Time,Distance1,SensorData0,Distance2,SensorData4
0.018000,0.060697,0.000000,0.060697,0.000000
0.036000,0.058953,0.000000,0.058953,0.000000
0.054000,0.056673,0.000000,0.056673,0.000000
0.072000,0.054483,0.000000,0.054483,0.000000
0.090000,0.052669,0.000000,0.052669,0.000000
0.108000,0.051164,0.000000,0.051164,0.000000
0.126000,0.049779,0.000000,0.049779,0.000000
0.144000,0.048402,0.000000,0.048402,0.000000
0.162000,0.047021,0.000000,0.047021,0.000000
0.180000,0.046281,1.004338,0.046281,1.004340
0.198000,0.046237,1.541371,0.046237,1.541373
0.216000,0.046269,2.214136,0.046269,2.214116
0.234000,0.046250,2.892050,0.046250,2.893174
0.252000,0.046183,3.560105,0.046183,3.559204
0.270000,0.046095,4.219196,0.046096,4.220251
0.288000,0.046004,4.868368,0.046004,4.868666
0.306000,0.045909,5.517746,0.045909,5.520917
0.324000,0.045816,6.170350,0.045815,6.168920
0.342000,0.045729,6.817518,0.045728,6.820771
0.360000,0.045646,7.471844,0.045646,7.465079
0.378000,0.045567,8.119771,0.045566,8.118292
0.396000,0.045490,8.768633,0.045489,8.768959
0.414000,0.045416,9.419183,0.045416,9.421637
0.432000,0.045344,10.068339,0.045344,10.073224
0.450000,0.045276,10.722284,0.045275,10.721979
0.468000,0.045209,11.373536,0.045208,11.372936
0.486000,0.045144,12.030290,0.045145,12.027697
0.504000,0.045085,12.687405,0.045085,12.687231
0.522000,0.045028,13.345488,0.045027,13.343233
0.540000,0.044970,14.002562,0.044969,14.003268
0.558000,0.044910,14.664038,0.044911,14.663531
0.576000,0.044851,15.325723,0.044852,15.325070
0.594000,0.044793,15.985598,0.044793,15.985258
0.612000,0.044733,16.649702,0.044734,16.645530
0.630000,0.044674,17.311117,0.044675,17.310912
0.648000,0.044616,17.973066,0.044617,17.976202
0.666000,0.044557,18.637301,0.044558,18.635960
0.684000,0.044499,19.301092,0.044499,19.301223
0.702000,0.044439,19.965826,0.044440,19.962074
0.720000,0.044380,20.628403,0.044380,20.628661
0.738000,0.044320,21.291753,0.044321,21.291468
0.756000,0.044261,21.955288,0.044261,21.954702
0.774000,0.044202,22.616540,0.044201,22.616747
0.792000,0.044142,23.282586,0.044143,23.277823
0.810000,0.044085,23.941229,0.044084,23.940173
0.828000,0.044027,24.602906,0.044025,24.602957
0.846000,0.043970,25.264850,0.043970,25.258951
0.864000,0.043914,25.922943,0.043913,25.923200
0.882000,0.043860,26.582032,0.043860,26.582194
0.900000,0.043808,27.236419,0.043808,27.242966
0.918000,0.043756,27.894855,0.043756,27.901520
0.936000,0.043705,28.556985,0.043707,28.556831
0.954000,0.043655,29.212816,0.043657,29.213990
0.972000,0.043607,29.870207,0.043607,29.870615
0.990000,0.043559,30.528639,0.043559,30.527977
1.008000,0.043513,31.184499,0.043512,31.184448
1.026000,0.043466,31.841751,0.043466,31.836504
1.044000,0.043420,32.420916,0.043419,32.420452
1.062000,0.043377,32.391517,0.043377,32.391853
1.080000,0.043342,32.365871,0.043342,32.365198
1.098000,0.043314,32.341078,0.043314,32.340616
1.116000,0.043291,32.322021,0.043291,32.320331
1.134000,0.043273,32.304400,0.043271,32.303797
1.152000,0.043256,32.289152,0.043256,32.290338
1.170000,0.043243,32.278939,0.043243,32.278511
1.188000,0.043232,32.263627,0.043233,32.271181
1.206000,0.043224,32.258809,0.043224,32.259197
1.224000,0.043217,32.251828,0.043217,32.251321
1.242000,0.043212,32.244878,0.043212,32.244442
1.260000,0.043208,32.236204,0.043208,32.241560
1.278000,0.043204,32.237541,0.043204,32.232296
1.296000,0.043201,32.229954,0.043201,32.229619
1.314000,0.043199,31.771442,0.043200,31.768711
1.332000,0.043203,31.083749,0.043203,31.082566
1.350000,0.043215,30.400593,0.043214,30.400475
1.368000,0.043231,29.720786,0.043231,29.720465
1.386000,0.043252,29.043843,0.043251,29.046066
1.404000,0.043277,28.375782,0.043276,28.374309
1.422000,0.043304,27.705630,0.043304,27.703751
1.440000,0.043335,27.038689,0.043335,27.036472
1.458000,0.043368,26.371543,0.043367,26.370658
1.476000,0.043403,25.708933,0.043402,25.708221
1.494000,0.043439,25.045753,0.043439,25.045212
1.512000,0.043477,24.381054,0.043476,24.388578
1.530000,0.043515,23.725709,0.043515,23.725088
1.548000,0.043555,23.065485,0.043555,23.066037
1.566000,0.043596,22.408294,0.043595,22.403895
1.584000,0.043638,21.748426,0.043637,21.747725
1.602000,0.043680,21.091025,0.043678,21.090479
1.620000,0.043721,20.434714,0.043721,20.432216
1.638000,0.043764,19.772972,0.043762,19.777722
1.656000,0.043805,19.118465,0.043806,19.118120
1.674000,0.043848,18.462190,0.043848,18.461782
1.692000,0.043891,17.802861,0.043891,17.807544
1.710000,0.043935,17.145300,0.043935,17.150140
1.728000,0.043978,16.490472,0.043979,16.489882
1.746000,0.044024,15.833853,0.044024,15.833098
1.764000,0.044079,15.215167,0.044079,15.212748
1.782000,0.044140,14.544285,0.044140,14.541612
1.800000,0.044203,13.871456,0.044202,13.870801
1.818000,0.044265,13.198795,0.044265,13.197006
1.836000,0.044327,12.536055,0.044327,12.539623
1.854000,0.044391,11.876021,0.044391,11.879226
1.872000,0.044456,11.215413,0.044456,11.220139
1.890000,0.044523,10.561607,0.044524,10.556371
1.908000,0.044592,9.899401,0.044593,9.899437
1.926000,0.044663,9.240115,0.044663,9.239156
1.944000,0.044735,8.578059,0.044734,8.584487
1.962000,0.044808,7.923685,0.044807,7.924550
1.980000,0.044882,7.268116,0.044882,7.265053
1.998000,0.044959,6.611459,0.044959,6.610442
2.016000,0.045039,5.957513,0.045039,5.955142
2.034000,0.045120,5.302463,0.045120,5.306040
2.052000,0.045202,4.654105,0.045202,4.652980
2.070000,0.045285,4.005660,0.045284,4.005328
2.088000,0.045370,3.360356,0.045369,3.360443
2.106000,0.045456,2.714539,0.045456,2.715011
2.124000,0.045547,2.077071,0.045547,2.076816
2.142000,0.045644,1.444948,0.045644,1.445176
2.160000,0.045751,0.824537,0.045752,0.824682
2.178000,0.045879,0.234690,0.045879,0.234870
2.196000,0.046128,0.000000,0.046128,0.000000
2.214000,0.046945,0.000000,0.046945,0.000000
2.232000,0.048401,0.000000,0.048401,0.000000
2.250000,0.050085,0.000000,0.050084,0.000000
2.268000,0.051655,0.000000,0.051655,0.000000
2.286000,0.053059,0.000000,0.053059,0.000000
2.304000,0.054410,0.000000,0.054410,0.000000
2.322000,0.055808,0.000000,0.055808,0.000000
2.340000,0.057271,0.000000,0.057271,0.000000
2.358000,0.058602,0.000000,0.058602,0.000000
2.376000,0.059085,0.000000,0.059085,0.000000
2.394000,0.058843,0.000000,0.058843,0.000000
2.412000,0.058476,0.000000,0.058476,0.000000
2.430000,0.058331,0.000000,0.058331,0.000000
2.448000,0.058389,0.000000,0.058389,0.000000
2.466000,0.058489,0.000000,0.058489,0.000000
2.484000,0.058533,0.000000,0.058533,0.000000
2.502000,0.058519,0.000000,0.058519,0.000000
2.520000,0.058492,0.000000,0.058492,0.000000
2.538000,0.058479,0.000000,0.058479,0.000000
2.556000,0.058482,0.000000,0.058482,0.000000
2.574000,0.058489,0.000000,0.058489,0.000000
2.592000,0.058493,0.000000,0.058493,0.000000
2.610000,0.058493,0.000000,0.058493,0.000000
2.628000,0.058491,0.000000,0.058491,0.000000
2.646000,0.058489,0.000000,0.058489,0.000000
2.664000,0.058490,0.000000,0.058490,0.000000
2.682000,0.058490,0.000000,0.058490,0.000000
2.700000,0.058490,0.000000,0.058490,0.000000
2.718000,0.058490,0.000000,0.058490,0.000000
2.736000,0.058490,0.000000,0.058490,0.000000
2.754000,0.058490,0.000000,0.058490,0.000000
2.772000,0.058490,0.000000,0.058490,0.000000
2.790000,0.058490,0.000000,0.058490,0.000000
2.808000,0.058490,0.000000,0.058490,0.000000
2.826000,0.058490,0.000000,0.058490,0.000000
2.844000,0.058490,0.000000,0.058490,0.000000
2.862000,0.058490,0.000000,0.058490,0.000000
2.880000,0.058490,0.000000,0.058490,0.000000
2.898000,0.058490,0.000000,0.058490,0.000000
2.916000,0.058490,0.000000,0.058490,0.000000
2.934000,0.058490,0.000000,0.058490,0.000000
2.952000,0.058490,0.000000,0.058490,0.000000
2.970000,0.058490,0.000000,0.058490,0.000000
2.988000,0.058490,0.000000,0.058490,0.000000
3.006000,0.058490,0.000000,0.058490,0.000000
3.024000,0.058490,0.000000,0.058490,0.000000
3.042000,0.058490,0.000000,0.058490,0.000000
3.060000,0.058490,0.000000,0.058490,0.000000
3.078000,0.058490,0.000000,0.058490,0.000000
3.096000,0.058490,0.000000,0.058490,0.000000
3.114000,0.058490,0.000000,0.058490,0.000000
3.132000,0.058490,0.000000,0.058490,0.000000
3.150000,0.058490,0.000000,0.058490,0.000000
3.168000,0.058490,0.000000,0.058490,0.000000
3.186000,0.058490,0.000000,0.058490,0.000000
3.204000,0.058490,0.000000,0.058490,0.000000
3.222000,0.058490,0.000000,0.058490,0.000000
3.240000,0.058490,0.000000,0.058490,0.000000
3.258000,0.058490,0.000000,0.058490,0.000000
3.276000,0.058490,0.000000,0.058490,0.000000
3.294000,0.058490,0.000000,0.058490,0.000000
3.312000,0.058490,0.000000,0.058490,0.000000
3.330000,0.058490,0.000000,0.058490,0.000000
3.348000,0.058490,0.000000,0.058490,0.000000
3.366000,0.058490,0.000000,0.058490,0.000000
3.384000,0.058490,0.000000,0.058490,0.000000
3.402000,0.058490,0.000000,0.058490,0.000000
3.420000,0.058490,0.000000,0.058490,0.000000
3.438000,0.058490,0.000000,0.058490,0.000000
3.456000,0.058490,0.000000,0.058490,0.000000
3.474000,0.058490,0.000000,0.058490,0.000000
3.492000,0.058490,0.000000,0.058490,0.000000
3.510000,0.058490,0.000000,0.058490,0.000000
3.528000,0.058490,0.000000,0.058490,0.000000
3.546000,0.058490,0.000000,0.058490,0.000000
3.564000,0.058490,0.000000,0.058490,0.000000
3.582000,0.058490,0.000000,0.058490,0.000000
3.600000,0.058490,0.000000,0.058490,0.000000
3.618000,0.058490,0.000000,0.058490,0.000000
3.636000,0.058490,0.000000,0.058490,0.000000
3.654000,0.058490,0.000000,0.058490,0.000000
3.672000,0.058490,0.000000,0.058490,0.000000
3.690000,0.058490,0.000000,0.058490,0.000000
3.708000,0.058490,0.000000,0.058490,0.000000
3.726000,0.058490,0.000000,0.058490,0.000000
3.744000,0.058490,0.000000,0.058490,0.000000
3.762000,0.058490,0.000000,0.058490,0.000000
3.780000,0.058490,0.000000,0.058490,0.000000
3.798000,0.058490,0.000000,0.058490,0.000000
3.816000,0.058490,0.000000,0.058490,0.000000
3.834000,0.058490,0.000000,0.058490,0.000000
3.852000,0.058490,0.000000,0.058490,0.000000
3.870000,0.058490,0.000000,0.058490,0.000000
3.888000,0.058490,0.000000,0.058490,0.000000
3.906000,0.058490,0.000000,0.058490,0.000000
3.924000,0.058490,0.000000,0.058490,0.000000
3.942000,0.058490,0.000000,0.058490,0.000000
3.960000,0.058490,0.000000,0.058490,0.000000
3.978000,0.058490,0.000000,0.058490,0.000000
3.996000,0.058490,0.000000,0.058490,0.000000
4.014000,0.058490,0.000000,0.058490,0.000000
4.032000,0.058490,0.000000,0.058490,0.000000
4.050000,0.058490,0.000000,0.058490,0.000000
4.068000,0.058490,0.000000,0.058490,0.000000
4.086000,0.058490,0.000000,0.058490,0.000000
4.104000,0.058490,0.000000,0.058490,0.000000
4.122000,0.058490,0.000000,0.058490,0.000000
4.140000,0.058490,0.000000,0.058490,0.000000
4.158000,0.058490,0.000000,0.058490,0.000000
4.176000,0.058490,0.000000,0.058490,0.000000
4.194000,0.058490,0.000000,0.058490,0.000000
4.212000,0.058490,0.000000,0.058490,0.000000
4.230000,0.058490,0.000000,0.058490,0.000000
4.248000,0.058490,0.000000,0.058490,0.000000
4.266000,0.058490,0.000000,0.058490,0.000000
4.284000,0.058490,0.000000,0.058490,0.000000
4.302000,0.058490,0.000000,0.058490,0.000000
4.320000,0.058490,0.000000,0.058490,0.000000
4.338000,0.058490,0.000000,0.058490,0.000000
4.356000,0.058490,0.000000,0.058490,0.000000
4.374000,0.058490,0.000000,0.058490,0.000000
4.392000,0.058490,0.000000,0.058490,0.000000
4.410000,0.058490,0.000000,0.058490,0.000000
4.428000,0.058490,0.000000,0.058490,0.000000
4.446000,0.058490,0.000000,0.058490,0.000000
4.464000,0.058490,0.000000,0.058490,0.000000
4.482000,0.058490,0.000000,0.058490,0.000000
4.500000,0.058490,0.000000,0.058490,0.000000
4.518000,0.058490,0.000000,0.058490,0.000000
4.536000,0.058490,0.000000,0.058490,0.000000
4.554000,0.058490,0.000000,0.058490,0.000000
4.572000,0.058490,0.000000,0.058490,0.000000
4.590000,0.058490,0.000000,0.058490,0.000000
4.608000,0.058490,0.000000,0.058490,0.000000
4.626000,0.058490,0.000000,0.058490,0.000000
4.644000,0.058490,0.000000,0.058490,0.000000
4.662000,0.058490,0.000000,0.058490,0.000000
4.680000,0.058490,0.000000,0.058490,0.000000
4.698000,0.058490,0.000000,0.058490,0.000000
4.716000,0.058490,0.000000,0.058490,0.000000
4.734000,0.058490,0.000000,0.058490,0.000000
4.752000,0.058490,0.000000,0.058490,0.000000
4.770000,0.058490,0.000000,0.058490,0.000000
4.788000,0.058490,0.000000,0.058490,0.000000
4.806000,0.058490,0.000000,0.058490,0.000000
4.824000,0.058490,0.000000,0.058490,0.000000
4.842000,0.058490,0.000000,0.058490,0.000000
4.860000,0.058490,0.000000,0.058490,0.000000
4.878000,0.058490,0.000000,0.058490,0.000000
4.896000,0.058490,0.000000,0.058490,0.000000
4.914000,0.058490,0.000000,0.058490,0.000000
4.932000,0.058490,0.000000,0.058490,0.000000
4.950000,0.058490,0.000000,0.058490,0.000000
4.968000,0.058490,0.000000,0.058490,0.000000
4.986000,0.058490,0.000000,0.058490,0.000000
5.004000,0.058490,0.000000,0.058490,0.000000
5.022000,0.058490,0.000000,0.058490,0.000000
5.040000,0.058490,0.000000,0.058490,0.000000
5.058000,0.058490,0.000000,0.058490,0.000000
5.076000,0.058490,0.000000,0.058490,0.000000
5.094000,0.058490,0.000000,0.058490,0.000000
5.112000,0.058490,0.000000,0.058490,0.000000
5.130000,0.058490,0.000000,0.058490,0.000000
5.148000,0.058490,0.000000,0.058490,0.000000
5.166000,0.058490,0.000000,0.058490,0.000000
5.184000,0.058490,0.000000,0.058490,0.000000
5.202000,0.058490,0.000000,0.058490,0.000000
5.220000,0.058490,0.000000,0.058490,0.000000
5.238000,0.058490,0.000000,0.058490,0.000000
5.256000,0.058490,0.000000,0.058490,0.000000
5.274000,0.058490,0.000000,0.058490,0.000000
5.292000,0.058490,0.000000,0.058490,0.000000
5.310000,0.058490,0.000000,0.058490,0.000000
5.328000,0.058490,0.000000,0.058490,0.000000
5.346000,0.058490,0.000000,0.058490,0.000000
5.364000,0.058490,0.000000,0.058490,0.000000
5.382000,0.058490,0.000000,0.058490,0.000000
5.400000,0.058490,0.000000,0.058490,0.000000
5.418000,0.058490,0.000000,0.058490,0.000000
5.436000,0.058490,0.000000,0.058490,0.000000
5.454000,0.058490,0.000000,0.058490,0.000000
5.472000,0.058490,0.000000,0.058490,0.000000
5.490000,0.058490,0.000000,0.058490,0.000000
5.508000,0.058490,0.000000,0.058490,0.000000
5.526000,0.058490,0.000000,0.058490,0.000000
5.544000,0.058490,0.000000,0.058490,0.000000
5.562000,0.058490,0.000000,0.058490,0.000000
5.580000,0.058490,0.000000,0.058490,0.000000
5.598000,0.058490,0.000000,0.058490,0.000000
5.616000,0.058490,0.000000,0.058490,0.000000
5.634000,0.058490,0.000000,0.058490,0.000000
5.652000,0.058490,0.000000,0.058490,0.000000
5.670000,0.058490,0.000000,0.058490,0.000000
5.688000,0.058490,0.000000,0.058490,0.000000
5.706000,0.058490,0.000000,0.058490,0.000000
5.724000,0.058490,0.000000,0.058490,0.000000
5.742000,0.058490,0.000000,0.058490,0.000000
5.760000,0.058490,0.000000,0.058490,0.000000
5.778000,0.058490,0.000000,0.058490,0.000000
5.796000,0.058490,0.000000,0.058490,0.000000
5.814000,0.058490,0.000000,0.058490,0.000000
5.832000,0.058490,0.000000,0.058490,0.000000
5.850000,0.058490,0.000000,0.058490,0.000000
5.868000,0.058490,0.000000,0.058490,0.000000
5.886000,0.058490,0.000000,0.058490,0.000000
5.904000,0.058490,0.000000,0.058490,0.000000
5.922000,0.058490,0.000000,0.058490,0.000000
5.940000,0.058490,0.000000,0.058490,0.000000
5.958000,0.058490,0.000000,0.058490,0.000000
5.976000,0.058490,0.000000,0.058490,0.000000
5.994000,0.058490,0.000000,0.058490,0.000000
6.012000,0.058490,0.000000,0.058490,0.000000
6.030000,0.058490,0.000000,0.058490,0.000000
6.048000,0.058490,0.000000,0.058490,0.000000
6.066000,0.058490,0.000000,0.058490,0.000000
6.084000,0.058490,0.000000,0.058490,0.000000
6.102000,0.058490,0.000000,0.058490,0.000000
6.120000,0.058490,0.000000,0.058490,0.000000
6.138000,0.058490,0.000000,0.058490,0.000000
6.156000,0.058490,0.000000,0.058490,0.000000
6.174000,0.058490,0.000000,0.058490,0.000000
6.192000,0.058490,0.000000,0.058490,0.000000
6.210000,0.058490,0.000000,0.058490,0.000000
6.228000,0.058490,0.000000,0.058490,0.000000
6.246000,0.058490,0.000000,0.058490,0.000000
6.264000,0.058490,0.000000,0.058490,0.000000
6.282000,0.058490,0.000000,0.058490,0.000000
6.300000,0.058490,0.000000,0.058490,0.000000
6.318000,0.058490,0.000000,0.058490,0.000000
6.336000,0.058490,0.000000,0.058490,0.000000
6.354000,0.058490,0.000000,0.058490,0.000000
6.372000,0.058490,0.000000,0.058490,0.000000
6.390000,0.058490,0.000000,0.058490,0.000000
6.408000,0.058490,0.000000,0.058490,0.000000
6.426000,0.058490,0.000000,0.058490,0.000000
6.444000,0.058490,0.000000,0.058490,0.000000
6.462000,0.058490,0.000000,0.058490,0.000000
6.480000,0.058490,0.000000,0.058490,0.000000
6.498000,0.058490,0.000000,0.058490,0.000000
6.516000,0.058490,0.000000,0.058490,0.000000
6.534000,0.058490,0.000000,0.058490,0.000000
6.552000,0.058490,0.000000,0.058490,0.000000
6.570000,0.058490,0.000000,0.058490,0.000000
6.588000,0.058490,0.000000,0.058490,0.000000
6.606000,0.058490,0.000000,0.058490,0.000000
6.624000,0.058490,0.000000,0.058490,0.000000
6.642000,0.058490,0.000000,0.058490,0.000000
6.660000,0.058490,0.000000,0.058490,0.000000
6.678000,0.058490,0.000000,0.058490,0.000000
6.696000,0.058490,0.000000,0.058490,0.000000
6.714000,0.058490,0.000000,0.058490,0.000000
6.732000,0.058490,0.000000,0.058490,0.000000
6.750000,0.058490,0.000000,0.058490,0.000000
6.768000,0.058490,0.000000,0.058490,0.000000
6.786000,0.058490,0.000000,0.058490,0.000000
6.804000,0.058490,0.000000,0.058490,0.000000
6.822000,0.058490,0.000000,0.058490,0.000000
6.840000,0.058490,0.000000,0.058490,0.000000
6.858000,0.058490,0.000000,0.058490,0.000000
6.876000,0.058490,0.000000,0.058490,0.000000
6.894000,0.058490,0.000000,0.058490,0.000000
6.912000,0.058490,0.000000,0.058490,0.000000
6.930000,0.058490,0.000000,0.058490,0.000000
6.948000,0.058490,0.000000,0.058490,0.000000
6.966000,0.058490,0.000000,0.058490,0.000000
6.984000,0.058490,0.000000,0.058490,0.000000
7.002000,0.058490,0.000000,0.058490,0.000000
7.020000,0.058490,0.000000,0.058490,0.000000
7.038000,0.058490,0.000000,0.058490,0.000000
7.056000,0.058490,0.000000,0.058490,0.000000
7.074000,0.058490,0.000000,0.058490,0.000000
7.092000,0.058490,0.000000,0.058490,0.000000
7.110000,0.058490,0.000000,0.058490,0.000000
7.128000,0.058490,0.000000,0.058490,0.000000
7.146000,0.058490,0.000000,0.058490,0.000000
7.164000,0.058490,0.000000,0.058490,0.000000
7.182000,0.058490,0.000000,0.058490,0.000000
7.200000,0.058490,0.000000,0.058490,0.000000
7.218000,0.058490,0.000000,0.058490,0.000000
7.236000,0.058490,0.000000,0.058490,0.000000
7.254000,0.058490,0.000000,0.058490,0.000000
7.272000,0.058490,0.000000,0.058490,0.000000
7.290000,0.058490,0.000000,0.058490,0.000000
7.308000,0.058490,0.000000,0.058490,0.000000
7.326000,0.058490,0.000000,0.058490,0.000000
7.344000,0.058490,0.000000,0.058490,0.000000
7.362000,0.058490,0.000000,0.058490,0.000000
7.380000,0.058490,0.000000,0.058490,0.000000
7.398000,0.058490,0.000000,0.058490,0.000000
7.416000,0.058490,0.000000,0.058490,0.000000
7.434000,0.058490,0.000000,0.058490,0.000000
7.452000,0.058490,0.000000,0.058490,0.000000
7.470000,0.058490,0.000000,0.058490,0.000000
7.488000,0.058490,0.000000,0.058490,0.000000
7.506000,0.058490,0.000000,0.058490,0.000000
7.524000,0.058490,0.000000,0.058490,0.000000
7.542000,0.058490,0.000000,0.058490,0.000000
7.560000,0.058490,0.000000,0.058490,0.000000
7.578000,0.058490,0.000000,0.058490,0.000000
7.596000,0.058490,0.000000,0.058490,0.000000
