// Time Position Current
0.0 0.8733651041984558 0.0
1.0048076923076923 0.8733651041984558 0.029999999329447746
2.0096153846153846 0.8733651041984558 0.029999999329447746
3.0144230769230766 1.746727466583252 0.029999999329447746
4.019230769230769 1.746727466583252 0.029999999329447746
5.024038461538462 3.493452310562134 0.019999999552965164
6.028846153846153 3.493452310562134 0.019999999552965164
7.033653846153846 5.240177154541016 0.009999999776482582
8.038461538461538 6.550220966339111 0.019999999552965164
9.04326923076923 7.423583030700684 0.009999999776482582
10.048076923076923 8.296945571899414 0.0
11.052884615384615 10.043670654296875 0.009999999776482582
12.057692307692307 10.043670654296875 0.009999999776482582
13.0625 11.353713989257812 0.0
14.067307692307692 11.353713989257812 0.0
15.072115384615385 13.100439071655273 0.009999999776482582
16.076923076923077 13.973801612854004 0.009999999776482582
17.08173076923077 13.973801612854004 0.009999999776482582
18.08653846153846 15.283844947814941 0.009999999776482582
19.091346153846153 17.030569076538086 0.0
20.096153846153847 17.46725082397461 0.009999999776482582
21.100961538461537 18.340614318847656 0.019999999552965164
22.10576923076923 20.087337493896484 0.009999999776482582
23.110576923076923 20.96070098876953 0.009999999776482582
24.115384615384613 20.96070098876953 0.009999999776482582
25.120192307692307 22.27074432373047 0.009999999776482582
26.125 22.27074432373047 0.009999999776482582
27.129807692307693 24.01746940612793 0.019999999552965164
28.134615384615383 24.890830993652344 0.009999999776482582
29.139423076923077 25.76419448852539 0.0
30.14423076923077 27.074237823486328 0.009999999776482582
31.14903846153846 27.074237823486328 0.009999999776482582
32.15384615384615 28.82096290588379 0.019999999552965164
33.15865384615385 28.82096290588379 0.019999999552965164
34.16346153846154 30.56768798828125 0.009999999776482582
35.16826923076923 30.56768798828125 0.009999999776482582
36.17307692307692 31.00436782836914 0.009999999776482582
37.17788461538461 31.877731323242188 0.019999999552965164
38.18269230769231 32.751094818115234 0.009999999776482582
39.1875 34.06113815307617 0.009999999776482582
40.19230769230769 35.807861328125 0.0
41.19711538461539 35.807861328125 0.0
42.20192307692307 37.554588317871094 0.0
43.20673076923077 37.554588317871094 0.0
44.21153846153846 38.86463165283203 0.019999999552965164
45.21634615384615 38.86463165283203 0.019999999552965164
46.22115384615385 39.30131149291992 0.009999999776482582
47.22596153846154 39.73799133300781 0.019999999552965164
48.230769230769226 40.61135482788086 0.05999999865889549
49.23557692307692 40.61135482788086 0.05999999865889549
50.24038461538461 41.04803466796875 0.05999999865889549
51.24519230769231 41.04803466796875 0.05999999865889549
52.25 41.484718322753906 0.09000000357627869
53.25480769230769 42.35808181762695 0.10000000149011612
54.25961538461539 42.794761657714844 0.12999999523162842
55.26442307692307 42.794761657714844 0.12999999523162842
56.26923076923077 43.231441497802734 0.14000000059604645
57.27403846153846 43.66812515258789 0.18000000715255737
58.27884615384615 43.66812515258789 0.18000000715255737
59.28365384615385 44.54148483276367 0.20000000298023224
60.28846153846154 44.97816848754883 0.1899999976158142
61.293269230769226 45.85152816772461 0.20000000298023224
62.29807692307692 46.288211822509766 0.20999999344348907
63.30288461538461 46.724891662597656 0.25
64.3076923076923 46.724891662597656 0.25
65.3125 47.5982551574707 0.25999999046325684
66.3173076923077 47.5982551574707 0.25999999046325684
67.32211538461539 48.034934997558594 0.3499999940395355
68.32692307692308 48.034934997558594 0.3499999940395355
69.33173076923077 48.90829849243164 0.30000001192092896
70.33653846153847 48.90829849243164 0.30000001192092896
71.34134615384615 49.34497833251953 0.3199999928474426
72.34615384615384 49.34497833251953 0.3199999928474426
73.35096153846153 49.78166198730469 0.36000001430511475
74.35576923076923 50.21834182739258 0.3700000047683716
75.36057692307692 50.21834182739258 0.3700000047683716
76.36538461538461 50.65502166748047 0.029999999329447746
77.3701923076923 50.65502166748047 0.029999999329447746
78.375 50.65502166748047 0.05999999865889549
79.3798076923077 50.65502166748047 0.07999999821186066
80.38461538461539 50.65502166748047 0.09000000357627869
81.38942307692308 51.091705322265625 0.0
82.39423076923077 51.091705322265625 0.0
83.39903846153847 51.091705322265625 0.029999999329447746
84.40384615384615 51.091705322265625 0.029999999329447746
85.40865384615384 51.091705322265625 0.07999999821186066
86.41346153846153 51.091705322265625 0.07999999821186066
87.41826923076923 51.091705322265625 0.09000000357627869
88.42307692307692 51.091705322265625 0.09000000357627869
89.42788461538461 51.528385162353516 0.9700000286102295
90.4326923076923 51.965065002441406 0.019999999552965164
91.4375 51.965065002441406 0.019999999552965164
92.4423076923077 51.965065002441406 0.05000000074505806
93.44711538461539 51.965065002441406 0.05999999865889549
94.45192307692308 51.965065002441406 0.10999999940395355
95.45673076923077 51.965065002441406 0.9800000190734863
96.46153846153845 52.40174865722656 0.009999999776482582
97.46634615384615 52.40174865722656 0.05999999865889549
98.47115384615384 52.40174865722656 0.05999999865889549
99.47596153846153 52.40174865722656 0.07999999821186066
100.48076923076923 52.40174865722656 0.9900000095367432
101.48557692307692 52.40174865722656 0.9900000095367432
102.49038461538461 52.83842849731445 0.029999999329447746
103.4951923076923 52.83842849731445 0.029999999329447746
104.5 52.83842849731445 0.05000000074505806
105.5048076923077 52.83842849731445 0.05000000074505806
106.50961538461539 52.83842849731445 0.09000000357627869
107.51442307692308 52.83842849731445 0.2800000011920929
108.51923076923077 53.27511215209961 0.019999999552965164
109.52403846153845 53.27511215209961 0.03999999910593033
110.52884615384615 53.27511215209961 0.03999999910593033
111.53365384615384 53.27511215209961 0.05999999865889549
112.53846153846153 53.27511215209961 0.05999999865889549
113.54326923076923 53.27511215209961 0.05999999865889549
114.54807692307692 53.27511215209961 0.05999999865889549
115.55288461538461 53.27511215209961 0.05999999865889549
116.5576923076923 53.27511215209961 0.05999999865889549
117.5625 53.27511215209961 0.05999999865889549
118.5673076923077 53.27511215209961 0.05999999865889549
119.57211538461539 53.27511215209961 0.05999999865889549
120.57692307692308 53.27511215209961 0.05999999865889549
121.58173076923077 53.27511215209961 0.05999999865889549
122.58653846153845 53.27511215209961 0.05999999865889549
123.59134615384615 53.27511215209961 0.05999999865889549
124.59615384615384 53.27511215209961 0.05999999865889549
125.60096153846153 53.27511215209961 0.05999999865889549
126.60576923076923 53.27511215209961 0.05999999865889549
127.61057692307692 53.27511215209961 0.05999999865889549
128.6153846153846 53.27511215209961 0.05999999865889549
129.6201923076923 53.27511215209961 0.05999999865889549
130.625 53.27511215209961 0.05999999865889549
131.62980769230768 53.27511215209961 0.05999999865889549
132.6346153846154 53.27511215209961 0.05999999865889549
133.63942307692307 53.27511215209961 0.05999999865889549
134.64423076923077 53.27511215209961 0.05999999865889549
135.64903846153845 53.27511215209961 0.05999999865889549
136.65384615384616 53.27511215209961 0.05999999865889549
137.65865384615384 53.27511215209961 0.05999999865889549
138.66346153846155 53.27511215209961 0.05999999865889549
139.66826923076923 53.27511215209961 0.05999999865889549
140.67307692307693 53.27511215209961 0.05999999865889549
141.6778846153846 53.27511215209961 0.05999999865889549
142.6826923076923 53.27511215209961 0.05999999865889549
143.6875 53.27511215209961 0.05999999865889549
144.69230769230768 53.27511215209961 0.05999999865889549
145.6971153846154 53.27511215209961 0.05999999865889549
146.70192307692307 53.27511215209961 0.05999999865889549
147.70673076923077 53.27511215209961 0.05999999865889549
148.71153846153845 53.27511215209961 0.05999999865889549
149.71634615384616 53.27511215209961 0.05999999865889549
150.72115384615384 53.27511215209961 0.05999999865889549
151.72596153846155 53.27511215209961 0.05999999865889549
152.73076923076923 53.27511215209961 0.05999999865889549
153.73557692307693 53.27511215209961 0.05999999865889549
154.7403846153846 53.27511215209961 0.05999999865889549
155.7451923076923 53.27511215209961 0.05999999865889549
156.75 53.27511215209961 0.05999999865889549
157.75480769230768 53.27511215209961 0.05999999865889549
158.7596153846154 53.27511215209961 0.05999999865889549
159.76442307692307 53.27511215209961 0.05999999865889549
160.76923076923077 53.27511215209961 0.05999999865889549
161.77403846153845 53.27511215209961 0.05999999865889549
162.77884615384616 53.27511215209961 0.05999999865889549
163.78365384615384 53.27511215209961 0.05999999865889549
164.78846153846155 53.27511215209961 0.05999999865889549
165.79326923076923 53.27511215209961 0.05999999865889549
166.79807692307693 53.27511215209961 0.05999999865889549
167.8028846153846 53.27511215209961 0.05999999865889549
168.8076923076923 53.27511215209961 0.05999999865889549
169.8125 53.27511215209961 0.05999999865889549
170.81730769230768 53.27511215209961 0.05999999865889549
171.8221153846154 53.27511215209961 0.05999999865889549
172.82692307692307 53.27511215209961 0.05999999865889549
173.83173076923077 53.27511215209961 0.05999999865889549
174.83653846153845 53.27511215209961 0.05999999865889549
175.84134615384616 53.27511215209961 0.05999999865889549
176.84615384615384 53.27511215209961 0.05999999865889549
177.85096153846155 53.27511215209961 0.05999999865889549
178.85576923076923 53.27511215209961 0.05999999865889549
179.86057692307693 53.27511215209961 0.05999999865889549
180.8653846153846 53.27511215209961 0.05999999865889549
181.8701923076923 53.27511215209961 0.05999999865889549
182.875 53.27511215209961 0.05999999865889549
183.87980769230768 53.27511215209961 0.05999999865889549
184.8846153846154 53.27511215209961 0.05999999865889549
185.88942307692307 53.27511215209961 0.05999999865889549
186.89423076923077 53.27511215209961 0.05999999865889549
187.89903846153845 53.27511215209961 0.05999999865889549
188.90384615384616 53.27511215209961 0.05999999865889549
189.90865384615384 53.27511215209961 0.05999999865889549
190.91346153846155 53.27511215209961 0.05999999865889549
191.91826923076923 53.27511215209961 0.05999999865889549
192.9230769230769 53.27511215209961 0.05999999865889549
193.9278846153846 53.27511215209961 0.05999999865889549
194.9326923076923 53.27511215209961 0.05999999865889549
195.9375 53.27511215209961 0.05999999865889549
196.94230769230768 53.27511215209961 0.05999999865889549
197.9471153846154 53.27511215209961 0.05999999865889549
198.95192307692307 53.27511215209961 0.05999999865889549
199.95673076923077 53.27511215209961 0.05999999865889549
200.96153846153845 53.27511215209961 0.05999999865889549
201.96634615384616 53.27511215209961 0.05999999865889549
202.97115384615384 53.27511215209961 0.05999999865889549
203.97596153846155 53.27511215209961 0.05999999865889549
204.98076923076923 53.27511215209961 0.05999999865889549
205.9855769230769 53.27511215209961 0.05999999865889549
206.9903846153846 53.27511215209961 0.05999999865889549
207.9951923076923 53.27511215209961 0.05999999865889549
209.0 53.27511215209961 0.05999999865889549
