// Time Position Current
0.0 0.8733651041984558 0.0
1.0133333333333334 0.8733651041984558 0.0
2.026666666666667 0.8733651041984558 0.0
3.04 0.8733651041984558 0.029999999329447746
4.053333333333334 0.8733651041984558 0.029999999329447746
5.066666666666667 2.6200900077819824 0.019999999552965164
6.08 3.493452310562134 0.009999999776482582
7.093333333333334 4.366814613342285 0.019999999552965164
8.106666666666667 5.240177154541016 0.009999999776482582
9.120000000000001 6.113539695739746 0.009999999776482582
10.133333333333335 7.860264301300049 0.009999999776482582
11.146666666666668 7.860264301300049 0.009999999776482582
12.16 8.733627319335938 0.009999999776482582
13.173333333333334 8.733627319335938 0.009999999776482582
14.186666666666667 10.043670654296875 0.019999999552965164
15.200000000000001 10.043670654296875 0.019999999552965164
16.213333333333335 11.790395736694336 0.009999999776482582
17.226666666666667 13.100439071655273 0.009999999776482582
18.240000000000002 13.100439071655273 0.009999999776482582
19.253333333333334 13.973801612854004 0.019999999552965164
20.26666666666667 13.973801612854004 0.019999999552965164
21.28 15.720526695251465 0.009999999776482582
22.293333333333337 15.720526695251465 0.009999999776482582
23.30666666666667 17.030569076538086 0.009999999776482582
24.32 18.777294158935547 0.009999999776482582
25.333333333333336 19.650657653808594 0.019999999552965164
26.346666666666668 21.834062576293945 0.009999999776482582
27.360000000000003 21.834062576293945 0.009999999776482582
28.373333333333335 23.580787658691406 0.0
29.38666666666667 24.454151153564453 0.009999999776482582
30.400000000000002 24.454151153564453 0.009999999776482582
31.413333333333338 25.76419448852539 0.009999999776482582
32.42666666666667 26.637556076049805 0.009999999776482582
33.440000000000005 28.384281158447266 0.009999999776482582
34.45333333333333 29.257644653320312 0.009999999776482582
35.46666666666667 29.694324493408203 0.019999999552965164
36.480000000000004 31.00436782836914 0.019999999552965164
37.49333333333334 31.441049575805664 0.019999999552965164
38.50666666666667 31.441049575805664 0.019999999552965164
39.52 33.187774658203125 0.009999999776482582
40.53333333333334 33.187774658203125 0.009999999776482582
41.54666666666667 34.06113815307617 0.009999999776482582
42.56 34.06113815307617 0.009999999776482582
43.57333333333334 35.807861328125 0.009999999776482582
44.58666666666667 36.68122482299805 0.019999999552965164
45.6 37.991268157958984 0.009999999776482582
46.61333333333334 38.427947998046875 0.0
47.62666666666667 38.86463165283203 0.009999999776482582
48.64 39.73799133300781 0.029999999329447746
49.653333333333336 39.73799133300781 0.029999999329447746
50.66666666666667 40.17467498779297 0.05999999865889549
51.68000000000001 40.17467498779297 0.05999999865889549
52.693333333333335 41.04803466796875 0.07999999821186066
53.70666666666667 41.04803466796875 0.07999999821186066
54.720000000000006 41.484718322753906 0.10000000149011612
55.73333333333334 41.9213981628418 0.10000000149011612
56.74666666666667 42.35808181762695 0.10999999940395355
57.760000000000005 42.794761657714844 0.12999999523162842
58.77333333333334 42.794761657714844 0.12999999523162842
59.78666666666667 43.231441497802734 0.14000000059604645
60.800000000000004 43.231441497802734 0.15000000596046448
61.81333333333334 44.10480499267578 0.20000000298023224
62.826666666666675 44.10480499267578 0.20000000298023224
63.84 44.54148483276367 0.20999999344348907
64.85333333333334 45.41484832763672 0.20000000298023224
65.86666666666667 45.41484832763672 0.20000000298023224
66.88000000000001 46.288211822509766 0.2199999988079071
67.89333333333335 46.724891662597656 0.25999999046325684
68.90666666666667 47.16157531738281 0.2800000011920929
69.92 47.16157531738281 0.28999999165534973
70.93333333333334 47.5982551574707 0.05000000074505806
71.94666666666667 47.5982551574707 0.05000000074505806
72.96000000000001 47.5982551574707 0.05000000074505806
73.97333333333334 47.5982551574707 0.07999999821186066
74.98666666666668 47.5982551574707 1.0
76.0 47.5982551574707 1.0
