// Time Position Current
0.0 0.8733651041984558 0.0
1.0077519379844961 0.8733651041984558 0.0
2.0155038759689923 0.8733651041984558 0.03999999910593033
3.0232558139534884 0.8733651041984558 0.03999999910593033
4.0310077519379846 1.746727466583252 0.019999999552965164
5.038759689922481 3.493452310562134 0.009999999776482582
6.046511627906977 5.240177154541016 0.009999999776482582
7.054263565891473 5.240177154541016 0.009999999776482582
8.062015503875969 6.986902236938477 0.009999999776482582
9.069767441860465 6.986902236938477 0.009999999776482582
10.077519379844961 8.296945571899414 0.019999999552965164
11.085271317829458 9.170308113098145 0.009999999776482582
12.093023255813954 10.043670654296875 0.019999999552965164
13.10077519379845 10.917033195495605 0.009999999776482582
14.108527131782946 10.917033195495605 0.009999999776482582
15.116279069767442 11.790395736694336 0.009999999776482582
16.124031007751938 11.790395736694336 0.009999999776482582
17.131782945736433 13.53711986541748 0.019999999552965164
18.13953488372093 13.53711986541748 0.019999999552965164
19.14728682170543 15.283844947814941 0.009999999776482582
20.155038759689923 15.283844947814941 0.009999999776482582
21.162790697674417 16.593889236450195 0.019999999552965164
22.170542635658915 16.593889236450195 0.019999999552965164
23.178294573643413 18.340614318847656 0.009999999776482582
24.186046511627907 20.087337493896484 0.009999999776482582
25.1937984496124 20.087337493896484 0.009999999776482582
26.2015503875969 20.524019241333008 0.009999999776482582
27.209302325581397 22.27074432373047 0.019999999552965164
28.217054263565892 22.27074432373047 0.019999999552965164
29.224806201550386 24.01746940612793 0.019999999552965164
30.232558139534884 24.01746940612793 0.019999999552965164
31.240310077519382 25.327512741088867 0.019999999552965164
32.248062015503876 25.327512741088867 0.019999999552965164
33.25581395348837 27.074237823486328 0.019999999552965164
34.263565891472865 27.947599411010742 0.009999999776482582
35.27131782945737 28.82096290588379 0.019999999552965164
36.27906976744186 30.131006240844727 0.009999999776482582
37.286821705426355 31.00436782836914 0.019999999552965164
38.29457364341086 31.00436782836914 0.019999999552965164
39.30232558139535 32.751094818115234 0.009999999776482582
40.310077519379846 34.06113815307617 0.009999999776482582
41.31782945736434 34.06113815307617 0.009999999776482582
42.325581395348834 35.807861328125 0.0
43.333333333333336 35.807861328125 0.0
44.34108527131783 37.11790466308594 0.009999999776482582
45.348837209302324 38.86463165283203 0.019999999552965164
46.356589147286826 39.30131149291992 0.019999999552965164
47.36434108527132 39.73799133300781 0.029999999329447746
48.372093023255815 39.73799133300781 0.05000000074505806
49.37984496124031 40.17467498779297 0.05000000074505806
50.3875968992248 40.17467498779297 0.05000000074505806
51.395348837209305 41.04803466796875 0.05999999865889549
52.4031007751938 41.9213981628418 0.07999999821186066
53.41085271317829 41.9213981628418 0.07999999821186066
54.418604651162795 41.9213981628418 0.09000000357627869
55.42635658914729 41.9213981628418 0.09000000357627869
56.434108527131784 42.794761657714844 0.10999999940395355
57.44186046511628 42.794761657714844 0.10999999940395355
58.44961240310077 43.231441497802734 0.15000000596046448
59.457364341085274 43.231441497802734 0.15000000596046448
60.46511627906977 44.10480499267578 0.17000000178813934
61.47286821705426 44.97816848754883 0.17000000178813934
62.480620155038764 44.97816848754883 0.17000000178813934
63.48837209302326 44.97816848754883 0.17000000178813934
64.49612403100775 45.85152816772461 0.1899999976158142
65.50387596899225 46.724891662597656 0.20000000298023224
66.51162790697674 47.16157531738281 0.20999999344348907
67.51937984496124 47.5982551574707 0.20999999344348907
68.52713178294573 48.034934997558594 0.23999999463558197
69.53488372093024 48.034934997558594 0.25999999046325684
70.54263565891473 48.47161865234375 0.25
71.55038759689923 48.90829849243164 0.25
72.55813953488372 49.34497833251953 0.2800000011920929
73.56589147286822 49.34497833251953 0.2800000011920929
74.57364341085271 49.78166198730469 0.30000001192092896
75.5813953488372 50.21834182739258 0.33000001311302185
76.58914728682171 50.21834182739258 0.33000001311302185
77.59689922480621 51.091705322265625 0.36000001430511475
78.6046511627907 51.091705322265625 0.36000001430511475
79.6124031007752 51.965065002441406 0.36000001430511475
80.62015503875969 52.40174865722656 0.3700000047683716
81.62790697674419 52.83842849731445 0.38999998569488525
82.63565891472868 52.83842849731445 0.38999998569488525
83.64341085271317 53.27511215209961 0.4000000059604645
84.65116279069767 53.7117919921875 0.4399999976158142
85.65891472868218 54.14847183227539 0.46000000834465027
86.66666666666667 54.58515548706055 0.4699999988079071
87.67441860465117 55.02183532714844 0.4699999988079071
88.68217054263566 55.45851516723633 0.5099999904632568
89.68992248062015 55.45851516723633 0.49000000953674316
90.69767441860465 55.45851516723633 0.49000000953674316
91.70542635658914 56.331878662109375 0.5299999713897705
92.71317829457365 56.768558502197266 0.550000011920929
93.72093023255815 57.20524215698242 0.5699999928474426
94.72868217054264 57.20524215698242 0.5600000023841858
95.73643410852713 57.64192199707031 0.5699999928474426
96.74418604651163 58.07860565185547 0.5899999737739563
97.75193798449612 58.51528549194336 0.5899999737739563
98.75968992248062 58.51528549194336 0.6100000143051147
99.76744186046511 59.388648986816406 0.6299999952316284
100.7751937984496 59.388648986816406 0.6299999952316284
101.78294573643412 59.8253288269043 0.6600000262260437
102.79069767441861 59.8253288269043 0.6600000262260437
103.7984496124031 59.8253288269043 0.019999999552965164
104.8062015503876 59.8253288269043 0.019999999552965164
105.81395348837209 59.8253288269043 0.05999999865889549
106.82170542635659 59.8253288269043 0.05999999865889549
107.82945736434108 59.8253288269043 0.10000000149011612
108.83720930232559 59.8253288269043 0.11999999731779099
109.84496124031008 60.26200866699219 0.0
110.85271317829458 60.26200866699219 0.05999999865889549
111.86046511627907 60.26200866699219 0.9800000190734863
112.86821705426357 60.26200866699219 0.029999999329447746
113.87596899224806 60.26200866699219 0.029999999329447746
114.88372093023256 60.26200866699219 0.07000000029802322
115.89147286821705 60.26200866699219 0.07000000029802322
116.89922480620154 60.26200866699219 0.10000000149011612
117.90697674418605 60.698692321777344 0.9800000190734863
118.91472868217055 60.698692321777344 0.03999999910593033
119.92248062015504 60.698692321777344 0.05999999865889549
120.93023255813954 60.698692321777344 0.05999999865889549
121.93798449612403 60.698692321777344 0.07999999821186066
122.94573643410853 60.698692321777344 0.07999999821186066
123.95348837209302 60.698692321777344 0.029999999329447746
124.96124031007753 60.698692321777344 0.029999999329447746
125.96899224806202 60.698692321777344 0.05000000074505806
126.97674418604652 60.698692321777344 0.05000000074505806
127.98449612403101 60.698692321777344 0.09000000357627869
128.9922480620155 61.135372161865234 1.0
130.0 61.135372161865234 1.0
