Time,Distance1,SensorData0,Distance2,SensorData4
0.018000,0.060697,0.000000,0.060697,0.000000
0.036000,0.058953,0.000000,0.058953,0.000000
0.054000,0.056673,0.000000,0.056673,0.000000
0.072000,0.054483,0.000000,0.054483,0.000000
0.090000,0.052669,0.000000,0.052669,0.000000
0.108000,0.051164,0.000000,0.051164,0.000000
0.126000,0.049779,0.000000,0.049779,0.000000
0.144000,0.048402,0.000000,0.048402,0.000000
0.162000,0.047021,0.000000,0.047021,0.000000
0.180000,0.045869,0.914671,0.045869,0.914670
0.198000,0.045643,1.376239,0.045643,1.376238
0.216000,0.045639,1.998166,0.045639,1.998166
0.234000,0.045582,2.648735,0.045582,2.648735
0.252000,0.045437,3.293733,0.045437,3.293733
0.270000,0.045237,3.927482,0.045237,3.927482
0.288000,0.045016,4.550980,0.045016,4.550980
0.306000,0.044795,5.165604,0.044795,5.165605
0.324000,0.044577,5.778695,0.044577,5.778695
0.342000,0.044365,6.392672,0.044365,6.392672
0.360000,0.044155,7.008568,0.044155,7.008565
0.378000,0.043947,7.625114,0.043947,7.625127
0.396000,0.043738,8.242967,0.043738,8.243014
0.414000,0.043529,8.860667,0.043529,8.860719
0.432000,0.043324,9.635129,0.043324,9.635185
0.450000,0.043147,10.332291,0.043147,10.332425
0.468000,0.042983,11.071374,0.042983,11.071578
0.486000,0.042834,11.865778,0.042834,11.866004
0.504000,0.042696,12.709970,0.042696,12.707787
0.522000,0.042568,13.543481,0.042568,13.537492
0.540000,0.042445,14.263923,0.042445,14.267544
0.558000,0.042315,14.195600,0.042316,14.193000
0.576000,0.042181,15.003546,0.042182,15.000776
0.594000,0.042049,15.799987,0.042049,15.800578
0.612000,0.041918,16.594502,0.041920,16.593113
0.630000,0.041804,16.906817,0.041805,16.905596
0.648000,0.041701,17.540504,0.041701,17.537612
0.666000,0.041603,18.161583,0.041603,18.159682
0.684000,0.041511,18.782992,0.041510,18.781938
0.702000,0.041415,19.343721,0.041414,19.343661
0.720000,0.041281,18.335985,0.041281,18.336035
0.738000,0.041115,18.969365,0.041115,18.967913
0.756000,0.040995,19.129110,0.040994,19.131261
0.774000,0.040879,20.071647,0.040881,20.067850
0.792000,0.040703,20.666617,0.040699,20.666111
0.810000,0.040566,21.255500,0.040557,21.253909
0.828000,0.040397,21.826827,0.040394,21.825881
0.846000,0.040250,21.580008,0.040240,22.395281
0.864000,0.040091,22.916036,0.040075,22.902651
0.882000,0.039939,23.497108,0.039935,23.497804
0.900000,0.039798,24.073385,0.039798,24.073257
0.918000,0.039666,24.643761,0.039669,24.647223
0.936000,0.039541,25.209977,0.039544,25.211515
0.954000,0.039417,25.766793,0.039420,25.767013
0.972000,0.039291,26.316699,0.039294,26.319538
0.990000,0.039161,26.858847,0.039163,26.860203
1.008000,0.039026,27.390699,0.039027,27.392628
1.026000,0.038884,27.912871,0.038885,27.914971
1.044000,0.038736,28.371243,0.038736,28.372207
1.062000,0.038592,28.282371,0.038593,28.281844
1.080000,0.038474,28.262187,0.038474,28.260584
1.098000,0.038381,28.250837,0.038382,28.250222
1.116000,0.038309,28.244395,0.038309,28.241533
1.134000,0.038249,28.233680,0.038249,28.235403
1.152000,0.038197,28.222400,0.038197,28.223616
1.170000,0.038148,28.205688,0.038148,28.207721
1.188000,0.038097,27.224732,0.038093,27.222615
1.206000,0.038019,27.211845,0.038012,27.209672
1.224000,0.037938,27.220173,0.037931,27.222830
1.242000,0.037865,27.293593,0.037858,27.302991
1.260000,0.037790,27.377153,0.037783,27.381460
1.278000,0.037708,27.433026,0.037701,27.437420
1.296000,0.037621,27.455420,0.037614,27.458012
1.314000,0.037536,27.096094,0.037530,27.095295
1.332000,0.037477,26.574061,0.037472,26.569095
1.350000,0.037455,26.061048,0.037451,26.060357
1.368000,0.037467,25.543230,0.037464,25.543464
1.386000,0.037502,24.117234,0.037497,24.119428
1.404000,0.037542,23.621059,0.037539,23.625150
1.422000,0.037596,23.171821,0.037594,23.183605
1.440000,0.037650,23.450423,0.037646,23.458811
1.458000,0.037685,23.027342,0.037681,23.044502
1.476000,0.037728,22.633116,0.037725,22.646993
1.494000,0.037784,22.200106,0.037783,22.213764
1.512000,0.037857,21.753662,0.037856,21.768679
1.530000,0.037946,21.296621,0.037947,21.306736
1.548000,0.038052,20.828087,0.038054,20.838574
1.566000,0.038173,20.318955,0.038175,20.328008
1.584000,0.038310,19.840603,0.038311,19.843155
1.602000,0.038460,19.353865,0.038460,19.359373
1.620000,0.038621,18.869066,0.038620,18.872423
1.638000,0.038799,16.983843,0.038794,16.985788
1.656000,0.038997,16.490219,0.038992,16.494381
1.674000,0.039205,15.992578,0.039201,15.997703
1.692000,0.039413,15.475924,0.039410,15.478564
1.710000,0.039620,14.971700,0.039619,14.974623
1.728000,0.039826,14.552139,0.039826,14.555258
1.746000,0.040037,14.059134,0.040036,14.061584
1.764000,0.040250,12.965442,0.040252,13.069230
1.782000,0.040453,12.612045,0.040456,12.587741
1.800000,0.040631,12.153997,0.040633,12.224470
1.818000,0.040827,10.823209,0.040830,11.221792
1.836000,0.040988,11.082224,0.040995,10.927629
1.854000,0.041164,10.927552,0.041165,10.788918
1.872000,0.041341,10.330665,0.041350,10.285847
1.890000,0.041516,9.824515,0.041526,9.795641
1.908000,0.041683,9.332900,0.041692,9.306497
1.926000,0.041843,8.822883,0.041852,8.802859
1.944000,0.042001,8.365697,0.042011,8.387083
1.962000,0.042162,7.839858,0.042172,7.855938
1.980000,0.042325,8.013238,0.042336,8.014658
1.998000,0.042485,7.610003,0.042497,7.603682
2.016000,0.042654,6.865491,0.042665,6.855866
2.034000,0.042836,6.008390,0.042846,5.993278
2.052000,0.043024,5.733071,0.043033,5.728273
2.070000,0.043216,4.728521,0.043223,4.727540
2.088000,0.043418,3.777864,0.043424,3.776396
2.106000,0.043632,2.748144,0.043636,2.748822
2.124000,0.043883,1.866691,0.043887,1.868023
2.142000,0.044183,1.130846,0.044186,1.132297
2.160000,0.044519,0.582979,0.044521,0.584111
2.178000,0.044854,0.130449,0.044856,0.131178
2.196000,0.045453,0.000000,0.045454,0.000000
2.214000,0.046650,0.000000,0.046650,0.000000
2.232000,0.048294,0.000000,0.048294,0.000000
2.250000,0.050010,0.000000,0.050010,0.000000
2.268000,0.051572,0.000000,0.051572,0.000000
2.286000,0.052989,0.000000,0.052989,0.000000
2.304000,0.054372,0.000000,0.054372,0.000000
2.322000,0.055797,0.000000,0.055797,0.000000
2.340000,0.057273,0.000000,0.057273,0.000000
2.358000,0.058602,0.000000,0.058602,0.000000
2.376000,0.059082,0.000000,0.059082,0.000000
2.394000,0.058840,0.000000,0.058840,0.000000
2.412000,0.058474,0.000000,0.058474,0.000000
2.430000,0.058331,0.000000,0.058331,0.000000
2.448000,0.058389,0.000000,0.058389,0.000000
2.466000,0.058489,0.000000,0.058489,0.000000
2.484000,0.058532,0.000000,0.058532,0.000000
2.502000,0.058519,0.000000,0.058519,0.000000
2.520000,0.058492,0.000000,0.058492,0.000000
2.538000,0.058479,0.000000,0.058479,0.000000
2.556000,0.058482,0.000000,0.058482,0.000000
2.574000,0.058489,0.000000,0.058489,0.000000
2.592000,0.058493,0.000000,0.058493,0.000000
2.610000,0.058493,0.000000,0.058493,0.000000
2.628000,0.058491,0.000000,0.058491,0.000000
2.646000,0.058489,0.000000,0.058489,0.000000
2.664000,0.058490,0.000000,0.058490,0.000000
2.682000,0.058490,0.000000,0.058490,0.000000
2.700000,0.058490,0.000000,0.058490,0.000000
2.718000,0.058490,0.000000,0.058490,0.000000
2.736000,0.058490,0.000000,0.058490,0.000000
2.754000,0.058490,0.000000,0.058490,0.000000
2.772000,0.058490,0.000000,0.058490,0.000000
2.790000,0.058490,0.000000,0.058490,0.000000
2.808000,0.058490,0.000000,0.058490,0.000000
2.826000,0.058490,0.000000,0.058490,0.000000
2.844000,0.058490,0.000000,0.058490,0.000000
2.862000,0.058490,0.000000,0.058490,0.000000
2.880000,0.058490,0.000000,0.058490,0.000000
2.898000,0.058490,0.000000,0.058490,0.000000
2.916000,0.058490,0.000000,0.058490,0.000000
2.934000,0.058490,0.000000,0.058490,0.000000
2.952000,0.058490,0.000000,0.058490,0.000000
2.970000,0.058490,0.000000,0.058490,0.000000
2.988000,0.058490,0.000000,0.058490,0.000000
3.006000,0.058490,0.000000,0.058490,0.000000
3.024000,0.058490,0.000000,0.058490,0.000000
3.042000,0.058490,0.000000,0.058490,0.000000
3.060000,0.058490,0.000000,0.058490,0.000000
3.078000,0.058490,0.000000,0.058490,0.000000
3.096000,0.058490,0.000000,0.058490,0.000000
3.114000,0.058490,0.000000,0.058490,0.000000
3.132000,0.058490,0.000000,0.058490,0.000000
3.150000,0.058490,0.000000,0.058490,0.000000
3.168000,0.058490,0.000000,0.058490,0.000000
3.186000,0.058490,0.000000,0.058490,0.000000
3.204000,0.058490,0.000000,0.058490,0.000000
3.222000,0.058490,0.000000,0.058490,0.000000
3.240000,0.058490,0.000000,0.058490,0.000000
3.258000,0.058490,0.000000,0.058490,0.000000
3.276000,0.058490,0.000000,0.058490,0.000000
3.294000,0.058490,0.000000,0.058490,0.000000
3.312000,0.058490,0.000000,0.058490,0.000000
3.330000,0.058490,0.000000,0.058490,0.000000
3.348000,0.058490,0.000000,0.058490,0.000000
3.366000,0.058490,0.000000,0.058490,0.000000
3.384000,0.058490,0.000000,0.058490,0.000000
3.402000,0.058490,0.000000,0.058490,0.000000
3.420000,0.058490,0.000000,0.058490,0.000000
3.438000,0.058490,0.000000,0.058490,0.000000
3.456000,0.058490,0.000000,0.058490,0.000000
3.474000,0.058490,0.000000,0.058490,0.000000
3.492000,0.058490,0.000000,0.058490,0.000000
3.510000,0.058490,0.000000,0.058490,0.000000
3.528000,0.058490,0.000000,0.058490,0.000000
3.546000,0.058490,0.000000,0.058490,0.000000
3.564000,0.058490,0.000000,0.058490,0.000000
3.582000,0.058490,0.000000,0.058490,0.000000
3.600000,0.058490,0.000000,0.058490,0.000000
3.618000,0.058490,0.000000,0.058490,0.000000
3.636000,0.058490,0.000000,0.058490,0.000000
3.654000,0.058490,0.000000,0.058490,0.000000
3.672000,0.058490,0.000000,0.058490,0.000000
3.690000,0.058490,0.000000,0.058490,0.000000
3.708000,0.058490,0.000000,0.058490,0.000000
3.726000,0.058490,0.000000,0.058490,0.000000
3.744000,0.058490,0.000000,0.058490,0.000000
3.762000,0.058490,0.000000,0.058490,0.000000
3.780000,0.058490,0.000000,0.058490,0.000000
3.798000,0.058490,0.000000,0.058490,0.000000
3.816000,0.058490,0.000000,0.058490,0.000000
3.834000,0.058490,0.000000,0.058490,0.000000
3.852000,0.058490,0.000000,0.058490,0.000000
3.870000,0.058490,0.000000,0.058490,0.000000
3.888000,0.058490,0.000000,0.058490,0.000000
3.906000,0.058490,0.000000,0.058490,0.000000
3.924000,0.058490,0.000000,0.058490,0.000000
3.942000,0.058490,0.000000,0.058490,0.000000
3.960000,0.058490,0.000000,0.058490,0.000000
3.978000,0.058490,0.000000,0.058490,0.000000
3.996000,0.058490,0.000000,0.058490,0.000000
4.014000,0.058490,0.000000,0.058490,0.000000
4.032000,0.058490,0.000000,0.058490,0.000000
4.050000,0.058490,0.000000,0.058490,0.000000
4.068000,0.058490,0.000000,0.058490,0.000000
4.086000,0.058490,0.000000,0.058490,0.000000
4.104000,0.058490,0.000000,0.058490,0.000000
4.122000,0.058490,0.000000,0.058490,0.000000
4.140000,0.058490,0.000000,0.058490,0.000000
4.158000,0.058490,0.000000,0.058490,0.000000
4.176000,0.058490,0.000000,0.058490,0.000000
4.194000,0.058490,0.000000,0.058490,0.000000
4.212000,0.058490,0.000000,0.058490,0.000000
4.230000,0.058490,0.000000,0.058490,0.000000
4.248000,0.058490,0.000000,0.058490,0.000000
4.266000,0.058490,0.000000,0.058490,0.000000
4.284000,0.058490,0.000000,0.058490,0.000000
4.302000,0.058490,0.000000,0.058490,0.000000
4.320000,0.058490,0.000000,0.058490,0.000000
4.338000,0.058490,0.000000,0.058490,0.000000
4.356000,0.058490,0.000000,0.058490,0.000000
4.374000,0.058490,0.000000,0.058490,0.000000
4.392000,0.058490,0.000000,0.058490,0.000000
4.410000,0.058490,0.000000,0.058490,0.000000
4.428000,0.058490,0.000000,0.058490,0.000000
4.446000,0.058490,0.000000,0.058490,0.000000
4.464000,0.058490,0.000000,0.058490,0.000000
4.482000,0.058490,0.000000,0.058490,0.000000
4.500000,0.058490,0.000000,0.058490,0.000000
4.518000,0.058490,0.000000,0.058490,0.000000
4.536000,0.058490,0.000000,0.058490,0.000000
4.554000,0.058490,0.000000,0.058490,0.000000
4.572000,0.058490,0.000000,0.058490,0.000000
4.590000,0.058490,0.000000,0.058490,0.000000
4.608000,0.058490,0.000000,0.058490,0.000000
4.626000,0.058490,0.000000,0.058490,0.000000
4.644000,0.058490,0.000000,0.058490,0.000000
4.662000,0.058490,0.000000,0.058490,0.000000
4.680000,0.058490,0.000000,0.058490,0.000000
4.698000,0.058490,0.000000,0.058490,0.000000
4.716000,0.058490,0.000000,0.058490,0.000000
4.734000,0.058490,0.000000,0.058490,0.000000
4.752000,0.058490,0.000000,0.058490,0.000000
4.770000,0.058490,0.000000,0.058490,0.000000
4.788000,0.058490,0.000000,0.058490,0.000000
4.806000,0.058490,0.000000,0.058490,0.000000
4.824000,0.058490,0.000000,0.058490,0.000000
4.842000,0.058490,0.000000,0.058490,0.000000
4.860000,0.058490,0.000000,0.058490,0.000000
4.878000,0.058490,0.000000,0.058490,0.000000
4.896000,0.058490,0.000000,0.058490,0.000000
4.914000,0.058490,0.000000,0.058490,0.000000
4.932000,0.058490,0.000000,0.058490,0.000000
4.950000,0.058490,0.000000,0.058490,0.000000
4.968000,0.058490,0.000000,0.058490,0.000000
4.986000,0.058490,0.000000,0.058490,0.000000
5.004000,0.058490,0.000000,0.058490,0.000000
5.022000,0.058490,0.000000,0.058490,0.000000
5.040000,0.058490,0.000000,0.058490,0.000000
5.058000,0.058490,0.000000,0.058490,0.000000
5.076000,0.058490,0.000000,0.058490,0.000000
5.094000,0.058490,0.000000,0.058490,0.000000
5.112000,0.058490,0.000000,0.058490,0.000000
5.130000,0.058490,0.000000,0.058490,0.000000
5.148000,0.058490,0.000000,0.058490,0.000000
5.166000,0.058490,0.000000,0.058490,0.000000
5.184000,0.058490,0.000000,0.058490,0.000000
5.202000,0.058490,0.000000,0.058490,0.000000
5.220000,0.058490,0.000000,0.058490,0.000000
5.238000,0.058490,0.000000,0.058490,0.000000
5.256000,0.058490,0.000000,0.058490,0.000000
5.274000,0.058490,0.000000,0.058490,0.000000
5.292000,0.058490,0.000000,0.058490,0.000000
5.310000,0.058490,0.000000,0.058490,0.000000
5.328000,0.058490,0.000000,0.058490,0.000000
5.346000,0.058490,0.000000,0.058490,0.000000
5.364000,0.058490,0.000000,0.058490,0.000000
5.382000,0.058490,0.000000,0.058490,0.000000
5.400000,0.058490,0.000000,0.058490,0.000000
5.418000,0.058490,0.000000,0.058490,0.000000
5.436000,0.058490,0.000000,0.058490,0.000000
5.454000,0.058490,0.000000,0.058490,0.000000
5.472000,0.058490,0.000000,0.058490,0.000000
5.490000,0.058490,0.000000,0.058490,0.000000
5.508000,0.058490,0.000000,0.058490,0.000000
5.526000,0.058490,0.000000,0.058490,0.000000
5.544000,0.058490,0.000000,0.058490,0.000000
5.562000,0.058490,0.000000,0.058490,0.000000
5.580000,0.058490,0.000000,0.058490,0.000000
5.598000,0.058490,0.000000,0.058490,0.000000
