// Time Position Current
0.0 0.8733651041984558 0.0
1.0076335877862594 0.8733651041984558 0.0
2.015267175572519 0.8733651041984558 0.0
3.0229007633587783 1.746727466583252 0.03999999910593033
4.030534351145038 1.746727466583252 0.03999999910593033
5.038167938931297 2.6200900077819824 0.019999999552965164
6.045801526717557 2.6200900077819824 0.019999999552965164
7.0534351145038165 4.366814613342285 0.0
8.061068702290076 5.240177154541016 0.009999999776482582
9.068702290076335 6.113539695739746 0.0
10.076335877862594 7.860264301300049 0.009999999776482582
11.083969465648854 7.860264301300049 0.009999999776482582
12.091603053435113 8.733627319335938 0.009999999776482582
13.099236641221372 8.733627319335938 0.009999999776482582
14.106870229007633 10.043670654296875 0.009999999776482582
15.114503816793892 10.043670654296875 0.009999999776482582
16.12213740458015 11.790395736694336 0.009999999776482582
17.12977099236641 12.66375732421875 0.0
18.13740458015267 13.100439071655273 0.009999999776482582
19.145038167938928 14.847164154052734 0.019999999552965164
20.152671755725187 14.847164154052734 0.019999999552965164
21.16030534351145 15.720526695251465 0.009999999776482582
22.16793893129771 15.720526695251465 0.009999999776482582
23.175572519083968 15.720526695251465 0.009999999776482582
24.183206106870227 17.030569076538086 0.0
25.190839694656486 20.087337493896484 0.009999999776482582
26.198473282442745 20.96070098876953 0.019999999552965164
27.206106870229004 21.834062576293945 0.009999999776482582
28.213740458015266 23.144107818603516 0.0
29.221374045801525 23.144107818603516 0.0
30.229007633587784 24.01746940612793 0.009999999776482582
31.236641221374043 24.01746940612793 0.009999999776482582
32.2442748091603 25.76419448852539 0.019999999552965164
33.25190839694656 27.074237823486328 0.009999999776482582
34.25954198473282 27.947599411010742 0.009999999776482582
35.26717557251908 28.82096290588379 0.009999999776482582
36.27480916030534 30.131006240844727 0.0
37.2824427480916 30.131006240844727 0.0
38.290076335877856 31.00436782836914 0.019999999552965164
39.297709923664115 31.00436782836914 0.019999999552965164
40.305343511450374 32.751094818115234 0.019999999552965164
41.31297709923664 32.751094818115234 0.019999999552965164
42.3206106870229 34.06113815307617 0.0
43.32824427480916 34.93449783325195 0.009999999776482582
44.33587786259542 35.807861328125 0.009999999776482582
45.343511450381676 37.554588317871094 0.019999999552965164
46.351145038167935 37.554588317871094 0.019999999552965164
47.358778625954194 38.86463165283203 0.009999999776482582
48.36641221374045 38.86463165283203 0.009999999776482582
49.37404580152671 39.30131149291992 0.009999999776482582
50.38167938931297 39.30131149291992 0.009999999776482582
51.38931297709923 40.17467498779297 0.03999999910593033
52.39694656488549 40.17467498779297 0.03999999910593033
53.40458015267175 40.61135482788086 0.09000000357627869
54.41221374045801 41.04803466796875 0.09000000357627869
55.419847328244266 41.484718322753906 0.09000000357627869
56.42748091603053 42.35808181762695 0.10000000149011612
57.43511450381679 42.35808181762695 0.10000000149011612
58.44274809160305 42.35808181762695 0.11999999731779099
59.45038167938931 43.231441497802734 0.15000000596046448
60.45801526717557 43.231441497802734 0.15000000596046448
61.46564885496183 43.66812515258789 0.1599999964237213
62.473282442748086 45.85152816772461 0.20999999344348907
63.480916030534345 46.288211822509766 0.2199999988079071
64.4885496183206 46.288211822509766 0.2199999988079071
65.49618320610686 46.724891662597656 0.23999999463558197
66.50381679389312 46.724891662597656 0.23999999463558197
67.51145038167938 47.5982551574707 0.25999999046325684
68.51908396946564 47.5982551574707 0.25999999046325684
69.5267175572519 48.034934997558594 0.30000001192092896
70.53435114503816 48.034934997558594 0.30000001192092896
71.54198473282442 48.47161865234375 0.30000001192092896
72.54961832061068 48.90829849243164 0.28999999165534973
73.55725190839694 49.34497833251953 0.3100000023841858
74.5648854961832 49.78166198730469 0.3400000035762787
75.57251908396945 49.78166198730469 0.3400000035762787
76.58015267175571 50.65502166748047 0.3700000047683716
77.58778625954197 50.65502166748047 0.3700000047683716
78.59541984732823 51.091705322265625 0.3799999952316284
79.60305343511449 51.091705322265625 0.3799999952316284
80.61068702290075 51.965065002441406 0.38999998569488525
81.61832061068702 51.965065002441406 0.38999998569488525
82.62595419847328 52.83842849731445 0.4000000059604645
83.63358778625954 52.83842849731445 0.4000000059604645
84.6412213740458 53.27511215209961 0.4399999976158142
85.64885496183206 53.27511215209961 0.4399999976158142
86.65648854961832 53.7117919921875 0.47999998927116394
87.66412213740458 53.7117919921875 0.47999998927116394
88.67175572519083 54.58515548706055 0.49000000953674316
89.6793893129771 54.58515548706055 0.49000000953674316
90.68702290076335 54.58515548706055 0.49000000953674316
91.69465648854961 55.02183532714844 0.5199999809265137
92.70229007633587 55.45851516723633 0.5199999809265137
93.70992366412213 55.895198822021484 0.5400000214576721
94.71755725190839 55.895198822021484 0.5699999928474426
95.72519083969465 56.768558502197266 0.029999999329447746
96.7328244274809 56.768558502197266 0.029999999329447746
97.74045801526717 56.768558502197266 0.05999999865889549
98.74809160305342 56.768558502197266 0.05999999865889549
99.75572519083968 56.768558502197266 0.10999999940395355
100.76335877862594 56.768558502197266 0.03999999910593033
101.7709923664122 56.768558502197266 0.029999999329447746
102.77862595419846 56.768558502197266 0.029999999329447746
103.78625954198472 56.768558502197266 0.05999999865889549
104.79389312977098 56.768558502197266 0.09000000357627869
105.80152671755724 56.768558502197266 0.10999999940395355
106.8091603053435 57.20524215698242 0.019999999552965164
107.81679389312976 57.20524215698242 0.019999999552965164
108.82442748091601 57.20524215698242 0.05999999865889549
109.83206106870227 57.20524215698242 0.05999999865889549
110.83969465648853 57.20524215698242 0.09000000357627869
111.84732824427479 57.64192199707031 0.019999999552965164
112.85496183206106 57.64192199707031 0.019999999552965164
113.86259541984732 57.64192199707031 0.05000000074505806
114.87022900763358 57.64192199707031 0.05000000074505806
115.87786259541984 57.64192199707031 0.07999999821186066
116.8854961832061 57.64192199707031 0.10000000149011612
117.89312977099236 57.64192199707031 0.10000000149011612
118.90076335877862 58.07860565185547 0.029999999329447746
119.90839694656488 58.07860565185547 0.03999999910593033
120.91603053435114 58.07860565185547 0.05000000074505806
121.9236641221374 58.07860565185547 0.05000000074505806
122.93129770992365 58.07860565185547 0.07000000029802322
123.93893129770991 58.07860565185547 0.09000000357627869
124.94656488549617 58.07860565185547 0.10999999940395355
125.95419847328243 58.07860565185547 0.03999999910593033
126.96183206106869 58.07860565185547 0.03999999910593033
127.96946564885495 58.07860565185547 0.07000000029802322
128.9770992366412 58.07860565185547 0.07000000029802322
129.98473282442748 58.07860565185547 0.10000000149011612
130.99236641221373 58.51528549194336 1.0
132.0 58.51528549194336 1.0
