Time,Distance1,SensorData0,Distance2,SensorData4
0.018000,0.060778,0.000000,0.060778,0.000000
0.036000,0.059525,0.000000,0.059525,0.000000
0.054000,0.058077,0.000000,0.058077,0.000000
0.072000,0.056768,0.000000,0.056768,0.000000
0.090000,0.055720,0.000000,0.055720,0.000000
0.108000,0.054871,0.000000,0.054871,0.000000
0.126000,0.054109,0.000000,0.054109,0.000000
0.144000,0.053362,0.000000,0.053362,0.000000
0.162000,0.052615,0.000000,0.052615,0.000000
0.180000,0.051879,0.000000,0.051879,0.000000
0.198000,0.051164,0.000000,0.051164,0.000000
0.216000,0.050465,0.000000,0.050465,0.000000
0.234000,0.049776,0.000000,0.049776,0.000000
0.252000,0.049092,0.000000,0.049092,0.000000
0.270000,0.048414,0.000000,0.048414,0.000000
0.288000,0.047741,0.000000,0.047741,0.000000
0.306000,0.047075,0.000000,0.047075,0.000000
0.324000,0.046417,0.000000,0.046417,0.000000
0.342000,0.045996,0.448840,0.045996,0.448837
0.360000,0.045927,0.699933,0.045927,0.699930
0.378000,0.045905,1.016315,0.045905,1.016312
0.396000,0.045852,1.337439,0.045852,1.337436
0.414000,0.045767,1.649545,0.045767,1.649542
0.432000,0.045661,1.954342,0.045661,1.954339
0.450000,0.045546,2.254120,0.045546,2.254117
0.468000,0.045430,2.554196,0.045430,2.554193
0.486000,0.045314,2.855316,0.045314,2.855314
0.504000,0.045201,3.158250,0.045201,3.158248
0.522000,0.045089,3.462174,0.045089,3.462172
0.540000,0.044979,3.767717,0.044979,3.767716
0.558000,0.044870,4.075038,0.044870,4.075040
0.576000,0.044761,4.382736,0.044761,4.382737
0.594000,0.044651,4.690732,0.044651,4.690741
0.612000,0.044541,4.999391,0.044541,4.999399
0.630000,0.044430,5.308359,0.044430,5.308367
0.648000,0.044318,5.617580,0.044318,5.617590
0.666000,0.044206,5.927350,0.044206,5.927363
0.684000,0.044093,6.238138,0.044093,6.238160
0.702000,0.043979,6.549691,0.043979,6.549748
0.720000,0.043864,6.863787,0.043864,6.863865
0.738000,0.043747,7.178945,0.043747,7.178908
0.756000,0.043629,7.497869,0.043629,7.497887
0.774000,0.043508,7.818638,0.043508,7.818290
0.792000,0.043390,8.254641,0.043390,8.253838
0.810000,0.043286,8.628779,0.043286,8.626936
0.828000,0.043184,9.012149,0.043184,9.011950
0.846000,0.043081,9.395703,0.043081,9.394749
0.864000,0.042980,9.795387,0.042980,9.795534
0.882000,0.042884,10.204435,0.042884,10.203737
0.900000,0.042795,10.628196,0.042795,10.627177
0.918000,0.042715,10.830346,0.042715,10.825725
0.936000,0.042644,11.295010,0.042644,11.290897
0.954000,0.042579,11.724646,0.042579,11.721166
0.972000,0.042517,12.127880,0.042518,12.122033
0.990000,0.042458,12.496569,0.042458,12.490563
1.008000,0.042399,12.839327,0.042399,12.833875
1.026000,0.042340,13.153436,0.042340,13.149313
1.044000,0.042281,13.408721,0.042281,13.407353
1.062000,0.042228,13.346858,0.042229,13.346730
1.080000,0.042185,13.355662,0.042186,13.354410
1.098000,0.042163,13.351714,0.042164,13.354182
1.116000,0.042160,13.355350,0.042160,13.355146
1.134000,0.042167,13.359430,0.042168,13.359623
1.152000,0.042180,13.366791,0.042181,13.369216
1.170000,0.042195,13.377200,0.042196,13.374193
1.188000,0.042210,13.383727,0.042210,13.386904
1.206000,0.042223,13.395131,0.042223,13.394872
1.224000,0.042234,13.403395,0.042233,13.402093
1.242000,0.042242,13.409474,0.042243,13.408278
1.260000,0.042250,13.412958,0.042249,13.416212
1.278000,0.042256,13.416579,0.042256,13.418435
1.296000,0.042261,13.420819,0.042262,13.419129
1.314000,0.042267,13.194438,0.042267,13.196291
1.332000,0.042287,12.845518,0.042286,12.846476
1.350000,0.042323,12.492985,0.042323,12.494009
1.368000,0.042372,12.137860,0.042372,12.140703
1.386000,0.042429,11.784536,0.042429,11.787010
1.404000,0.042490,11.425687,0.042490,11.428109
1.422000,0.042550,11.063908,0.042550,11.066304
1.440000,0.042609,10.694982,0.042609,10.698921
1.458000,0.042664,10.328371,0.042665,10.327836
1.476000,0.042718,9.958944,0.042718,9.961034
1.494000,0.042771,9.616147,0.042771,9.614640
1.512000,0.042831,9.235751,0.042830,9.236167
1.530000,0.042886,8.863320,0.042885,8.863233
1.548000,0.042937,8.490197,0.042936,8.490047
1.566000,0.042986,8.119854,0.042986,8.119617
1.584000,0.043037,7.749070,0.043037,7.748844
1.602000,0.043089,7.380082,0.043089,7.379944
1.620000,0.043143,7.011743,0.043143,7.011765
1.638000,0.043197,6.643889,0.043198,6.643353
1.656000,0.043253,6.273312,0.043253,6.273938
1.674000,0.043310,5.902565,0.043310,5.902227
1.692000,0.043366,5.530128,0.043366,5.529461
1.710000,0.043422,5.161115,0.043422,5.161191
1.728000,0.043479,4.820324,0.043479,4.820830
1.746000,0.043536,4.468385,0.043537,4.468962
1.764000,0.043597,4.152622,0.043597,4.152948
1.782000,0.043663,3.845688,0.043663,3.845946
1.800000,0.043737,3.544174,0.043737,3.544325
1.818000,0.043819,3.244045,0.043819,3.244232
1.836000,0.043911,2.945316,0.043911,2.945361
1.854000,0.044011,2.648549,0.044011,2.648528
1.872000,0.044121,2.354473,0.044120,2.354427
1.890000,0.044237,2.036039,0.044237,2.035960
1.908000,0.044361,1.751024,0.044361,1.750959
1.926000,0.044490,1.466047,0.044490,1.465988
1.944000,0.044621,1.183840,0.044621,1.183782
1.962000,0.044755,0.902548,0.044755,0.902490
1.980000,0.044893,0.623743,0.044893,0.623681
1.998000,0.045039,0.350844,0.045039,0.350776
2.016000,0.045212,0.125867,0.045211,0.125806
2.034000,0.045537,0.000000,0.045537,0.000000
2.052000,0.046136,0.000000,0.046136,0.000000
2.070000,0.046950,0.000000,0.046950,0.000000
2.088000,0.047818,0.000000,0.047818,0.000000
2.106000,0.048620,0.000000,0.048620,0.000000
2.124000,0.049338,0.000000,0.049338,0.000000
2.142000,0.050018,0.000000,0.050018,0.000000
2.160000,0.050703,0.000000,0.050703,0.000000
2.178000,0.051405,0.000000,0.051405,0.000000
2.196000,0.052118,0.000000,0.052118,0.000000
2.214000,0.052832,0.000000,0.052832,0.000000
2.232000,0.053544,0.000000,0.053544,0.000000
2.250000,0.054258,0.000000,0.054258,0.000000
2.268000,0.054976,0.000000,0.054976,0.000000
2.286000,0.055700,0.000000,0.055700,0.000000
2.304000,0.056428,0.000000,0.056428,0.000000
2.322000,0.057160,0.000000,0.057160,0.000000
2.340000,0.057896,0.000000,0.057896,0.000000
2.358000,0.058550,0.000000,0.058550,0.000000
2.376000,0.058783,0.000000,0.058783,0.000000
2.394000,0.058663,0.000000,0.058663,0.000000
2.412000,0.058482,0.000000,0.058482,0.000000
2.430000,0.058412,0.000000,0.058412,0.000000
2.448000,0.058441,0.000000,0.058441,0.000000
2.466000,0.058490,0.000000,0.058490,0.000000
2.484000,0.058511,0.000000,0.058511,0.000000
2.502000,0.058504,0.000000,0.058504,0.000000
2.520000,0.058491,0.000000,0.058491,0.000000
2.538000,0.058485,0.000000,0.058485,0.000000
2.556000,0.058486,0.000000,0.058486,0.000000
2.574000,0.058490,0.000000,0.058490,0.000000
2.592000,0.058492,0.000000,0.058492,0.000000
2.610000,0.058491,0.000000,0.058491,0.000000
2.628000,0.058490,0.000000,0.058490,0.000000
2.646000,0.058490,0.000000,0.058490,0.000000
2.664000,0.058490,0.000000,0.058490,0.000000
2.682000,0.058490,0.000000,0.058490,0.000000
2.700000,0.058490,0.000000,0.058490,0.000000
2.718000,0.058490,0.000000,0.058490,0.000000
2.736000,0.058490,0.000000,0.058490,0.000000
2.754000,0.058490,0.000000,0.058490,0.000000
2.772000,0.058490,0.000000,0.058490,0.000000
2.790000,0.058490,0.000000,0.058490,0.000000
2.808000,0.058490,0.000000,0.058490,0.000000
2.826000,0.058490,0.000000,0.058490,0.000000
2.844000,0.058490,0.000000,0.058490,0.000000
2.862000,0.058490,0.000000,0.058490,0.000000
2.880000,0.058490,0.000000,0.058490,0.000000
2.898000,0.058490,0.000000,0.058490,0.000000
2.916000,0.058490,0.000000,0.058490,0.000000
2.934000,0.058490,0.000000,0.058490,0.000000
2.952000,0.058490,0.000000,0.058490,0.000000
2.970000,0.058490,0.000000,0.058490,0.000000
2.988000,0.058490,0.000000,0.058490,0.000000
3.006000,0.058490,0.000000,0.058490,0.000000
3.024000,0.058490,0.000000,0.058490,0.000000
3.042000,0.058490,0.000000,0.058490,0.000000
3.060000,0.058490,0.000000,0.058490,0.000000
3.078000,0.058490,0.000000,0.058490,0.000000
3.096000,0.058490,0.000000,0.058490,0.000000
3.114000,0.058490,0.000000,0.058490,0.000000
3.132000,0.058490,0.000000,0.058490,0.000000
3.150000,0.058490,0.000000,0.058490,0.000000
3.168000,0.058490,0.000000,0.058490,0.000000
3.186000,0.058490,0.000000,0.058490,0.000000
3.204000,0.058490,0.000000,0.058490,0.000000
3.222000,0.058490,0.000000,0.058490,0.000000
3.240000,0.058490,0.000000,0.058490,0.000000
3.258000,0.058490,0.000000,0.058490,0.000000
3.276000,0.058490,0.000000,0.058490,0.000000
3.294000,0.058490,0.000000,0.058490,0.000000
3.312000,0.058490,0.000000,0.058490,0.000000
3.330000,0.058490,0.000000,0.058490,0.000000
3.348000,0.058490,0.000000,0.058490,0.000000
3.366000,0.058490,0.000000,0.058490,0.000000
3.384000,0.058490,0.000000,0.058490,0.000000
3.402000,0.058490,0.000000,0.058490,0.000000
3.420000,0.058490,0.000000,0.058490,0.000000
3.438000,0.058490,0.000000,0.058490,0.000000
3.456000,0.058490,0.000000,0.058490,0.000000
3.474000,0.058490,0.000000,0.058490,0.000000
3.492000,0.058490,0.000000,0.058490,0.000000
3.510000,0.058490,0.000000,0.058490,0.000000
3.528000,0.058490,0.000000,0.058490,0.000000
3.546000,0.058490,0.000000,0.058490,0.000000
3.564000,0.058490,0.000000,0.058490,0.000000
3.582000,0.058490,0.000000,0.058490,0.000000
3.600000,0.058490,0.000000,0.058490,0.000000
3.618000,0.058490,0.000000,0.058490,0.000000
3.636000,0.058490,0.000000,0.058490,0.000000
3.654000,0.058490,0.000000,0.058490,0.000000
3.672000,0.058490,0.000000,0.058490,0.000000
3.690000,0.058490,0.000000,0.058490,0.000000
3.708000,0.058490,0.000000,0.058490,0.000000
3.726000,0.058490,0.000000,0.058490,0.000000
3.744000,0.058490,0.000000,0.058490,0.000000
3.762000,0.058490,0.000000,0.058490,0.000000
3.780000,0.058490,0.000000,0.058490,0.000000
3.798000,0.058490,0.000000,0.058490,0.000000
3.816000,0.058490,0.000000,0.058490,0.000000
3.834000,0.058490,0.000000,0.058490,0.000000
3.852000,0.058490,0.000000,0.058490,0.000000
3.870000,0.058490,0.000000,0.058490,0.000000
3.888000,0.058490,0.000000,0.058490,0.000000
3.906000,0.058490,0.000000,0.058490,0.000000
3.924000,0.058490,0.000000,0.058490,0.000000
3.942000,0.058490,0.000000,0.058490,0.000000
3.960000,0.058490,0.000000,0.058490,0.000000
3.978000,0.058490,0.000000,0.058490,0.000000
3.996000,0.058490,0.000000,0.058490,0.000000
4.014000,0.058490,0.000000,0.058490,0.000000
4.032000,0.058490,0.000000,0.058490,0.000000
4.050000,0.058490,0.000000,0.058490,0.000000
4.068000,0.058490,0.000000,0.058490,0.000000
4.086000,0.058490,0.000000,0.058490,0.000000
4.104000,0.058490,0.000000,0.058490,0.000000
4.122000,0.058490,0.000000,0.058490,0.000000
4.140000,0.058490,0.000000,0.058490,0.000000
4.158000,0.058490,0.000000,0.058490,0.000000
4.176000,0.058490,0.000000,0.058490,0.000000
4.194000,0.058490,0.000000,0.058490,0.000000
4.212000,0.058490,0.000000,0.058490,0.000000
4.230000,0.058490,0.000000,0.058490,0.000000
4.248000,0.058490,0.000000,0.058490,0.000000
4.266000,0.058490,0.000000,0.058490,0.000000
4.284000,0.058490,0.000000,0.058490,0.000000
4.302000,0.058490,0.000000,0.058490,0.000000
4.320000,0.058490,0.000000,0.058490,0.000000
4.338000,0.058490,0.000000,0.058490,0.000000
4.356000,0.058490,0.000000,0.058490,0.000000
4.374000,0.058490,0.000000,0.058490,0.000000
4.392000,0.058490,0.000000,0.058490,0.000000
4.410000,0.058490,0.000000,0.058490,0.000000
4.428000,0.058490,0.000000,0.058490,0.000000
4.446000,0.058490,0.000000,0.058490,0.000000
4.464000,0.058490,0.000000,0.058490,0.000000
4.482000,0.058490,0.000000,0.058490,0.000000
4.500000,0.058490,0.000000,0.058490,0.000000
4.518000,0.058490,0.000000,0.058490,0.000000
4.536000,0.058490,0.000000,0.058490,0.000000
4.554000,0.058490,0.000000,0.058490,0.000000
4.572000,0.058490,0.000000,0.058490,0.000000
4.590000,0.058490,0.000000,0.058490,0.000000
4.608000,0.058490,0.000000,0.058490,0.000000
4.626000,0.058490,0.000000,0.058490,0.000000
4.644000,0.058490,0.000000,0.058490,0.000000
4.662000,0.058490,0.000000,0.058490,0.000000
4.680000,0.058490,0.000000,0.058490,0.000000
4.698000,0.058490,0.000000,0.058490,0.000000
4.716000,0.058490,0.000000,0.058490,0.000000
4.734000,0.058490,0.000000,0.058490,0.000000
4.752000,0.058490,0.000000,0.058490,0.000000
4.770000,0.058490,0.000000,0.058490,0.000000
4.788000,0.058490,0.000000,0.058490,0.000000
4.806000,0.058490,0.000000,0.058490,0.000000
4.824000,0.058490,0.000000,0.058490,0.000000
4.842000,0.058490,0.000000,0.058490,0.000000
4.860000,0.058490,0.000000,0.058490,0.000000
4.878000,0.058490,0.000000,0.058490,0.000000
4.896000,0.058490,0.000000,0.058490,0.000000
4.914000,0.058490,0.000000,0.058490,0.000000
4.932000,0.058490,0.000000,0.058490,0.000000
4.950000,0.058490,0.000000,0.058490,0.000000
4.968000,0.058490,0.000000,0.058490,0.000000
4.986000,0.058490,0.000000,0.058490,0.000000
5.004000,0.058490,0.000000,0.058490,0.000000
5.022000,0.058490,0.000000,0.058490,0.000000
5.040000,0.058490,0.000000,0.058490,0.000000
5.058000,0.058490,0.000000,0.058490,0.000000
5.076000,0.058490,0.000000,0.058490,0.000000
5.094000,0.058490,0.000000,0.058490,0.000000
5.112000,0.058490,0.000000,0.058490,0.000000
5.130000,0.058490,0.000000,0.058490,0.000000
5.148000,0.058490,0.000000,0.058490,0.000000
5.166000,0.058490,0.000000,0.058490,0.000000
5.184000,0.058490,0.000000,0.058490,0.000000
5.202000,0.058490,0.000000,0.058490,0.000000
5.220000,0.058490,0.000000,0.058490,0.000000
5.238000,0.058490,0.000000,0.058490,0.000000
5.256000,0.058490,0.000000,0.058490,0.000000
5.274000,0.058490,0.000000,0.058490,0.000000
5.292000,0.058490,0.000000,0.058490,0.000000
5.310000,0.058490,0.000000,0.058490,0.000000
5.328000,0.058490,0.000000,0.058490,0.000000
5.346000,0.058490,0.000000,0.058490,0.000000
5.364000,0.058490,0.000000,0.058490,0.000000
5.382000,0.058490,0.000000,0.058490,0.000000
5.400000,0.058490,0.000000,0.058490,0.000000
5.418000,0.058490,0.000000,0.058490,0.000000
5.436000,0.058490,0.000000,0.058490,0.000000
5.454000,0.058490,0.000000,0.058490,0.000000
5.472000,0.058490,0.000000,0.058490,0.000000
5.490000,0.058490,0.000000,0.058490,0.000000
5.508000,0.058490,0.000000,0.058490,0.000000
5.526000,0.058490,0.000000,0.058490,0.000000
5.544000,0.058490,0.000000,0.058490,0.000000
5.562000,0.058490,0.000000,0.058490,0.000000
5.580000,0.058490,0.000000,0.058490,0.000000
5.598000,0.058490,0.000000,0.058490,0.000000
