// Time Position Current
0.0 0.8733651041984558 0.0
1.0078125 0.8733651041984558 0.0
2.015625 0.8733651041984558 0.019999999552965164
3.0234375 1.3100463151931763 0.03999999910593033
4.03125 2.183408737182617 0.029999999329447746
5.0390625 3.0567712783813477 0.0
6.046875 4.80349588394165 0.009999999776482582
7.0546875 4.80349588394165 0.009999999776482582
8.0625 6.550220966339111 0.009999999776482582
9.0703125 6.550220966339111 0.009999999776482582
10.078125 7.860264301300049 0.009999999776482582
11.0859375 7.860264301300049 0.009999999776482582
12.09375 8.733627319335938 0.009999999776482582
13.1015625 8.733627319335938 0.009999999776482582
14.109375 10.480351448059082 0.009999999776482582
15.1171875 10.480351448059082 0.009999999776482582
16.125 13.973801612854004 0.009999999776482582
17.1328125 13.973801612854004 0.009999999776482582
18.140625 13.973801612854004 0.009999999776482582
19.1484375 14.847164154052734 0.0
20.15625 16.593889236450195 0.019999999552965164
21.1640625 16.593889236450195 0.019999999552965164
22.171875 17.903932571411133 0.009999999776482582
23.1796875 17.903932571411133 0.009999999776482582
24.1875 18.777294158935547 0.0
25.1953125 20.087337493896484 0.019999999552965164
26.203125 20.087337493896484 0.019999999552965164
27.2109375 22.27074432373047 0.019999999552965164
28.21875 23.580787658691406 0.009999999776482582
29.2265625 23.580787658691406 0.009999999776482582
30.234375 24.890830993652344 0.019999999552965164
31.2421875 26.637556076049805 0.009999999776482582
32.25 26.637556076049805 0.009999999776482582
33.2578125 27.074237823486328 0.0
34.265625 27.947599411010742 0.009999999776482582
35.2734375 28.82096290588379 0.019999999552965164
36.28125 28.82096290588379 0.019999999552965164
37.2890625 31.441049575805664 0.009999999776482582
38.296875 31.441049575805664 0.009999999776482582
39.3046875 31.877731323242188 0.009999999776482582
40.3125 31.877731323242188 0.009999999776482582
41.3203125 33.624454498291016 0.009999999776482582
42.328125 33.624454498291016 0.009999999776482582
43.3359375 35.37118148803711 0.0
44.34375 35.37118148803711 0.0
45.3515625 36.68122482299805 0.009999999776482582
46.359375 36.68122482299805 0.009999999776482582
47.3671875 38.427947998046875 0.0
48.375 39.30131149291992 0.009999999776482582
49.3828125 40.17467498779297 0.009999999776482582
50.390625 41.9213981628418 0.0
51.3984375 41.9213981628418 0.0
52.40625 43.231441497802734 0.009999999776482582
53.4140625 43.231441497802734 0.009999999776482582
54.421875 43.66812515258789 0.009999999776482582
55.4296875 45.85152816772461 0.009999999776482582
56.4375 45.85152816772461 0.009999999776482582
57.4453125 46.724891662597656 0.019999999552965164
58.453125 48.034934997558594 0.019999999552965164
59.4609375 48.90829849243164 0.009999999776482582
60.46875 48.90829849243164 0.009999999776482582
61.4765625 50.21834182739258 0.029999999329447746
62.484375 50.21834182739258 0.029999999329447746
63.4921875 51.965065002441406 0.029999999329447746
64.5 51.965065002441406 0.029999999329447746
65.5078125 53.27511215209961 0.029999999329447746
66.515625 53.7117919921875 0.029999999329447746
67.5234375 54.58515548706055 0.029999999329447746
68.53125 55.895198822021484 0.029999999329447746
69.5390625 55.895198822021484 0.029999999329447746
70.546875 57.20524215698242 0.03999999910593033
71.5546875 57.20524215698242 0.03999999910593033
72.5625 58.51528549194336 0.05999999865889549
73.5703125 58.51528549194336 0.05999999865889549
74.578125 59.8253288269043 0.03999999910593033
75.5859375 59.8253288269043 0.03999999910593033
76.59375 61.135372161865234 0.03999999910593033
77.6015625 62.00873565673828 0.05000000074505806
78.609375 62.88209533691406 0.029999999329447746
79.6171875 64.192138671875 0.07000000029802322
80.625 64.192138671875 0.07000000029802322
81.6328125 65.06550598144531 0.03999999910593033
82.640625 65.06550598144531 0.03999999910593033
83.6484375 66.37554931640625 0.05000000074505806
84.65625 66.37554931640625 0.05000000074505806
85.6640625 67.68559265136719 0.07000000029802322
86.671875 68.55895233154297 0.05000000074505806
87.6796875 69.43231201171875 0.05000000074505806
88.6875 70.74235534667969 0.07000000029802322
89.6953125 70.74235534667969 0.07000000029802322
90.703125 71.61572265625 0.05999999865889549
91.7109375 71.61572265625 0.05999999865889549
92.71875 72.48908233642578 0.05999999865889549
93.7265625 73.3624496459961 0.05999999865889549
94.734375 74.67249298095703 0.07000000029802322
95.7421875 74.67249298095703 0.07000000029802322
96.75 75.54585266113281 0.05000000074505806
97.7578125 77.2925796508789 0.07000000029802322
98.765625 78.16593933105469 0.07000000029802322
99.7734375 78.16593933105469 0.07000000029802322
100.78125 79.03929901123047 0.07000000029802322
101.7890625 80.78602600097656 0.09000000357627869
102.796875 81.22270965576172 0.09000000357627869
103.8046875 81.65938568115234 0.07999999821186066
104.8125 83.40611267089844 0.10000000149011612
105.8203125 83.40611267089844 0.10000000149011612
106.828125 83.8427963256836 0.10000000149011612
107.8359375 84.27947998046875 0.10999999940395355
108.84375 84.71615600585938 0.10999999940395355
109.8515625 85.15283966064453 0.10999999940395355
110.859375 86.02619934082031 0.14000000059604645
111.8671875 86.02619934082031 0.14000000059604645
112.875 86.89956665039062 0.1599999964237213
113.8828125 86.89956665039062 0.1599999964237213
114.890625 87.7729263305664 0.17000000178813934
115.8984375 87.7729263305664 0.17000000178813934
116.90625 88.20960998535156 0.20000000298023224
117.9140625 88.64628601074219 0.20000000298023224
118.921875 88.64628601074219 0.25
119.9296875 89.5196533203125 0.019999999552965164
120.9375 89.5196533203125 0.07000000029802322
121.9453125 89.5196533203125 0.07000000029802322
122.953125 89.5196533203125 0.10000000149011612
123.9609375 89.95632934570312 0.019999999552965164
124.96875 89.95632934570312 0.03999999910593033
125.9765625 89.95632934570312 0.05000000074505806
126.984375 89.95632934570312 0.07999999821186066
127.9921875 89.95632934570312 1.0
129.0 89.95632934570312 1.0
