// Time Position Current
0.0 0.8733651041984558 0.0
1.009009009009009 0.8733651041984558 0.0
2.018018018018018 0.8733651041984558 0.0
3.0270270270270268 0.8733651041984558 0.019999999552965164
4.036036036036036 2.183408737182617 0.03999999910593033
5.045045045045045 2.183408737182617 0.03999999910593033
6.0540540540540535 3.930133581161499 0.019999999552965164
7.063063063063062 3.930133581161499 0.019999999552965164
8.072072072072071 5.676858425140381 0.0
9.08108108108108 5.676858425140381 0.0
10.09009009009009 7.423583030700684 0.0
11.099099099099098 7.423583030700684 0.0
12.108108108108107 9.170308113098145 0.009999999776482582
13.117117117117116 9.606988906860352 0.0
14.126126126126124 10.480351448059082 0.019999999552965164
15.135135135135133 11.353713989257812 0.009999999776482582
16.144144144144143 11.353713989257812 0.009999999776482582
17.153153153153152 13.100439071655273 0.009999999776482582
18.16216216216216 13.100439071655273 0.009999999776482582
19.17117117117117 14.410482406616211 0.019999999552965164
20.18018018018018 14.410482406616211 0.019999999552965164
21.189189189189186 16.157207489013672 0.019999999552965164
22.198198198198195 17.030569076538086 0.029999999329447746
23.207207207207205 17.46725082397461 0.009999999776482582
24.216216216216214 18.340614318847656 0.019999999552965164
25.225225225225223 18.340614318847656 0.019999999552965164
26.234234234234233 18.777294158935547 0.019999999552965164
27.243243243243242 19.650657653808594 0.0
28.252252252252248 21.397382736206055 0.009999999776482582
29.261261261261257 21.397382736206055 0.009999999776482582
30.270270270270267 22.707426071166992 0.019999999552965164
31.279279279279276 22.707426071166992 0.019999999552965164
32.288288288288285 24.890830993652344 0.009999999776482582
33.29729729729729 24.890830993652344 0.009999999776482582
34.306306306306304 25.76419448852539 0.009999999776482582
35.31531531531531 25.76419448852539 0.009999999776482582
36.32432432432432 27.947599411010742 0.009999999776482582
37.33333333333333 28.384281158447266 0.009999999776482582
38.34234234234234 28.82096290588379 0.019999999552965164
39.35135135135135 29.694324493408203 0.009999999776482582
40.36036036036036 31.441049575805664 0.009999999776482582
41.369369369369366 31.441049575805664 0.009999999776482582
42.37837837837837 32.751094818115234 0.019999999552965164
43.387387387387385 32.751094818115234 0.019999999552965164
44.39639639639639 34.49781799316406 0.019999999552965164
45.4054054054054 34.49781799316406 0.019999999552965164
46.41441441441441 35.37118148803711 0.019999999552965164
47.42342342342342 36.244544982910156 0.0
48.43243243243243 37.11790466308594 0.019999999552965164
49.441441441441434 38.86463165283203 0.009999999776482582
50.45045045045045 38.86463165283203 0.009999999776482582
51.45945945945945 39.73799133300781 0.019999999552965164
52.468468468468465 39.73799133300781 0.019999999552965164
53.47747747747747 40.61135482788086 0.03999999910593033
54.486486486486484 40.61135482788086 0.05999999865889549
55.49549549549549 41.04803466796875 0.07000000029802322
56.504504504504496 41.9213981628418 0.07999999821186066
57.51351351351351 42.35808181762695 0.10000000149011612
58.522522522522515 42.794761657714844 0.10000000149011612
59.53153153153153 42.794761657714844 0.10000000149011612
60.54054054054053 43.66812515258789 0.1599999964237213
61.549549549549546 43.66812515258789 0.1599999964237213
62.55855855855855 44.10480499267578 0.18000000715255737
63.567567567567565 44.10480499267578 0.18000000715255737
64.57657657657657 44.97816848754883 0.18000000715255737
65.58558558558558 44.97816848754883 0.18000000715255737
66.59459459459458 44.97816848754883 0.18000000715255737
67.6036036036036 46.288211822509766 0.1899999976158142
68.61261261261261 46.724891662597656 0.20000000298023224
69.62162162162161 47.16157531738281 0.20999999344348907
70.63063063063062 47.5982551574707 0.25
71.63963963963964 48.034934997558594 0.27000001072883606
72.64864864864865 48.47161865234375 0.27000001072883606
73.65765765765765 49.34497833251953 0.3100000023841858
74.66666666666666 49.78166198730469 0.3100000023841858
75.67567567567566 49.78166198730469 0.3100000023841858
76.68468468468468 50.21834182739258 0.3400000035762787
77.69369369369369 50.21834182739258 0.3400000035762787
78.7027027027027 50.65502166748047 0.03999999910593033
79.7117117117117 50.65502166748047 0.03999999910593033
80.72072072072072 50.65502166748047 0.05999999865889549
81.72972972972973 50.65502166748047 0.05999999865889549
82.73873873873873 50.65502166748047 0.09000000357627869
83.74774774774774 50.65502166748047 0.029999999329447746
84.75675675675674 50.65502166748047 0.029999999329447746
85.76576576576576 50.65502166748047 0.05000000074505806
86.77477477477477 50.65502166748047 0.05000000074505806
87.78378378378378 50.65502166748047 0.09000000357627869
88.79279279279278 51.091705322265625 0.009999999776482582
89.80180180180179 51.091705322265625 0.009999999776482582
90.8108108108108 51.091705322265625 0.029999999329447746
91.81981981981981 51.091705322265625 0.07000000029802322
92.82882882882882 51.091705322265625 0.09000000357627869
93.83783783783782 51.091705322265625 0.10000000149011612
94.84684684684684 51.965065002441406 0.009999999776482582
95.85585585585585 51.965065002441406 0.019999999552965164
96.86486486486486 51.965065002441406 0.07999999821186066
97.87387387387386 51.965065002441406 0.09000000357627869
98.88288288288287 51.965065002441406 0.9900000095367432
99.89189189189189 51.965065002441406 0.9900000095367432
100.9009009009009 52.40174865722656 0.019999999552965164
101.9099099099099 52.40174865722656 0.019999999552965164
102.9189189189189 52.40174865722656 0.05999999865889549
103.92792792792793 52.40174865722656 0.05999999865889549
104.93693693693693 52.40174865722656 0.10999999940395355
105.94594594594594 52.40174865722656 0.10999999940395355
106.95495495495494 52.83842849731445 0.03999999910593033
107.96396396396395 52.83842849731445 0.05999999865889549
108.97297297297297 52.83842849731445 0.07999999821186066
109.98198198198197 52.83842849731445 0.07999999821186066
110.99099099099098 52.83842849731445 1.0
112.0 52.83842849731445 1.0
