// Time Position Current
0.0 0.8733651041984558 0.0
1.0112359550561798 0.8733651041984558 0.0
2.0224719101123596 0.8733651041984558 0.0
3.033707865168539 0.8733651041984558 0.0
4.044943820224719 1.3100463151931763 0.05000000074505806
5.056179775280899 3.0567712783813477 0.019999999552965164
6.067415730337078 4.80349588394165 0.009999999776482582
7.078651685393258 4.80349588394165 0.009999999776482582
8.089887640449438 6.550220966339111 0.009999999776482582
9.101123595505618 7.423583030700684 0.019999999552965164
10.112359550561798 7.423583030700684 0.019999999552965164
11.123595505617978 9.170308113098145 0.009999999776482582
12.134831460674157 9.170308113098145 0.009999999776482582
13.146067415730338 10.480351448059082 0.009999999776482582
14.157303370786517 11.353713989257812 0.0
15.168539325842698 12.227076530456543 0.019999999552965164
16.179775280898877 13.100439071655273 0.019999999552965164
17.191011235955056 13.53711986541748 0.019999999552965164
18.202247191011235 15.283844947814941 0.009999999776482582
19.213483146067418 15.283844947814941 0.009999999776482582
20.224719101123597 17.030569076538086 0.009999999776482582
21.235955056179776 17.030569076538086 0.009999999776482582
22.247191011235955 17.46725082397461 0.009999999776482582
23.258426966292134 17.46725082397461 0.009999999776482582
24.269662921348313 19.21397590637207 0.019999999552965164
25.280898876404496 27.074237823486328 0.019999999552965164
26.292134831460675 27.947599411010742 0.009999999776482582
27.303370786516854 28.82096290588379 0.0
28.314606741573034 28.82096290588379 0.009999999776482582
29.325842696629213 31.00436782836914 0.009999999776482582
30.337078651685395 31.00436782836914 0.009999999776482582
31.348314606741575 32.31441116333008 0.019999999552965164
32.359550561797754 34.06113815307617 0.019999999552965164
33.37078651685393 34.06113815307617 0.019999999552965164
34.38202247191011 35.807861328125 0.009999999776482582
35.39325842696629 37.11790466308594 0.009999999776482582
36.40449438202247 37.11790466308594 0.009999999776482582
37.41573033707865 38.86463165283203 0.009999999776482582
38.426966292134836 38.86463165283203 0.009999999776482582
39.438202247191015 39.30131149291992 0.019999999552965164
40.449438202247194 39.30131149291992 0.019999999552965164
41.46067415730337 39.73799133300781 0.03999999910593033
42.47191011235955 40.61135482788086 0.05999999865889549
43.48314606741573 41.04803466796875 0.07000000029802322
44.49438202247191 41.484718322753906 0.07000000029802322
45.50561797752809 41.9213981628418 0.10000000149011612
46.51685393258427 41.9213981628418 0.10000000149011612
47.52808988764045 42.794761657714844 0.12999999523162842
48.53932584269663 42.794761657714844 0.12999999523162842
49.55056179775281 43.231441497802734 0.14000000059604645
50.56179775280899 43.231441497802734 0.14000000059604645
51.57303370786517 43.66812515258789 0.1599999964237213
52.58426966292135 43.66812515258789 0.1599999964237213
53.59550561797753 44.10480499267578 0.18000000715255737
54.60674157303371 44.97816848754883 0.18000000715255737
55.61797752808989 44.97816848754883 0.20000000298023224
56.62921348314607 45.85152816772461 0.20000000298023224
57.640449438202246 45.85152816772461 0.20000000298023224
58.651685393258425 46.724891662597656 0.23000000417232513
59.66292134831461 46.724891662597656 0.23000000417232513
60.67415730337079 47.16157531738281 0.33000001311302185
61.68539325842697 47.16157531738281 0.33000001311302185
62.69662921348315 47.5982551574707 0.28999999165534973
63.70786516853933 47.5982551574707 0.28999999165534973
64.71910112359551 48.034934997558594 0.3100000023841858
65.73033707865169 48.90829849243164 0.3199999928474426
66.74157303370787 48.90829849243164 0.3199999928474426
67.75280898876404 49.78166198730469 0.3700000047683716
68.76404494382022 49.78166198730469 0.3700000047683716
69.7752808988764 50.65502166748047 0.4099999964237213
70.78651685393258 51.091705322265625 0.30000001192092896
71.79775280898876 51.091705322265625 0.41999998688697815
72.80898876404494 51.091705322265625 0.41999998688697815
73.82022471910112 51.528385162353516 0.4399999976158142
74.8314606741573 51.965065002441406 0.44999998807907104
75.84269662921349 52.83842849731445 0.49000000953674316
76.85393258426967 52.83842849731445 0.49000000953674316
77.86516853932585 52.83842849731445 0.49000000953674316
78.87640449438203 52.83842849731445 0.49000000953674316
79.88764044943821 53.7117919921875 0.5199999809265137
80.89887640449439 53.7117919921875 0.5199999809265137
81.91011235955057 53.7117919921875 0.5299999713897705
82.92134831460675 53.7117919921875 0.5299999713897705
83.93258426966293 54.58515548706055 0.009999999776482582
84.9438202247191 54.58515548706055 0.029999999329447746
85.95505617977528 54.58515548706055 0.05000000074505806
86.96629213483146 54.58515548706055 0.07999999821186066
87.97752808988764 54.58515548706055 0.07999999821186066
88.98876404494382 54.58515548706055 1.0
90.0 54.58515548706055 1.0
