// Time Position Current
0.0 0.8733651041984558 0.0
1.0016528925619834 0.8733651041984558 0.0
2.003305785123967 0.8733651041984558 0.0
3.0049586776859503 1.3100463151931763 0.019999999552965164
4.006611570247934 1.746727466583252 0.029999999329447746
5.008264462809917 2.6200900077819824 0.019999999552965164
6.0099173553719005 3.930133581161499 0.009999999776482582
7.011570247933884 4.80349588394165 0.009999999776482582
8.013223140495867 5.676858425140381 0.009999999776482582
9.01487603305785 6.550220966339111 0.0
10.016528925619834 8.296945571899414 0.009999999776482582
11.018181818181818 8.733627319335938 0.0
12.019834710743801 9.170308113098145 0.0
13.021487603305784 10.917033195495605 0.009999999776482582
14.023140495867768 11.790395736694336 0.009999999776482582
15.024793388429751 12.66375732421875 0.009999999776482582
16.026446280991735 13.973801612854004 0.0
17.02809917355372 13.973801612854004 0.0
18.0297520661157 14.847164154052734 0.009999999776482582
19.031404958677683 14.847164154052734 0.009999999776482582
20.03305785123967 15.720526695251465 0.019999999552965164
21.034710743801654 15.720526695251465 0.019999999552965164
22.036363636363635 17.903932571411133 0.009999999776482582
23.038016528925617 17.903932571411133 0.009999999776482582
24.039669421487602 19.650657653808594 0.009999999776482582
25.041322314049587 19.650657653808594 0.009999999776482582
26.04297520661157 20.96070098876953 0.019999999552965164
27.04462809917355 20.96070098876953 0.019999999552965164
28.046280991735536 22.707426071166992 0.009999999776482582
29.04793388429752 24.454151153564453 0.019999999552965164
30.049586776859503 24.454151153564453 0.019999999552965164
31.051239669421484 24.890830993652344 0.0
32.05289256198347 26.637556076049805 0.009999999776482582
33.054545454545455 26.637556076049805 0.009999999776482582
34.05619834710744 27.947599411010742 0.009999999776482582
35.05785123966942 28.82096290588379 0.019999999552965164
36.0595041322314 30.56768798828125 0.009999999776482582
37.06115702479339 31.441049575805664 0.009999999776482582
38.06280991735537 32.751094818115234 0.009999999776482582
39.06446280991735 33.624454498291016 0.0
40.06611570247934 33.624454498291016 0.0
41.06776859504132 35.37118148803711 0.019999999552965164
42.06942148760331 36.244544982910156 0.0
43.071074380165285 36.68122482299805 0.019999999552965164
44.07272727272727 37.991268157958984 0.019999999552965164
45.074380165289256 38.427947998046875 0.0
46.076033057851234 40.17467498779297 0.009999999776482582
47.07768595041322 40.17467498779297 0.009999999776482582
48.079338842975204 41.04803466796875 0.009999999776482582
49.08099173553719 41.9213981628418 0.0
50.082644628099175 43.231441497802734 0.009999999776482582
51.08429752066115 43.231441497802734 0.009999999776482582
52.08595041322314 43.66812515258789 0.009999999776482582
53.08760330578512 44.54148483276367 0.019999999552965164
54.0892561983471 44.54148483276367 0.019999999552965164
55.090909090909086 45.85152816772461 0.019999999552965164
56.09256198347107 46.724891662597656 0.029999999329447746
57.09421487603306 46.724891662597656 0.029999999329447746
58.09586776859504 48.90829849243164 0.019999999552965164
59.09752066115702 48.90829849243164 0.019999999552965164
60.099173553719005 49.78166198730469 0.019999999552965164
61.10082644628099 49.78166198730469 0.019999999552965164
62.10247933884297 50.21834182739258 0.029999999329447746
63.104132231404954 50.21834182739258 0.029999999329447746
64.10578512396694 50.21834182739258 0.029999999329447746
65.10743801652892 50.21834182739258 0.029999999329447746
66.10909090909091 50.21834182739258 0.029999999329447746
67.11074380165289 50.21834182739258 0.029999999329447746
68.11239669421488 50.21834182739258 0.029999999329447746
69.11404958677686 50.21834182739258 0.029999999329447746
70.11570247933884 50.21834182739258 0.029999999329447746
71.11735537190083 50.21834182739258 0.029999999329447746
72.1190082644628 50.21834182739258 0.029999999329447746
73.12066115702478 50.21834182739258 0.029999999329447746
74.12231404958678 50.21834182739258 0.029999999329447746
75.12396694214875 50.21834182739258 0.029999999329447746
76.12561983471073 50.21834182739258 0.029999999329447746
77.12727272727273 50.21834182739258 0.029999999329447746
78.1289256198347 50.21834182739258 0.029999999329447746
79.1305785123967 50.21834182739258 0.029999999329447746
80.13223140495867 50.21834182739258 0.029999999329447746
81.13388429752065 50.21834182739258 0.029999999329447746
82.13553719008264 50.21834182739258 0.029999999329447746
83.13719008264462 50.21834182739258 0.029999999329447746
84.13884297520661 50.21834182739258 0.029999999329447746
85.14049586776859 50.21834182739258 0.029999999329447746
86.14214876033057 50.21834182739258 0.029999999329447746
87.14380165289256 50.21834182739258 0.029999999329447746
88.14545454545454 50.21834182739258 0.029999999329447746
89.14710743801652 50.21834182739258 0.029999999329447746
90.14876033057851 50.21834182739258 0.029999999329447746
91.15041322314049 50.21834182739258 0.029999999329447746
92.15206611570247 50.21834182739258 0.029999999329447746
93.15371900826446 50.21834182739258 0.029999999329447746
94.15537190082644 50.21834182739258 0.029999999329447746
95.15702479338843 50.21834182739258 0.029999999329447746
96.15867768595041 50.21834182739258 0.029999999329447746
97.16033057851239 50.21834182739258 0.029999999329447746
98.16198347107438 50.21834182739258 0.029999999329447746
99.16363636363636 50.21834182739258 0.029999999329447746
100.16528925619835 50.21834182739258 0.029999999329447746
101.16694214876033 50.21834182739258 0.029999999329447746
102.1685950413223 50.21834182739258 0.029999999329447746
103.1702479338843 50.21834182739258 0.029999999329447746
104.17190082644628 50.21834182739258 0.029999999329447746
105.17355371900825 50.21834182739258 0.029999999329447746
106.17520661157025 50.21834182739258 0.029999999329447746
107.17685950413222 50.21834182739258 0.029999999329447746
108.1785123966942 50.21834182739258 0.029999999329447746
109.1801652892562 50.21834182739258 0.029999999329447746
110.18181818181817 50.21834182739258 0.029999999329447746
111.18347107438017 50.21834182739258 0.029999999329447746
112.18512396694214 50.21834182739258 0.029999999329447746
113.18677685950412 50.21834182739258 0.029999999329447746
114.18842975206611 50.21834182739258 0.029999999329447746
115.19008264462809 50.21834182739258 0.029999999329447746
116.19173553719008 50.21834182739258 0.029999999329447746
117.19338842975206 50.21834182739258 0.029999999329447746
118.19504132231404 50.21834182739258 0.029999999329447746
119.19669421487603 50.21834182739258 0.029999999329447746
120.19834710743801 50.21834182739258 0.029999999329447746
121.19999999999999 50.21834182739258 0.029999999329447746
122.20165289256198 50.21834182739258 0.029999999329447746
123.20330578512396 50.21834182739258 0.029999999329447746
124.20495867768594 50.21834182739258 0.029999999329447746
125.20661157024793 50.21834182739258 0.029999999329447746
126.20826446280991 50.21834182739258 0.029999999329447746
127.2099173553719 50.21834182739258 0.029999999329447746
128.21157024793388 50.21834182739258 0.029999999329447746
129.21322314049587 50.21834182739258 0.029999999329447746
130.21487603305783 50.21834182739258 0.029999999329447746
131.21652892561983 50.21834182739258 0.029999999329447746
132.21818181818182 50.21834182739258 0.029999999329447746
133.21983471074378 50.21834182739258 0.029999999329447746
134.22148760330577 50.21834182739258 0.029999999329447746
135.22314049586777 50.21834182739258 0.029999999329447746
136.22479338842976 50.21834182739258 0.029999999329447746
137.22644628099172 50.21834182739258 0.029999999329447746
138.22809917355372 50.21834182739258 0.029999999329447746
139.2297520661157 50.21834182739258 0.029999999329447746
140.23140495867767 50.21834182739258 0.029999999329447746
141.23305785123966 50.21834182739258 0.029999999329447746
142.23471074380166 50.21834182739258 0.029999999329447746
143.23636363636362 50.21834182739258 0.029999999329447746
144.2380165289256 50.21834182739258 0.029999999329447746
145.2396694214876 50.21834182739258 0.029999999329447746
146.24132231404957 50.21834182739258 0.029999999329447746
147.24297520661156 90.82969665527344 0.05000000074505806
148.24462809917355 90.82969665527344 0.05000000074505806
149.24628099173552 90.82969665527344 0.05000000074505806
150.2479338842975 90.82969665527344 0.05000000074505806
151.2495867768595 90.82969665527344 0.03999999910593033
152.25123966942147 90.82969665527344 0.03999999910593033
153.25289256198346 90.82969665527344 0.05000000074505806
154.25454545454545 90.82969665527344 0.05000000074505806
155.25619834710744 90.82969665527344 0.029999999329447746
156.2578512396694 90.82969665527344 0.05000000074505806
157.2595041322314 90.82969665527344 0.05000000074505806
158.2611570247934 90.82969665527344 0.03999999910593033
159.26280991735536 90.82969665527344 0.05000000074505806
160.26446280991735 90.82969665527344 0.05000000074505806
161.26611570247934 90.82969665527344 0.03999999910593033
162.2677685950413 90.82969665527344 0.03999999910593033
163.2694214876033 90.82969665527344 0.05000000074505806
164.2710743801653 90.82969665527344 0.05000000074505806
165.27272727272725 90.82969665527344 0.03999999910593033
166.27438016528924 90.82969665527344 0.03999999910593033
167.27603305785124 90.82969665527344 0.03999999910593033
168.27768595041323 90.82969665527344 0.03999999910593033
169.2793388429752 90.82969665527344 0.03999999910593033
170.28099173553719 90.82969665527344 0.03999999910593033
171.28264462809918 90.82969665527344 0.03999999910593033
172.28429752066114 90.82969665527344 0.03999999910593033
173.28595041322313 90.82969665527344 0.03999999910593033
174.28760330578513 90.82969665527344 0.03999999910593033
175.2892561983471 90.82969665527344 0.03999999910593033
176.29090909090908 90.82969665527344 0.03999999910593033
177.29256198347107 90.82969665527344 0.03999999910593033
178.29421487603304 90.82969665527344 0.03999999910593033
179.29586776859503 90.82969665527344 0.03999999910593033
180.29752066115702 90.82969665527344 0.03999999910593033
181.299173553719 90.82969665527344 0.03999999910593033
182.30082644628098 90.82969665527344 0.03999999910593033
183.30247933884297 90.82969665527344 0.03999999910593033
184.30413223140494 90.82969665527344 0.03999999910593033
185.30578512396693 90.82969665527344 0.03999999910593033
186.30743801652892 90.82969665527344 0.03999999910593033
187.3090909090909 90.82969665527344 0.03999999910593033
188.31074380165288 90.82969665527344 0.03999999910593033
189.31239669421487 90.82969665527344 0.03999999910593033
190.31404958677686 90.82969665527344 0.03999999910593033
191.31570247933882 90.82969665527344 0.03999999910593033
192.31735537190082 90.82969665527344 0.03999999910593033
193.3190082644628 90.82969665527344 0.03999999910593033
194.32066115702477 90.82969665527344 0.03999999910593033
195.32231404958677 90.82969665527344 0.03999999910593033
196.32396694214876 90.82969665527344 0.03999999910593033
197.32561983471072 90.82969665527344 0.03999999910593033
198.3272727272727 90.82969665527344 0.03999999910593033
199.3289256198347 90.82969665527344 0.03999999910593033
200.3305785123967 90.82969665527344 0.03999999910593033
201.33223140495866 90.82969665527344 0.03999999910593033
202.33388429752065 90.82969665527344 0.03999999910593033
203.33553719008265 90.82969665527344 0.03999999910593033
204.3371900826446 90.82969665527344 0.03999999910593033
205.3388429752066 90.82969665527344 0.03999999910593033
206.3404958677686 90.82969665527344 0.03999999910593033
207.34214876033056 90.82969665527344 0.03999999910593033
208.34380165289255 90.82969665527344 0.03999999910593033
209.34545454545454 90.82969665527344 0.03999999910593033
210.3471074380165 90.82969665527344 0.03999999910593033
211.3487603305785 90.82969665527344 0.03999999910593033
212.3504132231405 90.82969665527344 0.03999999910593033
213.35206611570246 90.82969665527344 0.03999999910593033
214.35371900826445 90.82969665527344 0.03999999910593033
215.35537190082644 90.82969665527344 0.03999999910593033
216.3570247933884 90.82969665527344 0.03999999910593033
217.3586776859504 90.82969665527344 0.03999999910593033
218.3603305785124 90.82969665527344 0.03999999910593033
219.36198347107438 90.82969665527344 0.03999999910593033
220.36363636363635 90.82969665527344 0.03999999910593033
221.36528925619834 90.82969665527344 0.03999999910593033
222.36694214876033 90.82969665527344 0.03999999910593033
223.3685950413223 90.82969665527344 0.03999999910593033
224.3702479338843 90.82969665527344 0.03999999910593033
225.37190082644628 90.82969665527344 0.03999999910593033
226.37355371900824 90.82969665527344 0.03999999910593033
227.37520661157023 90.82969665527344 0.03999999910593033
228.37685950413223 90.82969665527344 0.03999999910593033
229.3785123966942 90.82969665527344 0.03999999910593033
230.38016528925618 90.82969665527344 0.03999999910593033
231.38181818181818 90.82969665527344 0.03999999910593033
232.38347107438017 90.82969665527344 0.03999999910593033
233.38512396694213 90.82969665527344 0.03999999910593033
234.38677685950412 90.82969665527344 0.03999999910593033
235.38842975206612 90.82969665527344 0.03999999910593033
236.39008264462808 90.82969665527344 0.03999999910593033
237.39173553719007 90.82969665527344 0.03999999910593033
238.39338842975206 90.82969665527344 0.03999999910593033
239.39504132231403 90.82969665527344 0.03999999910593033
240.39669421487602 90.82969665527344 0.03999999910593033
241.398347107438 90.82969665527344 0.03999999910593033
242.39999999999998 90.82969665527344 0.03999999910593033
243.40165289256197 90.82969665527344 0.03999999910593033
244.40330578512396 90.82969665527344 0.03999999910593033
245.40495867768593 90.82969665527344 0.03999999910593033
246.40661157024792 90.82969665527344 0.03999999910593033
247.4082644628099 90.82969665527344 0.03999999910593033
248.40991735537187 90.82969665527344 0.03999999910593033
249.41157024793387 90.82969665527344 0.03999999910593033
250.41322314049586 90.82969665527344 0.03999999910593033
251.41487603305785 90.82969665527344 0.03999999910593033
252.41652892561982 90.82969665527344 0.05000000074505806
253.4181818181818 90.82969665527344 0.05000000074505806
254.4198347107438 90.82969665527344 0.03999999910593033
255.42148760330576 90.82969665527344 0.03999999910593033
256.42314049586776 90.82969665527344 0.05000000074505806
257.42479338842975 90.82969665527344 0.03999999910593033
258.42644628099174 90.82969665527344 0.03999999910593033
259.42809917355373 90.82969665527344 0.05000000074505806
260.42975206611567 90.82969665527344 0.05000000074505806
261.43140495867766 90.82969665527344 0.03999999910593033
262.43305785123965 90.82969665527344 0.05000000074505806
263.43471074380165 90.82969665527344 0.05000000074505806
264.43636363636364 90.82969665527344 0.05000000074505806
265.43801652892563 90.82969665527344 0.03999999910593033
266.43966942148757 90.82969665527344 0.03999999910593033
267.44132231404956 90.82969665527344 0.05000000074505806
268.44297520661155 90.82969665527344 0.05000000074505806
269.44462809917354 90.82969665527344 0.03999999910593033
270.44628099173553 90.82969665527344 0.03999999910593033
271.4479338842975 90.82969665527344 0.03999999910593033
272.4495867768595 90.82969665527344 0.03999999910593033
273.45123966942145 90.82969665527344 0.03999999910593033
274.45289256198345 90.82969665527344 0.05000000074505806
275.45454545454544 90.82969665527344 0.05000000074505806
276.45619834710743 90.82969665527344 0.03999999910593033
277.4578512396694 90.82969665527344 0.05000000074505806
278.4595041322314 90.82969665527344 0.05000000074505806
279.46115702479335 90.82969665527344 0.05000000074505806
280.46280991735534 90.82969665527344 0.03999999910593033
281.46446280991734 90.82969665527344 0.05000000074505806
282.4661157024793 90.82969665527344 0.03999999910593033
283.4677685950413 90.82969665527344 0.03999999910593033
284.4694214876033 90.82969665527344 0.05000000074505806
285.47107438016525 90.82969665527344 0.05000000074505806
286.47272727272724 90.82969665527344 0.05000000074505806
287.47438016528923 90.82969665527344 0.05000000074505806
288.4760330578512 90.82969665527344 0.05000000074505806
289.4776859504132 90.82969665527344 0.05000000074505806
290.4793388429752 90.82969665527344 0.03999999910593033
291.4809917355372 90.82969665527344 0.03999999910593033
292.48264462809914 90.82969665527344 0.03999999910593033
293.48429752066113 90.82969665527344 0.03999999910593033
294.4859504132231 90.82969665527344 0.05000000074505806
295.4876033057851 90.82969665527344 0.05000000074505806
296.4892561983471 90.82969665527344 0.03999999910593033
297.4909090909091 90.82969665527344 0.05000000074505806
298.49256198347103 90.82969665527344 0.05000000074505806
299.494214876033 90.82969665527344 0.03999999910593033
300.495867768595 90.82969665527344 0.05000000074505806
301.497520661157 90.82969665527344 0.05000000074505806
302.499173553719 90.82969665527344 0.03999999910593033
303.500826446281 90.82969665527344 0.03999999910593033
304.50247933884293 90.82969665527344 0.05000000074505806
305.5041322314049 90.82969665527344 0.05000000074505806
306.5057851239669 90.82969665527344 0.05000000074505806
307.5074380165289 90.82969665527344 0.05000000074505806
308.5090909090909 90.82969665527344 0.03999999910593033
309.5107438016529 90.82969665527344 0.05000000074505806
310.5123966942149 90.82969665527344 0.05000000074505806
311.5140495867768 90.82969665527344 0.03999999910593033
312.5157024793388 90.82969665527344 0.03999999910593033
313.5173553719008 90.82969665527344 0.03999999910593033
314.5190082644628 90.82969665527344 0.03999999910593033
315.5206611570248 90.82969665527344 0.03999999910593033
316.5223140495868 90.82969665527344 0.03999999910593033
317.5239669421487 90.82969665527344 0.03999999910593033
318.5256198347107 90.82969665527344 0.03999999910593033
319.5272727272727 90.82969665527344 0.03999999910593033
320.5289256198347 90.82969665527344 0.03999999910593033
321.5305785123967 90.82969665527344 0.03999999910593033
322.5322314049587 90.82969665527344 0.03999999910593033
323.5338842975207 90.82969665527344 0.03999999910593033
324.5355371900826 90.82969665527344 0.03999999910593033
325.5371900826446 90.82969665527344 0.03999999910593033
326.5388429752066 90.82969665527344 0.03999999910593033
327.5404958677686 90.82969665527344 0.03999999910593033
328.5421487603306 90.82969665527344 0.03999999910593033
329.54380165289257 90.82969665527344 0.03999999910593033
330.5454545454545 90.82969665527344 0.03999999910593033
331.5471074380165 90.82969665527344 0.03999999910593033
332.5487603305785 90.82969665527344 0.03999999910593033
333.5504132231405 90.82969665527344 0.03999999910593033
334.5520661157025 90.82969665527344 0.03999999910593033
335.55371900826447 90.82969665527344 0.03999999910593033
336.55537190082646 90.82969665527344 0.03999999910593033
337.5570247933884 90.82969665527344 0.03999999910593033
338.5586776859504 90.82969665527344 0.03999999910593033
339.5603305785124 90.82969665527344 0.03999999910593033
340.56198347107437 90.82969665527344 0.03999999910593033
341.56363636363636 90.82969665527344 0.03999999910593033
342.56528925619835 90.82969665527344 0.03999999910593033
343.5669421487603 90.82969665527344 0.03999999910593033
344.5685950413223 90.82969665527344 0.03999999910593033
345.5702479338843 90.82969665527344 0.03999999910593033
346.57190082644627 90.82969665527344 0.03999999910593033
347.57355371900826 90.82969665527344 0.03999999910593033
348.57520661157025 90.82969665527344 0.03999999910593033
349.5768595041322 90.82969665527344 0.03999999910593033
350.5785123966942 90.82969665527344 0.03999999910593033
351.5801652892562 90.82969665527344 0.03999999910593033
352.58181818181816 90.82969665527344 0.03999999910593033
353.58347107438016 90.82969665527344 0.03999999910593033
354.58512396694215 90.82969665527344 0.03999999910593033
355.58677685950414 90.82969665527344 0.03999999910593033
356.5884297520661 90.82969665527344 0.03999999910593033
357.59008264462807 90.82969665527344 0.03999999910593033
358.59173553719006 90.82969665527344 0.03999999910593033
359.59338842975205 90.82969665527344 0.03999999910593033
360.59504132231405 90.82969665527344 0.03999999910593033
361.59669421487604 90.82969665527344 0.03999999910593033
362.598347107438 90.82969665527344 0.03999999910593033
363.59999999999997 90.82969665527344 0.03999999910593033
364.60165289256196 90.82969665527344 0.03999999910593033
365.60330578512395 90.82969665527344 0.03999999910593033
366.60495867768594 90.82969665527344 0.03999999910593033
367.60661157024794 90.82969665527344 0.03999999910593033
368.60826446280987 90.82969665527344 0.03999999910593033
369.60991735537186 90.82969665527344 0.03999999910593033
370.61157024793386 90.82969665527344 0.03999999910593033
371.61322314049585 90.82969665527344 0.03999999910593033
372.61487603305784 90.82969665527344 0.03999999910593033
373.61652892561983 90.82969665527344 0.03999999910593033
374.6181818181818 90.82969665527344 0.03999999910593033
375.61983471074376 90.82969665527344 0.03999999910593033
376.62148760330575 90.82969665527344 0.03999999910593033
377.62314049586774 90.82969665527344 0.03999999910593033
378.62479338842974 90.82969665527344 0.03999999910593033
379.62644628099173 90.82969665527344 0.03999999910593033
380.6280991735537 90.82969665527344 0.03999999910593033
381.62975206611566 90.82969665527344 0.03999999910593033
382.63140495867765 90.82969665527344 0.03999999910593033
383.63305785123964 90.82969665527344 0.03999999910593033
384.63471074380163 90.82969665527344 0.03999999910593033
385.6363636363636 90.82969665527344 0.03999999910593033
386.6380165289256 90.82969665527344 0.03999999910593033
387.6396694214876 90.82969665527344 0.03999999910593033
388.64132231404955 90.82969665527344 0.03999999910593033
389.64297520661154 90.82969665527344 0.05000000074505806
390.64462809917353 90.82969665527344 0.03999999910593033
391.6462809917355 90.82969665527344 0.03999999910593033
392.6479338842975 90.82969665527344 0.05000000074505806
393.6495867768595 90.82969665527344 0.03999999910593033
394.65123966942144 90.82969665527344 0.03999999910593033
395.65289256198344 90.82969665527344 0.03999999910593033
396.6545454545454 90.82969665527344 0.03999999910593033
397.6561983471074 90.82969665527344 0.03999999910593033
398.6578512396694 90.82969665527344 0.03999999910593033
399.6595041322314 90.82969665527344 0.03999999910593033
400.6611570247934 90.82969665527344 0.05000000074505806
401.66280991735533 90.82969665527344 0.05000000074505806
402.6644628099173 90.82969665527344 0.05000000074505806
403.6661157024793 90.82969665527344 0.05000000074505806
404.6677685950413 90.82969665527344 0.05000000074505806
405.6694214876033 90.82969665527344 0.03999999910593033
406.6710743801653 90.82969665527344 0.03999999910593033
407.67272727272723 90.82969665527344 0.03999999910593033
408.6743801652892 90.82969665527344 0.03999999910593033
409.6760330578512 90.82969665527344 0.03999999910593033
410.6776859504132 90.82969665527344 0.03999999910593033
411.6793388429752 90.82969665527344 0.03999999910593033
412.6809917355372 90.82969665527344 0.03999999910593033
413.6826446280991 90.82969665527344 0.03999999910593033
414.6842975206611 90.82969665527344 0.03999999910593033
415.6859504132231 90.82969665527344 0.03999999910593033
416.6876033057851 90.82969665527344 0.03999999910593033
417.6892561983471 90.82969665527344 0.03999999910593033
418.6909090909091 90.82969665527344 0.03999999910593033
419.6925619834711 90.82969665527344 0.03999999910593033
420.694214876033 90.82969665527344 0.03999999910593033
421.695867768595 90.82969665527344 0.03999999910593033
422.697520661157 90.82969665527344 0.03999999910593033
423.699173553719 90.82969665527344 0.03999999910593033
424.700826446281 90.82969665527344 0.03999999910593033
425.702479338843 90.82969665527344 0.03999999910593033
426.7041322314049 90.82969665527344 0.03999999910593033
427.7057851239669 90.82969665527344 0.03999999910593033
428.7074380165289 90.82969665527344 0.03999999910593033
429.7090909090909 90.82969665527344 0.03999999910593033
430.7107438016529 90.82969665527344 0.03999999910593033
431.7123966942149 90.82969665527344 0.03999999910593033
432.7140495867768 90.82969665527344 0.03999999910593033
433.7157024793388 90.82969665527344 0.03999999910593033
434.7173553719008 90.82969665527344 0.03999999910593033
435.7190082644628 90.82969665527344 0.03999999910593033
436.7206611570248 90.82969665527344 0.03999999910593033
437.72231404958677 90.82969665527344 0.03999999910593033
438.72396694214876 90.82969665527344 0.03999999910593033
439.7256198347107 90.82969665527344 0.03999999910593033
440.7272727272727 90.82969665527344 0.03999999910593033
441.7289256198347 90.82969665527344 0.03999999910593033
442.7305785123967 90.82969665527344 0.03999999910593033
443.73223140495867 90.82969665527344 0.03999999910593033
444.73388429752066 90.82969665527344 0.03999999910593033
445.7355371900826 90.82969665527344 0.03999999910593033
446.7371900826446 90.82969665527344 0.03999999910593033
447.7388429752066 90.82969665527344 0.03999999910593033
448.7404958677686 90.82969665527344 0.03999999910593033
449.74214876033056 90.82969665527344 0.03999999910593033
450.74380165289256 90.82969665527344 0.03999999910593033
451.74545454545455 90.82969665527344 0.03999999910593033
452.7471074380165 90.82969665527344 0.03999999910593033
453.7487603305785 90.82969665527344 0.03999999910593033
454.75041322314047 90.82969665527344 0.03999999910593033
455.75206611570246 90.82969665527344 0.03999999910593033
456.75371900826445 90.82969665527344 0.03999999910593033
457.75537190082645 90.82969665527344 0.03999999910593033
458.7570247933884 90.82969665527344 0.03999999910593033
459.7586776859504 90.82969665527344 0.03999999910593033
460.76033057851237 90.82969665527344 0.03999999910593033
461.76198347107436 90.82969665527344 0.03999999910593033
462.76363636363635 90.82969665527344 0.03999999910593033
463.76528925619834 90.82969665527344 0.03999999910593033
464.76694214876034 90.82969665527344 0.03999999910593033
465.76859504132227 90.82969665527344 0.03999999910593033
466.77024793388426 90.82969665527344 0.03999999910593033
467.77190082644626 90.82969665527344 0.03999999910593033
468.77355371900825 90.82969665527344 0.03999999910593033
469.77520661157024 90.82969665527344 0.03999999910593033
470.77685950413223 90.82969665527344 0.03999999910593033
471.77851239669417 90.82969665527344 0.03999999910593033
472.78016528925616 90.82969665527344 0.03999999910593033
473.78181818181815 90.82969665527344 0.03999999910593033
474.78347107438015 90.82969665527344 0.03999999910593033
475.78512396694214 90.82969665527344 0.03999999910593033
476.78677685950413 90.82969665527344 0.03999999910593033
477.78842975206607 90.82969665527344 0.03999999910593033
478.79008264462806 90.82969665527344 0.03999999910593033
479.79173553719005 90.82969665527344 0.03999999910593033
480.79338842975204 90.82969665527344 0.03999999910593033
481.79504132231403 90.82969665527344 0.03999999910593033
482.796694214876 90.82969665527344 0.03999999910593033
483.798347107438 90.82969665527344 0.03999999910593033
484.79999999999995 90.82969665527344 0.03999999910593033
485.80165289256195 90.82969665527344 0.05000000074505806
486.80330578512394 90.82969665527344 0.05000000074505806
487.80495867768593 90.82969665527344 0.05000000074505806
488.8066115702479 90.82969665527344 0.03999999910593033
489.8082644628099 90.82969665527344 0.05000000074505806
490.80991735537185 90.82969665527344 0.05000000074505806
491.81157024793384 90.82969665527344 0.03999999910593033
492.81322314049584 90.82969665527344 0.05000000074505806
493.8148760330578 90.82969665527344 0.03999999910593033
494.8165289256198 90.82969665527344 0.03999999910593033
495.8181818181818 90.82969665527344 0.05000000074505806
496.81983471074375 90.82969665527344 0.03999999910593033
497.82148760330574 90.82969665527344 0.03999999910593033
498.82314049586773 90.82969665527344 0.03999999910593033
499.8247933884297 90.82969665527344 0.05000000074505806
500.8264462809917 90.82969665527344 0.05000000074505806
501.8280991735537 90.82969665527344 0.03999999910593033
502.8297520661157 90.82969665527344 0.05999999865889549
503.83140495867764 90.82969665527344 0.05999999865889549
504.83305785123963 90.82969665527344 0.03999999910593033
505.8347107438016 90.82969665527344 0.03999999910593033
506.8363636363636 90.82969665527344 0.05999999865889549
507.8380165289256 90.82969665527344 0.05999999865889549
508.8396694214876 90.82969665527344 0.03999999910593033
509.84132231404953 90.82969665527344 0.05000000074505806
510.8429752066115 90.82969665527344 0.03999999910593033
511.8446280991735 90.82969665527344 0.03999999910593033
512.8462809917355 90.82969665527344 0.05000000074505806
513.8479338842975 90.82969665527344 0.03999999910593033
514.8495867768595 90.82969665527344 0.03999999910593033
515.8512396694215 90.82969665527344 0.05000000074505806
516.8528925619835 90.82969665527344 0.05000000074505806
517.8545454545455 90.82969665527344 0.05000000074505806
518.8561983471075 90.82969665527344 0.05000000074505806
519.8578512396693 90.82969665527344 0.05000000074505806
520.8595041322313 90.82969665527344 0.05000000074505806
521.8611570247933 90.82969665527344 0.03999999910593033
522.8628099173553 90.82969665527344 0.05000000074505806
523.8644628099173 90.82969665527344 0.03999999910593033
524.8661157024793 90.82969665527344 0.03999999910593033
525.8677685950413 90.82969665527344 0.05000000074505806
526.8694214876033 90.82969665527344 0.05000000074505806
527.8710743801653 90.82969665527344 0.05000000074505806
528.8727272727273 90.82969665527344 0.05000000074505806
529.8743801652893 90.82969665527344 0.05000000074505806
530.8760330578513 90.82969665527344 0.03999999910593033
531.8776859504133 90.82969665527344 0.05000000074505806
532.8793388429751 90.82969665527344 0.05000000074505806
533.8809917355371 90.82969665527344 0.029999999329447746
534.8826446280991 90.82969665527344 0.029999999329447746
535.8842975206611 90.82969665527344 0.03999999910593033
536.8859504132231 90.82969665527344 0.03999999910593033
537.8876033057851 90.82969665527344 0.05000000074505806
538.8892561983471 90.82969665527344 0.05000000074505806
539.8909090909091 90.82969665527344 0.03999999910593033
540.8925619834711 90.82969665527344 0.05000000074505806
541.8942148760331 90.82969665527344 0.05000000074505806
542.895867768595 90.82969665527344 0.03999999910593033
543.897520661157 90.82969665527344 0.03999999910593033
544.899173553719 90.82969665527344 0.05000000074505806
545.9008264462809 90.82969665527344 0.03999999910593033
546.9024793388429 90.82969665527344 0.03999999910593033
547.9041322314049 90.82969665527344 0.05000000074505806
548.9057851239669 90.82969665527344 0.05999999865889549
549.9074380165289 90.82969665527344 0.03999999910593033
550.9090909090909 90.82969665527344 0.03999999910593033
551.9107438016529 90.82969665527344 0.05000000074505806
552.9123966942149 90.82969665527344 0.05000000074505806
553.9140495867769 90.82969665527344 0.03999999910593033
554.9157024793388 90.82969665527344 0.03999999910593033
555.9173553719008 90.82969665527344 0.03999999910593033
556.9190082644628 90.82969665527344 0.03999999910593033
557.9206611570247 90.82969665527344 0.03999999910593033
558.9223140495867 90.82969665527344 0.05000000074505806
559.9239669421487 90.82969665527344 0.05000000074505806
560.9256198347107 90.82969665527344 0.05000000074505806
561.9272727272727 90.82969665527344 0.03999999910593033
562.9289256198347 90.82969665527344 0.03999999910593033
563.9305785123967 90.82969665527344 0.03999999910593033
564.9322314049587 90.82969665527344 0.03999999910593033
565.9338842975206 90.82969665527344 0.029999999329447746
566.9355371900826 90.82969665527344 0.029999999329447746
567.9371900826446 90.82969665527344 0.029999999329447746
568.9388429752066 90.82969665527344 0.029999999329447746
569.9404958677686 90.82969665527344 0.029999999329447746
570.9421487603305 90.82969665527344 0.029999999329447746
571.9438016528925 90.82969665527344 0.029999999329447746
572.9454545454545 90.82969665527344 0.029999999329447746
573.9471074380165 90.82969665527344 0.029999999329447746
574.9487603305785 90.82969665527344 0.029999999329447746
575.9504132231405 90.82969665527344 0.029999999329447746
576.9520661157025 90.82969665527344 0.029999999329447746
577.9537190082644 90.82969665527344 0.029999999329447746
578.9553719008264 90.82969665527344 0.029999999329447746
579.9570247933884 90.82969665527344 0.029999999329447746
580.9586776859504 90.82969665527344 0.029999999329447746
581.9603305785124 90.82969665527344 0.029999999329447746
582.9619834710744 90.82969665527344 0.029999999329447746
583.9636363636363 90.82969665527344 0.029999999329447746
584.9652892561983 90.82969665527344 0.029999999329447746
585.9669421487603 90.82969665527344 0.029999999329447746
586.9685950413223 90.82969665527344 0.029999999329447746
587.9702479338843 90.82969665527344 0.029999999329447746
588.9719008264462 90.82969665527344 0.029999999329447746
589.9735537190082 90.82969665527344 0.029999999329447746
590.9752066115702 90.82969665527344 0.029999999329447746
591.9768595041322 90.82969665527344 0.029999999329447746
592.9785123966942 90.82969665527344 0.029999999329447746
593.9801652892562 90.82969665527344 0.029999999329447746
594.9818181818182 90.82969665527344 0.029999999329447746
595.9834710743802 90.82969665527344 0.029999999329447746
596.9851239669421 90.82969665527344 0.029999999329447746
597.9867768595041 90.82969665527344 0.029999999329447746
598.988429752066 90.82969665527344 0.029999999329447746
599.990082644628 90.82969665527344 0.029999999329447746
600.99173553719 90.82969665527344 0.029999999329447746
601.993388429752 90.82969665527344 0.029999999329447746
602.995041322314 90.82969665527344 0.029999999329447746
603.996694214876 90.82969665527344 0.029999999329447746
604.998347107438 90.82969665527344 0.029999999329447746
606.0 90.82969665527344 0.029999999329447746
