// Time Position Current
0.0 0.8733651041984558 0.0
1.0089285714285714 3.0567712783813477 0.019999999552965164
2.017857142857143 3.493452310562134 0.0
3.0267857142857144 4.366814613342285 0.009999999776482582
4.035714285714286 6.113539695739746 0.009999999776482582
5.044642857142857 6.113539695739746 0.009999999776482582
6.053571428571429 7.860264301300049 0.009999999776482582
7.0625 7.860264301300049 0.009999999776482582
8.071428571428571 9.170308113098145 0.0
9.080357142857142 10.043670654296875 0.009999999776482582
10.089285714285714 10.043670654296875 0.009999999776482582
11.098214285714285 10.917033195495605 0.019999999552965164
12.107142857142858 11.790395736694336 0.009999999776482582
13.116071428571429 13.100439071655273 0.009999999776482582
14.125 13.100439071655273 0.009999999776482582
15.133928571428571 14.847164154052734 0.019999999552965164
16.142857142857142 14.847164154052734 0.019999999552965164
17.151785714285715 15.720526695251465 0.009999999776482582
18.160714285714285 15.720526695251465 0.009999999776482582
19.169642857142858 17.030569076538086 0.009999999776482582
20.178571428571427 17.903932571411133 0.0
21.1875 18.777294158935547 0.009999999776482582
22.19642857142857 20.524019241333008 0.009999999776482582
23.205357142857142 20.524019241333008 0.009999999776482582
24.214285714285715 21.834062576293945 0.0
25.223214285714285 21.834062576293945 0.0
26.232142857142858 22.707426071166992 0.009999999776482582
27.241071428571427 22.707426071166992 0.009999999776482582
28.25 24.454151153564453 0.009999999776482582
29.25892857142857 25.76419448852539 0.019999999552965164
30.267857142857142 25.76419448852539 0.019999999552965164
31.27678571428571 27.51091957092285 0.009999999776482582
32.285714285714285 27.51091957092285 0.009999999776482582
33.294642857142854 28.82096290588379 0.0
34.30357142857143 28.82096290588379 0.0
35.3125 30.56768798828125 0.009999999776482582
36.32142857142857 30.56768798828125 0.009999999776482582
37.33035714285714 31.441049575805664 0.0
38.339285714285715 31.441049575805664 0.0
39.348214285714285 32.751094818115234 0.019999999552965164
40.357142857142854 33.624454498291016 0.0
41.36607142857143 34.49781799316406 0.019999999552965164
42.375 36.244544982910156 0.009999999776482582
43.38392857142857 41.9213981628418 0.09000000357627869
44.39285714285714 41.9213981628418 0.09000000357627869
45.401785714285715 42.35808181762695 0.10999999940395355
46.410714285714285 42.35808181762695 0.10999999940395355
47.419642857142854 42.794761657714844 0.14000000059604645
48.42857142857143 42.794761657714844 0.14000000059604645
49.4375 43.231441497802734 0.10999999940395355
50.44642857142857 43.66812515258789 0.1899999976158142
51.45535714285714 43.66812515258789 0.1899999976158142
52.464285714285715 44.10480499267578 0.1899999976158142
53.473214285714285 44.54148483276367 0.20000000298023224
54.482142857142854 45.41484832763672 0.20999999344348907
55.49107142857142 45.41484832763672 0.20999999344348907
56.5 46.288211822509766 0.2199999988079071
57.50892857142857 46.288211822509766 0.2199999988079071
58.51785714285714 46.724891662597656 0.25
59.526785714285715 46.724891662597656 0.25
60.535714285714285 47.5982551574707 0.25999999046325684
61.544642857142854 47.5982551574707 0.25999999046325684
62.55357142857142 47.5982551574707 0.2800000011920929
63.5625 48.47161865234375 0.3199999928474426
64.57142857142857 48.47161865234375 0.3199999928474426
65.58035714285714 48.90829849243164 0.3400000035762787
66.58928571428571 49.34497833251953 0.3400000035762787
67.59821428571428 49.78166198730469 0.3700000047683716
68.60714285714286 50.21834182739258 0.38999998569488525
69.61607142857143 50.21834182739258 0.38999998569488525
70.625 50.65502166748047 0.019999999552965164
71.63392857142857 50.65502166748047 0.019999999552965164
72.64285714285714 50.65502166748047 0.05999999865889549
73.65178571428571 50.65502166748047 0.07999999821186066
74.66071428571428 50.65502166748047 0.07999999821186066
75.66964285714286 50.65502166748047 0.11999999731779099
76.67857142857143 51.091705322265625 0.019999999552965164
77.6875 51.091705322265625 0.019999999552965164
78.69642857142857 51.091705322265625 0.07000000029802322
79.70535714285714 51.091705322265625 0.07000000029802322
80.71428571428571 51.091705322265625 0.10000000149011612
81.72321428571428 51.528385162353516 0.019999999552965164
82.73214285714286 51.528385162353516 0.019999999552965164
83.74107142857143 51.528385162353516 0.029999999329447746
84.75 51.528385162353516 0.05000000074505806
85.75892857142857 51.528385162353516 0.07000000029802322
86.76785714285714 51.528385162353516 0.09000000357627869
87.77678571428571 51.528385162353516 0.10999999940395355
88.78571428571428 51.965065002441406 0.019999999552965164
89.79464285714286 51.965065002441406 0.019999999552965164
90.80357142857143 51.965065002441406 0.05999999865889549
91.8125 51.965065002441406 0.05999999865889549
92.82142857142857 51.965065002441406 0.10000000149011612
93.83035714285714 51.965065002441406 0.10000000149011612
94.83928571428571 52.40174865722656 0.009999999776482582
95.84821428571428 52.40174865722656 0.009999999776482582
96.85714285714286 52.40174865722656 0.029999999329447746
97.86607142857143 52.40174865722656 0.029999999329447746
98.875 52.40174865722656 0.07999999821186066
99.88392857142857 52.40174865722656 0.10000000149011612
100.89285714285714 52.83842849731445 0.009999999776482582
101.90178571428571 52.83842849731445 0.03999999910593033
102.91071428571428 52.83842849731445 0.03999999910593033
103.91964285714285 52.83842849731445 0.09000000357627869
104.92857142857143 52.83842849731445 0.09000000357627869
105.9375 52.83842849731445 0.9800000190734863
106.94642857142857 53.27511215209961 0.019999999552965164
107.95535714285714 53.27511215209961 0.019999999552965164
108.96428571428571 53.27511215209961 0.05999999865889549
109.97321428571428 53.27511215209961 0.07000000029802322
110.98214285714285 53.27511215209961 0.07000000029802322
111.99107142857143 53.7117919921875 1.0
113.0 53.7117919921875 0.03999999910593033
