// Time Position Current
0.0 0.8733651041984558 0.0
1.005050505050505 0.8733651041984558 0.0
2.01010101010101 0.8733651041984558 0.029999999329447746
3.0151515151515147 2.183408737182617 0.009999999776482582
4.02020202020202 2.183408737182617 0.009999999776482582
5.025252525252525 3.0567712783813477 0.009999999776482582
6.030303030303029 3.0567712783813477 0.009999999776482582
7.035353535353535 5.240177154541016 0.019999999552965164
8.04040404040404 5.240177154541016 0.019999999552965164
9.045454545454545 6.550220966339111 0.009999999776482582
10.05050505050505 6.550220966339111 0.009999999776482582
11.055555555555555 8.296945571899414 0.009999999776482582
12.060606060606059 9.170308113098145 0.0
13.065656565656564 10.043670654296875 0.019999999552965164
14.07070707070707 10.917033195495605 0.019999999552965164
15.075757575757574 10.917033195495605 0.019999999552965164
16.08080808080808 11.790395736694336 0.009999999776482582
17.085858585858585 11.790395736694336 0.009999999776482582
18.09090909090909 13.53711986541748 0.0
19.095959595959595 13.53711986541748 0.0
20.1010101010101 14.847164154052734 0.009999999776482582
21.106060606060606 16.157207489013672 0.019999999552965164
22.11111111111111 16.593889236450195 0.019999999552965164
23.116161616161616 17.030569076538086 0.009999999776482582
24.121212121212118 17.903932571411133 0.009999999776482582
25.126262626262623 19.650657653808594 0.019999999552965164
26.131313131313128 19.650657653808594 0.019999999552965164
27.136363636363633 20.96070098876953 0.009999999776482582
28.14141414141414 20.96070098876953 0.009999999776482582
29.146464646464644 21.834062576293945 0.009999999776482582
30.15151515151515 21.834062576293945 0.009999999776482582
31.156565656565654 23.580787658691406 0.0
32.16161616161616 23.580787658691406 0.0
33.166666666666664 24.890830993652344 0.019999999552965164
34.17171717171717 26.637556076049805 0.019999999552965164
35.176767676767675 27.947599411010742 0.019999999552965164
36.18181818181818 27.947599411010742 0.019999999552965164
37.186868686868685 28.82096290588379 0.009999999776482582
38.19191919191919 28.82096290588379 0.009999999776482582
39.196969696969695 31.00436782836914 0.009999999776482582
40.2020202020202 31.00436782836914 0.009999999776482582
41.207070707070706 32.31441116333008 0.019999999552965164
42.21212121212121 32.751094818115234 0.019999999552965164
43.217171717171716 34.06113815307617 0.009999999776482582
44.22222222222222 35.37118148803711 0.009999999776482582
45.22727272727273 36.244544982910156 0.009999999776482582
46.23232323232323 37.11790466308594 0.019999999552965164
47.23737373737374 38.86463165283203 0.009999999776482582
48.242424242424235 39.30131149291992 0.009999999776482582
49.24747474747474 39.30131149291992 0.009999999776482582
50.252525252525245 40.17467498779297 0.029999999329447746
51.25757575757575 40.61135482788086 0.07999999821186066
52.262626262626256 41.484718322753906 0.07999999821186066
53.26767676767676 42.35808181762695 0.10000000149011612
54.272727272727266 42.794761657714844 0.11999999731779099
55.27777777777777 43.231441497802734 0.12999999523162842
56.28282828282828 43.231441497802734 0.12999999523162842
57.28787878787878 44.97816848754883 0.18000000715255737
58.29292929292929 44.97816848754883 0.18000000715255737
59.29797979797979 45.85152816772461 0.20000000298023224
60.3030303030303 46.724891662597656 0.20999999344348907
61.3080808080808 46.724891662597656 0.20999999344348907
62.31313131313131 47.16157531738281 0.23999999463558197
63.31818181818181 47.16157531738281 0.23999999463558197
64.32323232323232 47.5982551574707 0.28999999165534973
65.32828282828282 47.5982551574707 0.28999999165534973
66.33333333333333 48.47161865234375 0.2800000011920929
67.33838383838383 48.90829849243164 0.3199999928474426
68.34343434343434 49.34497833251953 0.3199999928474426
69.34848484848484 49.78166198730469 0.3499999940395355
70.35353535353535 49.78166198730469 0.3499999940395355
71.35858585858585 50.21834182739258 0.3799999952316284
72.36363636363636 50.65502166748047 0.3799999952316284
73.36868686868686 50.65502166748047 0.47999998927116394
74.37373737373737 51.091705322265625 0.4099999964237213
75.37878787878788 51.528385162353516 0.4000000059604645
76.38383838383838 52.40174865722656 0.41999998688697815
77.38888888888889 52.83842849731445 0.4399999976158142
78.39393939393939 52.83842849731445 0.4399999976158142
79.3989898989899 53.27511215209961 0.46000000834465027
80.4040404040404 53.27511215209961 0.46000000834465027
81.4090909090909 53.7117919921875 0.49000000953674316
82.41414141414141 53.7117919921875 0.5
83.41919191919192 53.7117919921875 0.5199999809265137
84.42424242424242 54.14847183227539 0.17000000178813934
85.42929292929293 54.58515548706055 0.03999999910593033
86.43434343434343 54.58515548706055 0.07000000029802322
87.43939393939394 54.58515548706055 0.07000000029802322
88.44444444444444 54.58515548706055 0.09000000357627869
89.44949494949495 54.58515548706055 0.03999999910593033
90.45454545454545 54.58515548706055 0.029999999329447746
91.45959595959596 54.58515548706055 0.05000000074505806
92.46464646464646 54.58515548706055 0.05000000074505806
93.46969696969697 54.58515548706055 0.07000000029802322
94.47474747474747 54.58515548706055 0.07000000029802322
95.47979797979798 54.58515548706055 0.10000000149011612
96.48484848484847 54.58515548706055 0.10000000149011612
97.48989898989898 55.02183532714844 0.03999999910593033
98.49494949494948 55.02183532714844 0.03999999910593033
99.49999999999999 55.02183532714844 0.05999999865889549
100.50505050505049 55.02183532714844 0.10000000149011612
101.510101010101 55.02183532714844 0.10999999940395355
102.5151515151515 55.45851516723633 0.029999999329447746
103.520202020202 55.45851516723633 0.05999999865889549
104.52525252525251 55.45851516723633 0.05999999865889549
105.53030303030302 55.45851516723633 0.10000000149011612
106.53535353535352 55.45851516723633 0.029999999329447746
107.54040404040403 55.45851516723633 0.029999999329447746
108.54545454545453 55.45851516723633 0.05000000074505806
109.55050505050504 55.45851516723633 0.07999999821186066
110.55555555555554 55.45851516723633 0.10000000149011612
111.56060606060605 55.895198822021484 0.019999999552965164
112.56565656565655 55.895198822021484 0.019999999552965164
113.57070707070706 55.895198822021484 0.05999999865889549
114.57575757575756 55.895198822021484 0.05999999865889549
115.58080808080807 55.895198822021484 0.05999999865889549
116.58585858585857 55.895198822021484 0.05999999865889549
117.59090909090908 55.895198822021484 0.10999999940395355
118.59595959595958 55.895198822021484 0.10999999940395355
119.60101010101009 56.331878662109375 0.029999999329447746
120.6060606060606 56.331878662109375 0.05000000074505806
121.6111111111111 56.331878662109375 0.07000000029802322
122.6161616161616 56.331878662109375 0.10000000149011612
123.62121212121211 56.331878662109375 0.10000000149011612
124.62626262626262 56.331878662109375 0.9700000286102295
125.63131313131312 56.331878662109375 0.9700000286102295
126.63636363636363 56.331878662109375 0.05000000074505806
127.64141414141413 56.331878662109375 0.05000000074505806
128.64646464646464 56.331878662109375 0.03999999910593033
129.65151515151513 56.331878662109375 0.03999999910593033
130.65656565656565 56.331878662109375 0.05000000074505806
131.66161616161614 56.331878662109375 0.05000000074505806
132.66666666666666 56.331878662109375 0.05000000074505806
133.67171717171715 56.331878662109375 0.05000000074505806
134.67676767676767 56.331878662109375 0.05000000074505806
135.68181818181816 56.331878662109375 0.03999999910593033
136.68686868686868 56.331878662109375 0.03999999910593033
137.69191919191917 56.331878662109375 0.03999999910593033
138.6969696969697 56.331878662109375 0.05000000074505806
139.70202020202018 56.331878662109375 0.05000000074505806
140.7070707070707 56.331878662109375 0.05000000074505806
141.7121212121212 56.331878662109375 0.05000000074505806
142.7171717171717 56.331878662109375 0.03999999910593033
143.7222222222222 56.331878662109375 0.03999999910593033
144.72727272727272 56.331878662109375 0.05000000074505806
145.7323232323232 56.331878662109375 0.05000000074505806
146.73737373737373 56.331878662109375 0.03999999910593033
147.74242424242422 56.331878662109375 0.03999999910593033
148.74747474747474 56.331878662109375 0.05000000074505806
149.75252525252523 56.331878662109375 0.03999999910593033
150.75757575757575 56.331878662109375 0.03999999910593033
151.76262626262624 56.331878662109375 0.05000000074505806
152.76767676767676 56.331878662109375 0.05000000074505806
153.77272727272725 56.331878662109375 0.05000000074505806
154.77777777777777 56.331878662109375 0.05000000074505806
155.78282828282826 56.331878662109375 0.05000000074505806
156.78787878787878 56.331878662109375 0.03999999910593033
157.79292929292927 56.331878662109375 0.03999999910593033
158.7979797979798 56.331878662109375 0.05000000074505806
159.80303030303028 56.331878662109375 0.05000000074505806
160.8080808080808 56.331878662109375 0.03999999910593033
161.8131313131313 56.331878662109375 0.03999999910593033
162.8181818181818 56.331878662109375 0.03999999910593033
163.8232323232323 56.331878662109375 0.03999999910593033
164.82828282828282 56.331878662109375 0.05000000074505806
165.83333333333331 56.331878662109375 0.05000000074505806
166.83838383838383 56.331878662109375 0.05000000074505806
167.84343434343432 56.331878662109375 0.05000000074505806
168.84848484848484 56.331878662109375 0.03999999910593033
169.85353535353534 56.331878662109375 0.03999999910593033
170.85858585858585 56.331878662109375 0.03999999910593033
171.86363636363635 56.331878662109375 0.05000000074505806
172.86868686868686 56.331878662109375 0.03999999910593033
173.87373737373736 56.331878662109375 0.05000000074505806
174.87878787878788 56.331878662109375 0.03999999910593033
175.88383838383837 56.331878662109375 0.05000000074505806
176.88888888888889 56.331878662109375 0.05000000074505806
177.89393939393938 56.331878662109375 0.05000000074505806
178.8989898989899 56.331878662109375 0.05000000074505806
179.9040404040404 56.331878662109375 0.03999999910593033
180.9090909090909 56.331878662109375 0.03999999910593033
181.9141414141414 56.331878662109375 0.03999999910593033
182.91919191919192 56.331878662109375 0.05000000074505806
183.9242424242424 56.331878662109375 0.05000000074505806
184.92929292929293 56.331878662109375 0.03999999910593033
185.93434343434342 56.331878662109375 0.03999999910593033
186.93939393939394 56.331878662109375 0.03999999910593033
187.94444444444443 56.331878662109375 0.03999999910593033
188.94949494949495 56.331878662109375 0.05000000074505806
189.95454545454544 56.331878662109375 0.05000000074505806
190.95959595959596 56.331878662109375 0.05000000074505806
191.96464646464645 56.331878662109375 0.03999999910593033
192.96969696969694 56.331878662109375 0.05000000074505806
193.97474747474746 56.331878662109375 0.05000000074505806
194.97979797979795 56.331878662109375 0.05000000074505806
195.98484848484847 56.331878662109375 0.03999999910593033
196.98989898989896 56.331878662109375 0.03999999910593033
197.99494949494948 56.331878662109375 0.05000000074505806
199.0 56.331878662109375 0.05000000074505806
