// Time Position Current
0.0 0.8733651041984558 0.0
1.008695652173913 0.8733651041984558 0.0
2.017391304347826 0.8733651041984558 0.019999999552965164
3.026086956521739 2.183408737182617 0.019999999552965164
4.034782608695652 2.6200900077819824 0.009999999776482582
5.0434782608695645 2.6200900077819824 0.009999999776482582
6.052173913043478 4.366814613342285 0.0
7.060869565217391 6.113539695739746 0.0
8.069565217391304 6.113539695739746 0.0
9.078260869565216 7.860264301300049 0.009999999776482582
10.086956521739129 7.860264301300049 0.009999999776482582
11.095652173913043 9.170308113098145 0.009999999776482582
12.104347826086956 10.043670654296875 0.0
13.113043478260868 10.917033195495605 0.009999999776482582
14.121739130434783 12.227076530456543 0.0
15.130434782608695 12.227076530456543 0.0
16.139130434782608 13.100439071655273 0.0
17.14782608695652 13.100439071655273 0.0
18.156521739130433 14.847164154052734 0.019999999552965164
19.165217391304346 14.847164154052734 0.019999999552965164
20.173913043478258 16.157207489013672 0.009999999776482582
21.182608695652174 17.030569076538086 0.009999999776482582
22.191304347826087 17.903932571411133 0.0
23.2 19.650657653808594 0.019999999552965164
24.208695652173912 19.650657653808594 0.019999999552965164
25.217391304347824 20.087337493896484 0.019999999552965164
26.226086956521737 20.087337493896484 0.019999999552965164
27.23478260869565 21.834062576293945 0.009999999776482582
28.243478260869566 21.834062576293945 0.009999999776482582
29.252173913043478 22.707426071166992 0.0
30.26086956521739 24.01746940612793 0.009999999776482582
31.269565217391303 24.890830993652344 0.009999999776482582
32.278260869565216 26.637556076049805 0.0
33.28695652173913 26.637556076049805 0.0
34.29565217391304 27.074237823486328 0.0
35.30434782608695 27.074237823486328 0.0
36.313043478260866 28.82096290588379 0.0
37.32173913043478 28.82096290588379 0.0
38.33043478260869 30.56768798828125 0.009999999776482582
39.339130434782604 30.56768798828125 0.009999999776482582
40.347826086956516 31.877731323242188 0.0
41.356521739130436 33.624454498291016 0.009999999776482582
42.36521739130435 34.49781799316406 0.009999999776482582
43.37391304347826 35.37118148803711 0.019999999552965164
44.38260869565217 36.68122482299805 0.009999999776482582
45.391304347826086 37.554588317871094 0.0
46.4 37.554588317871094 0.0
47.40869565217391 38.86463165283203 0.009999999776482582
48.417391304347824 38.86463165283203 0.009999999776482582
49.426086956521736 39.73799133300781 0.05999999865889549
50.43478260869565 39.73799133300781 0.05999999865889549
51.44347826086956 40.17467498779297 0.07000000029802322
52.452173913043474 41.04803466796875 0.07999999821186066
53.460869565217386 41.484718322753906 0.07999999821186066
54.4695652173913 41.9213981628418 0.10000000149011612
55.47826086956521 41.9213981628418 0.10999999940395355
56.48695652173913 42.35808181762695 0.11999999731779099
57.495652173913044 42.794761657714844 0.14000000059604645
58.504347826086956 43.231441497802734 0.12999999523162842
59.51304347826087 43.231441497802734 0.1599999964237213
60.52173913043478 43.231441497802734 0.1599999964237213
61.530434782608694 44.10480499267578 0.1899999976158142
62.53913043478261 44.10480499267578 0.1899999976158142
63.54782608695652 44.97816848754883 0.20999999344348907
64.55652173913043 44.97816848754883 0.20999999344348907
65.56521739130434 45.85152816772461 0.2199999988079071
66.57391304347826 46.288211822509766 0.23000000417232513
67.58260869565217 46.288211822509766 0.23000000417232513
68.59130434782608 46.724891662597656 0.23999999463558197
69.6 46.724891662597656 0.23999999463558197
70.6086956521739 47.16157531738281 0.2800000011920929
71.61739130434782 47.16157531738281 0.2800000011920929
72.62608695652173 48.034934997558594 0.28999999165534973
73.63478260869564 48.034934997558594 0.28999999165534973
74.64347826086956 48.90829849243164 0.3400000035762787
75.65217391304347 48.90829849243164 0.3400000035762787
76.66086956521738 49.34497833251953 0.33000001311302185
77.6695652173913 49.78166198730469 0.3400000035762787
78.67826086956521 49.78166198730469 0.36000001430511475
79.68695652173912 50.21834182739258 0.3799999952316284
80.69565217391303 51.091705322265625 0.4699999988079071
81.70434782608696 51.091705322265625 0.4699999988079071
82.71304347826087 51.965065002441406 0.41999998688697815
83.72173913043478 51.965065002441406 0.41999998688697815
84.7304347826087 52.40174865722656 0.41999998688697815
85.73913043478261 52.83842849731445 0.4300000071525574
86.74782608695652 53.27511215209961 0.44999998807907104
87.75652173913043 53.7117919921875 0.4699999988079071
88.76521739130435 53.7117919921875 0.4699999988079071
89.77391304347826 53.7117919921875 0.49000000953674316
90.78260869565217 54.14847183227539 0.5199999809265137
91.79130434782608 55.02183532714844 0.5199999809265137
92.8 55.45851516723633 0.5600000023841858
93.80869565217391 55.895198822021484 0.5699999928474426
94.81739130434782 55.895198822021484 0.5799999833106995
95.82608695652173 56.331878662109375 0.6000000238418579
96.83478260869565 56.768558502197266 0.019999999552965164
97.84347826086956 56.768558502197266 0.019999999552965164
98.85217391304347 56.768558502197266 0.05000000074505806
99.86086956521739 56.768558502197266 0.05000000074505806
100.8695652173913 56.768558502197266 0.07999999821186066
101.87826086956521 56.768558502197266 0.07999999821186066
102.88695652173912 56.768558502197266 0.009999999776482582
103.89565217391304 57.20524215698242 0.029999999329447746
104.90434782608695 57.20524215698242 0.03999999910593033
105.91304347826086 57.20524215698242 0.05999999865889549
106.92173913043477 57.20524215698242 0.05999999865889549
107.93043478260869 57.20524215698242 0.10000000149011612
108.9391304347826 57.20524215698242 0.10000000149011612
109.94782608695651 57.20524215698242 0.009999999776482582
110.95652173913042 57.20524215698242 0.029999999329447746
111.96521739130434 57.20524215698242 0.05000000074505806
112.97391304347826 57.20524215698242 0.05999999865889549
113.98260869565217 57.20524215698242 0.09000000357627869
114.99130434782609 57.64192199707031 1.0
116.0 57.64192199707031 0.05000000074505806
