// Time Position Current
0.0 0.8733651041984558 0.0
1.008695652173913 0.8733651041984558 0.0
2.017391304347826 0.8733651041984558 0.029999999329447746
3.026086956521739 0.8733651041984558 0.029999999329447746
4.034782608695652 1.3100463151931763 0.03999999910593033
5.0434782608695645 1.3100463151931763 0.03999999910593033
6.052173913043478 3.0567712783813477 0.019999999552965164
7.060869565217391 3.0567712783813477 0.019999999552965164
8.069565217391304 5.240177154541016 0.009999999776482582
9.078260869565216 6.113539695739746 0.0
10.086956521739129 6.550220966339111 0.0
11.095652173913043 8.296945571899414 0.0
12.104347826086956 8.296945571899414 0.0
13.113043478260868 10.043670654296875 0.019999999552965164
14.121739130434783 10.043670654296875 0.019999999552965164
15.130434782608695 11.353713989257812 0.0
16.139130434782608 13.100439071655273 0.009999999776482582
17.14782608695652 13.100439071655273 0.009999999776482582
18.156521739130433 13.53711986541748 0.009999999776482582
19.165217391304346 15.283844947814941 0.019999999552965164
20.173913043478258 17.030569076538086 0.009999999776482582
21.182608695652174 17.030569076538086 0.009999999776482582
22.191304347826087 18.340614318847656 0.009999999776482582
23.2 19.21397590637207 0.0
24.208695652173912 19.21397590637207 0.0
25.217391304347824 20.96070098876953 0.009999999776482582
26.226086956521737 21.397382736206055 0.009999999776482582
27.23478260869565 22.27074432373047 0.019999999552965164
28.243478260869566 24.01746940612793 0.009999999776482582
29.252173913043478 24.01746940612793 0.009999999776482582
30.26086956521739 25.76419448852539 0.019999999552965164
31.269565217391303 25.76419448852539 0.019999999552965164
32.278260869565216 27.074237823486328 0.009999999776482582
33.28695652173913 28.82096290588379 0.009999999776482582
34.29565217391304 28.82096290588379 0.009999999776482582
35.30434782608695 29.694324493408203 0.019999999552965164
36.313043478260866 30.131006240844727 0.0
37.32173913043478 31.00436782836914 0.019999999552965164
38.33043478260869 32.751094818115234 0.009999999776482582
39.339130434782604 32.751094818115234 0.009999999776482582
40.347826086956516 34.06113815307617 0.0
41.356521739130436 34.06113815307617 0.0
42.36521739130435 35.807861328125 0.009999999776482582
43.37391304347826 35.807861328125 0.009999999776482582
44.38260869565217 37.554588317871094 0.0
45.391304347826086 37.554588317871094 0.0
46.4 38.86463165283203 0.019999999552965164
47.40869565217391 38.86463165283203 0.019999999552965164
48.417391304347824 39.73799133300781 0.029999999329447746
49.426086956521736 39.73799133300781 0.029999999329447746
50.43478260869565 40.17467498779297 0.05999999865889549
51.44347826086956 40.17467498779297 0.05999999865889549
52.452173913043474 41.04803466796875 0.07999999821186066
53.460869565217386 41.04803466796875 0.07999999821186066
54.4695652173913 41.484718322753906 0.09000000357627869
55.47826086956521 41.9213981628418 0.10000000149011612
56.48695652173913 42.35808181762695 0.10999999940395355
57.495652173913044 42.794761657714844 0.15000000596046448
58.504347826086956 43.66812515258789 0.05999999865889549
59.51304347826087 43.66812515258789 0.05999999865889549
60.52173913043478 44.10480499267578 0.10999999940395355
61.530434782608694 44.54148483276367 0.20999999344348907
62.53913043478261 44.54148483276367 0.20999999344348907
63.54782608695652 45.41484832763672 0.20999999344348907
64.55652173913043 45.85152816772461 0.2199999988079071
65.56521739130434 46.288211822509766 0.2199999988079071
66.57391304347826 46.724891662597656 0.2199999988079071
67.58260869565217 46.724891662597656 0.2199999988079071
68.59130434782608 48.034934997558594 0.28999999165534973
69.6 48.034934997558594 0.28999999165534973
70.6086956521739 48.47161865234375 0.28999999165534973
71.61739130434782 49.34497833251953 0.3100000023841858
72.62608695652173 49.78166198730469 0.3100000023841858
73.63478260869564 49.78166198730469 0.33000001311302185
74.64347826086956 50.65502166748047 0.3499999940395355
75.65217391304347 50.65502166748047 0.3499999940395355
76.66086956521738 51.091705322265625 0.3799999952316284
77.6695652173913 51.091705322265625 0.3799999952316284
78.67826086956521 51.965065002441406 0.3799999952316284
79.68695652173912 51.965065002441406 0.3799999952316284
80.69565217391303 52.40174865722656 0.38999998569488525
81.70434782608696 52.83842849731445 0.4000000059604645
82.71304347826087 53.27511215209961 0.41999998688697815
83.72173913043478 53.7117919921875 0.44999998807907104
84.7304347826087 53.7117919921875 0.44999998807907104
85.73913043478261 54.58515548706055 0.4699999988079071
86.74782608695652 54.58515548706055 0.4699999988079071
87.75652173913043 54.58515548706055 0.49000000953674316
88.76521739130435 54.58515548706055 0.49000000953674316
89.77391304347826 55.45851516723633 0.5
90.78260869565217 55.45851516723633 0.5
91.79130434782608 55.895198822021484 0.5400000214576721
92.8 55.895198822021484 0.550000011920929
93.80869565217391 56.331878662109375 0.009999999776482582
94.81739130434782 56.331878662109375 0.05000000074505806
95.82608695652173 56.331878662109375 0.05999999865889549
96.83478260869565 56.331878662109375 0.09000000357627869
97.84347826086956 56.768558502197266 0.9900000095367432
98.85217391304347 56.768558502197266 0.9900000095367432
99.86086956521739 56.768558502197266 0.03999999910593033
100.8695652173913 56.768558502197266 0.03999999910593033
101.87826086956521 56.768558502197266 0.07000000029802322
102.88695652173912 56.768558502197266 0.10000000149011612
103.89565217391304 56.768558502197266 0.9900000095367432
104.90434782608695 57.20524215698242 0.029999999329447746
105.91304347826086 57.20524215698242 0.05999999865889549
106.92173913043477 57.20524215698242 0.07999999821186066
107.93043478260869 57.20524215698242 0.9900000095367432
108.9391304347826 57.20524215698242 0.9900000095367432
109.94782608695651 57.64192199707031 0.03999999910593033
110.95652173913042 57.64192199707031 0.07000000029802322
111.96521739130434 57.64192199707031 0.07000000029802322
112.97391304347826 57.64192199707031 0.09000000357627869
113.98260869565217 57.64192199707031 0.09000000357627869
114.99130434782609 57.64192199707031 1.0
116.0 57.64192199707031 1.0
