Time,Distance1,SensorData0,Distance2,SensorData4
0.018000,0.060778,0.000000,0.060778,0.000000
0.036000,0.059525,0.000000,0.059525,0.000000
0.054000,0.058077,0.000000,0.058077,0.000000
0.072000,0.056768,0.000000,0.056768,0.000000
0.090000,0.055720,0.000000,0.055720,0.000000
0.108000,0.054871,0.000000,0.054871,0.000000
0.126000,0.054109,0.000000,0.054109,0.000000
0.144000,0.053362,0.000000,0.053362,0.000000
0.162000,0.052615,0.000000,0.052615,0.000000
0.180000,0.051879,0.000000,0.051879,0.000000
0.198000,0.051164,0.000000,0.051164,0.000000
0.216000,0.050465,0.000000,0.050465,0.000000
0.234000,0.049776,0.000000,0.049776,0.000000
0.252000,0.049092,0.000000,0.049092,0.000000
0.270000,0.048414,0.000000,0.048414,0.000000
0.288000,0.047741,0.000000,0.047741,0.000000
0.306000,0.047075,0.000000,0.047075,0.000000
0.324000,0.046417,0.000000,0.046417,0.000000
0.342000,0.045898,0.414922,0.045898,0.414923
0.360000,0.045794,0.642956,0.045794,0.642958
0.378000,0.045779,0.958137,0.045779,0.958139
0.396000,0.045747,1.286914,0.045747,1.286917
0.414000,0.045688,1.610140,0.045688,1.610142
0.432000,0.045614,1.928029,0.045614,1.928032
0.450000,0.045531,2.244903,0.045531,2.244905
0.468000,0.045446,2.559794,0.045446,2.559796
0.486000,0.045358,2.878643,0.045358,2.878645
0.504000,0.045268,3.198474,0.045268,3.198474
0.522000,0.045177,3.518573,0.045177,3.518575
0.540000,0.045084,3.841352,0.045084,3.841352
0.558000,0.044988,4.162373,0.044988,4.162372
0.576000,0.044890,4.483394,0.044890,4.483395
0.594000,0.044791,4.802160,0.044791,4.802160
0.612000,0.044690,5.121522,0.044690,5.121532
0.630000,0.044588,5.440202,0.044588,5.440210
0.648000,0.044487,5.756935,0.044487,5.756931
0.666000,0.044385,6.073923,0.044385,6.073936
0.684000,0.044285,6.392814,0.044285,6.392890
0.702000,0.044187,6.711823,0.044187,6.711704
0.720000,0.044091,7.030927,0.044091,7.031772
0.738000,0.043996,7.348348,0.043996,7.348900
0.756000,0.043903,7.638404,0.043903,7.638705
0.774000,0.043812,7.968184,0.043812,7.966827
0.792000,0.043722,8.264192,0.043722,8.266082
0.810000,0.043632,8.657143,0.043633,8.654746
0.828000,0.043553,9.016459,0.043553,9.016882
0.846000,0.043481,9.374937,0.043480,9.374707
0.864000,0.043411,9.741697,0.043410,9.742381
0.882000,0.043341,10.107140,0.043341,10.105465
0.900000,0.043273,10.477832,0.043273,10.476626
0.918000,0.043207,10.853773,0.043207,10.851095
0.936000,0.043142,11.238184,0.043143,11.235838
0.954000,0.043082,11.628254,0.043082,11.629857
0.972000,0.043026,12.022840,0.043026,12.019235
0.990000,0.042973,12.418465,0.042973,12.417753
1.008000,0.042923,12.811936,0.042922,12.813723
1.026000,0.042874,13.207410,0.042875,13.208864
1.044000,0.042827,13.562097,0.042828,13.561530
1.062000,0.042787,13.584982,0.042788,13.586358
1.080000,0.042765,13.595393,0.042765,13.594852
1.098000,0.042757,13.606254,0.042757,13.606304
1.116000,0.042756,13.619274,0.042755,13.616422
1.134000,0.042755,13.633904,0.042754,13.634074
1.152000,0.042754,13.644891,0.042754,13.642011
1.170000,0.042752,13.654549,0.042751,13.654068
1.188000,0.042750,13.660270,0.042749,13.662859
1.206000,0.042748,13.662969,0.042747,13.662618
1.224000,0.042746,13.667103,0.042746,13.668629
1.242000,0.042745,13.669471,0.042745,13.668006
1.260000,0.042744,13.669938,0.042744,13.669497
1.278000,0.042744,13.670353,0.042743,13.671861
1.296000,0.042743,13.672621,0.042744,13.671290
1.314000,0.042745,13.431363,0.042745,13.432483
1.332000,0.042760,13.059990,0.042760,13.061650
1.350000,0.042791,12.682023,0.042792,12.682064
1.368000,0.042832,12.302698,0.042832,12.304967
1.386000,0.042876,11.920788,0.042876,11.923504
1.404000,0.042919,11.542733,0.042919,11.540784
1.422000,0.042961,11.153880,0.042961,11.151816
1.440000,0.043003,10.766102,0.043002,10.768146
1.458000,0.043045,10.376081,0.043045,10.373979
1.476000,0.043088,9.983143,0.043087,9.987024
1.494000,0.043132,9.596308,0.043133,9.597384
1.512000,0.043178,9.209796,0.043179,9.211786
1.530000,0.043226,8.830830,0.043226,8.830556
1.548000,0.043276,8.451922,0.043276,8.454050
1.566000,0.043327,8.084075,0.043328,8.083878
1.584000,0.043380,7.719812,0.043381,7.717991
1.602000,0.043436,7.357507,0.043436,7.360457
1.620000,0.043492,7.001985,0.043493,7.000938
1.638000,0.043552,6.647983,0.043552,6.648217
1.656000,0.043613,6.304657,0.043614,6.305695
1.674000,0.043678,5.964235,0.043678,5.963526
1.692000,0.043745,5.625679,0.043745,5.626059
1.710000,0.043815,5.300978,0.043815,5.302390
1.728000,0.043887,4.976803,0.043888,4.976295
1.746000,0.043961,4.658370,0.043962,4.658200
1.764000,0.044037,4.340512,0.044038,4.340002
1.782000,0.044116,4.000817,0.044116,4.001048
1.800000,0.044197,3.692729,0.044197,3.693063
1.818000,0.044279,3.383796,0.044279,3.383991
1.836000,0.044362,3.076978,0.044363,3.077043
1.854000,0.044447,2.770184,0.044447,2.770339
1.872000,0.044532,2.464860,0.044532,2.464955
1.890000,0.044619,2.157603,0.044619,2.157688
1.908000,0.044708,1.852825,0.044708,1.852892
1.926000,0.044799,1.549423,0.044799,1.549500
1.944000,0.044892,1.246493,0.044892,1.246578
1.962000,0.044988,0.945530,0.044988,0.945623
1.980000,0.045087,0.645795,0.045087,0.645893
1.998000,0.045190,0.350228,0.045190,0.350323
2.016000,0.045312,0.098301,0.045312,0.098374
2.034000,0.045588,0.000000,0.045588,0.000000
2.052000,0.046173,0.000000,0.046174,0.000000
2.070000,0.046997,0.000000,0.046997,0.000000
2.088000,0.047865,0.000000,0.047865,0.000000
2.106000,0.048651,0.000000,0.048651,0.000000
2.124000,0.049352,0.000000,0.049352,0.000000
2.142000,0.050021,0.000000,0.050021,0.000000
2.160000,0.050703,0.000000,0.050703,0.000000
2.178000,0.051406,0.000000,0.051406,0.000000
2.196000,0.052120,0.000000,0.052120,0.000000
2.214000,0.052833,0.000000,0.052833,0.000000
2.232000,0.053545,0.000000,0.053545,0.000000
2.250000,0.054258,0.000000,0.054258,0.000000
2.268000,0.054976,0.000000,0.054976,0.000000
2.286000,0.055700,0.000000,0.055700,0.000000
2.304000,0.056428,0.000000,0.056428,0.000000
2.322000,0.057160,0.000000,0.057160,0.000000
2.340000,0.057896,0.000000,0.057896,0.000000
2.358000,0.058550,0.000000,0.058550,0.000000
2.376000,0.058783,0.000000,0.058783,0.000000
2.394000,0.058663,0.000000,0.058663,0.000000
2.412000,0.058482,0.000000,0.058482,0.000000
2.430000,0.058412,0.000000,0.058412,0.000000
2.448000,0.058441,0.000000,0.058441,0.000000
2.466000,0.058490,0.000000,0.058490,0.000000
2.484000,0.058511,0.000000,0.058511,0.000000
2.502000,0.058504,0.000000,0.058504,0.000000
2.520000,0.058491,0.000000,0.058491,0.000000
2.538000,0.058485,0.000000,0.058485,0.000000
2.556000,0.058486,0.000000,0.058486,0.000000
2.574000,0.058490,0.000000,0.058490,0.000000
2.592000,0.058492,0.000000,0.058492,0.000000
2.610000,0.058491,0.000000,0.058491,0.000000
2.628000,0.058490,0.000000,0.058490,0.000000
2.646000,0.058490,0.000000,0.058490,0.000000
2.664000,0.058490,0.000000,0.058490,0.000000
2.682000,0.058490,0.000000,0.058490,0.000000
2.700000,0.058490,0.000000,0.058490,0.000000
2.718000,0.058490,0.000000,0.058490,0.000000
2.736000,0.058490,0.000000,0.058490,0.000000
2.754000,0.058490,0.000000,0.058490,0.000000
2.772000,0.058490,0.000000,0.058490,0.000000
2.790000,0.058490,0.000000,0.058490,0.000000
2.808000,0.058490,0.000000,0.058490,0.000000
2.826000,0.058490,0.000000,0.058490,0.000000
2.844000,0.058490,0.000000,0.058490,0.000000
2.862000,0.058490,0.000000,0.058490,0.000000
2.880000,0.058490,0.000000,0.058490,0.000000
2.898000,0.058490,0.000000,0.058490,0.000000
2.916000,0.058490,0.000000,0.058490,0.000000
2.934000,0.058490,0.000000,0.058490,0.000000
2.952000,0.058490,0.000000,0.058490,0.000000
2.970000,0.058490,0.000000,0.058490,0.000000
2.988000,0.058490,0.000000,0.058490,0.000000
3.006000,0.058490,0.000000,0.058490,0.000000
3.024000,0.058490,0.000000,0.058490,0.000000
3.042000,0.058490,0.000000,0.058490,0.000000
3.060000,0.058490,0.000000,0.058490,0.000000
3.078000,0.058490,0.000000,0.058490,0.000000
3.096000,0.058490,0.000000,0.058490,0.000000
3.114000,0.058490,0.000000,0.058490,0.000000
3.132000,0.058490,0.000000,0.058490,0.000000
3.150000,0.058490,0.000000,0.058490,0.000000
3.168000,0.058490,0.000000,0.058490,0.000000
3.186000,0.058490,0.000000,0.058490,0.000000
3.204000,0.058490,0.000000,0.058490,0.000000
3.222000,0.058490,0.000000,0.058490,0.000000
3.240000,0.058490,0.000000,0.058490,0.000000
3.258000,0.058490,0.000000,0.058490,0.000000
3.276000,0.058490,0.000000,0.058490,0.000000
3.294000,0.058490,0.000000,0.058490,0.000000
3.312000,0.058490,0.000000,0.058490,0.000000
3.330000,0.058490,0.000000,0.058490,0.000000
3.348000,0.058490,0.000000,0.058490,0.000000
3.366000,0.058490,0.000000,0.058490,0.000000
3.384000,0.058490,0.000000,0.058490,0.000000
3.402000,0.058490,0.000000,0.058490,0.000000
3.420000,0.058490,0.000000,0.058490,0.000000
3.438000,0.058490,0.000000,0.058490,0.000000
3.456000,0.058490,0.000000,0.058490,0.000000
3.474000,0.058490,0.000000,0.058490,0.000000
3.492000,0.058490,0.000000,0.058490,0.000000
3.510000,0.058490,0.000000,0.058490,0.000000
3.528000,0.058490,0.000000,0.058490,0.000000
3.546000,0.058490,0.000000,0.058490,0.000000
3.564000,0.058490,0.000000,0.058490,0.000000
3.582000,0.058490,0.000000,0.058490,0.000000
3.600000,0.058490,0.000000,0.058490,0.000000
3.618000,0.058490,0.000000,0.058490,0.000000
3.636000,0.058490,0.000000,0.058490,0.000000
3.654000,0.058490,0.000000,0.058490,0.000000
3.672000,0.058490,0.000000,0.058490,0.000000
3.690000,0.058490,0.000000,0.058490,0.000000
3.708000,0.058490,0.000000,0.058490,0.000000
3.726000,0.058490,0.000000,0.058490,0.000000
3.744000,0.058490,0.000000,0.058490,0.000000
3.762000,0.058490,0.000000,0.058490,0.000000
3.780000,0.058490,0.000000,0.058490,0.000000
3.798000,0.058490,0.000000,0.058490,0.000000
3.816000,0.058490,0.000000,0.058490,0.000000
3.834000,0.058490,0.000000,0.058490,0.000000
3.852000,0.058490,0.000000,0.058490,0.000000
3.870000,0.058490,0.000000,0.058490,0.000000
3.888000,0.058490,0.000000,0.058490,0.000000
3.906000,0.058490,0.000000,0.058490,0.000000
3.924000,0.058490,0.000000,0.058490,0.000000
3.942000,0.058490,0.000000,0.058490,0.000000
3.960000,0.058490,0.000000,0.058490,0.000000
3.978000,0.058490,0.000000,0.058490,0.000000
3.996000,0.058490,0.000000,0.058490,0.000000
4.014000,0.058490,0.000000,0.058490,0.000000
4.032000,0.058490,0.000000,0.058490,0.000000
4.050000,0.058490,0.000000,0.058490,0.000000
4.068000,0.058490,0.000000,0.058490,0.000000
4.086000,0.058490,0.000000,0.058490,0.000000
4.104000,0.058490,0.000000,0.058490,0.000000
4.122000,0.058490,0.000000,0.058490,0.000000
4.140000,0.058490,0.000000,0.058490,0.000000
4.158000,0.058490,0.000000,0.058490,0.000000
4.176000,0.058490,0.000000,0.058490,0.000000
4.194000,0.058490,0.000000,0.058490,0.000000
4.212000,0.058490,0.000000,0.058490,0.000000
4.230000,0.058490,0.000000,0.058490,0.000000
4.248000,0.058490,0.000000,0.058490,0.000000
4.266000,0.058490,0.000000,0.058490,0.000000
4.284000,0.058490,0.000000,0.058490,0.000000
4.302000,0.058490,0.000000,0.058490,0.000000
4.320000,0.058490,0.000000,0.058490,0.000000
4.338000,0.058490,0.000000,0.058490,0.000000
4.356000,0.058490,0.000000,0.058490,0.000000
4.374000,0.058490,0.000000,0.058490,0.000000
4.392000,0.058490,0.000000,0.058490,0.000000
4.410000,0.058490,0.000000,0.058490,0.000000
4.428000,0.058490,0.000000,0.058490,0.000000
4.446000,0.058490,0.000000,0.058490,0.000000
4.464000,0.058490,0.000000,0.058490,0.000000
4.482000,0.058490,0.000000,0.058490,0.000000
4.500000,0.058490,0.000000,0.058490,0.000000
4.518000,0.058490,0.000000,0.058490,0.000000
4.536000,0.058490,0.000000,0.058490,0.000000
4.554000,0.058490,0.000000,0.058490,0.000000
4.572000,0.058490,0.000000,0.058490,0.000000
4.590000,0.058490,0.000000,0.058490,0.000000
4.608000,0.058490,0.000000,0.058490,0.000000
4.626000,0.058490,0.000000,0.058490,0.000000
4.644000,0.058490,0.000000,0.058490,0.000000
4.662000,0.058490,0.000000,0.058490,0.000000
4.680000,0.058490,0.000000,0.058490,0.000000
4.698000,0.058490,0.000000,0.058490,0.000000
4.716000,0.058490,0.000000,0.058490,0.000000
4.734000,0.058490,0.000000,0.058490,0.000000
4.752000,0.058490,0.000000,0.058490,0.000000
4.770000,0.058490,0.000000,0.058490,0.000000
4.788000,0.058490,0.000000,0.058490,0.000000
4.806000,0.058490,0.000000,0.058490,0.000000
4.824000,0.058490,0.000000,0.058490,0.000000
4.842000,0.058490,0.000000,0.058490,0.000000
4.860000,0.058490,0.000000,0.058490,0.000000
4.878000,0.058490,0.000000,0.058490,0.000000
4.896000,0.058490,0.000000,0.058490,0.000000
4.914000,0.058490,0.000000,0.058490,0.000000
4.932000,0.058490,0.000000,0.058490,0.000000
4.950000,0.058490,0.000000,0.058490,0.000000
4.968000,0.058490,0.000000,0.058490,0.000000
4.986000,0.058490,0.000000,0.058490,0.000000
5.004000,0.058490,0.000000,0.058490,0.000000
5.022000,0.058490,0.000000,0.058490,0.000000
5.040000,0.058490,0.000000,0.058490,0.000000
5.058000,0.058490,0.000000,0.058490,0.000000
5.076000,0.058490,0.000000,0.058490,0.000000
5.094000,0.058490,0.000000,0.058490,0.000000
5.112000,0.058490,0.000000,0.058490,0.000000
5.130000,0.058490,0.000000,0.058490,0.000000
5.148000,0.058490,0.000000,0.058490,0.000000
5.166000,0.058490,0.000000,0.058490,0.000000
5.184000,0.058490,0.000000,0.058490,0.000000
5.202000,0.058490,0.000000,0.058490,0.000000
5.220000,0.058490,0.000000,0.058490,0.000000
5.238000,0.058490,0.000000,0.058490,0.000000
5.256000,0.058490,0.000000,0.058490,0.000000
5.274000,0.058490,0.000000,0.058490,0.000000
5.292000,0.058490,0.000000,0.058490,0.000000
5.310000,0.058490,0.000000,0.058490,0.000000
5.328000,0.058490,0.000000,0.058490,0.000000
5.346000,0.058490,0.000000,0.058490,0.000000
5.364000,0.058490,0.000000,0.058490,0.000000
5.382000,0.058490,0.000000,0.058490,0.000000
5.400000,0.058490,0.000000,0.058490,0.000000
5.418000,0.058490,0.000000,0.058490,0.000000
5.436000,0.058490,0.000000,0.058490,0.000000
5.454000,0.058490,0.000000,0.058490,0.000000
5.472000,0.058490,0.000000,0.058490,0.000000
5.490000,0.058490,0.000000,0.058490,0.000000
5.508000,0.058490,0.000000,0.058490,0.000000
5.526000,0.058490,0.000000,0.058490,0.000000
5.544000,0.058490,0.000000,0.058490,0.000000
5.562000,0.058490,0.000000,0.058490,0.000000
5.580000,0.058490,0.000000,0.058490,0.000000
5.598000,0.058490,0.000000,0.058490,0.000000
