Time,Distance1,SensorData0,Distance2,SensorData4
0.018000,0.060778,0.000000,0.060778,0.000000
0.036000,0.059525,0.000000,0.059525,0.000000
0.054000,0.058077,0.000000,0.058077,0.000000
0.072000,0.056768,0.000000,0.056768,0.000000
0.090000,0.055720,0.000000,0.055720,0.000000
0.108000,0.054871,0.000000,0.054871,0.000000
0.126000,0.054109,0.000000,0.054109,0.000000
0.144000,0.053362,0.000000,0.053362,0.000000
0.162000,0.052615,0.000000,0.052615,0.000000
0.180000,0.051879,0.000000,0.051879,0.000000
0.198000,0.051164,0.000000,0.051164,0.000000
0.216000,0.050465,0.000000,0.050465,0.000000
0.234000,0.049776,0.000000,0.049776,0.000000
0.252000,0.049092,0.000000,0.049092,0.000000
0.270000,0.048414,0.000000,0.048414,0.000000
0.288000,0.047741,0.000000,0.047741,0.000000
0.306000,0.047075,0.000000,0.047075,0.000000
0.324000,0.046443,0.430715,0.046443,0.430717
0.342000,0.046260,0.556299,0.046260,0.556300
0.360000,0.046271,0.858928,0.046271,0.858930
0.378000,0.046290,1.197121,0.046290,1.197123
0.396000,0.046287,1.535188,0.046287,1.535190
0.414000,0.046266,1.867884,0.046266,1.867886
0.432000,0.046238,2.195424,0.046238,2.196027
0.450000,0.046207,2.523800,0.046207,2.523412
0.468000,0.046176,2.853280,0.046177,2.852016
0.486000,0.046147,3.177802,0.046147,3.181864
0.504000,0.046119,3.508469,0.046118,3.509295
0.522000,0.046091,3.835202,0.046090,3.836528
0.540000,0.046063,4.167271,0.046062,4.162562
0.558000,0.046036,4.489874,0.046035,4.495729
0.576000,0.046009,4.819498,0.046008,4.824990
0.594000,0.045982,5.150506,0.045982,5.151376
0.612000,0.045957,5.480493,0.045957,5.481564
0.630000,0.045931,5.812896,0.045932,5.807105
0.648000,0.045906,6.140704,0.045907,6.140338
0.666000,0.045882,6.472992,0.045883,6.467276
0.684000,0.045858,6.801035,0.045859,6.800549
0.702000,0.045834,7.132079,0.045835,7.131182
0.720000,0.045812,7.462490,0.045812,7.463765
0.738000,0.045789,7.795066,0.045789,7.793208
0.756000,0.045768,8.131485,0.045768,8.126894
0.774000,0.045747,8.462349,0.045747,8.461212
0.792000,0.045726,8.795488,0.045726,8.795175
0.810000,0.045704,9.130447,0.045704,9.129957
0.828000,0.045682,9.466354,0.045682,9.461277
0.846000,0.045659,9.800134,0.045660,9.795907
0.864000,0.045636,10.133116,0.045638,10.133015
0.882000,0.045614,10.467138,0.045615,10.466962
0.900000,0.045592,10.803720,0.045593,10.799408
0.918000,0.045570,11.137772,0.045570,11.134901
0.936000,0.045548,11.471314,0.045547,11.471499
0.954000,0.045526,11.808703,0.045526,11.804392
0.972000,0.045504,12.141363,0.045504,12.141577
0.990000,0.045482,12.475655,0.045483,12.475087
1.008000,0.045460,12.809904,0.045461,12.811091
1.026000,0.045439,13.147070,0.045439,13.146686
1.044000,0.045418,13.443911,0.045418,13.443136
1.062000,0.045398,13.438757,0.045399,13.438197
1.080000,0.045384,13.430512,0.045384,13.432562
1.098000,0.045374,13.426195,0.045374,13.429406
1.116000,0.045366,13.422235,0.045366,13.426999
1.134000,0.045361,13.423211,0.045361,13.424087
1.152000,0.045356,13.423354,0.045357,13.422261
1.170000,0.045353,13.421005,0.045354,13.421105
1.188000,0.045351,13.417648,0.045351,13.422143
1.206000,0.045349,13.419872,0.045350,13.419517
1.224000,0.045348,13.420832,0.045348,13.420704
1.242000,0.045347,13.422077,0.045346,13.417200
1.260000,0.045345,13.419792,0.045345,13.419990
1.278000,0.045344,13.423388,0.045344,13.416200
1.296000,0.045342,13.420489,0.045342,13.419534
1.314000,0.045341,13.191005,0.045341,13.190910
1.332000,0.045344,12.847649,0.045344,12.850067
1.350000,0.045351,12.510970,0.045351,12.506093
1.368000,0.045362,12.169628,0.045362,12.169831
1.386000,0.045375,11.833451,0.045376,11.832427
1.404000,0.045391,11.495321,0.045391,11.494570
1.422000,0.045408,11.157351,0.045407,11.161205
1.440000,0.045426,10.823128,0.045425,10.823037
1.458000,0.045445,10.485929,0.045445,10.490045
1.476000,0.045464,10.155230,0.045464,10.149509
1.494000,0.045483,9.814865,0.045484,9.818327
1.512000,0.045503,9.480645,0.045504,9.483940
1.530000,0.045523,9.147696,0.045524,9.146370
1.548000,0.045544,8.812023,0.045544,8.812361
1.566000,0.045564,8.475041,0.045564,8.480811
1.584000,0.045585,8.143144,0.045585,8.142629
1.602000,0.045606,7.807556,0.045605,7.809422
1.620000,0.045626,7.471701,0.045626,7.476355
1.638000,0.045647,7.137405,0.045647,7.142855
1.656000,0.045669,6.808406,0.045669,6.805039
1.674000,0.045690,6.472384,0.045690,6.473425
1.692000,0.045712,6.139711,0.045712,6.140485
1.710000,0.045734,5.809341,0.045734,5.804691
1.728000,0.045758,5.474369,0.045756,5.475347
1.746000,0.045781,5.146006,0.045781,5.139804
1.764000,0.045804,4.814878,0.045805,4.809246
1.782000,0.045828,4.481087,0.045829,4.480690
1.800000,0.045853,4.151688,0.045853,4.151017
1.818000,0.045877,3.821195,0.045878,3.820192
1.836000,0.045902,3.494309,0.045902,3.489300
1.854000,0.045927,3.162171,0.045928,3.161728
1.872000,0.045953,2.834121,0.045952,2.833288
1.890000,0.045979,2.502342,0.045978,2.502593
1.908000,0.046005,2.175344,0.046004,2.176451
1.926000,0.046030,1.848684,0.046030,1.849906
1.944000,0.046056,1.519643,0.046057,1.518166
1.962000,0.046085,1.195074,0.046085,1.193647
1.980000,0.046116,0.872266,0.046116,0.870450
1.998000,0.046149,0.550447,0.046149,0.550440
2.016000,0.046190,0.239440,0.046189,0.239412
2.034000,0.046254,0.000000,0.046254,0.000000
2.052000,0.046499,0.000000,0.046499,0.000000
2.070000,0.047098,0.000000,0.047098,0.000000
2.088000,0.047904,0.000000,0.047904,0.000000
2.106000,0.048702,0.000000,0.048702,0.000000
2.124000,0.049410,0.000000,0.049410,0.000000
2.142000,0.050062,0.000000,0.050062,0.000000
2.160000,0.050719,0.000000,0.050719,0.000000
2.178000,0.051407,0.000000,0.051407,0.000000
2.196000,0.052118,0.000000,0.052118,0.000000
2.214000,0.052834,0.000000,0.052834,0.000000
2.232000,0.053548,0.000000,0.053548,0.000000
2.250000,0.054260,0.000000,0.054260,0.000000
2.268000,0.054977,0.000000,0.054977,0.000000
2.286000,0.055700,0.000000,0.055700,0.000000
2.304000,0.056428,0.000000,0.056428,0.000000
2.322000,0.057160,0.000000,0.057160,0.000000
2.340000,0.057896,0.000000,0.057896,0.000000
2.358000,0.058550,0.000000,0.058550,0.000000
2.376000,0.058783,0.000000,0.058783,0.000000
2.394000,0.058663,0.000000,0.058663,0.000000
2.412000,0.058482,0.000000,0.058482,0.000000
2.430000,0.058412,0.000000,0.058412,0.000000
2.448000,0.058441,0.000000,0.058441,0.000000
2.466000,0.058490,0.000000,0.058490,0.000000
2.484000,0.058511,0.000000,0.058511,0.000000
2.502000,0.058504,0.000000,0.058504,0.000000
2.520000,0.058491,0.000000,0.058491,0.000000
2.538000,0.058485,0.000000,0.058485,0.000000
2.556000,0.058486,0.000000,0.058486,0.000000
2.574000,0.058490,0.000000,0.058490,0.000000
2.592000,0.058492,0.000000,0.058492,0.000000
2.610000,0.058491,0.000000,0.058491,0.000000
2.628000,0.058490,0.000000,0.058490,0.000000
2.646000,0.058490,0.000000,0.058490,0.000000
2.664000,0.058490,0.000000,0.058490,0.000000
2.682000,0.058490,0.000000,0.058490,0.000000
2.700000,0.058490,0.000000,0.058490,0.000000
2.718000,0.058490,0.000000,0.058490,0.000000
2.736000,0.058490,0.000000,0.058490,0.000000
2.754000,0.058490,0.000000,0.058490,0.000000
2.772000,0.058490,0.000000,0.058490,0.000000
2.790000,0.058490,0.000000,0.058490,0.000000
2.808000,0.058490,0.000000,0.058490,0.000000
2.826000,0.058490,0.000000,0.058490,0.000000
2.844000,0.058490,0.000000,0.058490,0.000000
2.862000,0.058490,0.000000,0.058490,0.000000
2.880000,0.058490,0.000000,0.058490,0.000000
2.898000,0.058490,0.000000,0.058490,0.000000
2.916000,0.058490,0.000000,0.058490,0.000000
2.934000,0.058490,0.000000,0.058490,0.000000
2.952000,0.058490,0.000000,0.058490,0.000000
2.970000,0.058490,0.000000,0.058490,0.000000
2.988000,0.058490,0.000000,0.058490,0.000000
3.006000,0.058490,0.000000,0.058490,0.000000
3.024000,0.058490,0.000000,0.058490,0.000000
3.042000,0.058490,0.000000,0.058490,0.000000
3.060000,0.058490,0.000000,0.058490,0.000000
3.078000,0.058490,0.000000,0.058490,0.000000
3.096000,0.058490,0.000000,0.058490,0.000000
3.114000,0.058490,0.000000,0.058490,0.000000
3.132000,0.058490,0.000000,0.058490,0.000000
3.150000,0.058490,0.000000,0.058490,0.000000
3.168000,0.058490,0.000000,0.058490,0.000000
3.186000,0.058490,0.000000,0.058490,0.000000
3.204000,0.058490,0.000000,0.058490,0.000000
3.222000,0.058490,0.000000,0.058490,0.000000
3.240000,0.058490,0.000000,0.058490,0.000000
3.258000,0.058490,0.000000,0.058490,0.000000
3.276000,0.058490,0.000000,0.058490,0.000000
3.294000,0.058490,0.000000,0.058490,0.000000
3.312000,0.058490,0.000000,0.058490,0.000000
3.330000,0.058490,0.000000,0.058490,0.000000
3.348000,0.058490,0.000000,0.058490,0.000000
3.366000,0.058490,0.000000,0.058490,0.000000
3.384000,0.058490,0.000000,0.058490,0.000000
3.402000,0.058490,0.000000,0.058490,0.000000
3.420000,0.058490,0.000000,0.058490,0.000000
3.438000,0.058490,0.000000,0.058490,0.000000
3.456000,0.058490,0.000000,0.058490,0.000000
3.474000,0.058490,0.000000,0.058490,0.000000
3.492000,0.058490,0.000000,0.058490,0.000000
3.510000,0.058490,0.000000,0.058490,0.000000
3.528000,0.058490,0.000000,0.058490,0.000000
3.546000,0.058490,0.000000,0.058490,0.000000
3.564000,0.058490,0.000000,0.058490,0.000000
3.582000,0.058490,0.000000,0.058490,0.000000
3.600000,0.058490,0.000000,0.058490,0.000000
3.618000,0.058490,0.000000,0.058490,0.000000
3.636000,0.058490,0.000000,0.058490,0.000000
3.654000,0.058490,0.000000,0.058490,0.000000
3.672000,0.058490,0.000000,0.058490,0.000000
3.690000,0.058490,0.000000,0.058490,0.000000
3.708000,0.058490,0.000000,0.058490,0.000000
3.726000,0.058490,0.000000,0.058490,0.000000
3.744000,0.058490,0.000000,0.058490,0.000000
3.762000,0.058490,0.000000,0.058490,0.000000
3.780000,0.058490,0.000000,0.058490,0.000000
3.798000,0.058490,0.000000,0.058490,0.000000
3.816000,0.058490,0.000000,0.058490,0.000000
3.834000,0.058490,0.000000,0.058490,0.000000
3.852000,0.058490,0.000000,0.058490,0.000000
3.870000,0.058490,0.000000,0.058490,0.000000
3.888000,0.058490,0.000000,0.058490,0.000000
3.906000,0.058490,0.000000,0.058490,0.000000
3.924000,0.058490,0.000000,0.058490,0.000000
3.942000,0.058490,0.000000,0.058490,0.000000
3.960000,0.058490,0.000000,0.058490,0.000000
3.978000,0.058490,0.000000,0.058490,0.000000
3.996000,0.058490,0.000000,0.058490,0.000000
4.014000,0.058490,0.000000,0.058490,0.000000
4.032000,0.058490,0.000000,0.058490,0.000000
4.050000,0.058490,0.000000,0.058490,0.000000
4.068000,0.058490,0.000000,0.058490,0.000000
4.086000,0.058490,0.000000,0.058490,0.000000
4.104000,0.058490,0.000000,0.058490,0.000000
4.122000,0.058490,0.000000,0.058490,0.000000
4.140000,0.058490,0.000000,0.058490,0.000000
4.158000,0.058490,0.000000,0.058490,0.000000
4.176000,0.058490,0.000000,0.058490,0.000000
4.194000,0.058490,0.000000,0.058490,0.000000
4.212000,0.058490,0.000000,0.058490,0.000000
4.230000,0.058490,0.000000,0.058490,0.000000
4.248000,0.058490,0.000000,0.058490,0.000000
4.266000,0.058490,0.000000,0.058490,0.000000
4.284000,0.058490,0.000000,0.058490,0.000000
4.302000,0.058490,0.000000,0.058490,0.000000
4.320000,0.058490,0.000000,0.058490,0.000000
4.338000,0.058490,0.000000,0.058490,0.000000
4.356000,0.058490,0.000000,0.058490,0.000000
4.374000,0.058490,0.000000,0.058490,0.000000
4.392000,0.058490,0.000000,0.058490,0.000000
4.410000,0.058490,0.000000,0.058490,0.000000
4.428000,0.058490,0.000000,0.058490,0.000000
4.446000,0.058490,0.000000,0.058490,0.000000
4.464000,0.058490,0.000000,0.058490,0.000000
4.482000,0.058490,0.000000,0.058490,0.000000
4.500000,0.058490,0.000000,0.058490,0.000000
4.518000,0.058490,0.000000,0.058490,0.000000
4.536000,0.058490,0.000000,0.058490,0.000000
4.554000,0.058490,0.000000,0.058490,0.000000
4.572000,0.058490,0.000000,0.058490,0.000000
4.590000,0.058490,0.000000,0.058490,0.000000
4.608000,0.058490,0.000000,0.058490,0.000000
4.626000,0.058490,0.000000,0.058490,0.000000
4.644000,0.058490,0.000000,0.058490,0.000000
4.662000,0.058490,0.000000,0.058490,0.000000
4.680000,0.058490,0.000000,0.058490,0.000000
4.698000,0.058490,0.000000,0.058490,0.000000
4.716000,0.058490,0.000000,0.058490,0.000000
4.734000,0.058490,0.000000,0.058490,0.000000
4.752000,0.058490,0.000000,0.058490,0.000000
4.770000,0.058490,0.000000,0.058490,0.000000
4.788000,0.058490,0.000000,0.058490,0.000000
4.806000,0.058490,0.000000,0.058490,0.000000
4.824000,0.058490,0.000000,0.058490,0.000000
4.842000,0.058490,0.000000,0.058490,0.000000
4.860000,0.058490,0.000000,0.058490,0.000000
4.878000,0.058490,0.000000,0.058490,0.000000
4.896000,0.058490,0.000000,0.058490,0.000000
4.914000,0.058490,0.000000,0.058490,0.000000
4.932000,0.058490,0.000000,0.058490,0.000000
4.950000,0.058490,0.000000,0.058490,0.000000
4.968000,0.058490,0.000000,0.058490,0.000000
4.986000,0.058490,0.000000,0.058490,0.000000
5.004000,0.058490,0.000000,0.058490,0.000000
5.022000,0.058490,0.000000,0.058490,0.000000
5.040000,0.058490,0.000000,0.058490,0.000000
5.058000,0.058490,0.000000,0.058490,0.000000
5.076000,0.058490,0.000000,0.058490,0.000000
5.094000,0.058490,0.000000,0.058490,0.000000
5.112000,0.058490,0.000000,0.058490,0.000000
5.130000,0.058490,0.000000,0.058490,0.000000
5.148000,0.058490,0.000000,0.058490,0.000000
5.166000,0.058490,0.000000,0.058490,0.000000
5.184000,0.058490,0.000000,0.058490,0.000000
5.202000,0.058490,0.000000,0.058490,0.000000
5.220000,0.058490,0.000000,0.058490,0.000000
5.238000,0.058490,0.000000,0.058490,0.000000
5.256000,0.058490,0.000000,0.058490,0.000000
5.274000,0.058490,0.000000,0.058490,0.000000
5.292000,0.058490,0.000000,0.058490,0.000000
5.310000,0.058490,0.000000,0.058490,0.000000
5.328000,0.058490,0.000000,0.058490,0.000000
5.346000,0.058490,0.000000,0.058490,0.000000
5.364000,0.058490,0.000000,0.058490,0.000000
5.382000,0.058490,0.000000,0.058490,0.000000
5.400000,0.058490,0.000000,0.058490,0.000000
5.418000,0.058490,0.000000,0.058490,0.000000
5.436000,0.058490,0.000000,0.058490,0.000000
5.454000,0.058490,0.000000,0.058490,0.000000
5.472000,0.058490,0.000000,0.058490,0.000000
5.490000,0.058490,0.000000,0.058490,0.000000
5.508000,0.058490,0.000000,0.058490,0.000000
5.526000,0.058490,0.000000,0.058490,0.000000
5.544000,0.058490,0.000000,0.058490,0.000000
5.562000,0.058490,0.000000,0.058490,0.000000
5.580000,0.058490,0.000000,0.058490,0.000000
5.598000,0.058490,0.000000,0.058490,0.000000
5.616000,0.058490,0.000000,0.058490,0.000000
5.634000,0.058490,0.000000,0.058490,0.000000
5.652000,0.058490,0.000000,0.058490,0.000000
5.670000,0.058490,0.000000,0.058490,0.000000
5.688000,0.058490,0.000000,0.058490,0.000000
5.706000,0.058490,0.000000,0.058490,0.000000
5.724000,0.058490,0.000000,0.058490,0.000000
5.742000,0.058490,0.000000,0.058490,0.000000
5.760000,0.058490,0.000000,0.058490,0.000000
5.778000,0.058490,0.000000,0.058490,0.000000
5.796000,0.058490,0.000000,0.058490,0.000000
5.814000,0.058490,0.000000,0.058490,0.000000
5.832000,0.058490,0.000000,0.058490,0.000000
5.850000,0.058490,0.000000,0.058490,0.000000
5.868000,0.058490,0.000000,0.058490,0.000000
5.886000,0.058490,0.000000,0.058490,0.000000
5.904000,0.058490,0.000000,0.058490,0.000000
5.922000,0.058490,0.000000,0.058490,0.000000
5.940000,0.058490,0.000000,0.058490,0.000000
5.958000,0.058490,0.000000,0.058490,0.000000
5.976000,0.058490,0.000000,0.058490,0.000000
5.994000,0.058490,0.000000,0.058490,0.000000
6.012000,0.058490,0.000000,0.058490,0.000000
6.030000,0.058490,0.000000,0.058490,0.000000
6.048000,0.058490,0.000000,0.058490,0.000000
6.066000,0.058490,0.000000,0.058490,0.000000
6.084000,0.058490,0.000000,0.058490,0.000000
6.102000,0.058490,0.000000,0.058490,0.000000
6.120000,0.058490,0.000000,0.058490,0.000000
6.138000,0.058490,0.000000,0.058490,0.000000
6.156000,0.058490,0.000000,0.058490,0.000000
6.174000,0.058490,0.000000,0.058490,0.000000
6.192000,0.058490,0.000000,0.058490,0.000000
6.210000,0.058490,0.000000,0.058490,0.000000
6.228000,0.058490,0.000000,0.058490,0.000000
6.246000,0.058490,0.000000,0.058490,0.000000
6.264000,0.058490,0.000000,0.058490,0.000000
6.282000,0.058490,0.000000,0.058490,0.000000
6.300000,0.058490,0.000000,0.058490,0.000000
6.318000,0.058490,0.000000,0.058490,0.000000
6.336000,0.058490,0.000000,0.058490,0.000000
6.354000,0.058490,0.000000,0.058490,0.000000
6.372000,0.058490,0.000000,0.058490,0.000000
6.390000,0.058490,0.000000,0.058490,0.000000
6.408000,0.058490,0.000000,0.058490,0.000000
6.426000,0.058490,0.000000,0.058490,0.000000
6.444000,0.058490,0.000000,0.058490,0.000000
6.462000,0.058490,0.000000,0.058490,0.000000
6.480000,0.058490,0.000000,0.058490,0.000000
6.498000,0.058490,0.000000,0.058490,0.000000
6.516000,0.058490,0.000000,0.058490,0.000000
6.534000,0.058490,0.000000,0.058490,0.000000
6.552000,0.058490,0.000000,0.058490,0.000000
6.570000,0.058490,0.000000,0.058490,0.000000
6.588000,0.058490,0.000000,0.058490,0.000000
6.606000,0.058490,0.000000,0.058490,0.000000
6.624000,0.058490,0.000000,0.058490,0.000000
6.642000,0.058490,0.000000,0.058490,0.000000
6.660000,0.058490,0.000000,0.058490,0.000000
6.678000,0.058490,0.000000,0.058490,0.000000
6.696000,0.058490,0.000000,0.058490,0.000000
6.714000,0.058490,0.000000,0.058490,0.000000
6.732000,0.058490,0.000000,0.058490,0.000000
6.750000,0.058490,0.000000,0.058490,0.000000
6.768000,0.058490,0.000000,0.058490,0.000000
6.786000,0.058490,0.000000,0.058490,0.000000
6.804000,0.058490,0.000000,0.058490,0.000000
6.822000,0.058490,0.000000,0.058490,0.000000
6.840000,0.058490,0.000000,0.058490,0.000000
6.858000,0.058490,0.000000,0.058490,0.000000
6.876000,0.058490,0.000000,0.058490,0.000000
6.894000,0.058490,0.000000,0.058490,0.000000
6.912000,0.058490,0.000000,0.058490,0.000000
6.930000,0.058490,0.000000,0.058490,0.000000
6.948000,0.058490,0.000000,0.058490,0.000000
6.966000,0.058490,0.000000,0.058490,0.000000
6.984000,0.058490,0.000000,0.058490,0.000000
7.002000,0.058490,0.000000,0.058490,0.000000
7.020000,0.058490,0.000000,0.058490,0.000000
7.038000,0.058490,0.000000,0.058490,0.000000
7.056000,0.058490,0.000000,0.058490,0.000000
7.074000,0.058490,0.000000,0.058490,0.000000
7.092000,0.058490,0.000000,0.058490,0.000000
7.110000,0.058490,0.000000,0.058490,0.000000
7.128000,0.058490,0.000000,0.058490,0.000000
7.146000,0.058490,0.000000,0.058490,0.000000
7.164000,0.058490,0.000000,0.058490,0.000000
7.182000,0.058490,0.000000,0.058490,0.000000
7.200000,0.058490,0.000000,0.058490,0.000000
7.218000,0.058490,0.000000,0.058490,0.000000
7.236000,0.058490,0.000000,0.058490,0.000000
7.254000,0.058490,0.000000,0.058490,0.000000
7.272000,0.058490,0.000000,0.058490,0.000000
7.290000,0.058490,0.000000,0.058490,0.000000
7.308000,0.058490,0.000000,0.058490,0.000000
7.326000,0.058490,0.000000,0.058490,0.000000
7.344000,0.058490,0.000000,0.058490,0.000000
7.362000,0.058490,0.000000,0.058490,0.000000
7.380000,0.058490,0.000000,0.058490,0.000000
7.398000,0.058490,0.000000,0.058490,0.000000
7.416000,0.058490,0.000000,0.058490,0.000000
7.434000,0.058490,0.000000,0.058490,0.000000
7.452000,0.058490,0.000000,0.058490,0.000000
7.470000,0.058490,0.000000,0.058490,0.000000
7.488000,0.058490,0.000000,0.058490,0.000000
7.506000,0.058490,0.000000,0.058490,0.000000
7.524000,0.058490,0.000000,0.058490,0.000000
7.542000,0.058490,0.000000,0.058490,0.000000
7.560000,0.058490,0.000000,0.058490,0.000000
7.578000,0.058490,0.000000,0.058490,0.000000
7.596000,0.058490,0.000000,0.058490,0.000000
