// Time Position Current
0.0 0.8733651041984558 0.0
1.00355871886121 0.8733651041984558 0.0
2.00711743772242 0.8733651041984558 0.0
3.01067615658363 0.8733651041984558 0.029999999329447746
4.01423487544484 1.746727466583252 0.019999999552965164
5.017793594306051 2.6200900077819824 0.009999999776482582
6.02135231316726 3.493452310562134 0.009999999776482582
7.02491103202847 4.366814613342285 0.0
8.02846975088968 5.240177154541016 0.009999999776482582
9.032028469750891 5.240177154541016 0.009999999776482582
10.035587188612102 6.986902236938477 0.0
11.03914590747331 6.986902236938477 0.0
12.04270462633452 8.296945571899414 0.009999999776482582
13.046263345195731 8.296945571899414 0.009999999776482582
14.04982206405694 10.043670654296875 0.009999999776482582
15.05338078291815 10.043670654296875 0.009999999776482582
16.05693950177936 11.353713989257812 0.009999999776482582
17.06049822064057 12.227076530456543 0.0
18.064056939501782 13.100439071655273 0.019999999552965164
19.067615658362993 14.847164154052734 0.009999999776482582
20.071174377224203 14.847164154052734 0.009999999776482582
21.07473309608541 15.283844947814941 0.0
22.07829181494662 15.283844947814941 0.0
23.08185053380783 17.030569076538086 0.009999999776482582
24.08540925266904 17.030569076538086 0.009999999776482582
25.088967971530252 18.340614318847656 0.009999999776482582
26.092526690391463 20.087337493896484 0.009999999776482582
27.096085409252673 20.087337493896484 0.009999999776482582
28.09964412811388 21.834062576293945 0.009999999776482582
29.10320284697509 21.834062576293945 0.009999999776482582
30.1067615658363 22.27074432373047 0.009999999776482582
31.11032028469751 23.144107818603516 0.009999999776482582
32.11387900355872 24.890830993652344 0.009999999776482582
33.11743772241993 24.890830993652344 0.009999999776482582
34.12099644128114 26.200876235961914 0.009999999776482582
35.12455516014235 27.51091957092285 0.009999999776482582
36.128113879003564 27.51091957092285 0.009999999776482582
37.13167259786477 28.82096290588379 0.019999999552965164
38.135231316725985 30.131006240844727 0.0
39.13879003558719 31.00436782836914 0.009999999776482582
40.142348754448406 32.31441116333008 0.019999999552965164
41.14590747330961 32.31441116333008 0.019999999552965164
42.14946619217082 33.187774658203125 0.019999999552965164
43.153024911032034 34.93449783325195 0.009999999776482582
44.15658362989324 34.93449783325195 0.009999999776482582
45.160142348754455 36.244544982910156 0.009999999776482582
46.16370106761566 37.991268157958984 0.0
47.167259786476876 37.991268157958984 0.0
48.17081850533808 38.86463165283203 0.019999999552965164
49.17437722419929 39.30131149291992 0.009999999776482582
50.177935943060504 39.30131149291992 0.009999999776482582
51.18149466192171 40.61135482788086 0.05000000074505806
52.185053380782925 41.04803466796875 0.07000000029802322
53.18861209964413 41.04803466796875 0.07000000029802322
54.192170818505346 41.9213981628418 0.09000000357627869
55.19572953736655 41.9213981628418 0.09000000357627869
56.19928825622776 42.794761657714844 0.12999999523162842
57.202846975088974 42.794761657714844 0.14000000059604645
58.20640569395018 43.66812515258789 0.1599999964237213
59.209964412811395 44.10480499267578 0.18000000715255737
60.2135231316726 44.54148483276367 0.20999999344348907
61.217081850533816 44.97816848754883 0.20999999344348907
62.22064056939502 44.97816848754883 0.20999999344348907
63.22419928825624 45.85152816772461 0.20999999344348907
64.22775800711744 45.85152816772461 0.20999999344348907
65.23131672597866 46.288211822509766 0.23000000417232513
66.23487544483986 46.288211822509766 0.23000000417232513
67.23843416370107 47.16157531738281 0.27000001072883606
68.24199288256229 48.034934997558594 0.3400000035762787
69.2455516014235 48.034934997558594 0.3100000023841858
70.2491103202847 48.90829849243164 0.3100000023841858
71.25266903914591 49.34497833251953 0.3400000035762787
72.25622775800713 49.78166198730469 0.3700000047683716
73.25978647686833 49.78166198730469 0.3700000047683716
74.26334519572954 50.65502166748047 0.38999998569488525
75.26690391459076 50.65502166748047 0.38999998569488525
76.27046263345197 50.65502166748047 0.4000000059604645
77.27402135231317 50.65502166748047 0.4000000059604645
78.27758007117438 51.528385162353516 0.41999998688697815
79.2811387900356 51.528385162353516 0.41999998688697815
80.28469750889681 52.40174865722656 0.44999998807907104
81.28825622775801 52.40174865722656 0.44999998807907104
82.29181494661923 52.83842849731445 0.46000000834465027
83.29537366548044 53.27511215209961 0.5099999904632568
84.29893238434164 53.27511215209961 0.49000000953674316
85.30249110320285 53.27511215209961 0.49000000953674316
86.30604982206407 54.14847183227539 0.5299999713897705
87.30960854092528 54.14847183227539 0.5299999713897705
88.31316725978648 54.14847183227539 0.5299999713897705
89.3167259786477 54.14847183227539 0.5299999713897705
90.32028469750891 54.14847183227539 0.5299999713897705
91.32384341637011 54.14847183227539 0.5299999713897705
92.32740213523132 54.14847183227539 0.5299999713897705
93.33096085409254 54.14847183227539 0.5299999713897705
94.33451957295375 54.14847183227539 0.5299999713897705
95.33807829181495 54.14847183227539 0.5299999713897705
96.34163701067617 54.14847183227539 0.5299999713897705
97.34519572953738 54.14847183227539 0.5299999713897705
98.34875444839858 54.14847183227539 0.5299999713897705
99.3523131672598 54.14847183227539 0.5299999713897705
100.35587188612101 54.14847183227539 0.5299999713897705
101.35943060498222 54.14847183227539 0.5299999713897705
102.36298932384342 54.14847183227539 0.5299999713897705
103.36654804270464 54.14847183227539 0.5299999713897705
104.37010676156585 54.14847183227539 0.5299999713897705
105.37366548042705 54.14847183227539 0.5299999713897705
106.37722419928826 54.14847183227539 0.5299999713897705
107.38078291814948 54.14847183227539 0.5299999713897705
108.38434163701069 54.14847183227539 0.5299999713897705
109.38790035587189 54.14847183227539 0.5299999713897705
110.3914590747331 54.14847183227539 0.5299999713897705
111.39501779359432 54.14847183227539 0.5299999713897705
112.39857651245552 54.14847183227539 0.5299999713897705
113.40213523131673 54.14847183227539 0.5299999713897705
114.40569395017795 54.14847183227539 0.5299999713897705
115.40925266903916 54.14847183227539 0.5299999713897705
116.41281138790036 54.14847183227539 0.5299999713897705
117.41637010676158 54.14847183227539 0.5299999713897705
118.41992882562279 54.14847183227539 0.5299999713897705
119.423487544484 54.14847183227539 0.5299999713897705
120.4270462633452 54.14847183227539 0.5299999713897705
121.43060498220642 54.14847183227539 0.5299999713897705
122.43416370106763 54.14847183227539 0.5299999713897705
123.43772241992883 54.14847183227539 0.5299999713897705
124.44128113879005 54.14847183227539 0.5299999713897705
125.44483985765126 54.14847183227539 0.5299999713897705
126.44839857651247 54.14847183227539 0.5299999713897705
127.45195729537367 54.14847183227539 0.5299999713897705
128.4555160142349 54.14847183227539 0.5299999713897705
129.4590747330961 54.14847183227539 0.5299999713897705
130.46263345195732 54.14847183227539 0.5299999713897705
131.46619217081852 54.14847183227539 0.5299999713897705
132.46975088967972 54.14847183227539 0.5299999713897705
133.47330960854094 54.14847183227539 0.5299999713897705
134.47686832740214 54.14847183227539 0.5299999713897705
135.48042704626337 54.14847183227539 0.5299999713897705
136.48398576512457 54.14847183227539 0.5299999713897705
137.48754448398577 54.14847183227539 0.5299999713897705
138.491103202847 54.14847183227539 0.5299999713897705
139.4946619217082 54.14847183227539 0.5299999713897705
140.4982206405694 54.14847183227539 0.5299999713897705
141.50177935943063 54.14847183227539 0.5299999713897705
142.50533807829183 54.14847183227539 0.5299999713897705
143.50889679715303 54.14847183227539 0.5299999713897705
144.51245551601426 54.14847183227539 0.5299999713897705
145.51601423487546 54.14847183227539 0.5299999713897705
146.51957295373666 54.14847183227539 0.5299999713897705
147.52313167259788 54.14847183227539 0.5299999713897705
148.52669039145908 54.14847183227539 0.5299999713897705
149.5302491103203 54.14847183227539 0.5299999713897705
150.5338078291815 54.14847183227539 0.5299999713897705
151.5373665480427 54.14847183227539 0.5299999713897705
152.54092526690394 54.14847183227539 0.5299999713897705
153.54448398576514 54.14847183227539 0.5299999713897705
154.54804270462634 54.14847183227539 0.5299999713897705
155.55160142348757 54.14847183227539 0.5299999713897705
156.55516014234877 54.14847183227539 0.5299999713897705
157.55871886120997 54.14847183227539 0.5299999713897705
158.5622775800712 54.14847183227539 0.5299999713897705
159.5658362989324 54.14847183227539 0.5299999713897705
160.56939501779362 54.14847183227539 0.5299999713897705
161.57295373665482 54.14847183227539 0.5299999713897705
162.57651245551602 54.14847183227539 0.5299999713897705
163.58007117437725 54.14847183227539 0.5299999713897705
164.58362989323845 54.14847183227539 0.5299999713897705
165.58718861209965 54.14847183227539 0.5299999713897705
166.59074733096088 54.14847183227539 0.5299999713897705
167.59430604982208 54.14847183227539 0.5299999713897705
168.59786476868328 54.14847183227539 0.5299999713897705
169.6014234875445 54.14847183227539 0.5299999713897705
170.6049822064057 54.14847183227539 0.5299999713897705
171.6085409252669 54.14847183227539 0.5299999713897705
172.61209964412814 54.14847183227539 0.5299999713897705
173.61565836298934 54.14847183227539 0.5299999713897705
174.61921708185056 54.14847183227539 0.5299999713897705
175.62277580071176 59.388648986816406 0.05000000074505806
176.62633451957296 59.388648986816406 0.03999999910593033
177.6298932384342 59.388648986816406 0.03999999910593033
178.6334519572954 59.388648986816406 0.03999999910593033
179.6370106761566 59.388648986816406 0.05000000074505806
180.64056939501782 59.388648986816406 0.03999999910593033
181.64412811387902 59.388648986816406 0.05000000074505806
182.64768683274022 59.388648986816406 0.05000000074505806
183.65124555160145 59.388648986816406 0.05000000074505806
184.65480427046265 59.388648986816406 0.05000000074505806
185.65836298932385 59.388648986816406 0.05000000074505806
186.66192170818508 59.388648986816406 0.05000000074505806
187.66548042704628 59.388648986816406 0.05000000074505806
188.6690391459075 59.388648986816406 0.05000000074505806
189.6725978647687 59.388648986816406 0.05000000074505806
190.6761565836299 59.388648986816406 0.05000000074505806
191.67971530249113 59.388648986816406 0.05000000074505806
192.68327402135233 59.388648986816406 0.05000000074505806
193.68683274021353 59.388648986816406 0.05000000074505806
194.69039145907476 59.388648986816406 0.05000000074505806
195.69395017793596 59.388648986816406 0.05000000074505806
196.69750889679716 59.388648986816406 0.05000000074505806
197.7010676156584 59.388648986816406 0.05000000074505806
198.7046263345196 59.388648986816406 0.05000000074505806
199.70818505338082 59.388648986816406 0.05000000074505806
200.71174377224202 59.388648986816406 0.05000000074505806
201.71530249110322 59.388648986816406 0.05000000074505806
202.71886120996444 59.388648986816406 0.05000000074505806
203.72241992882564 59.388648986816406 0.05000000074505806
204.72597864768684 59.388648986816406 0.05000000074505806
205.72953736654807 59.388648986816406 0.05000000074505806
206.73309608540927 59.388648986816406 0.05000000074505806
207.73665480427047 59.388648986816406 0.05000000074505806
208.7402135231317 59.388648986816406 0.05000000074505806
209.7437722419929 59.388648986816406 0.05000000074505806
210.7473309608541 59.388648986816406 0.05000000074505806
211.75088967971533 59.388648986816406 0.05000000074505806
212.75444839857653 59.388648986816406 0.05000000074505806
213.75800711743776 59.388648986816406 0.05000000074505806
214.76156583629896 59.388648986816406 0.05000000074505806
215.76512455516016 59.388648986816406 0.05000000074505806
216.76868327402138 59.388648986816406 0.05000000074505806
217.77224199288258 59.388648986816406 0.05000000074505806
218.77580071174378 59.388648986816406 0.05000000074505806
219.779359430605 59.388648986816406 0.05000000074505806
220.7829181494662 59.388648986816406 0.05000000074505806
221.7864768683274 59.388648986816406 0.05000000074505806
222.79003558718864 59.388648986816406 0.05000000074505806
223.79359430604984 59.388648986816406 0.05000000074505806
224.79715302491104 59.388648986816406 0.05000000074505806
225.80071174377227 59.388648986816406 0.05000000074505806
226.80427046263347 59.388648986816406 0.05000000074505806
227.8078291814947 59.388648986816406 0.05000000074505806
228.8113879003559 59.388648986816406 0.05000000074505806
229.8149466192171 59.388648986816406 0.05000000074505806
230.81850533807832 59.388648986816406 0.05000000074505806
231.82206405693952 59.388648986816406 0.05000000074505806
232.82562277580072 59.388648986816406 0.05000000074505806
233.82918149466195 59.388648986816406 0.05000000074505806
234.83274021352315 59.388648986816406 0.05000000074505806
235.83629893238435 59.388648986816406 0.05000000074505806
236.83985765124558 59.388648986816406 0.05000000074505806
237.84341637010678 59.388648986816406 0.05000000074505806
238.846975088968 59.388648986816406 0.05000000074505806
239.8505338078292 59.388648986816406 0.05000000074505806
240.8540925266904 59.388648986816406 0.05000000074505806
241.85765124555164 59.388648986816406 0.05000000074505806
242.86120996441284 59.388648986816406 0.05000000074505806
243.86476868327404 59.388648986816406 0.05000000074505806
244.86832740213526 59.388648986816406 0.05000000074505806
245.87188612099646 59.388648986816406 0.05000000074505806
246.87544483985766 59.388648986816406 0.05000000074505806
247.8790035587189 59.388648986816406 0.05000000074505806
248.8825622775801 59.388648986816406 0.05000000074505806
249.8861209964413 59.388648986816406 0.05000000074505806
250.88967971530252 59.388648986816406 0.05000000074505806
251.89323843416372 59.388648986816406 0.05000000074505806
252.89679715302495 59.388648986816406 0.05000000074505806
253.90035587188615 59.388648986816406 0.05000000074505806
254.90391459074735 59.388648986816406 0.05000000074505806
255.90747330960858 59.388648986816406 0.05000000074505806
256.9110320284698 59.388648986816406 0.05000000074505806
257.914590747331 59.388648986816406 0.05000000074505806
258.9181494661922 59.388648986816406 0.05000000074505806
259.92170818505343 59.388648986816406 0.05000000074505806
260.92526690391463 59.388648986816406 0.05000000074505806
261.92882562277583 59.388648986816406 0.05000000074505806
262.93238434163703 59.388648986816406 0.05000000074505806
263.93594306049823 59.388648986816406 0.05000000074505806
264.93950177935943 59.388648986816406 0.05000000074505806
265.9430604982207 59.388648986816406 0.05000000074505806
266.9466192170819 59.388648986816406 0.05000000074505806
267.9501779359431 59.388648986816406 0.05000000074505806
268.9537366548043 59.388648986816406 0.05000000074505806
269.9572953736655 59.388648986816406 0.05000000074505806
270.96085409252674 59.388648986816406 0.05000000074505806
271.96441281138794 59.388648986816406 0.05000000074505806
272.96797153024914 59.388648986816406 0.05000000074505806
273.97153024911034 59.388648986816406 0.05000000074505806
274.97508896797154 59.388648986816406 0.05000000074505806
275.97864768683274 59.388648986816406 0.05000000074505806
276.982206405694 59.388648986816406 0.05000000074505806
277.9857651245552 59.388648986816406 0.05000000074505806
278.9893238434164 59.388648986816406 0.05000000074505806
279.9928825622776 59.388648986816406 0.05000000074505806
280.9964412811388 59.388648986816406 0.05000000074505806
282.0 59.388648986816406 0.05000000074505806
