// Time Position Current
0.0 0.8733651041984558 0.0
1.009090909090909 0.8733651041984558 0.0
2.018181818181818 1.746727466583252 0.03999999910593033
3.0272727272727273 1.746727466583252 0.03999999910593033
4.036363636363636 2.6200900077819824 0.009999999776482582
5.045454545454545 2.6200900077819824 0.009999999776482582
6.054545454545455 4.366814613342285 0.0
7.0636363636363635 5.240177154541016 0.009999999776482582
8.072727272727272 6.113539695739746 0.009999999776482582
9.081818181818182 7.860264301300049 0.009999999776482582
10.09090909090909 9.606988906860352 0.009999999776482582
11.1 9.606988906860352 0.009999999776482582
12.10909090909091 10.917033195495605 0.009999999776482582
13.118181818181817 10.917033195495605 0.009999999776482582
14.127272727272727 12.66375732421875 0.009999999776482582
15.136363636363635 12.66375732421875 0.009999999776482582
16.145454545454545 13.53711986541748 0.009999999776482582
17.154545454545453 13.53711986541748 0.009999999776482582
18.163636363636364 14.847164154052734 0.0
19.172727272727272 16.593889236450195 0.009999999776482582
20.18181818181818 16.593889236450195 0.009999999776482582
21.19090909090909 17.903932571411133 0.019999999552965164
22.2 17.903932571411133 0.019999999552965164
23.209090909090907 19.650657653808594 0.009999999776482582
24.21818181818182 19.650657653808594 0.009999999776482582
25.227272727272727 20.524019241333008 0.009999999776482582
26.236363636363635 20.524019241333008 0.009999999776482582
27.245454545454542 21.834062576293945 0.009999999776482582
28.254545454545454 21.834062576293945 0.009999999776482582
29.263636363636362 23.580787658691406 0.009999999776482582
30.27272727272727 24.454151153564453 0.0
31.28181818181818 24.890830993652344 0.019999999552965164
32.29090909090909 26.637556076049805 0.009999999776482582
33.3 26.637556076049805 0.009999999776482582
34.309090909090905 28.384281158447266 0.009999999776482582
35.31818181818181 28.384281158447266 0.009999999776482582
36.32727272727273 29.694324493408203 0.009999999776482582
37.336363636363636 30.56768798828125 0.009999999776482582
38.345454545454544 31.00436782836914 0.0
39.35454545454545 31.877731323242188 0.009999999776482582
40.36363636363636 33.624454498291016 0.019999999552965164
41.37272727272727 34.93449783325195 0.009999999776482582
42.38181818181818 34.93449783325195 0.009999999776482582
43.39090909090909 36.68122482299805 0.009999999776482582
44.4 36.68122482299805 0.009999999776482582
45.40909090909091 37.554588317871094 0.0
46.418181818181814 37.554588317871094 0.0
47.42727272727272 39.30131149291992 0.009999999776482582
48.43636363636364 39.73799133300781 0.029999999329447746
49.445454545454545 40.17467498779297 0.05999999865889549
50.45454545454545 40.61135482788086 0.07999999821186066
51.46363636363636 41.484718322753906 0.07999999821186066
52.47272727272727 41.484718322753906 0.07999999821186066
53.48181818181818 41.9213981628418 0.10999999940395355
54.490909090909085 41.9213981628418 0.10999999940395355
55.5 42.794761657714844 0.10999999940395355
56.50909090909091 42.794761657714844 0.10999999940395355
57.518181818181816 43.231441497802734 0.15000000596046448
58.527272727272724 43.231441497802734 0.15000000596046448
59.53636363636363 43.66812515258789 0.1899999976158142
60.54545454545454 43.66812515258789 0.1899999976158142
61.554545454545455 44.10480499267578 0.18000000715255737
62.56363636363636 44.10480499267578 0.18000000715255737
63.57272727272727 44.97816848754883 0.1899999976158142
64.58181818181818 45.85152816772461 0.20999999344348907
65.5909090909091 45.85152816772461 0.20000000298023224
66.6 46.724891662597656 0.23999999463558197
67.60909090909091 46.724891662597656 0.23999999463558197
68.61818181818181 47.16157531738281 0.27000001072883606
69.62727272727273 47.16157531738281 0.27000001072883606
70.63636363636363 47.5982551574707 0.30000001192092896
71.64545454545454 47.5982551574707 0.30000001192092896
72.65454545454546 48.034934997558594 0.3199999928474426
73.66363636363636 48.034934997558594 0.3199999928474426
74.67272727272727 48.90829849243164 0.3199999928474426
75.68181818181817 49.34497833251953 0.3400000035762787
76.69090909090909 49.34497833251953 0.3400000035762787
77.7 49.78166198730469 0.3400000035762787
78.7090909090909 49.78166198730469 0.3700000047683716
79.71818181818182 50.65502166748047 0.029999999329447746
80.72727272727272 50.65502166748047 0.029999999329447746
81.73636363636363 50.65502166748047 0.05000000074505806
82.74545454545454 50.65502166748047 0.05000000074505806
83.75454545454545 50.65502166748047 0.07999999821186066
84.76363636363637 50.65502166748047 0.10000000149011612
85.77272727272727 50.65502166748047 0.9900000095367432
86.78181818181818 51.091705322265625 0.029999999329447746
87.79090909090908 51.091705322265625 0.029999999329447746
88.8 51.091705322265625 0.05000000074505806
89.8090909090909 51.091705322265625 0.09000000357627869
90.81818181818181 51.091705322265625 0.10000000149011612
91.82727272727273 51.528385162353516 0.019999999552965164
92.83636363636363 51.528385162353516 0.019999999552965164
93.84545454545454 51.528385162353516 0.019999999552965164
94.85454545454544 51.528385162353516 0.05000000074505806
95.86363636363636 51.528385162353516 0.05999999865889549
96.87272727272727 51.528385162353516 0.09000000357627869
97.88181818181818 51.528385162353516 0.10999999940395355
98.89090909090909 51.965065002441406 0.019999999552965164
99.89999999999999 51.965065002441406 0.05000000074505806
100.9090909090909 51.965065002441406 0.07999999821186066
101.91818181818181 51.965065002441406 0.07999999821186066
102.92727272727272 51.965065002441406 0.10000000149011612
103.93636363636364 51.965065002441406 0.10000000149011612
104.94545454545454 52.40174865722656 0.019999999552965164
105.95454545454545 52.40174865722656 0.019999999552965164
106.96363636363635 52.40174865722656 0.05999999865889549
107.97272727272727 52.40174865722656 0.07000000029802322
108.98181818181817 52.40174865722656 0.07000000029802322
109.99090909090908 52.40174865722656 1.0
111.0 52.40174865722656 1.0
