digraph G {
"bracelet_link" -> "end_effector_link"[label="Broadcaster: /manipulator/robot_state_publisher\nAverage rate: 10000.000 Hz\nMost recent transform: 0.000 ( 1598625884.428 sec old)\nBuffer length: 0.000 sec\n"];
"spherical_wrist_2_link" -> "bracelet_link"[label="Broadcaster: /manipulator/robot_state_publisher\nAverage rate: 40.203 Hz\nMost recent transform: 1598625884.376 ( 0.052 sec old)\nBuffer length: 4.925 sec\n"];
"end_effector_link" -> "robotiq_arg2f_base_link"[label="Broadcaster: /manipulator/robot_state_publisher\nAverage rate: 10000.000 Hz\nMost recent transform: 0.000 ( 1598625884.428 sec old)\nBuffer length: 0.000 sec\n"];
"left_inner_finger" -> "left_inner_finger_pad"[label="Broadcaster: /manipulator/robot_state_publisher\nAverage rate: 10000.000 Hz\nMost recent transform: 0.000 ( 1598625884.428 sec old)\nBuffer length: 0.000 sec\n"];
"left_outer_finger" -> "left_inner_finger"[label="Broadcaster: /manipulator/robot_state_publisher\nAverage rate: 40.203 Hz\nMost recent transform: 1598625884.376 ( 0.052 sec old)\nBuffer length: 4.925 sec\n"];
"left_outer_knuckle" -> "left_outer_finger"[label="Broadcaster: /manipulator/robot_state_publisher\nAverage rate: 10000.000 Hz\nMost recent transform: 0.000 ( 1598625884.428 sec old)\nBuffer length: 0.000 sec\n"];
"robotiq_arg2f_base_link" -> "left_outer_knuckle"[label="Broadcaster: /manipulator/robot_state_publisher\nAverage rate: 40.203 Hz\nMost recent transform: 1598625884.376 ( 0.052 sec old)\nBuffer length: 4.925 sec\n"];
"right_inner_finger" -> "right_inner_finger_pad"[label="Broadcaster: /manipulator/robot_state_publisher\nAverage rate: 10000.000 Hz\nMost recent transform: 0.000 ( 1598625884.428 sec old)\nBuffer length: 0.000 sec\n"];
"right_outer_finger" -> "right_inner_finger"[label="Broadcaster: /manipulator/robot_state_publisher\nAverage rate: 40.203 Hz\nMost recent transform: 1598625884.376 ( 0.052 sec old)\nBuffer length: 4.925 sec\n"];
"right_outer_knuckle" -> "right_outer_finger"[label="Broadcaster: /manipulator/robot_state_publisher\nAverage rate: 10000.000 Hz\nMost recent transform: 0.000 ( 1598625884.428 sec old)\nBuffer length: 0.000 sec\n"];
"robotiq_arg2f_base_link" -> "right_outer_knuckle"[label="Broadcaster: /manipulator/robot_state_publisher\nAverage rate: 40.203 Hz\nMost recent transform: 1598625884.376 ( 0.052 sec old)\nBuffer length: 4.925 sec\n"];
"base_link" -> "camera_link_1"[label="Broadcaster: /kinova_melodic_handeyecalibration_1_eye_on_base/handeye_publisher_ws_kinova3_18_3893_243339365167375790\nAverage rate: 10000.000 Hz\nMost recent transform: 0.000 ( 1598625884.428 sec old)\nBuffer length: 0.000 sec\n"];
"base_link" -> "camera_link_0"[label="Broadcaster: /kinova_melodic_handeyecalibration_0_eye_on_base/handeye_publisher_ws_kinova3_18_3893_8342100370309048228\nAverage rate: 10000.000 Hz\nMost recent transform: 0.000 ( 1598625884.428 sec old)\nBuffer length: 0.000 sec\n"];
"base_link" -> "shoulder_link"[label="Broadcaster: /manipulator/robot_state_publisher\nAverage rate: 40.203 Hz\nMost recent transform: 1598625884.376 ( 0.052 sec old)\nBuffer length: 4.925 sec\n"];
"shoulder_link" -> "half_arm_1_link"[label="Broadcaster: /manipulator/robot_state_publisher\nAverage rate: 40.203 Hz\nMost recent transform: 1598625884.376 ( 0.052 sec old)\nBuffer length: 4.925 sec\n"];
"half_arm_1_link" -> "half_arm_2_link"[label="Broadcaster: /manipulator/robot_state_publisher\nAverage rate: 40.203 Hz\nMost recent transform: 1598625884.376 ( 0.052 sec old)\nBuffer length: 4.925 sec\n"];
"half_arm_2_link" -> "forearm_link"[label="Broadcaster: /manipulator/robot_state_publisher\nAverage rate: 40.203 Hz\nMost recent transform: 1598625884.376 ( 0.052 sec old)\nBuffer length: 4.925 sec\n"];
"forearm_link" -> "spherical_wrist_1_link"[label="Broadcaster: /manipulator/robot_state_publisher\nAverage rate: 40.203 Hz\nMost recent transform: 1598625884.376 ( 0.052 sec old)\nBuffer length: 4.925 sec\n"];
"spherical_wrist_1_link" -> "spherical_wrist_2_link"[label="Broadcaster: /manipulator/robot_state_publisher\nAverage rate: 40.203 Hz\nMost recent transform: 1598625884.376 ( 0.052 sec old)\nBuffer length: 4.925 sec\n"];
"robotiq_arg2f_base_link" -> "left_inner_knuckle"[label="Broadcaster: /manipulator/robot_state_publisher\nAverage rate: 40.203 Hz\nMost recent transform: 1598625884.376 ( 0.052 sec old)\nBuffer length: 4.925 sec\n"];
"robotiq_arg2f_base_link" -> "right_inner_knuckle"[label="Broadcaster: /manipulator/robot_state_publisher\nAverage rate: 40.203 Hz\nMost recent transform: 1598625884.376 ( 0.052 sec old)\nBuffer length: 4.925 sec\n"];
"camera_link_0" -> "6Dpose_cam_0_object_0"[label="Broadcaster: /camera_broadcaster\nAverage rate: 22.544 Hz\nMost recent transform: 1598625884.425 ( 0.002 sec old)\nBuffer length: 4.968 sec\n"];
"6Dpose_cam_0_object_0" -> "grasping_cam_0_object_0"[label="Broadcaster: /camera_broadcaster\nAverage rate: 22.544 Hz\nMost recent transform: 1598625884.426 ( 0.002 sec old)\nBuffer length: 4.968 sec\n"];
"6Dpose_cam_0_object_0" -> "grasping_object_-1"[label="Broadcaster: /camera_broadcaster\nAverage rate: 22.544 Hz\nMost recent transform: 1598625884.426 ( 0.002 sec old)\nBuffer length: 4.968 sec\n"];
"camera_link_1" -> "6Dpose_cam_1_object_0"[label="Broadcaster: /camera_broadcaster\nAverage rate: 22.531 Hz\nMost recent transform: 1598625884.400 ( 0.027 sec old)\nBuffer length: 4.927 sec\n"];
"6Dpose_cam_1_object_0" -> "grasping_cam_1_object_0"[label="Broadcaster: /camera_broadcaster\nAverage rate: 22.530 Hz\nMost recent transform: 1598625884.401 ( 0.027 sec old)\nBuffer length: 4.927 sec\n"];
edge [style=invis];
 subgraph cluster_legend { style=bold; color=black; label ="view_frames Result";
"Recorded at time: 1598625884.428"[ shape=plaintext ] ;
 }->"base_link";
}