// Time Position Current
0.0 0.8733651041984558 0.0
1.01 0.8733651041984558 0.0
2.02 0.8733651041984558 0.0
3.0300000000000002 0.8733651041984558 0.0
4.04 2.183408737182617 0.019999999552965164
5.05 2.6200900077819824 0.009999999776482582
6.0600000000000005 3.493452310562134 0.009999999776482582
7.07 5.240177154541016 0.009999999776482582
8.08 5.240177154541016 0.009999999776482582
9.09 6.986902236938477 0.019999999552965164
10.1 7.860264301300049 0.019999999552965164
11.11 8.733627319335938 0.009999999776482582
12.120000000000001 9.170308113098145 0.0
13.13 10.043670654296875 0.009999999776482582
14.14 10.917033195495605 0.019999999552965164
15.15 12.66375732421875 0.019999999552965164
16.16 12.66375732421875 0.019999999552965164
17.17 13.100439071655273 0.009999999776482582
18.18 13.100439071655273 0.009999999776482582
19.19 14.847164154052734 0.009999999776482582
20.2 14.847164154052734 0.009999999776482582
21.21 16.157207489013672 0.009999999776482582
22.22 16.157207489013672 0.009999999776482582
23.23 17.903932571411133 0.0
24.240000000000002 18.777294158935547 0.009999999776482582
25.25 19.650657653808594 0.009999999776482582
26.26 20.96070098876953 0.019999999552965164
27.27 20.96070098876953 0.019999999552965164
28.28 22.707426071166992 0.019999999552965164
29.29 22.707426071166992 0.019999999552965164
30.3 24.454151153564453 0.009999999776482582
31.31 24.454151153564453 0.009999999776482582
32.32 24.890830993652344 0.0
33.33 24.890830993652344 0.0
34.34 26.637556076049805 0.009999999776482582
35.35 26.637556076049805 0.009999999776482582
36.36 27.947599411010742 0.019999999552965164
37.37 28.82096290588379 0.009999999776482582
38.38 29.694324493408203 0.009999999776482582
39.39 31.441049575805664 0.0
40.4 31.441049575805664 0.0
41.410000000000004 32.31441116333008 0.009999999776482582
42.42 32.31441116333008 0.009999999776482582
43.43 34.06113815307617 0.0
44.44 35.37118148803711 0.009999999776482582
45.45 37.11790466308594 0.0
46.46 38.427947998046875 0.019999999552965164
47.47 38.86463165283203 0.019999999552965164
48.480000000000004 39.30131149291992 0.029999999329447746
49.49 40.17467498779297 0.05999999865889549
50.5 40.17467498779297 0.05999999865889549
51.51 41.04803466796875 0.05999999865889549
52.52 41.484718322753906 0.07000000029802322
53.53 41.9213981628418 0.07999999821186066
54.54 41.9213981628418 0.07999999821186066
55.55 41.9213981628418 0.09000000357627869
56.56 41.9213981628418 0.09000000357627869
57.57 42.794761657714844 0.12999999523162842
58.58 42.794761657714844 0.15000000596046448
59.59 43.231441497802734 0.1899999976158142
60.6 43.66812515258789 0.18000000715255737
61.61 43.66812515258789 0.18000000715255737
62.62 44.10480499267578 0.1899999976158142
63.63 44.10480499267578 0.1899999976158142
64.64 44.97816848754883 0.20999999344348907
65.65 45.41484832763672 0.2199999988079071
66.66 45.85152816772461 0.23999999463558197
67.67 45.85152816772461 0.25
68.68 46.288211822509766 0.25
69.69 46.724891662597656 0.27000001072883606
70.7 46.724891662597656 0.27000001072883606
71.71 47.16157531738281 0.28999999165534973
72.72 47.16157531738281 0.28999999165534973
73.73 47.5982551574707 0.3199999928474426
74.74 48.034934997558594 0.33000001311302185
75.75 48.47161865234375 0.33000001311302185
76.76 48.90829849243164 0.36000001430511475
77.77 48.90829849243164 0.36000001430511475
78.78 49.34497833251953 0.3799999952316284
79.79 49.34497833251953 0.3799999952316284
80.8 49.78166198730469 0.4099999964237213
81.81 50.21834182739258 0.019999999552965164
82.82000000000001 50.21834182739258 0.03999999910593033
83.83 50.21834182739258 0.05999999865889549
84.84 50.21834182739258 0.07999999821186066
85.85 50.21834182739258 0.07999999821186066
86.86 50.21834182739258 0.10999999940395355
87.87 50.21834182739258 0.10999999940395355
88.88 50.65502166748047 0.009999999776482582
89.89 50.65502166748047 0.009999999776482582
90.9 50.65502166748047 0.05999999865889549
91.91 50.65502166748047 0.05999999865889549
92.92 50.65502166748047 0.09000000357627869
93.93 51.091705322265625 0.009999999776482582
94.94 51.091705322265625 0.009999999776482582
95.95 51.091705322265625 0.03999999910593033
96.96000000000001 51.091705322265625 0.03999999910593033
97.97 51.091705322265625 0.07999999821186066
98.98 51.091705322265625 0.07999999821186066
99.99 51.528385162353516 1.0
101.0 51.528385162353516 1.0
