Time: 2021-May-14-14-30, Measurement number 1 with weight -0.051255569128
Time: 2021-May-14-14-32, Measurement number 1 with weight -0.0802722502945
Time: 2021-May-14-14-36, Measurement number 1 with weight 0.0132368655704
Time: 2021-May-14-14-36, Measurement number 2 with weight 0.00745792204366
Time: 2021-May-14-14-40, Measurement number 1 with weight 0.0192092119928
Time: 2021-May-14-14-41, Measurement number 2 with weight 0.011196939532
Time: 2021-May-14-14-43, Measurement number 1 with weight 0.149077666304
Time: 2021-May-14-14-43, Measurement number 2 with weight 0.142075977387
Time: 2021-May-14-14-45, Measurement number 1 with weight 6.22828102676
Time: 2021-May-14-14-46, Measurement number 2 with weight 6.59437542686
Time: 2021-May-14-14-47, Measurement number 1 with weight 0.0373016425627
Time: 2021-May-14-14-47, Measurement number 2 with weight 0.415153362511
Time: 2021-May-14-14-57, Measurement number 1 with weight 0.29163798528
Time: 2021-May-14-14-57, Measurement number 2 with weight 0.673531626481
Time: 2021-May-14-15-04, Measurement number 1 with weight 0.0587754457019
Time: 2021-May-14-15-04, Measurement number 2 with weight 0.444402464217
Time: 2021-May-14-15-43, Measurement number 1 with weight 0.0561929669058
Time: 2021-May-14-15-44, Measurement number 2 with weight 0.439474397006
Time: 2021-May-14-15-45, Measurement number 1 with weight 0.0344718993014
Time: 2021-May-14-15-45, Measurement number 2 with weight 0.416320146926
Time: 2021-May-19-11-39, Measurement number 1 with weight 0.200123130849
Time: 2021-May-19-11-39, Measurement number 2 with weight 0.595600567833
