// Time Position Current
0.0 0.8733651041984558 0.0
1.0114942528735633 0.8733651041984558 0.0
2.0229885057471266 0.8733651041984558 0.0
3.03448275862069 0.8733651041984558 0.0
4.045977011494253 0.8733651041984558 0.0
5.057471264367816 0.8733651041984558 0.0
6.06896551724138 0.8733651041984558 0.0
7.080459770114944 0.8733651041984558 0.0
8.091954022988507 0.8733651041984558 0.0
9.10344827586207 0.8733651041984558 0.0
10.114942528735632 0.8733651041984558 0.0
11.126436781609197 0.8733651041984558 0.0
12.13793103448276 0.8733651041984558 0.0
13.149425287356323 0.8733651041984558 0.0
14.160919540229887 0.8733651041984558 0.0
15.17241379310345 0.8733651041984558 0.0
16.183908045977013 0.8733651041984558 0.0
17.195402298850578 0.8733651041984558 0.0
18.20689655172414 0.8733651041984558 0.0
19.218390804597703 0.8733651041984558 0.0
20.229885057471265 0.8733651041984558 0.0
21.24137931034483 0.8733651041984558 0.0
22.252873563218394 0.8733651041984558 0.0
23.264367816091955 0.8733651041984558 0.0
24.27586206896552 0.8733651041984558 0.0
25.287356321839084 0.8733651041984558 0.0
26.298850574712645 0.8733651041984558 0.0
27.31034482758621 29.694324493408203 0.009999999776482582
28.321839080459775 31.441049575805664 0.009999999776482582
29.333333333333336 32.31441116333008 0.009999999776482582
30.3448275862069 33.187774658203125 0.009999999776482582
31.35632183908046 34.06113815307617 0.009999999776482582
32.367816091954026 34.93449783325195 0.019999999552965164
33.37931034482759 34.93449783325195 0.019999999552965164
34.390804597701155 35.807861328125 0.0
35.40229885057472 37.11790466308594 0.019999999552965164
36.41379310344828 37.991268157958984 0.009999999776482582
37.425287356321846 38.427947998046875 0.009999999776482582
38.43678160919541 38.86463165283203 0.019999999552965164
39.44827586206897 39.30131149291992 0.029999999329447746
40.45977011494253 39.30131149291992 0.029999999329447746
41.4712643678161 39.73799133300781 0.03999999910593033
42.48275862068966 39.73799133300781 0.03999999910593033
43.49425287356322 40.61135482788086 0.09000000357627869
44.50574712643679 41.04803466796875 0.07000000029802322
45.51724137931035 41.9213981628418 0.10000000149011612
46.52873563218391 41.9213981628418 0.10000000149011612
47.54022988505748 41.9213981628418 0.10999999940395355
48.55172413793104 42.794761657714844 0.14000000059604645
49.5632183908046 42.794761657714844 0.14000000059604645
50.57471264367817 43.66812515258789 0.1599999964237213
51.58620689655173 44.10480499267578 0.1899999976158142
52.59770114942529 44.54148483276367 0.20000000298023224
53.60919540229886 44.54148483276367 0.20000000298023224
54.62068965517242 45.41484832763672 0.2199999988079071
55.63218390804598 45.85152816772461 0.2199999988079071
56.64367816091955 45.85152816772461 0.2199999988079071
57.65517241379311 46.724891662597656 0.23999999463558197
58.66666666666667 46.724891662597656 0.27000001072883606
59.67816091954023 47.16157531738281 0.2800000011920929
60.6896551724138 47.16157531738281 0.2800000011920929
61.70114942528736 47.5982551574707 0.30000001192092896
62.71264367816092 48.47161865234375 0.3100000023841858
63.72413793103449 48.47161865234375 0.3100000023841858
64.73563218390805 48.90829849243164 0.3400000035762787
65.74712643678161 48.90829849243164 0.3400000035762787
66.75862068965517 49.34497833251953 0.3499999940395355
67.77011494252874 49.34497833251953 0.3499999940395355
68.78160919540231 49.78166198730469 0.3799999952316284
69.79310344827587 50.21834182739258 0.4000000059604645
70.80459770114943 50.65502166748047 0.4000000059604645
71.816091954023 51.528385162353516 0.4300000071525574
72.82758620689656 51.528385162353516 0.4300000071525574
73.83908045977012 51.965065002441406 0.4300000071525574
74.85057471264369 51.965065002441406 0.4300000071525574
75.86206896551725 52.40174865722656 0.4399999976158142
76.87356321839081 52.40174865722656 0.4399999976158142
77.88505747126437 53.27511215209961 0.44999998807907104
78.89655172413794 53.27511215209961 0.44999998807907104
79.9080459770115 53.7117919921875 0.5
80.91954022988506 53.7117919921875 0.5
81.93103448275863 54.14847183227539 0.5199999809265137
82.9425287356322 54.14847183227539 0.5199999809265137
83.95402298850576 55.02183532714844 0.5299999713897705
84.96551724137932 55.45851516723633 0.550000011920929
85.97701149425288 55.45851516723633 0.5699999928474426
86.98850574712644 56.331878662109375 1.0
88.0 56.331878662109375 0.029999999329447746
