// Time Position Current
0.0 0.8733651041984558 0.0
1.0103092783505154 0.8733651041984558 0.0
2.020618556701031 0.8733651041984558 0.0
3.0309278350515463 0.8733651041984558 0.0
4.041237113402062 2.183408737182617 0.019999999552965164
5.051546391752577 2.183408737182617 0.019999999552965164
6.061855670103093 3.493452310562134 0.009999999776482582
7.072164948453608 5.240177154541016 0.0
8.082474226804123 6.113539695739746 0.0
9.092783505154639 6.113539695739746 0.009999999776482582
10.103092783505154 6.986902236938477 0.009999999776482582
11.11340206185567 7.860264301300049 0.009999999776482582
12.123711340206185 7.860264301300049 0.009999999776482582
13.1340206185567 9.606988906860352 0.009999999776482582
14.144329896907216 9.606988906860352 0.009999999776482582
15.154639175257731 10.917033195495605 0.0
16.164948453608247 12.66375732421875 0.009999999776482582
17.175257731958762 13.53711986541748 0.0
18.185567010309278 14.847164154052734 0.009999999776482582
19.195876288659793 15.720526695251465 0.009999999776482582
20.20618556701031 17.46725082397461 0.009999999776482582
21.216494845360824 17.46725082397461 0.009999999776482582
22.22680412371134 17.903932571411133 0.009999999776482582
23.237113402061855 19.650657653808594 0.009999999776482582
24.24742268041237 19.650657653808594 0.009999999776482582
25.257731958762886 21.397382736206055 0.009999999776482582
26.2680412371134 21.834062576293945 0.019999999552965164
27.278350515463917 23.144107818603516 0.009999999776482582
28.288659793814432 23.580787658691406 0.019999999552965164
29.298969072164947 24.454151153564453 0.009999999776482582
30.309278350515463 26.200876235961914 0.009999999776482582
31.31958762886598 26.200876235961914 0.009999999776482582
32.329896907216494 27.074237823486328 0.009999999776482582
33.34020618556701 28.384281158447266 0.019999999552965164
34.350515463917525 29.257644653320312 0.009999999776482582
35.360824742268036 30.131006240844727 0.009999999776482582
36.371134020618555 31.877731323242188 0.009999999776482582
37.381443298969074 31.877731323242188 0.009999999776482582
38.391752577319586 33.187774658203125 0.009999999776482582
39.4020618556701 33.187774658203125 0.009999999776482582
40.41237113402062 34.06113815307617 0.0
41.422680412371136 34.06113815307617 0.0
42.43298969072165 34.49781799316406 0.009999999776482582
43.44329896907216 34.49781799316406 0.009999999776482582
44.45360824742268 37.11790466308594 0.009999999776482582
45.4639175257732 38.86463165283203 0.009999999776482582
46.47422680412371 38.86463165283203 0.009999999776482582
47.48453608247422 39.30131149291992 0.019999999552965164
48.49484536082474 39.73799133300781 0.05000000074505806
49.50515463917526 39.73799133300781 0.05000000074505806
50.51546391752577 40.61135482788086 0.07000000029802322
51.52577319587628 41.484718322753906 0.05000000074505806
52.5360824742268 41.484718322753906 0.09000000357627869
53.54639175257732 41.9213981628418 0.11999999731779099
54.55670103092783 42.35808181762695 0.10000000149011612
55.567010309278345 42.794761657714844 0.14000000059604645
56.577319587628864 43.231441497802734 0.15000000596046448
57.58762886597938 43.66812515258789 0.17000000178813934
58.597938144329895 43.66812515258789 0.17000000178813934
59.60824742268041 44.54148483276367 0.20000000298023224
60.618556701030926 44.97816848754883 0.20000000298023224
61.628865979381445 45.85152816772461 0.20999999344348907
62.63917525773196 46.288211822509766 0.23000000417232513
63.64948453608247 46.288211822509766 0.20999999344348907
64.65979381443299 46.724891662597656 0.23999999463558197
65.6701030927835 47.16157531738281 0.25
66.68041237113403 47.5982551574707 0.30000001192092896
67.69072164948453 47.5982551574707 0.30000001192092896
68.70103092783505 48.034934997558594 0.2800000011920929
69.71134020618557 48.034934997558594 0.2800000011920929
70.72164948453607 48.90829849243164 0.3199999928474426
71.73195876288659 48.90829849243164 0.3199999928474426
72.74226804123711 49.34497833251953 0.3700000047683716
73.75257731958763 49.34497833251953 0.3700000047683716
74.76288659793815 49.78166198730469 0.3400000035762787
75.77319587628865 49.78166198730469 0.3400000035762787
76.78350515463917 50.65502166748047 0.38999998569488525
77.79381443298969 51.091705322265625 0.4000000059604645
78.8041237113402 51.528385162353516 0.41999998688697815
79.81443298969072 51.965065002441406 0.4099999964237213
80.82474226804123 52.40174865722656 0.41999998688697815
81.83505154639175 52.83842849731445 0.4399999976158142
82.84536082474227 53.27511215209961 0.46000000834465027
83.85567010309278 53.27511215209961 0.46000000834465027
84.8659793814433 53.7117919921875 0.49000000953674316
85.87628865979381 53.7117919921875 0.49000000953674316
86.88659793814432 54.14847183227539 0.5199999809265137
87.89690721649484 55.02183532714844 0.5299999713897705
88.90721649484536 55.45851516723633 0.5400000214576721
89.91752577319588 55.895198822021484 0.550000011920929
90.9278350515464 56.331878662109375 0.5899999737739563
91.9381443298969 56.768558502197266 0.029999999329447746
92.94845360824742 56.768558502197266 0.029999999329447746
93.95876288659794 56.768558502197266 0.05000000074505806
94.96907216494844 56.768558502197266 0.07999999821186066
95.97938144329896 56.768558502197266 0.07999999821186066
96.98969072164948 56.768558502197266 1.0
98.0 56.768558502197266 1.0
