// Time Position Current
0.0 0.8733651041984558 0.0
1.0083333333333333 0.8733651041984558 0.0
2.0166666666666666 0.8733651041984558 0.029999999329447746
3.025 0.8733651041984558 0.029999999329447746
4.033333333333333 1.746727466583252 0.029999999329447746
5.041666666666666 2.6200900077819824 0.009999999776482582
6.05 4.366814613342285 0.0
7.058333333333334 4.366814613342285 0.0
8.066666666666666 6.113539695739746 0.0
9.075 6.113539695739746 0.0
10.083333333333332 7.860264301300049 0.0
11.091666666666667 9.170308113098145 0.009999999776482582
12.1 10.043670654296875 0.019999999552965164
13.108333333333333 10.043670654296875 0.019999999552965164
14.116666666666667 10.917033195495605 0.019999999552965164
15.125 11.790395736694336 0.009999999776482582
16.133333333333333 13.100439071655273 0.009999999776482582
17.141666666666666 13.100439071655273 0.009999999776482582
18.15 14.847164154052734 0.009999999776482582
19.15833333333333 14.847164154052734 0.009999999776482582
20.166666666666664 16.593889236450195 0.019999999552965164
21.175 16.593889236450195 0.019999999552965164
22.183333333333334 17.030569076538086 0.019999999552965164
23.191666666666666 17.903932571411133 0.009999999776482582
24.2 18.777294158935547 0.009999999776482582
25.208333333333332 19.650657653808594 0.009999999776482582
26.216666666666665 20.087337493896484 0.009999999776482582
27.224999999999998 21.834062576293945 0.009999999776482582
28.233333333333334 21.834062576293945 0.009999999776482582
29.241666666666667 22.707426071166992 0.009999999776482582
30.25 23.580787658691406 0.009999999776482582
31.258333333333333 24.890830993652344 0.019999999552965164
32.266666666666666 26.637556076049805 0.009999999776482582
33.275 26.637556076049805 0.009999999776482582
34.28333333333333 26.637556076049805 0.009999999776482582
35.291666666666664 27.51091957092285 0.009999999776482582
36.3 28.82096290588379 0.009999999776482582
37.30833333333333 28.82096290588379 0.009999999776482582
38.31666666666666 30.56768798828125 0.0
39.324999999999996 30.56768798828125 0.0
40.33333333333333 32.31441116333008 0.019999999552965164
41.34166666666667 32.751094818115234 0.029999999329447746
42.35 33.624454498291016 0.009999999776482582
43.358333333333334 33.624454498291016 0.009999999776482582
44.36666666666667 34.49781799316406 0.009999999776482582
45.375 35.807861328125 0.009999999776482582
46.38333333333333 35.807861328125 0.009999999776482582
47.391666666666666 37.554588317871094 0.009999999776482582
48.4 37.554588317871094 0.009999999776482582
49.40833333333333 39.30131149291992 0.019999999552965164
50.416666666666664 39.30131149291992 0.019999999552965164
51.425 40.17467498779297 0.009999999776482582
52.43333333333333 41.9213981628418 0.009999999776482582
53.44166666666666 41.9213981628418 0.009999999776482582
54.449999999999996 43.231441497802734 0.009999999776482582
55.45833333333333 43.231441497802734 0.009999999776482582
56.46666666666667 44.54148483276367 0.009999999776482582
57.475 44.54148483276367 0.009999999776482582
58.483333333333334 46.288211822509766 0.009999999776482582
59.49166666666667 46.288211822509766 0.009999999776482582
60.5 47.16157531738281 0.009999999776482582
61.50833333333333 47.5982551574707 0.009999999776482582
62.516666666666666 48.90829849243164 0.0
63.525 50.21834182739258 0.009999999776482582
64.53333333333333 50.21834182739258 0.009999999776482582
65.54166666666667 51.528385162353516 0.009999999776482582
66.55 51.528385162353516 0.009999999776482582
67.55833333333334 53.27511215209961 0.009999999776482582
68.56666666666666 54.14847183227539 0.0
69.575 54.14847183227539 0.0
70.58333333333333 55.895198822021484 0.009999999776482582
71.59166666666667 55.895198822021484 0.009999999776482582
72.6 57.20524215698242 0.009999999776482582
73.60833333333333 57.20524215698242 0.009999999776482582
74.61666666666666 58.95196533203125 0.0
75.625 58.95196533203125 0.0
76.63333333333333 59.8253288269043 0.0
77.64166666666667 61.135372161865234 0.009999999776482582
78.64999999999999 61.135372161865234 0.009999999776482582
79.65833333333333 62.88209533691406 0.0
80.66666666666666 62.88209533691406 0.0
81.675 64.192138671875 0.009999999776482582
82.68333333333334 65.9388656616211 0.009999999776482582
83.69166666666666 65.9388656616211 0.009999999776482582
84.7 67.68559265136719 0.009999999776482582
85.70833333333333 68.12226867675781 0.009999999776482582
86.71666666666667 68.12226867675781 0.009999999776482582
87.725 69.8689956665039 0.0
88.73333333333333 69.8689956665039 0.0
89.74166666666666 71.61572265625 0.009999999776482582
90.75 71.61572265625 0.009999999776482582
91.75833333333333 72.92576599121094 0.0
92.76666666666667 72.92576599121094 0.0
93.77499999999999 74.67249298095703 0.0
94.78333333333333 74.67249298095703 0.0
95.79166666666666 75.54585266113281 0.019999999552965164
96.8 75.54585266113281 0.019999999552965164
97.80833333333334 76.85589599609375 0.0
98.81666666666666 77.72925567626953 0.009999999776482582
99.825 78.60262298583984 0.009999999776482582
100.83333333333333 80.3493423461914 0.019999999552965164
101.84166666666667 80.3493423461914 0.019999999552965164
102.85 81.65938568115234 0.009999999776482582
103.85833333333333 81.65938568115234 0.009999999776482582
104.86666666666666 83.40611267089844 0.0
105.875 83.40611267089844 0.0
106.88333333333333 84.27947998046875 0.0
107.89166666666667 84.71615600585938 0.0
108.89999999999999 85.58952331542969 0.009999999776482582
109.90833333333333 87.33624267578125 0.009999999776482582
110.91666666666666 87.33624267578125 0.009999999776482582
111.925 88.64628601074219 0.009999999776482582
112.93333333333334 90.39301300048828 0.0
113.94166666666666 91.70305633544922 0.0
114.95 92.576416015625 0.0
115.95833333333333 93.44978332519531 0.009999999776482582
116.96666666666667 94.3231430053711 0.0
117.975 95.1965103149414 0.0
118.98333333333333 95.1965103149414 0.0
119.99166666666666 96.94322967529297 0.009999999776482582
121.0 98.2532730102539 0.009999999776482582
