// Time Position Current
0.0 0.8733651041984558 0.0
1.0081967213114753 0.8733651041984558 0.0
2.0163934426229506 0.8733651041984558 0.0
3.024590163934426 0.8733651041984558 0.029999999329447746
4.032786885245901 1.746727466583252 0.03999999910593033
5.0409836065573765 3.493452310562134 0.009999999776482582
6.049180327868852 3.493452310562134 0.009999999776482582
7.057377049180327 5.676858425140381 0.009999999776482582
8.065573770491802 5.676858425140381 0.009999999776482582
9.073770491803277 6.986902236938477 0.009999999776482582
10.081967213114753 6.986902236938477 0.009999999776482582
11.09016393442623 8.296945571899414 0.009999999776482582
12.098360655737704 8.296945571899414 0.009999999776482582
13.106557377049178 9.170308113098145 0.019999999552965164
14.114754098360654 9.170308113098145 0.019999999552965164
15.12295081967213 10.480351448059082 0.009999999776482582
16.131147540983605 11.353713989257812 0.009999999776482582
17.13934426229508 12.227076530456543 0.009999999776482582
18.147540983606554 13.973801612854004 0.0
19.15573770491803 13.973801612854004 0.0
20.163934426229506 15.283844947814941 0.009999999776482582
21.17213114754098 15.283844947814941 0.009999999776482582
22.18032786885246 17.030569076538086 0.009999999776482582
23.188524590163933 17.030569076538086 0.009999999776482582
24.196721311475407 18.340614318847656 0.0
25.204918032786882 18.340614318847656 0.0
26.213114754098356 19.21397590637207 0.009999999776482582
27.221311475409834 19.21397590637207 0.009999999776482582
28.22950819672131 20.96070098876953 0.019999999552965164
29.237704918032783 21.834062576293945 0.009999999776482582
30.24590163934426 22.27074432373047 0.009999999776482582
31.254098360655735 24.454151153564453 0.009999999776482582
32.26229508196721 24.454151153564453 0.009999999776482582
33.27049180327869 25.76419448852539 0.009999999776482582
34.27868852459016 25.76419448852539 0.009999999776482582
35.28688524590164 27.074237823486328 0.009999999776482582
36.29508196721311 27.074237823486328 0.009999999776482582
37.303278688524586 28.82096290588379 0.019999999552965164
38.31147540983606 28.82096290588379 0.019999999552965164
39.319672131147534 29.694324493408203 0.029999999329447746
40.32786885245901 29.694324493408203 0.029999999329447746
41.33606557377049 31.00436782836914 0.009999999776482582
42.34426229508196 31.00436782836914 0.009999999776482582
43.35245901639344 32.751094818115234 0.019999999552965164
44.36065573770492 33.624454498291016 0.009999999776482582
45.36885245901639 34.49781799316406 0.009999999776482582
46.377049180327866 34.93449783325195 0.0
47.38524590163934 35.807861328125 0.009999999776482582
48.393442622950815 37.554588317871094 0.009999999776482582
49.40163934426229 37.554588317871094 0.009999999776482582
50.409836065573764 38.86463165283203 0.009999999776482582
51.41803278688524 38.86463165283203 0.009999999776482582
52.42622950819671 39.73799133300781 0.029999999329447746
53.43442622950819 39.73799133300781 0.029999999329447746
54.44262295081967 40.17467498779297 0.07999999821186066
55.45081967213114 40.17467498779297 0.07999999821186066
56.45901639344262 41.04803466796875 0.07999999821186066
57.467213114754095 41.04803466796875 0.07999999821186066
58.475409836065566 41.484718322753906 0.07999999821186066
59.483606557377044 41.484718322753906 0.07999999821186066
60.49180327868852 42.35808181762695 0.10999999940395355
61.49999999999999 42.794761657714844 0.12999999523162842
62.50819672131147 43.231441497802734 0.14000000059604645
63.51639344262294 43.231441497802734 0.1599999964237213
64.52459016393442 43.66812515258789 0.17000000178813934
65.5327868852459 43.66812515258789 0.17000000178813934
66.54098360655738 44.97816848754883 0.1899999976158142
67.54918032786884 45.41484832763672 0.25999999046325684
68.55737704918032 45.41484832763672 0.25999999046325684
69.5655737704918 46.288211822509766 0.20999999344348907
70.57377049180327 46.724891662597656 0.2199999988079071
71.58196721311475 46.724891662597656 0.23000000417232513
72.59016393442622 47.16157531738281 0.23999999463558197
73.5983606557377 47.5982551574707 0.25999999046325684
74.60655737704917 48.034934997558594 0.27000001072883606
75.61475409836065 48.034934997558594 0.27000001072883606
76.62295081967213 48.47161865234375 0.27000001072883606
77.6311475409836 48.47161865234375 0.27000001072883606
78.63934426229507 49.34497833251953 0.30000001192092896
79.64754098360655 49.34497833251953 0.30000001192092896
80.65573770491802 49.78166198730469 0.3499999940395355
81.6639344262295 50.21834182739258 0.3499999940395355
82.67213114754098 50.21834182739258 0.3700000047683716
83.68032786885244 51.091705322265625 0.4099999964237213
84.68852459016392 51.965065002441406 0.4000000059604645
85.6967213114754 51.965065002441406 0.4000000059604645
86.70491803278688 52.40174865722656 0.4000000059604645
87.71311475409836 52.40174865722656 0.4000000059604645
88.72131147540983 53.27511215209961 0.4699999988079071
89.7295081967213 53.27511215209961 0.41999998688697815
90.73770491803278 53.7117919921875 0.44999998807907104
91.74590163934425 54.14847183227539 0.4699999988079071
92.75409836065573 54.14847183227539 0.4699999988079071
93.76229508196721 54.58515548706055 0.5
94.77049180327867 54.58515548706055 0.5
95.77868852459015 55.45851516723633 0.5199999809265137
96.78688524590163 55.895198822021484 0.5299999713897705
97.79508196721311 55.895198822021484 0.5299999713897705
98.80327868852459 56.768558502197266 0.5799999833106995
99.81147540983605 56.768558502197266 0.5899999737739563
100.81967213114753 57.20524215698242 0.6100000143051147
101.827868852459 57.64192199707031 0.6100000143051147
102.83606557377048 58.51528549194336 0.6299999952316284
103.84426229508196 58.51528549194336 0.6299999952316284
104.85245901639342 58.95196533203125 0.6399999856948853
105.8606557377049 59.388648986816406 0.6600000262260437
106.86885245901638 59.388648986816406 0.6600000262260437
107.87704918032786 59.388648986816406 0.6899999976158142
108.88524590163934 59.388648986816406 0.699999988079071
109.89344262295081 59.388648986816406 0.9900000095367432
110.90163934426228 59.8253288269043 0.029999999329447746
111.90983606557376 59.8253288269043 0.05999999865889549
112.91803278688523 59.8253288269043 0.05999999865889549
113.92622950819671 59.8253288269043 0.10000000149011612
114.93442622950819 59.8253288269043 0.10000000149011612
115.94262295081965 59.8253288269043 0.5600000023841858
116.95081967213113 59.8253288269043 0.5600000023841858
117.95901639344261 59.8253288269043 0.05000000074505806
118.96721311475409 59.8253288269043 0.07000000029802322
119.97540983606557 59.8253288269043 0.09000000357627869
120.98360655737704 59.8253288269043 0.10000000149011612
121.99180327868851 59.8253288269043 1.0
123.0 60.26200866699219 0.05000000074505806
