// Time Position Current
0.0 0.8733651041984558 0.0
1.004566210045662 0.8733651041984558 0.0
2.009132420091324 0.8733651041984558 0.029999999329447746
3.013698630136986 0.8733651041984558 0.029999999329447746
4.018264840182648 1.3100463151931763 0.029999999329447746
5.0228310502283104 1.3100463151931763 0.029999999329447746
6.027397260273972 3.0567712783813477 0.019999999552965164
7.031963470319634 4.80349588394165 0.0
8.036529680365296 6.550220966339111 0.0
9.041095890410958 6.550220966339111 0.0
10.045662100456621 7.860264301300049 0.0
11.050228310502282 7.860264301300049 0.0
12.054794520547944 8.733627319335938 0.0
13.059360730593607 8.733627319335938 0.0
14.063926940639268 10.480351448059082 0.019999999552965164
15.068493150684931 10.480351448059082 0.019999999552965164
16.073059360730593 11.790395736694336 0.0
17.077625570776256 12.66375732421875 0.0
18.082191780821915 13.53711986541748 0.009999999776482582
19.08675799086758 15.720526695251465 0.009999999776482582
20.091324200913242 15.720526695251465 0.009999999776482582
21.0958904109589 16.157207489013672 0.009999999776482582
22.100456621004565 16.157207489013672 0.009999999776482582
23.105022831050228 17.46725082397461 0.0
24.109589041095887 18.777294158935547 0.009999999776482582
25.11415525114155 20.087337493896484 0.019999999552965164
26.118721461187214 21.834062576293945 0.0
27.123287671232877 22.27074432373047 0.009999999776482582
28.127853881278536 24.01746940612793 0.009999999776482582
29.1324200913242 24.01746940612793 0.009999999776482582
30.136986301369863 24.454151153564453 0.009999999776482582
31.141552511415522 24.454151153564453 0.009999999776482582
32.146118721461185 26.200876235961914 0.009999999776482582
33.150684931506845 27.074237823486328 0.019999999552965164
34.15525114155251 28.384281158447266 0.019999999552965164
35.15981735159817 29.257644653320312 0.009999999776482582
36.16438356164383 31.00436782836914 0.009999999776482582
37.1689497716895 32.31441116333008 0.0
38.17351598173516 32.31441116333008 0.0
39.17808219178082 33.624454498291016 0.019999999552965164
40.182648401826484 33.624454498291016 0.019999999552965164
41.18721461187214 34.93449783325195 0.019999999552965164
42.1917808219178 35.807861328125 0.009999999776482582
43.19634703196347 36.244544982910156 0.009999999776482582
44.20091324200913 37.991268157958984 0.0
45.20547945205479 37.991268157958984 0.0
46.210045662100455 39.30131149291992 0.019999999552965164
47.214611872146115 39.30131149291992 0.019999999552965164
48.219178082191775 39.73799133300781 0.029999999329447746
49.22374429223744 39.73799133300781 0.029999999329447746
50.2283105022831 40.17467498779297 0.05000000074505806
51.23287671232877 40.17467498779297 0.05000000074505806
52.23744292237443 41.04803466796875 0.07999999821186066
53.24200913242009 41.04803466796875 0.09000000357627869
54.24657534246575 41.484718322753906 0.10000000149011612
55.25114155251141 42.35808181762695 0.11999999731779099
56.25570776255707 42.35808181762695 0.11999999731779099
57.26027397260274 42.794761657714844 0.11999999731779099
58.2648401826484 42.794761657714844 0.11999999731779099
59.26940639269406 43.231441497802734 0.15000000596046448
60.273972602739725 43.66812515258789 0.17000000178813934
61.278538812785385 44.10480499267578 0.20000000298023224
62.283105022831045 44.54148483276367 0.20000000298023224
63.28767123287671 45.85152816772461 0.20000000298023224
64.29223744292237 45.85152816772461 0.23999999463558197
65.29680365296804 45.85152816772461 0.23999999463558197
66.30136986301369 46.724891662597656 0.23000000417232513
67.30593607305936 46.724891662597656 0.23000000417232513
68.31050228310502 47.16157531738281 0.25
69.31506849315068 47.16157531738281 0.25
70.31963470319634 47.5982551574707 0.28999999165534973
71.32420091324201 48.034934997558594 0.30000001192092896
72.32876712328766 48.47161865234375 0.28999999165534973
73.33333333333333 49.34497833251953 0.30000001192092896
74.337899543379 49.34497833251953 0.30000001192092896
75.34246575342465 49.78166198730469 0.33000001311302185
76.34703196347031 49.78166198730469 0.33000001311302185
77.35159817351598 50.21834182739258 0.3700000047683716
78.35616438356163 50.21834182739258 0.3700000047683716
79.3607305936073 50.65502166748047 0.3799999952316284
80.36529680365297 50.65502166748047 0.3799999952316284
81.36986301369862 51.965065002441406 0.4000000059604645
82.37442922374429 51.965065002441406 0.4000000059604645
83.37899543378995 52.40174865722656 0.4000000059604645
84.3835616438356 53.27511215209961 0.44999998807907104
85.38812785388127 53.27511215209961 0.44999998807907104
86.39269406392694 53.27511215209961 0.44999998807907104
87.39726027397259 53.7117919921875 0.47999998927116394
88.40182648401826 54.14847183227539 0.49000000953674316
89.40639269406392 54.14847183227539 0.49000000953674316
90.41095890410958 55.02183532714844 0.5099999904632568
91.41552511415524 55.02183532714844 0.5099999904632568
92.42009132420091 55.45851516723633 0.5299999713897705
93.42465753424656 55.895198822021484 0.5400000214576721
94.42922374429223 56.331878662109375 0.5699999928474426
95.4337899543379 56.331878662109375 0.5699999928474426
96.43835616438355 56.331878662109375 0.6000000238418579
97.44292237442922 56.331878662109375 0.6000000238418579
98.44748858447488 57.20524215698242 0.6200000047683716
99.45205479452055 57.20524215698242 0.6200000047683716
100.4566210045662 57.64192199707031 0.6299999952316284
101.46118721461187 57.64192199707031 0.6299999952316284
102.46575342465754 58.51528549194336 0.6499999761581421
103.47031963470319 58.95196533203125 0.6800000071525574
104.47488584474885 59.388648986816406 0.699999988079071
105.47945205479452 59.388648986816406 0.7099999785423279
106.48401826484017 59.8253288269043 0.03999999910593033
107.48858447488584 59.8253288269043 0.03999999910593033
108.4931506849315 59.8253288269043 0.07000000029802322
109.49771689497716 59.8253288269043 0.07000000029802322
110.50228310502283 59.8253288269043 0.10000000149011612
111.5068493150685 59.8253288269043 0.9900000095367432
112.51141552511415 59.8253288269043 0.9900000095367432
113.51598173515981 59.8253288269043 0.05000000074505806
114.52054794520548 59.8253288269043 0.05000000074505806
115.52511415525113 59.8253288269043 0.05000000074505806
116.5296803652968 59.8253288269043 0.03999999910593033
117.53424657534246 59.8253288269043 0.03999999910593033
118.53881278538812 59.8253288269043 0.05000000074505806
119.54337899543378 59.8253288269043 0.05000000074505806
120.54794520547945 59.8253288269043 0.05000000074505806
121.5525114155251 59.8253288269043 0.05000000074505806
122.55707762557077 59.8253288269043 0.03999999910593033
123.56164383561644 59.8253288269043 0.03999999910593033
124.56621004566209 59.8253288269043 0.03999999910593033
125.57077625570776 59.8253288269043 0.05000000074505806
126.57534246575342 59.8253288269043 0.05000000074505806
127.57990867579908 59.8253288269043 0.03999999910593033
128.58447488584474 59.8253288269043 0.03999999910593033
129.5890410958904 59.8253288269043 0.05000000074505806
130.59360730593608 59.8253288269043 0.05000000074505806
131.59817351598173 59.8253288269043 0.03999999910593033
132.60273972602738 59.8253288269043 0.03999999910593033
133.60730593607306 59.8253288269043 0.05000000074505806
134.6118721461187 59.8253288269043 0.05000000074505806
135.61643835616437 59.8253288269043 0.03999999910593033
136.62100456621005 59.8253288269043 0.03999999910593033
137.6255707762557 59.8253288269043 0.03999999910593033
138.63013698630135 59.8253288269043 0.03999999910593033
139.63470319634703 59.8253288269043 0.03999999910593033
140.63926940639269 59.8253288269043 0.05000000074505806
141.64383561643834 59.8253288269043 0.05000000074505806
142.64840182648402 59.8253288269043 0.03999999910593033
143.65296803652967 59.8253288269043 0.03999999910593033
144.65753424657532 59.8253288269043 0.05000000074505806
145.662100456621 59.8253288269043 0.05000000074505806
146.66666666666666 59.8253288269043 0.05000000074505806
147.6712328767123 59.8253288269043 0.05000000074505806
148.675799086758 59.8253288269043 0.03999999910593033
149.68036529680364 59.8253288269043 0.03999999910593033
150.6849315068493 59.8253288269043 0.05000000074505806
151.68949771689498 59.8253288269043 0.05000000074505806
152.69406392694063 59.8253288269043 0.05000000074505806
153.69863013698628 59.8253288269043 0.03999999910593033
154.70319634703196 59.8253288269043 0.03999999910593033
155.70776255707761 59.8253288269043 0.03999999910593033
156.71232876712327 59.8253288269043 0.03999999910593033
157.71689497716895 59.8253288269043 0.05000000074505806
158.7214611872146 59.8253288269043 0.05000000074505806
159.72602739726025 59.8253288269043 0.03999999910593033
160.73059360730593 59.8253288269043 0.05000000074505806
161.7351598173516 59.8253288269043 0.05000000074505806
162.73972602739724 59.8253288269043 0.05000000074505806
163.74429223744292 59.8253288269043 0.05000000074505806
164.74885844748857 59.8253288269043 0.05000000074505806
165.75342465753423 59.8253288269043 0.03999999910593033
166.7579908675799 59.8253288269043 0.03999999910593033
167.76255707762556 59.8253288269043 0.03999999910593033
168.7671232876712 59.8253288269043 0.03999999910593033
169.7716894977169 59.8253288269043 0.05000000074505806
170.77625570776254 59.8253288269043 0.05000000074505806
171.7808219178082 59.8253288269043 0.03999999910593033
172.78538812785388 59.8253288269043 0.03999999910593033
173.78995433789953 59.8253288269043 0.03999999910593033
174.79452054794518 59.8253288269043 0.03999999910593033
175.79908675799086 59.8253288269043 0.05000000074505806
176.80365296803652 59.8253288269043 0.05000000074505806
177.80821917808217 59.8253288269043 0.03999999910593033
178.81278538812785 59.8253288269043 0.03999999910593033
179.8173515981735 59.8253288269043 0.03999999910593033
180.82191780821915 59.8253288269043 0.05000000074505806
181.82648401826484 59.8253288269043 0.05000000074505806
182.8310502283105 59.8253288269043 0.05000000074505806
183.83561643835614 59.8253288269043 0.03999999910593033
184.84018264840182 59.8253288269043 0.03999999910593033
185.84474885844747 59.8253288269043 0.03999999910593033
186.84931506849313 59.8253288269043 0.05000000074505806
187.8538812785388 59.8253288269043 0.05000000074505806
188.85844748858446 59.8253288269043 0.05000000074505806
189.8630136986301 59.8253288269043 0.05000000074505806
190.8675799086758 59.8253288269043 0.05000000074505806
191.87214611872145 59.8253288269043 0.03999999910593033
192.8767123287671 59.8253288269043 0.05000000074505806
193.88127853881278 59.8253288269043 0.03999999910593033
194.88584474885843 59.8253288269043 0.03999999910593033
195.8904109589041 59.8253288269043 0.03999999910593033
196.89497716894977 59.8253288269043 0.03999999910593033
197.89954337899542 59.8253288269043 0.03999999910593033
198.9041095890411 59.8253288269043 0.03999999910593033
199.90867579908675 59.8253288269043 0.05000000074505806
200.9132420091324 59.8253288269043 0.05000000074505806
201.91780821917808 59.8253288269043 0.03999999910593033
202.92237442922374 59.8253288269043 0.03999999910593033
203.9269406392694 59.8253288269043 0.05000000074505806
204.93150684931507 59.8253288269043 0.05000000074505806
205.93607305936072 59.8253288269043 0.05000000074505806
206.94063926940638 59.8253288269043 0.03999999910593033
207.94520547945206 59.8253288269043 0.03999999910593033
208.9497716894977 59.8253288269043 0.03999999910593033
209.95433789954336 59.8253288269043 0.03999999910593033
210.95890410958904 59.8253288269043 0.05000000074505806
211.9634703196347 59.8253288269043 0.05000000074505806
212.96803652968035 59.8253288269043 0.05999999865889549
213.97260273972603 59.8253288269043 0.05000000074505806
214.97716894977168 59.8253288269043 0.05000000074505806
215.98173515981733 59.8253288269043 0.03999999910593033
216.986301369863 59.8253288269043 0.03999999910593033
217.99086757990867 59.8253288269043 0.05000000074505806
218.99543378995432 59.8253288269043 0.05000000074505806
220.0 59.8253288269043 0.05000000074505806
