// Time Position Current
0.0 0.8733651041984558 0.0
1.0085470085470085 0.8733651041984558 0.0
2.017094017094017 0.8733651041984558 0.0
3.0256410256410255 0.8733651041984558 0.019999999552965164
4.034188034188034 0.8733651041984558 0.019999999552965164
5.042735042735043 2.183408737182617 0.019999999552965164
6.051282051282051 3.930133581161499 0.009999999776482582
7.05982905982906 3.930133581161499 0.009999999776482582
8.068376068376068 5.676858425140381 0.009999999776482582
9.076923076923077 5.676858425140381 0.009999999776482582
10.085470085470085 7.423583030700684 0.009999999776482582
11.094017094017094 8.733627319335938 0.019999999552965164
12.102564102564102 8.733627319335938 0.019999999552965164
13.11111111111111 10.480351448059082 0.009999999776482582
14.11965811965812 10.480351448059082 0.009999999776482582
15.128205128205128 11.790395736694336 0.0
16.136752136752136 11.790395736694336 0.0
17.145299145299145 13.53711986541748 0.009999999776482582
18.153846153846153 14.410482406616211 0.009999999776482582
19.162393162393162 15.283844947814941 0.009999999776482582
20.17094017094017 16.157207489013672 0.009999999776482582
21.17948717948718 17.46725082397461 0.009999999776482582
22.188034188034187 19.21397590637207 0.009999999776482582
23.196581196581196 19.21397590637207 0.009999999776482582
24.205128205128204 20.524019241333008 0.019999999552965164
25.213675213675213 22.27074432373047 0.019999999552965164
26.22222222222222 22.27074432373047 0.019999999552965164
27.23076923076923 23.144107818603516 0.009999999776482582
28.23931623931624 23.144107818603516 0.009999999776482582
29.247863247863247 24.890830993652344 0.009999999776482582
30.256410256410255 26.200876235961914 0.019999999552965164
31.264957264957264 26.200876235961914 0.019999999552965164
32.27350427350427 27.947599411010742 0.009999999776482582
33.282051282051285 27.947599411010742 0.009999999776482582
34.29059829059829 29.257644653320312 0.009999999776482582
35.299145299145295 30.131006240844727 0.009999999776482582
36.30769230769231 31.00436782836914 0.009999999776482582
37.31623931623932 31.877731323242188 0.009999999776482582
38.324786324786324 33.187774658203125 0.009999999776482582
39.33333333333333 33.187774658203125 0.009999999776482582
40.34188034188034 34.93449783325195 0.009999999776482582
41.35042735042735 34.93449783325195 0.009999999776482582
42.35897435897436 36.68122482299805 0.009999999776482582
43.36752136752136 37.991268157958984 0.009999999776482582
44.376068376068375 37.991268157958984 0.009999999776482582
45.38461538461539 38.86463165283203 0.009999999776482582
46.39316239316239 39.73799133300781 0.029999999329447746
47.4017094017094 40.61135482788086 0.05999999865889549
48.41025641025641 40.61135482788086 0.05999999865889549
49.41880341880342 41.484718322753906 0.07000000029802322
50.427350427350426 41.484718322753906 0.07000000029802322
51.43589743589743 41.9213981628418 0.07000000029802322
52.44444444444444 42.35808181762695 0.07000000029802322
53.452991452991455 42.794761657714844 0.07000000029802322
54.46153846153846 43.231441497802734 0.07999999821186066
55.470085470085465 43.66812515258789 0.09000000357627869
56.47863247863248 44.54148483276367 0.10999999940395355
57.48717948717949 44.54148483276367 0.10999999940395355
58.495726495726494 45.41484832763672 0.12999999523162842
59.5042735042735 45.41484832763672 0.12999999523162842
60.51282051282051 45.85152816772461 0.11999999731779099
61.52136752136752 45.85152816772461 0.11999999731779099
62.52991452991453 46.724891662597656 0.14000000059604645
63.53846153846153 47.16157531738281 0.07000000029802322
64.54700854700855 47.16157531738281 0.1599999964237213
65.55555555555556 48.034934997558594 0.17000000178813934
66.56410256410257 48.034934997558594 0.17000000178813934
67.57264957264957 48.90829849243164 0.20000000298023224
68.58119658119658 48.90829849243164 0.20000000298023224
69.58974358974359 49.78166198730469 0.20999999344348907
70.59829059829059 49.78166198730469 0.20999999344348907
71.6068376068376 50.21834182739258 0.2199999988079071
72.61538461538461 50.21834182739258 0.2199999988079071
73.62393162393163 50.65502166748047 0.23000000417232513
74.63247863247864 51.091705322265625 0.23000000417232513
75.64102564102564 51.528385162353516 0.25
76.64957264957265 52.83842849731445 0.3400000035762787
77.65811965811966 52.83842849731445 0.3400000035762787
78.66666666666666 53.7117919921875 0.28999999165534973
79.67521367521367 53.7117919921875 0.28999999165534973
80.68376068376068 53.7117919921875 0.28999999165534973
81.6923076923077 53.7117919921875 0.28999999165534973
82.7008547008547 54.14847183227539 0.30000001192092896
83.7094017094017 54.58515548706055 0.3199999928474426
84.71794871794872 55.02183532714844 0.33000001311302185
85.72649572649573 55.895198822021484 0.3499999940395355
86.73504273504273 55.895198822021484 0.3499999940395355
87.74358974358974 55.895198822021484 0.3400000035762787
88.75213675213675 55.895198822021484 0.3400000035762787
89.76068376068376 57.20524215698242 0.38999998569488525
90.76923076923077 57.64192199707031 0.4099999964237213
91.77777777777777 57.64192199707031 0.4099999964237213
92.78632478632478 58.51528549194336 0.41999998688697815
93.7948717948718 58.95196533203125 0.4300000071525574
94.8034188034188 59.388648986816406 0.4300000071525574
95.8119658119658 59.8253288269043 0.46000000834465027
96.82051282051282 59.8253288269043 0.46000000834465027
97.82905982905983 60.698692321777344 0.49000000953674316
98.83760683760684 60.698692321777344 0.49000000953674316
99.84615384615384 61.135372161865234 0.5
100.85470085470085 61.135372161865234 0.5
101.86324786324786 61.572052001953125 0.5
102.87179487179486 61.572052001953125 0.5
103.88034188034187 62.00873565673828 0.550000011920929
104.88888888888889 62.44541549682617 0.550000011920929
105.8974358974359 62.44541549682617 0.5799999833106995
106.90598290598291 62.88209533691406 0.38999998569488525
107.91452991452991 63.31877899169922 0.6000000238418579
108.92307692307692 63.75545883178711 0.6100000143051147
109.93162393162393 63.75545883178711 0.6100000143051147
110.94017094017093 64.62882232666016 0.6200000047683716
111.94871794871794 64.62882232666016 0.6200000047683716
112.95726495726495 65.06550598144531 0.6600000262260437
113.96581196581197 65.06550598144531 0.6600000262260437
114.97435897435898 65.50218200683594 0.6700000166893005
115.98290598290598 65.50218200683594 0.6700000166893005
116.99145299145299 65.50218200683594 1.0
118.0 65.50218200683594 0.019999999552965164
