// Time Position Current
0.0 0.8733651041984558 0.0
1.00990099009901 0.8733651041984558 0.0
2.01980198019802 0.8733651041984558 0.0
3.0297029702970297 0.8733651041984558 0.0
4.03960396039604 1.746727466583252 0.03999999910593033
5.0495049504950495 1.746727466583252 0.03999999910593033
6.0594059405940595 3.493452310562134 0.0
7.069306930693069 4.366814613342285 0.019999999552965164
8.07920792079208 5.240177154541016 0.019999999552965164
9.089108910891088 6.113539695739746 0.0
10.099009900990099 6.113539695739746 0.0
11.10891089108911 7.860264301300049 0.009999999776482582
12.118811881188119 7.860264301300049 0.009999999776482582
13.128712871287128 9.170308113098145 0.009999999776482582
14.138613861386139 9.170308113098145 0.009999999776482582
15.14851485148515 10.917033195495605 0.0
16.15841584158416 12.66375732421875 0.009999999776482582
17.168316831683168 12.66375732421875 0.009999999776482582
18.178217821782177 13.100439071655273 0.009999999776482582
19.18811881188119 13.973801612854004 0.019999999552965164
20.198019801980198 14.847164154052734 0.009999999776482582
21.207920792079207 16.157207489013672 0.009999999776482582
22.21782178217822 16.157207489013672 0.009999999776482582
23.22772277227723 17.903932571411133 0.009999999776482582
24.237623762376238 17.903932571411133 0.009999999776482582
25.247524752475247 19.650657653808594 0.009999999776482582
26.257425742574256 19.650657653808594 0.009999999776482582
27.26732673267327 20.96070098876953 0.019999999552965164
28.277227722772277 21.834062576293945 0.009999999776482582
29.287128712871286 22.707426071166992 0.019999999552965164
30.2970297029703 23.580787658691406 0.019999999552965164
31.306930693069308 24.890830993652344 0.019999999552965164
32.31683168316832 24.890830993652344 0.019999999552965164
33.32673267326733 26.637556076049805 0.019999999552965164
34.336633663366335 26.637556076049805 0.019999999552965164
35.34653465346535 27.947599411010742 0.009999999776482582
36.35643564356435 27.947599411010742 0.009999999776482582
37.366336633663366 29.694324493408203 0.009999999776482582
38.37623762376238 29.694324493408203 0.009999999776482582
39.386138613861384 31.441049575805664 0.009999999776482582
40.396039603960396 31.877731323242188 0.029999999329447746
41.40594059405941 32.751094818115234 0.009999999776482582
42.415841584158414 33.187774658203125 0.029999999329447746
43.42574257425743 33.187774658203125 0.029999999329447746
44.43564356435644 35.37118148803711 0.019999999552965164
45.445544554455445 36.68122482299805 0.019999999552965164
46.45544554455446 36.68122482299805 0.019999999552965164
47.46534653465346 37.991268157958984 0.009999999776482582
48.475247524752476 37.991268157958984 0.009999999776482582
49.48514851485149 39.73799133300781 0.019999999552965164
50.495049504950494 39.73799133300781 0.019999999552965164
51.504950495049506 40.17467498779297 0.03999999910593033
52.51485148514851 40.17467498779297 0.03999999910593033
53.524752475247524 41.04803466796875 0.05999999865889549
54.53465346534654 41.484718322753906 0.07999999821186066
55.54455445544554 41.9213981628418 0.07999999821186066
56.554455445544555 42.35808181762695 0.10999999940395355
57.56435643564357 42.794761657714844 0.11999999731779099
58.57425742574257 43.231441497802734 0.12999999523162842
59.584158415841586 43.231441497802734 0.12999999523162842
60.5940594059406 43.66812515258789 0.17000000178813934
61.603960396039604 43.66812515258789 0.17000000178813934
62.613861386138616 44.54148483276367 0.18000000715255737
63.62376237623762 44.54148483276367 0.18000000715255737
64.63366336633663 45.41484832763672 0.18000000715255737
65.64356435643565 46.288211822509766 0.20000000298023224
66.65346534653466 46.724891662597656 0.20999999344348907
67.66336633663366 46.724891662597656 0.20999999344348907
68.67326732673267 47.5982551574707 0.25
69.68316831683168 47.5982551574707 0.25
70.6930693069307 48.034934997558594 0.25
71.70297029702971 48.034934997558594 0.25
72.7128712871287 48.90829849243164 0.2800000011920929
73.72277227722772 48.90829849243164 0.2800000011920929
74.73267326732673 49.34497833251953 0.30000001192092896
75.74257425742574 49.34497833251953 0.30000001192092896
76.75247524752476 49.78166198730469 0.3400000035762787
77.76237623762377 50.21834182739258 0.2199999988079071
78.77227722772277 50.65502166748047 0.029999999329447746
79.78217821782178 50.65502166748047 0.029999999329447746
80.79207920792079 50.65502166748047 0.029999999329447746
81.8019801980198 50.65502166748047 0.05999999865889549
82.81188118811882 50.65502166748047 0.05999999865889549
83.82178217821782 50.65502166748047 0.09000000357627869
84.83168316831683 51.091705322265625 0.05000000074505806
85.84158415841584 51.091705322265625 0.05000000074505806
86.85148514851485 51.091705322265625 0.05000000074505806
87.86138613861387 51.091705322265625 0.07000000029802322
88.87128712871288 51.091705322265625 0.10000000149011612
89.88118811881188 51.528385162353516 0.029999999329447746
90.89108910891089 51.528385162353516 0.029999999329447746
91.9009900990099 51.528385162353516 0.07000000029802322
92.91089108910892 51.528385162353516 0.07000000029802322
93.92079207920793 51.528385162353516 0.09000000357627869
94.93069306930693 51.965065002441406 0.4399999976158142
95.94059405940594 51.965065002441406 0.4399999976158142
96.95049504950495 51.965065002441406 0.03999999910593033
97.96039603960396 51.965065002441406 0.03999999910593033
98.97029702970298 51.965065002441406 0.07000000029802322
99.98019801980197 51.965065002441406 0.07000000029802322
100.99009900990099 52.40174865722656 1.0
102.0 52.40174865722656 0.009999999776482582
