Time,Distance1,SensorData0,Distance2,SensorData4
0.018000,0.060778,0.000000,0.060778,0.000000
0.036000,0.059525,0.000000,0.059525,0.000000
0.054000,0.058077,0.000000,0.058077,0.000000
0.072000,0.056768,0.000000,0.056768,0.000000
0.090000,0.055720,0.000000,0.055720,0.000000
0.108000,0.054871,0.000000,0.054871,0.000000
0.126000,0.054109,0.000000,0.054109,0.000000
0.144000,0.053362,0.000000,0.053362,0.000000
0.162000,0.052615,0.000000,0.052615,0.000000
0.180000,0.051879,0.000000,0.051879,0.000000
0.198000,0.051164,0.000000,0.051164,0.000000
0.216000,0.050465,0.000000,0.050465,0.000000
0.234000,0.049776,0.000000,0.049776,0.000000
0.252000,0.049092,0.000000,0.049092,0.000000
0.270000,0.048414,0.000000,0.048414,0.000000
0.288000,0.047741,0.000000,0.047741,0.000000
0.306000,0.047075,0.000000,0.047075,0.000000
0.324000,0.046417,0.000000,0.046417,0.000000
0.342000,0.046070,0.475817,0.046070,0.475818
0.360000,0.046026,0.741426,0.046026,0.741428
0.378000,0.046005,1.054081,0.046005,1.054083
0.396000,0.045944,1.367872,0.045944,1.367874
0.414000,0.045847,1.667296,0.045847,1.667297
0.432000,0.045725,1.956090,0.045725,1.956091
0.450000,0.045592,2.238337,0.045592,2.238338
0.468000,0.045456,2.516461,0.045456,2.516462
0.486000,0.045321,2.792314,0.045321,2.792315
0.504000,0.045190,3.065713,0.045190,3.065714
0.522000,0.045063,3.340480,0.045063,3.340481
0.540000,0.044938,3.609076,0.044938,3.609077
0.558000,0.044812,3.878762,0.044812,3.878763
0.576000,0.044687,4.160797,0.044687,4.160798
0.594000,0.044572,4.442026,0.044572,4.442027
0.612000,0.044462,4.725926,0.044462,4.725927
0.630000,0.044355,5.011482,0.044355,5.011483
0.648000,0.044249,5.297779,0.044249,5.297780
0.666000,0.044144,5.583665,0.044144,5.583666
0.684000,0.044040,5.871419,0.044040,5.871417
0.702000,0.043937,6.157550,0.043937,6.157551
0.720000,0.043833,6.445438,0.043833,6.445418
0.738000,0.043730,6.732782,0.043730,6.732170
0.756000,0.043626,7.018709,0.043626,7.018178
0.774000,0.043522,7.304779,0.043522,7.305613
0.792000,0.043418,7.591093,0.043418,7.591333
0.810000,0.043313,7.875615,0.043313,7.875562
0.828000,0.043208,8.162495,0.043209,8.161393
0.846000,0.043104,8.447756,0.043104,8.447544
0.864000,0.043009,8.793651,0.043009,8.793524
0.882000,0.042926,9.106988,0.042925,9.105264
0.900000,0.042847,9.421657,0.042846,9.418568
0.918000,0.042772,9.737634,0.042771,9.736352
0.936000,0.042700,10.056211,0.042700,10.057249
0.954000,0.042632,10.384845,0.042633,10.384767
0.972000,0.042570,10.715404,0.042571,10.716020
0.990000,0.042512,11.048251,0.042512,11.049471
1.008000,0.042457,11.379172,0.042457,11.377929
1.026000,0.042404,11.701064,0.042404,11.699523
1.044000,0.042351,11.978028,0.042351,11.978760
1.062000,0.042303,11.952679,0.042303,11.951429
1.080000,0.042270,11.915637,0.042270,11.915288
1.098000,0.042249,11.876356,0.042249,11.873963
1.116000,0.042237,11.701758,0.042237,11.701793
1.134000,0.042230,11.694974,0.042230,11.697792
1.152000,0.042224,11.679074,0.042224,11.679078
1.170000,0.042216,11.671854,0.042217,11.668891
1.188000,0.042209,11.664479,0.042209,11.666581
1.206000,0.042203,11.464432,0.042203,11.467874
1.224000,0.042198,11.478525,0.042200,11.475958
1.242000,0.042196,11.485330,0.042196,11.485186
1.260000,0.042195,11.492680,0.042196,11.488476
1.278000,0.042196,11.492631,0.042196,11.492887
1.296000,0.042198,11.493609,0.042197,11.496957
1.314000,0.042201,11.298587,0.042201,11.297923
1.332000,0.042219,10.996263,0.042219,10.997436
1.350000,0.042258,10.692990,0.042259,10.692849
1.368000,0.042317,10.392302,0.042316,10.391785
1.386000,0.042391,10.164559,0.042390,10.164093
1.404000,0.042477,9.841747,0.042477,9.841459
1.422000,0.042573,9.574270,0.042572,9.576166
1.440000,0.042674,9.259244,0.042673,9.259086
1.458000,0.042777,8.940644,0.042777,8.941304
1.476000,0.042880,8.581028,0.042881,8.580222
1.494000,0.042984,8.277743,0.042984,8.278378
1.512000,0.043086,7.951292,0.043086,7.951611
1.530000,0.043185,7.668305,0.043185,7.668577
1.548000,0.043283,7.384138,0.043283,7.383502
1.566000,0.043380,7.098964,0.043380,7.100417
1.584000,0.043476,6.816188,0.043478,6.816873
1.602000,0.043574,6.530524,0.043574,6.531290
1.620000,0.043671,6.247812,0.043671,6.247680
1.638000,0.043770,5.964383,0.043769,5.963564
1.656000,0.043868,5.677843,0.043867,5.678157
1.674000,0.043967,5.394413,0.043966,5.394907
1.692000,0.044066,5.109121,0.044065,5.109562
1.710000,0.044165,4.825105,0.044165,4.825728
1.728000,0.044265,4.540771,0.044265,4.540213
1.746000,0.044365,4.256836,0.044365,4.256527
1.764000,0.044466,3.972209,0.044466,3.972451
1.782000,0.044568,3.688816,0.044568,3.689048
1.800000,0.044671,3.405118,0.044671,3.404831
1.818000,0.044775,3.122624,0.044775,3.122977
1.836000,0.044880,2.838743,0.044880,2.838542
1.854000,0.044986,2.557620,0.044986,2.557480
1.872000,0.045093,2.276141,0.045093,2.276168
1.890000,0.045202,1.995402,0.045201,1.995394
1.908000,0.045312,1.715340,0.045312,1.715339
1.926000,0.045424,1.436835,0.045424,1.436848
1.944000,0.045538,1.158537,0.045538,1.158555
1.962000,0.045655,0.883712,0.045655,0.883725
1.980000,0.045773,0.611808,0.045773,0.611817
1.998000,0.045894,0.348476,0.045894,0.348476
2.016000,0.046024,0.096381,0.046024,0.096377
2.034000,0.046182,0.000000,0.046182,0.000000
2.052000,0.046571,0.000000,0.046571,0.000000
2.070000,0.047238,0.000000,0.047238,0.000000
2.088000,0.048008,0.000000,0.048008,0.000000
2.106000,0.048737,0.000000,0.048737,0.000000
2.124000,0.049403,0.000000,0.049403,0.000000
2.142000,0.050051,0.000000,0.050051,0.000000
2.160000,0.050719,0.000000,0.050719,0.000000
2.178000,0.051415,0.000000,0.051415,0.000000
2.196000,0.052125,0.000000,0.052125,0.000000
2.214000,0.052836,0.000000,0.052836,0.000000
2.232000,0.053547,0.000000,0.053547,0.000000
2.250000,0.054259,0.000000,0.054259,0.000000
2.268000,0.054977,0.000000,0.054977,0.000000
2.286000,0.055700,0.000000,0.055700,0.000000
2.304000,0.056429,0.000000,0.056429,0.000000
2.322000,0.057161,0.000000,0.057161,0.000000
2.340000,0.057896,0.000000,0.057896,0.000000
2.358000,0.058550,0.000000,0.058550,0.000000
2.376000,0.058783,0.000000,0.058783,0.000000
2.394000,0.058663,0.000000,0.058663,0.000000
2.412000,0.058482,0.000000,0.058482,0.000000
2.430000,0.058412,0.000000,0.058412,0.000000
2.448000,0.058441,0.000000,0.058441,0.000000
2.466000,0.058490,0.000000,0.058490,0.000000
2.484000,0.058511,0.000000,0.058511,0.000000
2.502000,0.058504,0.000000,0.058504,0.000000
2.520000,0.058491,0.000000,0.058491,0.000000
2.538000,0.058485,0.000000,0.058485,0.000000
2.556000,0.058486,0.000000,0.058486,0.000000
2.574000,0.058490,0.000000,0.058490,0.000000
2.592000,0.058492,0.000000,0.058492,0.000000
2.610000,0.058491,0.000000,0.058491,0.000000
2.628000,0.058490,0.000000,0.058490,0.000000
2.646000,0.058490,0.000000,0.058490,0.000000
2.664000,0.058490,0.000000,0.058490,0.000000
2.682000,0.058490,0.000000,0.058490,0.000000
2.700000,0.058490,0.000000,0.058490,0.000000
2.718000,0.058490,0.000000,0.058490,0.000000
2.736000,0.058490,0.000000,0.058490,0.000000
2.754000,0.058490,0.000000,0.058490,0.000000
2.772000,0.058490,0.000000,0.058490,0.000000
2.790000,0.058490,0.000000,0.058490,0.000000
2.808000,0.058490,0.000000,0.058490,0.000000
2.826000,0.058490,0.000000,0.058490,0.000000
2.844000,0.058490,0.000000,0.058490,0.000000
2.862000,0.058490,0.000000,0.058490,0.000000
2.880000,0.058490,0.000000,0.058490,0.000000
2.898000,0.058490,0.000000,0.058490,0.000000
2.916000,0.058490,0.000000,0.058490,0.000000
2.934000,0.058490,0.000000,0.058490,0.000000
2.952000,0.058490,0.000000,0.058490,0.000000
2.970000,0.058490,0.000000,0.058490,0.000000
2.988000,0.058490,0.000000,0.058490,0.000000
3.006000,0.058490,0.000000,0.058490,0.000000
3.024000,0.058490,0.000000,0.058490,0.000000
3.042000,0.058490,0.000000,0.058490,0.000000
3.060000,0.058490,0.000000,0.058490,0.000000
3.078000,0.058490,0.000000,0.058490,0.000000
3.096000,0.058490,0.000000,0.058490,0.000000
3.114000,0.058490,0.000000,0.058490,0.000000
3.132000,0.058490,0.000000,0.058490,0.000000
3.150000,0.058490,0.000000,0.058490,0.000000
3.168000,0.058490,0.000000,0.058490,0.000000
3.186000,0.058490,0.000000,0.058490,0.000000
3.204000,0.058490,0.000000,0.058490,0.000000
3.222000,0.058490,0.000000,0.058490,0.000000
3.240000,0.058490,0.000000,0.058490,0.000000
3.258000,0.058490,0.000000,0.058490,0.000000
3.276000,0.058490,0.000000,0.058490,0.000000
3.294000,0.058490,0.000000,0.058490,0.000000
3.312000,0.058490,0.000000,0.058490,0.000000
3.330000,0.058490,0.000000,0.058490,0.000000
3.348000,0.058490,0.000000,0.058490,0.000000
3.366000,0.058490,0.000000,0.058490,0.000000
3.384000,0.058490,0.000000,0.058490,0.000000
3.402000,0.058490,0.000000,0.058490,0.000000
3.420000,0.058490,0.000000,0.058490,0.000000
3.438000,0.058490,0.000000,0.058490,0.000000
3.456000,0.058490,0.000000,0.058490,0.000000
3.474000,0.058490,0.000000,0.058490,0.000000
3.492000,0.058490,0.000000,0.058490,0.000000
3.510000,0.058490,0.000000,0.058490,0.000000
3.528000,0.058490,0.000000,0.058490,0.000000
3.546000,0.058490,0.000000,0.058490,0.000000
3.564000,0.058490,0.000000,0.058490,0.000000
3.582000,0.058490,0.000000,0.058490,0.000000
3.600000,0.058490,0.000000,0.058490,0.000000
3.618000,0.058490,0.000000,0.058490,0.000000
3.636000,0.058490,0.000000,0.058490,0.000000
3.654000,0.058490,0.000000,0.058490,0.000000
3.672000,0.058490,0.000000,0.058490,0.000000
3.690000,0.058490,0.000000,0.058490,0.000000
3.708000,0.058490,0.000000,0.058490,0.000000
3.726000,0.058490,0.000000,0.058490,0.000000
3.744000,0.058490,0.000000,0.058490,0.000000
3.762000,0.058490,0.000000,0.058490,0.000000
3.780000,0.058490,0.000000,0.058490,0.000000
3.798000,0.058490,0.000000,0.058490,0.000000
3.816000,0.058490,0.000000,0.058490,0.000000
3.834000,0.058490,0.000000,0.058490,0.000000
3.852000,0.058490,0.000000,0.058490,0.000000
3.870000,0.058490,0.000000,0.058490,0.000000
3.888000,0.058490,0.000000,0.058490,0.000000
3.906000,0.058490,0.000000,0.058490,0.000000
3.924000,0.058490,0.000000,0.058490,0.000000
3.942000,0.058490,0.000000,0.058490,0.000000
3.960000,0.058490,0.000000,0.058490,0.000000
3.978000,0.058490,0.000000,0.058490,0.000000
3.996000,0.058490,0.000000,0.058490,0.000000
4.014000,0.058490,0.000000,0.058490,0.000000
4.032000,0.058490,0.000000,0.058490,0.000000
4.050000,0.058490,0.000000,0.058490,0.000000
4.068000,0.058490,0.000000,0.058490,0.000000
4.086000,0.058490,0.000000,0.058490,0.000000
4.104000,0.058490,0.000000,0.058490,0.000000
4.122000,0.058490,0.000000,0.058490,0.000000
4.140000,0.058490,0.000000,0.058490,0.000000
4.158000,0.058490,0.000000,0.058490,0.000000
4.176000,0.058490,0.000000,0.058490,0.000000
4.194000,0.058490,0.000000,0.058490,0.000000
4.212000,0.058490,0.000000,0.058490,0.000000
4.230000,0.058490,0.000000,0.058490,0.000000
4.248000,0.058490,0.000000,0.058490,0.000000
4.266000,0.058490,0.000000,0.058490,0.000000
4.284000,0.058490,0.000000,0.058490,0.000000
4.302000,0.058490,0.000000,0.058490,0.000000
4.320000,0.058490,0.000000,0.058490,0.000000
4.338000,0.058490,0.000000,0.058490,0.000000
4.356000,0.058490,0.000000,0.058490,0.000000
4.374000,0.058490,0.000000,0.058490,0.000000
4.392000,0.058490,0.000000,0.058490,0.000000
4.410000,0.058490,0.000000,0.058490,0.000000
4.428000,0.058490,0.000000,0.058490,0.000000
4.446000,0.058490,0.000000,0.058490,0.000000
4.464000,0.058490,0.000000,0.058490,0.000000
4.482000,0.058490,0.000000,0.058490,0.000000
4.500000,0.058490,0.000000,0.058490,0.000000
4.518000,0.058490,0.000000,0.058490,0.000000
4.536000,0.058490,0.000000,0.058490,0.000000
4.554000,0.058490,0.000000,0.058490,0.000000
4.572000,0.058490,0.000000,0.058490,0.000000
4.590000,0.058490,0.000000,0.058490,0.000000
4.608000,0.058490,0.000000,0.058490,0.000000
4.626000,0.058490,0.000000,0.058490,0.000000
4.644000,0.058490,0.000000,0.058490,0.000000
4.662000,0.058490,0.000000,0.058490,0.000000
4.680000,0.058490,0.000000,0.058490,0.000000
4.698000,0.058490,0.000000,0.058490,0.000000
4.716000,0.058490,0.000000,0.058490,0.000000
4.734000,0.058490,0.000000,0.058490,0.000000
4.752000,0.058490,0.000000,0.058490,0.000000
4.770000,0.058490,0.000000,0.058490,0.000000
4.788000,0.058490,0.000000,0.058490,0.000000
4.806000,0.058490,0.000000,0.058490,0.000000
4.824000,0.058490,0.000000,0.058490,0.000000
4.842000,0.058490,0.000000,0.058490,0.000000
4.860000,0.058490,0.000000,0.058490,0.000000
4.878000,0.058490,0.000000,0.058490,0.000000
4.896000,0.058490,0.000000,0.058490,0.000000
4.914000,0.058490,0.000000,0.058490,0.000000
4.932000,0.058490,0.000000,0.058490,0.000000
4.950000,0.058490,0.000000,0.058490,0.000000
4.968000,0.058490,0.000000,0.058490,0.000000
4.986000,0.058490,0.000000,0.058490,0.000000
5.004000,0.058490,0.000000,0.058490,0.000000
5.022000,0.058490,0.000000,0.058490,0.000000
5.040000,0.058490,0.000000,0.058490,0.000000
5.058000,0.058490,0.000000,0.058490,0.000000
5.076000,0.058490,0.000000,0.058490,0.000000
5.094000,0.058490,0.000000,0.058490,0.000000
5.112000,0.058490,0.000000,0.058490,0.000000
5.130000,0.058490,0.000000,0.058490,0.000000
5.148000,0.058490,0.000000,0.058490,0.000000
5.166000,0.058490,0.000000,0.058490,0.000000
5.184000,0.058490,0.000000,0.058490,0.000000
5.202000,0.058490,0.000000,0.058490,0.000000
5.220000,0.058490,0.000000,0.058490,0.000000
5.238000,0.058490,0.000000,0.058490,0.000000
5.256000,0.058490,0.000000,0.058490,0.000000
5.274000,0.058490,0.000000,0.058490,0.000000
5.292000,0.058490,0.000000,0.058490,0.000000
5.310000,0.058490,0.000000,0.058490,0.000000
5.328000,0.058490,0.000000,0.058490,0.000000
5.346000,0.058490,0.000000,0.058490,0.000000
5.364000,0.058490,0.000000,0.058490,0.000000
5.382000,0.058490,0.000000,0.058490,0.000000
5.400000,0.058490,0.000000,0.058490,0.000000
5.418000,0.058490,0.000000,0.058490,0.000000
5.436000,0.058490,0.000000,0.058490,0.000000
5.454000,0.058490,0.000000,0.058490,0.000000
5.472000,0.058490,0.000000,0.058490,0.000000
5.490000,0.058490,0.000000,0.058490,0.000000
5.508000,0.058490,0.000000,0.058490,0.000000
5.526000,0.058490,0.000000,0.058490,0.000000
5.544000,0.058490,0.000000,0.058490,0.000000
5.562000,0.058490,0.000000,0.058490,0.000000
5.580000,0.058490,0.000000,0.058490,0.000000
5.598000,0.058490,0.000000,0.058490,0.000000
