// Time Position Current
0.0 0.8733651041984558 0.0
1.0070921985815602 0.8733651041984558 0.0
2.0141843971631204 0.8733651041984558 0.0
3.0212765957446805 1.746727466583252 0.029999999329447746
4.028368794326241 1.746727466583252 0.029999999329447746
5.035460992907801 2.6200900077819824 0.009999999776482582
6.042553191489361 3.493452310562134 0.0
7.049645390070921 4.366814613342285 0.019999999552965164
8.056737588652481 6.113539695739746 0.009999999776482582
9.063829787234042 6.113539695739746 0.009999999776482582
10.070921985815602 7.860264301300049 0.009999999776482582
11.078014184397162 7.860264301300049 0.009999999776482582
12.085106382978722 9.170308113098145 0.009999999776482582
13.092198581560282 9.170308113098145 0.009999999776482582
14.099290780141843 10.917033195495605 0.009999999776482582
15.106382978723403 10.917033195495605 0.009999999776482582
16.113475177304963 12.66375732421875 0.0
17.120567375886523 12.66375732421875 0.0
18.127659574468083 13.100439071655273 0.009999999776482582
19.134751773049643 13.973801612854004 0.009999999776482582
20.141843971631204 15.720526695251465 0.009999999776482582
21.148936170212764 16.593889236450195 0.009999999776482582
22.156028368794324 17.030569076538086 0.009999999776482582
23.163120567375884 17.903932571411133 0.009999999776482582
24.170212765957444 19.650657653808594 0.009999999776482582
25.177304964539005 19.650657653808594 0.009999999776482582
26.184397163120565 20.96070098876953 0.009999999776482582
27.191489361702125 20.96070098876953 0.009999999776482582
28.198581560283685 21.834062576293945 0.0
29.205673758865245 21.834062576293945 0.0
30.212765957446805 23.580787658691406 0.019999999552965164
31.219858156028366 24.890830993652344 0.009999999776482582
32.226950354609926 24.890830993652344 0.009999999776482582
33.234042553191486 26.637556076049805 0.0
34.241134751773046 26.637556076049805 0.0
35.248226950354606 27.947599411010742 0.019999999552965164
36.25531914893617 27.947599411010742 0.019999999552965164
37.26241134751773 29.257644653320312 0.009999999776482582
38.26950354609929 29.257644653320312 0.009999999776482582
39.27659574468085 30.131006240844727 0.0
40.28368794326241 31.00436782836914 0.009999999776482582
41.29078014184397 32.31441116333008 0.009999999776482582
42.29787234042553 32.751094818115234 0.019999999552965164
43.30496453900709 33.187774658203125 0.019999999552965164
44.31205673758865 34.93449783325195 0.009999999776482582
45.31914893617021 34.93449783325195 0.009999999776482582
46.32624113475177 36.68122482299805 0.019999999552965164
47.33333333333333 36.68122482299805 0.019999999552965164
48.34042553191489 37.554588317871094 0.019999999552965164
49.34751773049645 37.554588317871094 0.019999999552965164
50.35460992907801 38.86463165283203 0.009999999776482582
51.36170212765957 38.86463165283203 0.009999999776482582
52.36879432624113 41.04803466796875 0.0
53.37588652482269 41.9213981628418 0.019999999552965164
54.38297872340425 42.794761657714844 0.009999999776482582
55.39007092198581 43.66812515258789 0.009999999776482582
56.39716312056737 43.66812515258789 0.009999999776482582
57.40425531914893 44.97816848754883 0.009999999776482582
58.41134751773049 44.97816848754883 0.009999999776482582
59.41843971631205 45.85152816772461 0.019999999552965164
60.42553191489361 45.85152816772461 0.019999999552965164
61.43262411347517 47.16157531738281 0.019999999552965164
62.43971631205673 48.034934997558594 0.019999999552965164
63.44680851063829 48.90829849243164 0.019999999552965164
64.45390070921985 50.21834182739258 0.029999999329447746
65.46099290780141 51.528385162353516 0.019999999552965164
66.46808510638297 51.528385162353516 0.019999999552965164
67.47517730496453 52.83842849731445 0.029999999329447746
68.48226950354609 52.83842849731445 0.029999999329447746
69.48936170212765 54.58515548706055 0.03999999910593033
70.49645390070921 54.58515548706055 0.03999999910593033
71.50354609929077 55.02183532714844 0.029999999329447746
72.51063829787233 55.02183532714844 0.029999999329447746
73.5177304964539 56.768558502197266 0.029999999329447746
74.52482269503545 57.20524215698242 0.03999999910593033
75.53191489361701 58.07860565185547 0.03999999910593033
76.53900709219857 59.388648986816406 0.03999999910593033
77.54609929078013 59.388648986816406 0.03999999910593033
78.5531914893617 61.135372161865234 0.03999999910593033
79.56028368794325 61.135372161865234 0.03999999910593033
80.56737588652481 61.572052001953125 0.05999999865889549
81.57446808510637 61.572052001953125 0.05999999865889549
82.58156028368793 63.31877899169922 0.05000000074505806
83.5886524822695 63.75545883178711 0.03999999910593033
84.59574468085106 64.62882232666016 0.05000000074505806
85.60283687943262 65.50218200683594 0.05000000074505806
86.60992907801418 65.9388656616211 0.05000000074505806
87.61702127659574 67.68559265136719 0.05000000074505806
88.6241134751773 67.68559265136719 0.05000000074505806
89.63120567375886 68.99563598632812 0.05000000074505806
90.63829787234042 68.99563598632812 0.05000000074505806
91.64539007092198 69.8689956665039 0.05000000074505806
92.65248226950354 69.8689956665039 0.05000000074505806
93.6595744680851 71.17903900146484 0.05999999865889549
94.66666666666666 72.05239868164062 0.05000000074505806
95.67375886524822 72.48908233642578 0.05999999865889549
96.68085106382978 73.3624496459961 0.05999999865889549
97.68794326241134 74.67249298095703 0.07000000029802322
98.6950354609929 75.54585266113281 0.07000000029802322
99.70212765957446 75.54585266113281 0.07000000029802322
100.70921985815602 77.2925796508789 0.05999999865889549
101.71631205673758 78.60262298583984 0.09000000357627869
102.72340425531914 78.60262298583984 0.09000000357627869
103.7304964539007 79.91266632080078 0.07999999821186066
104.73758865248226 79.91266632080078 0.07999999821186066
105.74468085106382 81.22270965576172 0.07999999821186066
106.75177304964538 81.22270965576172 0.07999999821186066
107.75886524822694 81.65938568115234 0.09000000357627869
108.7659574468085 81.65938568115234 0.09000000357627869
109.77304964539006 82.96942901611328 0.10000000149011612
110.78014184397162 83.40611267089844 0.10000000149011612
111.78723404255318 84.27947998046875 0.10000000149011612
112.79432624113474 85.15283966064453 0.11999999731779099
113.8014184397163 85.15283966064453 0.11999999731779099
114.80851063829786 85.58952331542969 0.14000000059604645
115.81560283687942 85.58952331542969 0.14000000059604645
116.82269503546098 86.02619934082031 0.15000000596046448
117.82978723404254 86.02619934082031 0.15000000596046448
118.8368794326241 86.46288299560547 0.18000000715255737
119.84397163120566 86.46288299560547 0.18000000715255737
120.85106382978722 87.33624267578125 0.1899999976158142
121.85815602836878 88.20960998535156 0.2199999988079071
122.86524822695034 88.20960998535156 0.2199999988079071
123.8723404255319 88.64628601074219 0.25999999046325684
124.87943262411346 88.64628601074219 0.25999999046325684
125.88652482269502 89.08296966552734 0.019999999552965164
126.89361702127658 89.08296966552734 0.019999999552965164
127.90070921985814 89.08296966552734 0.03999999910593033
128.9078014184397 89.08296966552734 0.03999999910593033
129.91489361702128 89.08296966552734 0.07000000029802322
130.92198581560282 89.08296966552734 0.09000000357627869
131.92907801418437 89.08296966552734 0.10000000149011612
132.93617021276594 89.5196533203125 0.009999999776482582
133.94326241134752 89.5196533203125 0.009999999776482582
134.95035460992906 89.5196533203125 0.05000000074505806
135.9574468085106 89.5196533203125 0.05000000074505806
136.96453900709218 89.95632934570312 0.029999999329447746
137.97163120567376 89.95632934570312 0.029999999329447746
138.9787234042553 89.95632934570312 0.05999999865889549
139.98581560283685 89.95632934570312 0.07999999821186066
140.99290780141843 89.95632934570312 1.0
142.0 90.39301300048828 0.03999999910593033
