{"CFG_ANA_ORBMAXERR": [null, null, null, null],
 "CFG_ANA_USE_ANA": [null, null, null, null],
 "CFG_BATCH_ENABLE": [null, null, null, null],
 "CFG_BATCH_EXTRAODO": [null, null, null, null],
 "CFG_BATCH_EXTRAPVT": [null, null, null, null],
 "CFG_BATCH_MAXENTRIES": [null, null, null, null],
 "CFG_BATCH_PIOACTIVELOW": [null, null, null, null],
 "CFG_BATCH_PIOENABLE": [null, null, null, null],
 "CFG_BATCH_PIOID": [null, null, null, null],
 "CFG_BATCH_WARNTHRS": [null, null, null, null],
 "CFG_BDS_USE_GEO_PRN": [0, 0, 0, 0],
 "CFG_GEOFENCE_CONFLVL": [0, 0, 0, 0],
 "CFG_GEOFENCE_FENCE1_LAT": [0, 0, 0, 0],
 "CFG_GEOFENCE_FENCE1_LON": [0, 0, 0, 0],
 "CFG_GEOFENCE_FENCE1_RAD": [0, 0, 0, 0],
 "CFG_GEOFENCE_FENCE2_LAT": [0, 0, 0, 0],
 "CFG_GEOFENCE_FENCE2_LON": [0, 0, 0, 0],
 "CFG_GEOFENCE_FENCE2_RAD": [0, 0, 0, 0],
 "CFG_GEOFENCE_FENCE3_LAT": [0, 0, 0, 0],
 "CFG_GEOFENCE_FENCE3_LON": [0, 0, 0, 0],
 "CFG_GEOFENCE_FENCE3_RAD": [0, 0, 0, 0],
 "CFG_GEOFENCE_FENCE4_LAT": [0, 0, 0, 0],
 "CFG_GEOFENCE_FENCE4_LON": [0, 0, 0, 0],
 "CFG_GEOFENCE_FENCE4_RAD": [0, 0, 0, 0],
 "CFG_GEOFENCE_PIN": [12, 12, 12, 12],
 "CFG_GEOFENCE_PINPOL": [0, 0, 0, 0],
 "CFG_GEOFENCE_USE_FENCE1": [0, 0, 0, 0],
 "CFG_GEOFENCE_USE_FENCE2": [0, 0, 0, 0],
 "CFG_GEOFENCE_USE_FENCE3": [0, 0, 0, 0],
 "CFG_GEOFENCE_USE_FENCE4": [0, 0, 0, 0],
 "CFG_GEOFENCE_USE_PIO": [0, 0, 0, 0],
 "CFG_HW_ANT_CFG_OPENDET_POL": [1, 1, 1, 1],
 "CFG_HW_ANT_CFG_OPENDET": [0, 0, 0, 0],
 "CFG_HW_ANT_CFG_PWRDOWN_POL": [1, 1, 1, 1],
 "CFG_HW_ANT_CFG_PWRDOWN": [0, 0, 0, 0],
 "CFG_HW_ANT_CFG_RECOVER": [0, 0, 0, 0],
 "CFG_HW_ANT_CFG_SHORTDET_POL": [1, 1, 1, 1],
 "CFG_HW_ANT_CFG_SHORTDET": [0, 0, 0, 0],
 "CFG_HW_ANT_CFG_VOLTCTRL": [0, 0, 0, 0],
 "CFG_HW_ANT_SUP_ENGINE": [0, 0, 0, 0],
 "CFG_HW_ANT_SUP_OPEN_PIN": [16, 16, 16, 16],
 "CFG_HW_ANT_SUP_OPEN_THR": [0, 0, 0, 0],
 "CFG_HW_ANT_SUP_SHORT_PIN": [15, 15, 15, 15],
 "CFG_HW_ANT_SUP_SHORT_THR": [0, 0, 0, 0],
 "CFG_HW_ANT_SUP_SWITCH_PIN": [13, 13, 13, 13],
 "CFG_HW_RF_LNA_MODE": [null, null, null, null],
 "CFG_HW_SENS_WOM_MODE": [null, null, null, null],
 "CFG_HW_SENS_WOM_THLD": [null, null, null, null],
 "CFG_I2C_ADDRESS": [132, 132, 132, 132],
 "CFG_I2C_ENABLED": [1, 1, 1, 1],
 "CFG_I2C_EXTENDEDTIMEOUT": [0, 0, 0, 0],
 "CFG_I2C_REMAP": [null, null, null, null],
 "CFG_I2CINPROT_NMEA": [1, 1, 1, 1],
 "CFG_I2CINPROT_RTCM2X": [null, null, null, null],
 "CFG_I2CINPROT_RTCM3X": [1, 1, 1, 1],
 "CFG_I2CINPROT_SPARTN": [1, 1, 1, 1],
 "CFG_I2CINPROT_UBX": [1, 1, 1, 1],
 "CFG_I2COUTPROT_NMEA": [1, 1, 1, 1],
 "CFG_I2COUTPROT_RTCM3X": [null, null, null, null],
 "CFG_I2COUTPROT_UBX": [1, 1, 1, 1],
 "CFG_INFMSG_NMEA_I2C": ["00000111", "00000111", "00000111", "00000111"],
 "CFG_INFMSG_NMEA_SPI": ["00000111", "00000111", "00000111", "00000111"],
 "CFG_INFMSG_NMEA_UART1": ["00000111", "00000111", "00000111", "00000111"],
 "CFG_INFMSG_NMEA_UART2": ["00000111", "00000111", "00000111", "00000111"],
 "CFG_INFMSG_NMEA_USB": ["00000111", "00000111", "00000111", "00000111"],
 "CFG_INFMSG_UBX_I2C": ["00000000", "00000000", "00000000", "00000000"],
 "CFG_INFMSG_UBX_SPI": ["00000000", "00000000", "00000000", "00000000"],
 "CFG_INFMSG_UBX_UART1": ["00000000", "00000000", "00000000", "00000000"],
 "CFG_INFMSG_UBX_UART2": ["00000000", "00000000", "00000000", "00000000"],
 "CFG_INFMSG_UBX_USB": ["00000000", "00000000", "00000000", "00000000"],
 "CFG_ITFM_ANTSETTING": [0, 0, 0, 0],
 "CFG_ITFM_BBTHRESHOLD": [3, 3, 3, 3],
 "CFG_ITFM_CWTHRESHOLD": [15, 15, 15, 15],
 "CFG_ITFM_ENABLE_AUX": [0, 0, 0, 0],
 "CFG_ITFM_ENABLE": [0, 0, 0, 0],
 "CFG_LOGFILTER_APPLY_ALL_FILTERS": [null, null, null, null],
 "CFG_LOGFILTER_MIN_INTERVAL": [null, null, null, null],
 "CFG_LOGFILTER_ONCE_PER_WAKE_UP_ENA": [null, null, null, null],
 "CFG_LOGFILTER_POSITION_THRS": [null, null, null, null],
 "CFG_LOGFILTER_RECORD_ENA": [null, null, null, null],
 "CFG_LOGFILTER_SPEED_THRS": [null, null, null, null],
 "CFG_LOGFILTER_TIME_THRS": [null, null, null, null],
 "CFG_MOT_GNSSDIST_THRS": [0, 0, 0, 0],
 "CFG_MOT_GNSSSPEED_THRS": [0, 0, 0, 0],
 "CFG_MSGOUT_NMEA_ID_DTM_I2C": [0, 0, 0, 0],
 "CFG_MSGOUT_NMEA_ID_DTM_SPI": [0, 0, 0, 0],
 "CFG_MSGOUT_NMEA_ID_DTM_UART1": [0, 0, 0, 0],
 "CFG_MSGOUT_NMEA_ID_DTM_UART2": [0, 0, 0, 0],
 "CFG_MSGOUT_NMEA_ID_DTM_USB": [0, 0, 0, 0],
 "CFG_MSGOUT_NMEA_ID_GBS_I2C": [0, 0, 0, 0],
 "CFG_MSGOUT_NMEA_ID_GBS_SPI": [0, 0, 0, 0],
 "CFG_MSGOUT_NMEA_ID_GBS_UART1": [0, 0, 0, 0],
 "CFG_MSGOUT_NMEA_ID_GBS_UART2": [0, 0, 0, 0],
 "CFG_MSGOUT_NMEA_ID_GBS_USB": [0, 0, 0, 0],
 "CFG_MSGOUT_NMEA_ID_GGA_I2C": [0, 0, 0, 1],
 "CFG_MSGOUT_NMEA_ID_GGA_SPI": [0, 0, 0, 1],
 "CFG_MSGOUT_NMEA_ID_GGA_UART1": [0, 0, 0, 1],
 "CFG_MSGOUT_NMEA_ID_GGA_UART2": [0, 0, 0, 1],
 "CFG_MSGOUT_NMEA_ID_GGA_USB": [0, 0, 0, 1],
 "CFG_MSGOUT_NMEA_ID_GLL_I2C": [0, 0, 0, 1],
 "CFG_MSGOUT_NMEA_ID_GLL_SPI": [0, 0, 0, 1],
 "CFG_MSGOUT_NMEA_ID_GLL_UART1": [0, 0, 0, 1],
 "CFG_MSGOUT_NMEA_ID_GLL_UART2": [0, 0, 0, 1],
 "CFG_MSGOUT_NMEA_ID_GLL_USB": [0, 0, 0, 1],
 "CFG_MSGOUT_NMEA_ID_GNS_I2C": [0, 0, 0, 0],
 "CFG_MSGOUT_NMEA_ID_GNS_SPI": [0, 0, 0, 0],
 "CFG_MSGOUT_NMEA_ID_GNS_UART1": [0, 0, 0, 0],
 "CFG_MSGOUT_NMEA_ID_GNS_UART2": [0, 0, 0, 0],
 "CFG_MSGOUT_NMEA_ID_GNS_USB": [0, 0, 0, 0],
 "CFG_MSGOUT_NMEA_ID_GRS_I2C": [0, 0, 0, 0],
 "CFG_MSGOUT_NMEA_ID_GRS_SPI": [0, 0, 0, 0],
 "CFG_MSGOUT_NMEA_ID_GRS_UART1": [0, 0, 0, 0],
 "CFG_MSGOUT_NMEA_ID_GRS_UART2": [0, 0, 0, 0],
 "CFG_MSGOUT_NMEA_ID_GRS_USB": [0, 0, 0, 0],
 "CFG_MSGOUT_NMEA_ID_GSA_I2C": [0, 0, 0, 1],
 "CFG_MSGOUT_NMEA_ID_GSA_SPI": [0, 0, 0, 1],
 "CFG_MSGOUT_NMEA_ID_GSA_UART1": [0, 0, 0, 1],
 "CFG_MSGOUT_NMEA_ID_GSA_UART2": [0, 0, 0, 1],
 "CFG_MSGOUT_NMEA_ID_GSA_USB": [0, 0, 0, 1],
 "CFG_MSGOUT_NMEA_ID_GST_I2C": [0, 0, 0, 0],
 "CFG_MSGOUT_NMEA_ID_GST_SPI": [0, 0, 0, 0],
 "CFG_MSGOUT_NMEA_ID_GST_UART1": [0, 0, 0, 0],
 "CFG_MSGOUT_NMEA_ID_GST_UART2": [0, 0, 0, 0],
 "CFG_MSGOUT_NMEA_ID_GST_USB": [0, 0, 0, 0],
 "CFG_MSGOUT_NMEA_ID_GSV_I2C": [0, 0, 0, 1],
 "CFG_MSGOUT_NMEA_ID_GSV_SPI": [0, 0, 0, 1],
 "CFG_MSGOUT_NMEA_ID_GSV_UART1": [0, 0, 0, 1],
 "CFG_MSGOUT_NMEA_ID_GSV_UART2": [0, 0, 0, 1],
 "CFG_MSGOUT_NMEA_ID_GSV_USB": [0, 0, 0, 1],
 "CFG_MSGOUT_NMEA_ID_RLM_I2C": [0, 0, 0, 0],
 "CFG_MSGOUT_NMEA_ID_RLM_SPI": [0, 0, 0, 0],
 "CFG_MSGOUT_NMEA_ID_RLM_UART1": [0, 0, 0, 0],
 "CFG_MSGOUT_NMEA_ID_RLM_UART2": [0, 0, 0, 0],
 "CFG_MSGOUT_NMEA_ID_RLM_USB": [0, 0, 0, 0],
 "CFG_MSGOUT_NMEA_ID_RMC_I2C": [0, 0, 0, 1],
 "CFG_MSGOUT_NMEA_ID_RMC_SPI": [0, 0, 0, 1],
 "CFG_MSGOUT_NMEA_ID_RMC_UART1": [0, 0, 0, 1],
 "CFG_MSGOUT_NMEA_ID_RMC_UART2": [0, 0, 0, 1],
 "CFG_MSGOUT_NMEA_ID_RMC_USB": [0, 0, 0, 1],
 "CFG_MSGOUT_NMEA_ID_THS_I2C": [0, 0, 0, 0],
 "CFG_MSGOUT_NMEA_ID_THS_SPI": [0, 0, 0, 0],
 "CFG_MSGOUT_NMEA_ID_THS_UART1": [0, 0, 0, 0],
 "CFG_MSGOUT_NMEA_ID_THS_UART2": [0, 0, 0, 0],
 "CFG_MSGOUT_NMEA_ID_THS_USB": [0, 0, 0, 0],
 "CFG_MSGOUT_NMEA_ID_VLW_I2C": [0, 0, 0, 0],
 "CFG_MSGOUT_NMEA_ID_VLW_SPI": [0, 0, 0, 0],
 "CFG_MSGOUT_NMEA_ID_VLW_UART1": [0, 0, 0, 0],
 "CFG_MSGOUT_NMEA_ID_VLW_UART2": [0, 0, 0, 0],
 "CFG_MSGOUT_NMEA_ID_VLW_USB": [0, 0, 0, 0],
 "CFG_MSGOUT_NMEA_ID_VTG_I2C": [0, 0, 0, 1],
 "CFG_MSGOUT_NMEA_ID_VTG_SPI": [0, 0, 0, 1],
 "CFG_MSGOUT_NMEA_ID_VTG_UART1": [0, 0, 0, 1],
 "CFG_MSGOUT_NMEA_ID_VTG_UART2": [0, 0, 0, 1],
 "CFG_MSGOUT_NMEA_ID_VTG_USB": [0, 0, 0, 1],
 "CFG_MSGOUT_NMEA_ID_ZDA_I2C": [0, 0, 0, 0],
 "CFG_MSGOUT_NMEA_ID_ZDA_SPI": [0, 0, 0, 0],
 "CFG_MSGOUT_NMEA_ID_ZDA_UART1": [0, 0, 0, 0],
 "CFG_MSGOUT_NMEA_ID_ZDA_UART2": [0, 0, 0, 0],
 "CFG_MSGOUT_NMEA_ID_ZDA_USB": [0, 0, 0, 0],
 "CFG_MSGOUT_NMEA_NAV2_ID_GGA_I2C": [null, null, null, null],
 "CFG_MSGOUT_NMEA_NAV2_ID_GGA_SPI": [null, null, null, null],
 "CFG_MSGOUT_NMEA_NAV2_ID_GGA_UART1": [null, null, null, null],
 "CFG_MSGOUT_NMEA_NAV2_ID_GGA_UART2": [null, null, null, null],
 "CFG_MSGOUT_NMEA_NAV2_ID_GGA_USB": [null, null, null, null],
 "CFG_MSGOUT_NMEA_NAV2_ID_GLL_I2C": [null, null, null, null],
 "CFG_MSGOUT_NMEA_NAV2_ID_GLL_SPI": [null, null, null, null],
 "CFG_MSGOUT_NMEA_NAV2_ID_GLL_UART1": [null, null, null, null],
 "CFG_MSGOUT_NMEA_NAV2_ID_GLL_UART2": [null, null, null, null],
 "CFG_MSGOUT_NMEA_NAV2_ID_GLL_USB": [null, null, null, null],
 "CFG_MSGOUT_NMEA_NAV2_ID_GNS_I2C": [null, null, null, null],
 "CFG_MSGOUT_NMEA_NAV2_ID_GNS_SPI": [null, null, null, null],
 "CFG_MSGOUT_NMEA_NAV2_ID_GNS_UART1": [null, null, null, null],
 "CFG_MSGOUT_NMEA_NAV2_ID_GNS_UART2": [null, null, null, null],
 "CFG_MSGOUT_NMEA_NAV2_ID_GNS_USB": [null, null, null, null],
 "CFG_MSGOUT_NMEA_NAV2_ID_GSA_I2C": [null, null, null, null],
 "CFG_MSGOUT_NMEA_NAV2_ID_GSA_SPI": [null, null, null, null],
 "CFG_MSGOUT_NMEA_NAV2_ID_GSA_UART1": [null, null, null, null],
 "CFG_MSGOUT_NMEA_NAV2_ID_GSA_UART2": [null, null, null, null],
 "CFG_MSGOUT_NMEA_NAV2_ID_GSA_USB": [null, null, null, null],
 "CFG_MSGOUT_NMEA_NAV2_ID_RMC_I2C": [null, null, null, null],
 "CFG_MSGOUT_NMEA_NAV2_ID_RMC_SPI": [null, null, null, null],
 "CFG_MSGOUT_NMEA_NAV2_ID_RMC_UART1": [null, null, null, null],
 "CFG_MSGOUT_NMEA_NAV2_ID_RMC_UART2": [null, null, null, null],
 "CFG_MSGOUT_NMEA_NAV2_ID_RMC_USB": [null, null, null, null],
 "CFG_MSGOUT_NMEA_NAV2_ID_VTG_I2C": [null, null, null, null],
 "CFG_MSGOUT_NMEA_NAV2_ID_VTG_SPI": [null, null, null, null],
 "CFG_MSGOUT_NMEA_NAV2_ID_VTG_UART1": [null, null, null, null],
 "CFG_MSGOUT_NMEA_NAV2_ID_VTG_UART2": [null, null, null, null],
 "CFG_MSGOUT_NMEA_NAV2_ID_VTG_USB": [null, null, null, null],
 "CFG_MSGOUT_NMEA_NAV2_ID_ZDA_I2C": [null, null, null, null],
 "CFG_MSGOUT_NMEA_NAV2_ID_ZDA_SPI": [null, null, null, null],
 "CFG_MSGOUT_NMEA_NAV2_ID_ZDA_UART1": [null, null, null, null],
 "CFG_MSGOUT_NMEA_NAV2_ID_ZDA_UART2": [null, null, null, null],
 "CFG_MSGOUT_NMEA_NAV2_ID_ZDA_USB": [null, null, null, null],
 "CFG_MSGOUT_PUBX_ID_POLYP_I2C": [0, 0, 0, 0],
 "CFG_MSGOUT_PUBX_ID_POLYP_SPI": [0, 0, 0, 0],
 "CFG_MSGOUT_PUBX_ID_POLYP_UART1": [0, 0, 0, 0],
 "CFG_MSGOUT_PUBX_ID_POLYP_UART2": [0, 0, 0, 0],
 "CFG_MSGOUT_PUBX_ID_POLYP_USB": [0, 0, 0, 0],
 "CFG_MSGOUT_PUBX_ID_POLYS_I2C": [0, 0, 0, 0],
 "CFG_MSGOUT_PUBX_ID_POLYS_SPI": [0, 0, 0, 0],
 "CFG_MSGOUT_PUBX_ID_POLYS_UART1": [0, 0, 0, 0],
 "CFG_MSGOUT_PUBX_ID_POLYS_UART2": [0, 0, 0, 0],
 "CFG_MSGOUT_PUBX_ID_POLYS_USB": [0, 0, 0, 0],
 "CFG_MSGOUT_PUBX_ID_POLYT_I2C": [0, 0, 0, 0],
 "CFG_MSGOUT_PUBX_ID_POLYT_SPI": [0, 0, 0, 0],
 "CFG_MSGOUT_PUBX_ID_POLYT_UART1": [0, 0, 0, 0],
 "CFG_MSGOUT_PUBX_ID_POLYT_UART2": [0, 0, 0, 0],
 "CFG_MSGOUT_PUBX_ID_POLYT_USB": [0, 0, 0, 0],
 "CFG_MSGOUT_RTCM_3X_TYPE1001_I2C": [null, null, null, null],
 "CFG_MSGOUT_RTCM_3X_TYPE1001_SPI": [null, null, null, null],
 "CFG_MSGOUT_RTCM_3X_TYPE1001_UART1": [null, null, null, null],
 "CFG_MSGOUT_RTCM_3X_TYPE1001_UART2": [null, null, null, null],
 "CFG_MSGOUT_RTCM_3X_TYPE1001_USB": [null, null, null, null],
 "CFG_MSGOUT_RTCM_3X_TYPE1002_I2C": [null, null, null, null],
 "CFG_MSGOUT_RTCM_3X_TYPE1002_SPI": [null, null, null, null],
 "CFG_MSGOUT_RTCM_3X_TYPE1002_UART1": [null, null, null, null],
 "CFG_MSGOUT_RTCM_3X_TYPE1002_UART2": [null, null, null, null],
 "CFG_MSGOUT_RTCM_3X_TYPE1002_USB": [null, null, null, null],
 "CFG_MSGOUT_RTCM_3X_TYPE1005_I2C": [null, null, null, null],
 "CFG_MSGOUT_RTCM_3X_TYPE1005_SPI": [null, null, null, null],
 "CFG_MSGOUT_RTCM_3X_TYPE1005_UART1": [null, null, null, null],
 "CFG_MSGOUT_RTCM_3X_TYPE1005_UART2": [null, null, null, null],
 "CFG_MSGOUT_RTCM_3X_TYPE1005_USB": [null, null, null, null],
 "CFG_MSGOUT_RTCM_3X_TYPE1006_I2C": [null, null, null, null],
 "CFG_MSGOUT_RTCM_3X_TYPE1006_SPI": [null, null, null, null],
 "CFG_MSGOUT_RTCM_3X_TYPE1006_UART1": [null, null, null, null],
 "CFG_MSGOUT_RTCM_3X_TYPE1006_UART2": [null, null, null, null],
 "CFG_MSGOUT_RTCM_3X_TYPE1006_USB": [null, null, null, null],
 "CFG_MSGOUT_RTCM_3X_TYPE1007_I2C": [null, null, null, null],
 "CFG_MSGOUT_RTCM_3X_TYPE1007_SPI": [null, null, null, null],
 "CFG_MSGOUT_RTCM_3X_TYPE1007_UART1": [null, null, null, null],
 "CFG_MSGOUT_RTCM_3X_TYPE1007_UART2": [null, null, null, null],
 "CFG_MSGOUT_RTCM_3X_TYPE1007_USB": [null, null, null, null],
 "CFG_MSGOUT_RTCM_3X_TYPE1009_I2C": [null, null, null, null],
 "CFG_MSGOUT_RTCM_3X_TYPE1009_SPI": [null, null, null, null],
 "CFG_MSGOUT_RTCM_3X_TYPE1009_UART1": [null, null, null, null],
 "CFG_MSGOUT_RTCM_3X_TYPE1009_UART2": [null, null, null, null],
 "CFG_MSGOUT_RTCM_3X_TYPE1009_USB": [null, null, null, null],
 "CFG_MSGOUT_RTCM_3X_TYPE1010_I2C": [null, null, null, null],
 "CFG_MSGOUT_RTCM_3X_TYPE1010_SPI": [null, null, null, null],
 "CFG_MSGOUT_RTCM_3X_TYPE1010_UART1": [null, null, null, null],
 "CFG_MSGOUT_RTCM_3X_TYPE1010_UART2": [null, null, null, null],
 "CFG_MSGOUT_RTCM_3X_TYPE1010_USB": [null, null, null, null],
 "CFG_MSGOUT_RTCM_3X_TYPE1074_I2C": [null, null, null, null],
 "CFG_MSGOUT_RTCM_3X_TYPE1074_SPI": [null, null, null, null],
 "CFG_MSGOUT_RTCM_3X_TYPE1074_UART1": [null, null, null, null],
 "CFG_MSGOUT_RTCM_3X_TYPE1074_UART2": [null, null, null, null],
 "CFG_MSGOUT_RTCM_3X_TYPE1074_USB": [null, null, null, null],
 "CFG_MSGOUT_RTCM_3X_TYPE1077_I2C": [null, null, null, null],
 "CFG_MSGOUT_RTCM_3X_TYPE1077_SPI": [null, null, null, null],
 "CFG_MSGOUT_RTCM_3X_TYPE1077_UART1": [null, null, null, null],
 "CFG_MSGOUT_RTCM_3X_TYPE1077_UART2": [null, null, null, null],
 "CFG_MSGOUT_RTCM_3X_TYPE1077_USB": [null, null, null, null],
 "CFG_MSGOUT_RTCM_3X_TYPE1084_I2C": [null, null, null, null],
 "CFG_MSGOUT_RTCM_3X_TYPE1084_SPI": [null, null, null, null],
 "CFG_MSGOUT_RTCM_3X_TYPE1084_UART1": [null, null, null, null],
 "CFG_MSGOUT_RTCM_3X_TYPE1084_UART2": [null, null, null, null],
 "CFG_MSGOUT_RTCM_3X_TYPE1084_USB": [null, null, null, null],
 "CFG_MSGOUT_RTCM_3X_TYPE1087_I2C": [null, null, null, null],
 "CFG_MSGOUT_RTCM_3X_TYPE1087_SPI": [null, null, null, null],
 "CFG_MSGOUT_RTCM_3X_TYPE1087_UART1": [null, null, null, null],
 "CFG_MSGOUT_RTCM_3X_TYPE1087_UART2": [null, null, null, null],
 "CFG_MSGOUT_RTCM_3X_TYPE1087_USB": [null, null, null, null],
 "CFG_MSGOUT_RTCM_3X_TYPE1094_I2C": [null, null, null, null],
 "CFG_MSGOUT_RTCM_3X_TYPE1094_SPI": [null, null, null, null],
 "CFG_MSGOUT_RTCM_3X_TYPE1094_UART1": [null, null, null, null],
 "CFG_MSGOUT_RTCM_3X_TYPE1094_UART2": [null, null, null, null],
 "CFG_MSGOUT_RTCM_3X_TYPE1094_USB": [null, null, null, null],
 "CFG_MSGOUT_RTCM_3X_TYPE1097_I2C": [null, null, null, null],
 "CFG_MSGOUT_RTCM_3X_TYPE1097_SPI": [null, null, null, null],
 "CFG_MSGOUT_RTCM_3X_TYPE1097_UART1": [null, null, null, null],
 "CFG_MSGOUT_RTCM_3X_TYPE1097_UART2": [null, null, null, null],
 "CFG_MSGOUT_RTCM_3X_TYPE1097_USB": [null, null, null, null],
 "CFG_MSGOUT_RTCM_3X_TYPE1124_I2C": [null, null, null, null],
 "CFG_MSGOUT_RTCM_3X_TYPE1124_SPI": [null, null, null, null],
 "CFG_MSGOUT_RTCM_3X_TYPE1124_UART1": [null, null, null, null],
 "CFG_MSGOUT_RTCM_3X_TYPE1124_UART2": [null, null, null, null],
 "CFG_MSGOUT_RTCM_3X_TYPE1124_USB": [null, null, null, null],
 "CFG_MSGOUT_RTCM_3X_TYPE1127_I2C": [null, null, null, null],
 "CFG_MSGOUT_RTCM_3X_TYPE1127_SPI": [null, null, null, null],
 "CFG_MSGOUT_RTCM_3X_TYPE1127_UART1": [null, null, null, null],
 "CFG_MSGOUT_RTCM_3X_TYPE1127_UART2": [null, null, null, null],
 "CFG_MSGOUT_RTCM_3X_TYPE1127_USB": [null, null, null, null],
 "CFG_MSGOUT_RTCM_3X_TYPE1230_I2C": [null, null, null, null],
 "CFG_MSGOUT_RTCM_3X_TYPE1230_SPI": [null, null, null, null],
 "CFG_MSGOUT_RTCM_3X_TYPE1230_UART1": [null, null, null, null],
 "CFG_MSGOUT_RTCM_3X_TYPE1230_UART2": [null, null, null, null],
 "CFG_MSGOUT_RTCM_3X_TYPE1230_USB": [null, null, null, null],
 "CFG_MSGOUT_RTCM_3X_TYPE4072_0_I2C": [null, null, null, null],
 "CFG_MSGOUT_RTCM_3X_TYPE4072_0_SPI": [null, null, null, null],
 "CFG_MSGOUT_RTCM_3X_TYPE4072_0_UART1": [null, null, null, null],
 "CFG_MSGOUT_RTCM_3X_TYPE4072_0_UART2": [null, null, null, null],
 "CFG_MSGOUT_RTCM_3X_TYPE4072_0_USB": [null, null, null, null],
 "CFG_MSGOUT_RTCM_3X_TYPE4072_1_I2C": [null, null, null, null],
 "CFG_MSGOUT_RTCM_3X_TYPE4072_1_SPI": [null, null, null, null],
 "CFG_MSGOUT_RTCM_3X_TYPE4072_1_UART1": [null, null, null, null],
 "CFG_MSGOUT_RTCM_3X_TYPE4072_1_UART2": [null, null, null, null],
 "CFG_MSGOUT_RTCM_3X_TYPE4072_1_USB": [null, null, null, null],
 "CFG_MSGOUT_UBX_AID_ALM_I2C": [null, null, null, null],
 "CFG_MSGOUT_UBX_AID_ALM_SPI": [null, null, null, null],
 "CFG_MSGOUT_UBX_AID_ALM_UART1": [null, null, null, null],
 "CFG_MSGOUT_UBX_AID_ALM_UART2": [null, null, null, null],
 "CFG_MSGOUT_UBX_AID_ALM_USB": [null, null, null, null],
 "CFG_MSGOUT_UBX_AID_AOP_I2C": [null, null, null, null],
 "CFG_MSGOUT_UBX_AID_AOP_SPI": [null, null, null, null],
 "CFG_MSGOUT_UBX_AID_AOP_UART1": [null, null, null, null],
 "CFG_MSGOUT_UBX_AID_AOP_UART2": [null, null, null, null],
 "CFG_MSGOUT_UBX_AID_AOP_USB": [null, null, null, null],
 "CFG_MSGOUT_UBX_AID_EPH_I2C": [null, null, null, null],
 "CFG_MSGOUT_UBX_AID_EPH_SPI": [null, null, null, null],
 "CFG_MSGOUT_UBX_AID_EPH_UART1": [null, null, null, null],
 "CFG_MSGOUT_UBX_AID_EPH_UART2": [null, null, null, null],
 "CFG_MSGOUT_UBX_AID_EPH_USB": [null, null, null, null],
 "CFG_MSGOUT_UBX_AID_INI_I2C": [null, null, null, null],
 "CFG_MSGOUT_UBX_AID_INI_SPI": [null, null, null, null],
 "CFG_MSGOUT_UBX_AID_INI_UART1": [null, null, null, null],
 "CFG_MSGOUT_UBX_AID_INI_UART2": [null, null, null, null],
 "CFG_MSGOUT_UBX_AID_INI_USB": [null, null, null, null],
 "CFG_MSGOUT_UBX_DBG_31_I2C": [0, 0, 0, 0],
 "CFG_MSGOUT_UBX_DBG_31_SPI": [0, 0, 0, 0],
 "CFG_MSGOUT_UBX_DBG_31_UART1": [0, 0, 0, 0],
 "CFG_MSGOUT_UBX_DBG_31_UART2": [0, 0, 0, 0],
 "CFG_MSGOUT_UBX_DBG_31_USB": [0, 0, 0, 0],
 "CFG_MSGOUT_UBX_ESF_ALG_I2C": [0, 0, 0, 0],
 "CFG_MSGOUT_UBX_ESF_ALG_SPI": [0, 0, 0, 0],
 "CFG_MSGOUT_UBX_ESF_ALG_UART1": [0, 0, 0, 0],
 "CFG_MSGOUT_UBX_ESF_ALG_UART2": [0, 0, 0, 0],
 "CFG_MSGOUT_UBX_ESF_ALG_USB": [0, 0, 0, 0],
 "CFG_MSGOUT_UBX_ESF_CAL_I2C": [null, null, null, null],
 "CFG_MSGOUT_UBX_ESF_CAL_SPI": [null, null, null, null],
 "CFG_MSGOUT_UBX_ESF_CAL_UART1": [null, null, null, null],
 "CFG_MSGOUT_UBX_ESF_CAL_UART2": [null, null, null, null],
 "CFG_MSGOUT_UBX_ESF_CAL_USB": [null, null, null, null],
 "CFG_MSGOUT_UBX_ESF_INS_I2C": [0, 0, 0, 0],
 "CFG_MSGOUT_UBX_ESF_INS_SPI": [0, 0, 0, 0],
 "CFG_MSGOUT_UBX_ESF_INS_UART1": [0, 0, 0, 0],
 "CFG_MSGOUT_UBX_ESF_INS_UART2": [0, 0, 0, 0],
 "CFG_MSGOUT_UBX_ESF_INS_USB": [0, 0, 0, 0],
 "CFG_MSGOUT_UBX_ESF_MEAS_I2C": [0, 0, 0, 0],
 "CFG_MSGOUT_UBX_ESF_MEAS_SPI": [0, 0, 0, 0],
 "CFG_MSGOUT_UBX_ESF_MEAS_UART1": [0, 0, 0, 0],
 "CFG_MSGOUT_UBX_ESF_MEAS_UART2": [0, 0, 0, 0],
 "CFG_MSGOUT_UBX_ESF_MEAS_USB": [0, 0, 0, 0],
 "CFG_MSGOUT_UBX_ESF_RAW_I2C": [0, 0, 0, 0],
 "CFG_MSGOUT_UBX_ESF_RAW_SPI": [0, 0, 0, 0],
 "CFG_MSGOUT_UBX_ESF_RAW_UART1": [0, 0, 0, 0],
 "CFG_MSGOUT_UBX_ESF_RAW_UART2": [0, 0, 0, 0],
 "CFG_MSGOUT_UBX_ESF_RAW_USB": [0, 0, 0, 0],
 "CFG_MSGOUT_UBX_ESF_STATUS_I2C": [0, 0, 0, 0],
 "CFG_MSGOUT_UBX_ESF_STATUS_SPI": [0, 0, 0, 0],
 "CFG_MSGOUT_UBX_ESF_STATUS_UART1": [0, 0, 0, 0],
 "CFG_MSGOUT_UBX_ESF_STATUS_UART2": [0, 0, 0, 0],
 "CFG_MSGOUT_UBX_ESF_STATUS_USB": [0, 0, 0, 0],
 "CFG_MSGOUT_UBX_HNR_ATT_I2C": [null, null, null, null],
 "CFG_MSGOUT_UBX_HNR_ATT_SPI": [null, null, null, null],
 "CFG_MSGOUT_UBX_HNR_ATT_UART1": [null, null, null, null],
 "CFG_MSGOUT_UBX_HNR_ATT_UART2": [null, null, null, null],
 "CFG_MSGOUT_UBX_HNR_ATT_USB": [null, null, null, null],
 "CFG_MSGOUT_UBX_HNR_INS_I2C": [null, null, null, null],
 "CFG_MSGOUT_UBX_HNR_INS_SPI": [null, null, null, null],
 "CFG_MSGOUT_UBX_HNR_INS_UART1": [null, null, null, null],
 "CFG_MSGOUT_UBX_HNR_INS_UART2": [null, null, null, null],
 "CFG_MSGOUT_UBX_HNR_INS_USB": [null, null, null, null],
 "CFG_MSGOUT_UBX_HNR_PVT_I2C": [null, null, null, null],
 "CFG_MSGOUT_UBX_HNR_PVT_SPI": [null, null, null, null],
 "CFG_MSGOUT_UBX_HNR_PVT_UART1": [null, null, null, null],
 "CFG_MSGOUT_UBX_HNR_PVT_UART2": [null, null, null, null],
 "CFG_MSGOUT_UBX_HNR_PVT_USB": [null, null, null, null],
 "CFG_MSGOUT_UBX_LOG_INFO_I2C": [null, null, null, null],
 "CFG_MSGOUT_UBX_LOG_INFO_SPI": [null, null, null, null],
 "CFG_MSGOUT_UBX_LOG_INFO_UART1": [null, null, null, null],
 "CFG_MSGOUT_UBX_LOG_INFO_UART2": [null, null, null, null],
 "CFG_MSGOUT_UBX_LOG_INFO_USB": [null, null, null, null],
 "CFG_MSGOUT_UBX_MON_COMMS_I2C": [0, 0, 0, 0],
 "CFG_MSGOUT_UBX_MON_COMMS_SPI": [0, 0, 0, 0],
 "CFG_MSGOUT_UBX_MON_COMMS_UART1": [0, 0, 0, 0],
 "CFG_MSGOUT_UBX_MON_COMMS_UART2": [0, 0, 0, 0],
 "CFG_MSGOUT_UBX_MON_COMMS_USB": [0, 0, 0, 0],
 "CFG_MSGOUT_UBX_MON_HW_I2C": [0, 0, 0, 0],
 "CFG_MSGOUT_UBX_MON_HW_SPI": [0, 0, 0, 0],
 "CFG_MSGOUT_UBX_MON_HW_UART1": [0, 0, 0, 0],
 "CFG_MSGOUT_UBX_MON_HW_UART2": [0, 0, 0, 0],
 "CFG_MSGOUT_UBX_MON_HW_USB": [0, 0, 0, 0],
 "CFG_MSGOUT_UBX_MON_HW2_I2C": [0, 0, 0, 0],
 "CFG_MSGOUT_UBX_MON_HW2_SPI": [0, 0, 0, 0],
 "CFG_MSGOUT_UBX_MON_HW2_UART1": [0, 0, 0, 0],
 "CFG_MSGOUT_UBX_MON_HW2_UART2": [0, 0, 0, 0],
 "CFG_MSGOUT_UBX_MON_HW2_USB": [0, 0, 0, 0],
 "CFG_MSGOUT_UBX_MON_HW3_I2C": [0, 0, 0, 0],
 "CFG_MSGOUT_UBX_MON_HW3_SPI": [0, 0, 0, 0],
 "CFG_MSGOUT_UBX_MON_HW3_UART1": [0, 0, 0, 0],
 "CFG_MSGOUT_UBX_MON_HW3_UART2": [0, 0, 0, 0],
 "CFG_MSGOUT_UBX_MON_HW3_USB": [0, 0, 0, 0],
 "CFG_MSGOUT_UBX_MON_IO_I2C": [0, 0, 0, 0],
 "CFG_MSGOUT_UBX_MON_IO_SPI": [0, 0, 0, 0],
 "CFG_MSGOUT_UBX_MON_IO_UART1": [0, 0, 0, 0],
 "CFG_MSGOUT_UBX_MON_IO_UART2": [0, 0, 0, 0],
 "CFG_MSGOUT_UBX_MON_IO_USB": [0, 0, 0, 0],
 "CFG_MSGOUT_UBX_MON_MSGPP_I2C": [0, 0, 0, 0],
 "CFG_MSGOUT_UBX_MON_MSGPP_SPI": [0, 0, 0, 0],
 "CFG_MSGOUT_UBX_MON_MSGPP_UART1": [0, 0, 0, 0],
 "CFG_MSGOUT_UBX_MON_MSGPP_UART2": [0, 0, 0, 0],
 "CFG_MSGOUT_UBX_MON_MSGPP_USB": [0, 0, 0, 0],
 "CFG_MSGOUT_UBX_MON_RF_I2C": [0, 0, 0, 0],
 "CFG_MSGOUT_UBX_MON_RF_SPI": [0, 0, 0, 0],
 "CFG_MSGOUT_UBX_MON_RF_UART1": [0, 0, 0, 0],
 "CFG_MSGOUT_UBX_MON_RF_UART2": [0, 0, 0, 0],
 "CFG_MSGOUT_UBX_MON_RF_USB": [0, 0, 0, 0],
 "CFG_MSGOUT_UBX_MON_RXBUF_I2C": [0, 0, 0, 0],
 "CFG_MSGOUT_UBX_MON_RXBUF_SPI": [0, 0, 0, 0],
 "CFG_MSGOUT_UBX_MON_RXBUF_UART1": [0, 0, 0, 0],
 "CFG_MSGOUT_UBX_MON_RXBUF_UART2": [0, 0, 0, 0],
 "CFG_MSGOUT_UBX_MON_RXBUF_USB": [0, 0, 0, 0],
 "CFG_MSGOUT_UBX_MON_RXR_I2C": [0, 0, 0, 0],
 "CFG_MSGOUT_UBX_MON_RXR_SPI": [0, 0, 0, 0],
 "CFG_MSGOUT_UBX_MON_RXR_UART1": [0, 0, 0, 0],
 "CFG_MSGOUT_UBX_MON_RXR_UART2": [0, 0, 0, 0],
 "CFG_MSGOUT_UBX_MON_RXR_USB": [0, 0, 0, 0],
 "CFG_MSGOUT_UBX_MON_SPAN_I2C": [0, 0, 0, 0],
 "CFG_MSGOUT_UBX_MON_SPAN_SPI": [0, 0, 0, 0],
 "CFG_MSGOUT_UBX_MON_SPAN_UART1": [0, 0, 0, 0],
 "CFG_MSGOUT_UBX_MON_SPAN_UART2": [0, 0, 0, 0],
 "CFG_MSGOUT_UBX_MON_SPAN_USB": [0, 0, 0, 0],
 "CFG_MSGOUT_UBX_MON_SYS_I2C": [null, null, null, null],
 "CFG_MSGOUT_UBX_MON_SYS_SPI": [null, null, null, null],
 "CFG_MSGOUT_UBX_MON_SYS_UART1": [null, null, null, null],
 "CFG_MSGOUT_UBX_MON_SYS_UART2": [null, null, null, null],
 "CFG_MSGOUT_UBX_MON_SYS_USB": [null, null, null, null],
 "CFG_MSGOUT_UBX_MON_TXBUF_I2C": [0, 0, 0, 0],
 "CFG_MSGOUT_UBX_MON_TXBUF_SPI": [0, 0, 0, 0],
 "CFG_MSGOUT_UBX_MON_TXBUF_UART1": [0, 0, 0, 0],
 "CFG_MSGOUT_UBX_MON_TXBUF_UART2": [0, 0, 0, 0],
 "CFG_MSGOUT_UBX_MON_TXBUF_USB": [0, 0, 0, 0],
 "CFG_MSGOUT_UBX_NAV_AOPSTATUS_I2C": [null, null, null, null],
 "CFG_MSGOUT_UBX_NAV_AOPSTATUS_SPI": [null, null, null, null],
 "CFG_MSGOUT_UBX_NAV_AOPSTATUS_UART1": [null, null, null, null],
 "CFG_MSGOUT_UBX_NAV_AOPSTATUS_UART2": [null, null, null, null],
 "CFG_MSGOUT_UBX_NAV_AOPSTATUS_USB": [null, null, null, null],
 "CFG_MSGOUT_UBX_NAV_ATT_I2C": [1, 1, 1, 0],
 "CFG_MSGOUT_UBX_NAV_ATT_SPI": [1, 1, 1, 0],
 "CFG_MSGOUT_UBX_NAV_ATT_UART1": [1, 1, 1, 0],
 "CFG_MSGOUT_UBX_NAV_ATT_UART2": [1, 1, 1, 0],
 "CFG_MSGOUT_UBX_NAV_ATT_USB": [1, 1, 1, 0],
 "CFG_MSGOUT_UBX_NAV_CLOCK_I2C": [1, 1, 1, 0],
 "CFG_MSGOUT_UBX_NAV_CLOCK_SPI": [1, 1, 1, 0],
 "CFG_MSGOUT_UBX_NAV_CLOCK_UART1": [1, 1, 1, 0],
 "CFG_MSGOUT_UBX_NAV_CLOCK_UART2": [1, 1, 1, 0],
 "CFG_MSGOUT_UBX_NAV_CLOCK_USB": [1, 1, 1, 0],
 "CFG_MSGOUT_UBX_NAV_COV_I2C": [1, 1, 1, 0],
 "CFG_MSGOUT_UBX_NAV_COV_SPI": [1, 1, 1, 0],
 "CFG_MSGOUT_UBX_NAV_COV_UART1": [1, 1, 1, 0],
 "CFG_MSGOUT_UBX_NAV_COV_UART2": [1, 1, 1, 0],
 "CFG_MSGOUT_UBX_NAV_COV_USB": [1, 1, 1, 0],
 "CFG_MSGOUT_UBX_NAV_DGPS_I2C": [null, null, null, null],
 "CFG_MSGOUT_UBX_NAV_DGPS_SPI": [null, null, null, null],
 "CFG_MSGOUT_UBX_NAV_DGPS_UART1": [null, null, null, null],
 "CFG_MSGOUT_UBX_NAV_DGPS_UART2": [null, null, null, null],
 "CFG_MSGOUT_UBX_NAV_DGPS_USB": [null, null, null, null],
 "CFG_MSGOUT_UBX_NAV_DOP_I2C": [1, 1, 1, 0],
 "CFG_MSGOUT_UBX_NAV_DOP_SPI": [1, 1, 1, 0],
 "CFG_MSGOUT_UBX_NAV_DOP_UART1": [1, 1, 1, 0],
 "CFG_MSGOUT_UBX_NAV_DOP_UART2": [1, 1, 1, 0],
 "CFG_MSGOUT_UBX_NAV_DOP_USB": [1, 1, 1, 0],
 "CFG_MSGOUT_UBX_NAV_EELL_I2C": [1, 1, 1, 0],
 "CFG_MSGOUT_UBX_NAV_EELL_SPI": [1, 1, 1, 0],
 "CFG_MSGOUT_UBX_NAV_EELL_UART1": [1, 1, 1, 0],
 "CFG_MSGOUT_UBX_NAV_EELL_UART2": [1, 1, 1, 0],
 "CFG_MSGOUT_UBX_NAV_EELL_USB": [1, 1, 1, 0],
 "CFG_MSGOUT_UBX_NAV_EOE_I2C": [1, 1, 1, 0],
 "CFG_MSGOUT_UBX_NAV_EOE_SPI": [1, 1, 1, 0],
 "CFG_MSGOUT_UBX_NAV_EOE_UART1": [1, 1, 1, 0],
 "CFG_MSGOUT_UBX_NAV_EOE_UART2": [1, 1, 1, 0],
 "CFG_MSGOUT_UBX_NAV_EOE_USB": [1, 1, 1, 0],
 "CFG_MSGOUT_UBX_NAV_GEOFENCE_I2C": [1, 1, 1, 0],
 "CFG_MSGOUT_UBX_NAV_GEOFENCE_SPI": [1, 1, 1, 0],
 "CFG_MSGOUT_UBX_NAV_GEOFENCE_UART1": [1, 1, 1, 0],
 "CFG_MSGOUT_UBX_NAV_GEOFENCE_UART2": [1, 1, 1, 0],
 "CFG_MSGOUT_UBX_NAV_GEOFENCE_USB": [1, 1, 1, 0],
 "CFG_MSGOUT_UBX_NAV_HPPOSECEF_I2C": [1, 1, 1, 0],
 "CFG_MSGOUT_UBX_NAV_HPPOSECEF_SPI": [1, 1, 1, 0],
 "CFG_MSGOUT_UBX_NAV_HPPOSECEF_UART1": [1, 1, 1, 0],
 "CFG_MSGOUT_UBX_NAV_HPPOSECEF_UART2": [1, 1, 1, 0],
 "CFG_MSGOUT_UBX_NAV_HPPOSECEF_USB": [1, 1, 1, 0],
 "CFG_MSGOUT_UBX_NAV_HPPOSLLH_I2C": [1, 1, 1, 0],
 "CFG_MSGOUT_UBX_NAV_HPPOSLLH_SPI": [1, 1, 1, 0],
 "CFG_MSGOUT_UBX_NAV_HPPOSLLH_UART1": [1, 1, 1, 0],
 "CFG_MSGOUT_UBX_NAV_HPPOSLLH_UART2": [1, 1, 1, 0],
 "CFG_MSGOUT_UBX_NAV_HPPOSLLH_USB": [1, 1, 1, 0],
 "CFG_MSGOUT_UBX_NAV_NMI_I2C": [null, null, null, null],
 "CFG_MSGOUT_UBX_NAV_NMI_SPI": [null, null, null, null],
 "CFG_MSGOUT_UBX_NAV_NMI_UART1": [null, null, null, null],
 "CFG_MSGOUT_UBX_NAV_NMI_UART2": [null, null, null, null],
 "CFG_MSGOUT_UBX_NAV_NMI_USB": [null, null, null, null],
 "CFG_MSGOUT_UBX_NAV_ODO_I2C": [1, 1, 1, 0],
 "CFG_MSGOUT_UBX_NAV_ODO_SPI": [1, 1, 1, 0],
 "CFG_MSGOUT_UBX_NAV_ODO_UART1": [1, 1, 1, 0],
 "CFG_MSGOUT_UBX_NAV_ODO_UART2": [1, 1, 1, 0],
 "CFG_MSGOUT_UBX_NAV_ODO_USB": [1, 1, 1, 0],
 "CFG_MSGOUT_UBX_NAV_ORB_I2C": [1, 1, 1, 0],
 "CFG_MSGOUT_UBX_NAV_ORB_SPI": [1, 1, 1, 0],
 "CFG_MSGOUT_UBX_NAV_ORB_UART1": [1, 1, 1, 0],
 "CFG_MSGOUT_UBX_NAV_ORB_UART2": [1, 1, 1, 0],
 "CFG_MSGOUT_UBX_NAV_ORB_USB": [1, 1, 1, 0],
 "CFG_MSGOUT_UBX_NAV_PL_I2C": [null, null, null, null],
 "CFG_MSGOUT_UBX_NAV_PL_SPI": [null, null, null, null],
 "CFG_MSGOUT_UBX_NAV_PL_UART1": [null, null, null, null],
 "CFG_MSGOUT_UBX_NAV_PL_UART2": [null, null, null, null],
 "CFG_MSGOUT_UBX_NAV_PL_USB": [null, null, null, null],
 "CFG_MSGOUT_UBX_NAV_POSECEF_I2C": [1, 1, 1, 0],
 "CFG_MSGOUT_UBX_NAV_POSECEF_SPI": [1, 1, 1, 0],
 "CFG_MSGOUT_UBX_NAV_POSECEF_UART1": [1, 1, 1, 0],
 "CFG_MSGOUT_UBX_NAV_POSECEF_UART2": [1, 1, 1, 0],
 "CFG_MSGOUT_UBX_NAV_POSECEF_USB": [1, 1, 1, 0],
 "CFG_MSGOUT_UBX_NAV_POSLLH_I2C": [1, 1, 1, 0],
 "CFG_MSGOUT_UBX_NAV_POSLLH_SPI": [1, 1, 1, 0],
 "CFG_MSGOUT_UBX_NAV_POSLLH_UART1": [1, 1, 1, 0],
 "CFG_MSGOUT_UBX_NAV_POSLLH_UART2": [1, 1, 1, 0],
 "CFG_MSGOUT_UBX_NAV_POSLLH_USB": [1, 1, 1, 0],
 "CFG_MSGOUT_UBX_NAV_PVAT_I2C": [1, 1, 1, 0],
 "CFG_MSGOUT_UBX_NAV_PVAT_SPI": [1, 1, 1, 0],
 "CFG_MSGOUT_UBX_NAV_PVAT_UART1": [1, 1, 1, 0],
 "CFG_MSGOUT_UBX_NAV_PVAT_UART2": [1, 1, 1, 0],
 "CFG_MSGOUT_UBX_NAV_PVAT_USB": [1, 1, 1, 0],
 "CFG_MSGOUT_UBX_NAV_PVT_I2C": [1, 1, 1, 0],
 "CFG_MSGOUT_UBX_NAV_PVT_SPI": [1, 1, 1, 0],
 "CFG_MSGOUT_UBX_NAV_PVT_UART1": [1, 1, 1, 0],
 "CFG_MSGOUT_UBX_NAV_PVT_UART2": [1, 1, 1, 0],
 "CFG_MSGOUT_UBX_NAV_PVT_USB": [1, 1, 1, 0],
 "CFG_MSGOUT_UBX_NAV_RELPOSNED_I2C": [1, 1, 1, 0],
 "CFG_MSGOUT_UBX_NAV_RELPOSNED_SPI": [1, 1, 1, 0],
 "CFG_MSGOUT_UBX_NAV_RELPOSNED_UART1": [1, 1, 1, 0],
 "CFG_MSGOUT_UBX_NAV_RELPOSNED_UART2": [1, 1, 1, 0],
 "CFG_MSGOUT_UBX_NAV_RELPOSNED_USB": [1, 1, 1, 0],
 "CFG_MSGOUT_UBX_NAV_SAT_I2C": [1, 1, 1, 0],
 "CFG_MSGOUT_UBX_NAV_SAT_SPI": [1, 1, 1, 0],
 "CFG_MSGOUT_UBX_NAV_SAT_UART1": [1, 1, 1, 0],
 "CFG_MSGOUT_UBX_NAV_SAT_UART2": [1, 1, 1, 0],
 "CFG_MSGOUT_UBX_NAV_SAT_USB": [1, 1, 1, 0],
 "CFG_MSGOUT_UBX_NAV_SBAS_I2C": [1, 1, 1, 0],
 "CFG_MSGOUT_UBX_NAV_SBAS_SPI": [1, 1, 1, 0],
 "CFG_MSGOUT_UBX_NAV_SBAS_UART1": [1, 1, 1, 0],
 "CFG_MSGOUT_UBX_NAV_SBAS_UART2": [1, 1, 1, 0],
 "CFG_MSGOUT_UBX_NAV_SBAS_USB": [1, 1, 1, 0],
 "CFG_MSGOUT_UBX_NAV_SIG_I2C": [1, 1, 1, 0],
 "CFG_MSGOUT_UBX_NAV_SIG_SPI": [1, 1, 1, 0],
 "CFG_MSGOUT_UBX_NAV_SIG_UART1": [1, 1, 1, 0],
 "CFG_MSGOUT_UBX_NAV_SIG_UART2": [1, 1, 1, 0],
 "CFG_MSGOUT_UBX_NAV_SIG_USB": [1, 1, 1, 0],
 "CFG_MSGOUT_UBX_NAV_SLAS_I2C": [null, null, null, null],
 "CFG_MSGOUT_UBX_NAV_SLAS_SPI": [null, null, null, null],
 "CFG_MSGOUT_UBX_NAV_SLAS_UART1": [null, null, null, null],
 "CFG_MSGOUT_UBX_NAV_SLAS_UART2": [null, null, null, null],
 "CFG_MSGOUT_UBX_NAV_SLAS_USB": [null, null, null, null],
 "CFG_MSGOUT_UBX_NAV_SOL_I2C": [null, null, null, null],
 "CFG_MSGOUT_UBX_NAV_SOL_SPI": [null, null, null, null],
 "CFG_MSGOUT_UBX_NAV_SOL_UART1": [null, null, null, null],
 "CFG_MSGOUT_UBX_NAV_SOL_UART2": [null, null, null, null],
 "CFG_MSGOUT_UBX_NAV_SOL_USB": [null, null, null, null],
 "CFG_MSGOUT_UBX_NAV_STATUS_I2C": [1, 1, 1, 0],
 "CFG_MSGOUT_UBX_NAV_STATUS_SPI": [1, 1, 1, 0],
 "CFG_MSGOUT_UBX_NAV_STATUS_UART1": [1, 1, 1, 0],
 "CFG_MSGOUT_UBX_NAV_STATUS_UART2": [1, 1, 1, 0],
 "CFG_MSGOUT_UBX_NAV_STATUS_USB": [1, 1, 1, 0],
 "CFG_MSGOUT_UBX_NAV_SVIN_I2C": [null, null, null, null],
 "CFG_MSGOUT_UBX_NAV_SVIN_SPI": [null, null, null, null],
 "CFG_MSGOUT_UBX_NAV_SVIN_UART1": [null, null, null, null],
 "CFG_MSGOUT_UBX_NAV_SVIN_UART2": [null, null, null, null],
 "CFG_MSGOUT_UBX_NAV_SVIN_USB": [null, null, null, null],
 "CFG_MSGOUT_UBX_NAV_SVINFO_I2C": [null, null, null, null],
 "CFG_MSGOUT_UBX_NAV_SVINFO_SPI": [null, null, null, null],
 "CFG_MSGOUT_UBX_NAV_SVINFO_UART1": [null, null, null, null],
 "CFG_MSGOUT_UBX_NAV_SVINFO_UART2": [null, null, null, null],
 "CFG_MSGOUT_UBX_NAV_SVINFO_USB": [null, null, null, null],
 "CFG_MSGOUT_UBX_NAV_TIMEBDS_I2C": [1, 1, 1, 0],
 "CFG_MSGOUT_UBX_NAV_TIMEBDS_SPI": [1, 1, 1, 0],
 "CFG_MSGOUT_UBX_NAV_TIMEBDS_UART1": [1, 1, 1, 0],
 "CFG_MSGOUT_UBX_NAV_TIMEBDS_UART2": [1, 1, 1, 0],
 "CFG_MSGOUT_UBX_NAV_TIMEBDS_USB": [1, 1, 1, 0],
 "CFG_MSGOUT_UBX_NAV_TIMEGAL_I2C": [1, 1, 1, 0],
 "CFG_MSGOUT_UBX_NAV_TIMEGAL_SPI": [1, 1, 1, 0],
 "CFG_MSGOUT_UBX_NAV_TIMEGAL_UART1": [1, 1, 1, 0],
 "CFG_MSGOUT_UBX_NAV_TIMEGAL_UART2": [1, 1, 1, 0],
 "CFG_MSGOUT_UBX_NAV_TIMEGAL_USB": [1, 1, 1, 0],
 "CFG_MSGOUT_UBX_NAV_TIMEGLO_I2C": [1, 1, 1, 0],
 "CFG_MSGOUT_UBX_NAV_TIMEGLO_SPI": [1, 1, 1, 0],
 "CFG_MSGOUT_UBX_NAV_TIMEGLO_UART1": [1, 1, 1, 0],
 "CFG_MSGOUT_UBX_NAV_TIMEGLO_UART2": [1, 1, 1, 0],
 "CFG_MSGOUT_UBX_NAV_TIMEGLO_USB": [1, 1, 1, 0],
 "CFG_MSGOUT_UBX_NAV_TIMEGPS_I2C": [1, 1, 1, 0],
 "CFG_MSGOUT_UBX_NAV_TIMEGPS_SPI": [1, 1, 1, 0],
 "CFG_MSGOUT_UBX_NAV_TIMEGPS_UART1": [1, 1, 1, 0],
 "CFG_MSGOUT_UBX_NAV_TIMEGPS_UART2": [1, 1, 1, 0],
 "CFG_MSGOUT_UBX_NAV_TIMEGPS_USB": [1, 1, 1, 0],
 "CFG_MSGOUT_UBX_NAV_TIMELS_I2C": [1, 1, 1, 0],
 "CFG_MSGOUT_UBX_NAV_TIMELS_SPI": [1, 1, 1, 0],
 "CFG_MSGOUT_UBX_NAV_TIMELS_UART1": [1, 1, 1, 0],
 "CFG_MSGOUT_UBX_NAV_TIMELS_UART2": [1, 1, 1, 0],
 "CFG_MSGOUT_UBX_NAV_TIMELS_USB": [1, 1, 1, 0],
 "CFG_MSGOUT_UBX_NAV_TIMENAVIC_I2C": [null, null, null, null],
 "CFG_MSGOUT_UBX_NAV_TIMENAVIC_SPI": [null, null, null, null],
 "CFG_MSGOUT_UBX_NAV_TIMENAVIC_UART1": [null, null, null, null],
 "CFG_MSGOUT_UBX_NAV_TIMENAVIC_UART2": [null, null, null, null],
 "CFG_MSGOUT_UBX_NAV_TIMENAVIC_USB": [null, null, null, null],
 "CFG_MSGOUT_UBX_NAV_TIMEQZSS_I2C": [null, null, null, null],
 "CFG_MSGOUT_UBX_NAV_TIMEQZSS_SPI": [null, null, null, null],
 "CFG_MSGOUT_UBX_NAV_TIMEQZSS_UART1": [null, null, null, null],
 "CFG_MSGOUT_UBX_NAV_TIMEQZSS_UART2": [null, null, null, null],
 "CFG_MSGOUT_UBX_NAV_TIMEQZSS_USB": [null, null, null, null],
 "CFG_MSGOUT_UBX_NAV_TIMEUTC_I2C": [1, 1, 1, 0],
 "CFG_MSGOUT_UBX_NAV_TIMEUTC_SPI": [1, 1, 1, 0],
 "CFG_MSGOUT_UBX_NAV_TIMEUTC_UART1": [1, 1, 1, 0],
 "CFG_MSGOUT_UBX_NAV_TIMEUTC_UART2": [1, 1, 1, 0],
 "CFG_MSGOUT_UBX_NAV_TIMEUTC_USB": [1, 1, 1, 0],
 "CFG_MSGOUT_UBX_NAV_VELECEF_I2C": [1, 1, 1, 0],
 "CFG_MSGOUT_UBX_NAV_VELECEF_SPI": [1, 1, 1, 0],
 "CFG_MSGOUT_UBX_NAV_VELECEF_UART1": [1, 1, 1, 0],
 "CFG_MSGOUT_UBX_NAV_VELECEF_UART2": [1, 1, 1, 0],
 "CFG_MSGOUT_UBX_NAV_VELECEF_USB": [1, 1, 1, 0],
 "CFG_MSGOUT_UBX_NAV_VELNED_I2C": [1, 1, 1, 0],
 "CFG_MSGOUT_UBX_NAV_VELNED_SPI": [1, 1, 1, 0],
 "CFG_MSGOUT_UBX_NAV_VELNED_UART1": [1, 1, 1, 0],
 "CFG_MSGOUT_UBX_NAV_VELNED_UART2": [1, 1, 1, 0],
 "CFG_MSGOUT_UBX_NAV_VELNED_USB": [1, 1, 1, 0],
 "CFG_MSGOUT_UBX_NAV2_CLOCK_I2C": [null, null, null, null],
 "CFG_MSGOUT_UBX_NAV2_CLOCK_SPI": [null, null, null, null],
 "CFG_MSGOUT_UBX_NAV2_CLOCK_UART1": [null, null, null, null],
 "CFG_MSGOUT_UBX_NAV2_CLOCK_UART2": [null, null, null, null],
 "CFG_MSGOUT_UBX_NAV2_CLOCK_USB": [null, null, null, null],
 "CFG_MSGOUT_UBX_NAV2_COV_I2C": [null, null, null, null],
 "CFG_MSGOUT_UBX_NAV2_COV_SPI": [null, null, null, null],
 "CFG_MSGOUT_UBX_NAV2_COV_UART1": [null, null, null, null],
 "CFG_MSGOUT_UBX_NAV2_COV_UART2": [null, null, null, null],
 "CFG_MSGOUT_UBX_NAV2_COV_USB": [null, null, null, null],
 "CFG_MSGOUT_UBX_NAV2_DOP_I2C": [null, null, null, null],
 "CFG_MSGOUT_UBX_NAV2_DOP_SPI": [null, null, null, null],
 "CFG_MSGOUT_UBX_NAV2_DOP_UART1": [null, null, null, null],
 "CFG_MSGOUT_UBX_NAV2_DOP_UART2": [null, null, null, null],
 "CFG_MSGOUT_UBX_NAV2_DOP_USB": [null, null, null, null],
 "CFG_MSGOUT_UBX_NAV2_EELL_I2C": [null, null, null, null],
 "CFG_MSGOUT_UBX_NAV2_EELL_SPI": [null, null, null, null],
 "CFG_MSGOUT_UBX_NAV2_EELL_UART1": [null, null, null, null],
 "CFG_MSGOUT_UBX_NAV2_EELL_UART2": [null, null, null, null],
 "CFG_MSGOUT_UBX_NAV2_EELL_USB": [null, null, null, null],
 "CFG_MSGOUT_UBX_NAV2_EOE_I2C": [null, null, null, null],
 "CFG_MSGOUT_UBX_NAV2_EOE_SPI": [null, null, null, null],
 "CFG_MSGOUT_UBX_NAV2_EOE_UART1": [null, null, null, null],
 "CFG_MSGOUT_UBX_NAV2_EOE_UART2": [null, null, null, null],
 "CFG_MSGOUT_UBX_NAV2_EOE_USB": [null, null, null, null],
 "CFG_MSGOUT_UBX_NAV2_ODO_I2C": [null, null, null, null],
 "CFG_MSGOUT_UBX_NAV2_ODO_SPI": [null, null, null, null],
 "CFG_MSGOUT_UBX_NAV2_ODO_UART1": [null, null, null, null],
 "CFG_MSGOUT_UBX_NAV2_ODO_UART2": [null, null, null, null],
 "CFG_MSGOUT_UBX_NAV2_ODO_USB": [null, null, null, null],
 "CFG_MSGOUT_UBX_NAV2_POSECEF_I2C": [null, null, null, null],
 "CFG_MSGOUT_UBX_NAV2_POSECEF_SPI": [null, null, null, null],
 "CFG_MSGOUT_UBX_NAV2_POSECEF_UART1": [null, null, null, null],
 "CFG_MSGOUT_UBX_NAV2_POSECEF_UART2": [null, null, null, null],
 "CFG_MSGOUT_UBX_NAV2_POSECEF_USB": [null, null, null, null],
 "CFG_MSGOUT_UBX_NAV2_POSLLH_I2C": [null, null, null, null],
 "CFG_MSGOUT_UBX_NAV2_POSLLH_SPI": [null, null, null, null],
 "CFG_MSGOUT_UBX_NAV2_POSLLH_UART1": [null, null, null, null],
 "CFG_MSGOUT_UBX_NAV2_POSLLH_UART2": [null, null, null, null],
 "CFG_MSGOUT_UBX_NAV2_POSLLH_USB": [null, null, null, null],
 "CFG_MSGOUT_UBX_NAV2_PVAT_I2C": [null, null, null, null],
 "CFG_MSGOUT_UBX_NAV2_PVAT_SPI": [null, null, null, null],
 "CFG_MSGOUT_UBX_NAV2_PVAT_UART1": [null, null, null, null],
 "CFG_MSGOUT_UBX_NAV2_PVAT_UART2": [null, null, null, null],
 "CFG_MSGOUT_UBX_NAV2_PVAT_USB": [null, null, null, null],
 "CFG_MSGOUT_UBX_NAV2_PVT_I2C": [null, null, null, null],
 "CFG_MSGOUT_UBX_NAV2_PVT_SPI": [null, null, null, null],
 "CFG_MSGOUT_UBX_NAV2_PVT_UART1": [null, null, null, null],
 "CFG_MSGOUT_UBX_NAV2_PVT_UART2": [null, null, null, null],
 "CFG_MSGOUT_UBX_NAV2_PVT_USB": [null, null, null, null],
 "CFG_MSGOUT_UBX_NAV2_SAT_I2C": [null, null, null, null],
 "CFG_MSGOUT_UBX_NAV2_SAT_SPI": [null, null, null, null],
 "CFG_MSGOUT_UBX_NAV2_SAT_UART1": [null, null, null, null],
 "CFG_MSGOUT_UBX_NAV2_SAT_UART2": [null, null, null, null],
 "CFG_MSGOUT_UBX_NAV2_SAT_USB": [null, null, null, null],
 "CFG_MSGOUT_UBX_NAV2_SBAS_I2C": [null, null, null, null],
 "CFG_MSGOUT_UBX_NAV2_SBAS_SPI": [null, null, null, null],
 "CFG_MSGOUT_UBX_NAV2_SBAS_UART1": [null, null, null, null],
 "CFG_MSGOUT_UBX_NAV2_SBAS_UART2": [null, null, null, null],
 "CFG_MSGOUT_UBX_NAV2_SBAS_USB": [null, null, null, null],
 "CFG_MSGOUT_UBX_NAV2_SIG_I2C": [null, null, null, null],
 "CFG_MSGOUT_UBX_NAV2_SIG_SPI": [null, null, null, null],
 "CFG_MSGOUT_UBX_NAV2_SIG_UART1": [null, null, null, null],
 "CFG_MSGOUT_UBX_NAV2_SIG_UART2": [null, null, null, null],
 "CFG_MSGOUT_UBX_NAV2_SIG_USB": [null, null, null, null],
 "CFG_MSGOUT_UBX_NAV2_SLAS_I2C": [null, null, null, null],
 "CFG_MSGOUT_UBX_NAV2_SLAS_SPI": [null, null, null, null],
 "CFG_MSGOUT_UBX_NAV2_SLAS_UART1": [null, null, null, null],
 "CFG_MSGOUT_UBX_NAV2_SLAS_UART2": [null, null, null, null],
 "CFG_MSGOUT_UBX_NAV2_SLAS_USB": [null, null, null, null],
 "CFG_MSGOUT_UBX_NAV2_STATUS_I2C": [null, null, null, null],
 "CFG_MSGOUT_UBX_NAV2_STATUS_SPI": [null, null, null, null],
 "CFG_MSGOUT_UBX_NAV2_STATUS_UART1": [null, null, null, null],
 "CFG_MSGOUT_UBX_NAV2_STATUS_UART2": [null, null, null, null],
 "CFG_MSGOUT_UBX_NAV2_STATUS_USB": [null, null, null, null],
 "CFG_MSGOUT_UBX_NAV2_SVIN_I2C": [null, null, null, null],
 "CFG_MSGOUT_UBX_NAV2_SVIN_SPI": [null, null, null, null],
 "CFG_MSGOUT_UBX_NAV2_SVIN_UART1": [null, null, null, null],
 "CFG_MSGOUT_UBX_NAV2_SVIN_UART2": [null, null, null, null],
 "CFG_MSGOUT_UBX_NAV2_SVIN_USB": [null, null, null, null],
 "CFG_MSGOUT_UBX_NAV2_TIMEBDS_I2C": [null, null, null, null],
 "CFG_MSGOUT_UBX_NAV2_TIMEBDS_SPI": [null, null, null, null],
 "CFG_MSGOUT_UBX_NAV2_TIMEBDS_UART1": [null, null, null, null],
 "CFG_MSGOUT_UBX_NAV2_TIMEBDS_UART2": [null, null, null, null],
 "CFG_MSGOUT_UBX_NAV2_TIMEBDS_USB": [null, null, null, null],
 "CFG_MSGOUT_UBX_NAV2_TIMEGAL_I2C": [null, null, null, null],
 "CFG_MSGOUT_UBX_NAV2_TIMEGAL_SPI": [null, null, null, null],
 "CFG_MSGOUT_UBX_NAV2_TIMEGAL_UART1": [null, null, null, null],
 "CFG_MSGOUT_UBX_NAV2_TIMEGAL_UART2": [null, null, null, null],
 "CFG_MSGOUT_UBX_NAV2_TIMEGAL_USB": [null, null, null, null],
 "CFG_MSGOUT_UBX_NAV2_TIMEGLO_I2C": [null, null, null, null],
 "CFG_MSGOUT_UBX_NAV2_TIMEGLO_SPI": [null, null, null, null],
 "CFG_MSGOUT_UBX_NAV2_TIMEGLO_UART1": [null, null, null, null],
 "CFG_MSGOUT_UBX_NAV2_TIMEGLO_UART2": [null, null, null, null],
 "CFG_MSGOUT_UBX_NAV2_TIMEGLO_USB": [null, null, null, null],
 "CFG_MSGOUT_UBX_NAV2_TIMEGPS_I2C": [null, null, null, null],
 "CFG_MSGOUT_UBX_NAV2_TIMEGPS_SPI": [null, null, null, null],
 "CFG_MSGOUT_UBX_NAV2_TIMEGPS_UART1": [null, null, null, null],
 "CFG_MSGOUT_UBX_NAV2_TIMEGPS_UART2": [null, null, null, null],
 "CFG_MSGOUT_UBX_NAV2_TIMEGPS_USB": [null, null, null, null],
 "CFG_MSGOUT_UBX_NAV2_TIMELS_I2C": [null, null, null, null],
 "CFG_MSGOUT_UBX_NAV2_TIMELS_SPI": [null, null, null, null],
 "CFG_MSGOUT_UBX_NAV2_TIMELS_UART1": [null, null, null, null],
 "CFG_MSGOUT_UBX_NAV2_TIMELS_UART2": [null, null, null, null],
 "CFG_MSGOUT_UBX_NAV2_TIMELS_USB": [null, null, null, null],
 "CFG_MSGOUT_UBX_NAV2_TIMENAVIC_I2C": [null, null, null, null],
 "CFG_MSGOUT_UBX_NAV2_TIMENAVIC_SPI": [null, null, null, null],
 "CFG_MSGOUT_UBX_NAV2_TIMENAVIC_UART1": [null, null, null, null],
 "CFG_MSGOUT_UBX_NAV2_TIMENAVIC_UART2": [null, null, null, null],
 "CFG_MSGOUT_UBX_NAV2_TIMENAVIC_USB": [null, null, null, null],
 "CFG_MSGOUT_UBX_NAV2_TIMEQZSS_I2C": [null, null, null, null],
 "CFG_MSGOUT_UBX_NAV2_TIMEQZSS_SPI": [null, null, null, null],
 "CFG_MSGOUT_UBX_NAV2_TIMEQZSS_UART1": [null, null, null, null],
 "CFG_MSGOUT_UBX_NAV2_TIMEQZSS_UART2": [null, null, null, null],
 "CFG_MSGOUT_UBX_NAV2_TIMEQZSS_USB": [null, null, null, null],
 "CFG_MSGOUT_UBX_NAV2_TIMEUTC_I2C": [null, null, null, null],
 "CFG_MSGOUT_UBX_NAV2_TIMEUTC_SPI": [null, null, null, null],
 "CFG_MSGOUT_UBX_NAV2_TIMEUTC_UART1": [null, null, null, null],
 "CFG_MSGOUT_UBX_NAV2_TIMEUTC_UART2": [null, null, null, null],
 "CFG_MSGOUT_UBX_NAV2_TIMEUTC_USB": [null, null, null, null],
 "CFG_MSGOUT_UBX_NAV2_VELECEF_I2C": [null, null, null, null],
 "CFG_MSGOUT_UBX_NAV2_VELECEF_SPI": [null, null, null, null],
 "CFG_MSGOUT_UBX_NAV2_VELECEF_UART1": [null, null, null, null],
 "CFG_MSGOUT_UBX_NAV2_VELECEF_UART2": [null, null, null, null],
 "CFG_MSGOUT_UBX_NAV2_VELECEF_USB": [null, null, null, null],
 "CFG_MSGOUT_UBX_NAV2_VELNED_I2C": [null, null, null, null],
 "CFG_MSGOUT_UBX_NAV2_VELNED_SPI": [null, null, null, null],
 "CFG_MSGOUT_UBX_NAV2_VELNED_UART1": [null, null, null, null],
 "CFG_MSGOUT_UBX_NAV2_VELNED_UART2": [null, null, null, null],
 "CFG_MSGOUT_UBX_NAV2_VELNED_USB": [null, null, null, null],
 "CFG_MSGOUT_UBX_RXM_ALM_I2C": [null, null, null, null],
 "CFG_MSGOUT_UBX_RXM_ALM_SPI": [null, null, null, null],
 "CFG_MSGOUT_UBX_RXM_ALM_UART1": [null, null, null, null],
 "CFG_MSGOUT_UBX_RXM_ALM_UART2": [null, null, null, null],
 "CFG_MSGOUT_UBX_RXM_ALM_USB": [null, null, null, null],
 "CFG_MSGOUT_UBX_RXM_COR_I2C": [null, null, null, null],
 "CFG_MSGOUT_UBX_RXM_COR_SPI": [null, null, null, null],
 "CFG_MSGOUT_UBX_RXM_COR_UART1": [null, null, null, null],
 "CFG_MSGOUT_UBX_RXM_COR_UART2": [null, null, null, null],
 "CFG_MSGOUT_UBX_RXM_COR_USB": [null, null, null, null],
 "CFG_MSGOUT_UBX_RXM_EPH_I2C": [null, null, null, null],
 "CFG_MSGOUT_UBX_RXM_EPH_SPI": [null, null, null, null],
 "CFG_MSGOUT_UBX_RXM_EPH_UART1": [null, null, null, null],
 "CFG_MSGOUT_UBX_RXM_EPH_UART2": [null, null, null, null],
 "CFG_MSGOUT_UBX_RXM_EPH_USB": [null, null, null, null],
 "CFG_MSGOUT_UBX_RXM_IMES_I2C": [null, null, null, null],
 "CFG_MSGOUT_UBX_RXM_IMES_SPI": [null, null, null, null],
 "CFG_MSGOUT_UBX_RXM_IMES_UART1": [null, null, null, null],
 "CFG_MSGOUT_UBX_RXM_IMES_UART2": [null, null, null, null],
 "CFG_MSGOUT_UBX_RXM_IMES_USB": [null, null, null, null],
 "CFG_MSGOUT_UBX_RXM_MEAS20_I2C": [null, null, null, null],
 "CFG_MSGOUT_UBX_RXM_MEAS20_SPI": [null, null, null, null],
 "CFG_MSGOUT_UBX_RXM_MEAS20_UART1": [null, null, null, null],
 "CFG_MSGOUT_UBX_RXM_MEAS50_I2C": [null, null, null, null],
 "CFG_MSGOUT_UBX_RXM_MEAS50_SPI": [null, null, null, null],
 "CFG_MSGOUT_UBX_RXM_MEAS50_UART1": [null, null, null, null],
 "CFG_MSGOUT_UBX_RXM_MEASC12_I2C": [null, null, null, null],
 "CFG_MSGOUT_UBX_RXM_MEASC12_SPI": [null, null, null, null],
 "CFG_MSGOUT_UBX_RXM_MEASC12_UART1": [null, null, null, null],
 "CFG_MSGOUT_UBX_RXM_MEASD12_I2C": [null, null, null, null],
 "CFG_MSGOUT_UBX_RXM_MEASD12_SPI": [null, null, null, null],
 "CFG_MSGOUT_UBX_RXM_MEASD12_UART1": [null, null, null, null],
 "CFG_MSGOUT_UBX_RXM_MEASX_I2C": [0, 0, 0, 0],
 "CFG_MSGOUT_UBX_RXM_MEASX_SPI": [0, 0, 0, 0],
 "CFG_MSGOUT_UBX_RXM_MEASX_UART1": [0, 0, 0, 0],
 "CFG_MSGOUT_UBX_RXM_MEASX_UART2": [0, 0, 0, 0],
 "CFG_MSGOUT_UBX_RXM_MEASX_USB": [0, 0, 0, 0],
 "CFG_MSGOUT_UBX_RXM_PMP_I2C": [null, null, null, null],
 "CFG_MSGOUT_UBX_RXM_PMP_SPI": [null, null, null, null],
 "CFG_MSGOUT_UBX_RXM_PMP_UART1": [null, null, null, null],
 "CFG_MSGOUT_UBX_RXM_PMP_UART2": [null, null, null, null],
 "CFG_MSGOUT_UBX_RXM_PMP_USB": [null, null, null, null],
 "CFG_MSGOUT_UBX_RXM_QZSSL6_I2C": [null, null, null, null],
 "CFG_MSGOUT_UBX_RXM_QZSSL6_SPI": [null, null, null, null],
 "CFG_MSGOUT_UBX_RXM_QZSSL6_UART1": [null, null, null, null],
 "CFG_MSGOUT_UBX_RXM_QZSSL6_UART2": [null, null, null, null],
 "CFG_MSGOUT_UBX_RXM_QZSSL6_USB": [null, null, null, null],
 "CFG_MSGOUT_UBX_RXM_RAWX_I2C": [0, 0, 0, 0],
 "CFG_MSGOUT_UBX_RXM_RAWX_SPI": [0, 0, 0, 0],
 "CFG_MSGOUT_UBX_RXM_RAWX_UART1": [0, 0, 0, 0],
 "CFG_MSGOUT_UBX_RXM_RAWX_UART2": [0, 0, 0, 0],
 "CFG_MSGOUT_UBX_RXM_RAWX_USB": [0, 0, 0, 0],
 "CFG_MSGOUT_UBX_RXM_RLM_I2C": [0, 0, 0, 0],
 "CFG_MSGOUT_UBX_RXM_RLM_SPI": [0, 0, 0, 0],
 "CFG_MSGOUT_UBX_RXM_RLM_UART1": [0, 0, 0, 0],
 "CFG_MSGOUT_UBX_RXM_RLM_UART2": [0, 0, 0, 0],
 "CFG_MSGOUT_UBX_RXM_RLM_USB": [0, 0, 0, 0],
 "CFG_MSGOUT_UBX_RXM_RTCM_I2C": [0, 0, 0, 0],
 "CFG_MSGOUT_UBX_RXM_RTCM_SPI": [0, 0, 0, 0],
 "CFG_MSGOUT_UBX_RXM_RTCM_UART1": [0, 0, 0, 0],
 "CFG_MSGOUT_UBX_RXM_RTCM_UART2": [0, 0, 0, 0],
 "CFG_MSGOUT_UBX_RXM_RTCM_USB": [0, 0, 0, 0],
 "CFG_MSGOUT_UBX_RXM_SFRBX_I2C": [0, 0, 0, 0],
 "CFG_MSGOUT_UBX_RXM_SFRBX_SPI": [0, 0, 0, 0],
 "CFG_MSGOUT_UBX_RXM_SFRBX_UART1": [0, 0, 0, 0],
 "CFG_MSGOUT_UBX_RXM_SFRBX_UART2": [0, 0, 0, 0],
 "CFG_MSGOUT_UBX_RXM_SFRBX_USB": [0, 0, 0, 0],
 "CFG_MSGOUT_UBX_RXM_SPARTN_I2C": [0, 0, 0, 0],
 "CFG_MSGOUT_UBX_RXM_SPARTN_SPI": [0, 0, 0, 0],
 "CFG_MSGOUT_UBX_RXM_SPARTN_UART1": [0, 0, 0, 0],
 "CFG_MSGOUT_UBX_RXM_SPARTN_UART2": [0, 0, 0, 0],
 "CFG_MSGOUT_UBX_RXM_SPARTN_USB": [0, 0, 0, 0],
 "CFG_MSGOUT_UBX_RXM_SVSI_I2C": [null, null, null, null],
 "CFG_MSGOUT_UBX_RXM_SVSI_SPI": [null, null, null, null],
 "CFG_MSGOUT_UBX_RXM_SVSI_UART1": [null, null, null, null],
 "CFG_MSGOUT_UBX_RXM_SVSI_UART2": [null, null, null, null],
 "CFG_MSGOUT_UBX_RXM_SVSI_USB": [null, null, null, null],
 "CFG_MSGOUT_UBX_RXM_TM_I2C": [null, null, null, null],
 "CFG_MSGOUT_UBX_RXM_TM_SPI": [null, null, null, null],
 "CFG_MSGOUT_UBX_RXM_TM_UART1": [null, null, null, null],
 "CFG_MSGOUT_UBX_RXM_TM_UART2": [null, null, null, null],
 "CFG_MSGOUT_UBX_RXM_TM_USB": [null, null, null, null],
 "CFG_MSGOUT_UBX_SEC_ECSIGN_I2C": [0, 0, 0, 0],
 "CFG_MSGOUT_UBX_SEC_ECSIGN_SPI": [0, 0, 0, 0],
 "CFG_MSGOUT_UBX_SEC_ECSIGN_UART1": [0, 0, 0, 0],
 "CFG_MSGOUT_UBX_SEC_ECSIGN_UART2": [0, 0, 0, 0],
 "CFG_MSGOUT_UBX_SEC_ECSIGN_USB": [0, 0, 0, 0],
 "CFG_MSGOUT_UBX_SEC_SIG_I2C": [0, 0, 0, 0],
 "CFG_MSGOUT_UBX_SEC_SIG_SPI": [0, 0, 0, 0],
 "CFG_MSGOUT_UBX_SEC_SIG_UART1": [0, 0, 0, 0],
 "CFG_MSGOUT_UBX_SEC_SIG_UART2": [0, 0, 0, 0],
 "CFG_MSGOUT_UBX_SEC_SIG_USB": [0, 0, 0, 0],
 "CFG_MSGOUT_UBX_SEC_SIGLOG_I2C": [null, null, null, null],
 "CFG_MSGOUT_UBX_SEC_SIGLOG_SPI": [null, null, null, null],
 "CFG_MSGOUT_UBX_SEC_SIGLOG_UART1": [null, null, null, null],
 "CFG_MSGOUT_UBX_SEC_SIGLOG_UART2": [null, null, null, null],
 "CFG_MSGOUT_UBX_SEC_SIGLOG_USB": [null, null, null, null],
 "CFG_MSGOUT_UBX_TIM_SVIN_I2C": [null, null, null, null],
 "CFG_MSGOUT_UBX_TIM_SVIN_SPI": [null, null, null, null],
 "CFG_MSGOUT_UBX_TIM_SVIN_UART1": [null, null, null, null],
 "CFG_MSGOUT_UBX_TIM_SVIN_UART2": [null, null, null, null],
 "CFG_MSGOUT_UBX_TIM_SVIN_USB": [null, null, null, null],
 "CFG_MSGOUT_UBX_TIM_TM2_I2C": [0, 0, 0, 0],
 "CFG_MSGOUT_UBX_TIM_TM2_SPI": [0, 0, 0, 0],
 "CFG_MSGOUT_UBX_TIM_TM2_UART1": [0, 0, 0, 0],
 "CFG_MSGOUT_UBX_TIM_TM2_UART2": [0, 0, 0, 0],
 "CFG_MSGOUT_UBX_TIM_TM2_USB": [0, 0, 0, 0],
 "CFG_MSGOUT_UBX_TIM_TP_I2C": [0, 0, 0, 0],
 "CFG_MSGOUT_UBX_TIM_TP_SPI": [0, 0, 0, 0],
 "CFG_MSGOUT_UBX_TIM_TP_UART1": [0, 0, 0, 0],
 "CFG_MSGOUT_UBX_TIM_TP_UART2": [0, 0, 0, 0],
 "CFG_MSGOUT_UBX_TIM_TP_USB": [0, 0, 0, 0],
 "CFG_MSGOUT_UBX_TIM_VRFY_I2C": [0, 0, 0, 0],
 "CFG_MSGOUT_UBX_TIM_VRFY_SPI": [0, 0, 0, 0],
 "CFG_MSGOUT_UBX_TIM_VRFY_UART1": [0, 0, 0, 0],
 "CFG_MSGOUT_UBX_TIM_VRFY_UART2": [0, 0, 0, 0],
 "CFG_MSGOUT_UBX_TIM_VRFY_USB": [0, 0, 0, 0],
 "CFG_NAV2_OUT_ENABLED": [null, null, null, null],
 "CFG_NAV2_SBAS_USE_INTEGRITY": [null, null, null, null],
 "CFG_NAVHPG_DGNSSMODE": [3, 3, 3, 3],
 "CFG_NAVMASK_EL_MASK_000_020": [null, null, null, null],
 "CFG_NAVMASK_EL_MASK_020_040": [null, null, null, null],
 "CFG_NAVMASK_EL_MASK_040_060": [null, null, null, null],
 "CFG_NAVMASK_EL_MASK_060_080": [null, null, null, null],
 "CFG_NAVMASK_EL_MASK_080_100": [null, null, null, null],
 "CFG_NAVMASK_EL_MASK_100_120": [null, null, null, null],
 "CFG_NAVMASK_EL_MASK_120_140": [null, null, null, null],
 "CFG_NAVMASK_EL_MASK_140_160": [null, null, null, null],
 "CFG_NAVMASK_EL_MASK_160_180": [null, null, null, null],
 "CFG_NAVMASK_EL_MASK_180_200": [null, null, null, null],
 "CFG_NAVMASK_EL_MASK_200_220": [null, null, null, null],
 "CFG_NAVMASK_EL_MASK_220_240": [null, null, null, null],
 "CFG_NAVMASK_EL_MASK_240_260": [null, null, null, null],
 "CFG_NAVMASK_EL_MASK_260_280": [null, null, null, null],
 "CFG_NAVMASK_EL_MASK_280_300": [null, null, null, null],
 "CFG_NAVMASK_EL_MASK_300_320": [null, null, null, null],
 "CFG_NAVMASK_EL_MASK_320_340": [null, null, null, null],
 "CFG_NAVMASK_EL_MASK_340_360": [null, null, null, null],
 "CFG_NAVSPG_ACKAIDING": [0, 0, 0, 0],
 "CFG_NAVSPG_CONSTR_ALT": [0, 0, 0, 0],
 "CFG_NAVSPG_CONSTR_ALTVAR": [10000, 10000, 10000, 10000],
 "CFG_NAVSPG_CONSTR_DGNSSTO": [60, 60, 60, 60],
 "CFG_NAVSPG_CONSTR_PROPLIMIT": [null, null, null, null],
 "CFG_NAVSPG_DYNMODEL": [4, 4, 4, 4],
 "CFG_NAVSPG_FIXMODE": [3, 3, 3, 3],
 "CFG_NAVSPG_INFIL_CNOTHRS": [0, 0, 0, 0],
 "CFG_NAVSPG_INFIL_MAXSVS": [32, 32, 32, 32],
 "CFG_NAVSPG_INFIL_MINCNO": [20, 20, 20, 20],
 "CFG_NAVSPG_INFIL_MINELEV": [10, 10, 10, 10],
 "CFG_NAVSPG_INFIL_MINSVS": [5, 5, 5, 5],
 "CFG_NAVSPG_INFIL_NCNOTHRS": [0, 0, 0, 0],
 "CFG_NAVSPG_INIFIX3D": [0, 0, 0, 0],
 "CFG_NAVSPG_OUTFIL_FACC": [150, 150, 150, 150],
 "CFG_NAVSPG_OUTFIL_PACC": [100, 100, 100, 100],
 "CFG_NAVSPG_OUTFIL_PDOP": [250, 250, 250, 250],
 "CFG_NAVSPG_OUTFIL_TACC": [350, 350, 350, 350],
 "CFG_NAVSPG_OUTFIL_TDOP": [250, 250, 250, 250],
 "CFG_NAVSPG_PL_ENA": [null, null, null, null],
 "CFG_NAVSPG_SIGATTCOMP": [0, 0, 0, 0],
 "CFG_NAVSPG_USE_PPP": [null, null, null, null],
 "CFG_NAVSPG_USE_USRDAT": [0, 0, 0, 0],
 "CFG_NAVSPG_USRDAT_DX": [0.0, 0.0, 0.0, 0.0],
 "CFG_NAVSPG_USRDAT_DY": [0.0, 0.0, 0.0, 0.0],
 "CFG_NAVSPG_USRDAT_DZ": [0.0, 0.0, 0.0, 0.0],
 "CFG_NAVSPG_USRDAT_FLAT": [298.257223563, 298.257223563, 298.257223563, 298.257223563],
 "CFG_NAVSPG_USRDAT_MAJA": [6378137.0, 6378137.0, 6378137.0, 6378137.0],
 "CFG_NAVSPG_USRDAT_ROTX": [0.0, 0.0, 0.0, 0.0],
 "CFG_NAVSPG_USRDAT_ROTY": [0.0, 0.0, 0.0, 0.0],
 "CFG_NAVSPG_USRDAT_ROTZ": [0.0, 0.0, 0.0, 0.0],
 "CFG_NAVSPG_USRDAT_SCALE": [0.0, 0.0, 0.0, 0.0],
 "CFG_NAVSPG_UTCSTANDARD": [0, 0, 0, 0],
 "CFG_NAVSPG_WKNROLLOVER": [2172, 2172, 2172, 2172],
 "CFG_NMEA_BDSTALKERID": [0, 0, 0, 0],
 "CFG_NMEA_COMPAT": [0, 0, 0, 0],
 "CFG_NMEA_CONSIDER": [1, 1, 1, 1],
 "CFG_NMEA_FILT_BDS": [0, 0, 0, 0],
 "CFG_NMEA_FILT_GAL": [0, 0, 0, 0],
 "CFG_NMEA_FILT_GLO": [0, 0, 0, 0],
 "CFG_NMEA_FILT_GPS": [0, 0, 0, 0],
 "CFG_NMEA_FILT_NAVIC": [null, null, null, null],
 "CFG_NMEA_FILT_QZSS": [0, 0, 0, 0],
 "CFG_NMEA_FILT_SBAS": [0, 0, 0, 0],
 "CFG_NMEA_GSVTALKERID": [0, 0, 0, 0],
 "CFG_NMEA_HIGHPREC": [0, 0, 0, 0],
 "CFG_NMEA_LIMIT82": [0, 0, 0, 0],
 "CFG_NMEA_MAINTALKERID": [0, 0, 0, 0],
 "CFG_NMEA_MAXSVS": [0, 0, 0, 0],
 "CFG_NMEA_OUT_FROZENCOG": [0, 0, 0, 0],
 "CFG_NMEA_OUT_INVDATE": [0, 0, 0, 0],
 "CFG_NMEA_OUT_INVFIX": [0, 0, 0, 0],
 "CFG_NMEA_OUT_INVTIME": [0, 0, 0, 0],
 "CFG_NMEA_OUT_MSKFIX": [0, 0, 0, 0],
 "CFG_NMEA_OUT_ONLYGPS": [0, 0, 0, 0],
 "CFG_NMEA_PROTVER": [42, 42, 42, 42],
 "CFG_NMEA_SVNUMBERING": [0, 0, 0, 0],
 "CFG_ODO_COGLPGAIN": [76, 76, 76, 76],
 "CFG_ODO_COGMAXPOSACC": [50, 50, 50, 50],
 "CFG_ODO_COGMAXSPEED": [10, 10, 10, 10],
 "CFG_ODO_OUTLPCOG": [0, 0, 0, 0],
 "CFG_ODO_OUTLPVEL": [0, 0, 0, 0],
 "CFG_ODO_PROFILE": [0, 0, 0, 0],
 "CFG_ODO_USE_COG": [0, 0, 0, 0],
 "CFG_ODO_USE_ODO": [0, 0, 0, 0],
 "CFG_ODO_VELLPGAIN": [153, 153, 153, 153],
 "CFG_PM_ACQPERIOD": [null, null, null, null],
 "CFG_PM_DONOTENTEROFF": [null, null, null, null],
 "CFG_PM_EXTINTBACKUP": [null, null, null, null],
 "CFG_PM_EXTINTINACTIVE": [null, null, null, null],
 "CFG_PM_EXTINTINACTIVITY": [null, null, null, null],
 "CFG_PM_EXTINTSEL": [null, null, null, null],
 "CFG_PM_EXTINTWAKE": [null, null, null, null],
 "CFG_PM_GRIDOFFSET": [null, null, null, null],
 "CFG_PM_LIMITPEAKCURR": [null, null, null, null],
 "CFG_PM_MAXACQTIME": [null, null, null, null],
 "CFG_PM_MINACQTIME": [null, null, null, null],
 "CFG_PM_ONTIME": [null, null, null, null],
 "CFG_PM_OPERATEMODE": [null, null, null, null],
 "CFG_PM_POSUPDATEPERIOD": [null, null, null, null],
 "CFG_PM_UPDATEEPH": [null, null, null, null],
 "CFG_PM_WAITTIMEFIX": [null, null, null, null],
 "CFG_PMP_CENTER_FREQUENCY": [null, null, null, null],
 "CFG_PMP_DATA_RATE": [null, null, null, null],
 "CFG_PMP_DESCRAMBLER_INIT": [null, null, null, null],
 "CFG_PMP_SEARCH_WINDOW": [null, null, null, null],
 "CFG_PMP_SERVICE_ID": [null, null, null, null],
 "CFG_PMP_UNIQUE_WORD": [null, null, null, null],
 "CFG_PMP_USE_DESCRAMBLER": [null, null, null, null],
 "CFG_PMP_USE_PRESCRAMBLING": [null, null, null, null],
 "CFG_PMP_USE_SERVICE_ID": [null, null, null, null],
 "CFG_QZSS_L6_MSGA": [null, null, null, null],
 "CFG_QZSS_L6_MSGB": [null, null, null, null],
 "CFG_QZSS_L6_RSDECODER": [null, null, null, null],
 "CFG_QZSS_L6_SVIDA": [null, null, null, null],
 "CFG_QZSS_L6_SVIDB": [null, null, null, null],
 "CFG_QZSS_SLAS_MAX_BASELINE": [null, null, null, null],
 "CFG_QZSS_USE_SLAS_DGNSS": [null, null, null, null],
 "CFG_QZSS_USE_SLAS_RAIM_UNCORR": [null, null, null, null],
 "CFG_QZSS_USE_SLAS_TESTMODE": [null, null, null, null],
 "CFG_RATE_MEAS": [1000, 1000, 1000, 1000],
 "CFG_RATE_NAV_PRIO": [0, 0, 0, 0],
 "CFG_RATE_NAV": [1, 1, 1, 1],
 "CFG_RATE_TIMEREF": [1, 1, 1, 1],
 "CFG_RINV_BINARY": [0, 0, 0, 0],
 "CFG_RINV_CHUNK0": ["0100111001101111011101000110100101100011011001010011101000100000", "0100111001101111011101000110100101100011011001010011101000100000", "0100111001101111011101000110100101100011011001010011101000100000", "0100111001101111011101000110100101100011011001010011101000100000"],
 "CFG_RINV_CHUNK1": ["0110111001101111001000000110010001100001011101000110000100100000", "0110111001101111001000000110010001100001011101000110000100100000", "0110111001101111001000000110010001100001011101000110000100100000", "0110111001101111001000000110010001100001011101000110000100100000"],
 "CFG_RINV_CHUNK2": ["0111001101100001011101100110010101100100001000010000000000000000", "0111001101100001011101100110010101100100001000010000000000000000", "0111001101100001011101100110010101100100001000010000000000000000", "0111001101100001011101100110010101100100001000010000000000000000"],
 "CFG_RINV_CHUNK3": ["0000000000000000000000000000000000000000000000000000000000000000", "0000000000000000000000000000000000000000000000000000000000000000", "0000000000000000000000000000000000000000000000000000000000000000", "0000000000000000000000000000000000000000000000000000000000000000"],
 "CFG_RINV_DATA_SIZE": [22, 22, 22, 22],
 "CFG_RINV_DUMP": [0, 0, 0, 0],
 "CFG_RTCM_DF003_IN_FILTER": [0, 0, 0, 0],
 "CFG_RTCM_DF003_IN": [0, 0, 0, 0],
 "CFG_RTCM_DF003_OUT": [null, null, null, null],
 "CFG_SBAS_PRNSCANMASK": ["1100100000101011000001110000000000000000000000000000000000000000", "1100100000101011000001110000000000000000000000000000000000000000", "1100100000101011000001110000000000000000000000000000000000000000", "1100100000101011000001110000000000000000000000000000000000000000"],
 "CFG_SBAS_USE_DIFFCORR": [1, 1, 1, 1],
 "CFG_SBAS_USE_INTEGRITY": [0, 0, 0, 0],
 "CFG_SBAS_USE_RANGING": [1, 1, 1, 1],
 "CFG_SBAS_USE_TESTMODE": [0, 0, 0, 0],
 "CFG_SEC_CFG_LOCK_UNLOCKGRP1": [0, 0, 0, 0],
 "CFG_SEC_CFG_LOCK_UNLOCKGRP2": [0, 0, 0, 0],
 "CFG_SEC_CFG_LOCK": [0, 0, 0, 0],
 "CFG_SFCORE_HNR_RATE": [null, null, null, null],
 "CFG_SFCORE_USE_SF": [1, 1, 1, 1],
 "CFG_SFIMU_ACCEL_ACCURACY": [0, 0, 0, 0],
 "CFG_SFIMU_ACCEL_FREQUENCY": [0, 0, 0, 0],
 "CFG_SFIMU_ACCEL_LATENCY": [0, 0, 0, 0],
 "CFG_SFIMU_ACCEL_RMSTHDL": [32, 32, 32, 32],
 "CFG_SFIMU_AUTO_MNTALG_ENA": [0, 0, 0, 0],
 "CFG_SFIMU_GYRO_ACCURACY": [0, 0, 0, 0],
 "CFG_SFIMU_GYRO_FREQUENCY": [0, 0, 0, 0],
 "CFG_SFIMU_GYRO_LATENCY": [0, 0, 0, 0],
 "CFG_SFIMU_GYRO_RMSTHDL": [128, 128, 128, 128],
 "CFG_SFIMU_GYRO_TC_UPDATE_PERIOD": [1200, 1200, 1200, 1200],
 "CFG_SFIMU_IMU_EN": [1, 1, 1, 1],
 "CFG_SFIMU_IMU_I2C_SCL_PIO": [4, 4, 4, 4],
 "CFG_SFIMU_IMU_I2C_SDA_PIO": [3, 3, 3, 3],
 "CFG_SFIMU_IMU_MNTALG_PITCH": [0, 0, 0, 0],
 "CFG_SFIMU_IMU_MNTALG_ROLL": [0, 0, 0, 0],
 "CFG_SFIMU_IMU_MNTALG_YAW": [0, 0, 0, 0],
 "CFG_SFODO_CNT_BOTH_EDGES": [0, 0, 0, 0],
 "CFG_SFODO_COMBINE_TICKS": [0, 0, 0, 0],
 "CFG_SFODO_COUNT_MAX": [1, 1, 1, 1],
 "CFG_SFODO_DIR_PINPOL": [0, 0, 0, 0],
 "CFG_SFODO_DIS_AUTOCOUNTMAX": [0, 0, 0, 0],
 "CFG_SFODO_DIS_AUTODIRPINPOL": [0, 0, 0, 0],
 "CFG_SFODO_DIS_AUTOSPEED": [0, 0, 0, 0],
 "CFG_SFODO_DIS_AUTOSW": [0, 0, 0, 0],
 "CFG_SFODO_DIS_DIR_INFO": [null, null, null, null],
 "CFG_SFODO_FACTOR": [0, 0, 0, 0],
 "CFG_SFODO_FREQUENCY": [0, 0, 0, 0],
 "CFG_SFODO_LATENCY": [0, 0, 0, 0],
 "CFG_SFODO_QUANT_ERROR": [0, 0, 0, 0],
 "CFG_SFODO_SPEED_BAND": [0, 0, 0, 0],
 "CFG_SFODO_USE_SPEED": [0, 0, 0, 0],
 "CFG_SFODO_USE_WT_PIN": [1, 1, 1, 1],
 "CFG_SIGNAL_BDS_B1_ENA": [1, 1, 1, 1],
 "CFG_SIGNAL_BDS_B1C_ENA": [null, null, null, null],
 "CFG_SIGNAL_BDS_B2_ENA": [1, 1, 1, 1],
 "CFG_SIGNAL_BDS_B2A_ENA": [null, null, null, null],
 "CFG_SIGNAL_BDS_ENA": [1, 1, 1, 1],
 "CFG_SIGNAL_GAL_E1_ENA": [1, 1, 1, 1],
 "CFG_SIGNAL_GAL_E5A_ENA": [null, null, null, null],
 "CFG_SIGNAL_GAL_E5B_ENA": [1, 1, 1, 1],
 "CFG_SIGNAL_GAL_ENA": [1, 1, 1, 1],
 "CFG_SIGNAL_GLO_ENA": [1, 1, 1, 1],
 "CFG_SIGNAL_GLO_L1_ENA": [1, 1, 1, 1],
 "CFG_SIGNAL_GLO_L2_ENA": [1, 1, 1, 1],
 "CFG_SIGNAL_GPS_ENA": [1, 1, 1, 1],
 "CFG_SIGNAL_GPS_L1CA_ENA": [1, 1, 1, 1],
 "CFG_SIGNAL_GPS_L2C_ENA": [1, 1, 1, 1],
 "CFG_SIGNAL_GPS_L5_ENA": [null, null, null, null],
 "CFG_SIGNAL_IMES_ENA": [null, null, null, null],
 "CFG_SIGNAL_IMES_L1_ENA": [null, null, null, null],
 "CFG_SIGNAL_NAVIC_ENA": [null, null, null, null],
 "CFG_SIGNAL_NAVIC_L5_ENA": [null, null, null, null],
 "CFG_SIGNAL_QZSS_ENA": [1, 1, 1, 1],
 "CFG_SIGNAL_QZSS_L1CA_ENA": [1, 1, 1, 1],
 "CFG_SIGNAL_QZSS_L1S_ENA": [null, null, null, null],
 "CFG_SIGNAL_QZSS_L2C_ENA": [1, 1, 1, 1],
 "CFG_SIGNAL_QZSS_L5_ENA": [null, null, null, null],
 "CFG_SIGNAL_SBAS_ENA": [1, 1, 1, 1],
 "CFG_SIGNAL_SBAS_L1CA_ENA": [1, 1, 1, 1],
 "CFG_SPARTN_USE_SOURCE": [null, null, null, null],
 "CFG_SPI_CPHASE": [0, 0, 0, 0],
 "CFG_SPI_CPOLARITY": [0, 0, 0, 0],
 "CFG_SPI_ENABLED": [0, 0, 0, 0],
 "CFG_SPI_EXTENDEDTIMEOUT": [0, 0, 0, 0],
 "CFG_SPI_MAXFF": [50, 50, 50, 50],
 "CFG_SPIINPROT_NMEA": [1, 1, 1, 1],
 "CFG_SPIINPROT_RTCM2X": [null, null, null, null],
 "CFG_SPIINPROT_RTCM3X": [1, 1, 1, 1],
 "CFG_SPIINPROT_SPARTN": [1, 1, 1, 1],
 "CFG_SPIINPROT_UBX": [1, 1, 1, 1],
 "CFG_SPIOUTPROT_NMEA": [1, 1, 1, 1],
 "CFG_SPIOUTPROT_RTCM3X": [null, null, null, null],
 "CFG_SPIOUTPROT_UBX": [1, 1, 1, 1],
 "CFG_TMODE_ECEF_X_HP": [null, null, null, null],
 "CFG_TMODE_ECEF_X": [null, null, null, null],
 "CFG_TMODE_ECEF_Y_HP": [null, null, null, null],
 "CFG_TMODE_ECEF_Y": [null, null, null, null],
 "CFG_TMODE_ECEF_Z_HP": [null, null, null, null],
 "CFG_TMODE_ECEF_Z": [null, null, null, null],
 "CFG_TMODE_FIXED_POS_ACC": [null, null, null, null],
 "CFG_TMODE_HEIGHT_HP": [null, null, null, null],
 "CFG_TMODE_HEIGHT": [null, null, null, null],
 "CFG_TMODE_LAT_HP": [null, null, null, null],
 "CFG_TMODE_LAT": [null, null, null, null],
 "CFG_TMODE_LON_HP": [null, null, null, null],
 "CFG_TMODE_LON": [null, null, null, null],
 "CFG_TMODE_MODE": [null, null, null, null],
 "CFG_TMODE_POS_TYPE": [null, null, null, null],
 "CFG_TMODE_SVIN_ACC_LIMIT": [null, null, null, null],
 "CFG_TMODE_SVIN_MIN_DUR": [null, null, null, null],
 "CFG_TP_ALIGN_TO_TOW_TP1": [1, 1, 1, 1],
 "CFG_TP_ALIGN_TO_TOW_TP2": [null, null, null, null],
 "CFG_TP_ALIGN_TO_TOW_TP3": [null, null, null, null],
 "CFG_TP_ANT_CABLEDELAY": [50, 50, 50, 50],
 "CFG_TP_DRSTR_TP1": [1, 1, 1, 1],
 "CFG_TP_DRSTR_TP2": [null, null, null, null],
 "CFG_TP_DUTY_LOCK_TP1": [10.0, 10.0, 10.0, 10.0],
 "CFG_TP_DUTY_LOCK_TP2": [null, null, null, null],
 "CFG_TP_DUTY_LOCK_TP3": [null, null, null, null],
 "CFG_TP_DUTY_TP1": [0.0, 0.0, 0.0, 0.0],
 "CFG_TP_DUTY_TP2": [null, null, null, null],
 "CFG_TP_DUTY_TP3": [null, null, null, null],
 "CFG_TP_FREQ_LOCK_TP1": [1, 1, 1, 1],
 "CFG_TP_FREQ_LOCK_TP2": [null, null, null, null],
 "CFG_TP_FREQ_LOCK_TP3": [null, null, null, null],
 "CFG_TP_FREQ_TP1": [1, 1, 1, 1],
 "CFG_TP_FREQ_TP2": [null, null, null, null],
 "CFG_TP_FREQ_TP3": [null, null, null, null],
 "CFG_TP_LEN_LOCK_TP1": [100000, 100000, 100000, 100000],
 "CFG_TP_LEN_LOCK_TP2": [null, null, null, null],
 "CFG_TP_LEN_LOCK_TP3": [null, null, null, null],
 "CFG_TP_LEN_TP1": [0, 0, 0, 0],
 "CFG_TP_LEN_TP2": [null, null, null, null],
 "CFG_TP_LEN_TP3": [null, null, null, null],
 "CFG_TP_PERIOD_LOCK_TP1": [1000000, 1000000, 1000000, 1000000],
 "CFG_TP_PERIOD_LOCK_TP2": [null, null, null, null],
 "CFG_TP_PERIOD_LOCK_TP3": [null, null, null, null],
 "CFG_TP_PERIOD_TP1": [1000000, 1000000, 1000000, 1000000],
 "CFG_TP_PERIOD_TP2": [null, null, null, null],
 "CFG_TP_PERIOD_TP3": [null, null, null, null],
 "CFG_TP_POL_TP1": [1, 1, 1, 1],
 "CFG_TP_POL_TP2": [null, null, null, null],
 "CFG_TP_POL_TP3": [null, null, null, null],
 "CFG_TP_PULSE_DEF": [0, 0, 0, 0],
 "CFG_TP_PULSE_LENGTH_DEF": [1, 1, 1, 1],
 "CFG_TP_SYNC_GNSS_TP1": [1, 1, 1, 1],
 "CFG_TP_SYNC_GNSS_TP2": [null, null, null, null],
 "CFG_TP_SYNC_GNSS_TP3": [null, null, null, null],
 "CFG_TP_TIMEGRID_TP1": [0, 0, 0, 0],
 "CFG_TP_TIMEGRID_TP2": [null, null, null, null],
 "CFG_TP_TIMEGRID_TP3": [null, null, null, null],
 "CFG_TP_TP1_ENA": [1, 1, 1, 1],
 "CFG_TP_TP2_ENA": [null, null, null, null],
 "CFG_TP_TP3_ENA": [null, null, null, null],
 "CFG_TP_USE_LOCKED_TP1": [1, 1, 1, 1],
 "CFG_TP_USE_LOCKED_TP2": [null, null, null, null],
 "CFG_TP_USE_LOCKED_TP3": [null, null, null, null],
 "CFG_TP_USER_DELAY_TP1": [0, 0, 0, 0],
 "CFG_TP_USER_DELAY_TP2": [null, null, null, null],
 "CFG_TP_USER_DELAY_TP3": [null, null, null, null],
 "CFG_TXREADY_ENABLED": [0, 0, 0, 0],
 "CFG_TXREADY_INTERFACE": [0, 0, 0, 0],
 "CFG_TXREADY_PIN": [0, 0, 0, 0],
 "CFG_TXREADY_POLARITY": [0, 0, 0, 0],
 "CFG_TXREADY_THRESHOLD": [0, 0, 0, 0],
 "CFG_UART1_BAUDRATE": [38400, 38400, 38400, 38400],
 "CFG_UART1_DATABITS": [0, 0, 0, 0],
 "CFG_UART1_ENABLED": [1, 1, 1, 1],
 "CFG_UART1_PARITY": [0, 0, 0, 0],
 "CFG_UART1_REMAP": [0, 0, 0, 0],
 "CFG_UART1_STOPBITS": [1, 1, 1, 1],
 "CFG_UART1INPROT_NMEA": [1, 1, 1, 1],
 "CFG_UART1INPROT_RTCM2X": [null, null, null, null],
 "CFG_UART1INPROT_RTCM3X": [1, 1, 1, 1],
 "CFG_UART1INPROT_SPARTN": [1, 1, 1, 1],
 "CFG_UART1INPROT_UBX": [1, 1, 1, 1],
 "CFG_UART1OUTPROT_NMEA": [1, 1, 1, 1],
 "CFG_UART1OUTPROT_RTCM3X": [null, null, null, null],
 "CFG_UART1OUTPROT_UBX": [1, 1, 1, 1],
 "CFG_UART2_BAUDRATE": [38400, 38400, 38400, 38400],
 "CFG_UART2_DATABITS": [0, 0, 0, 0],
 "CFG_UART2_ENABLED": [1, 1, 1, 1],
 "CFG_UART2_PARITY": [0, 0, 0, 0],
 "CFG_UART2_REMAP": [0, 0, 0, 0],
 "CFG_UART2_STOPBITS": [1, 1, 1, 1],
 "CFG_UART2INPROT_NMEA": [0, 0, 0, 0],
 "CFG_UART2INPROT_RTCM2X": [null, null, null, null],
 "CFG_UART2INPROT_RTCM3X": [1, 1, 1, 1],
 "CFG_UART2INPROT_SPARTN": [null, null, null, null],
 "CFG_UART2INPROT_UBX": [null, null, null, null],
 "CFG_UART2OUTPROT_NMEA": [null, null, null, null],
 "CFG_UART2OUTPROT_RTCM3X": [null, null, null, null],
 "CFG_UART2OUTPROT_UBX": [null, null, null, null],
 "CFG_USB_ENABLED": [null, null, null, null],
 "CFG_USB_POWER": [null, null, null, null],
 "CFG_USB_PRODUCT_ID": [null, null, null, null],
 "CFG_USB_PRODUCT_STR0": [null, null, null, null],
 "CFG_USB_PRODUCT_STR1": [null, null, null, null],
 "CFG_USB_PRODUCT_STR2": [null, null, null, null],
 "CFG_USB_PRODUCT_STR3": [null, null, null, null],
 "CFG_USB_SELFPOW": [null, null, null, null],
 "CFG_USB_SERIAL_NO_STR0": [null, null, null, null],
 "CFG_USB_SERIAL_NO_STR1": [null, null, null, null],
 "CFG_USB_SERIAL_NO_STR2": [null, null, null, null],
 "CFG_USB_SERIAL_NO_STR3": [null, null, null, null],
 "CFG_USB_VENDOR_ID": [null, null, null, null],
 "CFG_USB_VENDOR_STR0": [null, null, null, null],
 "CFG_USB_VENDOR_STR1": [null, null, null, null],
 "CFG_USB_VENDOR_STR2": [null, null, null, null],
 "CFG_USB_VENDOR_STR3": [null, null, null, null],
 "CFG_USBINPROT_NMEA": [null, null, null, null],
 "CFG_USBINPROT_RTCM2X": [null, null, null, null],
 "CFG_USBINPROT_RTCM3X": [null, null, null, null],
 "CFG_USBINPROT_SPARTN": [null, null, null, null],
 "CFG_USBINPROT_UBX": [null, null, null, null],
 "CFG_USBOUTPROT_NMEA": [null, null, null, null],
 "CFG_USBOUTPROT_RTCM3X": [null, null, null, null],
 "CFG_USBOUTPROT_UBX": [null, null, null, null]}