0004   : 00 00  00 05
0008   : 00 00  00 03
000C   : 00 00  00 07
0010   : 00 00  00 90
0014   : 00 00  00 60
0018   : 00 00  00 1F
001C   : 2B CD  DC B3
0020   : 83 69  96 27
0024   : 2B CD  DC B3
0028   : 00 00  00 23
002C   : 00 00  00 10
0030   : 00 00  00 15
0034   : 00 00  00 70