%YAML 1.1
%TAG !u! tag:unity3d.com,2011:
--- !u!74 &7400000
AnimationClip:
  m_ObjectHideFlags: 0
  m_CorrespondingSourceObject: {fileID: 0}
  m_PrefabInstance: {fileID: 0}
  m_PrefabAsset: {fileID: 0}
  m_Name: ShipStart
  serializedVersion: 6
  m_Legacy: 0
  m_Compressed: 0
  m_UseHighQualityCurve: 1
  m_RotationCurves: []
  m_CompressedRotationCurves: []
  m_EulerCurves: []
  m_PositionCurves:
  - curve:
      serializedVersion: 2
      m_Curve:
      - serializedVersion: 3
        time: 0
        value: {x: 0, y: 0, z: 0}
        inSlope: {x: 0, y: 0, z: 0}
        outSlope: {x: 0, y: 0, z: 0}
        tangentMode: 0
        weightedMode: 0
        inWeight: {x: 0.33333334, y: 0.33333334, z: 0.33333334}
        outWeight: {x: 0.33333334, y: 0.33333334, z: 0.33333334}
      - serializedVersion: 3
        time: 0.5
        value: {x: 0.5, y: 0.5, z: 0}
        inSlope: {x: 0, y: 0, z: 0}
        outSlope: {x: 0, y: 0, z: 0}
        tangentMode: 0
        weightedMode: 0
        inWeight: {x: 0.33333334, y: 0.33333334, z: 0.33333334}
        outWeight: {x: 0.33333334, y: 0.33333334, z: 0.33333334}
      - serializedVersion: 3
        time: 1.8333334
        value: {x: 0.5, y: 0.5, z: 0}
        inSlope: {x: 0, y: 0, z: 0}
        outSlope: {x: 0, y: 0, z: 0}
        tangentMode: 0
        weightedMode: 0
        inWeight: {x: 0.33333334, y: 0.33333334, z: 0.33333334}
        outWeight: {x: 0.33333334, y: 0.33333334, z: 0.33333334}
      - serializedVersion: 3
        time: 2.5
        value: {x: 30, y: 2, z: 0}
        inSlope: {x: 0, y: 0, z: 0}
        outSlope: {x: 0, y: 0, z: 0}
        tangentMode: 0
        weightedMode: 0
        inWeight: {x: 0.33333334, y: 0.33333334, z: 0.33333334}
        outWeight: {x: 0.33333334, y: 0.33333334, z: 0.33333334}
      - serializedVersion: 3
        time: 3
        value: {x: 30, y: 2, z: 0}
        inSlope: {x: 0, y: 0, z: 0}
        outSlope: {x: 0, y: 0, z: 0}
        tangentMode: 0
        weightedMode: 0
        inWeight: {x: 0.33333334, y: 0.33333334, z: 0.33333334}
        outWeight: {x: 0.33333334, y: 0.33333334, z: 0.33333334}
      - serializedVersion: 3
        time: 18.85
        value: {x: 41, y: 7.5, z: 0}
        inSlope: {x: 0, y: 0, z: 0}
        outSlope: {x: 0, y: 0, z: 0}
        tangentMode: 0
        weightedMode: 0
        inWeight: {x: 0.33333334, y: 0.33333334, z: 0.33333334}
        outWeight: {x: 0.33333334, y: 0.33333334, z: 0.33333334}
      m_PreInfinity: 2
      m_PostInfinity: 2
      m_RotationOrder: 4
    path: 
  m_ScaleCurves: []
  m_FloatCurves: []
  m_PPtrCurves:
  - curve:
    - time: 0
      value: {fileID: -1590280296, guid: 27cf670b125995e489ec940e9bf60992, type: 3}
    - time: 0.16666667
      value: {fileID: -119634862, guid: 27cf670b125995e489ec940e9bf60992, type: 3}
    - time: 0.33333334
      value: {fileID: 566604091, guid: 27cf670b125995e489ec940e9bf60992, type: 3}
    - time: 0.5
      value: {fileID: 959571370, guid: 27cf670b125995e489ec940e9bf60992, type: 3}
    - time: 0.6666667
      value: {fileID: -568722901, guid: 27cf670b125995e489ec940e9bf60992, type: 3}
    - time: 0.8333333
      value: {fileID: -1587126148, guid: 27cf670b125995e489ec940e9bf60992, type: 3}
    - time: 1
      value: {fileID: 566604091, guid: 27cf670b125995e489ec940e9bf60992, type: 3}
    - time: 1.1666666
      value: {fileID: 959571370, guid: 27cf670b125995e489ec940e9bf60992, type: 3}
    - time: 1.3333334
      value: {fileID: -568722901, guid: 27cf670b125995e489ec940e9bf60992, type: 3}
    - time: 1.5
      value: {fileID: -1587126148, guid: 27cf670b125995e489ec940e9bf60992, type: 3}
    - time: 1.6666666
      value: {fileID: 566604091, guid: 27cf670b125995e489ec940e9bf60992, type: 3}
    - time: 1.8333334
      value: {fileID: 959571370, guid: 27cf670b125995e489ec940e9bf60992, type: 3}
    - time: 2
      value: {fileID: 959571370, guid: 27cf670b125995e489ec940e9bf60992, type: 3}
    - time: 2.1666667
      value: {fileID: -1587126148, guid: 27cf670b125995e489ec940e9bf60992, type: 3}
    - time: 2.3333333
      value: {fileID: 566604091, guid: 27cf670b125995e489ec940e9bf60992, type: 3}
    - time: 2.5
      value: {fileID: 959571370, guid: 27cf670b125995e489ec940e9bf60992, type: 3}
    - time: 2.6666667
      value: {fileID: -568722901, guid: 27cf670b125995e489ec940e9bf60992, type: 3}
    - time: 2.8333333
      value: {fileID: -1587126148, guid: 27cf670b125995e489ec940e9bf60992, type: 3}
    - time: 3
      value: {fileID: 566604091, guid: 27cf670b125995e489ec940e9bf60992, type: 3}
    - time: 3.1666667
      value: {fileID: 959571370, guid: 27cf670b125995e489ec940e9bf60992, type: 3}
    - time: 3.3333333
      value: {fileID: -568722901, guid: 27cf670b125995e489ec940e9bf60992, type: 3}
    - time: 3.5
      value: {fileID: -1587126148, guid: 27cf670b125995e489ec940e9bf60992, type: 3}
    - time: 3.6666667
      value: {fileID: 566604091, guid: 27cf670b125995e489ec940e9bf60992, type: 3}
    - time: 3.8333333
      value: {fileID: 959571370, guid: 27cf670b125995e489ec940e9bf60992, type: 3}
    - time: 4
      value: {fileID: -568722901, guid: 27cf670b125995e489ec940e9bf60992, type: 3}
    - time: 4.1666665
      value: {fileID: -1587126148, guid: 27cf670b125995e489ec940e9bf60992, type: 3}
    - time: 4.3333335
      value: {fileID: 566604091, guid: 27cf670b125995e489ec940e9bf60992, type: 3}
    - time: 4.5
      value: {fileID: 959571370, guid: 27cf670b125995e489ec940e9bf60992, type: 3}
    - time: 4.6666665
      value: {fileID: -568722901, guid: 27cf670b125995e489ec940e9bf60992, type: 3}
    - time: 4.8333335
      value: {fileID: -1587126148, guid: 27cf670b125995e489ec940e9bf60992, type: 3}
    - time: 5
      value: {fileID: 566604091, guid: 27cf670b125995e489ec940e9bf60992, type: 3}
    - time: 5.1666665
      value: {fileID: 959571370, guid: 27cf670b125995e489ec940e9bf60992, type: 3}
    - time: 5.3333335
      value: {fileID: -568722901, guid: 27cf670b125995e489ec940e9bf60992, type: 3}
    - time: 5.5
      value: {fileID: -1587126148, guid: 27cf670b125995e489ec940e9bf60992, type: 3}
    - time: 5.6666665
      value: {fileID: 566604091, guid: 27cf670b125995e489ec940e9bf60992, type: 3}
    - time: 5.8333335
      value: {fileID: 959571370, guid: 27cf670b125995e489ec940e9bf60992, type: 3}
    - time: 6
      value: {fileID: -568722901, guid: 27cf670b125995e489ec940e9bf60992, type: 3}
    - time: 6.1666665
      value: {fileID: -1587126148, guid: 27cf670b125995e489ec940e9bf60992, type: 3}
    - time: 6.3333335
      value: {fileID: 566604091, guid: 27cf670b125995e489ec940e9bf60992, type: 3}
    - time: 6.5
      value: {fileID: 959571370, guid: 27cf670b125995e489ec940e9bf60992, type: 3}
    - time: 6.6666665
      value: {fileID: -568722901, guid: 27cf670b125995e489ec940e9bf60992, type: 3}
    - time: 6.8333335
      value: {fileID: -1587126148, guid: 27cf670b125995e489ec940e9bf60992, type: 3}
    - time: 7
      value: {fileID: 566604091, guid: 27cf670b125995e489ec940e9bf60992, type: 3}
    - time: 7.1666665
      value: {fileID: 959571370, guid: 27cf670b125995e489ec940e9bf60992, type: 3}
    - time: 7.3333335
      value: {fileID: -568722901, guid: 27cf670b125995e489ec940e9bf60992, type: 3}
    - time: 7.5
      value: {fileID: -1587126148, guid: 27cf670b125995e489ec940e9bf60992, type: 3}
    - time: 7.6666665
      value: {fileID: 566604091, guid: 27cf670b125995e489ec940e9bf60992, type: 3}
    - time: 7.8333335
      value: {fileID: 959571370, guid: 27cf670b125995e489ec940e9bf60992, type: 3}
    - time: 8
      value: {fileID: -568722901, guid: 27cf670b125995e489ec940e9bf60992, type: 3}
    - time: 8.166667
      value: {fileID: -1587126148, guid: 27cf670b125995e489ec940e9bf60992, type: 3}
    - time: 8.333333
      value: {fileID: 566604091, guid: 27cf670b125995e489ec940e9bf60992, type: 3}
    - time: 8.5
      value: {fileID: 959571370, guid: 27cf670b125995e489ec940e9bf60992, type: 3}
    - time: 8.666667
      value: {fileID: -568722901, guid: 27cf670b125995e489ec940e9bf60992, type: 3}
    - time: 8.833333
      value: {fileID: -1587126148, guid: 27cf670b125995e489ec940e9bf60992, type: 3}
    - time: 9
      value: {fileID: 566604091, guid: 27cf670b125995e489ec940e9bf60992, type: 3}
    - time: 9.166667
      value: {fileID: 959571370, guid: 27cf670b125995e489ec940e9bf60992, type: 3}
    - time: 9.333333
      value: {fileID: -568722901, guid: 27cf670b125995e489ec940e9bf60992, type: 3}
    - time: 9.5
      value: {fileID: -1587126148, guid: 27cf670b125995e489ec940e9bf60992, type: 3}
    - time: 9.666667
      value: {fileID: 566604091, guid: 27cf670b125995e489ec940e9bf60992, type: 3}
    - time: 9.833333
      value: {fileID: 959571370, guid: 27cf670b125995e489ec940e9bf60992, type: 3}
    - time: 10
      value: {fileID: -568722901, guid: 27cf670b125995e489ec940e9bf60992, type: 3}
    - time: 10.166667
      value: {fileID: -1587126148, guid: 27cf670b125995e489ec940e9bf60992, type: 3}
    - time: 10.333333
      value: {fileID: 566604091, guid: 27cf670b125995e489ec940e9bf60992, type: 3}
    - time: 10.5
      value: {fileID: 959571370, guid: 27cf670b125995e489ec940e9bf60992, type: 3}
    - time: 10.666667
      value: {fileID: -568722901, guid: 27cf670b125995e489ec940e9bf60992, type: 3}
    - time: 10.833333
      value: {fileID: -1587126148, guid: 27cf670b125995e489ec940e9bf60992, type: 3}
    - time: 11
      value: {fileID: 566604091, guid: 27cf670b125995e489ec940e9bf60992, type: 3}
    - time: 11.166667
      value: {fileID: 959571370, guid: 27cf670b125995e489ec940e9bf60992, type: 3}
    - time: 11.333333
      value: {fileID: -568722901, guid: 27cf670b125995e489ec940e9bf60992, type: 3}
    - time: 11.5
      value: {fileID: -1587126148, guid: 27cf670b125995e489ec940e9bf60992, type: 3}
    - time: 11.666667
      value: {fileID: 566604091, guid: 27cf670b125995e489ec940e9bf60992, type: 3}
    - time: 11.833333
      value: {fileID: 959571370, guid: 27cf670b125995e489ec940e9bf60992, type: 3}
    - time: 12
      value: {fileID: -568722901, guid: 27cf670b125995e489ec940e9bf60992, type: 3}
    - time: 12.166667
      value: {fileID: -1587126148, guid: 27cf670b125995e489ec940e9bf60992, type: 3}
    - time: 12.333333
      value: {fileID: 566604091, guid: 27cf670b125995e489ec940e9bf60992, type: 3}
    - time: 12.5
      value: {fileID: 959571370, guid: 27cf670b125995e489ec940e9bf60992, type: 3}
    - time: 12.666667
      value: {fileID: -568722901, guid: 27cf670b125995e489ec940e9bf60992, type: 3}
    - time: 12.833333
      value: {fileID: -1587126148, guid: 27cf670b125995e489ec940e9bf60992, type: 3}
    - time: 13
      value: {fileID: 566604091, guid: 27cf670b125995e489ec940e9bf60992, type: 3}
    - time: 13.166667
      value: {fileID: 959571370, guid: 27cf670b125995e489ec940e9bf60992, type: 3}
    - time: 13.333333
      value: {fileID: -568722901, guid: 27cf670b125995e489ec940e9bf60992, type: 3}
    - time: 13.5
      value: {fileID: -1587126148, guid: 27cf670b125995e489ec940e9bf60992, type: 3}
    - time: 13.666667
      value: {fileID: 566604091, guid: 27cf670b125995e489ec940e9bf60992, type: 3}
    - time: 13.833333
      value: {fileID: 959571370, guid: 27cf670b125995e489ec940e9bf60992, type: 3}
    - time: 14
      value: {fileID: -568722901, guid: 27cf670b125995e489ec940e9bf60992, type: 3}
    - time: 14.166667
      value: {fileID: -1587126148, guid: 27cf670b125995e489ec940e9bf60992, type: 3}
    - time: 14.333333
      value: {fileID: 566604091, guid: 27cf670b125995e489ec940e9bf60992, type: 3}
    - time: 14.5
      value: {fileID: 959571370, guid: 27cf670b125995e489ec940e9bf60992, type: 3}
    - time: 14.666667
      value: {fileID: -568722901, guid: 27cf670b125995e489ec940e9bf60992, type: 3}
    - time: 14.833333
      value: {fileID: -1587126148, guid: 27cf670b125995e489ec940e9bf60992, type: 3}
    - time: 15
      value: {fileID: 566604091, guid: 27cf670b125995e489ec940e9bf60992, type: 3}
    - time: 15.166667
      value: {fileID: 959571370, guid: 27cf670b125995e489ec940e9bf60992, type: 3}
    - time: 15.333333
      value: {fileID: -568722901, guid: 27cf670b125995e489ec940e9bf60992, type: 3}
    - time: 15.5
      value: {fileID: -1587126148, guid: 27cf670b125995e489ec940e9bf60992, type: 3}
    - time: 15.666667
      value: {fileID: 566604091, guid: 27cf670b125995e489ec940e9bf60992, type: 3}
    - time: 15.833333
      value: {fileID: 959571370, guid: 27cf670b125995e489ec940e9bf60992, type: 3}
    - time: 16
      value: {fileID: -568722901, guid: 27cf670b125995e489ec940e9bf60992, type: 3}
    - time: 16.166666
      value: {fileID: -1587126148, guid: 27cf670b125995e489ec940e9bf60992, type: 3}
    - time: 16.333334
      value: {fileID: 566604091, guid: 27cf670b125995e489ec940e9bf60992, type: 3}
    - time: 16.5
      value: {fileID: 959571370, guid: 27cf670b125995e489ec940e9bf60992, type: 3}
    - time: 16.666666
      value: {fileID: -568722901, guid: 27cf670b125995e489ec940e9bf60992, type: 3}
    - time: 16.833334
      value: {fileID: -1587126148, guid: 27cf670b125995e489ec940e9bf60992, type: 3}
    - time: 17
      value: {fileID: 566604091, guid: 27cf670b125995e489ec940e9bf60992, type: 3}
    - time: 17.166666
      value: {fileID: 959571370, guid: 27cf670b125995e489ec940e9bf60992, type: 3}
    - time: 17.333334
      value: {fileID: -568722901, guid: 27cf670b125995e489ec940e9bf60992, type: 3}
    - time: 17.5
      value: {fileID: -1587126148, guid: 27cf670b125995e489ec940e9bf60992, type: 3}
    - time: 17.666666
      value: {fileID: 566604091, guid: 27cf670b125995e489ec940e9bf60992, type: 3}
    - time: 17.833334
      value: {fileID: 959571370, guid: 27cf670b125995e489ec940e9bf60992, type: 3}
    - time: 18
      value: {fileID: -568722901, guid: 27cf670b125995e489ec940e9bf60992, type: 3}
    - time: 18.166666
      value: {fileID: -1587126148, guid: 27cf670b125995e489ec940e9bf60992, type: 3}
    - time: 18.333334
      value: {fileID: 566604091, guid: 27cf670b125995e489ec940e9bf60992, type: 3}
    - time: 18.5
      value: {fileID: 959571370, guid: 27cf670b125995e489ec940e9bf60992, type: 3}
    - time: 18.666666
      value: {fileID: -568722901, guid: 27cf670b125995e489ec940e9bf60992, type: 3}
    - time: 18.833334
      value: {fileID: -1587126148, guid: 27cf670b125995e489ec940e9bf60992, type: 3}
    attribute: m_Sprite
    path: Thrusters
    classID: 212
    script: {fileID: 0}
  m_SampleRate: 60
  m_WrapMode: 0
  m_Bounds:
    m_Center: {x: 0, y: 0, z: 0}
    m_Extent: {x: 0, y: 0, z: 0}
  m_ClipBindingConstant:
    genericBindings:
    - serializedVersion: 2
      path: 0
      attribute: 1
      script: {fileID: 0}
      typeID: 4
      customType: 0
      isPPtrCurve: 0
    - serializedVersion: 2
      path: 714571079
      attribute: 0
      script: {fileID: 0}
      typeID: 212
      customType: 23
      isPPtrCurve: 1
    pptrCurveMapping:
    - {fileID: -1590280296, guid: 27cf670b125995e489ec940e9bf60992, type: 3}
    - {fileID: -119634862, guid: 27cf670b125995e489ec940e9bf60992, type: 3}
    - {fileID: 566604091, guid: 27cf670b125995e489ec940e9bf60992, type: 3}
    - {fileID: 959571370, guid: 27cf670b125995e489ec940e9bf60992, type: 3}
    - {fileID: -568722901, guid: 27cf670b125995e489ec940e9bf60992, type: 3}
    - {fileID: -1587126148, guid: 27cf670b125995e489ec940e9bf60992, type: 3}
    - {fileID: 566604091, guid: 27cf670b125995e489ec940e9bf60992, type: 3}
    - {fileID: 959571370, guid: 27cf670b125995e489ec940e9bf60992, type: 3}
    - {fileID: -568722901, guid: 27cf670b125995e489ec940e9bf60992, type: 3}
    - {fileID: -1587126148, guid: 27cf670b125995e489ec940e9bf60992, type: 3}
    - {fileID: 566604091, guid: 27cf670b125995e489ec940e9bf60992, type: 3}
    - {fileID: 959571370, guid: 27cf670b125995e489ec940e9bf60992, type: 3}
    - {fileID: 959571370, guid: 27cf670b125995e489ec940e9bf60992, type: 3}
    - {fileID: -1587126148, guid: 27cf670b125995e489ec940e9bf60992, type: 3}
    - {fileID: 566604091, guid: 27cf670b125995e489ec940e9bf60992, type: 3}
    - {fileID: 959571370, guid: 27cf670b125995e489ec940e9bf60992, type: 3}
    - {fileID: -568722901, guid: 27cf670b125995e489ec940e9bf60992, type: 3}
    - {fileID: -1587126148, guid: 27cf670b125995e489ec940e9bf60992, type: 3}
    - {fileID: 566604091, guid: 27cf670b125995e489ec940e9bf60992, type: 3}
    - {fileID: 959571370, guid: 27cf670b125995e489ec940e9bf60992, type: 3}
    - {fileID: -568722901, guid: 27cf670b125995e489ec940e9bf60992, type: 3}
    - {fileID: -1587126148, guid: 27cf670b125995e489ec940e9bf60992, type: 3}
    - {fileID: 566604091, guid: 27cf670b125995e489ec940e9bf60992, type: 3}
    - {fileID: 959571370, guid: 27cf670b125995e489ec940e9bf60992, type: 3}
    - {fileID: -568722901, guid: 27cf670b125995e489ec940e9bf60992, type: 3}
    - {fileID: -1587126148, guid: 27cf670b125995e489ec940e9bf60992, type: 3}
    - {fileID: 566604091, guid: 27cf670b125995e489ec940e9bf60992, type: 3}
    - {fileID: 959571370, guid: 27cf670b125995e489ec940e9bf60992, type: 3}
    - {fileID: -568722901, guid: 27cf670b125995e489ec940e9bf60992, type: 3}
    - {fileID: -1587126148, guid: 27cf670b125995e489ec940e9bf60992, type: 3}
    - {fileID: 566604091, guid: 27cf670b125995e489ec940e9bf60992, type: 3}
    - {fileID: 959571370, guid: 27cf670b125995e489ec940e9bf60992, type: 3}
    - {fileID: -568722901, guid: 27cf670b125995e489ec940e9bf60992, type: 3}
    - {fileID: -1587126148, guid: 27cf670b125995e489ec940e9bf60992, type: 3}
    - {fileID: 566604091, guid: 27cf670b125995e489ec940e9bf60992, type: 3}
    - {fileID: 959571370, guid: 27cf670b125995e489ec940e9bf60992, type: 3}
    - {fileID: -568722901, guid: 27cf670b125995e489ec940e9bf60992, type: 3}
    - {fileID: -1587126148, guid: 27cf670b125995e489ec940e9bf60992, type: 3}
    - {fileID: 566604091, guid: 27cf670b125995e489ec940e9bf60992, type: 3}
    - {fileID: 959571370, guid: 27cf670b125995e489ec940e9bf60992, type: 3}
    - {fileID: -568722901, guid: 27cf670b125995e489ec940e9bf60992, type: 3}
    - {fileID: -1587126148, guid: 27cf670b125995e489ec940e9bf60992, type: 3}
    - {fileID: 566604091, guid: 27cf670b125995e489ec940e9bf60992, type: 3}
    - {fileID: 959571370, guid: 27cf670b125995e489ec940e9bf60992, type: 3}
    - {fileID: -568722901, guid: 27cf670b125995e489ec940e9bf60992, type: 3}
    - {fileID: -1587126148, guid: 27cf670b125995e489ec940e9bf60992, type: 3}
    - {fileID: 566604091, guid: 27cf670b125995e489ec940e9bf60992, type: 3}
    - {fileID: 959571370, guid: 27cf670b125995e489ec940e9bf60992, type: 3}
    - {fileID: -568722901, guid: 27cf670b125995e489ec940e9bf60992, type: 3}
    - {fileID: -1587126148, guid: 27cf670b125995e489ec940e9bf60992, type: 3}
    - {fileID: 566604091, guid: 27cf670b125995e489ec940e9bf60992, type: 3}
    - {fileID: 959571370, guid: 27cf670b125995e489ec940e9bf60992, type: 3}
    - {fileID: -568722901, guid: 27cf670b125995e489ec940e9bf60992, type: 3}
    - {fileID: -1587126148, guid: 27cf670b125995e489ec940e9bf60992, type: 3}
    - {fileID: 566604091, guid: 27cf670b125995e489ec940e9bf60992, type: 3}
    - {fileID: 959571370, guid: 27cf670b125995e489ec940e9bf60992, type: 3}
    - {fileID: -568722901, guid: 27cf670b125995e489ec940e9bf60992, type: 3}
    - {fileID: -1587126148, guid: 27cf670b125995e489ec940e9bf60992, type: 3}
    - {fileID: 566604091, guid: 27cf670b125995e489ec940e9bf60992, type: 3}
    - {fileID: 959571370, guid: 27cf670b125995e489ec940e9bf60992, type: 3}
    - {fileID: -568722901, guid: 27cf670b125995e489ec940e9bf60992, type: 3}
    - {fileID: -1587126148, guid: 27cf670b125995e489ec940e9bf60992, type: 3}
    - {fileID: 566604091, guid: 27cf670b125995e489ec940e9bf60992, type: 3}
    - {fileID: 959571370, guid: 27cf670b125995e489ec940e9bf60992, type: 3}
    - {fileID: -568722901, guid: 27cf670b125995e489ec940e9bf60992, type: 3}
    - {fileID: -1587126148, guid: 27cf670b125995e489ec940e9bf60992, type: 3}
    - {fileID: 566604091, guid: 27cf670b125995e489ec940e9bf60992, type: 3}
    - {fileID: 959571370, guid: 27cf670b125995e489ec940e9bf60992, type: 3}
    - {fileID: -568722901, guid: 27cf670b125995e489ec940e9bf60992, type: 3}
    - {fileID: -1587126148, guid: 27cf670b125995e489ec940e9bf60992, type: 3}
    - {fileID: 566604091, guid: 27cf670b125995e489ec940e9bf60992, type: 3}
    - {fileID: 959571370, guid: 27cf670b125995e489ec940e9bf60992, type: 3}
    - {fileID: -568722901, guid: 27cf670b125995e489ec940e9bf60992, type: 3}
    - {fileID: -1587126148, guid: 27cf670b125995e489ec940e9bf60992, type: 3}
    - {fileID: 566604091, guid: 27cf670b125995e489ec940e9bf60992, type: 3}
    - {fileID: 959571370, guid: 27cf670b125995e489ec940e9bf60992, type: 3}
    - {fileID: -568722901, guid: 27cf670b125995e489ec940e9bf60992, type: 3}
    - {fileID: -1587126148, guid: 27cf670b125995e489ec940e9bf60992, type: 3}
    - {fileID: 566604091, guid: 27cf670b125995e489ec940e9bf60992, type: 3}
    - {fileID: 959571370, guid: 27cf670b125995e489ec940e9bf60992, type: 3}
    - {fileID: -568722901, guid: 27cf670b125995e489ec940e9bf60992, type: 3}
    - {fileID: -1587126148, guid: 27cf670b125995e489ec940e9bf60992, type: 3}
    - {fileID: 566604091, guid: 27cf670b125995e489ec940e9bf60992, type: 3}
    - {fileID: 959571370, guid: 27cf670b125995e489ec940e9bf60992, type: 3}
    - {fileID: -568722901, guid: 27cf670b125995e489ec940e9bf60992, type: 3}
    - {fileID: -1587126148, guid: 27cf670b125995e489ec940e9bf60992, type: 3}
    - {fileID: 566604091, guid: 27cf670b125995e489ec940e9bf60992, type: 3}
    - {fileID: 959571370, guid: 27cf670b125995e489ec940e9bf60992, type: 3}
    - {fileID: -568722901, guid: 27cf670b125995e489ec940e9bf60992, type: 3}
    - {fileID: -1587126148, guid: 27cf670b125995e489ec940e9bf60992, type: 3}
    - {fileID: 566604091, guid: 27cf670b125995e489ec940e9bf60992, type: 3}
    - {fileID: 959571370, guid: 27cf670b125995e489ec940e9bf60992, type: 3}
    - {fileID: -568722901, guid: 27cf670b125995e489ec940e9bf60992, type: 3}
    - {fileID: -1587126148, guid: 27cf670b125995e489ec940e9bf60992, type: 3}
    - {fileID: 566604091, guid: 27cf670b125995e489ec940e9bf60992, type: 3}
    - {fileID: 959571370, guid: 27cf670b125995e489ec940e9bf60992, type: 3}
    - {fileID: -568722901, guid: 27cf670b125995e489ec940e9bf60992, type: 3}
    - {fileID: -1587126148, guid: 27cf670b125995e489ec940e9bf60992, type: 3}
    - {fileID: 566604091, guid: 27cf670b125995e489ec940e9bf60992, type: 3}
    - {fileID: 959571370, guid: 27cf670b125995e489ec940e9bf60992, type: 3}
    - {fileID: -568722901, guid: 27cf670b125995e489ec940e9bf60992, type: 3}
    - {fileID: -1587126148, guid: 27cf670b125995e489ec940e9bf60992, type: 3}
    - {fileID: 566604091, guid: 27cf670b125995e489ec940e9bf60992, type: 3}
    - {fileID: 959571370, guid: 27cf670b125995e489ec940e9bf60992, type: 3}
    - {fileID: -568722901, guid: 27cf670b125995e489ec940e9bf60992, type: 3}
    - {fileID: -1587126148, guid: 27cf670b125995e489ec940e9bf60992, type: 3}
    - {fileID: 566604091, guid: 27cf670b125995e489ec940e9bf60992, type: 3}
    - {fileID: 959571370, guid: 27cf670b125995e489ec940e9bf60992, type: 3}
    - {fileID: -568722901, guid: 27cf670b125995e489ec940e9bf60992, type: 3}
    - {fileID: -1587126148, guid: 27cf670b125995e489ec940e9bf60992, type: 3}
    - {fileID: 566604091, guid: 27cf670b125995e489ec940e9bf60992, type: 3}
    - {fileID: 959571370, guid: 27cf670b125995e489ec940e9bf60992, type: 3}
    - {fileID: -568722901, guid: 27cf670b125995e489ec940e9bf60992, type: 3}
    - {fileID: -1587126148, guid: 27cf670b125995e489ec940e9bf60992, type: 3}
  m_AnimationClipSettings:
    serializedVersion: 2
    m_AdditiveReferencePoseClip: {fileID: 0}
    m_AdditiveReferencePoseTime: 0
    m_StartTime: 0
    m_StopTime: 18.85
    m_OrientationOffsetY: 0
    m_Level: 0
    m_CycleOffset: 0
    m_HasAdditiveReferencePose: 0
    m_LoopTime: 1
    m_LoopBlend: 0
    m_LoopBlendOrientation: 0
    m_LoopBlendPositionY: 0
    m_LoopBlendPositionXZ: 0
    m_KeepOriginalOrientation: 0
    m_KeepOriginalPositionY: 1
    m_KeepOriginalPositionXZ: 0
    m_HeightFromFeet: 0
    m_Mirror: 0
  m_EditorCurves:
  - curve:
      serializedVersion: 2
      m_Curve:
      - serializedVersion: 3
        time: 0
        value: 0
        inSlope: 0
        outSlope: 0
        tangentMode: 136
        weightedMode: 0
        inWeight: 0.33333334
        outWeight: 0.33333334
      - serializedVersion: 3
        time: 0.5
        value: 0.5
        inSlope: 0
        outSlope: 0
        tangentMode: 136
        weightedMode: 0
        inWeight: 0.33333334
        outWeight: 0.33333334
      - serializedVersion: 3
        time: 1.8333334
        value: 0.5
        inSlope: 0
        outSlope: 0
        tangentMode: 136
        weightedMode: 0
        inWeight: 0.33333334
        outWeight: 0.33333334
      - serializedVersion: 3
        time: 2.5
        value: 30
        inSlope: 0
        outSlope: 0
        tangentMode: 136
        weightedMode: 0
        inWeight: 0.33333334
        outWeight: 0.33333334
      - serializedVersion: 3
        time: 3
        value: 30
        inSlope: 0
        outSlope: 0
        tangentMode: 136
        weightedMode: 0
        inWeight: 0.33333334
        outWeight: 0.33333334
      - serializedVersion: 3
        time: 18.85
        value: 41
        inSlope: 0
        outSlope: 0
        tangentMode: 136
        weightedMode: 0
        inWeight: 0.33333334
        outWeight: 0.33333334
      m_PreInfinity: 2
      m_PostInfinity: 2
      m_RotationOrder: 4
    attribute: m_LocalPosition.x
    path: 
    classID: 4
    script: {fileID: 0}
  - curve:
      serializedVersion: 2
      m_Curve:
      - serializedVersion: 3
        time: 0
        value: 0
        inSlope: 0
        outSlope: 0
        tangentMode: 136
        weightedMode: 0
        inWeight: 0.33333334
        outWeight: 0.33333334
      - serializedVersion: 3
        time: 0.5
        value: 0.5
        inSlope: 0
        outSlope: 0
        tangentMode: 136
        weightedMode: 0
        inWeight: 0.33333334
        outWeight: 0.33333334
      - serializedVersion: 3
        time: 1.8333334
        value: 0.5
        inSlope: 0
        outSlope: 0
        tangentMode: 136
        weightedMode: 0
        inWeight: 0.33333334
        outWeight: 0.33333334
      - serializedVersion: 3
        time: 2.5
        value: 2
        inSlope: 0
        outSlope: 0
        tangentMode: 136
        weightedMode: 0
        inWeight: 0.33333334
        outWeight: 0.33333334
      - serializedVersion: 3
        time: 3
        value: 2
        inSlope: 0
        outSlope: 0
        tangentMode: 136
        weightedMode: 0
        inWeight: 0.33333334
        outWeight: 0.33333334
      - serializedVersion: 3
        time: 18.85
        value: 7.5
        inSlope: 0
        outSlope: 0
        tangentMode: 136
        weightedMode: 0
        inWeight: 0.33333334
        outWeight: 0.33333334
      m_PreInfinity: 2
      m_PostInfinity: 2
      m_RotationOrder: 4
    attribute: m_LocalPosition.y
    path: 
    classID: 4
    script: {fileID: 0}
  - curve:
      serializedVersion: 2
      m_Curve:
      - serializedVersion: 3
        time: 0
        value: 0
        inSlope: 0
        outSlope: 0
        tangentMode: 136
        weightedMode: 0
        inWeight: 0.33333334
        outWeight: 0.33333334
      - serializedVersion: 3
        time: 0.5
        value: 0
        inSlope: 0
        outSlope: 0
        tangentMode: 136
        weightedMode: 0
        inWeight: 0.33333334
        outWeight: 0.33333334
      - serializedVersion: 3
        time: 1.8333334
        value: 0
        inSlope: 0
        outSlope: 0
        tangentMode: 136
        weightedMode: 0
        inWeight: 0.33333334
        outWeight: 0.33333334
      - serializedVersion: 3
        time: 2.5
        value: 0
        inSlope: 0
        outSlope: 0
        tangentMode: 136
        weightedMode: 0
        inWeight: 0.33333334
        outWeight: 0.33333334
      - serializedVersion: 3
        time: 3
        value: 0
        inSlope: 0
        outSlope: 0
        tangentMode: 136
        weightedMode: 0
        inWeight: 0.33333334
        outWeight: 0.33333334
      - serializedVersion: 3
        time: 18.85
        value: 0
        inSlope: 0
        outSlope: 0
        tangentMode: 136
        weightedMode: 0
        inWeight: 0.33333334
        outWeight: 0.33333334
      m_PreInfinity: 2
      m_PostInfinity: 2
      m_RotationOrder: 4
    attribute: m_LocalPosition.z
    path: 
    classID: 4
    script: {fileID: 0}
  m_EulerEditorCurves: []
  m_HasGenericRootTransform: 1
  m_HasMotionFloatCurves: 0
  m_Events: []
