EESchema Schematic File Version 2
LIBS:power
LIBS:device
LIBS:transistors
LIBS:conn
LIBS:linear
LIBS:regul
LIBS:74xx
LIBS:cmos4000
LIBS:adc-dac
LIBS:memory
LIBS:xilinx
LIBS:microcontrollers
LIBS:dsp
LIBS:microchip
LIBS:analog_switches
LIBS:motorola
LIBS:texas
LIBS:intel
LIBS:audio
LIBS:interface
LIBS:digital-audio
LIBS:philips
LIBS:display
LIBS:cypress
LIBS:siliconi
LIBS:opto
LIBS:atmel
LIBS:contrib
LIBS:valves
LIBS:microchip_dspic33dsc
LIBS:74xgxx
LIBS:ac-dc
LIBS:actel
LIBS:Altera
LIBS:analog_devices
LIBS:brooktre
LIBS:cmos_ieee
LIBS:dc-dc
LIBS:diode
LIBS:elec-unifil
LIBS:ESD_Protection
LIBS:ftdi
LIBS:gennum
LIBS:graphic
LIBS:hc11
LIBS:ir
LIBS:Lattice
LIBS:logo
LIBS:maxim
LIBS:motor_drivers
LIBS:msp430
LIBS:nordicsemi
LIBS:nxp_armmcu
LIBS:onsemi
LIBS:Oscillators
LIBS:powerint
LIBS:Power_Management
LIBS:pspice
LIBS:references
LIBS:relays
LIBS:rfcom
LIBS:sensors
LIBS:silabs
LIBS:stm8
LIBS:stm32
LIBS:supertex
LIBS:switches
LIBS:transf
LIBS:ttl_ieee
LIBS:video
LIBS:Xicor
LIBS:Zilog
LIBS:MCP2562FD
LIBS:vccio
LIBS:mcp
LIBS:JX1
LIBS:JX2
LIBS:gates
LIBS:usblc6
LIBS:canbench-hw-cache
EELAYER 25 0
EELAYER END
$Descr A4 11693 8268
encoding utf-8
Sheet 1 10
Title "CANbus MicroZed CarrierCard"
Date "25.4.2016"
Rev "RevA"
Comp ""
Comment1 ""
Comment2 ""
Comment3 ""
Comment4 ""
$EndDescr
$Sheet
S 5500 900  950  1250
U 56E8FE78
F0 "Power" 60
F1 "power.sch" 60
F2 "VCCIO_EN" I L 5500 1050 60 
F3 "PG_MODULE" T L 5500 1200 60 
F4 "PWR_EN" T L 5500 1350 60 
$EndSheet
$Comp
L SW_PUSH SW1
U 1 1 56E96850
P 1750 3350
F 0 "SW1" H 1900 3460 50  0000 C CNN
F 1 "SW_PUSH" H 1750 3270 50  0000 C CNN
F 2 "Buttons_Switches_SMD:SW_SPST_EVQP0" H 1750 3350 50  0001 C CNN
F 3 "" H 1750 3350 50  0000 C CNN
	1    1750 3350
	1    0    0    -1  
$EndComp
$Comp
L C C21
U 1 1 56E96856
P 2150 3600
F 0 "C21" H 2175 3700 50  0000 L CNN
F 1 "10n" H 2175 3500 50  0000 L CNN
F 2 "Capacitors_SMD:C_0805_HandSoldering" H 2188 3450 50  0001 C CNN
F 3 "" H 2150 3600 50  0000 C CNN
	1    2150 3600
	1    0    0    -1  
$EndComp
$Comp
L GND #PWR01
U 1 1 56E9685E
P 1450 3850
F 0 "#PWR01" H 1450 3600 50  0001 C CNN
F 1 "GND" H 1450 3700 50  0000 C CNN
F 2 "" H 1450 3850 50  0000 C CNN
F 3 "" H 1450 3850 50  0000 C CNN
	1    1450 3850
	1    0    0    -1  
$EndComp
Text Label 2050 3350 0    50   ~ 0
PG_CARRIER
Text Notes 1500 3150 0    60   ~ 0
POR# Button
$Sheet
S 1450 900  1050 1250
U 56EC0B74
F0 "MicroHeader JX1" 60
F1 "jx1.sch" 60
F2 "PWR_ENABLE" T L 1450 1200 60 
$EndSheet
$Sheet
S 3350 900  1050 1250
U 56EC20E2
F0 "MicroHeader JX2" 60
F1 "jx2.sch" 60
F2 "VCCIO_EN" O L 3350 1000 60 
F3 "INIT#" B L 3350 1100 60 
F4 "PG_MODULE" B L 3350 1200 60 
$EndSheet
Text Label 700  1200 0    60   ~ 0
PWR_ENABLE
Wire Wire Line
	1450 3350 1450 3850
Wire Wire Line
	2050 3350 2650 3350
Wire Wire Line
	2150 3450 2150 3350
Connection ~ 2150 3350
Wire Wire Line
	2150 3800 1450 3800
Connection ~ 1450 3800
Wire Wire Line
	2150 3800 2150 3750
Wire Wire Line
	1450 1200 700  1200
Wire Wire Line
	2750 1000 3350 1000
Wire Wire Line
	2750 1100 3350 1100
Wire Wire Line
	2750 1200 3350 1200
Text Label 2750 1000 0    60   ~ 0
VCCIO_EN
Text Label 2750 1100 0    60   ~ 0
INIT#
Text Label 2750 1200 0    60   ~ 0
PG_CARRIER
Wire Wire Line
	3400 3950 4050 3950
Wire Wire Line
	4350 3550 4350 3700
Wire Wire Line
	3900 3550 3950 3550
Wire Wire Line
	3600 3550 3500 3550
Wire Wire Line
	3500 3550 3500 3400
Wire Wire Line
	4350 4100 4350 4250
Text Notes 3900 3250 0    60   ~ 0
System Power Good
$Comp
L LED D1
U 1 1 56E95EEA
P 4150 3550
F 0 "D1" H 4150 3650 50  0000 C CNN
F 1 "LED_GREEN" H 4150 3450 50  0000 C CNN
F 2 "LEDs:LED_0805" H 4150 3550 50  0001 C CNN
F 3 "" H 4150 3550 50  0000 C CNN
	1    4150 3550
	-1   0    0    1   
$EndComp
$Comp
L +5V #PWR02
U 1 1 56E95EE4
P 3500 3400
F 0 "#PWR02" H 3500 3250 50  0001 C CNN
F 1 "+5V" H 3500 3540 50  0000 C CNN
F 2 "" H 3500 3400 50  0000 C CNN
F 3 "" H 3500 3400 50  0000 C CNN
	1    3500 3400
	1    0    0    -1  
$EndComp
$Comp
L BSS138 Q1
U 1 1 56E95EDE
P 4250 3900
F 0 "Q1" H 4450 3975 50  0000 L CNN
F 1 "BSS138" H 4450 3900 50  0000 L CNN
F 2 "TO_SOT_Packages_SMD:SOT-23_Handsoldering" H 4450 3825 50  0001 L CIN
F 3 "" H 4250 3900 50  0000 L CNN
	1    4250 3900
	1    0    0    -1  
$EndComp
Text Label 3400 3950 0    60   ~ 0
PG_CARRIER
$Comp
L R R1
U 1 1 56E95ED5
P 3750 3550
F 0 "R1" V 3830 3550 50  0000 C CNN
F 1 "560R" V 3750 3550 50  0000 C CNN
F 2 "Resistors_SMD:R_0805_HandSoldering" V 3680 3550 50  0001 C CNN
F 3 "" H 3750 3550 50  0000 C CNN
	1    3750 3550
	0    1    1    0   
$EndComp
$Comp
L GND #PWR03
U 1 1 56E95ECC
P 4350 4250
F 0 "#PWR03" H 4350 4000 50  0001 C CNN
F 1 "GND" H 4350 4100 50  0000 C CNN
F 2 "" H 4350 4250 50  0000 C CNN
F 3 "" H 4350 4250 50  0000 C CNN
	1    4350 4250
	1    0    0    -1  
$EndComp
Wire Wire Line
	5500 1050 4850 1050
Text Label 4850 1050 0    60   ~ 0
VCCIO_EN
Wire Wire Line
	5500 1200 4850 1200
Text Label 4850 1200 0    60   ~ 0
PG_CARRIER
Wire Wire Line
	5500 1350 4850 1350
Text Label 4850 1350 0    60   ~ 0
PWR_ENABLE
$Comp
L SW_PUSH SW2
U 1 1 57114B25
P 1750 4550
F 0 "SW2" H 1900 4660 50  0000 C CNN
F 1 "SW_PUSH" H 1750 4470 50  0000 C CNN
F 2 "Buttons_Switches_SMD:SW_SPST_EVQP0" H 1750 4550 50  0001 C CNN
F 3 "" H 1750 4550 50  0000 C CNN
	1    1750 4550
	1    0    0    -1  
$EndComp
$Comp
L C C22
U 1 1 57114B2C
P 2150 4800
F 0 "C22" H 2175 4900 50  0000 L CNN
F 1 "10n" H 2175 4700 50  0000 L CNN
F 2 "Capacitors_SMD:C_0805_HandSoldering" H 2188 4650 50  0001 C CNN
F 3 "" H 2150 4800 50  0000 C CNN
	1    2150 4800
	1    0    0    -1  
$EndComp
$Comp
L GND #PWR04
U 1 1 57114B33
P 1450 5050
F 0 "#PWR04" H 1450 4800 50  0001 C CNN
F 1 "GND" H 1450 4900 50  0000 C CNN
F 2 "" H 1450 5050 50  0000 C CNN
F 3 "" H 1450 5050 50  0000 C CNN
	1    1450 5050
	1    0    0    -1  
$EndComp
Text Label 2050 4550 0    50   ~ 0
INIT#
Text Notes 1500 4350 0    60   ~ 0
INIT# Button
Wire Wire Line
	1450 4550 1450 5050
Wire Wire Line
	2050 4550 2650 4550
Wire Wire Line
	2150 4650 2150 4550
Connection ~ 2150 4550
Wire Wire Line
	2150 5000 1450 5000
Connection ~ 1450 5000
Wire Wire Line
	2150 5000 2150 4950
$Comp
L TEST_1P MH1
U 1 1 570FDF80
P 5250 5050
F 0 "MH1" H 5250 5320 50  0000 C CNN
F 1 "HOLE" H 5250 5250 50  0000 C CNN
F 2 "Mounting_Holes:MountingHole_3.2mm_M3_DIN965_Pad" H 5450 5050 50  0001 C CNN
F 3 "" H 5450 5050 50  0000 C CNN
	1    5250 5050
	1    0    0    -1  
$EndComp
$Comp
L GND #PWR05
U 1 1 570FE0E1
P 5250 5200
F 0 "#PWR05" H 5250 4950 50  0001 C CNN
F 1 "GND" H 5250 5050 50  0000 C CNN
F 2 "" H 5250 5200 50  0000 C CNN
F 3 "" H 5250 5200 50  0000 C CNN
	1    5250 5200
	1    0    0    -1  
$EndComp
Wire Wire Line
	5250 5050 5250 5200
$Comp
L TEST_1P MH2
U 1 1 570FE35A
P 5450 5050
F 0 "MH2" H 5450 5320 50  0000 C CNN
F 1 "HOLE" H 5450 5250 50  0000 C CNN
F 2 "Mounting_Holes:MountingHole_3.2mm_M3_DIN965_Pad" H 5650 5050 50  0001 C CNN
F 3 "" H 5650 5050 50  0000 C CNN
	1    5450 5050
	1    0    0    -1  
$EndComp
$Comp
L GND #PWR06
U 1 1 570FE360
P 5450 5200
F 0 "#PWR06" H 5450 4950 50  0001 C CNN
F 1 "GND" H 5450 5050 50  0000 C CNN
F 2 "" H 5450 5200 50  0000 C CNN
F 3 "" H 5450 5200 50  0000 C CNN
	1    5450 5200
	1    0    0    -1  
$EndComp
Wire Wire Line
	5450 5050 5450 5200
$Comp
L TEST_1P MH3
U 1 1 570FE3B1
P 5650 5050
F 0 "MH3" H 5650 5320 50  0000 C CNN
F 1 "HOLE" H 5650 5250 50  0000 C CNN
F 2 "Mounting_Holes:MountingHole_3.2mm_M3_DIN965_Pad" H 5850 5050 50  0001 C CNN
F 3 "" H 5850 5050 50  0000 C CNN
	1    5650 5050
	1    0    0    -1  
$EndComp
$Comp
L GND #PWR07
U 1 1 570FE3B7
P 5650 5200
F 0 "#PWR07" H 5650 4950 50  0001 C CNN
F 1 "GND" H 5650 5050 50  0000 C CNN
F 2 "" H 5650 5200 50  0000 C CNN
F 3 "" H 5650 5200 50  0000 C CNN
	1    5650 5200
	1    0    0    -1  
$EndComp
Wire Wire Line
	5650 5050 5650 5200
$Comp
L TEST_1P MH4
U 1 1 570FE3BE
P 5850 5050
F 0 "MH4" H 5850 5320 50  0000 C CNN
F 1 "HOLE" H 5850 5250 50  0000 C CNN
F 2 "Mounting_Holes:MountingHole_3.2mm_M3_DIN965_Pad" H 6050 5050 50  0001 C CNN
F 3 "" H 6050 5050 50  0000 C CNN
	1    5850 5050
	1    0    0    -1  
$EndComp
$Comp
L GND #PWR08
U 1 1 570FE3C4
P 5850 5200
F 0 "#PWR08" H 5850 4950 50  0001 C CNN
F 1 "GND" H 5850 5050 50  0000 C CNN
F 2 "" H 5850 5200 50  0000 C CNN
F 3 "" H 5850 5200 50  0000 C CNN
	1    5850 5200
	1    0    0    -1  
$EndComp
Wire Wire Line
	5850 5050 5850 5200
$Comp
L TEST_1P MH5
U 1 1 570FE473
P 6050 5050
F 0 "MH5" H 6050 5320 50  0000 C CNN
F 1 "HOLE" H 6050 5250 50  0000 C CNN
F 2 "Mounting_Holes:MountingHole_3.2mm_M3_DIN965_Pad" H 6250 5050 50  0001 C CNN
F 3 "" H 6250 5050 50  0000 C CNN
	1    6050 5050
	1    0    0    -1  
$EndComp
$Comp
L GND #PWR09
U 1 1 570FE479
P 6050 5200
F 0 "#PWR09" H 6050 4950 50  0001 C CNN
F 1 "GND" H 6050 5050 50  0000 C CNN
F 2 "" H 6050 5200 50  0000 C CNN
F 3 "" H 6050 5200 50  0000 C CNN
	1    6050 5200
	1    0    0    -1  
$EndComp
Wire Wire Line
	6050 5050 6050 5200
$Comp
L TEST_1P MH6
U 1 1 570FE480
P 6250 5050
F 0 "MH6" H 6250 5320 50  0000 C CNN
F 1 "HOLE" H 6250 5250 50  0000 C CNN
F 2 "Mounting_Holes:MountingHole_3.2mm_M3_DIN965_Pad" H 6450 5050 50  0001 C CNN
F 3 "" H 6450 5050 50  0000 C CNN
	1    6250 5050
	1    0    0    -1  
$EndComp
$Comp
L GND #PWR010
U 1 1 570FE486
P 6250 5200
F 0 "#PWR010" H 6250 4950 50  0001 C CNN
F 1 "GND" H 6250 5050 50  0000 C CNN
F 2 "" H 6250 5200 50  0000 C CNN
F 3 "" H 6250 5200 50  0000 C CNN
	1    6250 5200
	1    0    0    -1  
$EndComp
Wire Wire Line
	6250 5050 6250 5200
$Comp
L TEST_1P MH7
U 1 1 570FE48D
P 6450 5050
F 0 "MH7" H 6450 5320 50  0000 C CNN
F 1 "HOLE" H 6450 5250 50  0000 C CNN
F 2 "Mounting_Holes:MountingHole_3.2mm_M3_DIN965_Pad" H 6650 5050 50  0001 C CNN
F 3 "" H 6650 5050 50  0000 C CNN
	1    6450 5050
	1    0    0    -1  
$EndComp
$Comp
L GND #PWR011
U 1 1 570FE493
P 6450 5200
F 0 "#PWR011" H 6450 4950 50  0001 C CNN
F 1 "GND" H 6450 5050 50  0000 C CNN
F 2 "" H 6450 5200 50  0000 C CNN
F 3 "" H 6450 5200 50  0000 C CNN
	1    6450 5200
	1    0    0    -1  
$EndComp
Wire Wire Line
	6450 5050 6450 5200
$Comp
L TEST_1P MH8
U 1 1 570FE49A
P 6650 5050
F 0 "MH8" H 6650 5320 50  0000 C CNN
F 1 "HOLE" H 6650 5250 50  0000 C CNN
F 2 "Mounting_Holes:MountingHole_3.2mm_M3_DIN965_Pad" H 6850 5050 50  0001 C CNN
F 3 "" H 6850 5050 50  0000 C CNN
	1    6650 5050
	1    0    0    -1  
$EndComp
$Comp
L GND #PWR012
U 1 1 570FE4A0
P 6650 5200
F 0 "#PWR012" H 6650 4950 50  0001 C CNN
F 1 "GND" H 6650 5050 50  0000 C CNN
F 2 "" H 6650 5200 50  0000 C CNN
F 3 "" H 6650 5200 50  0000 C CNN
	1    6650 5200
	1    0    0    -1  
$EndComp
Wire Wire Line
	6650 5050 6650 5200
$EndSCHEMATC
