(module Choke_Dual_1206_HandSoldering (layer F.Cu) (tedit 570FC0F4)
  (descr http://www.tme.eu/cz/Document/72a49058c499d1da719158526cd2b482/SR_PASSIVES-DPWC1206.pdf)
  (attr smd)
  (fp_text reference REF** (at 0 -1.5) (layer F.SilkS)
    (effects (font (size 1 1) (thickness 0.15)))
  )
  (fp_text value Choke_Dual_1206_HandSoldering (at 0 1.5) (layer F.Fab)
    (effects (font (size 1 1) (thickness 0.15)))
  )
  (fp_line (start -1.7 -0.9) (end 1.7 -0.9) (layer F.SilkS) (width 0.15))
  (fp_line (start 1.7 -0.9) (end 1.7 0.9) (layer F.SilkS) (width 0.15))
  (fp_line (start 1.7 0.9) (end -1.7 0.9) (layer F.SilkS) (width 0.15))
  (fp_line (start -1.7 0.9) (end -1.7 -0.9) (layer F.SilkS) (width 0.15))
  (pad 2 smd rect (at 1.6 -0.5) (size 1.6 0.6) (layers F.Cu F.Paste F.Mask))
  (pad 3 smd rect (at 1.6 0.5) (size 1.6 0.6) (layers F.Cu F.Paste F.Mask))
  (pad 1 smd rect (at -1.6 -0.5) (size 1.6 0.6) (layers F.Cu F.Paste F.Mask))
  (pad 4 smd rect (at -1.6 0.5) (size 1.6 0.6) (layers F.Cu F.Paste F.Mask))
)
