EESchema Schematic File Version 2
LIBS:power
LIBS:device
LIBS:transistors
LIBS:conn
LIBS:linear
LIBS:regul
LIBS:74xx
LIBS:cmos4000
LIBS:adc-dac
LIBS:memory
LIBS:xilinx
LIBS:microcontrollers
LIBS:dsp
LIBS:microchip
LIBS:analog_switches
LIBS:motorola
LIBS:texas
LIBS:intel
LIBS:audio
LIBS:interface
LIBS:digital-audio
LIBS:philips
LIBS:display
LIBS:cypress
LIBS:siliconi
LIBS:opto
LIBS:atmel
LIBS:contrib
LIBS:valves
LIBS:microchip_dspic33dsc
LIBS:74xgxx
LIBS:ac-dc
LIBS:actel
LIBS:Altera
LIBS:analog_devices
LIBS:brooktre
LIBS:cmos_ieee
LIBS:dc-dc
LIBS:diode
LIBS:elec-unifil
LIBS:ESD_Protection
LIBS:ftdi
LIBS:gennum
LIBS:graphic
LIBS:hc11
LIBS:ir
LIBS:Lattice
LIBS:logo
LIBS:maxim
LIBS:motor_drivers
LIBS:msp430
LIBS:nordicsemi
LIBS:nxp_armmcu
LIBS:onsemi
LIBS:Oscillators
LIBS:powerint
LIBS:Power_Management
LIBS:pspice
LIBS:references
LIBS:relays
LIBS:rfcom
LIBS:sensors
LIBS:silabs
LIBS:stm8
LIBS:stm32
LIBS:supertex
LIBS:switches
LIBS:transf
LIBS:ttl_ieee
LIBS:video
LIBS:Xicor
LIBS:Zilog
LIBS:MCP2562FD
LIBS:vccio
LIBS:mcp
LIBS:JX1
LIBS:JX2
LIBS:gates
LIBS:usblc6
LIBS:canbench-hw-cache
EELAYER 25 0
EELAYER END
$Descr A4 11693 8268
encoding utf-8
Sheet 4 10
Title "CANbus MicroZed CarrierCard"
Date "25.4.2016"
Rev "RevA"
Comp ""
Comment1 ""
Comment2 ""
Comment3 ""
Comment4 ""
$EndDescr
$Comp
L GND #PWR081
U 1 1 5713CFA1
P 7250 6050
F 0 "#PWR081" H 7250 5800 50  0001 C CNN
F 1 "GND" H 7250 5900 50  0000 C CNN
F 2 "" H 7250 6050 50  0000 C CNN
F 3 "" H 7250 6050 50  0000 C CNN
	1    7250 6050
	1    0    0    -1  
$EndComp
$Comp
L GND #PWR082
U 1 1 5713CFA7
P 9750 6150
F 0 "#PWR082" H 9750 5900 50  0001 C CNN
F 1 "GND" H 9750 6000 50  0000 C CNN
F 2 "" H 9750 6150 50  0000 C CNN
F 3 "" H 9750 6150 50  0000 C CNN
	1    9750 6150
	1    0    0    -1  
$EndComp
$Comp
L +5V #PWR083
U 1 1 5713CFAD
P 7000 3750
F 0 "#PWR083" H 7000 3600 50  0001 C CNN
F 1 "+5V" H 7000 3900 50  0000 C CNN
F 2 "" H 7000 3750 50  0000 C CNN
F 3 "" H 7000 3750 50  0000 C CNN
	1    7000 3750
	1    0    0    -1  
$EndComp
$Comp
L +5V #PWR084
U 1 1 5713CFB3
P 10700 3800
F 0 "#PWR084" H 10700 3650 50  0001 C CNN
F 1 "+5V" H 10700 3950 50  0000 C CNN
F 2 "" H 10700 3800 50  0000 C CNN
F 3 "" H 10700 3800 50  0000 C CNN
	1    10700 3800
	1    0    0    -1  
$EndComp
$Comp
L VCCIO_35 #PWR085
U 1 1 5713CFB9
P 6450 4800
F 0 "#PWR085" H 6450 4650 50  0001 C CNN
F 1 "VCCIO_35" H 6450 4950 50  0000 C CNN
F 2 "" H 6450 4800 50  0000 C CNN
F 3 "" H 6450 4800 50  0000 C CNN
	1    6450 4800
	1    0    0    -1  
$EndComp
$Comp
L VCCIO_35 #PWR086
U 1 1 5713CFBF
P 10650 4800
F 0 "#PWR086" H 10650 4650 50  0001 C CNN
F 1 "VCCIO_35" H 10650 4950 50  0000 C CNN
F 2 "" H 10650 4800 50  0000 C CNN
F 3 "" H 10650 4800 50  0000 C CNN
	1    10650 4800
	1    0    0    -1  
$EndComp
Text Label 6700 1800 0    60   ~ 0
CAN1_RXD
Text Label 6700 1900 0    60   ~ 0
CAN1_TXD
Text Label 6700 2100 0    60   ~ 0
CAN2_RXD
Text Label 6700 2200 0    60   ~ 0
CAN2_TXD
Text Label 6700 2400 0    60   ~ 0
CAN3_RXD
Text Label 6700 2500 0    60   ~ 0
CAN3_TXD
Text Label 6700 2700 0    60   ~ 0
CAN4_RXD
Text Label 6700 2800 0    60   ~ 0
CAN4_TXD
$Comp
L VCCIO_35 #PWR087
U 1 1 5713CFCD
P 1150 1350
F 0 "#PWR087" H 1150 1200 50  0001 C CNN
F 1 "VCCIO_35" H 1150 1500 50  0000 C CNN
F 2 "" H 1150 1350 50  0000 C CNN
F 3 "" H 1150 1350 50  0000 C CNN
	1    1150 1350
	1    0    0    -1  
$EndComp
Text Label 2650 1550 2    60   ~ 0
SW1
Text Label 2650 1650 2    60   ~ 0
SW2
Text Label 2650 1750 2    60   ~ 0
SW3
Text Label 2650 1850 2    60   ~ 0
SW4
Text Label 2650 1950 2    60   ~ 0
SW5
Text Label 2650 2050 2    60   ~ 0
SW6
Text Label 2650 2150 2    60   ~ 0
SW7
Text Label 2650 2250 2    60   ~ 0
SW8
Text Label 2650 2350 2    60   ~ 0
KEY1
Text Label 2650 2450 2    60   ~ 0
KEY2
Text Label 2650 2550 2    60   ~ 0
KEY3
Text Label 2650 2650 2    60   ~ 0
KEY4
$Sheet
S 1350 3000 900  1250
U 5713CFE4
F0 "CAN Interfaces" 60
F1 "can.sch" 60
F2 "CAN1_RXD" O R 2250 3100 60 
F3 "CAN1_TXD" I R 2250 3200 60 
F4 "CAN2_RXD" O R 2250 3300 60 
F5 "CAN2_TXD" I R 2250 3400 60 
F6 "CAN3_RXD" O R 2250 3500 60 
F7 "CAN3_TXD" I R 2250 3600 60 
F8 "CAN4_RXD" O R 2250 3700 60 
F9 "CAN4_TXD" I R 2250 3800 60 
F10 "CAN_STBY" I R 2250 3950 60 
$EndSheet
Text Label 2850 3100 2    60   ~ 0
CAN1_RXD
Text Label 2850 3200 2    60   ~ 0
CAN1_TXD
Text Label 2850 3300 2    60   ~ 0
CAN2_RXD
Text Label 2850 3500 2    60   ~ 0
CAN3_RXD
Text Label 2850 3700 2    60   ~ 0
CAN4_RXD
Text Label 2850 3400 2    60   ~ 0
CAN2_TXD
Text Label 2850 3600 2    60   ~ 0
CAN3_TXD
Text Label 2850 3800 2    60   ~ 0
CAN4_TXD
Text Label 2850 3950 2    60   ~ 0
CAN_STBY
$Sheet
S 1350 1350 850  1400
U 5713D01F
F0 "User I/O" 60
F1 "user-io.sch" 60
F2 "VCCIO" I L 1350 1450 60 
F3 "SW1" I R 2200 1550 60 
F4 "SW2" I R 2200 1650 60 
F5 "SW3" I R 2200 1750 60 
F6 "SW4" I R 2200 1850 60 
F7 "SW5" I R 2200 1950 60 
F8 "SW6" I R 2200 2050 60 
F9 "SW7" I R 2200 2150 60 
F10 "SW8" I R 2200 2250 60 
F11 "KEY1" I R 2200 2350 60 
F12 "KEY2" I R 2200 2450 60 
F13 "KEY3" I R 2200 2550 60 
F14 "KEY4" I R 2200 2650 60 
F15 "LED2" I L 1350 1650 60 
F16 "LED3" I L 1350 1750 60 
F17 "LED4" I L 1350 1850 60 
F18 "LED5" I L 1350 1950 60 
F19 "LED6" I L 1350 2050 60 
F20 "LED7" I L 1350 2150 60 
F21 "LED8" I L 1350 2250 60 
F22 "LED1" I L 1350 1550 60 
$EndSheet
Text Label 850  1550 0    60   ~ 0
LED1
Text Label 850  1650 0    60   ~ 0
LED2
Text Label 850  1750 0    60   ~ 0
LED3
Text Label 850  1850 0    60   ~ 0
LED4
Text Label 850  1950 0    60   ~ 0
LED5
Text Label 850  2050 0    60   ~ 0
LED6
Text Label 850  2150 0    60   ~ 0
LED7
Text Label 850  2250 0    60   ~ 0
LED8
Wire Wire Line
	7550 1700 7250 1700
Wire Wire Line
	7250 1700 7250 6050
Wire Wire Line
	7550 5200 7250 5200
Connection ~ 7250 5200
Wire Wire Line
	7550 4500 7250 4500
Connection ~ 7250 4500
Wire Wire Line
	7550 4200 7250 4200
Connection ~ 7250 4200
Wire Wire Line
	7550 3500 7250 3500
Connection ~ 7250 3500
Wire Wire Line
	7550 3200 7250 3200
Connection ~ 7250 3200
Wire Wire Line
	7550 2900 7250 2900
Connection ~ 7250 2900
Wire Wire Line
	7550 2600 7250 2600
Connection ~ 7250 2600
Wire Wire Line
	7550 2300 7250 2300
Connection ~ 7250 2300
Wire Wire Line
	7550 2000 7250 2000
Connection ~ 7250 2000
Wire Wire Line
	9550 1700 9750 1700
Wire Wire Line
	9750 1700 9750 6150
Wire Wire Line
	9550 5200 9750 5200
Connection ~ 9750 5200
Wire Wire Line
	9550 4800 9750 4800
Connection ~ 9750 4800
Wire Wire Line
	9550 4500 9750 4500
Connection ~ 9750 4500
Wire Wire Line
	9550 4200 9750 4200
Connection ~ 9750 4200
Wire Wire Line
	9550 3500 9750 3500
Connection ~ 9750 3500
Wire Wire Line
	9550 3200 9750 3200
Connection ~ 9750 3200
Wire Wire Line
	9550 2900 9750 2900
Connection ~ 9750 2900
Wire Wire Line
	9550 2600 9750 2600
Connection ~ 9750 2600
Wire Wire Line
	9550 2300 9750 2300
Connection ~ 9750 2300
Wire Wire Line
	9550 2000 9750 2000
Connection ~ 9750 2000
Wire Wire Line
	7000 3900 7550 3900
Wire Wire Line
	7000 3900 7000 3750
Wire Wire Line
	7550 3800 7400 3800
Wire Wire Line
	7400 3800 7400 3900
Connection ~ 7400 3900
Wire Wire Line
	9550 5100 10450 5100
Wire Wire Line
	10700 3900 10700 3800
Wire Wire Line
	9550 3800 9650 3800
Wire Wire Line
	9650 3800 9650 3900
Connection ~ 9650 3900
Wire Wire Line
	6450 4900 7550 4900
Wire Wire Line
	6450 4900 6450 4800
Wire Wire Line
	7550 4800 7400 4800
Wire Wire Line
	7400 4800 7400 4900
Connection ~ 7400 4900
Wire Wire Line
	9550 4900 10650 4900
Wire Wire Line
	10650 4900 10650 4800
Wire Wire Line
	6700 1800 7550 1800
Wire Wire Line
	6700 1900 7550 1900
Wire Wire Line
	6700 2100 7550 2100
Wire Wire Line
	6700 2200 7550 2200
Wire Wire Line
	6700 2400 7550 2400
Wire Wire Line
	6700 2500 7550 2500
Wire Wire Line
	6700 2700 7550 2700
Wire Wire Line
	6700 2800 7550 2800
Wire Wire Line
	1150 1350 1150 1450
Wire Wire Line
	1150 1450 1350 1450
Wire Wire Line
	2200 1550 2650 1550
Wire Wire Line
	2200 1650 2650 1650
Wire Wire Line
	2200 1750 2650 1750
Wire Wire Line
	2200 1850 2650 1850
Wire Wire Line
	2200 1950 2650 1950
Wire Wire Line
	2200 2050 2650 2050
Wire Wire Line
	2200 2150 2650 2150
Wire Wire Line
	2200 2250 2650 2250
Wire Wire Line
	2200 2350 2650 2350
Wire Wire Line
	2200 2450 2650 2450
Wire Wire Line
	2200 2550 2650 2550
Wire Wire Line
	2200 2650 2650 2650
Wire Wire Line
	2250 3100 2850 3100
Wire Wire Line
	2250 3200 2850 3200
Wire Wire Line
	2250 3300 2850 3300
Wire Wire Line
	2250 3400 2850 3400
Wire Wire Line
	2250 3500 2850 3500
Wire Wire Line
	2250 3600 2850 3600
Wire Wire Line
	2250 3700 2850 3700
Wire Wire Line
	2250 3800 2850 3800
Wire Wire Line
	2250 3950 2850 3950
Wire Wire Line
	1350 1550 850  1550
Wire Wire Line
	1350 1650 850  1650
Wire Wire Line
	1350 1750 850  1750
Wire Wire Line
	1350 1850 850  1850
Wire Wire Line
	1350 1950 850  1950
Wire Wire Line
	1350 2050 850  2050
Wire Wire Line
	1350 2150 850  2150
Wire Wire Line
	1350 2250 850  2250
Wire Wire Line
	7550 4300 6650 4300
Wire Wire Line
	7550 4400 6650 4400
Wire Wire Line
	7550 4600 6650 4600
Wire Wire Line
	7550 5000 6650 5000
Wire Wire Line
	7550 5100 6650 5100
Wire Wire Line
	7550 5400 6650 5400
Wire Wire Line
	9550 4400 10450 4400
Wire Wire Line
	9550 3700 10450 3700
Wire Wire Line
	9550 3600 10450 3600
Wire Wire Line
	9550 5300 10450 5300
Wire Wire Line
	9550 4700 10450 4700
Wire Wire Line
	9550 4600 10450 4600
Wire Wire Line
	9550 4000 10450 4000
Wire Wire Line
	9550 4100 10450 4100
Wire Wire Line
	9550 5000 10450 5000
Wire Wire Line
	9550 5400 10450 5400
Wire Wire Line
	9550 4300 10450 4300
Wire Wire Line
	7550 4700 6650 4700
Wire Wire Line
	7550 5300 6650 5300
Text Label 6650 4300 0    60   ~ 0
LED1
Text Label 6650 4400 0    60   ~ 0
LED2
Text Label 6650 4600 0    60   ~ 0
LED3
Text Label 6650 4700 0    60   ~ 0
LED4
Text Label 6650 5000 0    60   ~ 0
LED5
Text Label 6650 5100 0    60   ~ 0
LED6
Text Label 6650 5300 0    60   ~ 0
LED7
Text Label 6650 5400 0    60   ~ 0
LED8
Text Label 10450 4300 2    60   ~ 0
SW4
Text Label 10450 4400 2    60   ~ 0
KEY2
Text Label 10450 3700 2    60   ~ 0
SW2
Text Label 10450 3600 2    60   ~ 0
SW1
Text Label 10450 5400 2    60   ~ 0
SW8
Text Label 10450 5300 2    60   ~ 0
KEY4
Text Label 10450 5100 2    60   ~ 0
SW7
Text Label 10450 5000 2    60   ~ 0
SW6
Text Label 10450 4700 2    60   ~ 0
KEY3
Text Label 10450 4600 2    60   ~ 0
SW5
Text Label 10450 4100 2    60   ~ 0
SW3
Text Label 10450 4000 2    60   ~ 0
KEY1
NoConn ~ 9550 5600
NoConn ~ 9550 5800
NoConn ~ 9550 5900
Text Label 10700 1400 2    60   ~ 0
INIT#
Text Label 10700 1500 2    60   ~ 0
PG_MODULE
Text HLabel 6950 1400 0    60   Output ~ 0
VCCIO_EN
Text HLabel 10700 1400 2    60   BiDi ~ 0
INIT#
Text HLabel 10700 1500 2    60   BiDi ~ 0
PG_MODULE
Wire Wire Line
	6950 1400 7550 1400
Wire Wire Line
	10700 1400 9550 1400
Wire Wire Line
	10700 1500 9550 1500
Wire Wire Line
	2250 5250 2650 5250
Wire Wire Line
	2250 5350 2650 5350
Wire Wire Line
	2250 5450 2650 5450
Wire Wire Line
	2250 5550 2650 5550
Wire Wire Line
	1050 5250 1550 5250
Wire Wire Line
	1050 5350 1550 5350
Wire Wire Line
	1050 5450 1550 5450
Wire Wire Line
	1050 5550 1550 5550
$Comp
L PMOD PS1
U 1 1 5713D108
P 1900 5500
F 0 "PS1" H 1900 5850 50  0000 C CNN
F 1 "PMOD" H 1900 5150 50  0000 C CNN
F 2 "footprints:PMOD_Angled" H 1900 4300 50  0001 C CNN
F 3 "" H 1900 4300 50  0000 C CNN
	1    1900 5500
	1    0    0    -1  
$EndComp
Wire Wire Line
	1550 5750 1450 5750
Wire Wire Line
	1450 5750 1450 5150
Wire Wire Line
	2350 5150 2350 5750
Wire Wire Line
	2350 5750 2250 5750
$Comp
L GND #PWR088
U 1 1 5713D113
P 2300 5850
F 0 "#PWR088" H 2300 5600 50  0001 C CNN
F 1 "GND" H 2300 5700 50  0000 C CNN
F 2 "" H 2300 5850 50  0000 C CNN
F 3 "" H 2300 5850 50  0000 C CNN
	1    2300 5850
	1    0    0    -1  
$EndComp
$Comp
L GND #PWR089
U 1 1 5713D119
P 1500 5850
F 0 "#PWR089" H 1500 5600 50  0001 C CNN
F 1 "GND" H 1500 5700 50  0000 C CNN
F 2 "" H 1500 5850 50  0000 C CNN
F 3 "" H 1500 5850 50  0000 C CNN
	1    1500 5850
	1    0    0    -1  
$EndComp
Wire Wire Line
	1500 5850 1500 5650
Wire Wire Line
	1500 5650 1550 5650
Wire Wire Line
	2250 5650 2300 5650
Wire Wire Line
	2300 5650 2300 5850
Text Label 1050 5250 0    60   ~ 0
PS1
Text Label 1050 5350 0    60   ~ 0
PS2
Text Label 1050 5450 0    60   ~ 0
PS3
Text Label 1050 5550 0    60   ~ 0
PS4
Text Label 2650 5250 2    60   ~ 0
PS7
Text Label 2650 5350 2    60   ~ 0
PS8
Text Label 2650 5450 2    60   ~ 0
PS9
Text Label 2650 5550 2    60   ~ 0
PS10
Text Notes 1250 4900 0    60   ~ 0
Note: VCCIO_35 must be 3.3V!
Wire Wire Line
	7550 1000 6450 1000
Wire Wire Line
	7550 1100 6450 1100
Wire Wire Line
	7550 1200 6450 1200
Wire Wire Line
	7550 1300 6450 1300
Wire Wire Line
	9550 1000 10750 1000
Wire Wire Line
	9550 1100 10750 1100
Wire Wire Line
	9550 1200 10750 1200
Wire Wire Line
	9550 1300 10750 1300
Text Label 6450 1000 0    60   ~ 0
PS2
Text Label 6450 1100 0    60   ~ 0
PS4
Text Label 6450 1200 0    60   ~ 0
PS8
Text Label 6450 1300 0    60   ~ 0
PS10
Text Label 10750 1000 2    60   ~ 0
PS1
Text Label 10750 1100 2    60   ~ 0
PS3
Text Label 10750 1200 2    60   ~ 0
PS7
Text Label 10750 1300 2    60   ~ 0
PS9
Wire Wire Line
	7550 5500 7250 5500
Connection ~ 7250 5500
NoConn ~ 9550 5700
$Comp
L MicroZed_JX2 JX2
U 1 1 5713D13F
P 8550 3450
F 0 "JX2" H 8550 6050 50  0000 C CNN
F 1 "MicroZed_JX2" H 8550 850 50  0000 C CNN
F 2 "footprints:61083_10x" H 8550 3450 60  0001 C CNN
F 3 "" H 8550 3450 60  0000 C CNN
	1    8550 3450
	-1   0    0    -1  
$EndComp
Wire Wire Line
	9550 5500 9750 5500
Connection ~ 9750 5500
Wire Wire Line
	9550 3900 10700 3900
$Comp
L +5V #PWR090
U 1 1 5713D149
P 6150 1400
F 0 "#PWR090" H 6150 1250 50  0001 C CNN
F 1 "+5V" H 6150 1540 50  0000 C CNN
F 2 "" H 6150 1400 50  0000 C CNN
F 3 "" H 6150 1400 50  0000 C CNN
	1    6150 1400
	1    0    0    -1  
$EndComp
Wire Wire Line
	7550 1500 6150 1500
Wire Wire Line
	6150 1500 6150 1400
NoConn ~ 7550 3000
NoConn ~ 7550 3100
NoConn ~ 7550 3300
NoConn ~ 7550 3400
NoConn ~ 7550 3600
NoConn ~ 7550 3700
NoConn ~ 7550 5900
NoConn ~ 9550 1600
$Comp
L VCCIO_35 #PWR091
U 1 1 5713D16B
P 2350 5150
F 0 "#PWR091" H 2350 5000 50  0001 C CNN
F 1 "VCCIO_35" H 2350 5300 50  0000 C CNN
F 2 "" H 2350 5150 50  0000 C CNN
F 3 "" H 2350 5150 50  0000 C CNN
	1    2350 5150
	1    0    0    -1  
$EndComp
$Comp
L VCCIO_35 #PWR092
U 1 1 5713D171
P 1450 5150
F 0 "#PWR092" H 1450 5000 50  0001 C CNN
F 1 "VCCIO_35" H 1450 5300 50  0000 C CNN
F 2 "" H 1450 5150 50  0000 C CNN
F 3 "" H 1450 5150 50  0000 C CNN
	1    1450 5150
	1    0    0    -1  
$EndComp
Wire Wire Line
	7550 1600 6450 1600
Text Label 6450 1600 0    60   ~ 0
CAN_STBY
$Comp
L VCCIO_35 #PWR093
U 1 1 57103C6E
P 6450 5700
F 0 "#PWR093" H 6450 5550 50  0001 C CNN
F 1 "VCCIO_35" H 6450 5850 50  0000 C CNN
F 2 "" H 6450 5700 50  0000 C CNN
F 3 "" H 6450 5700 50  0000 C CNN
	1    6450 5700
	1    0    0    -1  
$EndComp
Wire Wire Line
	6450 5800 7550 5800
Wire Wire Line
	6450 5800 6450 5700
Text Notes 6050 6300 0    60   ~ 0
JX2.98 is for\nVCCIO_13, assign\nsame voltage as \nVCCIO_35
NoConn ~ 7550 4000
NoConn ~ 7550 4100
NoConn ~ 7550 5600
NoConn ~ 7550 5700
NoConn ~ 9550 1800
NoConn ~ 9550 1900
NoConn ~ 9550 2100
NoConn ~ 9550 2200
NoConn ~ 9550 2400
NoConn ~ 9550 2500
NoConn ~ 9550 2700
NoConn ~ 9550 2800
NoConn ~ 9550 3000
NoConn ~ 9550 3100
NoConn ~ 9550 3300
NoConn ~ 9550 3400
$EndSCHEMATC
