{
    "IP_TS": "10.42.0.50",
    "IP_GW": "10.42.0.47",
    "KEY_FILE": "/home/user/.ssh/my-key",
    "UGW_CMD": "~/can-latester/_compiled/bin/ugw can3 can2",
    "UGW_FD_CMD": "~/can-latester/_compiled/bin/ugw -f can3 can2",
    "CGW_CMD": "cangw -A -s can3 -d can2",
    "CGW_FD_CMD": "cangw -A -X -s can3 -d can2",
    "STRESS_CPUS": 2,
    "UGW_PRIO": 80,
    "IRQ_PRIO": 90,
    "DEFAULT_PRIO": 50,
    "OPTS": "-o -c 10000",
    "OPTS_FLOOD": "-c 10000",
    "DEST_PATH": "/var/lib/latester/results/",
    "RESULTS_ARCHIVE_DIR": "/var/lib/latester/results-archive/",
    "PING_FLOOD_TARGET": "10.42.0.1",
    "MAINLINE_DIR": "/usr/src/linux-mainline/",
    "KERNEL_VARIANTS": {
        "master" : {
            "NAME": "master",
            "CONFIG_FILE": "/var/lib/latester/.config",
            "GIT_BRANCH" : "origin/master",
            "SOURCE_DIR": "/usr/src/linux-dut/",
            "BUILD_DIR": "/usr/src/linux-dut/_build/arm/zynq",
            "CLEAN_BUILD": true
        },
        "rt" : {
            "NAME": "RT",
            "CONFIG_FILE": "/var/lib/latester/.config-rt",
            "GIT_BRANCH" : "linux-rt-devel/for-kbuild-bot/current-stable",
            "SOURCE_DIR": "/usr/src/linux-dut/",
            "BUILD_DIR": "/usr/src/linux-dut/_build/arm/zynq",
            "CLEAN_BUILD": true
        }
    },
    "INSTALL_DIR": "/srv/nfs/debian-armhf",
    "BUILD_OUT_DIR": "/srv/tftp/zynq/mzapo/images/linux",
    "WEB_DIR": "/var/www/html/latester/",
    "WEB_ARCHIVE_DIR": "/var/www/html/can-latester-archive/",
    "WEB_EXPORT_DIR": "/var/www/html/latester-export/",
    "OVERVIEW_CONFIGS": [
        "master-oaat", "master-oaat-kern", "rt-oaat-prio", "rt-oaat-kern-prio"
    ],
    "DTBOCFG_DIR": "/usr/src/dtbocfg",
    "REBOOT_CMD": "ssh root@tborpi \"ttysendbreak /dev/ttyUSB0 2500\""
}
