Area,name,measured area (m2),percentage
11R,chin,0.003,0.19
14R,upper mouth,0.0067,0.42
12R,lower mouth,0.0084,0.53
16R,ear,0.0175,1.11
13R,lower jaw,0.0396,2.51
15R,upper jaw,0.0569,3.61
7R,hand,0.0614,3.89
9R,elbow,0.0622,3.95
2R,front calf,0.0695,4.41
1R,foot,0.0851,5.4
8R,forearm,0.1275,8.09
17R,upper head,0.13,8.25
3R,front knee,0.1303,8.26
4R,from thigh,0.1326,8.41
10R,arm,0.1355,8.59
6R,front torso,0.2484,15.76
5R,front abdominal,0.262,16.62
TOTAL RIGHT AREA,,1.5766,100
