loc,x,y
1R,173,941
1L,327,939
2R,168,852
2L,331,850
3R,168,757
3L,336,761
4R,176,671
4L,322,669
5R,195,567
5L,307,565
6R,203,376
6L,291,374
7R,36,616
7L,458,618
8R,54,532
8L,433,531
9R,66,468
9L,424,469
10R,114,405
10L,385,407
11R,209,246
11L,283,249
13R,165,211
13L,331,209
16R,121,162
16L,380,164
17R,201,97
17L,296,96
NONE,10,200