// Time Position Current 
0.000002 216 -44
0.100982 216 -44
0.200214 216 -44
0.300375 216 -44
0.400462 214 -44
0.500540 214 -44
0.600253 216 -44
0.700162 214 -44
0.800345 214 -44
0.900652 216 -44
1.000308 214 -44
1.100075 214 -44
1.200132 214 -43
1.300592 214 -44
1.400262 214 -44
1.500198 216 -44
1.600115 214 -44
1.700162 216 -44
1.800448 214 -44
1.900209 216 -44
2.000490 216 -44
2.100254 216 -44
2.200523 216 -44
2.300268 214 -44
2.400134 214 -44
2.500171 464 397
2.600275 2290 165
2.700165 4128 197
2.800091 5422 354
2.900219 6880 238
3.000203 8190 302
3.100526 8980 398
3.200331 10030 281
3.300143 11008 318
3.400103 11612 366
3.500255 12398 448
3.600422 12910 495
3.700378 13480 614
3.800180 13990 704
3.900133 14440 666
4.000314 14798 759
4.100121 14828 712
4.200440 14846 745
4.300408 14858 743
4.400128 0 14868
4.500273 14880 760
4.600192 14896 729
4.700048 14912 742
4.800165 14924 725
4.900158 14940 736
5.000481 14954 728
5.100310 14968 727
5.200592 14980 725
5.300415 14994 722
5.400211 15006 766
5.500184 15018 721
5.600345 15032 776
5.700157 15044 746
5.800319 15060 759
5.900240 15070 760
6.000516 15086 719
6.100440 15102 771
6.200615 15112 756
6.300326 15126 709
6.400600 15136 779
6.500164 15150 774
6.600993 15162 718
6.700251 15174 747
6.801166 15180 716
6.900176 15200 763
7.000679 15206 725
7.100120 15218 775
7.200482 15228 710
7.301050 15236 712
7.400182 15246 777
7.500367 15258 703
7.600121 15270 731
7.700518 15278 780
7.800162 15290 713
7.900534 15298 704
8.000286 15310 710
8.100107 15320 781
8.200401 15334 790
8.300206 15344 768
8.400522 15354 723
8.500207 15362 719
8.600169 15372 792
8.700458 15384 772
8.800256 15396 703
8.900157 15408 792
9.000236 15420 701
9.100194 15432 725
9.200329 15440 698
9.300310 15454 787
9.400129 15464 725
9.500442 15474 702
9.600247 15482 726
9.700557 15490 709
9.800358 15496 710
9.900181 15508 774
10.000117 15514 737
10.100297 15522 768
10.200103 15530 726
10.300648 15544 771
10.400224 15554 790
10.500060 15562 791
10.600169 15570 722
10.700170 15574 714
10.800128 15586 781
10.900320 15592 744
11.000103 15602 691
11.100441 15608 717
11.200226 15612 688
11.300516 15618 749
11.400332 15626 770
11.500149 15632 712
11.600449 0 15640
11.700272 15646 695
11.800582 15654 741
11.900391 15660 790
12.000188 15664 790
12.100193 15670 789
12.200126 15676 697
12.300125 15680 700
12.400178 15690 699
12.500271 15696 750
12.600289 15702 726
12.700259 15706 781
12.800189 15708 724
12.900372 15716 711
13.000315 15720 721
13.100112 15724 699
13.200100 15736 779
13.300267 15740 698
13.400551 15744 708
13.500353 15752 735
13.600374 15758 690
13.700481 15766 713
13.800287 15772 701
13.900038 15776 718
14.000150 15780 728
14.100242 15784 695
14.200030 15792 714
14.300349 15798 701
14.400208 15802 699
14.500458 15810 783
14.600273 15812 758
14.700089 15818 739
14.800393 15820 778
14.900211 15828 700
15.000506 15836 788
15.100335 15842 775
15.200136 15844 784
15.300441 15848 767
15.400246 15850 733
15.500574 15852 761
15.600183 15852 768
15.700197 15858 792
15.800090 15856 724
15.900395 15862 744
16.000112 15864 773
16.100383 15866 700
16.200263 15870 792
16.300033 15872 784
16.400336 15874 770
16.500144 15878 758
16.600459 15884 710
16.700268 15886 686
16.800140 15892 725
16.900383 15898 778
17.000207 15898 778
17.100115 15902 786
17.200354 15906 789
17.300120 15912 767
17.400129 15912 784
17.500194 15912 752
17.600073 15916 731
17.700374 15920 788
17.800185 15918 702
17.900359 15922 777
18.000301 15924 779
18.100139 15930 687
18.200138 15934 705
18.300239 15940 774
18.400153 15944 686
18.500358 15950 713
18.600167 15950 703
18.700466 15952 689
18.800292 0 15960
18.900088 15962 722
19.000168 15968 795
19.100223 0 15966
19.200242 15970 768
19.300342 15972 729
19.400156 15976 754
19.500711 15980 688
19.600282 15986 788
19.700092 15988 778
19.800407 15990 766
19.900202 15996 782
20.000446 15998 751
20.100321 16004 794
20.200134 16008 763
20.300449 16006 713
20.400256 16010 773
20.500127 16008 705
20.600375 16012 705
20.700203 16014 763
20.800127 16014 744
20.900303 16016 693
21.000120 16020 760
21.100118 16020 711
21.200236 16020 714
21.300228 16024 759
21.400358 16030 694
21.500187 16032 693
21.600143 16036 719
21.700113 16042 706
21.800601 0 16044
21.900239 16044 783
22.000126 16048 778
22.100070 16048 715
22.200174 16050 701
22.300173 16052 726
22.400482 16058 761
22.500292 16058 721
22.600091 16064 694
22.700402 16068 794
22.800216 16070 767
22.900536 16072 788
23.000320 16074 792
23.100166 16080 789
23.200177 16084 716
23.300288 16088 707
23.400097 16088 794
23.500398 16092 731
23.600150 16092 784
23.700180 16098 772
23.800122 16098 795
23.900134 16100 720
24.000208 16102 762
24.100131 16106 786
24.200125 16106 701
24.300365 16112 713
24.400279 16114 708
24.500093 0 16116
24.600107 16118 763
24.700331 16124 793
24.800233 16124 744
24.900228 16128 765
25.000270 16126 746
25.100357 16132 777
25.200374 16134 781
25.300761 16136 793
25.400178 16142 720
25.500131 16142 778
25.600058 16140 693
25.700247 16142 771
25.800337 16144 714
25.900352 16146 740
26.000178 16148 763
26.100353 16148 746
26.200619 16152 704
26.301113 16156 781
26.400681 16154 720
26.501491 16154 766
26.600079 16156 709
26.700229 16160 719
26.800089 16162 706
26.900138 16162 696
27.000239 16162 707
27.100178 16164 788
27.200119 16162 692
27.300066 16166 768
27.400162 16168 731
27.500187 16172 788
27.600517 16176 695
27.700465 16182 766
27.800218 16184 777
27.900599 16184 787
28.000272 16188 767
28.100664 16192 709
28.200623 16194 734
28.300775 16196 729
28.400129 16196 720
28.500283 16200 801
28.600235 16200 780
28.700169 16198 703
28.800470 16200 698
28.900109 16200 786
29.000358 16202 705
29.100610 16202 709
29.200302 16200 746
29.300565 16204 755
29.400229 16204 721
29.500102 16208 790
29.600111 16208 711
29.700424 16208 789
29.800269 16210 773
29.900088 16212 791
30.000417 16214 763
30.100156 16214 759
30.200167 16218 766
30.300097 16220 702
30.400271 16222 699
30.500108 16224 758
30.600442 16224 712
30.700260 16224 702
30.800106 16226 774
30.900376 16224 717
31.000276 16230 717
31.100112 16232 728
31.200459 16234 701
31.300272 16240 772
31.400171 16238 698
31.500530 16240 762
31.600333 16240 721
31.700151 16242 765
31.800161 16240 774
31.900334 16240 779
32.000166 16240 718
32.100393 16240 775
32.200332 16240 751
32.300177 16242 712
32.400504 16246 721
32.500345 16248 810
32.600153 16252 714
32.700506 16252 695
32.800572 16252 699
32.900170 16252 735
33.000502 16252 772
33.100332 16254 783
33.200155 16252 738
33.300112 16252 773
33.400326 16252 710
33.500240 16252 709
33.600497 16252 777
33.700381 16254 782
33.800232 16256 769
33.900385 16258 713
34.000212 0 16260
34.100144 16258 678
34.200490 16262 781
34.300333 16262 780
34.400192 16264 762
