// Time Position Current 
0.000002 266 -43
0.100318 266 -44
0.200129 266 -43
0.300369 266 -43
0.400250 266 -43
0.500191 266 -43
0.600368 266 -44
0.700179 266 -44
0.800488 266 -44
0.900308 266 -44
1.000113 0 266
1.100350 266 -44
1.200149 266 -44
1.300548 266 -44
1.400351 266 -43
1.500163 266 -43
1.600117 266 -44
1.700117 266 -43
1.800163 266 -43
1.900486 266 -44
2.001207 266 -43
2.100126 266 -43
2.201310 266 -43
2.300236 266 -43
2.400548 266 -44
2.500256 266 -44
2.600155 266 -44
2.700460 266 -44
2.800274 266 -43
2.900080 266 -43
3.000396 266 -44
3.100207 266 -44
3.200111 266 -44
3.300154 266 -43
3.400139 266 -43
3.500452 266 -43
3.600283 266 -44
3.700066 266 -44
3.800519 266 -44
3.900189 266 -44
4.000095 266 -43
4.100314 266 -44
4.200117 266 -43
4.300456 266 -43
4.400290 266 -44
4.501678 1278 307
4.600359 2948 168
4.700176 4426 308
4.800144 6030 262
4.900290 7498 273
5.000106 8572 297
5.100317 9422 346
5.200225 10306 288
5.300539 11122 527
5.400326 12006 458
5.500171 12598 569
5.600472 13104 637
5.700212 13604 657
5.800111 14034 728
5.900094 14414 729
6.000205 14496 738
6.100181 14508 763
6.200133 14524 741
6.300138 14532 735
6.400183 14544 760
6.500351 14558 768
6.600117 14574 727
6.700419 14584 737
6.800200 14598 741
6.900528 14612 748
7.000314 14624 720
7.100125 14638 731
7.200444 14650 761
7.300252 14670 720
7.400562 14682 756
7.500362 14698 702
7.600244 14712 770
7.700495 14720 753
7.800172 14732 715
7.900175 14740 760
8.000212 14754 718
8.100232 14766 689
8.200218 14782 767
8.300176 14792 721
8.400181 14802 777
8.500172 14810 710
8.600281 14822 772
8.700093 14828 720
8.800403 14840 700
8.900210 14856 712
9.000242 14872 715
9.100332 14882 777
9.200138 14896 707
9.300144 14904 713
9.400490 14914 781
9.500174 14926 738
9.600223 14940 730
9.700201 14950 726
9.800213 14960 764
9.900322 14968 775
10.000147 14978 753
10.100437 14984 689
10.200276 15000 761
10.300150 15010 770
10.400374 15022 709
10.500177 15036 692
10.600494 15046 785
10.700298 15054 779
10.800570 15060 767
10.900423 15072 768
11.000241 15076 776
11.100159 15086 789
11.200125 15088 751
11.300191 15098 732
11.400393 15106 719
11.500310 15114 771
11.600212 15118 724
11.700491 15124 798
11.800292 15130 782
11.900106 15136 698
12.001917 15144 714
12.100223 15152 761
12.200053 15158 695
12.300436 15166 695
12.400075 15172 769
12.500380 15178 766
12.600249 15184 721
12.700265 15190 750
12.800340 15196 758
12.900492 15204 698
13.000230 15208 768
13.100116 15212 699
13.200278 15220 763
13.300106 15226 736
13.400288 15230 710
13.500414 15234 785
13.600266 15236 715
13.700435 15238 785
13.800633 15244 702
13.900196 15250 705
14.000375 15254 698
14.100086 15258 704
14.200147 15264 707
14.300119 15268 785
14.400431 15270 739
14.500377 15274 715
14.600665 15276 689
14.700176 15284 788
14.800305 15286 730
14.900073 15290 699
15.000099 15292 729
15.100138 15298 792
15.200185 15300 777
15.300217 15308 786
15.400160 15306 693
15.500300 15312 709
15.600121 15312 739
15.702016 15320 744
15.800097 15320 696
15.900501 15326 779
16.000322 15328 720
16.100172 15330 810
16.200388 15330 688
16.300150 15332 718
16.400095 15336 782
16.500227 15340 791
16.600180 15344 779
16.700335 15346 718
16.800100 15350 791
16.900258 15354 764
17.000082 15358 761
17.100397 15360 782
17.200179 15364 787
17.300093 15368 802
17.400291 15370 703
17.500060 15372 705
17.600328 15376 714
17.700132 15378 700
17.800420 15382 705
17.900196 15386 718
18.000565 15390 799
18.100302 15394 709
18.200646 15396 765
18.300217 15398 771
18.400155 15402 778
18.500468 15404 791
18.600236 15404 719
18.700553 15410 751
18.800334 15408 785
18.900097 15410 786
19.000184 15408 697
19.100194 15410 759
19.200305 15412 709
19.300306 15416 720
19.400345 15418 768
19.500352 15420 731
19.600580 15422 754
19.700172 15424 789
19.800222 15426 686
19.900540 15428 690
20.000367 15428 777
20.100152 15432 765
20.200464 15432 746
20.300251 15434 724
20.400173 15434 685
20.500098 15438 694
20.600635 15440 716
20.700435 15442 710
20.800194 15442 699
20.900228 15444 713
21.000301 15446 733
21.100509 15452 741
21.200460 15454 782
21.300182 15454 722
21.400452 15456 766
21.500242 15456 752
21.600279 15458 794
21.700332 15460 746
21.800117 15462 703
21.900414 15466 789
22.000197 15466 759
22.100105 15464 694
22.200294 15468 694
22.300581 15470 696
22.400205 15470 725
22.500152 15470 733
22.600322 15472 710
22.700234 15472 725
22.800480 15476 730
22.900318 15478 704
23.000097 15480 756
23.100392 15482 782
23.200183 15482 725
23.300483 15486 760
23.400264 15488 686
23.500556 15492 744
23.600337 15492 703
23.700128 15494 688
23.800433 15494 792
23.900138 15498 769
24.000223 15500 696
24.100296 15502 702
24.200304 15504 795
24.300087 15504 691
24.400393 15506 792
24.500175 15504 708
24.600235 15504 681
24.700546 15508 717
24.800357 15510 705
24.900163 15512 689
25.000467 15516 802
25.100287 15512 711
25.200148 15516 694
25.300131 15514 704
25.400125 15518 716
25.500263 15518 764
25.600305 15520 727
25.700337 15522 783
25.800137 15522 739
25.900447 15524 700
26.000193 15526 805
26.100509 15524 698
26.200313 15528 712
26.300131 15530 797
26.400451 15528 711
26.500242 15528 699
26.600058 15534 787
26.700371 15532 685
26.800183 15536 700
26.900178 15540 795
27.000177 15538 769
27.100104 15540 787
27.200108 15544 793
27.300231 15546 684
27.400544 15548 692
27.500248 15552 801
27.600166 15552 726
27.700332 15554 792
27.800316 15552 783
27.900099 15552 704
28.000396 15550 745
28.100209 15556 696
28.200267 15556 786
28.300335 15554 717
28.400144 15554 701
28.500461 15556 773
28.600272 15556 708
28.700280 15556 783
28.800135 15556 712
28.900196 15556 762
29.000177 15556 705
29.100333 15556 694
29.200127 15556 713
29.300439 15556 740
29.400249 15556 692
29.500636 15564 785
29.600373 15564 759
29.700179 15562 784
29.800497 15562 682
29.900306 15562 736
30.000119 15568 718
30.100430 15568 781
30.200239 15568 760
30.300052 15566 696
30.400534 15566 718
30.500157 15566 780
30.600482 15568 751
30.700290 15568 719
30.800100 15568 707
30.900408 15568 753
31.000227 15568 750
31.100049 15568 725
31.200346 15568 707
31.300154 15568 779
31.400326 15572 799
31.501995 15574 710
31.600261 15574 694
31.700725 15574 772
31.801044 15576 706
31.900292 15578 731
32.000166 15578 691
32.101083 15576 786
32.200569 15578 754
32.300045 15580 782
32.400634 15582 801
32.501034 15584 789
32.601005 15584 696
32.700277 15586 761
32.800697 15588 798
32.900673 15586 696
33.003729 15588 707
33.100105 15588 704
33.200172 15590 775
33.300106 15590 793
33.400171 15592 787
33.500170 15590 716
33.600401 15590 707
