// Time Position Current 
0.000004 214 -44
0.100215 216 -44
0.203595 214 -43
0.300500 214 -44
0.400221 214 -44
0.500354 214 -44
0.600453 214 -44
0.700094 214 -44
0.800169 214 -44
0.900227 216 -44
1.000330 216 -44
1.100454 216 -44
1.200464 214 -44
1.300118 216 -44
1.400182 216 -43
1.500270 214 -44
1.600093 216 -44
1.700461 214 -44
1.800615 214 -44
1.900122 214 -44
2.000200 946 325
2.100295 2376 396
2.200166 4080 218
2.300208 5118 476
2.400553 6448 339
2.500130 7562 430
2.600234 9332 203
2.700328 10020 361
2.800492 11104 397
2.900096 11686 531
3.000053 12404 392
3.100133 13136 440
3.200234 13614 751
3.300321 14126 728
3.400104 14534 771
3.500157 14768 835
3.600114 14800 763
3.700167 14814 717
3.800256 14826 760
3.900112 14838 772
4.000161 14852 730
4.101681 14868 726
4.200315 14878 773
4.300165 14890 758
4.400147 14902 762
4.500358 14914 706
4.600167 14928 732
4.700547 14940 713
4.800165 14950 715
4.900191 14960 780
5.000487 14974 709
5.100063 14988 711
5.200215 15002 701
5.300221 15016 783
5.400325 15026 723
5.500418 15038 780
5.600195 15048 785
5.700109 15058 783
5.800142 15070 760
5.900309 15078 728
6.000381 15088 767
6.100450 15094 704
6.200518 15106 774
6.300551 15116 746
6.400212 15128 773
6.500263 15134 783
6.600257 15146 776
6.700443 15154 727
6.800545 15160 725
6.900293 15170 771
7.000194 15176 743
7.100293 15184 717
7.200384 15192 751
7.300188 15200 697
7.400244 15206 753
7.500198 15216 706
7.600212 15220 688
7.700166 15230 715
7.800460 15234 701
7.900145 15234 726
8.000253 15244 692
8.100098 15252 753
8.200435 15258 747
8.300099 15264 690
8.400805 15270 700
8.500526 15274 703
8.600241 15282 685
8.700088 15290 712
8.800093 15296 805
8.900124 15304 780
9.000173 15306 691
9.100112 15314 748
9.200108 15320 792
9.300114 15322 736
9.400124 15330 753
9.500267 15332 757
9.600105 15334 704
9.700559 15340 714
9.800311 15346 746
9.902799 15354 707
10.000185 15358 788
10.100488 15364 767
10.200337 15368 743
10.300173 15372 789
10.400325 15376 694
10.500410 15382 734
10.600151 15384 779
10.700354 15390 785
10.800564 15392 775
10.900184 15398 689
11.000417 15402 700
11.100089 15408 768
11.200472 15408 765
11.300312 15410 717
11.400594 15414 706
11.500235 15418 684
11.600487 15422 705
11.700089 15426 698
11.800231 15430 702
11.900499 15436 698
12.000121 15442 776
12.100393 15442 714
12.200117 15446 723
12.300233 15450 707
12.400245 15452 717
12.500160 15458 785
12.600104 15458 705
12.700144 15460 760
12.801308 15466 773
12.900217 15466 692
13.000071 15470 714
13.100291 15470 723
13.200604 15470 760
13.300361 15476 786
13.400287 15478 697
13.500166 15482 753
13.600370 15486 706
13.700122 15490 787
13.800160 15492 716
13.900101 15496 785
14.000189 15500 712
14.100357 15504 784
14.200183 15504 726
14.300133 15506 703
14.400266 15508 728
14.500025 15512 712
14.600338 15512 680
14.701628 15518 728
14.800412 15520 780
14.900164 15522 709
15.000119 15526 696
15.100112 15530 783
15.200221 15532 746
15.300313 15538 693
15.400296 15540 751
15.500245 15542 775
15.600153 15550 708
15.700125 15552 781
15.800280 15552 763
15.900514 15556 702
16.000262 15562 721
16.100185 15566 760
16.200461 15564 717
16.300099 15564 738
16.400412 15564 708
16.500317 15570 746
16.600112 15572 713
16.700621 15572 680
16.800135 15576 761
16.900225 15578 758
17.000279 15584 799
17.100219 15586 752
17.200104 15584 733
17.300193 15588 703
17.400404 15588 701
17.500605 15590 781
17.601122 15588 727
17.700558 15590 767
17.801074 15592 794
17.900149 15596 785
18.000223 15596 699
18.100148 15596 773
18.200392 15600 695
18.300429 15600 723
18.400449 15602 701
18.500324 15602 702
18.600232 15604 780
18.700103 15606 740
18.800195 15606 783
18.900183 15610 794
19.000092 15610 728
19.100439 15614 708
19.200215 15616 761
19.300294 15616 711
19.400136 15616 693
19.500364 15616 715
19.601849 15618 741
19.706436 15620 740
19.800216 15620 694
19.904366 15620 772
20.000343 15624 782
20.100109 15626 780
20.200153 15624 720
20.300162 15626 759
20.400181 15628 723
20.500300 15626 722
20.600279 15632 775
20.700280 15632 725
20.800187 15634 792
20.900142 0 15636
21.000386 15636 704
21.100985 15638 698
21.200078 15640 772
21.300489 15642 790
21.400191 15642 780
21.500573 15646 718
21.600122 15646 776
21.700635 15650 794
21.800408 15650 786
21.900175 15652 776
22.000152 15652 768
22.102610 15652 691
22.200578 0 15654
22.301088 15656 721
22.402381 15658 695
22.500113 15660 778
22.600256 15660 704
22.701244 15662 695
22.800311 15660 688
22.900151 15664 798
23.000109 15666 792
23.100137 15666 719
23.200430 15664 712
23.300162 15666 708
23.400496 15664 712
23.500135 15664 750
23.600553 15668 774
23.700102 15664 703
23.800338 0 15666
23.900311 15666 779
24.000117 15666 768
24.100906 15664 710
24.200626 15666 772
24.301759 15666 722
24.400609 15668 773
24.500994 15666 708
24.659439 15666 782
24.704110 15668 741
24.800380 15668 714
24.900531 15674 800
25.000216 15676 744
25.100255 15678 744
25.200073 15678 704
25.301072 15684 736
25.410990 15686 802
25.500355 15688 702
25.600112 15692 795
25.700647 15690 757
25.803816 15694 730
25.911930 15692 704
26.000512 15694 761
26.100526 15694 714
26.200454 15692 695
26.306400 15694 765
26.400346 15694 694
26.500132 15696 764
26.600182 15694 751
26.700310 15700 789
26.800395 15700 782
26.900536 15700 740
27.000806 15700 699
27.100160 15702 795
27.200099 15706 782
27.300136 15706 769
27.401358 15708 707
27.500240 15710 777
27.603395 15714 787
27.700638 15714 749
27.800135 15716 779
27.900208 15716 786
28.000310 15716 748
28.100088 15716 782
28.200265 0 15716
28.300940 15716 746
28.400696 15718 796
28.500604 15720 793
28.600153 15720 758
28.700449 15722 764
28.800371 15722 709
28.901033 15724 772
29.000325 15724 740
29.100508 15726 776
29.200289 15726 687
29.300234 15734 778
29.400109 15732 736
29.500185 15736 784
29.600205 15736 723
29.700377 15734 743
29.800608 15734 721
29.900433 15738 698
30.000059 15738 709
30.100299 0 15742
30.203065 15744 784
30.300637 15744 727
30.400762 15748 746
30.500851 15748 760
30.600125 15748 706
30.700497 15748 772
30.800547 0 15752
30.900714 15752 771
31.000082 15752 775
31.100308 15752 745
31.200209 15752 751
31.300616 15752 776
31.400103 15752 775
31.500240 15754 716
31.600356 15754 778
31.700131 15754 718
31.800219 15752 744
31.900483 15752 706
32.000669 15754 709
32.100710 15752 707
32.200551 15758 800
32.300679 15760 792
32.400482 15758 682
32.500559 15758 679
32.600295 15764 707
