// Time Position Current 
0.000010 208 -44
0.101106 208 -44
0.200380 208 -44
0.302460 208 -44
0.400335 208 -44
0.500129 208 -43
0.600460 208 -44
0.700615 208 -44
0.802964 208 -44
0.900747 208 -44
1.000724 208 -44
1.100145 208 -44
1.221338 208 -44
1.301041 0 208
1.400384 208 -44
1.500336 208 -44
1.600289 208 -44
1.700246 208 -44
1.800185 210 -44
1.900143 208 -44
2.000110 208 -43
2.100226 208 -43
2.200250 208 -44
2.300297 208 -44
2.400507 208 -43
2.500441 208 -43
2.600398 210 -44
2.700159 208 -43
2.800292 210 -43
2.900242 208 -44
3.000107 694 391
3.100074 2524 153
3.200609 4482 170
3.300151 6000 358
3.400242 7160 476
3.500558 8392 406
3.600394 9454 409
3.700187 10342 257
3.800220 11188 310
3.900128 11940 300
4.000116 12578 362
4.100429 13246 296
4.200165 13800 331
4.300041 14180 444
4.400079 14660 400
4.500323 15056 438
4.600140 15418 426
4.700229 0 15706
4.800252 16014 514
4.900633 16262 502
5.000428 16522 533
5.100197 16714 622
5.200498 16928 622
5.300249 17088 659
5.400133 17240 701
5.500354 17378 700
5.600116 17486 739
5.700068 17564 740
5.800371 17596 750
5.900169 17602 744
6.000127 17626 745
6.100317 17636 748
6.200099 17646 751
6.300267 17666 740
6.400232 17674 751
6.500285 17688 743
6.600099 0 17702
6.700184 17716 753
6.800273 17732 749
6.900125 17744 742
7.000091 17748 739
7.100194 17766 754
7.200213 17812 730
7.300132 17880 741
7.400333 18052 752
7.500139 18220 735
7.600466 18262 741
7.700164 18276 753
7.800582 18290 759
7.900395 18302 735
8.000190 18318 753
8.100212 18326 745
8.200088 18336 725
8.300124 18346 745
8.400459 18360 745
8.500243 18362 740
8.600575 18366 715
8.700102 18376 719
8.800185 18386 725
8.900267 18390 724
9.000308 18398 740
9.100113 18402 762
9.200460 18412 743
9.300115 18420 732
9.400552 18428 756
9.500209 18436 724
9.600166 18442 770
9.700492 18448 742
9.800287 18454 737
9.900093 18456 753
10.000900 18466 776
10.100323 18474 743
10.200119 18480 748
10.300344 18484 723
10.400142 18488 700
10.500476 0 18494
10.600382 18498 754
10.700098 18504 776
10.800403 18508 763
10.900201 18514 765
11.000224 18518 774
11.100528 18524 752
11.200237 18528 725
11.300525 18534 720
11.400207 18540 770
11.500094 18542 702
11.600425 18546 744
11.700195 18548 726
11.800418 18552 766
11.900076 18554 770
12.000122 18560 759
12.100038 18564 772
12.200271 18568 709
12.300131 18570 738
12.400394 18574 744
12.500237 18576 725
12.600092 18578 716
12.700196 18578 746
12.800121 18582 721
12.900105 18584 758
13.000173 18586 774
13.100079 18588 756
13.200253 18588 771
13.300265 18588 753
13.400176 18590 783
13.500280 18590 747
13.600092 18592 758
13.700426 18594 722
13.800220 18596 719
13.900535 18598 774
14.000340 18600 709
14.100154 18602 762
14.200503 18604 742
14.300278 18608 720
14.400694 18610 749
14.500600 18610 730
14.600579 18612 741
14.700216 18614 764
14.800768 18614 711
14.900187 18616 745
15.000146 18616 736
15.100199 18614 754
15.200277 0 18616
15.300489 18616 724
15.400826 18616 731
15.500399 18616 748
15.600332 18616 720
15.700276 18616 766
15.800225 18616 716
15.900172 0 18616
16.000087 18618 760
16.101038 18618 718
16.200695 18618 744
16.300440 0 18618
16.400172 18618 762
16.500223 18620 750
16.600109 18620 767
16.700042 18620 748
16.800317 18620 754
16.900539 18620 759
17.000147 18622 757
17.100410 18624 735
17.200168 18622 743
17.300372 18622 744
17.400119 18624 732
17.500307 18626 738
17.600181 18624 731
17.700254 18624 743
17.800320 18626 758
17.900043 18626 731
18.000084 18626 729
18.100187 18626 736
18.200258 18626 727
18.300340 18624 755
18.400426 18626 733
18.500170 18626 737
18.600080 18626 739
18.700159 0 18624
18.800149 18626 732
18.900252 18626 741
19.000674 18626 763
19.100414 18626 765
19.200310 18628 768
19.300126 18626 754
19.400211 18628 738
19.500237 18626 741
19.600314 18628 747
19.700395 18626 761
19.800133 18628 725
19.900188 18628 769
20.000137 18630 728
20.100216 18630 745
20.200307 18630 771
20.300399 18630 737
20.400175 18630 749
20.500226 18630 716
20.600296 0 18630
20.700116 18630 729
20.800063 18630 755
20.900261 18630 757
21.000047 18630 717
21.100361 18630 762
21.200158 18630 709
21.300272 18630 729
21.400288 18630 782
21.500094 18632 712
21.600412 18630 722
21.700223 18630 767
21.800025 18630 713
21.900338 18630 745
22.000152 18632 770
22.100475 0 18630
22.200267 18632 705
22.300078 18630 762
22.400178 18630 723
22.500197 18630 713
22.600433 18632 773
22.700327 18630 716
22.800127 18630 722
22.900440 18630 764
23.000257 18630 710
23.100260 18630 769
23.200372 18632 731
23.300179 18632 741
23.400227 18630 715
23.500302 18632 731
23.600125 18630 768
23.700424 18630 725
23.800235 18632 767
23.900105 18632 731
24.000360 18632 766
24.100173 18632 731
24.200476 18632 726
24.300159 18630 727
24.400095 18632 743
24.500144 0 18632
24.600223 18630 734
24.700047 18630 750
24.800349 18632 737
24.900149 18632 757
25.000476 18632 743
25.100271 18630 743
25.200085 18632 734
25.300421 18632 736
25.400211 18632 752
25.500139 18630 749
25.600329 18632 736
25.700133 18632 762
25.800130 18632 724
25.901400 18632 755
26.000073 18632 754
26.100031 18632 736
26.200187 18632 743
26.300528 18632 752
26.400202 18632 761
26.500114 18632 741
26.600206 18632 726
26.700228 18632 748
26.800204 18632 719
26.900372 18632 758
27.000176 18632 740
27.100498 18632 750
27.200299 18632 746
27.300104 18632 724
27.400426 18632 736
27.500221 18632 729
27.600092 18632 750
27.700349 18630 747
27.800159 18632 750
27.900220 18632 745
28.000276 18632 741
28.100091 18630 731
28.200401 18632 734
28.300207 18632 735
28.400563 18632 748
28.500140 18632 735
28.600174 18632 747
28.700458 18632 748
28.800265 18632 744
28.900079 18632 751
29.000408 18632 742
29.100202 18632 738
29.200512 18632 742
29.300311 18632 742
29.400175 18632 751
29.500500 18632 747
29.600293 18632 742
29.700111 18632 739
29.800418 18632 742
29.900228 18632 750
30.000094 18632 758
30.100354 18632 723
30.200212 18632 751
30.300479 18632 751
30.400333 18632 734
30.500152 18632 755
30.600483 18632 750
30.700264 18632 726
30.800101 18632 736
30.900397 18632 762
31.000195 18632 748
31.100092 18632 753
31.200319 18632 734
31.300134 18632 740
31.400464 18632 757
31.500123 18632 737
31.600575 18632 724
31.700394 18634 720
31.800184 18634 719
31.900423 18634 723
32.000158 18632 724
32.100194 18634 748
32.200128 18634 747
32.300241 0 18634
32.400208 18632 746
32.500077 0 18632
32.600169 18636 735
32.700232 18636 748
32.800125 18634 747
32.900148 18636 751
33.000440 18634 749
33.100096 18636 736
33.200165 18636 746
33.300342 18636 738
33.400175 18636 739
33.500104 18636 750
33.600214 18636 749
33.700079 18634 736
33.800543 18634 740
33.900225 18636 744
34.000579 18636 740
34.100328 18634 741
34.200189 18636 752
34.300194 18634 751
34.400648 18636 745
34.500484 18636 741
34.600378 18636 746
34.700193 18636 737
34.800749 18636 737
34.900314 18636 748
35.000408 18636 743
35.100246 18636 754
35.200245 18636 738
35.300060 18636 734
35.400360 18634 747
35.500178 18636 742
35.600127 18636 730
35.700302 18636 750
35.800101 18636 757
35.900420 18636 750
36.000229 18636 730
36.100547 18636 733
36.200343 18638 757
36.300154 0 18636
36.400108 18636 742
36.500347 18636 740
36.600146 18636 741
36.700475 18636 755
36.800243 18634 734
36.900094 18636 754
