// Time Position Current 
0.011194 0.000000 0.000000
0.021492 0.000000 0.000000
0.031368 0.000000 0.000000
0.045995 0.000000 0.000000
0.052213 0.000000 0.000000
0.061457 0.000000 0.000000
0.072268 0.000000 0.000000
0.081399 0.000000 0.000000
0.091898 0.000000 0.000000
0.102147 0.000000 0.000000
0.111311 0.000000 0.000000
0.122077 0.000000 0.000000
0.132146 0.000000 0.000000
0.142115 0.000000 0.000000
0.152167 0.000000 0.000000
0.161276 0.000000 0.000000
0.171547 0.000000 0.000000
0.182139 0.000000 0.000000
0.191494 0.000000 0.000000
0.202102 0.000000 0.000000
0.211625 0.000000 0.000000
0.222078 0.000000 0.000000
0.231721 0.000000 0.000000
0.241742 0.000000 0.000000
0.252063 0.000000 0.000000
0.261922 0.000000 0.000000
0.271345 0.000000 0.000000
0.281707 0.000000 0.000000
0.292133 0.000000 0.000000
0.302029 0.000000 0.000000
0.311623 0.000000 0.000000
0.322018 0.000000 0.000000
0.332019 0.008734 0.000000
0.342003 0.008734 0.000000
0.351996 0.008734 0.000000
0.361993 0.008734 0.000000
0.372041 0.008734 0.000000
0.381994 0.008734 0.000000
0.391967 0.008734 0.000000
0.401972 0.008734 0.000000
0.413102 0.008734 0.000000
0.421997 0.008734 0.000000
0.431389 0.008734 0.000000
0.441948 0.008734 0.000000
0.451938 0.008734 0.000000
0.461927 0.008734 0.000000
0.471532 0.008734 0.000000
0.481411 0.008734 0.000000
0.491950 0.008734 0.000000
0.501905 0.008734 0.000000
0.511955 0.008734 0.000000
0.521886 0.008734 0.000000
0.531948 0.008734 0.000000
0.541881 0.008734 0.000000
0.551868 0.008734 0.000000
0.563892 0.008734 0.000000
0.571876 0.008734 0.000000
0.581944 0.008734 0.000000
0.591866 0.008734 0.000000
0.601848 0.008734 0.000000
0.611865 0.008734 0.000000
0.621831 0.008734 0.000000
0.631445 0.008734 0.000000
0.641603 0.008734 0.000000
0.651823 0.008734 0.000000
0.661860 0.008734 0.000000
0.671828 0.008734 0.000000
0.681811 0.008734 0.000000
0.691792 0.008734 0.000000
0.701784 0.008734 0.000000
0.711830 0.008734 0.000000
0.721771 0.008734 0.000000
0.731791 0.008734 0.000000
0.741791 0.008734 0.000000
0.751759 0.008734 0.000000
0.761820 0.008734 0.000000
0.772253 0.008734 0.000000
0.781847 0.008734 0.000000
0.792238 0.008734 0.000000
0.801377 0.008734 0.000000
0.811246 0.008734 0.000000
0.821362 0.008734 0.000000
0.831303 0.008734 0.000000
0.841500 0.008734 0.000000
0.852351 0.008734 0.000000
0.862265 0.008734 0.000000
0.871683 0.008734 0.000000
0.882228 0.008734 0.000000
0.892178 0.008734 0.000000
0.902199 0.008734 0.000000
0.912235 0.008734 0.000000
0.922163 0.008734 0.000000
0.932342 0.008734 0.000000
0.942183 0.008734 0.000000
0.952233 0.008734 0.000000
0.962214 0.008734 0.000000
0.972137 0.008734 0.000000
0.982157 0.008734 0.000000
0.992124 0.008734 0.000000
1.002115 0.008734 0.000000
1.012109 0.008734 0.000000
1.021459 0.008734 0.000000
1.031733 0.008734 0.000000
1.041333 0.008734 0.000000
1.052140 0.008734 0.000000
1.063392 0.008734 0.000000
1.071837 0.008734 0.000000
1.082107 0.008734 0.000000
1.092055 0.008734 0.000000
1.102050 0.008734 0.370000
1.111393 0.008734 0.370000
1.122082 0.008734 0.370000
1.132087 0.008734 0.370000
1.141647 0.008734 0.370000
1.152021 0.052402 0.230000
1.162068 0.069869 0.170000
1.172013 0.069869 0.170000
1.182015 0.069869 0.170000
1.192009 0.069869 0.170000
1.201991 0.131004 0.290000
1.211425 0.131004 0.290000
1.221347 0.131004 0.290000
1.233736 0.131004 0.290000
1.242043 0.174673 0.230000
1.251983 0.174673 0.230000
1.261506 0.240175 0.110000
1.271962 0.240175 0.110000
1.281592 0.262009 0.100000
1.291982 0.262009 0.100000
1.301925 0.262009 0.100000
1.311966 0.262009 0.100000
1.321956 0.310044 0.100000
1.331979 0.310044 0.100000
1.341904 0.310044 0.100000
1.351902 0.310044 0.100000
1.361903 0.414847 0.200000
1.371540 0.414847 0.200000
1.381457 0.414847 0.200000
1.391526 0.414847 0.200000
1.401519 0.414847 0.200000
1.411399 0.441048 0.420000
1.421334 0.441048 0.420000
1.431540 0.441048 0.420000
1.441487 0.441048 0.420000
1.451493 0.475983 0.620000
1.461378 0.475983 0.620000
1.471487 0.475983 0.620000
1.481508 0.475983 0.620000
1.491460 0.475983 0.620000
1.501488 0.506550 0.950000
1.512053 0.506550 0.950000
1.521509 0.506550 0.950000
1.531333 0.506550 0.950000
1.541431 0.506550 0.950000
1.551435 0.528384 0.910000
1.561508 0.528384 0.910000
1.571416 0.528384 0.910000
1.581437 0.528384 0.910000
1.591397 0.554585 0.980000
1.601392 0.554585 0.980000
1.611362 0.576419 1.000000
1.621995 0.576419 1.000000
1.631759 0.576419 1.000000
1.641445 0.576419 1.000000
1.652182 0.576419 1.000000
1.661584 0.576419 1.000000
1.671590 0.593886 0.990000
1.681369 0.593886 0.990000
1.692017 0.593886 0.990000
1.701601 0.593886 0.990000
1.711601 0.606987 0.990000
1.721681 0.606987 0.990000
1.731930 0.606987 0.990000
1.741615 0.606987 0.990000
1.751334 0.606987 1.000000
1.762031 0.606987 1.000000
1.771750 0.606987 1.000000
1.781483 0.606987 1.000000
1.792188 0.606987 1.000000
1.801363 0.606987 1.000000
1.811620 0.606987 0.040000
1.821351 0.606987 0.040000
1.832125 0.606987 0.040000
1.841799 0.606987 0.040000
1.851507 0.606987 0.040000
1.862247 0.606987 0.050000
1.871961 0.606987 0.050000
1.882087 0.606987 0.050000
1.891408 0.606987 0.050000
1.902070 0.606987 0.050000
1.911772 0.606987 0.050000
1.921440 0.606987 0.050000
1.932261 0.606987 0.050000
1.941928 0.606987 0.030000
1.951661 0.606987 0.030000
1.961395 0.606987 0.030000
1.971589 0.606987 0.030000
1.981811 0.606987 0.060000
1.991553 0.606987 0.060000
2.001775 0.606987 0.060000
2.011453 0.606987 0.060000
2.022135 0.606987 0.060000
2.031904 0.606987 0.040000
2.041586 0.606987 0.040000
2.051300 0.606987 0.040000
2.062181 0.606987 0.040000
2.071761 0.606987 0.040000
2.082391 0.606987 0.040000
2.091944 0.606987 0.050000
2.101886 0.606987 0.050000
2.111604 0.606987 0.050000
2.121325 0.606987 0.050000
2.132123 0.606987 0.050000
2.141378 0.606987 0.050000
2.151480 0.606987 0.050000
2.163768 0.606987 0.050000
2.171431 0.606987 0.050000
2.181651 0.606987 0.050000
2.191855 0.606987 0.050000
2.201411 0.606987 0.040000
2.211304 0.606987 0.040000
2.221406 0.606987 0.040000
2.231360 0.606987 0.040000
2.241465 0.606987 0.040000
2.252152 0.606987 0.040000
2.261873 0.606987 0.040000
2.271597 0.606987 0.040000
2.281451 0.606987 0.040000
2.291324 0.606987 0.040000
2.301751 0.606987 0.040000
2.311470 0.606987 0.050000
2.322176 0.606987 0.050000
2.331370 0.606987 0.050000
2.341619 0.606987 0.050000
2.351337 0.606987 0.040000
2.361389 0.606987 0.040000
2.371768 0.606987 0.040000
2.381486 0.606987 0.040000
2.392186 0.606987 0.040000
2.401911 0.606987 0.040000
2.411631 0.606987 0.040000
2.421375 0.606987 0.040000
2.431327 0.606987 0.040000
2.441810 0.606987 0.040000
2.451522 0.606987 0.050000
2.462201 0.606987 0.050000
2.471922 0.606987 0.050000
2.481725 0.606987 0.050000
2.491374 0.606987 0.050000
2.502067 0.606987 0.050000
2.511799 0.606987 0.050000
2.521428 0.606987 0.050000
2.531496 0.606987 0.040000
2.541396 0.606987 0.040000
2.551699 0.606987 0.040000
2.561405 0.606987 0.040000
2.572132 0.606987 0.040000
2.581813 0.606987 0.050000
2.591555 0.606987 0.050000
2.602232 0.606987 0.050000
2.611373 0.606987 0.050000
2.621546 0.606987 0.040000
2.631480 0.606987 0.040000
2.642097 0.606987 0.040000
2.651839 0.606987 0.040000
2.661430 0.606987 0.040000
2.671278 0.606987 0.040000
2.682038 0.606987 0.040000
2.691710 0.606987 0.040000
2.702800 0.606987 0.040000
2.712209 0.606987 0.050000
2.721555 0.606987 0.050000
2.731362 0.606987 0.050000
2.741291 0.606987 0.050000
2.751861 0.606987 0.050000
2.761718 0.606987 0.050000
