Current Position 
-47 246
-48 240
-47 238
-48 236
-45 234
-44 232
174 912
128 2352
158 3914
204 5080
174 6308
137 7170
240 8096
203 8832
262 9504
234 10238
249 10856
252 11416
286 11966
249 12504
295 12910
336 13366
356 13804
385 14186
407 14496
455 14834
473 15092
496 15356
538 15654
588 15910
16144 0
532 16348
593 16472
646 16614
684 16744
733 16864
744 16966
755 17006
749 17032
17054 0
734 17090
715 17132
759 17182
771 17236
736 17296
731 17342
783 17384
730 17426
773 17464
760 17500
703 17546
724 17584
743 17612
790 17632
750 17658
728 17678
714 17702
733 17714
751 17734
709 17744
764 17758
17772 0
715 17782
719 17798
787 17808
783 17808
748 17810
772 17816
772 17824
777 17834
703 17836
707 17848
769 17856
767 17860
795 17866
702 17870
757 17870
689 17874
695 17882
772 17890
17894 0
699 17898
727 17900
701 17902
692 17906
722 17906
739 17908
708 17908
767 17918
17920 0
17920 0
790 17918
17922 0
731 17928
728 17930
719 17932
