// Time Position Current 
0.003206 0.000000 0.000000
0.007451 0.000000 0.000000
0.011558 0.000000 0.000000
0.017068 0.000000 0.000000
0.019593 0.000000 0.000000
0.023520 0.000000 0.000000
0.027515 0.000000 0.000000
0.034126 0.000000 0.000000
0.036025 0.000000 0.000000
0.039318 0.000000 0.000000
0.044070 0.000000 0.000000
0.047658 0.000000 0.000000
0.052155 0.000000 0.000000
0.055873 0.000000 0.000000
0.059492 0.000000 0.000000
0.064072 0.000000 0.000000
0.067468 0.000000 0.000000
0.071893 0.000000 0.000000
0.075581 0.000000 0.000000
0.079668 0.000000 0.000000
0.083540 0.000000 0.000000
0.087454 0.000000 0.000000
0.092146 0.000000 0.000000
0.096095 0.000000 0.000000
0.099672 0.000000 0.000000
0.103301 0.000000 0.000000
0.107447 0.000000 0.000000
0.111466 0.000000 0.000000
0.115814 0.000000 0.000000
0.119433 0.000000 0.000000
0.124022 0.000000 0.000000
0.127597 0.000000 0.000000
0.131431 0.000000 0.000000
0.135960 0.000000 0.000000
0.140031 0.000000 0.000000
0.143642 0.000000 0.000000
0.147728 0.000000 0.000000
0.151336 0.000000 0.000000
0.155645 0.000000 0.000000
0.159770 0.000000 0.000000
0.163373 0.000000 0.000000
0.167838 0.000000 0.000000
0.171335 0.000000 0.000000
0.175754 0.004386 0.000000
0.179588 0.004386 0.000000
0.183982 0.004386 0.000000
0.188124 0.004386 0.000000
0.191628 0.004386 0.000000
0.195449 0.004386 0.000000
0.200150 0.004386 0.000000
0.203696 0.004386 0.000000
0.207292 0.004386 0.000000
0.211767 0.004386 0.000000
0.215562 0.004386 0.000000
0.219872 0.004386 0.000000
0.223426 0.004386 0.000000
0.227593 0.004386 0.000000
0.231750 0.004386 0.000000
0.235599 0.004386 0.000000
0.239550 0.004386 0.000000
0.244112 0.004386 0.000000
0.247647 0.004386 0.000000
0.252130 0.004386 0.000000
0.255707 0.004386 0.000000
0.259297 0.004386 0.000000
0.263780 0.004386 0.000000
0.267390 0.004386 0.000000
0.272025 0.004386 0.000000
0.275507 0.004386 0.000000
0.279934 0.004386 0.000000
0.283539 0.004386 0.000000
0.287730 0.004386 0.000000
0.291597 0.004386 0.000000
0.295530 0.004386 0.000000
0.299290 0.004386 0.000000
0.304137 0.004386 0.000000
0.307622 0.004386 0.000000
0.311549 0.004386 0.000000
0.315524 0.004386 0.000000
0.319381 0.004386 0.000000
0.323292 0.004386 0.000000
0.327480 0.004386 0.000000
0.331566 0.004386 0.000000
0.335469 0.004386 0.000000
0.340013 0.004386 0.000000
0.343598 0.004386 0.000000
0.347943 0.004386 0.000000
0.351743 0.004386 0.000000
0.355523 0.004386 0.000000
0.359267 0.004386 0.000000
0.363329 0.004386 0.000000
0.367449 0.004386 0.000000
0.371414 0.004386 0.000000
0.375484 0.004386 0.000000
0.379414 0.004386 0.000000
0.383969 0.004386 0.000000
0.387568 0.004386 0.000000
0.391536 0.004386 0.000000
0.395555 0.004386 0.000000
0.400093 0.004386 0.000000
0.403678 0.004386 0.000000
0.407293 0.004386 0.000000
0.411706 0.004386 0.000000
0.415397 0.004386 0.000000
0.419423 0.004386 0.000000
0.423433 0.004386 0.000000
0.427960 0.004386 0.000000
0.431468 0.004386 0.000000
0.435520 0.004386 0.000000
0.439572 0.004386 0.000000
0.444048 0.004386 0.000000
0.447658 0.004386 0.000000
0.451273 0.004386 0.000000
0.455584 0.004386 0.000000
0.459314 0.004386 0.000000
0.463775 0.004386 0.000000
0.467361 0.004386 0.000000
0.471791 0.004386 0.000000
0.475446 0.004386 0.000000
0.479569 0.004386 0.000000
0.483506 0.004386 0.000000
0.488087 0.004386 0.000000
0.491585 0.004386 0.000000
0.495583 0.004386 0.000000
0.499639 0.004386 0.000000
0.504118 0.004386 0.000000
0.507703 0.004386 0.000000
0.511291 0.004386 0.000000
0.515504 0.004386 0.000000
0.519361 0.004386 0.000000
0.523851 0.004386 0.000000
0.527569 0.004386 0.000000
0.532067 0.004386 0.000000
0.535620 0.004386 0.000000
0.539389 0.004386 0.000000
0.543628 0.004386 0.000000
0.548268 0.004386 0.000000
0.551683 0.004386 0.000000
0.555296 0.004386 0.000000
0.559732 0.004386 0.000000
0.563479 0.004386 0.000000
0.567817 0.004386 0.000000
0.571417 0.004386 0.000000
0.575886 0.004386 0.000000
0.579439 0.004386 0.000000
0.583955 0.004386 0.000000
0.587584 0.004386 0.000000
0.591718 0.004386 0.000000
0.595603 0.004386 0.000000
0.599375 0.004386 0.000000
0.603693 0.004386 0.000000
0.607307 0.004386 0.000000
0.611775 0.004386 0.000000
0.615305 0.004386 0.000000
0.619794 0.004386 0.000000
0.623409 0.004386 0.000000
0.627887 0.004386 0.000000
0.633393 0.004386 0.000000
0.635693 0.004386 0.000000
0.639590 0.004386 0.000000
0.643458 0.004386 0.000000
0.647884 0.004386 0.000000
0.651527 0.004386 0.000000
0.655672 0.004386 0.000000
0.659252 0.004386 0.000000
0.663556 0.004386 0.000000
0.667338 0.004386 0.000000
0.671807 0.004386 0.000000
0.675886 0.004386 0.000000
0.679724 0.004386 0.000000
0.683544 0.004386 0.000000
0.687497 0.004386 0.000000
0.691557 0.004386 0.000000
0.696025 0.004386 0.000000
0.699612 0.004386 0.000000
0.704102 0.004386 0.000000
0.707519 0.004386 0.000000
0.712168 0.004386 0.000000
0.715302 0.004386 0.000000
0.719336 0.004386 0.000000
0.723677 0.004386 0.000000
0.727461 0.004386 0.000000
0.731910 0.004386 0.000000
0.735502 0.004386 0.000000
0.739901 0.004386 0.000000
0.743402 0.004386 0.000000
0.747381 0.004386 0.000000
0.751671 0.004386 0.000000
0.755228 0.004386 0.000000
0.759305 0.004386 0.000000
0.763302 0.004386 0.000000
0.767796 0.004386 0.000000
0.771346 0.004386 0.000000
0.775643 0.004386 0.000000
0.779421 0.004386 0.000000
0.783455 0.004386 0.000000
0.787517 0.004386 0.000000
0.792597 0.004386 0.000000
0.795624 0.004386 0.000000
0.800085 0.004386 0.000000
0.803696 0.004386 0.000000
0.807321 0.004386 0.000000
0.811473 0.004386 0.000000
0.815291 0.004386 0.000000
0.819587 0.004386 0.000000
0.823352 0.004386 0.000000
0.827408 0.004386 0.000000
0.831481 0.004386 0.000000
0.835465 0.004386 0.000000
0.839530 0.004386 0.000000
0.843419 0.004386 0.000000
0.847586 0.004386 0.000000
0.851805 0.004386 0.000000
0.855575 0.004386 0.000000
0.859492 0.004386 0.000000
0.863731 0.004386 0.000000
0.867410 0.004386 0.000000
0.871700 0.004386 0.000000
0.875424 0.004386 0.000000
0.879883 0.004386 0.000000
0.883475 0.004386 0.000000
0.887359 0.004386 0.000000
0.891333 0.004386 0.000000
0.895402 0.004386 0.000000
0.899611 0.004386 0.000000
0.904289 0.004386 0.000000
0.907513 0.004386 0.000000
0.911273 0.004386 0.000000
0.915744 0.004386 0.000000
0.919329 0.004386 0.000000
0.923812 0.004386 0.000000
0.927407 0.004386 0.000000
0.931685 0.004386 0.000000
0.935435 0.004386 0.000000
0.939954 0.004386 0.000000
0.943580 0.004386 0.000000
0.947946 0.004386 0.000000
0.951638 0.004386 0.000000
0.955563 0.004386 0.000000
0.959687 0.004386 0.000000
0.963322 0.004386 0.000000
0.967770 0.004386 0.000000
0.971300 0.004386 0.000000
0.975397 0.004386 0.000000
0.979405 0.004386 0.000000
0.983876 0.004386 0.000000
0.987467 0.004386 0.000000
0.991624 0.004386 0.000000
0.995451 0.004386 0.000000
1.000018 0.004386 0.000000
1.003698 0.004386 0.000000
1.007272 0.004386 0.000000
1.011748 0.004386 0.000000
1.015390 0.004386 0.000000
1.019852 0.004386 0.000000
1.023365 0.004386 0.000000
1.027852 0.004386 0.000000
1.031505 0.004386 0.000000
1.035278 0.004386 0.000000
1.039498 0.004386 0.000000
1.043979 0.004386 0.000000
1.047600 0.004386 0.000000
1.060151 0.004386 0.000000
1.060179 0.004386 0.000000
1.067652 0.004386 0.000000
1.069394 0.004386 0.000000
1.072705 0.004386 0.000000
1.076253 0.004386 0.000000
1.089344 0.004386 0.000000
1.089371 0.004386 0.000000
1.094465 0.004386 0.000000
1.099057 0.004386 0.000000
1.102732 0.004386 0.000000
1.106947 0.004386 0.000000
1.110471 0.004386 0.000000
1.113919 0.004386 0.000000
1.117480 0.004386 0.000000
1.122636 0.021930 0.100000
1.125772 0.021930 0.100000
1.130194 0.021930 0.100000
1.133642 0.021930 0.100000
1.139526 0.021930 0.100000
1.143006 0.021930 0.100000
1.146684 0.021930 0.100000
1.150192 0.021930 0.100000
1.154293 0.021930 0.100000
1.157835 0.021930 0.100000
1.163033 0.021930 0.100000
1.166104 0.021930 0.100000
1.170188 0.065789 0.060000
1.174610 0.065789 0.060000
1.177571 0.065789 0.060000
1.182526 0.065789 0.060000
1.185943 0.065789 0.060000
1.189557 0.065789 0.060000
1.193851 0.065789 0.060000
1.198743 0.065789 0.060000
1.202127 0.065789 0.060000
1.205796 0.065789 0.060000
1.209584 0.065789 0.060000
1.213645 0.065789 0.060000
1.217703 0.100877 0.030000
1.223164 0.114035 0.120000
1.226155 0.114035 0.120000
1.229789 0.114035 0.120000
1.234298 0.114035 0.120000
1.237520 0.114035 0.120000
1.242448 0.114035 0.120000
1.246201 0.114035 0.120000
1.249454 0.114035 0.120000
1.253616 0.114035 0.120000
1.257979 0.114035 0.120000
1.262369 0.114035 0.120000
1.265698 0.114035 0.120000
1.270147 0.153509 0.090000
1.273535 0.153509 0.090000
1.277894 0.153509 0.090000
1.281919 0.153509 0.090000
1.285743 0.153509 0.090000
1.289523 0.153509 0.090000
1.293599 0.153509 0.090000
1.297953 0.153509 0.090000
1.302687 0.153509 0.090000
1.305681 0.153509 0.090000
1.309954 0.153509 0.090000
1.313659 0.201754 0.150000
1.317451 0.201754 0.150000
1.321874 0.201754 0.150000
1.325888 0.201754 0.150000
1.329799 0.201754 0.150000
1.333727 0.201754 0.150000
1.338587 0.201754 0.150000
1.341935 0.201754 0.150000
1.345943 0.201754 0.150000
1.350473 0.201754 0.150000
1.353905 0.201754 0.150000
1.358614 0.201754 0.150000
1.362000 0.250000 0.100000
1.366011 0.250000 0.100000
1.369489 0.250000 0.100000
1.373960 0.250000 0.100000
1.378557 0.250000 0.100000
1.382130 0.250000 0.100000
1.386075 0.250000 0.100000
1.394199 0.250000 0.100000
1.394221 0.250000 0.100000
1.397513 0.250000 0.100000
1.402114 0.250000 0.100000
1.406136 0.250000 0.100000
1.409672 0.298246 0.040000
1.413927 0.298246 0.040000
1.417488 0.298246 0.040000
1.422230 0.298246 0.040000
1.426195 0.298246 0.040000
1.429698 0.298246 0.040000
1.433882 0.298246 0.040000
1.437655 0.298246 0.040000
1.441967 0.298246 0.040000
1.445853 0.298246 0.040000
1.449853 0.298246 0.040000
1.453538 0.333333 0.050000
1.457614 0.333333 0.050000
1.462374 0.333333 0.050000
1.466024 0.333333 0.050000
1.469817 0.333333 0.050000
1.473988 0.333333 0.050000
1.477806 0.333333 0.050000
1.483015 0.333333 0.050000
1.486538 0.333333 0.050000
1.489915 0.333333 0.050000
1.493464 0.333333 0.050000
1.497638 0.368421 0.040000
1.502600 0.368421 0.040000
1.505593 0.368421 0.040000
1.509973 0.368421 0.040000
1.513444 0.368421 0.040000
1.517917 0.368421 0.040000
1.521867 0.368421 0.040000
1.525653 0.368421 0.040000
1.530020 0.368421 0.040000
1.533514 0.368421 0.040000
1.537740 0.368421 0.040000
1.542580 0.416667 0.110000
1.545725 0.416667 0.110000
1.550458 0.416667 0.110000
1.553574 0.416667 0.110000
1.558012 0.416667 0.110000
1.562662 0.416667 0.110000
1.565784 0.416667 0.110000
1.570135 0.416667 0.110000
1.573857 0.416667 0.110000
1.578109 0.416667 0.110000
1.581854 0.416667 0.110000
1.594407 0.416667 0.110000
1.594472 0.451754 0.050000
1.600595 0.451754 0.050000
1.605741 0.451754 0.050000
1.609211 0.451754 0.050000
1.610818 0.451754 0.050000
1.614671 0.451754 0.050000
1.627758 0.451754 0.050000
1.627786 0.451754 0.050000
1.632528 0.451754 0.050000
1.638555 0.500000 0.130000
1.640913 0.500000 0.130000
1.644307 0.500000 0.130000
1.649537 0.500000 0.130000
1.652541 0.500000 0.130000
1.656682 0.500000 0.130000
1.660031 0.500000 0.130000
1.664291 0.500000 0.130000
1.667946 0.500000 0.130000
1.672719 0.500000 0.130000
1.676590 0.548246 0.160000
1.680998 0.548246 0.160000
1.684500 0.548246 0.160000
1.687911 0.548246 0.160000
1.692662 0.548246 0.160000
1.698758 0.548246 0.160000
1.700138 0.548246 0.160000
1.707334 0.548246 0.160000
1.708091 0.548246 0.160000
1.712712 0.548246 0.160000
1.717790 0.548246 0.160000
1.720195 0.548246 0.160000
1.724600 0.583333 0.060000
1.728048 0.583333 0.060000
1.732452 0.583333 0.060000
1.735909 0.583333 0.060000
1.740336 0.583333 0.060000
1.743978 0.583333 0.060000
1.748567 0.583333 0.060000
1.752470 0.583333 0.060000
1.755959 0.583333 0.060000
1.760373 0.583333 0.060000
1.763831 0.583333 0.060000
1.768502 0.609649 0.180000
1.772533 0.609649 0.180000
1.776041 0.609649 0.180000
1.784003 0.609649 0.180000
1.784250 0.609649 0.180000
1.788555 0.609649 0.180000
1.792633 0.618421 0.220000
1.807089 0.618421 0.220000
1.807115 0.618421 0.220000
1.813670 0.618421 0.220000
1.816412 0.618421 0.220000
1.819708 0.618421 0.220000
1.824203 0.618421 0.220000
1.828755 0.618421 0.220000
1.834219 0.618421 0.220000
1.836020 0.631579 0.260000
1.839594 0.631579 0.260000
1.843220 0.631579 0.260000
1.847558 0.631579 0.260000
1.852456 0.631579 0.260000
1.855715 0.631579 0.260000
1.859776 0.631579 0.260000
1.863556 0.631579 0.260000
1.867622 0.631579 0.260000
1.872507 0.631579 0.260000
1.876113 0.653509 0.340000
1.879870 0.653509 0.340000
1.883412 0.653509 0.340000
1.887696 0.653509 0.340000
1.892443 0.653509 0.340000
1.895544 0.653509 0.340000
1.899907 0.653509 0.340000
1.903563 0.653509 0.340000
1.907712 0.653509 0.340000
1.911245 0.653509 0.340000
1.916516 0.653509 0.340000
1.919342 0.653509 0.340000
1.923461 0.653509 0.340000
1.927811 0.666667 0.390000
1.931329 0.666667 0.390000
1.935744 0.666667 0.390000
1.939182 0.666667 0.390000
1.943524 0.666667 0.390000
1.947775 0.666667 0.390000
1.951425 0.666667 0.390000
1.955751 0.666667 0.390000
1.959433 0.666667 0.390000
1.963653 0.666667 0.390000
1.967948 0.666667 0.390000
1.971796 0.688596 0.460000
1.975806 0.688596 0.460000
1.979349 0.688596 0.460000
1.983809 0.688596 0.460000
1.988018 0.688596 0.460000
1.994872 0.688596 0.460000
1.996437 0.688596 0.460000
1.999744 0.688596 0.460000
2.003723 0.688596 0.460000
2.007209 0.688596 0.460000
2.012192 0.688596 0.460000
2.016166 0.688596 0.460000
2.019419 0.688596 0.460000
2.023824 0.688596 0.460000
2.027298 0.688596 0.460000
2.032515 0.688596 0.460000
2.036037 0.688596 0.460000
2.039314 0.688596 0.460000
2.043850 0.688596 0.460000
2.047335 0.688596 0.460000
2.052532 0.688596 0.460000
2.055963 0.688596 0.460000
2.059439 0.688596 0.460000
2.063919 0.710526 0.530000
2.067432 0.710526 0.530000
2.072362 0.710526 0.530000
2.075584 0.710526 0.530000
2.079743 0.710526 0.530000
2.083875 0.710526 0.530000
2.087349 0.710526 0.530000
2.092435 0.710526 0.530000
2.095448 0.710526 0.530000
2.099683 0.710526 0.530000
2.103212 0.710526 0.530000
2.107531 0.710526 0.530000
2.112504 0.750000 0.820000
2.115553 0.754386 0.730000
2.119796 0.754386 0.730000
2.123231 0.754386 0.730000
2.127599 0.754386 0.730000
2.132033 0.754386 0.730000
2.136485 0.754386 0.730000
2.139451 0.754386 0.730000
2.143309 0.754386 0.730000
2.147671 0.754386 0.730000
2.152044 0.754386 0.730000
2.156203 0.754386 0.730000
2.159454 0.754386 0.730000
2.163374 0.771930 0.790000
2.167732 0.771930 0.790000
2.171218 0.771930 0.790000
2.176241 0.771930 0.790000
2.180192 0.771930 0.790000
2.183498 0.771930 0.790000
2.187794 0.771930 0.790000
2.191281 0.771930 0.790000
2.195649 0.771930 0.790000
2.199170 0.771930 0.790000
2.203580 0.771930 0.790000
2.207855 0.785088 0.780000
2.211342 0.785088 0.780000
2.215802 0.785088 0.780000
2.219194 0.785088 0.780000
2.223724 0.785088 0.780000
2.228168 0.785088 0.780000
2.231941 0.785088 0.780000
2.235798 0.785088 0.780000
2.239266 0.785088 0.780000
2.243711 0.785088 0.780000
2.247521 0.785088 0.780000
2.251847 0.802632 0.860000
2.255852 0.802632 0.860000
2.259434 0.802632 0.860000
2.263784 0.802632 0.860000
2.267650 0.802632 0.860000
2.271936 0.802632 0.860000
2.276221 0.802632 0.860000
2.279396 0.802632 0.860000
2.284071 0.802632 0.860000
2.288917 0.802632 0.860000
2.291897 0.802632 0.860000
2.295586 0.802632 0.860000
2.299580 0.802632 0.860000
2.303893 0.820175 0.940000
2.307564 0.824561 0.970000
2.311342 0.824561 0.970000
2.315907 0.824561 0.970000
2.319542 0.824561 0.970000
2.323895 0.824561 0.970000
2.327380 0.824561 0.970000
2.332493 0.824561 0.970000
2.336225 0.824561 0.970000
2.339361 0.824561 0.970000
2.343960 0.824561 0.970000
2.347439 0.833333 1.000000
2.352834 0.833333 1.000000
2.356186 0.833333 1.000000
2.359586 0.833333 1.000000
2.364059 0.833333 1.000000
2.367516 0.833333 1.000000
2.372915 0.833333 1.000000
2.376294 0.833333 1.000000
2.379720 0.833333 1.000000
2.383205 0.833333 1.000000
2.387600 0.833333 1.000000
2.392951 0.833333 1.000000
2.396717 0.842105 0.980000
2.399846 0.842105 0.980000
2.403270 0.842105 0.980000
2.407642 0.842105 0.980000
2.412318 0.842105 0.980000
2.416083 0.842105 0.980000
2.420392 0.842105 0.980000
2.423273 0.842105 0.980000
2.427716 0.842105 0.980000
2.431240 0.842105 0.980000
2.435797 0.842105 0.980000
2.439636 0.850877 1.000000
2.443414 0.850877 1.000000
2.447308 0.850877 1.000000
2.451263 0.850877 1.000000
2.456225 0.850877 1.000000
2.459197 0.850877 1.000000
2.464095 0.850877 1.000000
2.467561 0.850877 1.000000
2.471397 0.850877 1.000000
2.475649 0.850877 1.000000
2.479616 0.850877 1.000000
2.483543 0.850877 0.990000
2.487890 0.850877 0.990000
2.491392 0.850877 0.990000
2.496033 0.850877 0.990000
2.499527 0.850877 0.990000
2.503604 0.850877 0.990000
2.508054 0.850877 0.990000
2.511769 0.850877 0.990000
2.515805 0.850877 0.990000
2.519321 0.850877 0.990000
2.523663 0.850877 0.990000

