// New Client: 100.66.66.2
// object=T3240
// time position forceZ torqueZ
0 0.199969 0.13553 0.00708
0.048 0.200026 0.175018 0.007343
0.098 0.200015 0.28584 0.002632
0.148 0.199921 -0.09438 -0.005891
0.198 0.19967 0.114894 0.012626
0.248 0.199176 0.308355 -0.002928
0.298 0.198663 0.346115 0.003027
0.348 0.198101 0.341063 0.007297
0.398 0.197629 0.069587 0.002042
0.448 0.196936 0.131756 -0.00877
0.498 0.196114 0.201877 0.010678
0.548 0.195283 0.108454 0.006146
0.598 0.194344 0.311268 0.011264
0.648 0.19341 0.259881 0.009309
0.698 0.192464 0.380982 0.00255
0.748 0.191319 0.26532 -0.000775
0.798 0.190067 0.281708 0.012084
0.848 0.188679 0.674498 0.013546
0.898 0.187328 0.300981 0.01887
0.948 0.185938 0.168322 0.018701
0.998 0.18437 0.273819 0.017587
1.048 0.182771 0.644707 0.018133
1.098 0.181157 0.193432 0.02957
1.148 0.179275 0.394491 0.023486
1.198 0.177464 0.209364 0.035874
1.248 0.175605 0.049464 0.108593
1.298 0.173587 0.590012 0.103521
1.348 0.171676 0.105207 0.095723
1.398 0.169481 0.545969 0.095854
1.448 0.167462 0.213894 0.088135
1.498 0.165679 0.239618 0.096517
1.548 0.163507 0.150608 0.090829
1.598 0.161394 0.47034 0.083988
1.648 0.159458 0.0529 0.088554
1.698 0.157422 0.41053 0.083624
1.748 0.155507 0.093576 0.074642
1.798 0.153389 0.351833 0.080501
1.848 0.151333 0.209184 0.081702
1.898 0.149355 0.354226 0.081653
1.948 0.147258 0.36873 0.081742
1.998 0.145315 0.034281 0.079704
2.048 0.143291 0.257316 0.089395
2.098 0.141278 0.254393 0.092755
2.148 0.13934 -0.116786 0.101288
2.198 0.137177 0.258388 0.13171
2.248 0.135151 0.346178 0.157604
2.298 0.133272 0.355316 0.160334
2.348 0.13114 0.470275 0.148175
2.398 0.129058 0.507172 0.152381
2.448 0.127237 0.212776 0.144852
2.498 0.125173 0.290096 0.150688
2.548 0.123012 0.116414 0.143491
2.598 0.121106 0.484823 0.143402
2.648 0.119154 0.386654 0.149681
2.698 0.116965 0.238377 0.135608
2.748 0.114966 0.131123 0.143185
2.798 0.112971 0.203405 0.13322
2.848 0.110891 0.160342 0.141555
2.898 0.108957 0.356348 0.14561
2.948 0.106806 0.426231 0.15194
2.998 0.104932 0.095288 0.168965
3.048 0.102876 0.467871 0.170766
3.098 0.100767 0.428758 0.189346
3.148 0.098803 0.13812 0.218917
3.198 0.096786 0.37245 0.200597
3.248 0.094757 0.328816 0.202429
3.298 0.092795 -0.196797 0.19609
3.348 0.091301 -24.522139 0.158035
3.398 0.089928 -46.685678 0.145405
3.448 0.088057 -58.028901 0.168498
3.498 0.085435 -61.158093 0.184262
3.548 0.082904 -62.962327 0.194295
3.598 0.0807 -64.131267 0.1615
3.648 0.078828 -66.890584 0.142798
3.698 0.076854 -69.839334 0.123579
3.748 0.074778 -72.287978 0.087965
3.798 0.072776 -74.38734 0.068708
3.848 0.07085 -77.064473 0.042294
3.898 0.069095 -79.113298 0.023345
3.948 0.06746 -81.989902 0.016287
3.998 0.065941 -84.918186 -0.013811
4.048 0.064581 -88.067988 -0.016685
4.098 0.063881 -88.441195 -0.00879
4.148 0.063556 -88.137799 0.012549
4.198 0.063283 -88.132737 0.030736
4.248 0.0631 -88.100624 0.060805
4.298 0.062959 -88.037565 0.134216
4.348 0.062804 -88.19782 0.131587
4.398 0.062542 -89.62903 0.125887
4.448 0.062362 -90.492271 0.127074
// Client closed conection.
