Time Position Current 
1582213706090689440 0.008734 0.000000
1582213706098764454 0.008734 0.000000
1582213706109024590 0.008734 0.000000
1582213706122793834 0.008734 0.000000
1582213706129304962 0.008734 0.000000
1582213706139322551 0.008734 0.000000
1582213706151890164 0.008734 0.000000
1582213706158606628 0.008734 0.000000
1582213706168509765 0.008734 0.000000
1582213706214199238 0.008734 0.000000
1582213706214393305 0.008734 0.000000
1582213706214465393 0.008734 0.000000
1582213706214512613 0.008734 0.000000
1582213706254199281 0.008734 0.000000
1582213706254277288 0.008734 0.000000
1582213706254448446 0.008734 0.000000
1582213706254485737 0.008734 0.000000
1582213706298203267 0.008734 0.000000
1582213706298245018 0.008734 0.000000
1582213706298275728 0.008734 0.000000
1582213706298745966 0.008734 0.000000
1582213706342084021 0.008734 0.000000
1582213706342146348 0.008734 0.000000
1582213706342198712 0.008734 0.000000
1582213706342232669 0.008734 0.000000
1582213706342281358 0.008734 0.000000
1582213706386188425 0.008734 0.000000
1582213706386234218 0.008734 0.000000
1582213706386269259 0.008734 0.000000
1582213706386309860 0.008734 0.000000
1582213706389630131 0.008734 0.000000
1582213706400175959 0.008734 0.000000
1582213706442057326 0.008734 0.000000
1582213706442136636 0.008734 0.000000
1582213706442228086 0.008734 0.000000
1582213706442277012 0.008734 0.000000
1582213706486188006 0.008734 0.000000
1582213706486230209 0.008734 0.000000
1582213706486265785 0.008734 0.000000
1582213706486296586 0.008734 0.000000
1582213706530069549 0.008734 0.000000
1582213706530132052 0.008734 0.000000
1582213706530199918 0.008734 0.000000
1582213706530234528 0.008734 0.000000
1582213706530264173 0.008734 0.000000
1582213706573962542 0.008734 0.000000
1582213706574047465 0.008734 0.000000
1582213706574143926 0.008734 0.000000
1582213706574197715 0.008734 0.000000
1582213706579747921 0.008734 0.000000
1582213706592205929 0.008734 0.000000
1582213706633880064 0.008734 0.000000
1582213706633941102 0.008734 0.000000
1582213706633993180 0.008734 0.000000
1582213706634043036 0.008734 0.000000
1582213706677916414 0.008734 0.000000
1582213706677976279 0.008734 0.000000
1582213706678028704 0.008734 0.000000
1582213706678080607 0.008734 0.000000
1582213706721858113 0.008734 0.000000
1582213706721920545 0.008734 0.000000
1582213706721990039 0.008734 0.000000
1582213706722024517 0.008734 0.000000
1582213706722055358 0.008734 0.000000
1582213706766104261 0.008734 0.000000
1582213706766213015 0.008734 0.000000
1582213706766264012 0.008734 0.000000
1582213706766320553 0.008734 0.000000
1582213706769550431 0.008734 0.000000
1582213706780430754 0.008734 0.000000
1582213706821904847 0.008734 0.000000
1582213706821975644 0.008734 0.000000
1582213706822082065 0.008734 0.000000
1582213706822148270 0.008734 0.000000
1582213706865970999 0.008734 0.000000
1582213706866052628 0.008734 0.000000
1582213706866314428 0.008734 0.000000
1582213706866395423 0.008734 0.000000
1582213706909727734 0.008734 0.000000
1582213706909795814 0.008734 0.000000
1582213706909863848 0.008734 0.000000
1582213706911794401 0.008734 0.000000
1582213706915766386 0.008734 0.000000
1582213706957822870 0.008734 0.000000
1582213706957918554 0.008734 0.000000
1582213706957984954 0.008734 0.000000
1582213706958033727 0.008734 0.000000
1582213707001762308 0.008734 0.000000
1582213707001834267 0.008734 0.000000
1582213707001901123 0.008734 0.140000
1582213707001967605 0.008734 0.160000
1582213707048131348 0.017467 0.180000
1582213707048258848 0.026201 0.120000
1582213707048425757 0.026201 0.120000
1582213707048550628 0.034935 0.120000
1582213707048643662 0.043668 0.080000
1582213707089727427 0.056769 0.150000
1582213707089910792 0.056769 0.150000
1582213707090028740 0.069869 0.170000
1582213707090164585 0.082969 0.160000
1582213707090302068 0.091703 0.040000
1582213707133853960 0.109170 0.120000
1582213707134115919 0.109170 0.120000
1582213707134321730 0.117904 0.000000
1582213707134544849 0.131004 0.080000
1582213707138788061 0.144105 0.010000
1582213707149292758 0.157205 0.030000
1582213707189643362 0.157205 0.030000
1582213707189787334 0.170306 0.060000
1582213707189904602 0.183406 0.010000
1582213707190019809 0.196507 0.100000
1582213707233735394 0.209607 0.070000
1582213707233878725 0.209607 0.070000
1582213707233995632 0.218341 0.110000
1582213707234131098 0.231441 0.110000
1582213707278386907 0.244542 0.140000
1582213707278584863 0.257642 0.010000
1582213707278726764 0.257642 0.010000
1582213707278860690 0.266376 0.010000
1582213707279013497 0.266376 0.010000
1582213707321522977 0.288210 0.120000
1582213707321664666 0.301310 0.000000
1582213707321781211 0.314411 0.040000
1582213707321917662 0.314411 0.040000
1582213707329102701 0.327511 0.070000
1582213707339034933 0.336245 0.030000
1582213707381618775 0.336245 0.030000
1582213707381762408 0.349345 0.010000
1582213707381878611 0.358079 0.110000
1582213707382014182 0.375546 0.120000
1582213707425736468 0.384279 0.130000
1582213707425854502 0.384279 0.130000
1582213707425981107 0.406114 0.090000
1582213707426106705 0.406114 0.090000
1582213707470629306 0.414847 0.090000
1582213707471699181 0.419214 0.130000
1582213707471865209 0.423581 0.160000
1582213707472017458 0.423581 0.160000
1582213707472178704 0.427948 0.180000
1582213707514534052 0.432314 0.220000
1582213707514690679 0.436681 0.240000
1582213707514789245 0.436681 0.240000
1582213707514880781 0.441048 0.270000
1582213707584112245 0.462882 0.390000
1582213707587485989 0.467249 0.460000
1582213707633709016 0.471616 0.420000
1582213707633863223 0.471616 0.420000
1582213707633991002 0.475983 0.570000
1582213707634174599 0.480349 0.460000
1582213707677594495 0.489083 0.470000
1582213707677708415 0.489083 0.500000
1582213707677832584 0.489083 0.500000
1582213707677980323 0.497817 0.510000
1582213707722167115 0.502183 0.540000
1582213707722322391 0.506550 0.570000
1582213707722449844 0.506550 0.570000
1582213707722598953 0.510917 0.650000
1582213707775372261 0.541485 0.680000
1582213707778693080 0.541485 0.680000
1582213707821581584 0.545852 0.680000
1582213707821738276 0.545852 0.680000
1582213707821886151 0.550218 0.710000
1582213707870100402 0.558952 0.740000
1582213707870253874 0.558952 0.740000
1582213707870382296 0.563319 0.790000
1582213707870528424 0.567686 0.790000
1582213707870673937 0.567686 0.790000
1582213707870803946 0.572052 0.820000
1582213707914522211 0.576419 0.830000
1582213707914679899 0.580786 0.840000
1582213707914851694 0.580786 0.840000
1582213707915003523 0.585153 0.850000
1582213707918733532 0.593886 0.890000
1582213707966045552 0.606987 0.970000
1582213708009998531 0.606987 0.970000
1582213708010229447 0.611354 0.990000
1582213708010458230 0.615721 1.000000
1582213708010811108 0.620087 1.000000
1582213708011020717 0.620087 1.000000
1582213708054254773 0.624454 1.000000
1582213708054360206 0.628821 1.000000
1582213708054453273 0.633188 1.000000
1582213708054544311 0.633188 1.000000
1582213708059752125 0.637555 1.000000
1582213708070599971 0.637555 1.000000
1582213708113666624 0.641921 1.000000
1582213708113893668 0.646288 1.000000
1582213708114116333 0.646288 1.000000
1582213708114402475 0.646288 1.000000
1582213708157951468 0.650655 1.000000
1582213708158108098 0.650655 0.990000
1582213708158255648 0.650655 0.990000
1582213708158402375 0.650655 0.990000
1582213708202155086 0.650655 1.000000
1582213708202377119 0.650655 1.000000
1582213708202599560 0.650655 0.050000
1582213708202816117 0.650655 0.050000
1582213708203045581 0.650655 0.050000
1582213708246519998 0.650655 0.040000
1582213708246682750 0.650655 0.040000
1582213708246792804 0.650655 0.040000
1582213708246918459 0.650655 0.040000
1582213708249728624 0.650655 0.040000
1582213708260625027 0.650655 0.050000
1582213708301825596 0.650655 0.040000
1582213708301994279 0.650655 0.050000
1582213708302127906 0.650655 0.050000
1582213708302258382 0.650655 0.050000
1582213708346580136 0.650655 0.050000
1582213708346888823 0.650655 0.050000
1582213708347160674 0.650655 0.050000
1582213708347416545 0.650655 0.040000
1582213708394093472 0.650655 0.040000
1582213708394249985 0.650655 0.040000
1582213708394385338 0.650655 0.050000
1582213708394513123 0.650655 0.050000
1582213708394661949 0.650655 0.050000
1582213708438356261 0.650655 0.050000
1582213708438515098 0.650655 0.050000
1582213708438666681 0.650655 0.040000
1582213708438888660 0.650655 0.040000
1582213708440270899 0.650655 0.040000
1582213708450427755 0.650655 0.040000
1582213708494179462 0.650655 0.050000
1582213708494405254 0.650655 0.050000
1582213708494637525 0.650655 0.050000
1582213708494859962 0.650655 0.040000
1582213708538518474 0.650655 0.040000
1582213708538675001 0.650655 0.040000
1582213708538804163 0.650655 0.040000
1582213708538930964 0.650655 0.050000
1582213708582604214 0.650655 0.050000
1582213708582827702 0.650655 0.050000
1582213708583045837 0.650655 0.050000
1582213708583267779 0.650655 0.040000
1582213708583505136 0.650655 0.050000
1582213708625636941 0.650655 0.050000
1582213708625792579 0.650655 0.040000
1582213708625920264 0.650655 0.050000
1582213708626060862 0.650655 0.050000
1582213708630214501 0.650655 0.050000
1582213708641662907 0.650655 0.040000
1582213708681541942 0.650655 0.040000
1582213708681634297 0.650655 0.040000
1582213708681751989 0.650655 0.040000
1582213708681817176 0.650655 0.040000
1582213708725763877 0.650655 0.040000
1582213708725859921 0.650655 0.050000
1582213708725943567 0.650655 0.050000
1582213708726009208 0.650655 0.040000
1582213708769512689 0.650655 0.040000
1582213708769585085 0.650655 0.040000
1582213708769648395 0.650655 0.040000
1582213708769738092 0.650655 0.050000
1582213708814474252 0.650655 0.050000
1582213708814584001 0.650655 0.050000
1582213708814715910 0.650655 0.050000
1582213708814783184 0.650655 0.040000
1582213708814843640 0.650655 0.040000
1582213708861461656 0.650655 0.040000
1582213708861575535 0.650655 0.040000
1582213708861642531 0.650655 0.040000
1582213708861702568 0.650655 0.050000
1582213708861814221 0.650655 0.050000
1582213708906385723 0.650655 0.050000
1582213708906497672 0.650655 0.050000
1582213708906564100 0.650655 0.040000
1582213708906624745 0.650655 0.040000
1582213708909630412 0.650655 0.040000
1582213708920816652 0.650655 0.050000
1582213708965843445 0.650655 0.050000
1582213708966006227 0.650655 0.050000
1582213709009873622 0.650655 0.050000
1582213709009973656 0.650655 0.050000
1582213709010062745 0.650655 0.040000
1582213709054383151 0.650655 0.040000
1582213709054573502 0.650655 0.040000
1582213709054641296 0.650655 0.040000
1582213709054723948 0.650655 0.050000
1582213709097607791 0.650655 0.050000
1582213709097772330 0.650655 0.050000
1582213709097878167 0.650655 0.050000
1582213709098240894 0.650655 0.040000
1582213709098441252 0.650655 0.040000
1582213709141830991 0.650655 0.040000
1582213709141941642 0.650655 0.040000
1582213709142008510 0.650655 0.040000
1582213709142069294 0.650655 0.050000
1582213709146249615 0.650655 0.050000
1582213709156679720 0.650655 0.050000
1582213709197749363 0.650655 0.050000
1582213709197845039 0.650655 0.040000
1582213709197928372 0.650655 0.040000
1582213709197997437 0.650655 0.050000
1582213709241928866 0.650655 0.050000
1582213709242040434 0.650655 0.050000
1582213709242106806 0.650655 0.050000
1582213709242167417 0.650655 0.040000
1582213709290105333 0.650655 0.040000
1582213709290235554 0.650655 0.040000
1582213709290312415 0.650655 0.040000
1582213709290378313 0.650655 0.040000
1582213709290461425 0.650655 0.050000
1582213709333650907 0.650655 0.040000
1582213709333730685 0.650655 0.040000
1582213709333802515 0.650655 0.040000
1582213709333856100 0.650655 0.040000
1582213709335792232 0.650655 0.040000
1582213709347929106 0.650655 0.050000
1582213709389409166 0.650655 0.050000
1582213709389469657 0.650655 0.050000
1582213709389537101 0.650655 0.040000
1582213709389589390 0.650655 0.030000
1582213709433742431 0.650655 0.050000
1582213709433804984 0.650655 0.050000
1582213709433860438 0.650655 0.050000
1582213709433911055 0.650655 0.050000
1582213709477980532 0.650655 0.050000
1582213709478045020 0.650655 0.040000
1582213709478099087 0.650655 0.040000
1582213709478169982 0.650655 0.050000
1582213709478224047 0.650655 0.050000
1582213709522412762 0.650655 0.040000
1582213709522526824 0.650655 0.040000
1582213709522586427 0.650655 0.040000
1582213709522658772 0.650655 0.040000
1582213709525826381 0.650655 0.040000
1582213709536523303 0.650655 0.050000
1582213709578166502 0.650655 0.050000
1582213709578253217 0.650655 0.050000
1582213709578325266 0.650655 0.040000
1582213709578401297 0.650655 0.040000
1582213709622069381 0.650655 0.040000
1582213709622130092 0.650655 0.040000
1582213709622182470 0.650655 0.040000
1582213709622233516 0.650655 0.050000
1582213709666235490 0.650655 0.040000
1582213709666276725 0.650655 0.040000
1582213709666306930 0.650655 0.030000
1582213709666336470 0.650655 0.030000
1582213709709972515 0.650655 0.040000
1582213709710033330 0.650655 0.050000
1582213709710086021 0.650655 0.060000
1582213709710136187 0.650655 0.040000
1582213709710187309 0.650655 0.040000
