// Time Position Current 
0.011347 0.000000 0.000000
0.015790 0.000000 0.000000
0.020065 0.000000 0.000000
0.023804 0.000000 0.000000
0.027778 0.000000 0.000000
0.031680 0.000000 0.000000
0.036198 0.000000 0.000000
0.040290 0.000000 0.000000
0.043608 0.000000 0.000000
0.048206 0.000000 0.000000
0.051876 0.000000 0.000000
0.055525 0.000000 0.000000
0.060292 0.000000 0.000000
0.063574 0.000000 0.000000
0.068218 0.000000 0.000000
0.071705 0.000000 0.000000
0.075390 0.000000 0.000000
0.079562 0.000000 0.000000
0.083785 0.000000 0.000000
0.088127 0.000000 0.000000
0.091510 0.000000 0.000000
0.095471 0.000000 0.000000
0.100419 0.000000 0.000000
0.103979 0.000000 0.000000
0.107680 0.000000 0.000000
0.111647 0.000000 0.000000
0.115943 0.000000 0.000000
0.119964 0.000000 0.000000
0.123727 0.000000 0.000000
0.127621 0.000000 0.000000
0.132278 0.000000 0.000000
0.135892 0.000000 0.000000
0.140079 0.000000 0.000000
0.143626 0.000000 0.000000
0.147551 0.000000 0.000000
0.152239 0.000000 0.000000
0.156355 0.000000 0.000000
0.160936 0.000000 0.000000
0.163627 0.000000 0.000000
0.167467 0.000000 0.000000
0.172079 0.000000 0.000000
0.175992 0.000000 0.000000
0.180256 0.000000 0.000000
0.183829 0.000000 0.000000
0.187859 0.000000 0.000000
0.192230 0.000000 0.000000
0.195559 0.004386 0.000000
0.199643 0.004386 0.000000
0.203979 0.004386 0.000000
0.207624 0.004386 0.000000
0.211868 0.004386 0.000000
0.215537 0.004386 0.000000
0.220306 0.004386 0.000000
0.223683 0.004386 0.000000
0.227489 0.004386 0.000000
0.232529 0.004386 0.000000
0.235575 0.004386 0.000000
0.239451 0.004386 0.000000
0.243509 0.004386 0.000000
0.247463 0.004386 0.000000
0.251546 0.004386 0.000000
0.255438 0.004386 0.000000
0.259800 0.004386 0.000000
0.263766 0.004386 0.000000
0.267447 0.004386 0.000000
0.271796 0.004386 0.000000
0.275708 0.004386 0.000000
0.279874 0.004386 0.000000
0.283427 0.004386 0.000000
0.287424 0.004386 0.000000
0.291773 0.004386 0.000000
0.295695 0.004386 0.000000
0.299712 0.004386 0.000000
0.303437 0.004386 0.000000
0.307590 0.004386 0.000000
0.312236 0.004386 0.000000
0.315996 0.004386 0.000000
0.319512 0.004386 0.000000
0.323503 0.004386 0.000000
0.327420 0.004386 0.000000
0.331714 0.004386 0.000000
0.336118 0.004386 0.000000
0.340131 0.004386 0.000000
0.343740 0.004386 0.000000
0.347434 0.004386 0.000000
0.351822 0.004386 0.000000
0.355786 0.004386 0.000000
0.359453 0.004386 0.000000
0.363716 0.004386 0.000000
0.367707 0.004386 0.000000
0.371807 0.004386 0.000000
0.375724 0.004386 0.000000
0.379716 0.004386 0.000000
0.383480 0.004386 0.000000
0.387987 0.004386 0.000000
0.391947 0.004386 0.000000
0.395904 0.004386 0.000000
0.399940 0.004386 0.000000
0.403428 0.004386 0.000000
0.408389 0.004386 0.000000
0.412238 0.004386 0.000000
0.416434 0.004386 0.000000
0.420038 0.004386 0.000000
0.423460 0.004386 0.000000
0.427414 0.004386 0.000000
0.431556 0.004386 0.000000
0.436177 0.004386 0.000000
0.440200 0.004386 0.000000
0.443460 0.004386 0.000000
0.447433 0.004386 0.000000
0.452161 0.004386 0.000000
0.456120 0.004386 0.000000
0.459481 0.004386 0.000000
0.463521 0.004386 0.000000
0.468231 0.004386 0.000000
0.472176 0.004386 0.000000
0.476154 0.004386 0.000000
0.479625 0.004386 0.000000
0.483415 0.004386 0.000000
0.488236 0.004386 0.000000
0.492259 0.004386 0.000000
0.496249 0.004386 0.000000
0.499693 0.004386 0.000000
0.503522 0.004386 0.000000
0.507844 0.004386 0.000000
0.511421 0.004386 0.000000
0.515856 0.004386 0.000000
0.520428 0.004386 0.000000
0.523408 0.004386 0.000000
0.527456 0.004386 0.000000
0.532092 0.004386 0.000000
0.536011 0.004386 0.000000
0.539601 0.004386 0.000000
0.543472 0.004386 0.000000
0.547463 0.004386 0.000000
0.551783 0.004386 0.000000
0.555768 0.004386 0.000000
0.559720 0.004386 0.000000
0.563530 0.004386 0.000000
0.567897 0.004386 0.000000
0.571875 0.004386 0.000000
0.575857 0.004386 0.000000
0.579730 0.004386 0.000000
0.583802 0.004386 0.000000
0.587799 0.004386 0.000000
0.591877 0.004386 0.000000
0.595878 0.004386 0.000000
0.599815 0.004386 0.000000
0.604169 0.004386 0.000000
0.608254 0.004386 0.000000
0.612273 0.004386 0.000000
0.616201 0.004386 0.000000
0.619595 0.004386 0.000000
0.623478 0.004386 0.000000
0.628241 0.004386 0.000000
0.632170 0.004386 0.000000
0.636182 0.004386 0.000000
0.639778 0.004386 0.000000
0.643421 0.004386 0.000000
0.647656 0.004386 0.000000
0.651727 0.004386 0.000000
0.655691 0.004386 0.000000
0.659545 0.004386 0.000000
0.663424 0.004386 0.000000
0.667513 0.004386 0.000000
0.671782 0.004386 0.000000
0.675727 0.004386 0.000000
0.679649 0.004386 0.000000
0.683426 0.004386 0.000000
0.687435 0.004386 0.000000
0.691600 0.004386 0.000000
0.695622 0.004386 0.000000
0.699646 0.004386 0.000000
0.703422 0.004386 0.000000
0.708043 0.004386 0.000000
0.712127 0.004386 0.000000
0.716127 0.004386 0.000000
0.719849 0.004386 0.000000
0.723419 0.004386 0.000000
0.727430 0.004386 0.000000
0.732003 0.004386 0.000000
0.735605 0.004386 0.000000
0.740045 0.004386 0.000000
0.744040 0.004386 0.000000
0.747848 0.004386 0.000000
0.752037 0.004386 0.000000
0.756034 0.004386 0.000000
0.759422 0.004386 0.000000
0.764454 0.004386 0.000000
0.767578 0.004386 0.000000
0.771395 0.004386 0.000000
0.776397 0.004386 0.000000
0.779795 0.004386 0.000000
0.783851 0.004386 0.000000
0.787441 0.004386 0.000000
0.791815 0.004386 0.000000
0.795838 0.004386 0.000000
0.799791 0.004386 0.000000
0.803876 0.004386 0.000000
0.807714 0.004386 0.000000
0.811440 0.004386 0.000000
0.815455 0.004386 0.000000
0.819843 0.004386 0.000000
0.823522 0.004386 0.000000
0.827592 0.004386 0.000000
0.831992 0.004386 0.000000
0.836404 0.004386 0.000000
0.839707 0.004386 0.000000
0.843435 0.004386 0.000000
0.848403 0.004386 0.000000
0.852402 0.004386 0.000000
0.856406 0.004386 0.000000
0.859407 0.004386 0.000000
0.863480 0.004386 0.000000
0.867718 0.004386 0.000000
0.872385 0.004386 0.000000
0.875539 0.004386 0.000000
0.879442 0.004386 0.000000
0.883451 0.004386 0.000000
0.887425 0.004386 0.000000
0.891447 0.004386 0.000000
0.895968 0.004386 0.000000
0.899873 0.004386 0.000000
0.903469 0.004386 0.000000
0.907755 0.004386 0.000000
0.911643 0.004386 0.000000
0.915710 0.004386 0.000000
0.919757 0.004386 0.000000
0.923451 0.004386 0.000000
0.927941 0.004386 0.000000
0.931869 0.004386 0.000000
0.935992 0.004386 0.000000
0.940098 0.004386 0.000000
0.943483 0.004386 0.000000
0.947875 0.004386 0.000000
0.951539 0.004386 0.000000
0.956006 0.004386 0.000000
0.959938 0.004386 0.000000
0.963758 0.004386 0.000000
0.967515 0.004386 0.000000
0.971874 0.004386 0.000000
0.975856 0.004386 0.000000
0.979846 0.004386 0.000000
0.983856 0.004386 0.000000
0.987528 0.004386 0.000000
0.991907 0.004386 0.000000
0.995905 0.004386 0.000000
0.999537 0.004386 0.000000
1.004223 0.004386 0.000000
1.007814 0.004386 0.000000
1.011470 0.004386 0.000000
1.015432 0.004386 0.000000
1.019926 0.004386 0.000000
1.023914 0.004386 0.000000
1.028054 0.004386 0.000000
1.031810 0.004386 0.000000
1.035806 0.004386 0.000000
1.039799 0.004386 0.000000
1.044143 0.004386 0.000000
1.047801 0.004386 0.000000
1.051863 0.004386 0.000000
1.055667 0.004386 0.000000
1.059798 0.004386 0.000000
1.063792 0.004386 0.000000
1.067806 0.004386 0.000000
1.071805 0.004386 0.000000
1.075789 0.004386 0.000000
1.079796 0.004386 0.150000
1.083792 0.004386 0.150000
1.087776 0.004386 0.150000
1.091773 0.004386 0.150000
1.095583 0.004386 0.150000
1.099680 0.004386 0.150000
1.103426 0.004386 0.150000
1.107782 0.004386 0.150000
1.111779 0.004386 0.150000
1.115707 0.004386 0.150000
1.119711 0.004386 0.150000
1.123519 0.043860 0.090000
1.127781 0.052632 0.150000
1.131774 0.052632 0.150000
1.135735 0.052632 0.150000
1.139703 0.052632 0.150000
1.143742 0.052632 0.150000
1.147854 0.052632 0.150000
1.151735 0.052632 0.150000
1.155736 0.052632 0.150000
1.159667 0.052632 0.150000
1.163731 0.052632 0.150000
1.167730 0.052632 0.150000
1.171726 0.092105 0.120000
1.175792 0.092105 0.120000
1.179586 0.092105 0.120000
1.183722 0.092105 0.120000
1.187715 0.092105 0.120000
1.191714 0.092105 0.120000
1.195697 0.092105 0.120000
1.199573 0.092105 0.120000
1.203715 0.092105 0.120000
1.207702 0.092105 0.120000
1.211701 0.092105 0.120000
1.215698 0.127193 0.050000
1.219698 0.127193 0.050000
1.223649 0.127193 0.050000
1.227411 0.127193 0.050000
1.231690 0.127193 0.050000
1.235693 0.127193 0.050000
1.239686 0.127193 0.050000
1.243680 0.127193 0.050000
1.247734 0.127193 0.050000
1.251751 0.127193 0.050000
1.255738 0.127193 0.050000
1.259753 0.179825 0.100000
1.263510 0.179825 0.100000
1.267667 0.179825 0.100000
1.271688 0.179825 0.100000
1.275733 0.179825 0.100000
1.279684 0.179825 0.100000
1.283442 0.179825 0.100000
1.287655 0.179825 0.100000
1.291653 0.179825 0.100000
1.295735 0.179825 0.100000
1.299680 0.179825 0.100000
1.303694 0.214912 0.040000
1.307643 0.214912 0.040000
1.311640 0.214912 0.040000
1.315636 0.214912 0.040000
1.319658 0.214912 0.040000
1.323500 0.214912 0.040000
1.327648 0.214912 0.040000
1.331645 0.214912 0.040000
1.335642 0.214912 0.040000
1.339671 0.214912 0.040000
1.343696 0.214912 0.040000
1.347644 0.214912 0.040000
1.351558 0.263158 0.070000
1.355627 0.263158 0.070000
1.359657 0.263158 0.070000
1.363632 0.263158 0.070000
1.367444 0.263158 0.070000
1.371621 0.263158 0.070000
1.375607 0.263158 0.070000
1.379556 0.263158 0.070000
1.383440 0.263158 0.070000
1.387594 0.263158 0.070000
1.391592 0.263158 0.070000
1.395589 0.311404 0.090000
1.399585 0.311404 0.090000
1.403584 0.311404 0.090000
1.407583 0.311404 0.090000
1.411580 0.311404 0.090000
1.415576 0.311404 0.090000
1.419408 0.311404 0.090000
1.423571 0.311404 0.090000
1.427586 0.311404 0.090000
1.431570 0.311404 0.090000
1.435629 0.311404 0.090000
1.439636 0.311404 0.090000
1.443576 0.346491 0.010000
1.447570 0.346491 0.010000
1.451571 0.346491 0.010000
1.455604 0.346491 0.010000
1.459570 0.346491 0.010000
1.463550 0.346491 0.010000
1.467445 0.346491 0.010000
1.471541 0.346491 0.010000
1.475564 0.346491 0.010000
1.479550 0.346491 0.010000
1.483526 0.346491 0.010000
1.487552 0.385965 0.100000
1.491549 0.385965 0.100000
1.495546 0.385965 0.100000
1.499554 0.385965 0.100000
1.503482 0.385965 0.100000
1.507533 0.385965 0.100000
1.511530 0.385965 0.100000
1.515631 0.385965 0.100000
1.519626 0.385965 0.100000
1.523567 0.385965 0.100000
1.527511 0.385965 0.100000
1.531518 0.399123 0.240000
1.535518 0.399123 0.240000
1.539505 0.399123 0.240000
1.543499 0.399123 0.240000
1.547498 0.399123 0.240000
1.551511 0.399123 0.240000
1.555697 0.399123 0.240000
1.559491 0.399123 0.240000
1.563546 0.399123 0.240000
1.567420 0.399123 0.240000
1.571484 0.399123 0.240000
1.575480 0.407895 0.390000
1.579829 0.407895 0.390000
1.583507 0.407895 0.390000
1.587478 0.407895 0.390000
1.591502 0.407895 0.390000
1.595469 0.407895 0.390000
1.599486 0.407895 0.390000
1.603526 0.407895 0.390000
1.607454 0.407895 0.390000
1.611470 0.407895 0.390000
1.615457 0.407895 0.390000
1.619452 0.407895 0.390000
1.623475 0.416667 0.380000
1.627457 0.416667 0.380000
1.631457 0.416667 0.380000
1.635461 0.416667 0.380000
1.639443 0.416667 0.380000
1.643429 0.416667 0.380000
1.647483 0.416667 0.380000
1.651453 0.416667 0.380000
1.655428 0.416667 0.380000
1.659445 0.416667 0.380000
1.663523 0.416667 0.380000
1.667421 0.416667 0.380000
1.671453 0.434211 0.450000
1.675436 0.434211 0.450000
1.679448 0.434211 0.450000
1.683456 0.434211 0.450000
1.687508 0.434211 0.450000
1.692423 0.434211 0.450000
1.695431 0.434211 0.450000
1.700444 0.434211 0.450000
1.703450 0.434211 0.450000
1.707436 0.434211 0.450000
1.712414 0.434211 0.450000
1.715405 0.451754 0.560000
1.720394 0.451754 0.560000
1.723411 0.451754 0.560000
1.727640 0.451754 0.560000
1.731578 0.451754 0.560000
1.736388 0.451754 0.560000
1.740395 0.451754 0.560000
1.743479 0.451754 0.560000
1.747440 0.451754 0.560000
1.752407 0.451754 0.560000
1.755374 0.451754 0.560000
1.759543 0.451754 0.560000
1.763428 0.451754 0.560000
1.767381 0.469298 0.630000
1.771693 0.469298 0.630000
1.776360 0.469298 0.630000
1.780357 0.469298 0.630000
1.783496 0.469298 0.630000
1.788370 0.469298 0.630000
1.791584 0.469298 0.630000
1.796351 0.469298 0.630000
1.800343 0.469298 0.630000
1.803579 0.469298 0.630000
1.807454 0.469298 0.630000
1.812337 0.482456 0.690000
1.816336 0.482456 0.690000
1.820335 0.482456 0.690000
1.823557 0.482456 0.690000
1.828325 0.482456 0.690000
1.832336 0.482456 0.690000
1.836321 0.482456 0.690000
1.840317 0.482456 0.690000
1.843534 0.482456 0.690000
1.847453 0.482456 0.690000
1.851571 0.482456 0.690000
1.856328 0.482456 0.690000
1.860307 0.500000 0.800000
1.863657 0.500000 0.800000
1.868354 0.500000 0.800000
1.871424 0.500000 0.800000
1.875957 0.500000 0.800000
1.880298 0.500000 0.800000
1.883579 0.500000 0.800000
1.888182 0.500000 0.800000
1.891598 0.500000 0.800000
1.896286 0.500000 0.800000
1.900284 0.500000 0.800000
1.903515 0.500000 0.800000
1.908280 0.500000 0.800000
1.912280 0.508772 0.860000
1.916273 0.508772 0.860000
1.920270 0.508772 0.860000
1.923474 0.508772 0.860000
1.927700 0.508772 0.860000
1.932275 0.508772 0.860000
1.936261 0.508772 0.860000
1.940261 0.508772 0.860000
1.943492 0.508772 0.860000
1.948180 0.508772 0.860000
1.951491 0.508772 0.860000
1.956251 0.526316 0.940000
1.959493 0.526316 0.940000
1.963459 0.526316 0.940000
1.967571 0.526316 0.940000
1.972245 0.526316 0.940000
1.976237 0.526316 0.940000
1.980134 0.526316 0.940000
1.983553 0.526316 0.940000
1.988245 0.526316 0.940000
1.991621 0.526316 0.940000
1.996226 0.526316 0.940000
2.000222 0.526316 0.940000
2.003455 0.526316 0.940000
2.007886 0.539474 1.000000
2.012214 0.539474 1.000000
2.016230 0.539474 1.000000
2.020226 0.539474 1.000000
2.023466 0.539474 1.000000
2.028253 0.539474 1.000000
2.031559 0.539474 1.000000
2.036219 0.539474 1.000000
2.040216 0.539474 1.000000
2.043438 0.539474 1.000000
2.048204 0.539474 1.000000
2.051422 0.548246 1.000000
2.055429 0.548246 1.000000
2.060209 0.548246 1.000000
2.063525 0.548246 1.000000
2.068260 0.548246 1.000000
2.072184 0.548246 1.000000
2.075687 0.548246 1.000000
2.080234 0.548246 1.000000
2.083464 0.548246 1.000000
2.087677 0.548246 1.000000
2.092052 0.548246 1.000000
2.095471 0.548246 1.000000
2.100164 0.548246 1.000000
2.103498 0.548246 1.000000
2.107393 0.548246 1.000000
2.112030 0.548246 1.000000
2.115439 0.548246 1.000000
2.120167 0.548246 1.000000
2.123586 0.548246 1.000000
2.127408 0.548246 1.000000
2.132161 0.548246 1.000000
2.135416 0.548246 1.000000

