0.008734 0.000000
0.008734 0.000000
0.008734 0.000000
0.008734 0.000000
0.008734 0.000000
0.008734 0.000000
0.008734 0.000000
0.008734 0.000000
0.008734 0.000000
0.008734 0.000000
0.008734 0.000000
0.008734 0.000000
0.008734 0.000000
0.008734 0.000000
0.008734 0.000000
0.008734 0.000000
0.008734 0.000000
0.008734 0.000000
0.008734 0.000000
0.008734 0.000000
0.008734 0.000000
0.008734 0.000000
0.008734 0.000000
0.008734 0.000000
0.008734 0.000000
0.008734 0.000000
0.008734 0.000000
0.008734 0.000000
0.008734 0.000000
0.008734 0.000000
0.008734 0.000000
0.008734 0.000000
0.008734 0.000000
0.008734 0.000000
0.008734 0.000000
0.008734 0.000000
0.008734 0.000000
0.008734 0.000000
0.008734 0.000000
0.008734 0.000000
0.008734 0.000000
0.008734 0.000000
0.008734 0.000000
0.008734 0.000000
0.008734 0.000000
0.008734 0.000000
0.008734 0.000000
0.008734 0.000000
0.008734 0.000000
0.008734 0.000000
0.008734 0.000000
0.008734 0.000000
0.008734 0.130000
0.008734 0.170000
0.017467 0.130000
0.017467 0.130000
0.026201 0.090000
0.034935 0.100000
0.048035 0.090000
0.056769 0.080000
0.056769 0.080000
0.069869 0.020000
0.082969 0.130000
0.096070 0.020000
0.096070 0.020000
0.109170 0.020000
0.122271 0.090000
0.135371 0.080000
0.148472 0.070000
0.161572 0.020000
0.161572 0.020000
0.179039 0.000000
0.187773 0.000000
0.205240 0.030000
0.218341 0.060000
0.218341 0.060000
0.227074 0.000000
0.240175 0.060000
0.253275 0.000000
0.253275 0.000000
0.266376 0.010000
0.279476 0.000000
0.292576 0.040000
0.305677 0.040000
0.305677 0.040000
0.314411 0.040000
0.327511 0.020000
0.340611 0.030000
0.349345 0.000000
0.349345 0.000000
0.362445 0.080000
0.375546 0.000000
0.384279 0.100000
0.393013 0.090000
0.393013 0.090000
0.406114 0.070000
0.419214 0.090000
0.432314 0.010000
0.441048 0.050000
0.441048 0.050000
0.454148 0.000000
0.467249 0.050000
0.475983 0.100000
0.489083 0.000000
0.489083 0.000000
0.502183 0.000000
0.510917 0.080000
0.524018 0.100000
0.537118 0.000000
0.537118 0.000000
0.550218 0.000000
0.558952 0.030000
0.572052 0.070000
0.572052 0.070000
0.585153 0.070000
0.593886 0.020000
0.606987 0.000000
0.620087 0.050000
0.620087 0.050000
0.628821 0.070000
0.641921 0.000000
0.655022 0.010000
0.663755 0.000000
0.676856 0.080000
0.676856 0.080000
0.676856 0.070000
0.676856 0.100000
0.676856 0.170000
0.676856 0.210000
0.676856 0.210000
0.676856 0.250000
0.676856 0.280000
0.676856 0.310000
0.676856 0.350000
0.676856 0.350000
0.676856 0.390000
0.676856 1.000000
0.676856 0.990000
0.676856 0.990000
0.676856 0.040000
0.676856 0.040000
0.676856 0.040000
0.676856 0.040000
0.676856 0.050000
0.676856 0.050000
0.676856 0.060000
0.676856 0.050000
0.676856 0.040000
0.676856 0.040000
0.676856 0.040000
0.676856 0.050000
0.676856 0.050000
0.676856 0.050000
0.676856 0.050000
0.676856 0.040000
0.676856 0.050000
0.676856 0.040000
0.676856 0.040000
0.676856 0.040000
0.676856 0.040000
0.676856 0.040000
0.676856 0.040000
0.676856 0.040000
0.676856 0.050000
0.676856 0.050000
0.676856 0.040000
0.676856 0.040000
0.676856 0.040000
0.676856 0.040000
0.676856 0.040000
0.676856 0.050000
0.676856 0.050000
0.676856 0.050000
0.676856 0.040000
0.676856 0.040000
0.676856 0.040000
0.676856 0.040000
0.676856 0.050000
0.676856 0.050000
0.676856 0.050000
0.676856 0.050000
0.676856 0.040000
0.676856 0.040000
0.676856 0.040000
0.676856 0.040000
0.676856 0.040000
0.676856 0.040000
0.676856 0.050000
0.676856 0.050000
0.676856 0.050000
0.676856 0.050000
0.676856 0.050000
0.676856 0.050000
0.676856 0.030000
0.676856 0.040000
0.676856 0.050000
0.676856 0.050000
0.676856 0.050000
0.676856 0.050000
0.676856 0.040000
0.676856 0.040000
0.676856 0.040000
0.676856 0.040000
0.676856 0.050000
0.676856 0.050000
0.676856 0.050000
0.676856 0.050000
0.676856 0.050000
0.676856 0.040000
0.676856 0.040000
0.676856 0.040000
0.676856 0.050000
0.676856 0.050000
0.676856 0.050000
0.676856 0.040000
0.676856 0.040000
0.676856 0.040000
0.676856 0.040000
0.676856 0.040000
0.676856 0.050000
0.676856 0.050000
0.676856 0.050000
0.676856 0.050000
0.676856 0.040000
0.676856 0.040000
0.676856 0.040000
0.676856 0.040000
0.676856 0.050000
0.676856 0.050000
0.676856 0.050000
0.676856 0.040000
0.676856 0.040000
0.676856 0.040000
0.676856 0.040000
0.676856 0.050000
0.676856 0.050000
0.676856 0.050000
0.676856 0.050000
0.676856 0.050000
0.676856 0.040000
0.676856 0.040000
0.676856 0.040000
