0.008734 0.000000
0.008734 0.000000
0.008734 0.000000
0.008734 0.000000
0.008734 0.000000
0.008734 0.000000
0.008734 0.000000
0.008734 0.000000
0.008734 0.000000
0.008734 0.000000
0.008734 0.000000
0.008734 0.000000
0.008734 0.000000
0.008734 0.000000
0.008734 0.000000
0.008734 0.000000
0.008734 0.000000
0.008734 0.000000
0.008734 0.000000
0.008734 0.000000
0.008734 0.000000
0.008734 0.000000
0.008734 0.000000
0.008734 0.000000
0.008734 0.000000
0.008734 0.000000
0.008734 0.000000
0.008734 0.000000
0.008734 0.000000
0.008734 0.000000
0.008734 0.000000
0.008734 0.000000
0.008734 0.000000
0.008734 0.000000
0.008734 0.000000
0.008734 0.000000
0.008734 0.000000
0.008734 0.000000
0.008734 0.000000
0.008734 0.000000
0.008734 0.000000
0.008734 0.000000
0.008734 0.000000
0.008734 0.000000
0.008734 0.000000
0.008734 0.000000
0.008734 0.000000
0.008734 0.000000
0.008734 0.000000
0.008734 0.000000
0.008734 0.000000
0.008734 0.000000
0.008734 0.000000
0.008734 0.000000
0.008734 0.000000
0.008734 0.000000
0.008734 0.000000
0.008734 0.000000
0.008734 0.000000
0.008734 0.000000
0.008734 0.000000
0.008734 0.000000
0.008734 0.000000
0.008734 0.000000
0.008734 0.000000
0.008734 0.000000
0.008734 0.000000
0.008734 0.000000
0.008734 0.000000
0.008734 0.000000
0.008734 0.000000
0.008734 0.000000
0.008734 0.000000
0.008734 0.000000
0.008734 0.000000
0.008734 0.000000
0.008734 0.000000
0.008734 0.000000
0.008734 0.000000
0.008734 0.000000
0.008734 0.000000
0.008734 0.000000
0.008734 0.000000
0.008734 0.000000
0.008734 0.000000
0.008734 0.000000
0.008734 0.000000
0.008734 0.000000
0.008734 0.000000
0.008734 0.000000
0.008734 0.000000
0.008734 0.000000
0.008734 0.000000
0.008734 0.000000
0.008734 0.000000
0.008734 0.000000
0.008734 0.000000
0.008734 0.000000
0.008734 0.000000
0.008734 0.000000
0.008734 0.000000
0.008734 0.000000
0.008734 0.000000
0.008734 0.000000
0.008734 0.000000
0.008734 0.000000
0.008734 0.000000
0.008734 0.000000
0.008734 0.000000
0.008734 0.000000
0.008734 0.000000
0.008734 0.000000
0.008734 0.000000
0.008734 0.000000
0.008734 0.000000
0.008734 0.000000
0.008734 0.000000
0.008734 0.000000
0.008734 0.000000
0.008734 0.000000
0.008734 0.000000
0.008734 0.000000
0.008734 0.000000
0.008734 0.000000
0.008734 0.000000
0.008734 0.000000
0.008734 0.000000
0.008734 0.000000
0.008734 0.000000
0.008734 0.000000
0.008734 0.000000
0.008734 0.000000
0.008734 0.000000
0.008734 0.000000
0.008734 0.000000
0.008734 0.000000
0.008734 0.000000
0.008734 0.000000
0.008734 0.000000
0.008734 0.000000
0.008734 0.000000
0.008734 0.000000
0.008734 0.000000
0.008734 0.000000
0.008734 0.000000
0.008734 0.000000
0.008734 0.000000
0.008734 0.000000
0.008734 0.000000
0.008734 0.000000
0.008734 0.130000
0.008734 0.190000
0.008734 0.190000
0.017467 0.140000
0.026201 0.130000
0.034935 0.060000
0.043668 0.050000
0.043668 0.050000
0.056769 0.100000
0.069869 0.070000
0.082969 0.120000
0.082969 0.120000
0.096070 0.030000
0.109170 0.000000
0.122271 0.060000
0.135371 0.090000
0.148472 0.110000
0.148472 0.110000
0.161572 0.080000
0.174673 0.030000
0.187773 0.090000
0.200873 0.060000
0.200873 0.060000
0.218341 0.000000
0.227074 0.030000
0.240175 0.010000
0.240175 0.010000
0.253275 0.040000
0.266376 0.050000
0.279476 0.060000
0.288210 0.050000
0.288210 0.050000
0.301310 0.070000
0.314411 0.000000
0.327511 0.010000
0.336245 0.000000
0.336245 0.000000
0.349345 0.000000
0.362445 0.080000
0.371179 0.000000
0.384279 0.090000
0.384279 0.090000
0.393013 0.000000
0.406114 0.070000
0.419214 0.000000
0.427948 0.020000
0.427948 0.020000
0.441048 0.030000
0.454148 0.000000
0.462882 0.070000
0.475983 0.090000
0.475983 0.090000
0.484716 0.050000
0.493450 0.100000
0.497817 0.120000
0.506550 0.140000
0.506550 0.140000
0.510917 0.170000
0.515284 0.170000
0.519651 0.190000
0.519651 0.190000
0.524018 0.220000
0.532751 0.110000
0.537118 0.270000
0.541485 0.280000
0.541485 0.280000
0.550218 0.240000
0.554585 0.290000
0.558952 0.280000
0.567686 0.350000
0.567686 0.350000
0.572052 0.370000
0.580786 0.340000
0.585153 0.370000
0.589520 0.370000
0.589520 0.370000
0.598253 0.390000
0.602620 0.400000
0.611354 0.430000
0.615721 0.420000
0.615721 0.420000
0.624454 0.450000
0.628821 0.470000
0.637555 0.480000
0.641921 0.520000
0.641921 0.520000
0.650655 0.510000
0.655022 0.530000
0.659389 0.540000
0.659389 0.540000
0.668122 0.550000
0.676856 0.600000
0.681223 0.620000
0.689956 0.630000
0.689956 0.630000
0.694323 0.640000
0.698690 0.660000
0.703057 0.670000
0.707424 0.700000
0.707424 0.700000
0.716157 0.730000
0.720524 0.900000
0.724891 0.740000
0.724891 0.740000
0.729258 0.760000
0.733625 0.790000
0.737991 0.810000
0.742358 0.890000
0.742358 0.890000
0.742358 0.860000
0.746725 0.890000
0.751092 0.910000
0.755459 0.930000
0.759825 0.960000
0.759825 0.960000
0.764192 0.970000
0.768559 0.980000
0.768559 0.990000
0.772926 1.000000
0.772926 1.000000
0.772926 0.980000
0.777293 1.000000
0.777293 1.000000
0.777293 1.000000
0.777293 1.000000
0.777293 0.990000
0.777293 0.050000
0.777293 0.050000
0.777293 0.060000
0.777293 0.060000
0.777293 0.050000
0.777293 0.050000
0.777293 0.040000
0.777293 0.040000
0.777293 0.040000
0.777293 0.040000
0.777293 0.040000
0.777293 0.040000
0.777293 0.040000
0.777293 0.040000
0.777293 0.050000
0.777293 0.050000
0.777293 0.040000
0.777293 0.040000
0.777293 0.040000
0.777293 0.040000
0.777293 0.050000
0.777293 0.050000
0.777293 0.050000
0.777293 0.040000
0.777293 0.040000
0.777293 0.040000
0.777293 0.040000
0.777293 0.040000
0.777293 0.060000
0.777293 0.060000
0.777293 0.030000
0.777293 0.040000
0.777293 0.040000
0.777293 0.050000
0.777293 0.050000
0.777293 0.050000
0.777293 0.050000
0.777293 0.040000
0.777293 0.040000
0.777293 0.050000
0.777293 0.050000
0.777293 0.050000
0.777293 0.050000
0.777293 0.040000
0.777293 0.040000
0.777293 0.050000
0.777293 0.040000
0.777293 0.040000
0.777293 0.050000
0.777293 0.050000
0.777293 0.050000
0.777293 0.040000
0.777293 0.040000
0.777293 0.040000
0.777293 0.040000
0.777293 0.050000
0.777293 0.040000
0.777293 0.040000
0.777293 0.040000
0.777293 0.040000
0.777293 0.050000
0.777293 0.060000
0.777293 0.030000
0.777293 0.030000
0.777293 0.040000
0.777293 0.040000
0.777293 0.050000
0.777293 0.050000
0.777293 0.050000
0.777293 0.050000
0.777293 0.040000
0.777293 0.050000
0.777293 0.050000
0.777293 0.040000
0.777293 0.050000
0.777293 0.050000
0.777293 0.040000
0.777293 0.040000
0.777293 0.040000
0.777293 0.040000
0.777293 0.040000
0.777293 0.040000
0.777293 0.050000
0.777293 0.030000
0.777293 0.040000
0.777293 0.040000
0.777293 0.050000
0.777293 0.050000
0.777293 0.050000
0.777293 0.040000
0.777293 0.040000
0.777293 0.040000
0.777293 0.050000
0.777293 0.050000
0.777293 0.040000
0.777293 0.050000
0.777293 0.050000
0.777293 0.050000
0.777293 0.050000
0.777293 0.040000
0.777293 0.040000
0.777293 0.050000
0.777293 0.050000
0.777293 0.060000
0.777293 0.040000
0.777293 0.040000
0.777293 0.040000
0.777293 0.040000
0.777293 0.050000
0.777293 0.050000
0.777293 0.050000
0.777293 0.050000
0.777293 0.040000
0.777293 0.040000
0.777293 0.040000
0.777293 0.060000
0.777293 0.060000
0.777293 0.060000
0.777293 0.050000
0.777293 0.040000
0.777293 0.040000
0.777293 0.060000
0.777293 0.060000
0.777293 0.050000
0.777293 0.040000
0.777293 0.040000
0.777293 0.040000
0.777293 0.040000
0.777293 0.040000
0.777293 0.040000
0.777293 0.040000
0.777293 0.040000
