// Time Position Current 
0.004544 0.000000 0.000000
0.009020 0.000000 0.000000
0.013017 0.000000 0.000000
0.017304 0.000000 0.000000
0.021465 0.000000 0.000000
0.024729 0.000000 0.000000
0.028865 0.000000 0.000000
0.034692 0.000000 0.000000
0.037346 0.000000 0.000000
0.041115 0.000000 0.000000
0.044892 0.000000 0.000000
0.048873 0.000000 0.000000
0.053393 0.000000 0.000000
0.057774 0.000000 0.000000
0.060969 0.000000 0.000000
0.064964 0.000000 0.000000
0.069223 0.000000 0.000000
0.072757 0.000000 0.000000
0.077000 0.000000 0.000000
0.081151 0.000000 0.000000
0.085286 0.000000 0.000000
0.089020 0.000000 0.000000
0.093063 0.000000 0.000000
0.096882 0.000000 0.000000
0.101268 0.000000 0.000000
0.105249 0.000000 0.000000
0.109160 0.000000 0.000000
0.113291 0.000000 0.000000
0.117454 0.000000 0.000000
0.121370 0.000000 0.000000
0.125152 0.000000 0.000000
0.129328 0.000000 0.000000
0.133094 0.000000 0.000000
0.137434 0.000000 0.000000
0.141078 0.000000 0.000000
0.144978 0.000000 0.000000
0.148748 0.000000 0.000000
0.152922 0.000000 0.000000
0.157752 0.000000 0.000000
0.161030 0.000000 0.000000
0.164830 0.000000 0.000000
0.169178 0.000000 0.000000
0.173224 0.000000 0.000000
0.177560 0.000000 0.000000
0.181432 0.004386 0.000000
0.184636 0.004386 0.000000
0.189152 0.004386 0.000000
0.193077 0.004386 0.000000
0.196942 0.004386 0.000000
0.201508 0.004386 0.000000
0.205404 0.004386 0.000000
0.209182 0.004386 0.000000
0.213036 0.004386 0.000000
0.217420 0.004386 0.000000
0.221102 0.004386 0.000000
0.224788 0.004386 0.000000
0.228784 0.004386 0.000000
0.232801 0.004386 0.000000
0.238208 0.004386 0.000000
0.241281 0.004386 0.000000
0.245067 0.004386 0.000000
0.249175 0.004386 0.000000
0.253571 0.004386 0.000000
0.256791 0.004386 0.000000
0.261120 0.004386 0.000000
0.264916 0.004386 0.000000
0.268692 0.004386 0.000000
0.272918 0.004386 0.000000
0.276930 0.004386 0.000000
0.280941 0.004386 0.000000
0.284747 0.004386 0.000000
0.289018 0.004386 0.000000
0.293215 0.004386 0.000000
0.297103 0.004386 0.000000
0.300872 0.004386 0.000000
0.305491 0.004386 0.000000
0.309278 0.004386 0.000000
0.313073 0.004386 0.000000
0.316765 0.004386 0.000000
0.321311 0.004386 0.000000
0.325205 0.004386 0.000000
0.329291 0.004386 0.000000
0.332772 0.004386 0.000000
0.337283 0.004386 0.000000
0.341378 0.004386 0.000000
0.345533 0.004386 0.000000
0.348938 0.004386 0.000000
0.352741 0.004386 0.000000
0.357290 0.004386 0.000000
0.361338 0.004386 0.000000
0.365012 0.004386 0.000000
0.368757 0.004386 0.000000
0.373521 0.004386 0.000000
0.376797 0.004386 0.000000
0.381075 0.004386 0.000000
0.384817 0.004386 0.000000
0.389531 0.004386 0.000000
0.393310 0.004386 0.000000
0.397466 0.004386 0.000000
0.401435 0.004386 0.000000
0.404659 0.004386 0.000000
0.409414 0.004386 0.000000
0.413138 0.004386 0.000000
0.417660 0.004386 0.000000
0.421179 0.004386 0.000000
0.425288 0.004386 0.000000
0.429104 0.004386 0.000000
0.432751 0.004386 0.000000
0.436770 0.004386 0.000000
0.441670 0.004386 0.000000
0.445248 0.004386 0.000000
0.448704 0.004386 0.000000
0.452805 0.004386 0.000000
0.457524 0.004386 0.000000
0.461303 0.004386 0.000000
0.465100 0.004386 0.000000
0.469197 0.004386 0.000000
0.472656 0.004386 0.000000
0.477342 0.004386 0.000000
0.481259 0.004386 0.000000
0.484906 0.004386 0.000000
0.488671 0.004386 0.000000
0.492978 0.004386 0.000000
0.497743 0.004386 0.000000
0.501538 0.004386 0.000000
0.504812 0.004386 0.000000
0.509202 0.004386 0.000000
0.513250 0.004386 0.000000
0.516933 0.004386 0.000000
0.521229 0.004386 0.000000
0.525504 0.004386 0.000000
0.529117 0.004386 0.000000
0.532982 0.004386 0.000000
0.536875 0.004386 0.000000
0.541187 0.004386 0.000000
0.544838 0.004386 0.000000
0.549119 0.004386 0.000000
0.552899 0.004386 0.000000
0.557194 0.004386 0.000000
0.561388 0.004386 0.000000
0.565089 0.004386 0.000000
0.568691 0.004386 0.000000
0.572985 0.004386 0.000000
0.578777 0.004386 0.000000
0.580963 0.004386 0.000000
0.584991 0.004386 0.000000
0.588789 0.004386 0.000000
0.593138 0.004386 0.000000
0.596776 0.004386 0.000000
0.601046 0.004386 0.000000
0.604809 0.004386 0.000000
0.609023 0.004386 0.000000
0.613102 0.004386 0.000000
0.616781 0.004386 0.000000
0.621184 0.004386 0.000000
0.624647 0.004386 0.000000
0.628818 0.004386 0.000000
0.632959 0.004386 0.000000
0.636927 0.004386 0.000000
0.640949 0.004386 0.000000
0.645410 0.004386 0.000000
0.649295 0.004386 0.000000
0.653087 0.004386 0.000000
0.657271 0.004386 0.000000
0.661460 0.004386 0.000000
0.664853 0.004386 0.000000
0.669193 0.004386 0.000000
0.672784 0.004386 0.000000
0.677535 0.004386 0.000000
0.681318 0.004386 0.000000
0.685807 0.004386 0.000000
0.688852 0.004386 0.000000
0.693022 0.004386 0.000000
0.697670 0.004386 0.000000
0.701106 0.004386 0.000000
0.704979 0.004386 0.000000
0.708683 0.004386 0.000000
0.712788 0.004386 0.000000
0.717225 0.004386 0.000000
0.720966 0.004386 0.000000
0.724902 0.004386 0.000000
0.728986 0.004386 0.000000
0.732933 0.004386 0.000000
0.737012 0.004386 0.000000
0.741126 0.004386 0.000000
0.745505 0.004386 0.000000
0.749285 0.004386 0.000000
0.753065 0.004386 0.000000
0.757265 0.004386 0.000000
0.761610 0.004386 0.000000
0.765350 0.004386 0.000000
0.769188 0.004386 0.000000
0.772678 0.004386 0.000000
0.777062 0.004386 0.000000
0.781103 0.004386 0.000000
0.785177 0.004386 0.000000
0.788945 0.004386 0.000000
0.793052 0.004386 0.000000
0.797452 0.004386 0.000000
0.801219 0.004386 0.000000
0.804991 0.004386 0.000000
0.808961 0.004386 0.000000
0.813501 0.004386 0.000000
0.817281 0.004386 0.000000
0.821243 0.004386 0.000000
0.824734 0.004386 0.000000
0.829485 0.004386 0.000000
0.833026 0.004386 0.000000
0.837102 0.004386 0.000000
0.841593 0.004386 0.000000
0.844654 0.004386 0.000000
0.848843 0.004386 0.000000
0.853186 0.004386 0.000000
0.857592 0.004386 0.000000
0.861444 0.004386 0.000000
0.864759 0.004386 0.000000
0.869096 0.004386 0.000000
0.873040 0.004386 0.000000
0.877516 0.004386 0.000000
0.881354 0.004386 0.000000
0.885286 0.004386 0.000000
0.889075 0.004386 0.000000
0.893041 0.004386 0.000000
0.897566 0.004386 0.000000
0.901348 0.004386 0.000000
0.905080 0.004386 0.000000
0.909044 0.004386 0.000000
0.912876 0.004386 0.000000
0.917235 0.004386 0.000000
0.921148 0.004386 0.000000
0.924910 0.004386 0.000000
0.928716 0.004386 0.000000
0.933414 0.004386 0.000000
0.937186 0.004386 0.000000
0.940964 0.004386 0.000000
0.944740 0.004386 0.000000
0.949472 0.004386 0.000000
0.953239 0.004386 0.000000
0.957609 0.004386 0.000000
0.961149 0.004386 0.000000
0.966871 0.004386 0.000000
0.969906 0.004386 0.000000
0.972800 0.004386 0.000000
0.977264 0.004386 0.000000
0.981051 0.004386 0.000000
0.984861 0.004386 0.000000
0.989014 0.004386 0.000000
0.992899 0.004386 0.000000
0.996673 0.004386 0.000000
1.001396 0.004386 0.000000
1.005168 0.004386 0.000000
1.009110 0.004386 0.000000
1.013040 0.004386 0.000000
1.017205 0.004386 0.000000
1.021227 0.004386 0.000000
1.024729 0.004386 0.000000
1.028698 0.004386 0.000000
1.033509 0.004386 0.000000
1.037637 0.004386 0.000000
1.040689 0.004386 0.000000
1.044856 0.004386 0.000000
1.049545 0.004386 0.000000
1.053350 0.004386 0.000000
1.057105 0.004386 0.000000
1.061324 0.004386 0.000000
1.064653 0.004386 0.130000
1.069422 0.004386 0.130000
1.073541 0.004386 0.130000
1.077460 0.004386 0.130000
1.081271 0.004386 0.130000
1.085100 0.004386 0.130000
1.089205 0.004386 0.130000
1.093193 0.004386 0.130000
1.097330 0.004386 0.130000
1.103025 0.004386 0.130000
1.105161 0.021930 0.130000
1.109031 0.021930 0.130000
1.112813 0.021930 0.130000
1.118112 0.021930 0.130000
1.121312 0.021930 0.130000
1.125081 0.021930 0.130000
1.128987 0.021930 0.130000
1.132634 0.021930 0.130000
1.138258 0.021930 0.130000
1.141132 0.021930 0.130000
1.145033 0.021930 0.130000
1.148995 0.021930 0.130000
1.153301 0.065789 0.130000
1.157581 0.065789 0.130000
1.160971 0.065789 0.130000
1.164821 0.065789 0.130000
1.168773 0.065789 0.130000
1.173237 0.065789 0.130000
1.176634 0.065789 0.130000
1.181390 0.065789 0.130000
1.184949 0.065789 0.130000
1.188877 0.065789 0.130000
1.193060 0.065789 0.130000
1.197690 0.114035 0.020000
1.201251 0.114035 0.020000
1.205220 0.114035 0.020000
1.208852 0.114035 0.020000
1.212901 0.114035 0.020000
1.217187 0.114035 0.020000
1.221238 0.114035 0.020000
1.225074 0.114035 0.020000
1.229022 0.114035 0.020000
1.233261 0.114035 0.020000
1.237590 0.114035 0.020000
1.241220 0.114035 0.020000
1.244668 0.149123 0.020000
1.248777 0.149123 0.020000
1.252675 0.149123 0.020000
1.257661 0.149123 0.020000
1.261050 0.149123 0.020000
1.264716 0.149123 0.020000
1.269172 0.149123 0.020000
1.272811 0.149123 0.020000
1.277470 0.149123 0.020000
1.281770 0.149123 0.020000
1.284798 0.149123 0.020000
1.289236 0.201754 0.130000
1.293154 0.201754 0.130000
1.297366 0.201754 0.130000
1.301318 0.201754 0.130000
1.305295 0.201754 0.130000
1.308898 0.201754 0.130000
1.313006 0.201754 0.130000
1.317264 0.201754 0.130000
1.321056 0.201754 0.130000
1.325261 0.201754 0.130000
1.329082 0.201754 0.130000
1.332815 0.201754 0.130000
1.337478 0.250000 0.140000
1.340897 0.250000 0.140000
1.345047 0.250000 0.140000
1.348870 0.250000 0.140000
1.352870 0.250000 0.140000
1.357144 0.250000 0.140000
1.361141 0.250000 0.140000
1.364920 0.250000 0.140000
1.368690 0.250000 0.140000
1.373432 0.250000 0.140000
1.377938 0.250000 0.140000
1.380636 0.285088 0.100000
1.384996 0.285088 0.100000
1.388773 0.298246 0.090000
1.393254 0.298246 0.090000
1.397244 0.298246 0.090000
1.401376 0.298246 0.090000
1.405423 0.298246 0.090000
1.408794 0.298246 0.090000
1.412722 0.298246 0.090000
1.416705 0.298246 0.090000
1.420711 0.298246 0.090000
1.424658 0.298246 0.090000
1.428705 0.333333 0.080000
1.432911 0.333333 0.080000
1.437160 0.333333 0.080000
1.441519 0.333333 0.080000
1.444706 0.333333 0.080000
1.448936 0.333333 0.080000
1.452739 0.333333 0.080000
1.457483 0.333333 0.080000
1.460763 0.333333 0.080000
1.465375 0.333333 0.080000
1.468827 0.333333 0.080000
1.473391 0.364035 0.150000
1.477715 0.364035 0.150000
1.481682 0.364035 0.150000
1.484834 0.364035 0.150000
1.489372 0.364035 0.150000
1.492810 0.364035 0.150000
1.497429 0.364035 0.150000
1.500936 0.364035 0.150000
1.504673 0.364035 0.150000
1.509391 0.364035 0.150000
1.512663 0.364035 0.150000
1.516787 0.412281 0.110000
1.520928 0.412281 0.110000
1.525151 0.412281 0.110000
1.529086 0.412281 0.110000
1.533076 0.412281 0.110000
1.537765 0.412281 0.110000
1.540929 0.412281 0.110000
1.545052 0.412281 0.110000
1.548669 0.412281 0.110000
1.552673 0.412281 0.110000
1.557231 0.412281 0.110000
1.561095 0.412281 0.110000
1.564640 0.460526 0.050000
1.570578 0.460526 0.050000
1.573004 0.460526 0.050000
1.577243 0.460526 0.050000
1.580785 0.460526 0.050000
1.584762 0.460526 0.050000
1.588810 0.460526 0.050000
1.593088 0.460526 0.050000
1.597441 0.460526 0.050000
1.600992 0.460526 0.050000
1.605181 0.460526 0.050000
1.608861 0.500000 0.120000
1.612855 0.500000 0.120000
1.617316 0.500000 0.120000
1.620756 0.500000 0.120000
1.624702 0.500000 0.120000
1.628666 0.500000 0.120000
1.632988 0.500000 0.120000
1.637514 0.500000 0.120000
1.641380 0.500000 0.120000
1.644991 0.500000 0.120000
1.649199 0.500000 0.120000
1.653232 0.543860 0.060000
1.657227 0.543860 0.060000
1.660988 0.543860 0.060000
1.665004 0.543860 0.060000
1.668998 0.543860 0.060000
1.672850 0.543860 0.060000
1.676883 0.543860 0.060000
1.681459 0.543860 0.060000
1.684769 0.543860 0.060000
1.688890 0.543860 0.060000
1.692757 0.543860 0.060000
1.696990 0.574561 0.150000
1.701362 0.574561 0.150000
1.704717 0.574561 0.150000
1.708742 0.574561 0.150000
1.713225 0.574561 0.150000
1.717776 0.574561 0.150000
1.721122 0.574561 0.150000
1.725083 0.574561 0.150000
1.728758 0.574561 0.150000
1.732764 0.574561 0.150000
1.737182 0.574561 0.150000
1.740881 0.614035 0.100000
1.744982 0.614035 0.100000
1.748792 0.614035 0.100000
1.752741 0.614035 0.100000
1.757056 0.614035 0.100000
1.761141 0.614035 0.100000
1.765217 0.614035 0.100000
1.769392 0.614035 0.100000
1.773580 0.614035 0.100000
1.777607 0.614035 0.100000
1.781172 0.614035 0.100000
1.784673 0.644737 0.150000
1.788667 0.653509 0.110000
1.793061 0.653509 0.110000
1.797498 0.653509 0.110000
1.801093 0.653509 0.110000
1.805181 0.653509 0.110000
1.808755 0.653509 0.110000
1.812787 0.653509 0.110000
1.817216 0.653509 0.110000
1.821222 0.653509 0.110000
1.825262 0.653509 0.110000
1.828840 0.653509 0.110000
1.832967 0.653509 0.110000
1.837800 0.684211 0.160000
1.841225 0.684211 0.160000
1.845094 0.684211 0.160000
1.849132 0.684211 0.160000
1.852728 0.684211 0.160000
1.857433 0.684211 0.160000
1.860697 0.684211 0.160000
1.864766 0.684211 0.160000
1.868908 0.684211 0.160000
1.872870 0.684211 0.160000
1.877303 0.684211 0.160000
1.880829 0.723684 0.140000
1.884974 0.723684 0.140000
1.889281 0.723684 0.140000
1.893006 0.723684 0.140000
1.897079 0.723684 0.140000
1.901214 0.723684 0.140000
1.905097 0.723684 0.140000
1.908760 0.723684 0.140000
1.912776 0.723684 0.140000
1.917486 0.723684 0.140000
1.921320 0.723684 0.140000
1.924891 0.723684 0.140000
1.928966 0.754386 0.190000
1.934114 0.754386 0.190000
1.937093 0.754386 0.190000
1.940775 0.754386 0.190000
1.944909 0.754386 0.190000
1.948774 0.754386 0.190000
1.952666 0.754386 0.190000
1.957533 0.754386 0.190000
1.960949 0.754386 0.190000
1.965204 0.754386 0.190000
1.969030 0.754386 0.190000
1.973255 0.793860 0.190000
1.978551 0.793860 0.190000
1.981113 0.793860 0.190000
1.985080 0.793860 0.190000
1.989039 0.793860 0.190000
1.993003 0.793860 0.190000
1.998208 0.793860 0.190000
2.001808 0.793860 0.190000
2.006548 0.793860 0.190000
2.009622 0.793860 0.190000
2.016571 0.833333 0.250000
2.017760 0.833333 0.250000
2.023613 0.833333 0.250000
2.024891 0.833333 0.250000
2.032294 0.833333 0.250000
2.034692 0.833333 0.250000
2.038262 0.833333 0.250000
2.041897 0.833333 0.250000
2.045184 0.833333 0.250000
2.049094 0.833333 0.250000
2.053052 0.833333 0.250000
2.056780 0.833333 0.250000
2.060934 0.833333 0.250000
2.064889 0.864035 0.260000
2.070131 0.864035 0.260000
2.072781 0.864035 0.260000
2.077424 0.864035 0.260000
2.087709 0.864035 0.260000
2.088005 0.864035 0.260000
2.089379 0.864035 0.260000
2.098268 0.864035 0.260000
2.098533 0.864035 0.260000
2.102125 0.864035 0.260000
2.104861 0.864035 0.260000
2.109144 0.894737 0.310000
2.113088 0.894737 0.310000
2.117469 0.894737 0.310000
2.120769 0.894737 0.310000
2.127114 0.894737 0.310000
2.128896 0.894737 0.310000
2.133045 0.894737 0.310000
2.141686 0.894737 0.310000
2.142452 0.894737 0.310000
2.144726 0.894737 0.310000
2.148841 0.894737 0.310000
2.154501 0.894737 0.310000
2.159794 0.916667 0.410000
2.160700 0.916667 0.410000
2.165471 0.916667 0.410000
2.170962 0.916667 0.410000
2.173731 0.916667 0.410000
2.180824 0.916667 0.410000
2.181183 0.916667 0.410000
2.185016 0.916667 0.410000
2.189082 0.916667 0.410000
2.192908 0.916667 0.410000
2.197686 0.916667 0.410000
2.200820 0.916667 0.410000
2.204769 0.925439 0.470000
2.208730 0.925439 0.470000
2.212672 0.925439 0.470000
2.218010 0.925439 0.470000
2.222470 0.925439 0.470000
2.226126 0.925439 0.470000
2.229258 0.925439 0.470000
2.234650 0.925439 0.470000
2.238511 0.925439 0.470000
2.241947 0.925439 0.470000
2.245219 0.925439 0.470000
2.249559 0.925439 0.470000
2.252818 0.929825 0.670000
2.257471 0.929825 0.670000
2.260877 0.929825 0.670000
2.264938 0.929825 0.670000
2.268773 0.929825 0.670000
2.272737 0.929825 0.670000
2.279882 0.929825 0.670000
2.280708 0.929825 0.670000
2.284974 0.929825 0.670000
2.288921 0.929825 0.670000
2.292726 0.929825 0.670000
2.298835 0.934211 0.740000

