Current Position 
-49 352
-47 342
-46 328
-48 320
312 0
-49 302
-48 296
-50 288
-49 282
-38 280
186 1172
2308 0
189 3736
172 4882
193 6010
158 6982
207 7888
198 8696
242 9614
305 10246
252 10932
280 11442
273 12196
283 12614
329 13042
352 13454
389 13900
399 14330
401 14618
447 14936
479 15194
498 15444
536 15704
605 15932
555 16162
586 16342
660 16524
708 16682
749 16818
744 16876
734 16902
750 16946
746 16978
757 17022
749 17084
728 17146
761 17194
720 17240
768 17298
754 17342
780 17386
17420 0
728 17444
704 17476
719 17500
776 17520
709 17548
707 17570
706 17594
781 17614
700 17622
779 17634
761 17660
702 17674
702 17690
703 17702
771 17710
745 17710
740 17724
743 17730
734 17738
698 17744
720 17754
788 17766
709 17770
773 17776
714 17784
772 17792
788 17800
691 17804
709 17808
715 17810
767 17812
752 17810
705 17814
717 17822
776 17828
759 17830
767 17832
718 17836
697 17848
756 17852
793 17856
703 17858
782 17864
733 17866
752 17872
772 17870
787 17874
719 17878
774 17882
17888 0
789 17892
766 17894
698 17898
715 17898
17900 0
696 17900
789 17908
779 17908
740 17910
768 17910
780 17910
743 17910
765 17910
768 17910
782 17910
704 17910
697 17912
Nan NaN 
