// New Client: 100.66.66.2
// object=RL5045
// time position forceZ torqueZ
0 0.200048 -0.212614 0.011992
0.048 0.199992 -0.376766 -0.006435
0.098 0.19997 0.132898 0.004495
0.148 0.199918 0.064696 0.005684
0.198 0.199646 0.016228 0.005408
0.248 0.199221 0.310021 0.004975
0.298 0.198688 -0.156077 -0.001174
0.348 0.198122 0.263883 0.00321
0.398 0.197637 -0.152603 0.011254
0.448 0.19695 0.093228 0.002757
0.498 0.19611 0.01825 0.004466
0.548 0.195276 -0.30611 0.000327
0.598 0.194362 0.004147 0.007676
0.648 0.193418 -0.038633 0.003442
0.698 0.192443 0.050697 0.006278
0.748 0.191312 0.021851 0.007331
0.798 0.190088 -0.03829 0.012186
0.848 0.188689 0.178242 0.017399
0.898 0.187328 -0.078499 0.010197
0.948 0.185931 0.053744 0.008195
0.998 0.1844 0.231986 0.016116
1.048 0.182758 -0.022189 0.017688
1.098 0.181083 -0.110931 0.01531
1.148 0.179228 0.407435 0.024498
1.198 0.17748 0.316316 0.027693
1.248 0.175577 -0.028197 0.099242
1.298 0.173573 0.257085 0.096887
1.348 0.171736 -0.138678 0.091219
1.398 0.169487 -0.049397 0.082445
1.448 0.167464 0.122027 0.087638
1.498 0.165654 -0.286387 0.079762
1.548 0.163531 0.023947 0.084148
1.598 0.161419 0.355985 0.075174
1.648 0.1595 -0.020041 0.069646
1.698 0.157478 0.23891 0.070705
1.748 0.155451 0.001861 0.068232
1.798 0.153401 0.049075 0.067584
1.848 0.15138 -0.053888 0.071248
1.898 0.149369 -0.068638 0.067054
1.948 0.147246 -0.091771 0.06294
1.998 0.145343 -0.157256 0.086097
2.048 0.143255 -0.024043 0.078286
2.098 0.14124 0.144461 0.077108
2.148 0.139308 -0.132963 0.071215
2.198 0.137172 0.089338 0.087061
2.248 0.135108 0.287549 0.091765
2.298 0.133314 0.006147 0.170911
2.348 0.131162 0.380375 0.161151
2.398 0.12909 0.181424 0.164077
2.448 0.127243 -0.043812 0.159499
2.498 0.12518 0.147909 0.149505
2.548 0.123017 0.274366 0.156151
2.598 0.121131 -0.015062 0.139116
2.648 0.119106 -0.248804 0.137642
2.698 0.116982 0.275179 0.147194
2.748 0.11499 0.348257 0.141585
2.798 0.112977 -0.045084 0.14319
2.848 0.110926 0.114033 0.137488
2.898 0.108952 0.309345 0.137438
2.948 0.106839 0.399233 0.13646
2.998 0.10488 0.047888 0.136419
3.048 0.102858 -0.047406 0.140072
3.098 0.100794 0.236577 0.141739
3.148 0.098842 -0.273918 0.145229
3.198 0.09678 0.271691 0.156566
3.248 0.094778 0.176555 0.168768
3.298 0.092752 -0.12317 0.168006
3.348 0.090769 0.158354 0.167055
3.398 0.088732 0.248843 0.17195
3.448 0.08681 0.132809 0.178443
3.498 0.08462 0.176786 0.172763
3.548 0.08267 0.039372 0.185672
3.598 0.080885 -12.667417 0.282037
3.648 0.079547 -32.494475 0.263683
3.698 0.077815 -50.684913 0.251125
3.748 0.075649 -60.953152 0.244967
3.798 0.073409 -69.217433 0.232329
3.848 0.07118 -76.893398 0.218888
3.898 0.069197 -84.181176 0.203533
3.948 0.067957 -88.992089 0.185444
// Client closed conection.