// Time Position Current 
0.004168 0.000000 0.000000
0.014641 0.000000 0.000000
0.024294 0.000000 0.000000
0.034523 0.000000 0.000000
0.045088 0.000000 0.000000
0.054347 0.000000 0.000000
0.064388 0.000000 0.000000
0.074533 0.000000 0.000000
0.084352 0.000000 0.000000
0.094292 0.000000 0.000000
0.105152 0.000000 0.000000
0.114284 0.000000 0.000000
0.124285 0.000000 0.000000
0.134305 0.000000 0.000000
0.144331 0.000000 0.000000
0.154399 0.000000 0.000000
0.164954 0.000000 0.000000
0.174730 0.000000 0.000000
0.184301 0.000000 0.000000
0.194463 0.000000 0.000000
0.205261 0.004386 0.000000
0.215133 0.004386 0.000000
0.224415 0.004386 0.000000
0.234499 0.004386 0.000000
0.244507 0.004386 0.000000
0.254691 0.004386 0.000000
0.264458 0.004386 0.000000
0.274316 0.004386 0.000000
0.284281 0.004386 0.000000
0.294432 0.004386 0.000000
0.304551 0.004386 0.000000
0.314255 0.004386 0.000000
0.324368 0.004386 0.000000
0.334306 0.004386 0.000000
0.344405 0.004386 0.000000
0.354587 0.004386 0.000000
0.364306 0.004386 0.000000
0.374364 0.004386 0.000000
0.384369 0.004386 0.000000
0.394844 0.004386 0.000000
0.404346 0.004386 0.000000
0.414362 0.004386 0.000000
0.424360 0.004386 0.000000
0.434736 0.004386 0.000000
0.444654 0.004386 0.000000
0.454328 0.004386 0.000000
0.464447 0.004386 0.000000
0.475047 0.004386 0.000000
0.484473 0.004386 0.000000
0.494608 0.004386 0.000000
0.504502 0.004386 0.000000
0.514307 0.004386 0.000000
0.525226 0.004386 0.000000
0.534499 0.004386 0.000000
0.545090 0.004386 0.000000
0.554317 0.004386 0.000000
0.564454 0.004386 0.000000
0.574660 0.004386 0.000000
0.584579 0.004386 0.000000
0.594646 0.004386 0.000000
0.604784 0.004386 0.000000
0.615198 0.004386 0.000000
0.624554 0.004386 0.000000
0.634278 0.004386 0.000000
0.644709 0.004386 0.000000
0.654322 0.004386 0.000000
0.664456 0.004386 0.000000
0.674459 0.004386 0.000000
0.684907 0.004386 0.000000
0.694676 0.004386 0.000000
0.704579 0.004386 0.000000
0.714424 0.004386 0.000000
0.724640 0.004386 0.000000
0.734345 0.004386 0.000000
0.744293 0.004386 0.000000
0.754578 0.004386 0.000000
0.764361 0.004386 0.000000
0.775235 0.004386 0.000000
0.784557 0.004386 0.000000
0.794669 0.004386 0.000000
0.804806 0.004386 0.000000
0.814644 0.004386 0.000000
0.824378 0.004386 0.000000
0.834662 0.004386 0.000000
0.844429 0.004386 0.000000
0.854245 0.004386 0.000000
0.864636 0.004386 0.000000
0.874448 0.004386 0.000000
0.884275 0.004386 0.000000
0.894626 0.004386 0.000000
0.904440 0.004386 0.000000
0.914673 0.004386 0.000000
0.924274 0.004386 0.000000
0.934530 0.004386 0.000000
0.944397 0.004386 0.000000
0.954354 0.004386 0.000000
0.964260 0.004386 0.000000
0.974292 0.004386 0.000000
0.984773 0.004386 0.000000
0.994493 0.004386 0.000000
1.004385 0.004386 0.000000
1.015227 0.004386 0.000000
1.025079 0.004386 0.000000
1.034323 0.004386 0.000000
1.044217 0.004386 0.000000
1.054458 0.004386 0.000000
1.064277 0.004386 0.000000
1.075174 0.004386 0.000000
1.084569 0.004386 0.000000
1.094528 0.004386 0.000000
1.104470 0.004386 0.000000
1.114440 0.035088 0.330000
1.124386 0.035088 0.330000
1.134588 0.035088 0.330000
1.144382 0.035088 0.330000
1.154728 0.035088 0.330000
1.164645 0.083333 0.160000
1.174313 0.083333 0.160000
1.184237 0.083333 0.160000
1.194309 0.083333 0.160000
1.204640 0.162281 0.120000
1.214685 0.162281 0.120000
1.224591 0.162281 0.120000
1.234308 0.162281 0.120000
1.245262 0.232456 0.100000
1.254393 0.232456 0.100000
1.264349 0.232456 0.100000
1.274563 0.232456 0.100000
1.284532 0.232456 0.100000
1.294282 0.320175 0.220000
1.305188 0.320175 0.220000
1.314627 0.320175 0.220000
1.324392 0.320175 0.220000
1.335015 0.385965 0.140000
1.344554 0.385965 0.140000
1.354700 0.385965 0.140000
1.364351 0.385965 0.140000
1.374826 0.385965 0.140000
1.384397 0.473684 0.070000
1.394392 0.473684 0.070000
1.404459 0.473684 0.070000
1.414401 0.473684 0.070000
1.424744 0.561404 0.060000
1.434525 0.561404 0.060000
1.444365 0.561404 0.060000
1.454665 0.561404 0.060000
1.465035 0.561404 0.060000
1.474948 0.622807 0.220000
1.484683 0.622807 0.220000
1.494492 0.622807 0.220000
1.504312 0.622807 0.220000
1.514660 0.692982 0.300000
1.524529 0.692982 0.300000
1.534316 0.692982 0.300000
1.545198 0.692982 0.300000
1.554807 0.692982 0.300000
1.564909 0.758772 0.300000
1.574548 0.758772 0.300000
1.584454 0.758772 0.300000
1.594271 0.758772 0.300000
1.604588 0.758772 0.300000
1.614316 0.802632 0.390000
1.624374 0.802632 0.390000
1.634541 0.802632 0.390000
1.644367 0.802632 0.390000
1.655268 0.846491 0.420000
1.664847 0.846491 0.420000
1.674323 0.846491 0.420000
1.684707 0.846491 0.420000
1.694616 0.899123 0.680000
1.704366 0.899123 0.680000
1.714428 0.899123 0.680000
1.724691 0.899123 0.680000
1.734791 0.899123 0.680000
1.744693 0.925439 0.780000
1.754578 0.925439 0.780000
1.764323 0.925439 0.780000
1.774654 0.925439 0.780000
1.784278 0.934211 0.990000
1.794242 0.934211 0.990000
1.804261 0.934211 0.990000
1.814374 0.934211 0.990000
1.824343 0.934211 0.990000
1.834611 0.934211 0.990000
1.844394 0.934211 0.990000
1.854279 0.934211 0.990000
1.864650 0.934211 0.990000
1.874283 0.934211 0.040000
1.884362 0.934211 0.040000
1.894363 0.934211 0.040000
1.904990 0.934211 0.040000
1.914384 0.934211 0.040000
1.924279 0.934211 0.050000
1.934426 0.934211 0.050000
1.944337 0.934211 0.050000
1.954401 0.934211 0.050000
1.964964 0.934211 0.050000
1.974478 0.934211 0.050000
1.984616 0.934211 0.050000
1.994416 0.934211 0.050000
2.005046 0.934211 0.050000
2.014370 0.934211 0.030000
2.024273 0.934211 0.030000
2.034807 0.934211 0.030000
2.044394 0.934211 0.030000
2.054278 0.934211 0.030000
2.064897 0.934211 0.040000
2.074398 0.934211 0.040000
2.084755 0.934211 0.040000
2.094301 0.934211 0.040000
2.104645 0.934211 0.030000
2.114340 0.934211 0.030000
2.126215 0.934211 0.030000
2.134699 0.934211 0.030000
2.144474 0.934211 0.030000
2.154533 0.934211 0.050000
2.165316 0.934211 0.050000
2.174348 0.934211 0.050000
2.184887 0.934211 0.050000
2.194361 0.934211 0.050000
2.204508 0.934211 0.050000
2.214247 0.934211 0.050000
2.224566 0.934211 0.050000
2.234428 0.934211 0.050000
2.245247 0.934211 0.040000
2.254296 0.934211 0.040000
2.264204 0.934211 0.040000
2.275100 0.934211 0.040000
2.284453 0.934211 0.050000
2.294356 0.934211 0.050000
2.304535 0.934211 0.050000
2.314406 0.934211 0.050000
2.324707 0.934211 0.050000
2.334744 0.934211 0.050000
2.344283 0.934211 0.050000
2.354562 0.934211 0.050000
2.364258 0.934211 0.050000
2.375234 0.934211 0.050000
2.384382 0.934211 0.050000
2.394900 0.934211 0.050000
2.404571 0.934211 0.050000
2.414539 0.934211 0.050000
2.424783 0.934211 0.050000
2.434978 0.934211 0.050000
2.444919 0.934211 0.050000
2.454595 0.934211 0.050000
2.464452 0.934211 0.040000
2.474451 0.934211 0.040000
2.484301 0.934211 0.040000
2.494339 0.934211 0.040000
2.504315 0.934211 0.040000
2.514352 0.934211 0.040000
2.524464 0.934211 0.040000
2.534273 0.934211 0.040000
2.544379 0.934211 0.040000
2.554802 0.934211 0.050000
2.564973 0.934211 0.050000
2.574259 0.934211 0.050000
2.584501 0.934211 0.050000
2.594806 0.934211 0.040000
2.604337 0.934211 0.040000
2.614483 0.934211 0.040000
2.625119 0.934211 0.040000
2.634417 0.934211 0.040000
2.644291 0.934211 0.040000
2.654563 0.934211 0.040000
2.664865 0.934211 0.040000
2.674774 0.934211 0.040000
2.684755 0.934211 0.050000
2.694456 0.934211 0.050000
2.704294 0.934211 0.050000
2.714400 0.934211 0.050000
2.724496 0.934211 0.050000
2.734405 0.934211 0.050000
2.745226 0.934211 0.050000
2.754992 0.934211 0.050000
2.764918 0.934211 0.050000
2.774309 0.934211 0.050000
2.784519 0.934211 0.050000
2.794433 0.934211 0.050000
2.804604 0.934211 0.050000
2.814686 0.934211 0.040000
2.824612 0.934211 0.040000
2.834922 0.934211 0.040000
2.844300 0.934211 0.040000
2.854607 0.934211 0.040000
2.864493 0.934211 0.040000
2.874392 0.934211 0.040000
2.884701 0.934211 0.040000
2.894517 0.934211 0.040000
2.904290 0.934211 0.050000
2.914332 0.934211 0.050000
2.924772 0.934211 0.050000
2.934597 0.934211 0.050000
2.944456 0.934211 0.050000
2.954562 0.934211 0.050000
2.964704 0.934211 0.050000
2.974620 0.934211 0.050000
2.984465 0.934211 0.050000
2.994319 0.934211 0.050000
3.004390 0.934211 0.040000
3.014344 0.934211 0.040000
3.024312 0.934211 0.040000
3.034637 0.934211 0.040000
3.044246 0.934211 0.030000
3.054345 0.934211 0.030000
3.064373 0.934211 0.030000
3.074297 0.934211 0.030000
3.084335 0.934211 0.030000
3.094885 0.934211 0.040000
3.104426 0.934211 0.040000
3.114565 0.934211 0.040000
