> New Client: 100.66.66.2
// object=GV5030
// time position forceZ torqueZ
0 0.199993 -0.152829 0.003739
0.048 0.200008 0.085931 0.00388
0.098 0.199982 0.282358 0.01211
0.148 0.199931 0.161057 0.010105
0.198 0.199765 0.103702 0.000734
0.248 0.199467 0.046825 0.006447
0.298 0.199023 -0.136407 -0.001513
0.348 0.198489 0.238296 0.007661
0.398 0.19805 -0.104601 0.005145
0.448 0.1975 0.062928 0.006012
0.498 0.1969 0.290585 0.006124
0.548 0.196296 -0.025675 -0.005374
0.598 0.195626 -0.014696 0.009464
0.648 0.194896 0.063588 0.004037
0.698 0.194109 -0.130028 0.014597
0.748 0.193073 0.155379 0.011866
0.798 0.192141 0.294782 0.006844
0.848 0.191082 -0.065599 0.011202
0.898 0.189951 0.27245 0.004263
0.948 0.188872 0.07526 0.00899
0.998 0.18783 -0.011435 0.005273
1.048 0.186537 -0.187737 0.007683
1.098 0.185139 -0.09937 0.013166
1.148 0.18375 0.036489 0.003528
1.198 0.18232 -0.075579 0.011052
1.248 0.180823 -0.037576 0.007104
1.298 0.17932 -0.010454 0.016066
1.348 0.177619 -0.082211 0.021721
1.398 0.176 -0.007014 0.014954
1.448 0.174228 -0.211578 0.023811
1.498 0.172332 -0.009574 0.115891
1.548 0.170577 -0.272857 0.106937
1.598 0.16865 -0.428795 0.09544
1.648 0.166603 0.004588 0.094785
1.698 0.164573 0.050518 0.082704
1.748 0.162571 -0.215482 0.090048
1.798 0.160329 -0.207724 0.078328
1.848 0.158083 -0.266407 0.08239
1.898 0.155913 0.029163 0.073503
1.948 0.153454 -0.007823 0.075743
1.998 0.151037 -0.00562 0.083735
2.048 0.148625 0.130412 0.08018
2.098 0.146039 0.073112 0.089619
2.148 0.143508 0.056156 0.082263
2.198 0.140859 0.189451 0.085614
2.248 0.138288 -0.253406 0.075913
2.298 0.135445 0.416343 0.085188
2.348 0.132679 0.167366 0.092395
2.398 0.129744 0.212818 0.0971
2.448 0.126816 0.022657 0.189797
2.498 0.123919 -0.126052 0.18278
2.548 0.120875 0.072243 0.16646
2.598 0.118011 0.093867 0.16294
2.648 0.115125 0.402935 0.166736
2.698 0.112334 -0.172849 0.154394
2.748 0.109702 -0.236764 0.155181
2.798 0.106962 0.369683 0.156057
2.848 0.10442 -0.162342 0.149755
2.898 0.10184 -0.379204 0.146186
2.948 0.09932 -0.126913 0.159585
2.998 0.097028 -0.240477 0.161618
3.048 0.094565 -0.156961 0.15758
3.098 0.092305 -0.300032 0.161377
3.148 0.09014 -0.176955 0.162607
3.198 0.087846 0.028519 0.165311
3.248 0.085906 -0.691719 0.185217
3.298 0.08376 -0.201607 0.252108
3.348 0.081772 -1.270882 0.242689
3.398 0.080305 -12.998697 0.233129
3.448 0.078789 -27.371316 0.219943
3.498 0.077087 -37.814003 0.221168
3.548 0.075164 -45.040133 0.215431
3.598 0.073225 -49.183805 0.217808
3.648 0.071281 -51.335502 0.241627
3.698 0.069789 -50.412334 0.215956
3.748 0.068354 -51.711075 0.206687
3.798 0.0669 -53.734134 0.206924
3.848 0.065504 -55.120658 0.197888
3.898 0.064244 -56.41425 0.207041
3.948 0.062873 -59.040701 0.206113
3.998 0.061696 -60.680899 0.199371
4.048 0.060597 -61.559549 0.19807
4.098 0.059589 -64.206482 0.196518
4.148 0.058624 -66.196493 0.196606
4.198 0.057653 -68.637944 0.202499
4.248 0.056697 -71.705503 0.216846
4.298 0.055789 -75.310179 0.215816
4.348 0.055007 -77.243198 0.196186
4.398 0.054396 -79.575061 0.203524
4.448 0.053785 -81.183551 0.201421
4.498 0.053255 -83.54811 0.219312
> Client closed conection.
> New Client: 100.66.66.2
// object=GV5040
// time position forceZ torqueZ
0 0.199992 0.124537 -0.00051
0.048 0.200002 -0.067023 0.004671
0.098 0.199978 0.281495 -0.00014
0.148 0.199922 -0.034681 -0.00055
0.198 0.199764 0.287227 0.010005
0.248 0.199451 0.011621 -0.002044
0.298 0.199018 0.271412 -0.007596
0.348 0.198516 0.311904 -0.005608
0.398 0.198061 0.126923 -0.001297
0.448 0.197458 0.379654 -0.003309
0.498 0.196848 0.064512 -0.002878
0.548 0.196328 0.257698 -0.001318
0.598 0.195604 0.117544 -0.00914
0.648 0.194895 0.166817 0.005449
0.698 0.194078 0.3601 0.002873
0.748 0.193117 0.532159 0.00321
0.798 0.192125 0.463796 0.002377
0.848 0.191109 0.244904 0.008966
0.898 0.189954 0.396637 -0.013645
0.948 0.188879 0.463453 0.008243
0.998 0.187837 0.193606 0.00453
1.048 0.186547 0.192125 0.000132
1.098 0.185111 0.171161 0.003416
1.148 0.183735 0.497229 0.001741
1.198 0.182313 0.260171 -0.000948
1.248 0.180821 0.265965 0.0059
1.298 0.179258 -0.010433 0.011358
1.348 0.177659 0.175985 0.008988
1.398 0.176027 0.291386 0.007346
1.448 0.174254 0.284185 0.013289
1.498 0.172364 0.307321 0.105156
1.548 0.170545 0.207968 0.08777
1.598 0.168676 0.492086 0.094404
1.648 0.166568 0.33851 0.085321
1.698 0.164584 0.439047 0.083986
1.748 0.162548 -0.204208 0.064583
1.798 0.160358 0.327577 0.072161
1.848 0.158085 0.133345 0.070456
1.898 0.155865 0.172311 0.063992
1.948 0.153436 0.055135 0.063302
1.998 0.151061 0.030406 0.069886
2.048 0.148624 0.570468 0.072439
2.098 0.146033 0.358342 0.074245
2.148 0.143471 0.041864 0.071097
2.198 0.140818 0.051577 0.068193
2.248 0.138283 -0.057138 0.069299
2.298 0.135414 0.275122 0.082874
2.348 0.132624 0.223538 0.078449
2.398 0.129752 0.06445 0.097793
2.448 0.126842 -0.248153 0.176173
2.498 0.123867 0.086598 0.172722
2.548 0.12087 0.182395 0.152047
2.598 0.117938 -0.21615 0.152433
2.648 0.115136 -0.116571 0.156105
2.698 0.112271 0.191193 0.151503
2.748 0.109641 -0.251874 0.139069
2.798 0.106934 0.142195 0.141435
2.848 0.104403 -0.055966 0.141026
2.898 0.10192 0.032608 0.140717
2.948 0.099313 0.325197 0.137092
2.998 0.097006 0.147284 0.156072
3.048 0.094536 0.398172 0.15721
3.098 0.092288 0.335184 0.146784
3.148 0.09018 -0.116734 0.160366
3.198 0.087825 0.11901 0.169468
3.248 0.085926 -0.047854 0.172585
3.298 0.08376 0.497847 0.231001
3.348 0.081722 0.375192 0.234694
3.398 0.080007 -11.743973 0.234086
3.448 0.078962 -30.623706 0.189753
3.498 0.077637 -58.077493 0.121479
3.548 0.076297 -90.488471 0.091177
> Client closed conection.
