// Time Position Current 
0.004108 0.000000 0.000000
0.014671 0.000000 0.000000
0.024572 0.000000 0.000000
0.034466 0.000000 0.000000
0.044744 0.000000 0.000000
0.054853 0.000000 0.000000
0.064474 0.000000 0.000000
0.074368 0.000000 0.000000
0.085086 0.000000 0.000000
0.095005 0.000000 0.000000
0.104339 0.000000 0.000000
0.114243 0.000000 0.000000
0.124645 0.000000 0.000000
0.134206 0.000000 0.000000
0.144853 0.000000 0.000000
0.154899 0.000000 0.000000
0.164672 0.000000 0.000000
0.174469 0.004386 0.000000
0.184570 0.004386 0.000000
0.194368 0.004386 0.000000
0.204397 0.004386 0.000000
0.214431 0.004386 0.000000
0.224447 0.004386 0.000000
0.234450 0.004386 0.000000
0.244390 0.004386 0.000000
0.254955 0.004386 0.000000
0.264400 0.004386 0.000000
0.274773 0.004386 0.000000
0.284635 0.004386 0.000000
0.294304 0.004386 0.000000
0.305137 0.004386 0.000000
0.314967 0.004386 0.000000
0.324283 0.004386 0.000000
0.334572 0.004386 0.000000
0.344281 0.004386 0.000000
0.354865 0.004386 0.000000
0.364939 0.004386 0.000000
0.374804 0.004386 0.000000
0.384475 0.004386 0.000000
0.394210 0.004386 0.000000
0.404196 0.004386 0.000000
0.414548 0.004386 0.000000
0.424453 0.004386 0.000000
0.434729 0.004386 0.000000
0.444271 0.004386 0.000000
0.454220 0.004386 0.000000
0.465036 0.004386 0.000000
0.474356 0.004386 0.000000
0.484258 0.004386 0.000000
0.494490 0.004386 0.000000
0.504259 0.004386 0.000000
0.514347 0.004386 0.000000
0.524821 0.004386 0.000000
0.534636 0.004386 0.000000
0.544409 0.004386 0.000000
0.554322 0.004386 0.000000
0.564233 0.004386 0.000000
0.574457 0.004386 0.000000
0.584248 0.004386 0.000000
0.594403 0.004386 0.000000
0.604634 0.004386 0.000000
0.615057 0.004386 0.000000
0.624394 0.004386 0.000000
0.634583 0.004386 0.000000
0.644474 0.004386 0.000000
0.654346 0.004386 0.000000
0.664412 0.004386 0.000000
0.674956 0.004386 0.000000
0.684632 0.004386 0.000000
0.694359 0.004386 0.000000
0.705156 0.004386 0.000000
0.715026 0.004386 0.000000
0.724247 0.004386 0.000000
0.734663 0.004386 0.000000
0.744478 0.004386 0.000000
0.754192 0.004386 0.000000
0.765011 0.004386 0.000000
0.774289 0.004386 0.000000
0.784585 0.004386 0.000000
0.794385 0.004386 0.000000
0.804263 0.004386 0.000000
0.815005 0.004386 0.000000
0.824726 0.004386 0.000000
0.834671 0.004386 0.000000
0.844394 0.004386 0.000000
0.854291 0.004386 0.000000
0.865115 0.004386 0.000000
0.874283 0.004386 0.000000
0.884238 0.004386 0.000000
0.894870 0.004386 0.000000
0.904716 0.004386 0.000000
0.914437 0.004386 0.000000
0.924313 0.004386 0.000000
0.935037 0.004386 0.000000
0.944337 0.004386 0.000000
0.954509 0.004386 0.000000
0.964537 0.004386 0.000000
0.974247 0.004386 0.000000
0.985013 0.004386 0.000000
0.994895 0.004386 0.000000
1.004625 0.004386 0.000000
1.014364 0.004386 0.000000
1.025302 0.004386 0.000000
1.034205 0.004386 0.000000
1.044806 0.004386 0.000000
1.054581 0.004386 0.000000
1.064489 0.004386 0.370000
1.074302 0.004386 0.370000
1.084736 0.004386 0.370000
1.094228 0.004386 0.370000
1.104322 0.004386 0.370000
1.115063 0.035088 0.260000
1.124939 0.035088 0.260000
1.134388 0.035088 0.260000
1.144513 0.035088 0.260000
1.154394 0.035088 0.260000
1.164307 0.105263 0.160000
1.174851 0.105263 0.160000
1.184246 0.105263 0.160000
1.194333 0.105263 0.160000
1.204240 0.166667 0.250000
1.214329 0.166667 0.250000
1.224213 0.166667 0.250000
1.234772 0.166667 0.250000
1.244708 0.254386 0.190000
1.254906 0.254386 0.190000
1.264473 0.254386 0.190000
1.275017 0.254386 0.190000
1.284658 0.254386 0.190000
1.294464 0.342105 0.000000
1.304430 0.342105 0.000000
1.314203 0.342105 0.000000
1.324846 0.342105 0.000000
1.334719 0.342105 0.000000
1.344872 0.407895 0.130000
1.354609 0.407895 0.130000
1.364408 0.407895 0.130000
1.374278 0.407895 0.130000
1.384861 0.473684 0.110000
1.394783 0.473684 0.110000
1.404665 0.473684 0.110000
1.414490 0.473684 0.110000
1.425165 0.561404 0.050000
1.435133 0.561404 0.050000
1.444251 0.561404 0.050000
1.454524 0.561404 0.050000
1.464483 0.561404 0.050000
1.474631 0.644737 0.100000
1.484955 0.644737 0.100000
1.494817 0.644737 0.100000
1.504532 0.644737 0.100000
1.514320 0.644737 0.100000
1.525109 0.701754 0.170000
1.534920 0.701754 0.170000
1.544726 0.701754 0.170000
1.554585 0.701754 0.170000
1.564715 0.771930 0.230000
1.574430 0.771930 0.230000
1.584236 0.771930 0.230000
1.594205 0.771930 0.230000
1.604306 0.824561 0.330000
1.614328 0.824561 0.330000
1.624378 0.824561 0.330000
1.634216 0.824561 0.330000
1.644488 0.824561 0.330000
1.654902 0.890351 0.360000
1.664614 0.890351 0.360000
1.674400 0.890351 0.360000
1.684288 0.890351 0.360000
1.694690 0.890351 0.360000
1.704787 0.947368 0.560000
1.714612 0.947368 0.560000
1.724330 0.947368 0.560000
1.734395 0.947368 0.560000
1.744796 0.956140 0.830000
1.754516 0.956140 0.830000
1.764349 0.956140 0.830000
1.774217 0.956140 0.830000
1.784183 0.956140 0.830000
1.794967 0.956140 1.000000
1.804822 0.956140 1.000000
1.814380 0.956140 1.000000
1.824378 0.956140 1.000000
1.834249 0.956140 0.040000
1.844671 0.956140 0.040000
1.854564 0.956140 0.040000
1.864266 0.956140 0.040000
1.874423 0.956140 0.040000
1.885048 0.956140 0.040000
1.894256 0.956140 0.040000
1.904691 0.956140 0.040000
1.914218 0.956140 0.040000
1.924271 0.956140 0.040000
1.934293 0.956140 0.040000
1.944994 0.956140 0.040000
1.954751 0.956140 0.040000
1.964570 0.956140 0.040000
1.974228 0.956140 0.040000
1.984657 0.956140 0.040000
1.994535 0.956140 0.040000
2.004486 0.956140 0.040000
2.014276 0.956140 0.040000
2.025161 0.956140 0.040000
2.034781 0.956140 0.040000
2.044220 0.956140 0.040000
2.054557 0.956140 0.050000
2.064309 0.956140 0.050000
2.075036 0.956140 0.050000
2.084872 0.956140 0.050000
2.094655 0.956140 0.050000
2.104324 0.956140 0.050000
2.114242 0.956140 0.050000
2.125111 0.956140 0.050000
2.134767 0.956140 0.050000
2.144222 0.956140 0.040000
2.154512 0.956140 0.040000
2.164224 0.956140 0.040000
2.174265 0.956140 0.040000
2.184472 0.956140 0.040000
2.194183 0.956140 0.040000
2.205055 0.956140 0.040000
2.214939 0.956140 0.040000
2.224432 0.956140 0.040000
2.234455 0.956140 0.040000
2.244340 0.956140 0.050000
2.255041 0.956140 0.050000
2.264854 0.956140 0.050000
2.274719 0.956140 0.050000
2.284459 0.956140 0.060000
2.294243 0.956140 0.060000
2.304836 0.956140 0.060000
2.314734 0.956140 0.060000
2.324331 0.956140 0.040000
2.334252 0.956140 0.040000
2.344992 0.956140 0.040000
2.354429 0.956140 0.040000
2.364287 0.956140 0.040000
2.374400 0.956140 0.050000
2.384213 0.956140 0.050000
2.394201 0.956140 0.050000
2.404514 0.956140 0.050000
2.414867 0.956140 0.030000
2.424679 0.956140 0.030000
2.434536 0.956140 0.030000
