> New Client: 100.66.66.2
// object=RP2440
// time position forceZ torqueZ
0 0.199998 0.039872 0.013431
0.048 0.200016 -0.101608 0.001868
0.098 0.200043 0.09896 0.002214
0.148 0.199959 0.005782 0.013009
0.198 0.199759 0.119011 0.002356
0.248 0.199337 0.073192 0.00201
0.298 0.198762 0.208283 0.002075
0.348 0.198165 -0.186194 0.006305
0.398 0.197707 -0.01959 0.002753
0.448 0.197068 -0.08497 0.008509
0.498 0.196231 0.140325 0.006386
0.548 0.195383 0.030297 0.060614
0.598 0.194497 -0.265368 0.057146
0.648 0.193452 -0.25682 0.054331
0.698 0.192556 -0.134537 0.047581
0.748 0.191425 0.011466 0.045758
0.798 0.190254 -0.117093 0.050403
0.848 0.18886 0.267849 0.044613
0.898 0.187524 0.102146 0.03754
0.948 0.186124 0.036701 0.02858
0.998 0.184588 0.074258 0.038731
1.048 0.182953 -0.088331 0.038668
1.098 0.18133 -0.318014 0.030283
1.148 0.179476 0.244509 0.044639
1.198 0.177756 -0.122196 0.034716
1.248 0.17584 0.029379 0.032621
1.298 0.173794 0.235773 0.038914
1.348 0.171958 -0.211207 0.047088
1.398 0.169754 0.22711 0.042419
1.448 0.167709 -0.060584 0.042828
1.498 0.165878 -0.001018 0.044507
1.548 0.163801 0.018171 0.042881
1.598 0.16166 -0.202512 0.047911
1.648 0.159756 -0.408817 0.044677
1.698 0.157722 0.090995 0.092458
1.748 0.155685 0.060183 0.131431
1.798 0.153647 0.231266 0.124223
1.848 0.151619 0.182738 0.125234
1.898 0.149617 -0.137386 0.112086
1.948 0.147505 0.103074 0.122575
1.998 0.145592 -0.256495 0.11725
2.048 0.14355 -0.098876 0.102916
2.098 0.14151 -0.118062 0.112042
2.148 0.13956 -0.261499 0.104941
2.198 0.137405 -0.18568 0.106723
2.248 0.135375 -0.021137 0.100128
2.298 0.133534 -0.382709 0.107903
2.348 0.131405 0.116907 0.112707
2.398 0.12934 0.222951 0.114921
2.448 0.12747 -0.271029 0.114095
2.498 0.125452 -0.310192 0.113238
2.548 0.12328 0.23682 0.132211
2.598 0.121349 -0.017864 0.12444
2.648 0.11936 -0.238653 0.130374
2.698 0.117242 -0.030005 0.133696
2.748 0.115247 0.069846 0.143398
2.798 0.113224 0.170041 0.220653
2.848 0.111149 0.250526 0.204427
2.898 0.109225 -0.205306 0.196605
2.948 0.107072 0.127972 0.201147
2.998 0.105146 -0.181083 0.197803
3.048 0.103188 -0.143531 0.177646
3.098 0.101031 -0.067943 0.189546
3.148 0.099028 -0.047582 0.181268
3.198 0.097088 -0.053328 0.177931
3.248 0.095066 0.05996 0.174991
3.298 0.093047 -0.291971 0.177122
3.348 0.090972 -0.187392 0.185205
3.398 0.088958 -0.091085 0.184956
3.448 0.086996 -0.055624 0.173736
3.498 0.08488 -0.20968 0.186173
3.548 0.082954 -0.095713 0.177706
3.598 0.081221 -14.702039 0.176301
3.648 0.079817 -34.422634 0.192648
3.698 0.078017 -49.68978 0.201972
3.748 0.075731 -55.551202 0.189887
3.798 0.073333 -59.291861 0.197329
3.848 0.071105 -62.401239 0.205401
3.898 0.069525 -64.964191 0.289751
3.948 0.067914 -68.819082 0.27826
3.998 0.066274 -71.897033 0.287761
4.048 0.06473 -74.791924 0.278588
4.098 0.063237 -78.877179 0.26803
4.148 0.061679 -83.324021 0.261127
4.198 0.060742 -84.180029 0.262495
4.248 0.060826 -78.231079 0.266898
4.298 0.060772 -77.944065 0.265337
4.348 0.060732 -77.225008 0.247402
4.398 0.060754 -76.67195 0.264572
4.448 0.060668 -76.022995 0.25329
4.498 0.060656 -76.577118 0.252462
4.548 0.060683 -75.638143 0.246186
4.598 0.060626 -75.372368 0.253435
4.648 0.06064 -74.938361 0.249402
4.698 0.060659 -74.465725 0.252355
4.748 0.060599 -74.180731 0.249932
4.798 0.06058 -74.215542 0.243777
4.848 0.060623 -73.67746 0.249649
4.898 0.060573 -73.407676 0.25016
4.948 0.060578 -73.469104 0.245775
4.998 0.060584 -72.97921 0.248574
5.048 0.060594 -72.758288 0.238935
5.098 0.060594 -72.770651 0.244581
5.148 0.060586 -72.593005 0.242245
5.198 0.060575 -72.516416 0.243399
5.248 0.060688 -71.510821 0.225303
5.298 0.06127 -65.140986 0.223457
5.348 0.062255 -56.768582 0.224637
5.398 0.063799 -46.748272 0.160907
5.448 0.065687 -37.298389 0.159062
5.498 0.068149 -29.418686 0.166001
5.548 0.071233 -22.075911 0.16597
5.598 0.074713 -16.275024 0.169288
5.648 0.078642 -9.00338 0.166789
5.698 0.08233 -0.660069 0.175362
5.748 0.087147 -1.277921 0.173739
5.798 0.092227 -1.507936 0.171348
5.848 0.097036 -1.291806 0.176932
5.898 0.101951 -1.705424 0.163666
5.948 0.106646 -1.139605 0.163301
5.998 0.111474 -1.424923 0.163927
6.048 0.116314 -1.473602 0.147933
6.098 0.12101 -0.922213 0.137911
6.148 0.125846 -0.892978 0.069984
6.198 0.130596 -0.829787 0.07508
6.248 0.135457 -0.575947 0.077573
6.298 0.140259 -0.873135 0.077955
6.348 0.145049 -1.030063 0.069952
6.398 0.149827 -0.736313 0.067551
6.448 0.154609 -0.801916 0.060316
6.498 0.159367 -0.838568 -0.018122
6.548 0.164087 -0.95324 -0.005493
6.598 0.168916 -1.007728 -0.002183
6.648 0.173677 -0.842463 -0.00058
6.698 0.178357 -0.658655 0.002978
6.748 0.182482 -0.482393 0.000919
6.798 0.186187 -0.566965 0.005359
6.848 0.189433 -0.60059 0.004631
6.898 0.192254 -0.683079 -0.000909
6.948 0.194671 -0.661564 -0.10581
6.998 0.196495 -0.668061 -0.097632
7.048 0.198166 -0.705386 -0.072666
7.098 0.199207 -0.778664 -0.072424
7.148 0.199668 -0.500113 -0.07515
7.198 0.199733 -0.363477 -0.067848
7.248 0.1997 -0.259616 -0.050651
7.298 0.199753 -0.587564 -0.032161
7.348 0.199813 -0.551821 0.008751
7.398 0.199952 -0.464677 0.005614
7.448 0.199991 -0.339835 0.006067
7.498 0.200023 -0.594217 -0.016679
7.548 0.200025 -0.324784 -0.006603
7.598 0.200014 -0.460696 -0.07674
7.648 0.199997 -0.440339 -0.060126
7.698 0.2 -0.554917 -0.064805
7.748 0.199961 -0.559752 -0.066872
7.798 0.200034 -0.231555 -0.054841
7.848 0.200015 -0.604547 -0.054142
7.898 0.20002 -0.698656 -0.048576
7.948 0.200012 -0.691488 0.014994
7.998 0.200034 -0.907473 0.005849
8.048 0.200012 -0.712034 -0.002658
8.098 0.199996 -0.746601 -0.003935
8.148 0.200004 -0.662393 -0.011768
8.198 0.200018 -0.797643 -0.00332
8.248 0.200023 -0.613177 -0.075735
8.298 0.200025 -0.486222 -0.068759
8.348 0.200041 -0.68862 -0.071342
8.398 0.200022 -0.529639 -0.056406
8.448 0.2 -0.373853 -0.054204
8.498 0.199995 -0.55029 -0.040784
8.548 0.2 -0.619429 0.018284
8.598 0.200031 -0.690129 0.005171
8.648 0.199988 -0.439003 0.012469
8.698 0.200041 -0.502734 0.00067
8.748 0.20003 -0.742561 0.002406
8.798 0.200021 -0.405143 0.001071
8.848 0.200022 -0.337117 -0.002246
8.898 0.200017 -0.556672 -0.004528
8.948 0.199998 0.047575 -0.000391
8.998 0.200034 -0.329513 -0.008644
9.048 0.199974 0.11571 -0.024267
9.098 0.200018 -0.205398 -0.072309
9.148 0.2 -0.196731 -0.065078
9.198 0.200046 -0.400832 -0.057103
9.248 0.199988 -0.136721 -0.057591
9.298 0.200032 -0.136905 0.022361
9.348 0.199968 -0.383658 -0.000248
9.398 0.200008 -0.304511 0.010932
9.448 0.200046 -0.03547 -0.006953
9.498 0.200006 -0.205042 0.004701
9.548 0.199966 -0.38479 -0.00427
9.598 0.20004 -0.458806 0.002767
9.648 0.199979 -0.483334 0.004843
9.698 0.200011 -0.261387 -0.013817
9.748 0.200012 -0.399294 -0.004829
9.798 0.2 -0.223736 -0.003562
9.848 0.199991 -0.428631 0.006115
9.898 0.200013 -0.478336 -0.012756
9.948 0.20003 -0.259515 0.00013
9.998 0.200014 -0.072003 -0.003258
10.048 0.199998 -0.512419 0.002368
10.098 0.200005 -0.211582 -0.00563
10.148 0.200018 -0.128512 0.003682
> Client closed conection.
