> New Client: 100.66.66.2
// object=RL4040
//index measure_width grip_force
1 117.4 25
2 118.5 25
3 116.9 25
4 115.5 25
5 115.1 25
6 114.2 25
7 114.4 25
8 111.6 25
9 111.1 25
10 111.1 25
11 109.7 25
12 108.5 25
13 106.5 25
14 105.5 25
15 105 25
16 105.8 25
17 104.5 25
18 103.3 25
19 102 25
20 98.9 25
21 100 25
22 97.6 25
23 96 25
24 95.5 25
25 96.3 25
26 94.4 25
27 92.8 25
28 93.1 25
29 91.8 25
30 88.8 25
31 89.6 25
32 89 25
33 89 25
34 86.8 25
35 84.9 25
36 84 25
37 83.7 25
38 82.6 25
39 81.2 25
40 81.7 25
41 79.2 25
42 79.2 25
43 77.1 25
44 78 25
45 76.6 25
46 75.4 25
47 73.6 25
48 72.2 25
49 70.1 25
50 70.4 25
51 71 25
52 67.4 25
53 66.2 25
54 66.2 25
55 65.9 25
56 63.8 25
57 61.9 25
58 64.4 25
59 62.8 25
60 61.6 25
61 59.5 25
62 58.6 25
63 56.4 25
64 57 25
65 55.1 25
66 53.6 25
67 52 25
68 53 25
69 53 25
70 51.4 25
71 51.1 25
72 49.5 25
73 48.9 25
74 48.2 25
75 47 25
76 45.4 25
77 43.5 25
78 41.9 25
79 40.9 25
80 40.3 25
81 40.6 25
82 39 25
83 39 25
84 35.4 25
85 36.1 25
86 36.7 25
87 34.8 25
88 33.8 25
89 33.5 26
90 31.2 26
91 31.2 27
92 31.2 27
93 30.2 28
94 30.2 29
95 28.3 29
96 29.9 30
97 28.6 31
98 27.9 31
99 27.6 32
100 27 33
101 27.3 34
102 28.3 35
103 28.9 35
104 28.3 36
105 27.3 37
106 27.3 37
107 26.6 38
108 25.6 38
109 24 39
110 25.6 39
111 24 40
112 25.3 40
113 23.3 41
114 25 42
115 24.3 42
116 22.4 43
117 22.7 43
118 21.4 44
119 20.4 45
120 20.4 45
121 19.7 46
122 20.4 47
123 20.7 48
124 21 49
125 19.7 50
126 21.4 50
127 21 51
128 19.1 51
129 19.4 52
130 16.8 53
131 17.4 54
132 16.8 55
133 18.4 55
134 16.4 55
135 15.1 55
136 16.8 56
137 17.1 57
138 16.4 57
139 13.4 58
140 14.4 59
141 14.4 60
142 15.1 61
143 13.8 62
144 14.8 63
145 14.8 64
146 13.1 65
147 16.4 66
148 16.1 67
149 13.1 67
150 12.5 68
151 12.5 69
152 12.1 70
153 14.4 71
154 14.4 72
155 13.1 72
156 12.8 73
157 11.8 74
158 11.8 75
159 14.4 76
160 12.5 77
161 12.8 78
162 12.5 79
163 11.8 80
164 15.4 81
165 13.4 81
166 10.8 82
167 10.5 83
168 11.5 84
169 11.8 85
170 13.4 86
171 13.4 87
172 13.4 88
173 13.4 88
174 10.1 89
175 9.5 90
176 12.5 91
177 9.8 92
178 9.1 93
179 10.1 94
180 9.5 95
181 11.5 96
182 9.1 97
183 8.8 98
184 8.5 99
185 10.1 100
186 11.1 101
187 10.8 102
188 11.8 103
189 12.5 104
190 11.8 105
191 9.1 105
192 10.8 106
193 9.5 107
194 10.1 108
195 9.1 109
196 9.8 110
197 11.5 111
198 9.1 112
199 8.5 113
200 9.5 114
201 10.1 115
202 11.5 116
203 9.5 117
204 9.1 118
205 9.5 119
206 9.8 120
> Client closed conection.
