//index measure_width grip_force
1 116.9 25
2 117.1 25
3 117.1 25
4 116 25
5 115.5 25
6 114.9 25
7 113.2 25
8 112.3 25
9 110.9 25
10 111.6 25
11 108.5 25
12 108.5 25
13 108.2 25
14 105 25
15 105.3 25
16 106 25
17 104.3 25
18 102.3 25
19 100.2 25
20 100 25
21 98.1 25
22 98.7 25
23 96.8 25
24 96.8 25
25 95.2 25
26 94.7 25
27 93.6 25
28 92.8 25
29 92 25
30 89.9 25
31 91.5 25
32 86.3 25
33 87.6 25
34 85.7 25
35 84.9 25
36 84 25
37 84.9 25
38 81.5 25
39 80.6 25
40 79.7 25
41 80.6 25
42 79.5 25
43 75.7 25
44 76.9 25
45 75.1 25
46 75.4 25
47 71.6 25
48 72.5 25
49 70.7 25
50 69.5 25
51 71.3 25
52 68.6 25
53 67.4 25
54 66.2 25
55 64.1 25
56 64.4 25
57 63.5 25
58 64.4 25
59 62.2 25
60 59.5 25
61 61 25
62 59.8 25
63 57.9 25
64 56.7 25
65 56.7 25
66 56.1 25
67 51.7 25
68 52.3 25
69 50.1 25
70 50.8 25
71 49.5 25
72 49.8 25
73 48.6 25
74 47.3 25
75 46 25
76 44.1 25
77 41.9 25
78 43.5 25
79 40.3 25
80 40.6 25
81 40.9 25
82 37.4 25
83 38 25
84 37.4 25
85 35.4 25
86 34.4 25
87 34.4 25
88 35.1 25
89 32.2 25
90 31.9 25
91 31.9 25
92 28.3 25
93 27.9 25
94 27 25
95 27 26
96 25.3 26
97 25.6 27
98 24.7 27
99 25.6 27
100 23.7 27
101 23.3 28
102 23 28
103 22.4 28
104 21 29
105 21 29
106 20.4 30
107 19.1 31
108 17.4 31
109 18.4 32
110 17.1 33
111 16.8 34
112 15.8 35
113 18.4 35
114 17.4 35
115 15.1 35
116 15.1 36
117 16.4 36
118 14.8 37
119 13.8 38
120 12.5 38
121 12.8 39
122 12.1 40
123 13.4 41
124 12.8 41
125 13.8 42
126 12.5 43
127 12.8 44
128 12.1 45
129 12.5 45
130 10.8 46
131 11.8 46
132 9.1 47
133 9.5 48
134 9.1 49
135 8.8 50
136 11.1 51
137 10.5 52
138 9.8 52
139 10.1 53
140 9.1 54
141 9.5 55
142 10.1 56
143 8.8 57
144 9.5 58
145 9.5 58
146 8.5 59
147 7.8 60
148 9.5 61
149 7.1 62
150 7.5 63
151 8.1 64
152 8.5 65
153 9.1 66
154 10.1 67
155 7.5 67
156 8.5 68
157 7.1 69
158 7.1 70
159 8.8 71
160 8.8 72
161 6.8 73
162 7.5 74
163 7.5 75
164 10.5 76
165 7.8 77
166 8.8 78
167 8.5 79
168 6.5 80
169 8.5 80
170 6.5 81
171 6.1 82
172 6.5 83
173 5.5 84
174 6.5 85
175 7.1 86
176 6.1 87
177 6.5 88
178 6.1 89
179 6.1 90
180 7.5 91
181 5.2 92
182 6.5 93
183 7.5 94
184 7.5 95
185 8.5 96
186 6.8 97
187 7.5 98
188 6.5 99
189 4.8 99
190 4.8 100
191 6.1 101
192 4.5 102
193 4.5 103
194 4.8 104
195 5.5 105
196 6.5 106
197 4.5 107
198 4.8 108
199 4.5 109
200 5.2 110
201 6.1 111
202 4.5 112
203 4.5 113
204 4.5 114
205 4.5 115
206 6.8 116
207 5.2 117
208 4.8 118
209 4.8 119
210 4.8 120