> New Client: 100.66.66.2
// object=whitedice
// time position forceZ torqueZ
0 0.199989 -0.189815 -0.010304
0.048 0.19998 -0.075728 -0.005784
0.098 0.199985 0.178727 -0.00331
0.148 0.199951 -0.004818 -0.009006
0.198 0.199651 0.043943 -0.002573
0.248 0.199228 0.213114 -0.012961
0.298 0.198679 0.249774 -0.001226
0.348 0.198134 0.015253 -0.010394
0.398 0.197623 0.236675 -0.00071
0.448 0.196944 0.021713 -0.005164
0.498 0.19611 -0.015379 0.001399
0.548 0.195275 -0.132649 -0.003096
0.598 0.194343 -0.228716 -0.007061
0.648 0.193335 0.081732 -0.00081
0.698 0.192419 -0.128824 -0.005906
0.748 0.191324 0.105482 -0.008749
0.798 0.190141 0.003502 -0.002565
0.848 0.188684 0.194596 0.000119
0.898 0.187339 0.08218 0.001561
0.948 0.185952 0.140115 0.001333
0.998 0.184453 0.152867 -0.000337
1.048 0.182765 0.284393 0.002935
1.098 0.181112 -0.08369 0.002406
1.148 0.179222 0.192681 0.004477
1.198 0.177472 0.097505 0.014352
1.248 0.175616 -0.164792 0.077012
1.298 0.173556 0.112939 0.066748
1.348 0.171705 -0.313025 0.06861
1.398 0.169471 -0.161211 0.055146
1.448 0.167514 -0.075765 0.066101
1.498 0.165668 -0.400157 0.070593
1.548 0.163503 -0.227018 0.045011
1.598 0.161427 0.180306 0.058779
1.648 0.159497 0.061693 0.060751
1.698 0.157462 0.236147 0.058799
1.748 0.155458 -0.072394 0.058255
1.798 0.153392 0.289834 0.053083
1.848 0.151375 0.353063 0.052733
1.898 0.149352 0.140262 0.059923
1.948 0.147245 -0.068914 0.055388
1.998 0.145319 -0.026819 0.061982
2.048 0.143223 -0.274368 0.059214
2.098 0.141261 0.059723 0.068302
2.148 0.139298 -0.185751 0.060426
2.198 0.137151 -0.063298 0.075368
2.248 0.135121 0.050942 0.097888
2.298 0.133238 -0.199131 0.136062
2.348 0.131157 -0.193627 0.134277
2.398 0.129041 0.030984 0.126289
2.448 0.127235 -0.148244 0.128548
2.498 0.125201 -0.239173 0.12738
2.548 0.123014 0.339773 0.115481
2.598 0.121115 -0.170489 0.111839
2.648 0.119076 -0.010713 0.118226
2.698 0.117005 0.431495 0.119828
2.748 0.115007 -0.088385 0.116886
2.798 0.112973 0.111441 0.12551
2.848 0.110907 0.459753 0.118204
2.898 0.108956 0.203474 0.121413
2.948 0.106782 0.040285 0.125532
2.998 0.104919 -0.135454 0.139016
3.048 0.102915 -0.034492 0.144928
3.098 0.100896 -9.249604 0.148517
3.148 0.099444 -20.891869 0.149742
3.198 0.097731 -35.850571 0.152209
3.248 0.095841 -49.283908 0.154589
3.298 0.09378 -62.341693 0.162047
3.348 0.091416 -74.65728 0.182995
3.398 0.089242 -84.102712 0.175304
3.448 0.087285 -91.440862 0.170742
> Client closed conection.
> New Client: 100.66.66.2
// object=whitedice
// time position forceZ torqueZ
0 0.200005 -0.13899 0.005184
0.048 0.200017 0.263077 -0.002055
0.098 0.199993 -0.046094 0.001186
0.148 0.199884 -0.155623 0.001674
0.198 0.199631 0.077228 -0.008652
0.248 0.199209 0.301315 0.002513
0.298 0.19867 0.201003 -0.003527
0.348 0.198145 0.100917 -0.00124
0.398 0.197613 -0.134411 -0.003116
0.448 0.196953 0.223893 0.010476
0.498 0.196131 0.378115 0.006392
0.548 0.195318 -0.051261 0.009118
0.598 0.194374 -0.0904 -0.005452
0.648 0.193356 -0.161358 -0.004117
0.698 0.192403 -0.073866 -0.000428
0.748 0.191307 -0.138712 -0.006681
0.798 0.190119 -0.19374 0.00079
0.848 0.188695 0.090437 0.002708
0.898 0.187392 0.234466 0.007229
0.948 0.185938 0.292091 0.007143
0.998 0.184372 0.154604 0.008965
1.048 0.182786 -0.06702 0.006573
1.098 0.181145 -0.30703 0.016086
1.148 0.179261 0.133282 0.051298
1.198 0.177518 -0.078545 0.042181
1.248 0.175593 -0.240056 0.044757
1.298 0.173566 0.129876 0.051781
1.348 0.171719 -0.235886 0.047223
1.398 0.169439 0.167007 0.040154
1.448 0.167481 0.146767 0.047859
1.498 0.165657 -0.204093 0.041797
1.548 0.163533 -0.00395 0.045138
1.598 0.161425 0.058272 0.038183
1.648 0.159505 -0.084235 0.048515
1.698 0.157436 0.015673 0.039194
1.748 0.155468 0.030748 0.046462
1.798 0.153428 -0.131085 0.03792
1.848 0.151356 0.008786 0.030339
1.898 0.149358 -0.287351 0.045806
1.948 0.147224 -0.307327 0.050128
1.998 0.145328 -0.258217 0.108796
2.048 0.143274 -0.056794 0.107208
2.098 0.141275 -0.105606 0.107311
2.148 0.139306 -0.103433 0.105151
2.198 0.137151 -0.431216 0.108696
2.248 0.135144 -0.151101 0.102617
2.298 0.133302 -0.491208 0.110509
2.348 0.13115 -0.135011 0.095404
2.398 0.129077 -0.030719 0.096805
2.448 0.127238 -0.41733 0.102463
2.498 0.125191 -0.047138 0.098079
2.548 0.123031 0.129237 0.091983
2.598 0.121075 0.05058 0.096449
2.648 0.119115 0.011158 0.105895
2.698 0.117034 0.09016 0.106234
2.748 0.11502 -0.539369 0.108559
2.798 0.112907 -0.412203 0.101825
2.848 0.110916 -0.189727 0.11896
2.898 0.108921 -0.141739 0.229146
2.948 0.106866 -0.201639 0.21924
2.998 0.104921 -0.322196 0.216315
3.048 0.102912 0.044582 0.20475
3.098 0.100894 -9.042929 0.185576
3.148 0.099456 -20.795721 0.184667
3.198 0.097695 -35.637716 0.185989
3.248 0.095787 -49.092869 0.178202
3.298 0.093733 -61.975653 0.166341
3.348 0.091456 -74.003033 0.15951
3.398 0.089236 -83.134564 0.166801
3.448 0.087285 -90.6735 0.157176
3.498 0.086518 -91.325765 0.164789
3.548 0.086014 -91.830931 0.163605
3.598 0.085495 -93.671657 0.154352
3.648 0.084942 -95.705167 0.163755
3.698 0.084357 -97.417025 0.164003
> Client closed conection.
