> New Client: 100.66.66.2
0 0.219141 -0.006276
0.048 -0.046163 0.003316
0.098 -0.098907 -0.003973
0.148 0.013688 -0.000522
0.198 -0.16149 -0.016224
0.248 0.189982 -0.001392
0.298 0.040395 -0.0071
0.348 0.186502 -0.002033
0.398 -0.115382 -0.007277
0.448 -0.071999 -0.002563
0.498 0.174093 -0.002069
0.548 0.235002 -0.009962
0.598 0.137481 -0.006709
0.648 0.395488 0.004353
0.698 0.075043 -0.006825
0.748 0.292875 -0.002728
0.798 -0.201911 -0.004847
0.848 0.084208 0.004401
0.898 0.083518 0.003068
0.948 0.272742 0.00615
0.998 0.286825 0.002691
1.048 -0.015277 0.000261
1.098 0.039454 -0.000531
1.148 0.216797 0.003402
1.198 0.095101 0.005478
1.248 -0.309127 0.006524
1.298 0.141504 0.052945
1.348 0.145064 0.079493
1.398 -0.120498 0.06862
1.448 -0.180576 0.078541
1.498 0.141466 0.062487
1.548 -0.040483 0.062909
1.598 -0.094328 0.063935
1.648 -0.029553 0.067139
1.698 -0.003288 0.050074
1.748 0.029468 0.061947
1.798 -0.205341 0.060375
1.848 0.045586 0.056612
1.898 -0.310776 0.063609
1.948 -0.159488 0.054799
1.998 -0.201654 0.060354
2.048 -0.520411 0.063837
2.098 -0.15825 0.063839
2.148 -0.090353 0.054651
2.198 -0.059072 0.073418
2.248 -0.099165 0.076724
2.298 0.119863 0.140666
2.348 -0.277157 0.14305
2.398 -0.255068 0.133385
2.448 -0.09208 0.143887
2.498 -0.43257 0.13719
2.548 -0.106682 0.135159
2.598 -0.282057 0.124468
2.648 -0.029382 0.128176
2.698 -0.046211 0.12675
2.748 -0.204296 0.130896
2.798 -0.161636 0.130126
2.848 -0.045145 0.137737
2.898 -0.213216 0.20898
2.948 -7.841763 0.198476
2.998 -22.255359 0.20372
3.048 -39.753984 0.183718
3.098 -54.189736 0.187765
3.148 -66.672324 0.183952
3.198 -78.497181 0.188971
3.248 -87.496875 0.180167
> Client closed conection.
> New Client: 100.66.66.2
0 0.099176 0.00698
0.048 0.101211 0.008152
0.098 0.296456 0.013038
0.148 0.163639 0.008557
0.198 0.277816 0.009673
0.248 0.211694 0.007734
0.298 0.23391 0.012746
0.348 0.456276 0.002557
0.398 0.0366 0.010711
0.448 0.19689 0.008314
0.498 0.532668 0.00868
0.548 0.592204 0.01426
0.598 0.167866 0.010061
0.648 0.321885 0.012251
0.698 0.358958 0.014652
0.748 0.49182 0.010521
0.798 0.464296 0.013671
0.848 -0.047398 0.013001
0.898 0.186601 0.006704
0.948 0.270444 0.015422
0.998 0.181936 0.014776
1.048 0.258108 0.016364
1.098 0.106689 0.020744
1.148 -0.084571 0.019242
1.198 0.192663 0.015017
1.248 0.285352 0.021571
1.298 0.097531 0.047637
1.348 0.124907 0.090294
1.398 0.223026 0.082252
1.448 -0.050722 0.079298
1.498 -0.043632 0.075753
1.548 -0.222212 0.072761
1.598 0.042068 0.074198
1.648 0.208465 0.063003
1.698 0.517772 0.069294
1.748 -0.038316 0.076398
1.798 0.291764 0.065658
1.848 0.412649 0.069132
1.898 0.074163 0.070993
1.948 0.189509 0.070328
1.998 0.170029 0.077309
2.048 -0.175585 0.076088
2.098 0.216808 0.078435
2.148 -0.04988 0.071574
2.198 0.107827 0.088951
2.248 -0.280876 0.106175
2.298 0.363293 0.152723
2.348 -0.195871 0.155925
2.398 0.071598 0.147875
2.448 0.114596 0.14291
2.498 0.154706 0.147843
2.548 0.03865 0.145331
2.598 0.387389 0.135204
2.648 -0.194241 0.147157
2.698 0.082652 0.138089
2.748 -0.055193 0.143653
2.798 0.479058 0.147731
2.848 0.078752 0.154872
2.898 -0.260351 0.222466
2.948 0.247542 0.214034
2.998 -0.111093 0.210356
3.048 0.345322 0.210973
3.098 0.111497 0.197268
3.148 0.183567 0.191375
3.198 -0.046307 0.196915
3.248 -0.170687 0.19468
3.298 -7.685608 0.197606
3.348 -24.178079 0.195845
3.398 -43.832214 0.195441
3.448 -63.913818 0.187498
3.498 -82.609418 0.193913
3.548 -91.733854 0.204293
> Client closed conection.
> New Client: 100.66.66.2
0 0.008065 -0.000826
0.048 0.094708 0.000628
0.098 0.182263 0.003327
0.148 0.27614 -0.000529
0.198 0.645433 0.005993
0.248 0.205568 0.005186
0.298 0.478031 -0.002373
0.348 0.351683 -0.003522
0.398 0.574343 0.009868
0.448 0.433301 -0.002492
0.498 0.280692 0.002244
0.548 0.336007 0.004055
0.598 0.463128 0.005178
0.648 0.715482 0.006604
0.698 0.353158 0.007261
0.748 0.778549 0.001223
0.798 0.476879 0.001135
0.848 0.24027 0.003204
0.898 0.65902 0.013502
0.948 0.348317 0.004436
0.998 0.081334 0.007161
1.048 0.399968 0.007234
1.098 0.25778 0.012288
1.148 0.142341 0.017796
1.198 0.451843 0.07791
1.248 0.308962 0.085317
1.298 0.279659 0.076317
1.348 0.203133 0.054128
1.398 0.228709 0.057663
1.448 -0.043308 0.06479
1.498 0.550739 0.050162
1.548 0.257821 0.054221
1.598 -0.050529 0.04994
1.648 0.449494 0.06117
1.698 0.016138 0.047579
1.748 0.021265 0.047504
1.798 0.547055 0.050838
1.848 0.579792 0.051801
1.898 0.514737 0.057445
1.948 0.25634 0.059196
1.998 0.715996 0.063735
2.048 0.376331 0.062503
2.098 0.348585 0.056689
2.148 0.327409 0.067746
2.198 0.869525 0.075865
2.248 0.281975 0.154167
2.298 0.581178 0.143162
2.348 0.429382 0.142056
2.398 0.171451 0.129359
2.448 0.392653 0.135064
2.498 0.126873 0.139549
2.548 0.195556 0.134885
2.598 0.305115 0.128049
2.648 0.490296 0.132789
2.698 0.421159 0.133346
2.748 0.067616 0.139786
2.798 0.378757 0.143679
2.848 0.425511 0.13829
2.898 -0.083692 0.158391
2.948 0.595664 0.231379
2.998 0.174451 0.221976
3.048 0.40703 0.208145
3.098 0.2968 0.206242
3.148 0.384555 0.199638
3.198 0.555792 0.201326
3.248 0.086593 0.190603
3.298 -7.558909 0.193588
3.348 -23.499303 0.191732
3.398 -43.07339 0.192295
3.448 -62.617998 0.186533
3.498 -81.441869 0.188234
3.548 -91.949729 0.190094
> Client closed conection.
