(kicad_sch (version 20230121) (generator eeschema)

  (uuid 64acae84-6fee-4125-a7b7-957a5d159b0a)

  (paper "A4")

  (lib_symbols
    (symbol "Connector:Conn_01x03_Pin" (pin_names (offset 1.016) hide) (in_bom yes) (on_board yes)
      (property "Reference" "J" (at 0 5.08 0)
        (effects (font (size 1.27 1.27)))
      )
      (property "Value" "Conn_01x03_Pin" (at 0 -5.08 0)
        (effects (font (size 1.27 1.27)))
      )
      (property "Footprint" "" (at 0 0 0)
        (effects (font (size 1.27 1.27)) hide)
      )
      (property "Datasheet" "~" (at 0 0 0)
        (effects (font (size 1.27 1.27)) hide)
      )
      (property "ki_locked" "" (at 0 0 0)
        (effects (font (size 1.27 1.27)))
      )
      (property "ki_keywords" "connector" (at 0 0 0)
        (effects (font (size 1.27 1.27)) hide)
      )
      (property "ki_description" "Generic connector, single row, 01x03, script generated" (at 0 0 0)
        (effects (font (size 1.27 1.27)) hide)
      )
      (property "ki_fp_filters" "Connector*:*_1x??_*" (at 0 0 0)
        (effects (font (size 1.27 1.27)) hide)
      )
      (symbol "Conn_01x03_Pin_1_1"
        (polyline
          (pts
            (xy 1.27 -2.54)
            (xy 0.8636 -2.54)
          )
          (stroke (width 0.1524) (type default))
          (fill (type none))
        )
        (polyline
          (pts
            (xy 1.27 0)
            (xy 0.8636 0)
          )
          (stroke (width 0.1524) (type default))
          (fill (type none))
        )
        (polyline
          (pts
            (xy 1.27 2.54)
            (xy 0.8636 2.54)
          )
          (stroke (width 0.1524) (type default))
          (fill (type none))
        )
        (rectangle (start 0.8636 -2.413) (end 0 -2.667)
          (stroke (width 0.1524) (type default))
          (fill (type outline))
        )
        (rectangle (start 0.8636 0.127) (end 0 -0.127)
          (stroke (width 0.1524) (type default))
          (fill (type outline))
        )
        (rectangle (start 0.8636 2.667) (end 0 2.413)
          (stroke (width 0.1524) (type default))
          (fill (type outline))
        )
        (pin passive line (at 5.08 2.54 180) (length 3.81)
          (name "Pin_1" (effects (font (size 1.27 1.27))))
          (number "1" (effects (font (size 1.27 1.27))))
        )
        (pin passive line (at 5.08 0 180) (length 3.81)
          (name "Pin_2" (effects (font (size 1.27 1.27))))
          (number "2" (effects (font (size 1.27 1.27))))
        )
        (pin passive line (at 5.08 -2.54 180) (length 3.81)
          (name "Pin_3" (effects (font (size 1.27 1.27))))
          (number "3" (effects (font (size 1.27 1.27))))
        )
      )
    )
    (symbol "Device:C" (pin_numbers hide) (pin_names (offset 0.254)) (in_bom yes) (on_board yes)
      (property "Reference" "C" (at 0.635 2.54 0)
        (effects (font (size 1.27 1.27)) (justify left))
      )
      (property "Value" "C" (at 0.635 -2.54 0)
        (effects (font (size 1.27 1.27)) (justify left))
      )
      (property "Footprint" "" (at 0.9652 -3.81 0)
        (effects (font (size 1.27 1.27)) hide)
      )
      (property "Datasheet" "~" (at 0 0 0)
        (effects (font (size 1.27 1.27)) hide)
      )
      (property "ki_keywords" "cap capacitor" (at 0 0 0)
        (effects (font (size 1.27 1.27)) hide)
      )
      (property "ki_description" "Unpolarized capacitor" (at 0 0 0)
        (effects (font (size 1.27 1.27)) hide)
      )
      (property "ki_fp_filters" "C_*" (at 0 0 0)
        (effects (font (size 1.27 1.27)) hide)
      )
      (symbol "C_0_1"
        (polyline
          (pts
            (xy -2.032 -0.762)
            (xy 2.032 -0.762)
          )
          (stroke (width 0.508) (type default))
          (fill (type none))
        )
        (polyline
          (pts
            (xy -2.032 0.762)
            (xy 2.032 0.762)
          )
          (stroke (width 0.508) (type default))
          (fill (type none))
        )
      )
      (symbol "C_1_1"
        (pin passive line (at 0 3.81 270) (length 2.794)
          (name "~" (effects (font (size 1.27 1.27))))
          (number "1" (effects (font (size 1.27 1.27))))
        )
        (pin passive line (at 0 -3.81 90) (length 2.794)
          (name "~" (effects (font (size 1.27 1.27))))
          (number "2" (effects (font (size 1.27 1.27))))
        )
      )
    )
    (symbol "Device:C_Polarized" (pin_numbers hide) (pin_names (offset 0.254)) (in_bom yes) (on_board yes)
      (property "Reference" "C" (at 0.635 2.54 0)
        (effects (font (size 1.27 1.27)) (justify left))
      )
      (property "Value" "C_Polarized" (at 0.635 -2.54 0)
        (effects (font (size 1.27 1.27)) (justify left))
      )
      (property "Footprint" "" (at 0.9652 -3.81 0)
        (effects (font (size 1.27 1.27)) hide)
      )
      (property "Datasheet" "~" (at 0 0 0)
        (effects (font (size 1.27 1.27)) hide)
      )
      (property "ki_keywords" "cap capacitor" (at 0 0 0)
        (effects (font (size 1.27 1.27)) hide)
      )
      (property "ki_description" "Polarized capacitor" (at 0 0 0)
        (effects (font (size 1.27 1.27)) hide)
      )
      (property "ki_fp_filters" "CP_*" (at 0 0 0)
        (effects (font (size 1.27 1.27)) hide)
      )
      (symbol "C_Polarized_0_1"
        (rectangle (start -2.286 0.508) (end 2.286 1.016)
          (stroke (width 0) (type default))
          (fill (type none))
        )
        (polyline
          (pts
            (xy -1.778 2.286)
            (xy -0.762 2.286)
          )
          (stroke (width 0) (type default))
          (fill (type none))
        )
        (polyline
          (pts
            (xy -1.27 2.794)
            (xy -1.27 1.778)
          )
          (stroke (width 0) (type default))
          (fill (type none))
        )
        (rectangle (start 2.286 -0.508) (end -2.286 -1.016)
          (stroke (width 0) (type default))
          (fill (type outline))
        )
      )
      (symbol "C_Polarized_1_1"
        (pin passive line (at 0 3.81 270) (length 2.794)
          (name "~" (effects (font (size 1.27 1.27))))
          (number "1" (effects (font (size 1.27 1.27))))
        )
        (pin passive line (at 0 -3.81 90) (length 2.794)
          (name "~" (effects (font (size 1.27 1.27))))
          (number "2" (effects (font (size 1.27 1.27))))
        )
      )
    )
    (symbol "Device:L" (pin_numbers hide) (pin_names (offset 1.016) hide) (in_bom yes) (on_board yes)
      (property "Reference" "L" (at -1.27 0 90)
        (effects (font (size 1.27 1.27)))
      )
      (property "Value" "L" (at 1.905 0 90)
        (effects (font (size 1.27 1.27)))
      )
      (property "Footprint" "" (at 0 0 0)
        (effects (font (size 1.27 1.27)) hide)
      )
      (property "Datasheet" "~" (at 0 0 0)
        (effects (font (size 1.27 1.27)) hide)
      )
      (property "ki_keywords" "inductor choke coil reactor magnetic" (at 0 0 0)
        (effects (font (size 1.27 1.27)) hide)
      )
      (property "ki_description" "Inductor" (at 0 0 0)
        (effects (font (size 1.27 1.27)) hide)
      )
      (property "ki_fp_filters" "Choke_* *Coil* Inductor_* L_*" (at 0 0 0)
        (effects (font (size 1.27 1.27)) hide)
      )
      (symbol "L_0_1"
        (arc (start 0 -2.54) (mid 0.6323 -1.905) (end 0 -1.27)
          (stroke (width 0) (type default))
          (fill (type none))
        )
        (arc (start 0 -1.27) (mid 0.6323 -0.635) (end 0 0)
          (stroke (width 0) (type default))
          (fill (type none))
        )
        (arc (start 0 0) (mid 0.6323 0.635) (end 0 1.27)
          (stroke (width 0) (type default))
          (fill (type none))
        )
        (arc (start 0 1.27) (mid 0.6323 1.905) (end 0 2.54)
          (stroke (width 0) (type default))
          (fill (type none))
        )
      )
      (symbol "L_1_1"
        (pin passive line (at 0 3.81 270) (length 1.27)
          (name "1" (effects (font (size 1.27 1.27))))
          (number "1" (effects (font (size 1.27 1.27))))
        )
        (pin passive line (at 0 -3.81 90) (length 1.27)
          (name "2" (effects (font (size 1.27 1.27))))
          (number "2" (effects (font (size 1.27 1.27))))
        )
      )
    )
    (symbol "Jumper:Jumper_2_Open" (pin_names (offset 0) hide) (in_bom yes) (on_board yes)
      (property "Reference" "JP" (at 0 2.794 0)
        (effects (font (size 1.27 1.27)))
      )
      (property "Value" "Jumper_2_Open" (at 0 -2.286 0)
        (effects (font (size 1.27 1.27)))
      )
      (property "Footprint" "" (at 0 0 0)
        (effects (font (size 1.27 1.27)) hide)
      )
      (property "Datasheet" "~" (at 0 0 0)
        (effects (font (size 1.27 1.27)) hide)
      )
      (property "ki_keywords" "Jumper SPST" (at 0 0 0)
        (effects (font (size 1.27 1.27)) hide)
      )
      (property "ki_description" "Jumper, 2-pole, open" (at 0 0 0)
        (effects (font (size 1.27 1.27)) hide)
      )
      (property "ki_fp_filters" "Jumper* TestPoint*2Pads* TestPoint*Bridge*" (at 0 0 0)
        (effects (font (size 1.27 1.27)) hide)
      )
      (symbol "Jumper_2_Open_0_0"
        (circle (center -2.032 0) (radius 0.508)
          (stroke (width 0) (type default))
          (fill (type none))
        )
        (circle (center 2.032 0) (radius 0.508)
          (stroke (width 0) (type default))
          (fill (type none))
        )
      )
      (symbol "Jumper_2_Open_0_1"
        (arc (start 1.524 1.27) (mid 0 1.778) (end -1.524 1.27)
          (stroke (width 0) (type default))
          (fill (type none))
        )
      )
      (symbol "Jumper_2_Open_1_1"
        (pin passive line (at -5.08 0 0) (length 2.54)
          (name "A" (effects (font (size 1.27 1.27))))
          (number "1" (effects (font (size 1.27 1.27))))
        )
        (pin passive line (at 5.08 0 180) (length 2.54)
          (name "B" (effects (font (size 1.27 1.27))))
          (number "2" (effects (font (size 1.27 1.27))))
        )
      )
    )
    (symbol "Regulator_Linear:AMS1117-3.3" (in_bom yes) (on_board yes)
      (property "Reference" "U" (at -3.81 3.175 0)
        (effects (font (size 1.27 1.27)))
      )
      (property "Value" "AMS1117-3.3" (at 0 3.175 0)
        (effects (font (size 1.27 1.27)) (justify left))
      )
      (property "Footprint" "Package_TO_SOT_SMD:SOT-223-3_TabPin2" (at 0 5.08 0)
        (effects (font (size 1.27 1.27)) hide)
      )
      (property "Datasheet" "http://www.advanced-monolithic.com/pdf/ds1117.pdf" (at 2.54 -6.35 0)
        (effects (font (size 1.27 1.27)) hide)
      )
      (property "ki_keywords" "linear regulator ldo fixed positive" (at 0 0 0)
        (effects (font (size 1.27 1.27)) hide)
      )
      (property "ki_description" "1A Low Dropout regulator, positive, 3.3V fixed output, SOT-223" (at 0 0 0)
        (effects (font (size 1.27 1.27)) hide)
      )
      (property "ki_fp_filters" "SOT?223*TabPin2*" (at 0 0 0)
        (effects (font (size 1.27 1.27)) hide)
      )
      (symbol "AMS1117-3.3_0_1"
        (rectangle (start -5.08 -5.08) (end 5.08 1.905)
          (stroke (width 0.254) (type default))
          (fill (type background))
        )
      )
      (symbol "AMS1117-3.3_1_1"
        (pin power_in line (at 0 -7.62 90) (length 2.54)
          (name "GND" (effects (font (size 1.27 1.27))))
          (number "1" (effects (font (size 1.27 1.27))))
        )
        (pin power_out line (at 7.62 0 180) (length 2.54)
          (name "VO" (effects (font (size 1.27 1.27))))
          (number "2" (effects (font (size 1.27 1.27))))
        )
        (pin power_in line (at -7.62 0 0) (length 2.54)
          (name "VI" (effects (font (size 1.27 1.27))))
          (number "3" (effects (font (size 1.27 1.27))))
        )
      )
    )
    (symbol "Switch:SW_Push" (pin_numbers hide) (pin_names (offset 1.016) hide) (in_bom yes) (on_board yes)
      (property "Reference" "SW" (at 1.27 2.54 0)
        (effects (font (size 1.27 1.27)) (justify left))
      )
      (property "Value" "SW_Push" (at 0 -1.524 0)
        (effects (font (size 1.27 1.27)))
      )
      (property "Footprint" "" (at 0 5.08 0)
        (effects (font (size 1.27 1.27)) hide)
      )
      (property "Datasheet" "~" (at 0 5.08 0)
        (effects (font (size 1.27 1.27)) hide)
      )
      (property "ki_keywords" "switch normally-open pushbutton push-button" (at 0 0 0)
        (effects (font (size 1.27 1.27)) hide)
      )
      (property "ki_description" "Push button switch, generic, two pins" (at 0 0 0)
        (effects (font (size 1.27 1.27)) hide)
      )
      (symbol "SW_Push_0_1"
        (circle (center -2.032 0) (radius 0.508)
          (stroke (width 0) (type default))
          (fill (type none))
        )
        (polyline
          (pts
            (xy 0 1.27)
            (xy 0 3.048)
          )
          (stroke (width 0) (type default))
          (fill (type none))
        )
        (polyline
          (pts
            (xy 2.54 1.27)
            (xy -2.54 1.27)
          )
          (stroke (width 0) (type default))
          (fill (type none))
        )
        (circle (center 2.032 0) (radius 0.508)
          (stroke (width 0) (type default))
          (fill (type none))
        )
        (pin passive line (at -5.08 0 0) (length 2.54)
          (name "1" (effects (font (size 1.27 1.27))))
          (number "1" (effects (font (size 1.27 1.27))))
        )
        (pin passive line (at 5.08 0 180) (length 2.54)
          (name "2" (effects (font (size 1.27 1.27))))
          (number "2" (effects (font (size 1.27 1.27))))
        )
      )
    )
    (symbol "power:+3.3VA" (power) (pin_names (offset 0)) (in_bom yes) (on_board yes)
      (property "Reference" "#PWR" (at 0 -3.81 0)
        (effects (font (size 1.27 1.27)) hide)
      )
      (property "Value" "+3.3VA" (at 0 3.556 0)
        (effects (font (size 1.27 1.27)))
      )
      (property "Footprint" "" (at 0 0 0)
        (effects (font (size 1.27 1.27)) hide)
      )
      (property "Datasheet" "" (at 0 0 0)
        (effects (font (size 1.27 1.27)) hide)
      )
      (property "ki_keywords" "global power" (at 0 0 0)
        (effects (font (size 1.27 1.27)) hide)
      )
      (property "ki_description" "Power symbol creates a global label with name \"+3.3VA\"" (at 0 0 0)
        (effects (font (size 1.27 1.27)) hide)
      )
      (symbol "+3.3VA_0_1"
        (polyline
          (pts
            (xy -0.762 1.27)
            (xy 0 2.54)
          )
          (stroke (width 0) (type default))
          (fill (type none))
        )
        (polyline
          (pts
            (xy 0 0)
            (xy 0 2.54)
          )
          (stroke (width 0) (type default))
          (fill (type none))
        )
        (polyline
          (pts
            (xy 0 2.54)
            (xy 0.762 1.27)
          )
          (stroke (width 0) (type default))
          (fill (type none))
        )
      )
      (symbol "+3.3VA_1_1"
        (pin power_in line (at 0 0 90) (length 0) hide
          (name "+3.3VA" (effects (font (size 1.27 1.27))))
          (number "1" (effects (font (size 1.27 1.27))))
        )
      )
    )
    (symbol "power:+5V" (power) (pin_names (offset 0)) (in_bom yes) (on_board yes)
      (property "Reference" "#PWR" (at 0 -3.81 0)
        (effects (font (size 1.27 1.27)) hide)
      )
      (property "Value" "+5V" (at 0 3.556 0)
        (effects (font (size 1.27 1.27)))
      )
      (property "Footprint" "" (at 0 0 0)
        (effects (font (size 1.27 1.27)) hide)
      )
      (property "Datasheet" "" (at 0 0 0)
        (effects (font (size 1.27 1.27)) hide)
      )
      (property "ki_keywords" "global power" (at 0 0 0)
        (effects (font (size 1.27 1.27)) hide)
      )
      (property "ki_description" "Power symbol creates a global label with name \"+5V\"" (at 0 0 0)
        (effects (font (size 1.27 1.27)) hide)
      )
      (symbol "+5V_0_1"
        (polyline
          (pts
            (xy -0.762 1.27)
            (xy 0 2.54)
          )
          (stroke (width 0) (type default))
          (fill (type none))
        )
        (polyline
          (pts
            (xy 0 0)
            (xy 0 2.54)
          )
          (stroke (width 0) (type default))
          (fill (type none))
        )
        (polyline
          (pts
            (xy 0 2.54)
            (xy 0.762 1.27)
          )
          (stroke (width 0) (type default))
          (fill (type none))
        )
      )
      (symbol "+5V_1_1"
        (pin power_in line (at 0 0 90) (length 0) hide
          (name "+5V" (effects (font (size 1.27 1.27))))
          (number "1" (effects (font (size 1.27 1.27))))
        )
      )
    )
    (symbol "power:+5VA" (power) (pin_names (offset 0)) (in_bom yes) (on_board yes)
      (property "Reference" "#PWR" (at 0 -3.81 0)
        (effects (font (size 1.27 1.27)) hide)
      )
      (property "Value" "+5VA" (at 0 3.556 0)
        (effects (font (size 1.27 1.27)))
      )
      (property "Footprint" "" (at 0 0 0)
        (effects (font (size 1.27 1.27)) hide)
      )
      (property "Datasheet" "" (at 0 0 0)
        (effects (font (size 1.27 1.27)) hide)
      )
      (property "ki_keywords" "global power" (at 0 0 0)
        (effects (font (size 1.27 1.27)) hide)
      )
      (property "ki_description" "Power symbol creates a global label with name \"+5VA\"" (at 0 0 0)
        (effects (font (size 1.27 1.27)) hide)
      )
      (symbol "+5VA_0_1"
        (polyline
          (pts
            (xy -0.762 1.27)
            (xy 0 2.54)
          )
          (stroke (width 0) (type default))
          (fill (type none))
        )
        (polyline
          (pts
            (xy 0 0)
            (xy 0 2.54)
          )
          (stroke (width 0) (type default))
          (fill (type none))
        )
        (polyline
          (pts
            (xy 0 2.54)
            (xy 0.762 1.27)
          )
          (stroke (width 0) (type default))
          (fill (type none))
        )
      )
      (symbol "+5VA_1_1"
        (pin power_in line (at 0 0 90) (length 0) hide
          (name "+5VA" (effects (font (size 1.27 1.27))))
          (number "1" (effects (font (size 1.27 1.27))))
        )
      )
    )
    (symbol "power:GND" (power) (pin_names (offset 0)) (in_bom yes) (on_board yes)
      (property "Reference" "#PWR" (at 0 -6.35 0)
        (effects (font (size 1.27 1.27)) hide)
      )
      (property "Value" "GND" (at 0 -3.81 0)
        (effects (font (size 1.27 1.27)))
      )
      (property "Footprint" "" (at 0 0 0)
        (effects (font (size 1.27 1.27)) hide)
      )
      (property "Datasheet" "" (at 0 0 0)
        (effects (font (size 1.27 1.27)) hide)
      )
      (property "ki_keywords" "global power" (at 0 0 0)
        (effects (font (size 1.27 1.27)) hide)
      )
      (property "ki_description" "Power symbol creates a global label with name \"GND\" , ground" (at 0 0 0)
        (effects (font (size 1.27 1.27)) hide)
      )
      (symbol "GND_0_1"
        (polyline
          (pts
            (xy 0 0)
            (xy 0 -1.27)
            (xy 1.27 -1.27)
            (xy 0 -2.54)
            (xy -1.27 -1.27)
            (xy 0 -1.27)
          )
          (stroke (width 0) (type default))
          (fill (type none))
        )
      )
      (symbol "GND_1_1"
        (pin power_in line (at 0 0 270) (length 0) hide
          (name "GND" (effects (font (size 1.27 1.27))))
          (number "1" (effects (font (size 1.27 1.27))))
        )
      )
    )
    (symbol "power:GNDA" (power) (pin_names (offset 0)) (in_bom yes) (on_board yes)
      (property "Reference" "#PWR" (at 0 -6.35 0)
        (effects (font (size 1.27 1.27)) hide)
      )
      (property "Value" "GNDA" (at 0 -3.81 0)
        (effects (font (size 1.27 1.27)))
      )
      (property "Footprint" "" (at 0 0 0)
        (effects (font (size 1.27 1.27)) hide)
      )
      (property "Datasheet" "" (at 0 0 0)
        (effects (font (size 1.27 1.27)) hide)
      )
      (property "ki_keywords" "global power" (at 0 0 0)
        (effects (font (size 1.27 1.27)) hide)
      )
      (property "ki_description" "Power symbol creates a global label with name \"GNDA\" , analog ground" (at 0 0 0)
        (effects (font (size 1.27 1.27)) hide)
      )
      (symbol "GNDA_0_1"
        (polyline
          (pts
            (xy 0 0)
            (xy 0 -1.27)
            (xy 1.27 -1.27)
            (xy 0 -2.54)
            (xy -1.27 -1.27)
            (xy 0 -1.27)
          )
          (stroke (width 0) (type default))
          (fill (type none))
        )
      )
      (symbol "GNDA_1_1"
        (pin power_in line (at 0 0 270) (length 0) hide
          (name "GNDA" (effects (font (size 1.27 1.27))))
          (number "1" (effects (font (size 1.27 1.27))))
        )
      )
    )
    (symbol "usb-powerbank:usb_module" (in_bom yes) (on_board yes)
      (property "Reference" "U" (at 0 1.27 0)
        (effects (font (size 1.27 1.27)))
      )
      (property "Value" "usb_module" (at 0 -11.43 0)
        (effects (font (size 1.27 1.27)))
      )
      (property "Footprint" "" (at 0 0 0)
        (effects (font (size 1.27 1.27)) hide)
      )
      (property "Datasheet" "" (at 0 0 0)
        (effects (font (size 1.27 1.27)) hide)
      )
      (symbol "usb_module_0_1"
        (rectangle (start -5.08 0) (end 5.08 -10.16)
          (stroke (width 0) (type default))
          (fill (type background))
        )
      )
      (symbol "usb_module_1_1"
        (pin power_in line (at -7.62 -2.54 0) (length 2.54)
          (name "Bat+" (effects (font (size 1.27 1.27))))
          (number "1" (effects (font (size 1.27 1.27))))
        )
        (pin power_in line (at -7.62 -5.08 0) (length 2.54)
          (name "Bat-" (effects (font (size 1.27 1.27))))
          (number "2" (effects (font (size 1.27 1.27))))
        )
        (pin power_out line (at 7.62 -2.54 180) (length 2.54)
          (name "+5V" (effects (font (size 1.27 1.27))))
          (number "3" (effects (font (size 1.27 1.27))))
        )
        (pin power_out line (at 7.62 -5.08 180) (length 2.54)
          (name "GND" (effects (font (size 1.27 1.27))))
          (number "4" (effects (font (size 1.27 1.27))))
        )
        (pin input line (at 7.62 -7.62 180) (length 2.54)
          (name "sw" (effects (font (size 1.27 1.27))))
          (number "5" (effects (font (size 1.27 1.27))))
        )
      )
    )
  )

  (junction (at 106.299 98.806) (diameter 0) (color 0 0 0 0)
    (uuid 46d4ccf8-73b1-4028-8aff-9e1d24cdb5fe)
  )
  (junction (at 132.842 63.373) (diameter 0) (color 0 0 0 0)
    (uuid 608ec27e-e2cc-455e-8089-bc01c168ceaa)
  )
  (junction (at 128.778 98.806) (diameter 0) (color 0 0 0 0)
    (uuid bdc746c9-3e5d-4eaa-a4b1-19b8752139b8)
  )
  (junction (at 119.126 108.839) (diameter 0) (color 0 0 0 0)
    (uuid e17c36d7-f4e1-46f5-b6d4-73b9040b68d3)
  )

  (wire (pts (xy 73.025 48.895) (xy 78.105 48.895))
    (stroke (width 0) (type default))
    (uuid 03e9aaf4-5184-4a49-878e-9ee22ae07173)
  )
  (wire (pts (xy 85.09 51.435) (xy 85.09 53.34))
    (stroke (width 0) (type default))
    (uuid 09eba483-36fa-4a51-bbbf-d3741434a0cb)
  )
  (wire (pts (xy 128.778 97.917) (xy 128.778 98.806))
    (stroke (width 0) (type default))
    (uuid 1e6f53f0-cac1-4d39-b5d8-bb5c5b656af5)
  )
  (wire (pts (xy 106.299 108.839) (xy 119.126 108.839))
    (stroke (width 0) (type default))
    (uuid 24814951-b8bf-4d94-8161-142d4b8a6c50)
  )
  (wire (pts (xy 43.18 45.72) (xy 48.895 45.72))
    (stroke (width 0) (type default))
    (uuid 252b7f64-7c4b-4c15-ac14-cc0e87081089)
  )
  (wire (pts (xy 132.842 63.373) (xy 132.842 65.913))
    (stroke (width 0) (type default))
    (uuid 26222eae-b1d6-485c-9246-76dcc034f986)
  )
  (wire (pts (xy 85.09 51.435) (xy 73.025 51.435))
    (stroke (width 0) (type default))
    (uuid 2715969f-4fe0-49ad-97f9-5329c441c83c)
  )
  (wire (pts (xy 171.069 72.898) (xy 171.069 75.692))
    (stroke (width 0) (type default))
    (uuid 2c61c2f7-f154-42f7-9aaa-a20cdb6de19b)
  )
  (wire (pts (xy 130.937 63.373) (xy 132.842 63.373))
    (stroke (width 0) (type default))
    (uuid 315f5ec2-cdfe-4633-a3d8-6811dc3ee2e2)
  )
  (wire (pts (xy 78.105 46.355) (xy 73.025 46.355))
    (stroke (width 0) (type default))
    (uuid 345495bd-f354-439a-9f28-89e22e5cce1a)
  )
  (wire (pts (xy 119.126 108.839) (xy 119.126 110.109))
    (stroke (width 0) (type default))
    (uuid 4516a982-f904-41e4-9d2c-5081b437ab7e)
  )
  (wire (pts (xy 53.34 48.26) (xy 53.34 46.355))
    (stroke (width 0) (type default))
    (uuid 4d78e767-b307-4e0e-b9cf-2deabc8fdf90)
  )
  (wire (pts (xy 132.842 73.533) (xy 132.842 75.311))
    (stroke (width 0) (type default))
    (uuid 4ed4de37-7228-4d49-b2dc-2c2582074ace)
  )
  (wire (pts (xy 106.299 100.33) (xy 106.299 98.806))
    (stroke (width 0) (type default))
    (uuid 5571d7ed-b781-460c-a153-4383fdede51a)
  )
  (wire (pts (xy 78.105 45.085) (xy 78.105 46.355))
    (stroke (width 0) (type default))
    (uuid 651bf3c5-650a-41ef-8d7d-7e7028db8dac)
  )
  (wire (pts (xy 119.126 106.426) (xy 119.126 108.839))
    (stroke (width 0) (type default))
    (uuid 6527452b-7c00-497b-bab7-16030ff6c34f)
  )
  (wire (pts (xy 120.777 63.373) (xy 123.317 63.373))
    (stroke (width 0) (type default))
    (uuid 6a1884b7-6c94-4059-99fe-5f367bdc4ba8)
  )
  (wire (pts (xy 106.299 98.806) (xy 111.506 98.806))
    (stroke (width 0) (type default))
    (uuid 6c2401a9-9e81-4d4c-9308-e6adc2b55234)
  )
  (wire (pts (xy 85.09 63.5) (xy 85.09 66.04))
    (stroke (width 0) (type default))
    (uuid 7b8dfbaf-0633-4002-82a5-9825cb4339e4)
  )
  (wire (pts (xy 48.895 45.72) (xy 48.895 48.895))
    (stroke (width 0) (type default))
    (uuid 8468ed52-a490-4018-84c8-0494a312cafc)
  )
  (wire (pts (xy 128.778 108.839) (xy 128.778 107.95))
    (stroke (width 0) (type default))
    (uuid 8bd31cd4-5d82-46ba-a253-5a2ce95a49e1)
  )
  (wire (pts (xy 106.299 107.95) (xy 106.299 108.839))
    (stroke (width 0) (type default))
    (uuid a32cfd96-33be-4f0f-acb0-675a1d9cfcb1)
  )
  (wire (pts (xy 160.909 72.898) (xy 160.909 75.819))
    (stroke (width 0) (type default))
    (uuid a9e3c7f7-5095-4bab-b32c-801b58035cb0)
  )
  (wire (pts (xy 53.34 46.355) (xy 57.785 46.355))
    (stroke (width 0) (type default))
    (uuid b186960e-ffb7-4a70-875b-a4b341217eef)
  )
  (wire (pts (xy 120.777 61.849) (xy 120.777 63.373))
    (stroke (width 0) (type default))
    (uuid c38bd347-5213-4ac3-a4b8-9ade82dbf81c)
  )
  (wire (pts (xy 119.126 108.839) (xy 128.778 108.839))
    (stroke (width 0) (type default))
    (uuid cc786485-f2ff-4596-b272-f4190d1beea0)
  )
  (wire (pts (xy 78.105 66.04) (xy 78.105 48.895))
    (stroke (width 0) (type default))
    (uuid cfca37a0-6e5a-4f23-a3cd-f2b0003e62cf)
  )
  (wire (pts (xy 48.895 48.895) (xy 57.785 48.895))
    (stroke (width 0) (type default))
    (uuid d2a41a39-befc-40de-b683-ac087f585e14)
  )
  (wire (pts (xy 43.18 48.26) (xy 53.34 48.26))
    (stroke (width 0) (type default))
    (uuid de399d1e-ed86-4b6c-b604-2bc8ebcd1dd5)
  )
  (wire (pts (xy 132.842 62.103) (xy 132.842 63.373))
    (stroke (width 0) (type default))
    (uuid e61ae34c-7e6b-4b3c-b7ee-7dffde01e644)
  )
  (wire (pts (xy 128.778 98.806) (xy 128.778 100.33))
    (stroke (width 0) (type default))
    (uuid ed0de3ed-f647-4bc8-9708-710fe56e1005)
  )
  (wire (pts (xy 106.299 97.917) (xy 106.299 98.806))
    (stroke (width 0) (type default))
    (uuid ef8358b6-3819-4f74-9a57-04f89f1e6422)
  )
  (wire (pts (xy 126.746 98.806) (xy 128.778 98.806))
    (stroke (width 0) (type default))
    (uuid fa846822-1476-44e9-a133-0dc3a9e7da5a)
  )

  (text "RPI pico implements its own analog ground,\ntherefore JP9 should be kept opened."
    (at 175.26 76.962 0)
    (effects (font (size 1.27 1.27)) (justify left bottom))
    (uuid 0c01c3e6-07f6-4c38-8a6f-850e3b740854)
  )
  (text "Powebank module - desolder USB-A connector\nhttps://www.laskakit.cz/nabijecka-boost-pro-usb-powerbank-5v--usb-c/\n\n"
    (at 32.258 35.433 0)
    (effects (font (size 1.27 1.27) bold) (justify left bottom))
    (uuid b44b4d98-7246-47a4-803a-9f701ef9c6b9)
  )

  (symbol (lib_id "power:GNDA") (at 119.126 110.109 0) (unit 1)
    (in_bom yes) (on_board yes) (dnp no) (fields_autoplaced)
    (uuid 0386ad10-2980-4fd0-a907-3092b6e5a631)
    (property "Reference" "#PWR037" (at 119.126 116.459 0)
      (effects (font (size 1.27 1.27)) hide)
    )
    (property "Value" "GNDA" (at 119.126 114.3 0)
      (effects (font (size 1.27 1.27)))
    )
    (property "Footprint" "" (at 119.126 110.109 0)
      (effects (font (size 1.27 1.27)) hide)
    )
    (property "Datasheet" "" (at 119.126 110.109 0)
      (effects (font (size 1.27 1.27)) hide)
    )
    (pin "1" (uuid d10d5b11-ee03-46b4-ae0b-822ce5110472))
    (instances
      (project "skinResisitance"
        (path "/7423c7a1-84f1-4977-97d9-6209231a3837/42732af2-4150-48e3-a633-6593869e46bd"
          (reference "#PWR037") (unit 1)
        )
      )
    )
  )

  (symbol (lib_id "Device:C") (at 106.299 104.14 0) (unit 1)
    (in_bom yes) (on_board yes) (dnp no) (fields_autoplaced)
    (uuid 13bee63a-684c-44b7-90c4-ad851bba3cda)
    (property "Reference" "C12" (at 109.22 102.87 0)
      (effects (font (size 1.27 1.27)) (justify left))
    )
    (property "Value" "100n" (at 109.22 105.41 0)
      (effects (font (size 1.27 1.27)) (justify left))
    )
    (property "Footprint" "Capacitor_SMD:C_0805_2012Metric_Pad1.18x1.45mm_HandSolder" (at 107.2642 107.95 0)
      (effects (font (size 1.27 1.27)) hide)
    )
    (property "Datasheet" "~" (at 106.299 104.14 0)
      (effects (font (size 1.27 1.27)) hide)
    )
    (pin "1" (uuid ee66a056-7b47-4c60-96ce-bda8aefb82a1))
    (pin "2" (uuid c216b299-b442-414e-a7fd-bac0d24d2116))
    (instances
      (project "skinResisitance"
        (path "/7423c7a1-84f1-4977-97d9-6209231a3837/42732af2-4150-48e3-a633-6593869e46bd"
          (reference "C12") (unit 1)
        )
      )
    )
  )

  (symbol (lib_id "power:GNDA") (at 160.909 75.819 0) (unit 1)
    (in_bom yes) (on_board yes) (dnp no) (fields_autoplaced)
    (uuid 1bdebb04-2562-4cfc-9e5e-e850e2e70f36)
    (property "Reference" "#PWR042" (at 160.909 82.169 0)
      (effects (font (size 1.27 1.27)) hide)
    )
    (property "Value" "GNDA" (at 160.909 80.01 0)
      (effects (font (size 1.27 1.27)))
    )
    (property "Footprint" "" (at 160.909 75.819 0)
      (effects (font (size 1.27 1.27)) hide)
    )
    (property "Datasheet" "" (at 160.909 75.819 0)
      (effects (font (size 1.27 1.27)) hide)
    )
    (pin "1" (uuid 7b74428e-5e7b-41c2-bad0-a1bc849a0aa6))
    (instances
      (project "skinResisitance"
        (path "/7423c7a1-84f1-4977-97d9-6209231a3837/42732af2-4150-48e3-a633-6593869e46bd"
          (reference "#PWR042") (unit 1)
        )
      )
    )
  )

  (symbol (lib_id "power:GND") (at 171.069 75.692 0) (unit 1)
    (in_bom yes) (on_board yes) (dnp no) (fields_autoplaced)
    (uuid 1d2066cb-ac97-42d4-b5ba-70067c6163f7)
    (property "Reference" "#PWR043" (at 171.069 82.042 0)
      (effects (font (size 1.27 1.27)) hide)
    )
    (property "Value" "GND" (at 171.069 79.883 0)
      (effects (font (size 1.27 1.27)))
    )
    (property "Footprint" "" (at 171.069 75.692 0)
      (effects (font (size 1.27 1.27)) hide)
    )
    (property "Datasheet" "" (at 171.069 75.692 0)
      (effects (font (size 1.27 1.27)) hide)
    )
    (pin "1" (uuid 5abbd4cc-aaec-48c1-9d68-04350dccd969))
    (instances
      (project "skinResisitance"
        (path "/7423c7a1-84f1-4977-97d9-6209231a3837/42732af2-4150-48e3-a633-6593869e46bd"
          (reference "#PWR043") (unit 1)
        )
      )
    )
  )

  (symbol (lib_id "Regulator_Linear:AMS1117-3.3") (at 119.126 98.806 0) (unit 1)
    (in_bom yes) (on_board yes) (dnp no) (fields_autoplaced)
    (uuid 278ac464-05ca-45c2-968e-9ab30ad39171)
    (property "Reference" "U9" (at 119.126 91.44 0)
      (effects (font (size 1.27 1.27)))
    )
    (property "Value" "AMS1117-3.3" (at 119.126 93.98 0)
      (effects (font (size 1.27 1.27)))
    )
    (property "Footprint" "Package_TO_SOT_SMD:SOT-223-3_TabPin2" (at 119.126 93.726 0)
      (effects (font (size 1.27 1.27)) hide)
    )
    (property "Datasheet" "http://www.advanced-monolithic.com/pdf/ds1117.pdf" (at 121.666 105.156 0)
      (effects (font (size 1.27 1.27)) hide)
    )
    (pin "1" (uuid 631100f0-443f-48d2-8844-04722d561914))
    (pin "2" (uuid 7c2ad10e-54ca-471c-b376-413b534ac91d))
    (pin "3" (uuid 5077082b-b006-4c0e-8550-a3444a534457))
    (instances
      (project "skinResisitance"
        (path "/7423c7a1-84f1-4977-97d9-6209231a3837/42732af2-4150-48e3-a633-6593869e46bd"
          (reference "U9") (unit 1)
        )
      )
    )
  )

  (symbol (lib_id "Connector:Conn_01x03_Pin") (at 38.1 48.26 0) (mirror x) (unit 1)
    (in_bom yes) (on_board yes) (dnp no)
    (uuid 2799f41e-80e9-40ec-828f-6b4689a1755c)
    (property "Reference" "J?" (at 38.735 55.245 0)
      (effects (font (size 1.27 1.27)))
    )
    (property "Value" "Conn_01x03_Pin" (at 38.735 52.705 0)
      (effects (font (size 1.27 1.27)))
    )
    (property "Footprint" "Connector_PinHeader_2.54mm:PinHeader_1x03_P2.54mm_Horizontal" (at 38.1 48.26 0)
      (effects (font (size 1.27 1.27)) hide)
    )
    (property "Datasheet" "~" (at 38.1 48.26 0)
      (effects (font (size 1.27 1.27)) hide)
    )
    (pin "1" (uuid b5ee80f2-802a-4464-8d2b-93b28bfca064))
    (pin "2" (uuid bf89d01e-2cbe-46fe-8e46-336aca4d8f2d))
    (pin "3" (uuid 71184338-a7e1-4a85-8e6b-f1750a72042b))
    (instances
      (project "buzzers_speakers"
        (path "/237270d4-dbb4-4c98-8ef7-25a6f469254e"
          (reference "J?") (unit 1)
        )
      )
      (project "skinResisitance"
        (path "/7423c7a1-84f1-4977-97d9-6209231a3837/42732af2-4150-48e3-a633-6593869e46bd"
          (reference "J6") (unit 1)
        )
      )
    )
  )

  (symbol (lib_id "Device:C") (at 128.778 104.14 0) (unit 1)
    (in_bom yes) (on_board yes) (dnp no) (fields_autoplaced)
    (uuid 43a6655c-881f-4a2b-a382-c0dc2e00152d)
    (property "Reference" "C13" (at 132.08 102.87 0)
      (effects (font (size 1.27 1.27)) (justify left))
    )
    (property "Value" "100n" (at 132.08 105.41 0)
      (effects (font (size 1.27 1.27)) (justify left))
    )
    (property "Footprint" "Capacitor_SMD:C_0805_2012Metric_Pad1.18x1.45mm_HandSolder" (at 129.7432 107.95 0)
      (effects (font (size 1.27 1.27)) hide)
    )
    (property "Datasheet" "~" (at 128.778 104.14 0)
      (effects (font (size 1.27 1.27)) hide)
    )
    (pin "1" (uuid 9ec1b681-6aeb-4490-9d26-6d2758f330af))
    (pin "2" (uuid ef275348-d437-4b1c-811a-4d778dc3647d))
    (instances
      (project "skinResisitance"
        (path "/7423c7a1-84f1-4977-97d9-6209231a3837/42732af2-4150-48e3-a633-6593869e46bd"
          (reference "C13") (unit 1)
        )
      )
    )
  )

  (symbol (lib_id "power:+5V") (at 120.777 61.849 0) (unit 1)
    (in_bom yes) (on_board yes) (dnp no) (fields_autoplaced)
    (uuid 59761166-77e9-433f-9d9b-58dc1f8bbae3)
    (property "Reference" "#PWR?" (at 120.777 65.659 0)
      (effects (font (size 1.27 1.27)) hide)
    )
    (property "Value" "+5V" (at 120.777 56.769 0)
      (effects (font (size 1.27 1.27)))
    )
    (property "Footprint" "" (at 120.777 61.849 0)
      (effects (font (size 1.27 1.27)) hide)
    )
    (property "Datasheet" "" (at 120.777 61.849 0)
      (effects (font (size 1.27 1.27)) hide)
    )
    (pin "1" (uuid c14dd3fc-2759-4454-82ae-625cf077f0df))
    (instances
      (project "skinResisitance"
        (path "/7423c7a1-84f1-4977-97d9-6209231a3837"
          (reference "#PWR?") (unit 1)
        )
        (path "/7423c7a1-84f1-4977-97d9-6209231a3837/42732af2-4150-48e3-a633-6593869e46bd"
          (reference "#PWR038") (unit 1)
        )
      )
    )
  )

  (symbol (lib_id "power:GND") (at 85.09 66.04 0) (unit 1)
    (in_bom yes) (on_board yes) (dnp no) (fields_autoplaced)
    (uuid 63756f2d-98f0-499a-9bd3-dedb029a738f)
    (property "Reference" "#PWR?" (at 85.09 72.39 0)
      (effects (font (size 1.27 1.27)) hide)
    )
    (property "Value" "GND" (at 85.09 70.485 0)
      (effects (font (size 1.27 1.27)))
    )
    (property "Footprint" "" (at 85.09 66.04 0)
      (effects (font (size 1.27 1.27)) hide)
    )
    (property "Datasheet" "" (at 85.09 66.04 0)
      (effects (font (size 1.27 1.27)) hide)
    )
    (pin "1" (uuid 86e5173f-8525-4d39-8d14-5e9a702f8052))
    (instances
      (project "buzzers_speakers"
        (path "/237270d4-dbb4-4c98-8ef7-25a6f469254e"
          (reference "#PWR?") (unit 1)
        )
      )
      (project "skinResisitance"
        (path "/7423c7a1-84f1-4977-97d9-6209231a3837/42732af2-4150-48e3-a633-6593869e46bd"
          (reference "#PWR035") (unit 1)
        )
      )
    )
  )

  (symbol (lib_id "power:+5V") (at 78.105 45.085 0) (unit 1)
    (in_bom yes) (on_board yes) (dnp no) (fields_autoplaced)
    (uuid 856e92ce-1a1a-4a6f-8f73-03a75c9e93eb)
    (property "Reference" "#PWR?" (at 78.105 48.895 0)
      (effects (font (size 1.27 1.27)) hide)
    )
    (property "Value" "+5V" (at 78.105 40.005 0)
      (effects (font (size 1.27 1.27)))
    )
    (property "Footprint" "" (at 78.105 45.085 0)
      (effects (font (size 1.27 1.27)) hide)
    )
    (property "Datasheet" "" (at 78.105 45.085 0)
      (effects (font (size 1.27 1.27)) hide)
    )
    (pin "1" (uuid 80b463e9-5dc4-4d87-8173-32a27bf9fea9))
    (instances
      (project "buzzers_speakers"
        (path "/237270d4-dbb4-4c98-8ef7-25a6f469254e"
          (reference "#PWR?") (unit 1)
        )
      )
      (project "skinResisitance"
        (path "/7423c7a1-84f1-4977-97d9-6209231a3837/42732af2-4150-48e3-a633-6593869e46bd"
          (reference "#PWR033") (unit 1)
        )
      )
    )
  )

  (symbol (lib_id "power:+5VA") (at 106.299 97.917 0) (unit 1)
    (in_bom yes) (on_board yes) (dnp no) (fields_autoplaced)
    (uuid a28891e1-139d-4546-bb7a-180b513eb718)
    (property "Reference" "#PWR036" (at 106.299 101.727 0)
      (effects (font (size 1.27 1.27)) hide)
    )
    (property "Value" "+5VA" (at 106.299 92.964 0)
      (effects (font (size 1.27 1.27)))
    )
    (property "Footprint" "" (at 106.299 97.917 0)
      (effects (font (size 1.27 1.27)) hide)
    )
    (property "Datasheet" "" (at 106.299 97.917 0)
      (effects (font (size 1.27 1.27)) hide)
    )
    (pin "1" (uuid 8c891063-4a93-45d8-a9d6-148507b5459b))
    (instances
      (project "skinResisitance"
        (path "/7423c7a1-84f1-4977-97d9-6209231a3837/42732af2-4150-48e3-a633-6593869e46bd"
          (reference "#PWR036") (unit 1)
        )
      )
    )
  )

  (symbol (lib_id "power:GNDA") (at 132.842 75.311 0) (unit 1)
    (in_bom yes) (on_board yes) (dnp no) (fields_autoplaced)
    (uuid aa87f7ab-638a-4652-bb83-0daf20a8b5f0)
    (property "Reference" "#PWR041" (at 132.842 81.661 0)
      (effects (font (size 1.27 1.27)) hide)
    )
    (property "Value" "GNDA" (at 132.842 80.01 0)
      (effects (font (size 1.27 1.27)))
    )
    (property "Footprint" "" (at 132.842 75.311 0)
      (effects (font (size 1.27 1.27)) hide)
    )
    (property "Datasheet" "" (at 132.842 75.311 0)
      (effects (font (size 1.27 1.27)) hide)
    )
    (pin "1" (uuid a47df7d4-bbe4-47ec-868f-b2674f6a512a))
    (instances
      (project "skinResisitance"
        (path "/7423c7a1-84f1-4977-97d9-6209231a3837/42732af2-4150-48e3-a633-6593869e46bd"
          (reference "#PWR041") (unit 1)
        )
      )
    )
  )

  (symbol (lib_id "power:+3.3VA") (at 128.778 97.917 0) (unit 1)
    (in_bom yes) (on_board yes) (dnp no) (fields_autoplaced)
    (uuid b326b04b-3f9a-4c7c-9def-576622e7fd3c)
    (property "Reference" "#PWR039" (at 128.778 101.727 0)
      (effects (font (size 1.27 1.27)) hide)
    )
    (property "Value" "+3.3VA" (at 128.778 92.71 0)
      (effects (font (size 1.27 1.27)))
    )
    (property "Footprint" "" (at 128.778 97.917 0)
      (effects (font (size 1.27 1.27)) hide)
    )
    (property "Datasheet" "" (at 128.778 97.917 0)
      (effects (font (size 1.27 1.27)) hide)
    )
    (pin "1" (uuid a7d7dd73-5eac-4c1d-9183-623435a46a20))
    (instances
      (project "skinResisitance"
        (path "/7423c7a1-84f1-4977-97d9-6209231a3837/42732af2-4150-48e3-a633-6593869e46bd"
          (reference "#PWR039") (unit 1)
        )
      )
    )
  )

  (symbol (lib_id "Jumper:Jumper_2_Open") (at 165.989 72.898 0) (unit 1)
    (in_bom yes) (on_board yes) (dnp no) (fields_autoplaced)
    (uuid bc990c3d-6041-4d6a-888a-92f251720f71)
    (property "Reference" "JP9" (at 165.989 66.04 0)
      (effects (font (size 1.27 1.27)))
    )
    (property "Value" "Jumper_2_Open" (at 165.989 68.58 0)
      (effects (font (size 1.27 1.27)))
    )
    (property "Footprint" "Jumper:SolderJumper-2_P1.3mm_Open_RoundedPad1.0x1.5mm" (at 165.989 72.898 0)
      (effects (font (size 1.27 1.27)) hide)
    )
    (property "Datasheet" "~" (at 165.989 72.898 0)
      (effects (font (size 1.27 1.27)) hide)
    )
    (pin "1" (uuid 4e759d8a-5a8a-4da5-920d-b422106b326a))
    (pin "2" (uuid a395824d-3297-44cd-b003-70c2c4079ecf))
    (instances
      (project "skinResisitance"
        (path "/7423c7a1-84f1-4977-97d9-6209231a3837/42732af2-4150-48e3-a633-6593869e46bd"
          (reference "JP9") (unit 1)
        )
      )
    )
  )

  (symbol (lib_id "Device:L") (at 127.127 63.373 90) (unit 1)
    (in_bom yes) (on_board yes) (dnp no) (fields_autoplaced)
    (uuid c2053a74-c5a1-418c-84ec-81dcb7b8f86b)
    (property "Reference" "L1" (at 127.127 58.42 90)
      (effects (font (size 1.27 1.27)))
    )
    (property "Value" "56u" (at 127.127 60.96 90)
      (effects (font (size 1.27 1.27)))
    )
    (property "Footprint" "Inductor_SMD:L_6.3x6.3_H3" (at 127.127 63.373 0)
      (effects (font (size 1.27 1.27)) hide)
    )
    (property "Datasheet" "~" (at 127.127 63.373 0)
      (effects (font (size 1.27 1.27)) hide)
    )
    (pin "1" (uuid 2ed41b91-6e2c-40a2-8a32-2b66cac64d64))
    (pin "2" (uuid 677bf4d9-f06f-4a51-b5c4-0342220effcd))
    (instances
      (project "skinResisitance"
        (path "/7423c7a1-84f1-4977-97d9-6209231a3837/42732af2-4150-48e3-a633-6593869e46bd"
          (reference "L1") (unit 1)
        )
      )
    )
  )

  (symbol (lib_id "Switch:SW_Push") (at 85.09 58.42 270) (mirror x) (unit 1)
    (in_bom yes) (on_board yes) (dnp no)
    (uuid d1da84db-5301-429b-ada8-738bd5663341)
    (property "Reference" "SW?" (at 92.075 58.42 0)
      (effects (font (size 1.27 1.27)))
    )
    (property "Value" "SW_Push" (at 89.535 58.42 0)
      (effects (font (size 1.27 1.27)))
    )
    (property "Footprint" "Button_Switch_THT:SW_Tactile_SPST_Angled_PTS645Vx83-2LFS" (at 90.17 58.42 0)
      (effects (font (size 1.27 1.27)) hide)
    )
    (property "Datasheet" "~" (at 90.17 58.42 0)
      (effects (font (size 1.27 1.27)) hide)
    )
    (pin "1" (uuid 911aa28b-2e0b-4542-aefa-1c042767ded8))
    (pin "2" (uuid ac7c2e69-72e1-4e25-9023-49e118cd9968))
    (instances
      (project "buzzers_speakers"
        (path "/237270d4-dbb4-4c98-8ef7-25a6f469254e"
          (reference "SW?") (unit 1)
        )
      )
      (project "skinResisitance"
        (path "/7423c7a1-84f1-4977-97d9-6209231a3837/42732af2-4150-48e3-a633-6593869e46bd"
          (reference "SW1") (unit 1)
        )
      )
      (project "buzzers_x16"
        (path "/d3e7770f-7d76-4f01-8656-616cb78a1417"
          (reference "SW?") (unit 1)
        )
      )
    )
  )

  (symbol (lib_id "power:GND") (at 78.105 66.04 0) (unit 1)
    (in_bom yes) (on_board yes) (dnp no) (fields_autoplaced)
    (uuid d6b57612-0cea-4c6d-bbc5-91783bd05d4d)
    (property "Reference" "#PWR?" (at 78.105 72.39 0)
      (effects (font (size 1.27 1.27)) hide)
    )
    (property "Value" "GND" (at 78.105 70.485 0)
      (effects (font (size 1.27 1.27)))
    )
    (property "Footprint" "" (at 78.105 66.04 0)
      (effects (font (size 1.27 1.27)) hide)
    )
    (property "Datasheet" "" (at 78.105 66.04 0)
      (effects (font (size 1.27 1.27)) hide)
    )
    (pin "1" (uuid 62829617-f862-41dc-864b-34a4185543cd))
    (instances
      (project "buzzers_speakers"
        (path "/237270d4-dbb4-4c98-8ef7-25a6f469254e"
          (reference "#PWR?") (unit 1)
        )
      )
      (project "skinResisitance"
        (path "/7423c7a1-84f1-4977-97d9-6209231a3837/42732af2-4150-48e3-a633-6593869e46bd"
          (reference "#PWR034") (unit 1)
        )
      )
    )
  )

  (symbol (lib_id "usb-powerbank:usb_module") (at 65.405 43.815 0) (unit 1)
    (in_bom yes) (on_board yes) (dnp no) (fields_autoplaced)
    (uuid da9995e2-b490-4f5c-a129-47572794c777)
    (property "Reference" "U?" (at 65.405 39.37 0)
      (effects (font (size 1.27 1.27)))
    )
    (property "Value" "usb_module" (at 65.405 41.91 0)
      (effects (font (size 1.27 1.27)))
    )
    (property "Footprint" "usb-powerbank:usb_module" (at 65.405 43.815 0)
      (effects (font (size 1.27 1.27)) hide)
    )
    (property "Datasheet" "" (at 65.405 43.815 0)
      (effects (font (size 1.27 1.27)) hide)
    )
    (pin "1" (uuid 7c1733f3-9a2d-4801-a877-db0f96e9b743))
    (pin "2" (uuid 95a4fa43-6516-44fb-b437-e51cfdb01419))
    (pin "3" (uuid 8f8ee1af-20e7-40f5-90ed-777d2a8fa2d2))
    (pin "4" (uuid 9c25bb7a-21fb-4e48-9983-de28a7e48cb6))
    (pin "5" (uuid c2b6d46f-ff55-4b82-9bb1-95320eb0428e))
    (instances
      (project "buzzers_speakers"
        (path "/237270d4-dbb4-4c98-8ef7-25a6f469254e"
          (reference "U?") (unit 1)
        )
      )
      (project "skinResisitance"
        (path "/7423c7a1-84f1-4977-97d9-6209231a3837/42732af2-4150-48e3-a633-6593869e46bd"
          (reference "U8") (unit 1)
        )
      )
    )
  )

  (symbol (lib_id "power:+5VA") (at 132.842 62.103 0) (unit 1)
    (in_bom yes) (on_board yes) (dnp no) (fields_autoplaced)
    (uuid db184bdd-11d0-42bb-8300-3fd6507615aa)
    (property "Reference" "#PWR040" (at 132.842 65.913 0)
      (effects (font (size 1.27 1.27)) hide)
    )
    (property "Value" "+5VA" (at 132.842 57.15 0)
      (effects (font (size 1.27 1.27)))
    )
    (property "Footprint" "" (at 132.842 62.103 0)
      (effects (font (size 1.27 1.27)) hide)
    )
    (property "Datasheet" "" (at 132.842 62.103 0)
      (effects (font (size 1.27 1.27)) hide)
    )
    (pin "1" (uuid 9a0ac222-b1ad-4f41-852e-b41364451a39))
    (instances
      (project "skinResisitance"
        (path "/7423c7a1-84f1-4977-97d9-6209231a3837/42732af2-4150-48e3-a633-6593869e46bd"
          (reference "#PWR040") (unit 1)
        )
      )
    )
  )

  (symbol (lib_id "Device:C_Polarized") (at 132.842 69.723 0) (unit 1)
    (in_bom yes) (on_board yes) (dnp no) (fields_autoplaced)
    (uuid f709e2f3-8236-4de5-af76-61b128c7761e)
    (property "Reference" "C14" (at 135.89 67.564 0)
      (effects (font (size 1.27 1.27)) (justify left))
    )
    (property "Value" "220u" (at 135.89 70.104 0)
      (effects (font (size 1.27 1.27)) (justify left))
    )
    (property "Footprint" "Capacitor_THT:CP_Radial_D6.3mm_P2.50mm" (at 133.8072 73.533 0)
      (effects (font (size 1.27 1.27)) hide)
    )
    (property "Datasheet" "~" (at 132.842 69.723 0)
      (effects (font (size 1.27 1.27)) hide)
    )
    (pin "1" (uuid b1e689fa-ad32-4a60-9074-b96e7bb7b03c))
    (pin "2" (uuid dd38c417-a224-43b4-b7ae-0f55ec8e1636))
    (instances
      (project "skinResisitance"
        (path "/7423c7a1-84f1-4977-97d9-6209231a3837/42732af2-4150-48e3-a633-6593869e46bd"
          (reference "C14") (unit 1)
        )
      )
    )
  )
)
