(kicad_sch (version 20230121) (generator eeschema)

  (uuid 160f727d-5d17-4087-aa69-05c03bc624e6)

  (paper "A4")

  (lib_symbols
    (symbol "Amplifier_Operational:MCP602" (pin_names (offset 0.127)) (in_bom yes) (on_board yes)
      (property "Reference" "U" (at 0 5.08 0)
        (effects (font (size 1.27 1.27)) (justify left))
      )
      (property "Value" "MCP602" (at 0 -5.08 0)
        (effects (font (size 1.27 1.27)) (justify left))
      )
      (property "Footprint" "" (at 0 0 0)
        (effects (font (size 1.27 1.27)) hide)
      )
      (property "Datasheet" "http://ww1.microchip.com/downloads/en/DeviceDoc/21314g.pdf" (at 0 0 0)
        (effects (font (size 1.27 1.27)) hide)
      )
      (property "ki_locked" "" (at 0 0 0)
        (effects (font (size 1.27 1.27)))
      )
      (property "ki_keywords" "dual opamp" (at 0 0 0)
        (effects (font (size 1.27 1.27)) hide)
      )
      (property "ki_description" "Dual 2.7V to 6.0V Single Supply CMOS Op Amps, DIP-8/SOIC-8/TSSOP-8" (at 0 0 0)
        (effects (font (size 1.27 1.27)) hide)
      )
      (property "ki_fp_filters" "SOIC*3.9x4.9mm*P1.27mm* DIP*W7.62mm* TO*99* OnSemi*Micro8* TSSOP*3x3mm*P0.65mm* TSSOP*4.4x3mm*P0.65mm* MSOP*3x3mm*P0.65mm* SSOP*3.9x4.9mm*P0.635mm* LFCSP*2x2mm*P0.5mm* *SIP* SOIC*5.3x6.2mm*P1.27mm*" (at 0 0 0)
        (effects (font (size 1.27 1.27)) hide)
      )
      (symbol "MCP602_1_1"
        (polyline
          (pts
            (xy -5.08 5.08)
            (xy 5.08 0)
            (xy -5.08 -5.08)
            (xy -5.08 5.08)
          )
          (stroke (width 0.254) (type default))
          (fill (type background))
        )
        (pin output line (at 7.62 0 180) (length 2.54)
          (name "~" (effects (font (size 1.27 1.27))))
          (number "1" (effects (font (size 1.27 1.27))))
        )
        (pin input line (at -7.62 -2.54 0) (length 2.54)
          (name "-" (effects (font (size 1.27 1.27))))
          (number "2" (effects (font (size 1.27 1.27))))
        )
        (pin input line (at -7.62 2.54 0) (length 2.54)
          (name "+" (effects (font (size 1.27 1.27))))
          (number "3" (effects (font (size 1.27 1.27))))
        )
      )
      (symbol "MCP602_2_1"
        (polyline
          (pts
            (xy -5.08 5.08)
            (xy 5.08 0)
            (xy -5.08 -5.08)
            (xy -5.08 5.08)
          )
          (stroke (width 0.254) (type default))
          (fill (type background))
        )
        (pin input line (at -7.62 2.54 0) (length 2.54)
          (name "+" (effects (font (size 1.27 1.27))))
          (number "5" (effects (font (size 1.27 1.27))))
        )
        (pin input line (at -7.62 -2.54 0) (length 2.54)
          (name "-" (effects (font (size 1.27 1.27))))
          (number "6" (effects (font (size 1.27 1.27))))
        )
        (pin output line (at 7.62 0 180) (length 2.54)
          (name "~" (effects (font (size 1.27 1.27))))
          (number "7" (effects (font (size 1.27 1.27))))
        )
      )
      (symbol "MCP602_3_1"
        (pin power_in line (at -2.54 -7.62 90) (length 3.81)
          (name "V-" (effects (font (size 1.27 1.27))))
          (number "4" (effects (font (size 1.27 1.27))))
        )
        (pin power_in line (at -2.54 7.62 270) (length 3.81)
          (name "V+" (effects (font (size 1.27 1.27))))
          (number "8" (effects (font (size 1.27 1.27))))
        )
      )
    )
    (symbol "Connector:Conn_01x02_Pin" (pin_names (offset 1.016) hide) (in_bom yes) (on_board yes)
      (property "Reference" "J" (at 0 2.54 0)
        (effects (font (size 1.27 1.27)))
      )
      (property "Value" "Conn_01x02_Pin" (at 0 -5.08 0)
        (effects (font (size 1.27 1.27)))
      )
      (property "Footprint" "" (at 0 0 0)
        (effects (font (size 1.27 1.27)) hide)
      )
      (property "Datasheet" "~" (at 0 0 0)
        (effects (font (size 1.27 1.27)) hide)
      )
      (property "ki_locked" "" (at 0 0 0)
        (effects (font (size 1.27 1.27)))
      )
      (property "ki_keywords" "connector" (at 0 0 0)
        (effects (font (size 1.27 1.27)) hide)
      )
      (property "ki_description" "Generic connector, single row, 01x02, script generated" (at 0 0 0)
        (effects (font (size 1.27 1.27)) hide)
      )
      (property "ki_fp_filters" "Connector*:*_1x??_*" (at 0 0 0)
        (effects (font (size 1.27 1.27)) hide)
      )
      (symbol "Conn_01x02_Pin_1_1"
        (polyline
          (pts
            (xy 1.27 -2.54)
            (xy 0.8636 -2.54)
          )
          (stroke (width 0.1524) (type default))
          (fill (type none))
        )
        (polyline
          (pts
            (xy 1.27 0)
            (xy 0.8636 0)
          )
          (stroke (width 0.1524) (type default))
          (fill (type none))
        )
        (rectangle (start 0.8636 -2.413) (end 0 -2.667)
          (stroke (width 0.1524) (type default))
          (fill (type outline))
        )
        (rectangle (start 0.8636 0.127) (end 0 -0.127)
          (stroke (width 0.1524) (type default))
          (fill (type outline))
        )
        (pin passive line (at 5.08 0 180) (length 3.81)
          (name "Pin_1" (effects (font (size 1.27 1.27))))
          (number "1" (effects (font (size 1.27 1.27))))
        )
        (pin passive line (at 5.08 -2.54 180) (length 3.81)
          (name "Pin_2" (effects (font (size 1.27 1.27))))
          (number "2" (effects (font (size 1.27 1.27))))
        )
      )
    )
    (symbol "Device:C" (pin_numbers hide) (pin_names (offset 0.254)) (in_bom yes) (on_board yes)
      (property "Reference" "C" (at 0.635 2.54 0)
        (effects (font (size 1.27 1.27)) (justify left))
      )
      (property "Value" "C" (at 0.635 -2.54 0)
        (effects (font (size 1.27 1.27)) (justify left))
      )
      (property "Footprint" "" (at 0.9652 -3.81 0)
        (effects (font (size 1.27 1.27)) hide)
      )
      (property "Datasheet" "~" (at 0 0 0)
        (effects (font (size 1.27 1.27)) hide)
      )
      (property "ki_keywords" "cap capacitor" (at 0 0 0)
        (effects (font (size 1.27 1.27)) hide)
      )
      (property "ki_description" "Unpolarized capacitor" (at 0 0 0)
        (effects (font (size 1.27 1.27)) hide)
      )
      (property "ki_fp_filters" "C_*" (at 0 0 0)
        (effects (font (size 1.27 1.27)) hide)
      )
      (symbol "C_0_1"
        (polyline
          (pts
            (xy -2.032 -0.762)
            (xy 2.032 -0.762)
          )
          (stroke (width 0.508) (type default))
          (fill (type none))
        )
        (polyline
          (pts
            (xy -2.032 0.762)
            (xy 2.032 0.762)
          )
          (stroke (width 0.508) (type default))
          (fill (type none))
        )
      )
      (symbol "C_1_1"
        (pin passive line (at 0 3.81 270) (length 2.794)
          (name "~" (effects (font (size 1.27 1.27))))
          (number "1" (effects (font (size 1.27 1.27))))
        )
        (pin passive line (at 0 -3.81 90) (length 2.794)
          (name "~" (effects (font (size 1.27 1.27))))
          (number "2" (effects (font (size 1.27 1.27))))
        )
      )
    )
    (symbol "Device:R" (pin_numbers hide) (pin_names (offset 0)) (in_bom yes) (on_board yes)
      (property "Reference" "R" (at 2.032 0 90)
        (effects (font (size 1.27 1.27)))
      )
      (property "Value" "R" (at 0 0 90)
        (effects (font (size 1.27 1.27)))
      )
      (property "Footprint" "" (at -1.778 0 90)
        (effects (font (size 1.27 1.27)) hide)
      )
      (property "Datasheet" "~" (at 0 0 0)
        (effects (font (size 1.27 1.27)) hide)
      )
      (property "ki_keywords" "R res resistor" (at 0 0 0)
        (effects (font (size 1.27 1.27)) hide)
      )
      (property "ki_description" "Resistor" (at 0 0 0)
        (effects (font (size 1.27 1.27)) hide)
      )
      (property "ki_fp_filters" "R_*" (at 0 0 0)
        (effects (font (size 1.27 1.27)) hide)
      )
      (symbol "R_0_1"
        (rectangle (start -1.016 -2.54) (end 1.016 2.54)
          (stroke (width 0.254) (type default))
          (fill (type none))
        )
      )
      (symbol "R_1_1"
        (pin passive line (at 0 3.81 270) (length 1.27)
          (name "~" (effects (font (size 1.27 1.27))))
          (number "1" (effects (font (size 1.27 1.27))))
        )
        (pin passive line (at 0 -3.81 90) (length 1.27)
          (name "~" (effects (font (size 1.27 1.27))))
          (number "2" (effects (font (size 1.27 1.27))))
        )
      )
    )
    (symbol "power:+3.3VA" (power) (pin_names (offset 0)) (in_bom yes) (on_board yes)
      (property "Reference" "#PWR" (at 0 -3.81 0)
        (effects (font (size 1.27 1.27)) hide)
      )
      (property "Value" "+3.3VA" (at 0 3.556 0)
        (effects (font (size 1.27 1.27)))
      )
      (property "Footprint" "" (at 0 0 0)
        (effects (font (size 1.27 1.27)) hide)
      )
      (property "Datasheet" "" (at 0 0 0)
        (effects (font (size 1.27 1.27)) hide)
      )
      (property "ki_keywords" "global power" (at 0 0 0)
        (effects (font (size 1.27 1.27)) hide)
      )
      (property "ki_description" "Power symbol creates a global label with name \"+3.3VA\"" (at 0 0 0)
        (effects (font (size 1.27 1.27)) hide)
      )
      (symbol "+3.3VA_0_1"
        (polyline
          (pts
            (xy -0.762 1.27)
            (xy 0 2.54)
          )
          (stroke (width 0) (type default))
          (fill (type none))
        )
        (polyline
          (pts
            (xy 0 0)
            (xy 0 2.54)
          )
          (stroke (width 0) (type default))
          (fill (type none))
        )
        (polyline
          (pts
            (xy 0 2.54)
            (xy 0.762 1.27)
          )
          (stroke (width 0) (type default))
          (fill (type none))
        )
      )
      (symbol "+3.3VA_1_1"
        (pin power_in line (at 0 0 90) (length 0) hide
          (name "+3.3VA" (effects (font (size 1.27 1.27))))
          (number "1" (effects (font (size 1.27 1.27))))
        )
      )
    )
    (symbol "power:+5VA" (power) (pin_names (offset 0)) (in_bom yes) (on_board yes)
      (property "Reference" "#PWR" (at 0 -3.81 0)
        (effects (font (size 1.27 1.27)) hide)
      )
      (property "Value" "+5VA" (at 0 3.556 0)
        (effects (font (size 1.27 1.27)))
      )
      (property "Footprint" "" (at 0 0 0)
        (effects (font (size 1.27 1.27)) hide)
      )
      (property "Datasheet" "" (at 0 0 0)
        (effects (font (size 1.27 1.27)) hide)
      )
      (property "ki_keywords" "global power" (at 0 0 0)
        (effects (font (size 1.27 1.27)) hide)
      )
      (property "ki_description" "Power symbol creates a global label with name \"+5VA\"" (at 0 0 0)
        (effects (font (size 1.27 1.27)) hide)
      )
      (symbol "+5VA_0_1"
        (polyline
          (pts
            (xy -0.762 1.27)
            (xy 0 2.54)
          )
          (stroke (width 0) (type default))
          (fill (type none))
        )
        (polyline
          (pts
            (xy 0 0)
            (xy 0 2.54)
          )
          (stroke (width 0) (type default))
          (fill (type none))
        )
        (polyline
          (pts
            (xy 0 2.54)
            (xy 0.762 1.27)
          )
          (stroke (width 0) (type default))
          (fill (type none))
        )
      )
      (symbol "+5VA_1_1"
        (pin power_in line (at 0 0 90) (length 0) hide
          (name "+5VA" (effects (font (size 1.27 1.27))))
          (number "1" (effects (font (size 1.27 1.27))))
        )
      )
    )
  )

  (junction (at 140.97 97.79) (diameter 0) (color 0 0 0 0)
    (uuid 0c6f8363-2c5e-4db8-a97b-c9a671e1c0d7)
  )
  (junction (at 165.1 107.823) (diameter 0) (color 0 0 0 0)
    (uuid 1317c957-62af-4a9e-a5d6-74f541c32207)
  )
  (junction (at 178.562 73.406) (diameter 0) (color 0 0 0 0)
    (uuid 398317a2-1ea9-4928-9580-242c822e15c8)
  )
  (junction (at 104.267 105.283) (diameter 0) (color 0 0 0 0)
    (uuid 718afa19-e888-40c2-9253-d5c256e3dd21)
  )
  (junction (at 150.114 73.406) (diameter 0) (color 0 0 0 0)
    (uuid 7a83548c-1cdb-438d-b4a9-e7f235483860)
  )
  (junction (at 165.1 97.79) (diameter 0) (color 0 0 0 0)
    (uuid 82b44144-bb07-4019-a03e-3b42643373b2)
  )
  (junction (at 126.746 105.283) (diameter 0) (color 0 0 0 0)
    (uuid 836aa9d1-be21-4ebb-a227-e51e58b95ba6)
  )
  (junction (at 140.97 105.283) (diameter 0) (color 0 0 0 0)
    (uuid acd9fdd4-9035-4f14-b165-550f1bae15b3)
  )

  (wire (pts (xy 138.303 105.283) (xy 140.97 105.283))
    (stroke (width 0) (type default))
    (uuid 0df56c43-6753-4d49-9894-99ebb2004a73)
  )
  (wire (pts (xy 126.746 105.283) (xy 126.746 107.95))
    (stroke (width 0) (type default))
    (uuid 1ad4a587-305a-4ace-ab2c-30feeb3a7b3d)
  )
  (wire (pts (xy 140.97 88.138) (xy 140.97 97.79))
    (stroke (width 0) (type default))
    (uuid 207b9fa6-1e55-4e93-8047-4a62e9e65be8)
  )
  (wire (pts (xy 178.562 73.406) (xy 193.802 73.406))
    (stroke (width 0) (type default))
    (uuid 216fdd0c-69ec-454b-9bde-bd042b333c5e)
  )
  (wire (pts (xy 150.114 58.293) (xy 150.114 61.849))
    (stroke (width 0) (type default))
    (uuid 236de296-bc10-4559-897c-49364d55843e)
  )
  (wire (pts (xy 104.267 105.283) (xy 104.267 106.68))
    (stroke (width 0) (type default))
    (uuid 25981158-0c24-4fd3-996c-bd1dbc5c81f1)
  )
  (wire (pts (xy 92.71 105.283) (xy 104.267 105.283))
    (stroke (width 0) (type default))
    (uuid 2977ec01-c863-491a-8f1b-6b24e9064222)
  )
  (wire (pts (xy 149.225 88.138) (xy 140.97 88.138))
    (stroke (width 0) (type default))
    (uuid 2990e422-bfcd-4892-b952-f00239eccf51)
  )
  (wire (pts (xy 165.1 107.823) (xy 169.545 107.823))
    (stroke (width 0) (type default))
    (uuid 2d124fed-e959-4268-a1ee-51318f807fca)
  )
  (wire (pts (xy 147.32 110.363) (xy 144.78 110.363))
    (stroke (width 0) (type default))
    (uuid 33ffdc75-ba1c-41b7-bede-1d032bba2974)
  )
  (wire (pts (xy 156.845 88.138) (xy 165.1 88.138))
    (stroke (width 0) (type default))
    (uuid 3b42fa01-ca88-4d1f-92af-94a1bd16f674)
  )
  (wire (pts (xy 165.1 97.79) (xy 165.1 107.823))
    (stroke (width 0) (type default))
    (uuid 4352893a-4c6b-428c-be0d-d7933f7be19a)
  )
  (wire (pts (xy 124.333 105.283) (xy 126.746 105.283))
    (stroke (width 0) (type default))
    (uuid 446c65da-de11-43a0-bd89-a9151343705d)
  )
  (wire (pts (xy 144.78 110.363) (xy 144.78 113.157))
    (stroke (width 0) (type default))
    (uuid 454ff2fd-ad46-4267-a4bf-056354a6975c)
  )
  (wire (pts (xy 178.562 95.25) (xy 190.754 95.25))
    (stroke (width 0) (type default))
    (uuid 4608d4fd-6da7-4697-90ad-3ef4290142f5)
  )
  (wire (pts (xy 104.267 114.3) (xy 104.267 116.459))
    (stroke (width 0) (type default))
    (uuid 67729ea1-a018-4a40-8662-dd187dbc52ef)
  )
  (wire (pts (xy 156.718 97.79) (xy 165.1 97.79))
    (stroke (width 0) (type default))
    (uuid 69ebf4bd-1861-438d-90df-f9d480aa1225)
  )
  (wire (pts (xy 140.97 105.283) (xy 147.32 105.283))
    (stroke (width 0) (type default))
    (uuid 75083828-17b2-46d1-b4cd-03b6139bde72)
  )
  (wire (pts (xy 142.24 73.406) (xy 150.114 73.406))
    (stroke (width 0) (type default))
    (uuid 7536becd-35a2-4623-82cc-1c2da4c265af)
  )
  (wire (pts (xy 162.56 107.823) (xy 165.1 107.823))
    (stroke (width 0) (type default))
    (uuid 77cdbc98-6814-4e23-a4c8-43e4e3fb183c)
  )
  (wire (pts (xy 126.746 105.283) (xy 130.683 105.283))
    (stroke (width 0) (type default))
    (uuid 7efdd67a-bd5c-4def-a49f-86c7b194092f)
  )
  (wire (pts (xy 165.1 97.79) (xy 190.754 97.79))
    (stroke (width 0) (type default))
    (uuid 8ef83132-542f-49af-9e83-75cd09225822)
  )
  (wire (pts (xy 104.267 92.837) (xy 104.267 96.393))
    (stroke (width 0) (type default))
    (uuid 902c1726-7b4f-4ffc-8030-04e83866b5ce)
  )
  (wire (pts (xy 104.267 105.283) (xy 116.713 105.283))
    (stroke (width 0) (type default))
    (uuid 93d29caa-c5e1-4b89-a5f3-f2bb2671a477)
  )
  (wire (pts (xy 140.97 97.79) (xy 140.97 105.283))
    (stroke (width 0) (type default))
    (uuid 95e42b18-23eb-4ecb-86d7-0d23690cfed1)
  )
  (wire (pts (xy 126.746 115.57) (xy 126.746 117.348))
    (stroke (width 0) (type default))
    (uuid a5a7396a-91d9-409d-af4c-72712e8d1c9b)
  )
  (wire (pts (xy 149.098 97.79) (xy 140.97 97.79))
    (stroke (width 0) (type default))
    (uuid afb11c9e-fd09-42e3-b52e-b53673578f21)
  )
  (wire (pts (xy 165.1 88.138) (xy 165.1 97.79))
    (stroke (width 0) (type default))
    (uuid be6af138-4095-404e-8bf1-70d1700ab365)
  )
  (wire (pts (xy 150.114 73.406) (xy 178.562 73.406))
    (stroke (width 0) (type default))
    (uuid c04bbdbb-f51e-44c1-8434-48320cccbd4a)
  )
  (wire (pts (xy 178.562 73.406) (xy 178.562 95.25))
    (stroke (width 0) (type default))
    (uuid d4c29bd3-2d06-4be1-97b3-d84dfea819e1)
  )
  (wire (pts (xy 177.165 107.823) (xy 193.675 107.823))
    (stroke (width 0) (type default))
    (uuid dc11a4e8-5ffd-4a28-ac11-8cccacd281c0)
  )
  (wire (pts (xy 150.114 69.469) (xy 150.114 73.406))
    (stroke (width 0) (type default))
    (uuid dd527718-37b6-4046-a3b8-cd324d174061)
  )
  (wire (pts (xy 104.267 104.013) (xy 104.267 105.283))
    (stroke (width 0) (type default))
    (uuid e3f1a417-6f03-4070-96b4-cc805b9669f9)
  )

  (text "Shifts voltage from 0-3.3V to 0.33V around the 1.65V"
    (at 153.416 122.809 0)
    (effects (font (size 1.27 1.27)) (justify left bottom))
    (uuid ee6cd195-97ad-4407-bea6-7d6e82dacaa1)
  )

  (global_label "1.65V" (shape input) (at 126.746 117.348 270) (fields_autoplaced)
    (effects (font (size 1.27 1.27)) (justify right))
    (uuid 1e8d5c86-9887-452f-8bf9-92856745a911)
    (property "Intersheetrefs" "${INTERSHEET_REFS}" (at 126.746 125.6551 90)
      (effects (font (size 1.27 1.27)) (justify right) hide)
    )
  )
  (global_label "1.65V" (shape input) (at 104.267 116.459 270) (fields_autoplaced)
    (effects (font (size 1.27 1.27)) (justify right))
    (uuid 80f164d7-c899-4384-92f0-342bfce0871b)
    (property "Intersheetrefs" "${INTERSHEET_REFS}" (at 104.267 124.7661 90)
      (effects (font (size 1.27 1.27)) (justify right) hide)
    )
  )
  (global_label "1.65V" (shape input) (at 144.78 113.157 270) (fields_autoplaced)
    (effects (font (size 1.27 1.27)) (justify right))
    (uuid 92c64e85-a51e-4d2c-93b3-cb23ef357100)
    (property "Intersheetrefs" "${INTERSHEET_REFS}" (at 144.78 121.4641 90)
      (effects (font (size 1.27 1.27)) (justify right) hide)
    )
  )

  (hierarchical_label "in_inverted" (shape input) (at 142.24 73.406 180) (fields_autoplaced)
    (effects (font (size 1.27 1.27)) (justify right))
    (uuid 59e7210f-83fa-4595-8b5a-9cb7afc21005)
  )
  (hierarchical_label "in" (shape input) (at 92.71 105.283 180) (fields_autoplaced)
    (effects (font (size 1.27 1.27)) (justify right))
    (uuid 949fbd3b-c2b7-4786-a96a-9eb8f999aea4)
  )
  (hierarchical_label "out_inverted" (shape output) (at 193.802 73.406 0) (fields_autoplaced)
    (effects (font (size 1.27 1.27)) (justify left))
    (uuid cdeca8cf-f836-442f-be30-60699480e140)
  )
  (hierarchical_label "out" (shape output) (at 193.675 107.823 0) (fields_autoplaced)
    (effects (font (size 1.27 1.27)) (justify left))
    (uuid ee96321e-f77e-4fda-9e1a-083fbc0e1b9a)
  )

  (symbol (lib_id "Device:R") (at 152.908 97.79 270) (unit 1)
    (in_bom yes) (on_board yes) (dnp no) (fields_autoplaced)
    (uuid 33d5627e-8cdf-4bcb-b658-0852571dae2e)
    (property "Reference" "R?" (at 152.908 91.44 90)
      (effects (font (size 1.27 1.27)))
    )
    (property "Value" "4k7" (at 152.908 93.98 90)
      (effects (font (size 1.27 1.27)))
    )
    (property "Footprint" "Resistor_SMD:R_0805_2012Metric_Pad1.20x1.40mm_HandSolder" (at 152.908 96.012 90)
      (effects (font (size 1.27 1.27)) hide)
    )
    (property "Datasheet" "~" (at 152.908 97.79 0)
      (effects (font (size 1.27 1.27)) hide)
    )
    (pin "1" (uuid 91b2a66f-3ce1-4cd0-a9ff-8202cd8724a8))
    (pin "2" (uuid 9633411c-a8ce-4c26-9bb7-9f5355c8bcf4))
    (instances
      (project "skinResisitance"
        (path "/7423c7a1-84f1-4977-97d9-6209231a3837/d161da69-ff4e-4b25-911a-65f9f3d9873e"
          (reference "R?") (unit 1)
        )
        (path "/7423c7a1-84f1-4977-97d9-6209231a3837/d161da69-ff4e-4b25-911a-65f9f3d9873e/671350f1-73a0-49d6-8b77-8219c143b371"
          (reference "R46") (unit 1)
        )
      )
    )
  )

  (symbol (lib_id "power:+5VA") (at 150.114 58.293 0) (unit 1)
    (in_bom yes) (on_board yes) (dnp no) (fields_autoplaced)
    (uuid 356a755e-ea6e-4c82-a1fd-892d17409669)
    (property "Reference" "#PWR?" (at 150.114 62.103 0)
      (effects (font (size 1.27 1.27)) hide)
    )
    (property "Value" "+5VA" (at 150.114 53.213 0)
      (effects (font (size 1.27 1.27)))
    )
    (property "Footprint" "" (at 150.114 58.293 0)
      (effects (font (size 1.27 1.27)) hide)
    )
    (property "Datasheet" "" (at 150.114 58.293 0)
      (effects (font (size 1.27 1.27)) hide)
    )
    (pin "1" (uuid 4f12a444-9168-4ac7-8c87-2aa038dd6e25))
    (instances
      (project "skinResisitance"
        (path "/7423c7a1-84f1-4977-97d9-6209231a3837/d161da69-ff4e-4b25-911a-65f9f3d9873e"
          (reference "#PWR?") (unit 1)
        )
        (path "/7423c7a1-84f1-4977-97d9-6209231a3837/d161da69-ff4e-4b25-911a-65f9f3d9873e/671350f1-73a0-49d6-8b77-8219c143b371"
          (reference "#PWR055") (unit 1)
        )
      )
    )
  )

  (symbol (lib_id "power:+3.3VA") (at 104.267 92.837 0) (unit 1)
    (in_bom yes) (on_board yes) (dnp no) (fields_autoplaced)
    (uuid 4512966f-c2f3-49f7-9943-6b82348115b6)
    (property "Reference" "#PWR054" (at 104.267 96.647 0)
      (effects (font (size 1.27 1.27)) hide)
    )
    (property "Value" "+3.3VA" (at 104.267 88.011 0)
      (effects (font (size 1.27 1.27)))
    )
    (property "Footprint" "" (at 104.267 92.837 0)
      (effects (font (size 1.27 1.27)) hide)
    )
    (property "Datasheet" "" (at 104.267 92.837 0)
      (effects (font (size 1.27 1.27)) hide)
    )
    (pin "1" (uuid e84c03d4-975e-42af-acbd-817977082d28))
    (instances
      (project "skinResisitance"
        (path "/7423c7a1-84f1-4977-97d9-6209231a3837/d161da69-ff4e-4b25-911a-65f9f3d9873e/671350f1-73a0-49d6-8b77-8219c143b371"
          (reference "#PWR054") (unit 1)
        )
      )
    )
  )

  (symbol (lib_id "Device:C") (at 126.746 111.76 180) (unit 1)
    (in_bom yes) (on_board yes) (dnp no) (fields_autoplaced)
    (uuid 61a834a0-845a-45af-ac58-9d1df70e8587)
    (property "Reference" "C?" (at 130.81 110.49 0)
      (effects (font (size 1.27 1.27)) (justify right))
    )
    (property "Value" "NC" (at 130.81 113.03 0)
      (effects (font (size 1.27 1.27)) (justify right))
    )
    (property "Footprint" "Capacitor_SMD:C_0805_2012Metric_Pad1.18x1.45mm_HandSolder" (at 125.7808 107.95 0)
      (effects (font (size 1.27 1.27)) hide)
    )
    (property "Datasheet" "~" (at 126.746 111.76 0)
      (effects (font (size 1.27 1.27)) hide)
    )
    (pin "1" (uuid 3ebcfda5-6d8f-46fa-b6fb-958b92884010))
    (pin "2" (uuid 8c9695e8-d7e4-4a6c-8073-beb944125e38))
    (instances
      (project "skinResisitance"
        (path "/7423c7a1-84f1-4977-97d9-6209231a3837"
          (reference "C?") (unit 1)
        )
        (path "/7423c7a1-84f1-4977-97d9-6209231a3837/d161da69-ff4e-4b25-911a-65f9f3d9873e"
          (reference "C?") (unit 1)
        )
        (path "/7423c7a1-84f1-4977-97d9-6209231a3837/d161da69-ff4e-4b25-911a-65f9f3d9873e/671350f1-73a0-49d6-8b77-8219c143b371"
          (reference "C17") (unit 1)
        )
      )
    )
  )

  (symbol (lib_id "Device:R") (at 134.493 105.283 270) (unit 1)
    (in_bom yes) (on_board yes) (dnp no) (fields_autoplaced)
    (uuid 63bbcfb1-9e81-4c3e-bd53-bc6455a75444)
    (property "Reference" "R?" (at 134.493 99.06 90)
      (effects (font (size 1.27 1.27)))
    )
    (property "Value" "0R" (at 134.493 101.6 90)
      (effects (font (size 1.27 1.27)))
    )
    (property "Footprint" "Resistor_SMD:R_0805_2012Metric_Pad1.20x1.40mm_HandSolder" (at 134.493 103.505 90)
      (effects (font (size 1.27 1.27)) hide)
    )
    (property "Datasheet" "~" (at 134.493 105.283 0)
      (effects (font (size 1.27 1.27)) hide)
    )
    (pin "1" (uuid 69a87f32-fe2e-4462-bc66-f85a9e3969fc))
    (pin "2" (uuid 0f02a661-a3ec-4de9-96f2-fdc563dfe99a))
    (instances
      (project "skinResisitance"
        (path "/7423c7a1-84f1-4977-97d9-6209231a3837/d161da69-ff4e-4b25-911a-65f9f3d9873e"
          (reference "R?") (unit 1)
        )
        (path "/7423c7a1-84f1-4977-97d9-6209231a3837/d161da69-ff4e-4b25-911a-65f9f3d9873e/671350f1-73a0-49d6-8b77-8219c143b371"
          (reference "R45") (unit 1)
        )
      )
    )
  )

  (symbol (lib_id "Device:R") (at 173.355 107.823 90) (unit 1)
    (in_bom yes) (on_board yes) (dnp no) (fields_autoplaced)
    (uuid 659ecd9d-5393-4099-b67a-8cf602a3f6f7)
    (property "Reference" "R?" (at 173.355 101.473 90)
      (effects (font (size 1.27 1.27)))
    )
    (property "Value" "10R" (at 173.355 104.013 90)
      (effects (font (size 1.27 1.27)))
    )
    (property "Footprint" "Resistor_SMD:R_0805_2012Metric_Pad1.20x1.40mm_HandSolder" (at 173.355 109.601 90)
      (effects (font (size 1.27 1.27)) hide)
    )
    (property "Datasheet" "~" (at 173.355 107.823 0)
      (effects (font (size 1.27 1.27)) hide)
    )
    (pin "1" (uuid e0368af2-27da-41d6-b95f-d439d795f5c8))
    (pin "2" (uuid b93b588d-45e4-427d-92f5-2b935b43ffbf))
    (instances
      (project "skinResisitance"
        (path "/7423c7a1-84f1-4977-97d9-6209231a3837"
          (reference "R?") (unit 1)
        )
        (path "/7423c7a1-84f1-4977-97d9-6209231a3837/d161da69-ff4e-4b25-911a-65f9f3d9873e"
          (reference "R?") (unit 1)
        )
        (path "/7423c7a1-84f1-4977-97d9-6209231a3837/d161da69-ff4e-4b25-911a-65f9f3d9873e/671350f1-73a0-49d6-8b77-8219c143b371"
          (reference "R47") (unit 1)
        )
      )
    )
  )

  (symbol (lib_id "Device:R") (at 120.523 105.283 270) (unit 1)
    (in_bom yes) (on_board yes) (dnp no) (fields_autoplaced)
    (uuid 6e6177ee-b2a5-420f-81c7-f8e3e66ba8a8)
    (property "Reference" "R?" (at 120.523 99.06 90)
      (effects (font (size 1.27 1.27)))
    )
    (property "Value" "47k" (at 120.523 101.6 90)
      (effects (font (size 1.27 1.27)))
    )
    (property "Footprint" "Resistor_SMD:R_0805_2012Metric_Pad1.20x1.40mm_HandSolder" (at 120.523 103.505 90)
      (effects (font (size 1.27 1.27)) hide)
    )
    (property "Datasheet" "~" (at 120.523 105.283 0)
      (effects (font (size 1.27 1.27)) hide)
    )
    (pin "1" (uuid 5257224b-b429-4519-9912-1600a5ceb5e6))
    (pin "2" (uuid e0c0fe73-3f05-4d7b-8f0e-4e41aaa4b2a3))
    (instances
      (project "skinResisitance"
        (path "/7423c7a1-84f1-4977-97d9-6209231a3837/d161da69-ff4e-4b25-911a-65f9f3d9873e"
          (reference "R?") (unit 1)
        )
        (path "/7423c7a1-84f1-4977-97d9-6209231a3837/d161da69-ff4e-4b25-911a-65f9f3d9873e/671350f1-73a0-49d6-8b77-8219c143b371"
          (reference "R44") (unit 1)
        )
      )
    )
  )

  (symbol (lib_id "Device:C") (at 153.035 88.138 90) (unit 1)
    (in_bom yes) (on_board yes) (dnp no) (fields_autoplaced)
    (uuid a493662a-05d6-4178-8f35-9928fd63e795)
    (property "Reference" "C?" (at 153.035 81.153 90)
      (effects (font (size 1.27 1.27)))
    )
    (property "Value" "220p" (at 153.035 83.693 90)
      (effects (font (size 1.27 1.27)))
    )
    (property "Footprint" "Capacitor_SMD:C_0805_2012Metric_Pad1.18x1.45mm_HandSolder" (at 156.845 87.1728 0)
      (effects (font (size 1.27 1.27)) hide)
    )
    (property "Datasheet" "~" (at 153.035 88.138 0)
      (effects (font (size 1.27 1.27)) hide)
    )
    (pin "1" (uuid 5c28c19a-43f7-487f-bbd1-d9b87aa2ab0a))
    (pin "2" (uuid 907b00d0-ada5-4e04-bec2-d1aeb2d58793))
    (instances
      (project "skinResisitance"
        (path "/7423c7a1-84f1-4977-97d9-6209231a3837"
          (reference "C?") (unit 1)
        )
        (path "/7423c7a1-84f1-4977-97d9-6209231a3837/d161da69-ff4e-4b25-911a-65f9f3d9873e"
          (reference "C?") (unit 1)
        )
        (path "/7423c7a1-84f1-4977-97d9-6209231a3837/d161da69-ff4e-4b25-911a-65f9f3d9873e/671350f1-73a0-49d6-8b77-8219c143b371"
          (reference "C18") (unit 1)
        )
      )
    )
  )

  (symbol (lib_id "Device:R") (at 150.114 65.659 180) (unit 1)
    (in_bom yes) (on_board yes) (dnp no) (fields_autoplaced)
    (uuid a74ee06d-5cac-4155-94a0-38c53cee4d9e)
    (property "Reference" "R?" (at 152.654 64.389 0)
      (effects (font (size 1.27 1.27)) (justify right))
    )
    (property "Value" "1k" (at 152.654 66.929 0)
      (effects (font (size 1.27 1.27)) (justify right))
    )
    (property "Footprint" "Resistor_SMD:R_0805_2012Metric_Pad1.20x1.40mm_HandSolder" (at 151.892 65.659 90)
      (effects (font (size 1.27 1.27)) hide)
    )
    (property "Datasheet" "~" (at 150.114 65.659 0)
      (effects (font (size 1.27 1.27)) hide)
    )
    (pin "1" (uuid 4c5911f8-9285-4ba4-a41d-3eb978ecb532))
    (pin "2" (uuid c4359abc-6439-45a7-a44f-a621c4e5d821))
    (instances
      (project "skinResisitance"
        (path "/7423c7a1-84f1-4977-97d9-6209231a3837/d161da69-ff4e-4b25-911a-65f9f3d9873e"
          (reference "R?") (unit 1)
        )
        (path "/7423c7a1-84f1-4977-97d9-6209231a3837/d161da69-ff4e-4b25-911a-65f9f3d9873e/671350f1-73a0-49d6-8b77-8219c143b371"
          (reference "R43") (unit 1)
        )
      )
    )
  )

  (symbol (lib_id "Device:R") (at 104.267 100.203 180) (unit 1)
    (in_bom yes) (on_board yes) (dnp no) (fields_autoplaced)
    (uuid b9130f78-edd9-4d62-b7db-3c2b02c868c5)
    (property "Reference" "R?" (at 106.807 98.933 0)
      (effects (font (size 1.27 1.27)) (justify right))
    )
    (property "Value" "1k" (at 106.807 101.473 0)
      (effects (font (size 1.27 1.27)) (justify right))
    )
    (property "Footprint" "Resistor_SMD:R_0805_2012Metric_Pad1.20x1.40mm_HandSolder" (at 106.045 100.203 90)
      (effects (font (size 1.27 1.27)) hide)
    )
    (property "Datasheet" "~" (at 104.267 100.203 0)
      (effects (font (size 1.27 1.27)) hide)
    )
    (pin "1" (uuid 55fe372f-000d-420e-a5e3-58a4c8dda68e))
    (pin "2" (uuid 32508804-64fb-4f2c-83aa-4ecc6f70a055))
    (instances
      (project "skinResisitance"
        (path "/7423c7a1-84f1-4977-97d9-6209231a3837/d161da69-ff4e-4b25-911a-65f9f3d9873e"
          (reference "R?") (unit 1)
        )
        (path "/7423c7a1-84f1-4977-97d9-6209231a3837/d161da69-ff4e-4b25-911a-65f9f3d9873e/671350f1-73a0-49d6-8b77-8219c143b371"
          (reference "R41") (unit 1)
        )
      )
    )
  )

  (symbol (lib_id "Connector:Conn_01x02_Pin") (at 195.834 97.79 180) (unit 1)
    (in_bom yes) (on_board yes) (dnp no) (fields_autoplaced)
    (uuid c85d0918-d67e-4162-ab05-b13b226c2132)
    (property "Reference" "J?" (at 197.358 95.25 0)
      (effects (font (size 1.27 1.27)) (justify right))
    )
    (property "Value" "testpoint" (at 197.358 97.79 0)
      (effects (font (size 1.27 1.27)) (justify right))
    )
    (property "Footprint" "Connector_PinHeader_2.54mm:PinHeader_1x02_P2.54mm_Vertical" (at 195.834 97.79 0)
      (effects (font (size 1.27 1.27)) hide)
    )
    (property "Datasheet" "~" (at 195.834 97.79 0)
      (effects (font (size 1.27 1.27)) hide)
    )
    (pin "1" (uuid 0fc048c1-7f1d-46d8-b0fb-814646b5023c))
    (pin "2" (uuid 3de3f00e-1641-4c4a-97c1-ac5b7acf1e30))
    (instances
      (project "skinResisitance"
        (path "/7423c7a1-84f1-4977-97d9-6209231a3837/d161da69-ff4e-4b25-911a-65f9f3d9873e"
          (reference "J?") (unit 1)
        )
        (path "/7423c7a1-84f1-4977-97d9-6209231a3837/d161da69-ff4e-4b25-911a-65f9f3d9873e/671350f1-73a0-49d6-8b77-8219c143b371"
          (reference "J7") (unit 1)
        )
      )
    )
  )

  (symbol (lib_id "Amplifier_Operational:MCP602") (at 154.94 107.823 0) (mirror x) (unit 2)
    (in_bom yes) (on_board yes) (dnp no)
    (uuid de663cc6-2ecd-4a71-90c6-36901abfa6d0)
    (property "Reference" "U3B?" (at 156.718 112.903 0)
      (effects (font (size 1.27 1.27)))
    )
    (property "Value" "MCP602" (at 158.369 115.697 0)
      (effects (font (size 1.27 1.27)))
    )
    (property "Footprint" "Package_SO:SO-8_3.9x4.9mm_P1.27mm" (at 154.94 107.823 0)
      (effects (font (size 1.27 1.27)) hide)
    )
    (property "Datasheet" "http://ww1.microchip.com/downloads/en/DeviceDoc/21314g.pdf" (at 154.94 107.823 0)
      (effects (font (size 1.27 1.27)) hide)
    )
    (pin "1" (uuid a678f5aa-108d-48a5-a043-eda79e07fbf7))
    (pin "2" (uuid e3bdfa67-7e78-4bd9-a64c-f8db53b926f7))
    (pin "3" (uuid c8aa505c-c994-434c-8fd2-293face02319))
    (pin "5" (uuid ad264c47-6c6c-4c06-9cd8-8a5972dc1eed))
    (pin "6" (uuid ce771165-f573-4d23-ad9e-c645456d85f4))
    (pin "7" (uuid baf4030f-0dbf-456a-bf9a-6a5098748001))
    (pin "4" (uuid d6be82b6-fb15-43b3-ba16-a49ad499afb5))
    (pin "8" (uuid 076f487e-b5ac-4414-8854-d291a87c1d98))
    (instances
      (project "skinResisitance"
        (path "/7423c7a1-84f1-4977-97d9-6209231a3837/d161da69-ff4e-4b25-911a-65f9f3d9873e"
          (reference "U3B?") (unit 2)
        )
        (path "/7423c7a1-84f1-4977-97d9-6209231a3837/d161da69-ff4e-4b25-911a-65f9f3d9873e/671350f1-73a0-49d6-8b77-8219c143b371"
          (reference "U7") (unit 2)
        )
      )
    )
  )

  (symbol (lib_id "Device:R") (at 104.267 110.49 180) (unit 1)
    (in_bom yes) (on_board yes) (dnp no) (fields_autoplaced)
    (uuid fe2bb2fc-37eb-4f63-8490-5381274f41e3)
    (property "Reference" "R?" (at 106.68 109.22 0)
      (effects (font (size 1.27 1.27)) (justify right))
    )
    (property "Value" "NC" (at 106.68 111.76 0)
      (effects (font (size 1.27 1.27)) (justify right))
    )
    (property "Footprint" "Resistor_SMD:R_0805_2012Metric_Pad1.20x1.40mm_HandSolder" (at 106.045 110.49 90)
      (effects (font (size 1.27 1.27)) hide)
    )
    (property "Datasheet" "~" (at 104.267 110.49 0)
      (effects (font (size 1.27 1.27)) hide)
    )
    (pin "1" (uuid c934829c-1937-4ad5-bced-40b4f239ddcc))
    (pin "2" (uuid 58cc7657-4639-4c2b-9620-80409106a746))
    (instances
      (project "skinResisitance"
        (path "/7423c7a1-84f1-4977-97d9-6209231a3837/d161da69-ff4e-4b25-911a-65f9f3d9873e"
          (reference "R?") (unit 1)
        )
        (path "/7423c7a1-84f1-4977-97d9-6209231a3837/d161da69-ff4e-4b25-911a-65f9f3d9873e/671350f1-73a0-49d6-8b77-8219c143b371"
          (reference "R42") (unit 1)
        )
      )
    )
  )
)
