<?xml version="1.0" encoding="UTF-8"?>

<!-- generated on Sat Apr 24 18:29:11 2021 by Eclipse SUMO Version 1.4.0
<configuration xmlns:xsi="http://www.w3.org/2001/XMLSchema-instance" xsi:noNamespaceSchemaLocation="http://sumo.dlr.de/xsd/sumoConfiguration.xsd">

    <input>
        <net-file value="sumofiles/junction.net.xml"/>
        <route-files value="sumofiles/junction_preemption_178.rou.xml"/>
        <additional-files value="sumofiles/junction.det.xml"/>
    </input>

    <output>
        <tripinfo-output value="sumofiles/output/tripinfo_preemption_178.xml"/>
    </output>

    <time>
        <begin value="0"/>
        <end value="10000"/>
        <step-length value="0.05"/>
    </time>

    <processing>
        <lateral-resolution value="0.1"/>
    </processing>

    <report>
        <no-warnings value="true"/>
        <error-log value="sumofiles/output/errorlog_preemption_178.log"/>
        <no-step-log value="true"/>
    </report>

    <traci_server>
        <remote-port value="55491"/>
    </traci_server>

    <gui_only>
        <gui-settings-file value="sumofiles/junction-gui.settings.xml"/>
        <tracker-interval value="0.05"/>
    </gui_only>

</configuration>
-->

<tripinfos xmlns:xsi="http://www.w3.org/2001/XMLSchema-instance" xsi:noNamespaceSchemaLocation="http://sumo.dlr.de/xsd/tripinfo_file.xsd">
    <tripinfo id="car_e2n_6" depart="6.00" departLane="e2sep_1" departPos="3.60" departPosLat="0.00" departSpeed="13.90" departDelay="0.00" arrival="145.30" arrivalLane="c2n_1" arrivalPos="990.00" arrivalPosLat="0.00" arrivalSpeed="14.73" duration="139.30" routeLength="1986.69" waitingTime="0.00" waitingCount="0" stopTime="0.00" timeLoss="3.75" rerouteNo="1" devices="tripinfo_car_e2n_6 routing_car_e2n_6" vType="Car" speedFactor="1.06" vaporized=""/>
    <tripinfo id="car_w2n_4" depart="4.00" departLane="w2sep_1" departPos="3.60" departPosLat="0.00" departSpeed="13.90" departDelay="0.00" arrival="150.00" arrivalLane="c2n_1" arrivalPos="990.00" arrivalPosLat="0.00" arrivalSpeed="14.73" duration="146.00" routeLength="1996.47" waitingTime="1.40" waitingCount="1" stopTime="0.00" timeLoss="9.81" rerouteNo="1" devices="tripinfo_car_w2n_4 routing_car_w2n_4" vType="Car" speedFactor="1.06" vaporized=""/>
    <tripinfo id="car_w2n_8" depart="8.00" departLane="w2sep_1" departPos="3.60" departPosLat="0.00" departSpeed="13.90" departDelay="0.00" arrival="155.95" arrivalLane="c2n_1" arrivalPos="990.00" arrivalPosLat="0.00" arrivalSpeed="14.04" duration="147.95" routeLength="1996.47" waitingTime="0.00" waitingCount="0" stopTime="0.00" timeLoss="5.11" rerouteNo="1" devices="tripinfo_car_w2n_8 routing_car_w2n_8" vType="Car" speedFactor="1.01" vaporized=""/>
    <tripinfo id="car_s2n_12" depart="12.00" departLane="s2sep_1" departPos="3.60" departPosLat="0.00" departSpeed="13.90" departDelay="0.00" arrival="161.00" arrivalLane="c2n_1" arrivalPos="990.00" arrivalPosLat="0.00" arrivalSpeed="15.04" duration="149.00" routeLength="1997.01" waitingTime="8.05" waitingCount="1" stopTime="0.00" timeLoss="16.30" rerouteNo="1" devices="tripinfo_car_s2n_12 routing_car_s2n_12" vType="Car" speedFactor="1.08" vaporized=""/>
    <tripinfo id="car_n2s_26" depart="26.40" departLane="n2sep_1" departPos="3.60" departPosLat="0.00" departSpeed="13.90" departDelay="0.40" arrival="163.25" arrivalLane="c2s_1" arrivalPos="990.00" arrivalPosLat="0.00" arrivalSpeed="15.05" duration="136.85" routeLength="1997.01" waitingTime="0.00" waitingCount="0" stopTime="0.00" timeLoss="4.13" rerouteNo="1" devices="tripinfo_car_n2s_26 routing_car_n2s_26" vType="Car" speedFactor="1.08" vaporized=""/>
    <tripinfo id="car_s2e_22" depart="22.00" departLane="s2sep_1" departPos="3.60" departPosLat="0.00" departSpeed="13.90" departDelay="0.00" arrival="169.60" arrivalLane="c2e_1" arrivalPos="990.00" arrivalPosLat="0.00" arrivalSpeed="13.90" duration="147.60" routeLength="1986.69" waitingTime="0.00" waitingCount="0" stopTime="0.00" timeLoss="3.94" rerouteNo="1" devices="tripinfo_car_s2e_22 routing_car_s2e_22" vType="Car" speedFactor="1.00" vaporized=""/>
    <tripinfo id="car_n2e_25" depart="25.00" departLane="n2sep_1" departPos="3.60" departPosLat="0.00" departSpeed="13.90" departDelay="0.00" arrival="172.55" arrivalLane="c2e_1" arrivalPos="990.00" arrivalPosLat="0.00" arrivalSpeed="14.45" duration="147.55" routeLength="1996.47" waitingTime="0.00" waitingCount="0" stopTime="0.00" timeLoss="9.55" rerouteNo="1" devices="tripinfo_car_n2e_25 routing_car_n2e_25" vType="Car" speedFactor="1.05" vaporized=""/>
    <tripinfo id="car_n2w_28" depart="28.10" departLane="n2sep_1" departPos="3.60" departPosLat="0.00" departSpeed="13.90" departDelay="0.10" arrival="174.45" arrivalLane="c2w_1" arrivalPos="990.00" arrivalPosLat="0.00" arrivalSpeed="14.32" duration="146.35" routeLength="1986.69" waitingTime="0.00" waitingCount="0" stopTime="0.00" timeLoss="6.89" rerouteNo="1" devices="tripinfo_car_n2w_28 routing_car_n2w_28" vType="Car" speedFactor="1.03" vaporized=""/>
    <tripinfo id="car_s2w_34" depart="34.00" departLane="s2sep_1" departPos="3.60" departPosLat="0.00" departSpeed="13.90" departDelay="0.00" arrival="179.45" arrivalLane="c2w_1" arrivalPos="990.00" arrivalPosLat="0.00" arrivalSpeed="14.26" duration="145.45" routeLength="1996.47" waitingTime="0.00" waitingCount="0" stopTime="0.00" timeLoss="4.84" rerouteNo="1" devices="tripinfo_car_s2w_34 routing_car_s2w_34" vType="Car" speedFactor="1.03" vaporized=""/>
    <tripinfo id="car_n2w_40" depart="40.00" departLane="n2sep_1" departPos="3.60" departPosLat="0.00" departSpeed="13.90" departDelay="0.00" arrival="187.75" arrivalLane="c2w_1" arrivalPos="990.00" arrivalPosLat="0.00" arrivalSpeed="13.90" duration="147.75" routeLength="1986.69" waitingTime="0.00" waitingCount="0" stopTime="0.00" timeLoss="4.05" rerouteNo="1" devices="tripinfo_car_n2w_40 routing_car_n2w_40" vType="Car" speedFactor="1.00" vaporized=""/>
    <tripinfo id="car_s2n_47" depart="47.00" departLane="s2sep_1" departPos="3.60" departPosLat="0.00" departSpeed="13.90" departDelay="0.00" arrival="190.80" arrivalLane="c2n_1" arrivalPos="990.00" arrivalPosLat="0.00" arrivalSpeed="13.90" duration="143.80" routeLength="1997.01" waitingTime="0.00" waitingCount="0" stopTime="0.00" timeLoss="0.12" rerouteNo="1" devices="tripinfo_car_s2n_47 routing_car_s2n_47" vType="Car" speedFactor="1.00" vaporized=""/>
    <tripinfo id="car_n2s_49" depart="49.00" departLane="n2sep_1" departPos="3.60" departPosLat="0.00" departSpeed="13.90" departDelay="0.00" arrival="193.10" arrivalLane="c2s_1" arrivalPos="990.00" arrivalPosLat="0.00" arrivalSpeed="13.90" duration="144.10" routeLength="1997.01" waitingTime="0.00" waitingCount="0" stopTime="0.00" timeLoss="0.42" rerouteNo="1" devices="tripinfo_car_n2s_49 routing_car_n2s_49" vType="Car" speedFactor="1.00" vaporized=""/>
    <tripinfo id="car_w2e_30" depart="30.00" departLane="w2sep_1" departPos="3.60" departPosLat="0.00" departSpeed="13.90" departDelay="0.00" arrival="204.95" arrivalLane="c2e_1" arrivalPos="990.00" arrivalPosLat="0.00" arrivalSpeed="15.16" duration="174.95" routeLength="1997.01" waitingTime="35.55" waitingCount="1" stopTime="0.00" timeLoss="43.19" rerouteNo="1" devices="tripinfo_car_w2e_30 routing_car_w2e_30" vType="Car" speedFactor="1.09" vaporized=""/>
    <tripinfo id="car_e2w_13" depart="13.00" departLane="e2sep_1" departPos="3.60" departPosLat="0.00" departSpeed="13.90" departDelay="0.00" arrival="208.70" arrivalLane="c2w_1" arrivalPos="990.00" arrivalPosLat="0.00" arrivalSpeed="14.32" duration="195.70" routeLength="1997.01" waitingTime="49.00" waitingCount="1" stopTime="0.00" timeLoss="56.23" rerouteNo="1" devices="tripinfo_car_e2w_13 routing_car_e2w_13" vType="Car" speedFactor="1.03" vaporized=""/>
    <tripinfo id="car_e2w_35" depart="35.00" departLane="e2sep_1" departPos="3.60" departPosLat="0.00" departSpeed="13.90" departDelay="0.00" arrival="212.40" arrivalLane="c2w_1" arrivalPos="990.00" arrivalPosLat="0.00" arrivalSpeed="14.53" duration="177.40" routeLength="1997.01" waitingTime="28.65" waitingCount="1" stopTime="0.00" timeLoss="40.19" rerouteNo="1" devices="tripinfo_car_e2w_35 routing_car_e2w_35" vType="Car" speedFactor="1.05" vaporized=""/>
    <tripinfo id="bus_w2e_66" depart="67.80" departLane="w2sep_1" departPos="12.10" departPosLat="0.00" departSpeed="13.90" departDelay="1.80" arrival="214.05" arrivalLane="c2e_1" arrivalPos="990.00" arrivalPosLat="0.00" arrivalSpeed="13.90" duration="146.25" routeLength="1988.51" waitingTime="0.00" waitingCount="0" stopTime="0.00" timeLoss="3.17" rerouteNo="1" devices="tripinfo_bus_w2e_66 routing_bus_w2e_66" vType="Bus" speedFactor="1.00" vaporized=""/>
    <tripinfo id="car_e2w_46" depart="46.00" departLane="e2sep_1" departPos="3.60" departPosLat="0.00" departSpeed="13.90" departDelay="0.00" arrival="215.75" arrivalLane="c2w_1" arrivalPos="990.00" arrivalPosLat="0.00" arrivalSpeed="14.49" duration="169.75" routeLength="1997.01" waitingTime="18.85" waitingCount="1" stopTime="0.00" timeLoss="32.33" rerouteNo="1" devices="tripinfo_car_e2w_46 routing_car_e2w_46" vType="Car" speedFactor="1.05" vaporized=""/>
    <tripinfo id="car_w2s_70" depart="70.00" departLane="w2sep_1" departPos="3.60" departPosLat="0.00" departSpeed="13.90" departDelay="0.00" arrival="215.90" arrivalLane="c2s_1" arrivalPos="990.00" arrivalPosLat="0.00" arrivalSpeed="14.55" duration="145.90" routeLength="1986.69" waitingTime="0.00" waitingCount="0" stopTime="0.00" timeLoss="8.67" rerouteNo="1" devices="tripinfo_car_w2s_70 routing_car_w2s_70" vType="Car" speedFactor="1.05" vaporized=""/>
    <tripinfo id="car_e2n_47" depart="47.40" departLane="e2sep_1" departPos="3.60" departPosLat="0.00" departSpeed="13.90" departDelay="0.40" arrival="217.30" arrivalLane="c2n_1" arrivalPos="990.00" arrivalPosLat="0.00" arrivalSpeed="13.90" duration="169.90" routeLength="1986.69" waitingTime="14.30" waitingCount="1" stopTime="0.00" timeLoss="26.23" rerouteNo="1" devices="tripinfo_car_e2n_47 routing_car_e2n_47" vType="Car" speedFactor="1.00" vaporized=""/>
    <tripinfo id="car_e2w_54" depart="54.00" departLane="e2sep_1" departPos="3.60" departPosLat="0.00" departSpeed="13.90" departDelay="0.00" arrival="217.70" arrivalLane="c2w_1" arrivalPos="990.00" arrivalPosLat="0.00" arrivalSpeed="15.48" duration="163.70" routeLength="1997.01" waitingTime="13.70" waitingCount="1" stopTime="0.00" timeLoss="39.64" rerouteNo="1" devices="tripinfo_car_e2w_54 routing_car_e2w_54" vType="Car" speedFactor="1.16" vaporized=""/>
    <tripinfo id="car_w2n_40" depart="40.00" departLane="w2sep_1" departPos="3.60" departPosLat="0.00" departSpeed="13.90" departDelay="0.00" arrival="219.85" arrivalLane="c2n_1" arrivalPos="990.00" arrivalPosLat="0.00" arrivalSpeed="15.39" duration="179.85" routeLength="1996.47" waitingTime="37.45" waitingCount="2" stopTime="0.00" timeLoss="51.31" rerouteNo="1" devices="tripinfo_car_w2n_40 routing_car_w2n_40" vType="Car" speedFactor="1.12" vaporized=""/>
    <tripinfo id="car_e2w_70" depart="70.00" departLane="e2sep_1" departPos="3.60" departPosLat="0.00" departSpeed="13.90" departDelay="0.00" arrival="219.90" arrivalLane="c2w_1" arrivalPos="990.00" arrivalPosLat="0.00" arrivalSpeed="15.27" duration="149.90" routeLength="1997.01" waitingTime="0.00" waitingCount="0" stopTime="0.00" timeLoss="21.93" rerouteNo="1" devices="tripinfo_car_e2w_70 routing_car_e2w_70" vType="Car" speedFactor="1.12" vaporized=""/>
    <tripinfo id="car_w2n_66" depart="66.00" departLane="w2sep_1" departPos="3.60" departPosLat="0.00" departSpeed="13.90" departDelay="0.00" arrival="224.00" arrivalLane="c2n_1" arrivalPos="990.00" arrivalPosLat="0.00" arrivalSpeed="15.14" duration="158.00" routeLength="1996.47" waitingTime="9.30" waitingCount="1" stopTime="0.00" timeLoss="25.66" rerouteNo="1" devices="tripinfo_car_w2n_66 routing_car_w2n_66" vType="Car" speedFactor="1.09" vaporized=""/>
    <tripinfo id="car_w2e_78" depart="79.30" departLane="w2sep_1" departPos="3.60" departPosLat="0.00" departSpeed="13.90" departDelay="1.30" arrival="224.60" arrivalLane="c2e_1" arrivalPos="990.00" arrivalPosLat="0.00" arrivalSpeed="13.90" duration="145.30" routeLength="1997.01" waitingTime="0.00" waitingCount="0" stopTime="0.00" timeLoss="1.59" rerouteNo="1" devices="tripinfo_car_w2e_78 routing_car_w2e_78" vType="Car" speedFactor="1.00" vaporized=""/>
    <tripinfo id="car_e2w_71" depart="71.30" departLane="e2sep_1" departPos="3.60" departPosLat="0.00" departSpeed="13.90" departDelay="0.30" arrival="224.65" arrivalLane="c2w_1" arrivalPos="990.00" arrivalPosLat="0.00" arrivalSpeed="13.89" duration="153.35" routeLength="1997.01" waitingTime="0.00" waitingCount="0" stopTime="0.00" timeLoss="9.67" rerouteNo="1" devices="tripinfo_car_e2w_71 routing_car_e2w_71" vType="Car" speedFactor="1.00" vaporized=""/>
    <tripinfo id="car_e2s_25" depart="25.00" departLane="e2sep_1" departPos="3.60" departPosLat="0.00" departSpeed="13.90" departDelay="0.00" arrival="227.20" arrivalLane="c2s_1" arrivalPos="990.00" arrivalPosLat="0.00" arrivalSpeed="14.04" duration="202.20" routeLength="1996.47" waitingTime="48.30" waitingCount="3" stopTime="0.00" timeLoss="59.35" rerouteNo="1" devices="tripinfo_car_e2s_25 routing_car_e2s_25" vType="Car" speedFactor="1.01" vaporized=""/>
    <tripinfo id="car_e2s_54" depart="55.25" departLane="e2sep_1" departPos="3.60" departPosLat="0.00" departSpeed="13.90" departDelay="1.25" arrival="231.20" arrivalLane="c2s_1" arrivalPos="990.00" arrivalPosLat="0.00" arrivalSpeed="14.13" duration="175.95" routeLength="1996.47" waitingTime="16.95" waitingCount="2" stopTime="0.00" timeLoss="34.20" rerouteNo="1" devices="tripinfo_car_e2s_54 routing_car_e2s_54" vType="Car" speedFactor="1.02" vaporized=""/>
    <tripinfo id="car_e2n_86" depart="86.00" departLane="e2sep_1" departPos="3.60" departPosLat="0.00" departSpeed="13.90" departDelay="0.00" arrival="233.05" arrivalLane="c2n_1" arrivalPos="990.00" arrivalPosLat="0.00" arrivalSpeed="13.97" duration="147.05" routeLength="1986.69" waitingTime="0.00" waitingCount="0" stopTime="0.00" timeLoss="4.12" rerouteNo="1" devices="tripinfo_car_e2n_86 routing_car_e2n_86" vType="Car" speedFactor="1.01" vaporized=""/>
    <tripinfo id="car_e2s_65" depart="65.00" departLane="e2sep_1" departPos="3.60" departPosLat="0.00" departSpeed="13.90" departDelay="0.00" arrival="234.85" arrivalLane="c2s_1" arrivalPos="990.00" arrivalPosLat="0.00" arrivalSpeed="14.02" duration="169.85" routeLength="1996.47" waitingTime="9.30" waitingCount="1" stopTime="0.00" timeLoss="27.01" rerouteNo="1" devices="tripinfo_car_e2s_65 routing_car_e2s_65" vType="Car" speedFactor="1.01" vaporized=""/>
    <tripinfo id="car_e2n_98" depart="98.00" departLane="e2sep_1" departPos="3.60" departPosLat="0.00" departSpeed="13.90" departDelay="0.00" arrival="234.90" arrivalLane="c2n_1" arrivalPos="990.00" arrivalPosLat="0.00" arrivalSpeed="15.53" duration="136.90" routeLength="1986.69" waitingTime="0.00" waitingCount="0" stopTime="0.00" timeLoss="15.10" rerouteNo="1" devices="tripinfo_car_e2n_98 routing_car_e2n_98" vType="Car" speedFactor="1.18" vaporized=""/>
    <tripinfo id="car_w2n_78" depart="78.00" departLane="w2sep_1" departPos="3.60" departPosLat="0.00" departSpeed="13.90" departDelay="0.00" arrival="237.00" arrivalLane="c2n_1" arrivalPos="990.00" arrivalPosLat="0.00" arrivalSpeed="15.32" duration="159.00" routeLength="1996.47" waitingTime="7.05" waitingCount="2" stopTime="0.00" timeLoss="31.49" rerouteNo="1" devices="tripinfo_car_w2n_78 routing_car_w2n_78" vType="Car" speedFactor="1.13" vaporized=""/>
    <tripinfo id="car_w2n_86" depart="86.00" departLane="w2sep_1" departPos="3.60" departPosLat="0.00" departSpeed="13.90" departDelay="0.00" arrival="239.05" arrivalLane="c2n_1" arrivalPos="990.00" arrivalPosLat="0.00" arrivalSpeed="15.54" duration="153.05" routeLength="1996.47" waitingTime="4.40" waitingCount="1" stopTime="0.00" timeLoss="28.00" rerouteNo="1" devices="tripinfo_car_w2n_86 routing_car_w2n_86" vType="Car" speedFactor="1.15" vaporized=""/>
    <tripinfo id="car_w2n_92" depart="92.00" departLane="w2sep_1" departPos="3.60" departPosLat="0.00" departSpeed="13.90" departDelay="0.00" arrival="244.65" arrivalLane="c2n_1" arrivalPos="990.00" arrivalPosLat="0.00" arrivalSpeed="13.90" duration="152.65" routeLength="1996.47" waitingTime="0.00" waitingCount="0" stopTime="0.00" timeLoss="8.33" rerouteNo="1" devices="tripinfo_car_w2n_92 routing_car_w2n_92" vType="Car" speedFactor="1.00" vaporized=""/>
    <tripinfo id="car_e2s_102" depart="102.00" departLane="e2sep_1" departPos="3.60" departPosLat="0.00" departSpeed="13.90" departDelay="0.00" arrival="245.85" arrivalLane="c2s_1" arrivalPos="990.00" arrivalPosLat="0.00" arrivalSpeed="14.32" duration="143.85" routeLength="1996.47" waitingTime="0.00" waitingCount="0" stopTime="0.00" timeLoss="3.79" rerouteNo="1" devices="tripinfo_car_e2s_102 routing_car_e2s_102" vType="Car" speedFactor="1.03" vaporized=""/>
    <tripinfo id="car_n2e_68" depart="68.00" departLane="n2sep_1" departPos="3.60" departPosLat="0.00" departSpeed="13.90" departDelay="0.00" arrival="255.00" arrivalLane="c2e_1" arrivalPos="990.00" arrivalPosLat="0.00" arrivalSpeed="14.27" duration="187.00" routeLength="1996.47" waitingTime="39.00" waitingCount="1" stopTime="0.00" timeLoss="46.35" rerouteNo="1" devices="tripinfo_car_n2e_68 routing_car_n2e_68" vType="Car" speedFactor="1.03" vaporized=""/>
    <tripinfo id="car_n2w_77" depart="77.00" departLane="n2sep_1" departPos="3.60" departPosLat="0.00" departSpeed="13.90" departDelay="0.00" arrival="255.65" arrivalLane="c2w_1" arrivalPos="990.00" arrivalPosLat="0.00" arrivalSpeed="13.90" duration="178.65" routeLength="1986.69" waitingTime="27.85" waitingCount="1" stopTime="0.00" timeLoss="34.96" rerouteNo="1" devices="tripinfo_car_n2w_77 routing_car_n2w_77" vType="Car" speedFactor="1.00" vaporized=""/>
    <tripinfo id="car_n2s_91" depart="91.45" departLane="n2sep_1" departPos="3.60" departPosLat="0.00" departSpeed="13.90" departDelay="0.45" arrival="256.65" arrivalLane="c2s_1" arrivalPos="990.00" arrivalPosLat="0.00" arrivalSpeed="14.17" duration="165.20" routeLength="1997.01" waitingTime="12.50" waitingCount="1" stopTime="0.00" timeLoss="24.27" rerouteNo="1" devices="tripinfo_car_n2s_91 routing_car_n2s_91" vType="Car" speedFactor="1.02" vaporized=""/>
    <tripinfo id="car_s2w_85" depart="85.00" departLane="s2sep_1" departPos="3.60" departPosLat="0.00" departSpeed="13.90" departDelay="0.00" arrival="257.45" arrivalLane="c2w_1" arrivalPos="990.00" arrivalPosLat="0.00" arrivalSpeed="15.47" duration="172.45" routeLength="1996.47" waitingTime="30.70" waitingCount="2" stopTime="0.00" timeLoss="50.00" rerouteNo="1" devices="tripinfo_car_s2w_85 routing_car_s2w_85" vType="Car" speedFactor="1.18" vaporized=""/>
    <tripinfo id="car_s2w_87" depart="87.00" departLane="s2sep_1" departPos="3.60" departPosLat="0.00" departSpeed="13.90" departDelay="0.00" arrival="259.40" arrivalLane="c2w_1" arrivalPos="990.00" arrivalPosLat="0.00" arrivalSpeed="15.63" duration="172.40" routeLength="1996.47" waitingTime="27.15" waitingCount="1" stopTime="0.00" timeLoss="49.23" rerouteNo="1" devices="tripinfo_car_s2w_87 routing_car_s2w_87" vType="Car" speedFactor="1.17" vaporized=""/>
    <tripinfo id="car_n2e_90" depart="90.00" departLane="n2sep_1" departPos="3.60" departPosLat="0.00" departSpeed="13.90" departDelay="0.00" arrival="260.70" arrivalLane="c2e_1" arrivalPos="990.00" arrivalPosLat="0.00" arrivalSpeed="13.90" duration="170.70" routeLength="1996.47" waitingTime="15.80" waitingCount="1" stopTime="0.00" timeLoss="26.38" rerouteNo="1" devices="tripinfo_car_n2e_90 routing_car_n2e_90" vType="Car" speedFactor="1.00" vaporized=""/>
    <tripinfo id="car_n2e_100" depart="100.00" departLane="n2sep_1" departPos="3.60" departPosLat="0.00" departSpeed="13.90" departDelay="0.00" arrival="262.85" arrivalLane="c2e_1" arrivalPos="990.00" arrivalPosLat="0.00" arrivalSpeed="14.93" duration="162.85" routeLength="1996.47" waitingTime="11.45" waitingCount="1" stopTime="0.00" timeLoss="31.93" rerouteNo="1" devices="tripinfo_car_n2e_100 routing_car_n2e_100" vType="Car" speedFactor="1.10" vaporized=""/>
    <tripinfo id="car_s2w_113" depart="113.00" departLane="s2sep_1" departPos="3.60" departPosLat="0.00" departSpeed="13.90" departDelay="0.00" arrival="264.10" arrivalLane="c2w_1" arrivalPos="990.00" arrivalPosLat="0.00" arrivalSpeed="14.42" duration="151.10" routeLength="1996.47" waitingTime="0.00" waitingCount="0" stopTime="0.00" timeLoss="12.04" rerouteNo="1" devices="tripinfo_car_s2w_113 routing_car_s2w_113" vType="Car" speedFactor="1.04" vaporized=""/>
    <tripinfo id="car_s2e_131" depart="131.00" departLane="s2sep_1" departPos="3.60" departPosLat="0.00" departSpeed="13.90" departDelay="0.00" arrival="264.75" arrivalLane="c2e_1" arrivalPos="990.00" arrivalPosLat="0.00" arrivalSpeed="15.52" duration="133.75" routeLength="1986.69" waitingTime="0.00" waitingCount="0" stopTime="0.00" timeLoss="10.84" rerouteNo="1" devices="tripinfo_car_s2e_131 routing_car_s2e_131" vType="Car" speedFactor="1.17" vaporized=""/>
    <tripinfo id="car_n2e_102" depart="102.00" departLane="n2sep_1" departPos="3.60" departPosLat="0.00" departSpeed="13.90" departDelay="0.00" arrival="266.75" arrivalLane="c2e_1" arrivalPos="990.00" arrivalPosLat="0.00" arrivalSpeed="15.55" duration="164.75" routeLength="1996.47" waitingTime="14.75" waitingCount="2" stopTime="0.00" timeLoss="40.13" rerouteNo="1" devices="tripinfo_car_n2e_102 routing_car_n2e_102" vType="Car" speedFactor="1.16" vaporized=""/>
    <tripinfo id="car_n2w_123" depart="123.00" departLane="n2sep_1" departPos="3.60" departPosLat="0.00" departSpeed="13.90" departDelay="0.00" arrival="271.15" arrivalLane="c2w_1" arrivalPos="990.00" arrivalPosLat="0.00" arrivalSpeed="13.90" duration="148.15" routeLength="1986.69" waitingTime="0.00" waitingCount="0" stopTime="0.00" timeLoss="4.48" rerouteNo="1" devices="tripinfo_car_n2w_123 routing_car_n2w_123" vType="Car" speedFactor="1.00" vaporized=""/>
    <tripinfo id="car_s2n_145" depart="145.00" departLane="s2sep_1" departPos="3.60" departPosLat="0.00" departSpeed="13.90" departDelay="0.00" arrival="274.05" arrivalLane="c2n_1" arrivalPos="990.00" arrivalPosLat="0.00" arrivalSpeed="15.56" duration="129.05" routeLength="1997.01" waitingTime="0.00" waitingCount="0" stopTime="0.00" timeLoss="0.66" rerouteNo="1" devices="tripinfo_car_s2n_145 routing_car_s2n_145" vType="Car" speedFactor="1.12" vaporized=""/>
    <tripinfo id="car_n2e_116" depart="116.00" departLane="n2sep_1" departPos="3.60" departPosLat="0.00" departSpeed="13.90" departDelay="0.00" arrival="274.35" arrivalLane="c2e_1" arrivalPos="990.00" arrivalPosLat="0.00" arrivalSpeed="13.90" duration="158.35" routeLength="1996.47" waitingTime="3.35" waitingCount="1" stopTime="0.00" timeLoss="14.04" rerouteNo="1" devices="tripinfo_car_n2e_116 routing_car_n2e_116" vType="Car" speedFactor="1.00" vaporized=""/>
    <tripinfo id="car_n2w_130" depart="130.00" departLane="n2sep_1" departPos="3.60" departPosLat="0.00" departSpeed="13.90" departDelay="0.00" arrival="278.15" arrivalLane="c2w_1" arrivalPos="990.00" arrivalPosLat="0.00" arrivalSpeed="13.90" duration="148.15" routeLength="1986.69" waitingTime="0.00" waitingCount="0" stopTime="0.00" timeLoss="4.48" rerouteNo="1" devices="tripinfo_car_n2w_130 routing_car_n2w_130" vType="Car" speedFactor="1.00" vaporized=""/>
    <tripinfo id="car_n2w_133" depart="133.00" departLane="n2sep_1" departPos="3.60" departPosLat="0.00" departSpeed="13.90" departDelay="0.00" arrival="280.35" arrivalLane="c2w_1" arrivalPos="990.00" arrivalPosLat="0.00" arrivalSpeed="14.89" duration="147.35" routeLength="1986.69" waitingTime="0.00" waitingCount="0" stopTime="0.00" timeLoss="16.25" rerouteNo="1" devices="tripinfo_car_n2w_133 routing_car_n2w_133" vType="Car" speedFactor="1.10" vaporized=""/>
    <tripinfo id="car_n2w_140" depart="140.00" departLane="n2sep_1" departPos="3.60" departPosLat="0.00" departSpeed="13.90" departDelay="0.00" arrival="285.35" arrivalLane="c2w_1" arrivalPos="990.00" arrivalPosLat="0.00" arrivalSpeed="14.22" duration="145.35" routeLength="1986.69" waitingTime="0.00" waitingCount="0" stopTime="0.00" timeLoss="5.02" rerouteNo="1" devices="tripinfo_car_n2w_140 routing_car_n2w_140" vType="Car" speedFactor="1.02" vaporized=""/>
    <tripinfo id="car_s2w_133" depart="133.00" departLane="s2sep_1" departPos="3.60" departPosLat="0.00" departSpeed="13.90" departDelay="0.00" arrival="290.15" arrivalLane="c2w_1" arrivalPos="990.00" arrivalPosLat="0.00" arrivalSpeed="13.94" duration="157.15" routeLength="1996.47" waitingTime="3.95" waitingCount="2" stopTime="0.00" timeLoss="13.28" rerouteNo="1" devices="tripinfo_car_s2w_133 routing_car_s2w_133" vType="Car" speedFactor="1.00" vaporized=""/>
    <tripinfo id="car_n2e_147" depart="147.00" departLane="n2sep_1" departPos="3.60" departPosLat="0.00" departSpeed="13.90" departDelay="0.00" arrival="292.75" arrivalLane="c2e_1" arrivalPos="990.00" arrivalPosLat="0.00" arrivalSpeed="14.12" duration="145.75" routeLength="1996.47" waitingTime="0.00" waitingCount="0" stopTime="0.00" timeLoss="3.68" rerouteNo="1" devices="tripinfo_car_n2e_147 routing_car_n2e_147" vType="Car" speedFactor="1.02" vaporized=""/>
    <tripinfo id="car_n2e_154" depart="154.00" departLane="n2sep_1" departPos="3.60" departPosLat="0.00" departSpeed="13.90" departDelay="0.00" arrival="294.70" arrivalLane="c2e_1" arrivalPos="990.00" arrivalPosLat="0.00" arrivalSpeed="15.58" duration="140.70" routeLength="1996.47" waitingTime="0.00" waitingCount="0" stopTime="0.00" timeLoss="17.51" rerouteNo="1" devices="tripinfo_car_n2e_154 routing_car_n2e_154" vType="Car" speedFactor="1.17" vaporized=""/>
    <tripinfo id="car_w2s_115" depart="115.00" departLane="w2sep_1" departPos="3.60" departPosLat="0.00" departSpeed="13.90" departDelay="0.00" arrival="295.00" arrivalLane="c2s_1" arrivalPos="990.00" arrivalPosLat="0.00" arrivalSpeed="15.12" duration="180.00" routeLength="1986.69" waitingTime="40.50" waitingCount="1" stopTime="0.00" timeLoss="47.96" rerouteNo="1" devices="tripinfo_car_w2s_115 routing_car_w2s_115" vType="Car" speedFactor="1.09" vaporized=""/>
    <tripinfo id="car_e2w_108" depart="108.45" departLane="e2sep_1" departPos="3.60" departPosLat="0.00" departSpeed="13.90" departDelay="0.45" arrival="297.25" arrivalLane="c2w_1" arrivalPos="990.00" arrivalPosLat="0.00" arrivalSpeed="15.18" duration="188.80" routeLength="1997.01" waitingTime="42.45" waitingCount="1" stopTime="0.00" timeLoss="57.21" rerouteNo="1" devices="tripinfo_car_e2w_108 routing_car_e2w_108" vType="Car" speedFactor="1.09" vaporized=""/>
    <tripinfo id="car_e2n_107" depart="107.00" departLane="e2sep_1" departPos="3.60" departPosLat="0.00" departSpeed="13.90" departDelay="0.00" arrival="299.40" arrivalLane="c2n_1" arrivalPos="990.00" arrivalPosLat="0.00" arrivalSpeed="14.15" duration="192.40" routeLength="1986.69" waitingTime="43.70" waitingCount="1" stopTime="0.00" timeLoss="51.28" rerouteNo="1" devices="tripinfo_car_e2n_107 routing_car_e2n_107" vType="Car" speedFactor="1.02" vaporized=""/>
    <tripinfo id="car_e2w_151" depart="151.00" departLane="e2sep_1" departPos="3.60" departPosLat="0.00" departSpeed="13.90" departDelay="0.00" arrival="300.40" arrivalLane="c2w_1" arrivalPos="990.00" arrivalPosLat="0.00" arrivalSpeed="16.28" duration="149.40" routeLength="1997.01" waitingTime="12.95" waitingCount="1" stopTime="0.00" timeLoss="27.46" rerouteNo="1" devices="tripinfo_car_e2w_151 routing_car_e2w_151" vType="Car" speedFactor="1.18" vaporized=""/>
    <tripinfo id="car_w2e_116" depart="116.30" departLane="w2sep_1" departPos="3.60" departPosLat="0.00" departSpeed="13.90" departDelay="0.30" arrival="302.50" arrivalLane="c2e_1" arrivalPos="990.00" arrivalPosLat="0.00" arrivalSpeed="14.04" duration="186.20" routeLength="1997.01" waitingTime="34.05" waitingCount="1" stopTime="0.00" timeLoss="43.95" rerouteNo="1" devices="tripinfo_car_w2e_116 routing_car_w2e_116" vType="Car" speedFactor="1.01" vaporized=""/>
    <tripinfo id="car_e2n_114" depart="114.00" departLane="e2sep_1" departPos="3.60" departPosLat="0.00" departSpeed="13.90" departDelay="0.00" arrival="303.70" arrivalLane="c2n_1" arrivalPos="990.00" arrivalPosLat="0.00" arrivalSpeed="14.49" duration="189.70" routeLength="1986.69" waitingTime="39.75" waitingCount="1" stopTime="0.00" timeLoss="52.02" rerouteNo="1" devices="tripinfo_car_e2n_114 routing_car_e2n_114" vType="Car" speedFactor="1.04" vaporized=""/>
    <tripinfo id="car_w2s_133" depart="133.00" departLane="w2sep_1" departPos="3.60" departPosLat="0.00" departSpeed="13.90" departDelay="0.00" arrival="304.55" arrivalLane="c2s_1" arrivalPos="990.00" arrivalPosLat="0.00" arrivalSpeed="14.13" duration="171.55" routeLength="1986.69" waitingTime="20.05" waitingCount="1" stopTime="0.00" timeLoss="30.25" rerouteNo="1" devices="tripinfo_car_w2s_133 routing_car_w2s_133" vType="Car" speedFactor="1.02" vaporized=""/>
    <tripinfo id="car_e2n_143" depart="143.00" departLane="e2sep_1" departPos="3.60" departPosLat="0.00" departSpeed="13.90" departDelay="0.00" arrival="305.90" arrivalLane="c2n_1" arrivalPos="990.00" arrivalPosLat="0.00" arrivalSpeed="15.37" duration="162.90" routeLength="1986.69" waitingTime="14.60" waitingCount="1" stopTime="0.00" timeLoss="35.98" rerouteNo="1" devices="tripinfo_car_e2n_143 routing_car_e2n_143" vType="Car" speedFactor="1.13" vaporized=""/>
    <tripinfo id="car_w2s_134" depart="134.45" departLane="w2sep_1" departPos="3.60" departPosLat="0.00" departSpeed="13.90" departDelay="0.45" arrival="309.55" arrivalLane="c2s_1" arrivalPos="990.00" arrivalPosLat="0.00" arrivalSpeed="13.90" duration="175.10" routeLength="1986.69" waitingTime="16.80" waitingCount="1" stopTime="0.00" timeLoss="31.45" rerouteNo="1" devices="tripinfo_car_w2s_134 routing_car_w2s_134" vType="Car" speedFactor="1.00" vaporized=""/>
    <tripinfo id="car_w2s_138" depart="138.00" departLane="w2sep_1" departPos="3.60" departPosLat="0.00" departSpeed="13.90" departDelay="0.00" arrival="311.50" arrivalLane="c2s_1" arrivalPos="990.00" arrivalPosLat="0.00" arrivalSpeed="15.22" duration="173.50" routeLength="1986.69" waitingTime="16.20" waitingCount="1" stopTime="0.00" timeLoss="47.74" rerouteNo="1" devices="tripinfo_car_w2s_138 routing_car_w2s_138" vType="Car" speedFactor="1.14" vaporized=""/>
    <tripinfo id="car_w2e_158" depart="158.00" departLane="w2sep_1" departPos="3.60" departPosLat="0.00" departSpeed="13.90" departDelay="0.00" arrival="312.90" arrivalLane="c2e_1" arrivalPos="990.00" arrivalPosLat="0.00" arrivalSpeed="14.21" duration="154.90" routeLength="1997.01" waitingTime="0.00" waitingCount="0" stopTime="0.00" timeLoss="14.31" rerouteNo="1" devices="tripinfo_car_w2e_158 routing_car_w2e_158" vType="Car" speedFactor="1.02" vaporized=""/>
    <tripinfo id="car_w2n_120" depart="120.00" departLane="w2sep_1" departPos="3.60" departPosLat="0.00" departSpeed="13.90" departDelay="0.00" arrival="313.00" arrivalLane="c2n_1" arrivalPos="990.00" arrivalPosLat="0.00" arrivalSpeed="13.90" duration="193.00" routeLength="1996.47" waitingTime="35.70" waitingCount="2" stopTime="0.00" timeLoss="48.68" rerouteNo="1" devices="tripinfo_car_w2n_120 routing_car_w2n_120" vType="Car" speedFactor="1.00" vaporized=""/>
    <tripinfo id="car_w2s_154" depart="154.00" departLane="w2sep_1" departPos="3.60" departPosLat="0.00" departSpeed="13.90" departDelay="0.00" arrival="315.20" arrivalLane="c2s_1" arrivalPos="990.00" arrivalPosLat="0.00" arrivalSpeed="13.95" duration="161.20" routeLength="1986.69" waitingTime="2.10" waitingCount="1" stopTime="0.00" timeLoss="18.24" rerouteNo="1" devices="tripinfo_car_w2s_154 routing_car_w2s_154" vType="Car" speedFactor="1.01" vaporized=""/>
    <tripinfo id="car_w2n_145" depart="145.00" departLane="w2sep_1" departPos="3.60" departPosLat="0.00" departSpeed="13.90" departDelay="0.00" arrival="315.35" arrivalLane="c2n_1" arrivalPos="990.00" arrivalPosLat="0.00" arrivalSpeed="14.79" duration="170.35" routeLength="1996.47" waitingTime="15.85" waitingCount="2" stopTime="0.00" timeLoss="37.03" rerouteNo="1" devices="tripinfo_car_w2n_145 routing_car_w2n_145" vType="Car" speedFactor="1.08" vaporized=""/>
    <tripinfo id="car_w2e_161" depart="161.00" departLane="w2sep_1" departPos="3.60" departPosLat="0.00" departSpeed="13.90" departDelay="0.00" arrival="317.05" arrivalLane="c2e_1" arrivalPos="990.00" arrivalPosLat="0.00" arrivalSpeed="14.21" duration="156.05" routeLength="1997.01" waitingTime="0.00" waitingCount="0" stopTime="0.00" timeLoss="15.62" rerouteNo="1" devices="tripinfo_car_w2e_161 routing_car_w2e_161" vType="Car" speedFactor="1.02" vaporized=""/>
    <tripinfo id="car_w2n_176" depart="176.00" departLane="w2sep_1" departPos="3.60" departPosLat="0.00" departSpeed="13.90" departDelay="0.00" arrival="317.60" arrivalLane="c2n_1" arrivalPos="990.00" arrivalPosLat="0.00" arrivalSpeed="15.01" duration="141.60" routeLength="1996.47" waitingTime="0.00" waitingCount="0" stopTime="0.00" timeLoss="10.65" rerouteNo="1" devices="tripinfo_car_w2n_176 routing_car_w2n_176" vType="Car" speedFactor="1.10" vaporized=""/>
    <tripinfo id="car_w2e_164" depart="164.00" departLane="w2sep_1" departPos="3.60" departPosLat="0.00" departSpeed="13.90" departDelay="0.00" arrival="320.60" arrivalLane="c2e_1" arrivalPos="990.00" arrivalPosLat="0.00" arrivalSpeed="14.14" duration="156.60" routeLength="1997.01" waitingTime="0.00" waitingCount="0" stopTime="0.00" timeLoss="15.68" rerouteNo="1" devices="tripinfo_car_w2e_164 routing_car_w2e_164" vType="Car" speedFactor="1.02" vaporized=""/>
    <tripinfo id="car_w2e_179" depart="179.00" departLane="w2sep_1" departPos="3.60" departPosLat="0.00" departSpeed="13.90" departDelay="0.00" arrival="324.00" arrivalLane="c2e_1" arrivalPos="990.00" arrivalPosLat="0.00" arrivalSpeed="14.10" duration="145.00" routeLength="1997.01" waitingTime="0.00" waitingCount="0" stopTime="0.00" timeLoss="3.71" rerouteNo="1" devices="tripinfo_car_w2e_179 routing_car_w2e_179" vType="Car" speedFactor="1.02" vaporized=""/>
    <tripinfo id="car_e2n_178" depart="178.00" departLane="e2sep_1" departPos="3.60" departPosLat="0.00" departSpeed="13.90" departDelay="0.00" arrival="325.65" arrivalLane="c2n_1" arrivalPos="990.00" arrivalPosLat="0.00" arrivalSpeed="13.90" duration="147.65" routeLength="1986.69" waitingTime="0.00" waitingCount="0" stopTime="0.00" timeLoss="3.94" rerouteNo="1" devices="tripinfo_car_e2n_178 routing_car_e2n_178" vType="Car" speedFactor="1.00" vaporized=""/>
    <tripinfo id="car_e2s_137" depart="137.00" departLane="e2sep_1" departPos="3.60" departPosLat="0.00" departSpeed="13.90" departDelay="0.00" arrival="326.05" arrivalLane="c2s_1" arrivalPos="990.00" arrivalPosLat="0.00" arrivalSpeed="13.90" duration="189.05" routeLength="1996.47" waitingTime="33.65" waitingCount="3" stopTime="0.00" timeLoss="44.73" rerouteNo="1" devices="tripinfo_car_e2s_137 routing_car_e2s_137" vType="Car" speedFactor="1.00" vaporized=""/>
    <tripinfo id="car_e2n_181" depart="181.00" departLane="e2sep_1" departPos="3.60" departPosLat="0.00" departSpeed="13.90" departDelay="0.00" arrival="327.55" arrivalLane="c2n_1" arrivalPos="990.00" arrivalPosLat="0.00" arrivalSpeed="15.27" duration="146.55" routeLength="1986.69" waitingTime="0.00" waitingCount="0" stopTime="0.00" timeLoss="21.38" rerouteNo="1" devices="tripinfo_car_e2n_181 routing_car_e2n_181" vType="Car" speedFactor="1.15" vaporized=""/>
    <tripinfo id="car_w2s_184" depart="184.00" departLane="w2sep_1" departPos="3.60" departPosLat="0.00" departSpeed="13.90" departDelay="0.00" arrival="332.30" arrivalLane="c2s_1" arrivalPos="990.00" arrivalPosLat="0.00" arrivalSpeed="13.92" duration="148.30" routeLength="1986.69" waitingTime="0.00" waitingCount="0" stopTime="0.00" timeLoss="4.86" rerouteNo="1" devices="tripinfo_car_w2s_184 routing_car_w2s_184" vType="Car" speedFactor="1.00" vaporized=""/>
    <tripinfo id="car_n2w_152" depart="152.00" departLane="n2sep_1" departPos="3.60" departPosLat="0.00" departSpeed="13.90" departDelay="0.00" arrival="336.35" arrivalLane="c2w_1" arrivalPos="990.00" arrivalPosLat="0.00" arrivalSpeed="16.05" duration="184.35" routeLength="1986.69" waitingTime="47.35" waitingCount="1" stopTime="0.00" timeLoss="59.91" rerouteNo="1" devices="tripinfo_car_n2w_152 routing_car_n2w_152" vType="Car" speedFactor="1.15" vaporized=""/>
    <tripinfo id="car_w2n_192" depart="192.00" departLane="w2sep_1" departPos="3.60" departPosLat="0.00" departSpeed="13.90" departDelay="0.00" arrival="339.10" arrivalLane="c2n_1" arrivalPos="990.00" arrivalPosLat="0.00" arrivalSpeed="14.00" duration="147.10" routeLength="1996.47" waitingTime="0.00" waitingCount="0" stopTime="0.00" timeLoss="3.76" rerouteNo="1" devices="tripinfo_car_w2n_192 routing_car_w2n_192" vType="Car" speedFactor="1.01" vaporized=""/>
    <tripinfo id="car_s2n_156" depart="156.00" departLane="s2sep_1" departPos="3.60" departPosLat="0.00" departSpeed="13.90" departDelay="0.00" arrival="345.60" arrivalLane="c2n_1" arrivalPos="990.00" arrivalPosLat="0.00" arrivalSpeed="14.45" duration="189.60" routeLength="1997.01" waitingTime="41.80" waitingCount="1" stopTime="0.00" timeLoss="51.42" rerouteNo="1" devices="tripinfo_car_s2n_156 routing_car_s2n_156" vType="Car" speedFactor="1.04" vaporized=""/>
    <tripinfo id="car_s2e_150" depart="150.00" departLane="s2sep_1" departPos="3.60" departPosLat="0.00" departSpeed="13.90" departDelay="0.00" arrival="345.65" arrivalLane="c2e_1" arrivalPos="990.00" arrivalPosLat="0.00" arrivalSpeed="13.90" duration="195.65" routeLength="1986.69" waitingTime="45.00" waitingCount="1" stopTime="0.00" timeLoss="51.98" rerouteNo="1" devices="tripinfo_car_s2e_150 routing_car_s2e_150" vType="Car" speedFactor="1.00" vaporized=""/>
    <tripinfo id="car_n2s_162" depart="162.00" departLane="n2sep_1" departPos="3.60" departPosLat="0.00" departSpeed="13.90" departDelay="0.00" arrival="347.85" arrivalLane="c2s_1" arrivalPos="990.00" arrivalPosLat="0.00" arrivalSpeed="13.90" duration="185.85" routeLength="1997.01" waitingTime="33.80" waitingCount="1" stopTime="0.00" timeLoss="42.16" rerouteNo="1" devices="tripinfo_car_n2s_162 routing_car_n2s_162" vType="Car" speedFactor="1.00" vaporized=""/>
    <tripinfo id="car_n2s_170" depart="170.00" departLane="n2sep_1" departPos="3.60" departPosLat="0.00" departSpeed="13.90" departDelay="0.00" arrival="349.70" arrivalLane="c2s_1" arrivalPos="990.00" arrivalPosLat="0.00" arrivalSpeed="15.50" duration="179.70" routeLength="1997.01" waitingTime="33.10" waitingCount="1" stopTime="0.00" timeLoss="57.87" rerouteNo="1" devices="tripinfo_car_n2s_170 routing_car_n2s_170" vType="Car" speedFactor="1.18" vaporized=""/>
    <tripinfo id="car_s2n_175" depart="175.00" departLane="s2sep_1" departPos="3.60" departPosLat="0.00" departSpeed="13.90" departDelay="0.00" arrival="349.90" arrivalLane="c2n_1" arrivalPos="990.00" arrivalPosLat="0.00" arrivalSpeed="14.34" duration="174.90" routeLength="1997.01" waitingTime="23.65" waitingCount="1" stopTime="0.00" timeLoss="35.75" rerouteNo="1" devices="tripinfo_car_s2n_175 routing_car_s2n_175" vType="Car" speedFactor="1.03" vaporized=""/>
    <tripinfo id="car_n2w_181" depart="181.00" departLane="n2sep_1" departPos="3.60" departPosLat="0.00" departSpeed="13.90" departDelay="0.00" arrival="350.50" arrivalLane="c2w_1" arrivalPos="990.00" arrivalPosLat="0.00" arrivalSpeed="14.32" duration="169.50" routeLength="1986.69" waitingTime="18.35" waitingCount="1" stopTime="0.00" timeLoss="30.03" rerouteNo="1" devices="tripinfo_car_n2w_181 routing_car_n2w_181" vType="Car" speedFactor="1.03" vaporized=""/>
    <tripinfo id="car_s2e_176" depart="178.10" departLane="s2sep_1" departPos="3.60" departPosLat="0.00" departSpeed="13.90" departDelay="2.10" arrival="350.85" arrivalLane="c2e_1" arrivalPos="990.00" arrivalPosLat="0.00" arrivalSpeed="14.37" duration="172.75" routeLength="1986.69" waitingTime="18.85" waitingCount="1" stopTime="0.00" timeLoss="33.86" rerouteNo="1" devices="tripinfo_car_s2e_176 routing_car_s2e_176" vType="Car" speedFactor="1.03" vaporized=""/>
    <tripinfo id="car_s2n_181" depart="181.00" departLane="s2sep_1" departPos="3.60" departPosLat="0.00" departSpeed="13.90" departDelay="0.00" arrival="355.30" arrivalLane="c2n_1" arrivalPos="990.00" arrivalPosLat="0.00" arrivalSpeed="13.90" duration="174.30" routeLength="1997.01" waitingTime="16.15" waitingCount="1" stopTime="0.00" timeLoss="30.63" rerouteNo="1" devices="tripinfo_car_s2n_181 routing_car_s2n_181" vType="Car" speedFactor="1.00" vaporized=""/>
    <tripinfo id="car_n2e_176" depart="176.00" departLane="n2sep_1" departPos="3.60" departPosLat="0.00" departSpeed="13.90" departDelay="0.00" arrival="357.30" arrivalLane="c2e_1" arrivalPos="990.00" arrivalPosLat="0.00" arrivalSpeed="14.00" duration="181.30" routeLength="1996.47" waitingTime="26.30" waitingCount="2" stopTime="0.00" timeLoss="38.01" rerouteNo="1" devices="tripinfo_car_n2e_176 routing_car_n2e_176" vType="Car" speedFactor="1.01" vaporized=""/>
    <tripinfo id="car_n2e_208" depart="208.00" departLane="n2sep_1" departPos="3.60" departPosLat="0.00" departSpeed="13.90" departDelay="0.00" arrival="359.60" arrivalLane="c2e_1" arrivalPos="990.00" arrivalPosLat="0.00" arrivalSpeed="14.90" duration="151.60" routeLength="1996.47" waitingTime="4.60" waitingCount="1" stopTime="0.00" timeLoss="19.44" rerouteNo="1" devices="tripinfo_car_n2e_208 routing_car_n2e_208" vType="Car" speedFactor="1.09" vaporized=""/>
    <tripinfo id="bus_n2w_211" depart="211.00" departLane="n2sep_1" departPos="12.10" departPosLat="0.00" departSpeed="13.90" departDelay="0.00" arrival="360.80" arrivalLane="c2w_1" arrivalPos="990.00" arrivalPosLat="0.00" arrivalSpeed="13.90" duration="149.80" routeLength="1978.19" waitingTime="0.00" waitingCount="0" stopTime="0.00" timeLoss="6.76" rerouteNo="1" devices="tripinfo_bus_n2w_211 routing_bus_n2w_211" vType="Bus" speedFactor="1.00" vaporized=""/>
    <tripinfo id="car_s2w_165" depart="165.00" departLane="s2sep_1" departPos="3.60" departPosLat="0.00" departSpeed="13.90" departDelay="0.00" arrival="364.15" arrivalLane="c2w_1" arrivalPos="990.00" arrivalPosLat="0.00" arrivalSpeed="14.59" duration="199.15" routeLength="1996.47" waitingTime="45.85" waitingCount="2" stopTime="0.00" timeLoss="62.42" rerouteNo="1" devices="tripinfo_car_s2w_165 routing_car_s2w_165" vType="Car" speedFactor="1.06" vaporized=""/>
    <tripinfo id="car_s2w_166" depart="166.35" departLane="s2sep_1" departPos="3.60" departPosLat="0.00" departSpeed="13.90" departDelay="0.35" arrival="368.20" arrivalLane="c2w_1" arrivalPos="990.00" arrivalPosLat="0.00" arrivalSpeed="13.89" duration="201.85" routeLength="1996.47" waitingTime="39.55" waitingCount="2" stopTime="0.00" timeLoss="57.53" rerouteNo="1" devices="tripinfo_car_s2w_166 routing_car_s2w_166" vType="Car" speedFactor="1.00" vaporized=""/>
    <tripinfo id="car_s2w_176" depart="176.40" departLane="s2sep_1" departPos="3.60" departPosLat="0.00" departSpeed="13.90" departDelay="0.40" arrival="370.40" arrivalLane="c2w_1" arrivalPos="990.00" arrivalPosLat="0.00" arrivalSpeed="14.76" duration="194.00" routeLength="1996.47" waitingTime="30.55" waitingCount="2" stopTime="0.00" timeLoss="61.21" rerouteNo="1" devices="tripinfo_car_s2w_176 routing_car_s2w_176" vType="Car" speedFactor="1.09" vaporized=""/>
    <tripinfo id="car_n2e_226" depart="226.00" departLane="n2sep_1" departPos="3.60" departPosLat="0.00" departSpeed="13.90" departDelay="0.00" arrival="372.40" arrivalLane="c2e_1" arrivalPos="990.00" arrivalPosLat="0.00" arrivalSpeed="14.04" duration="146.40" routeLength="1996.47" waitingTime="0.00" waitingCount="0" stopTime="0.00" timeLoss="3.49" rerouteNo="1" devices="tripinfo_car_n2e_226 routing_car_n2e_226" vType="Car" speedFactor="1.01" vaporized=""/>
    <tripinfo id="car_e2w_191" depart="191.00" departLane="e2sep_1" departPos="3.60" departPosLat="0.00" departSpeed="13.90" departDelay="0.00" arrival="387.90" arrivalLane="c2w_1" arrivalPos="990.00" arrivalPosLat="0.00" arrivalSpeed="14.49" duration="196.90" routeLength="1997.01" waitingTime="52.35" waitingCount="1" stopTime="0.00" timeLoss="59.11" rerouteNo="1" devices="tripinfo_car_e2w_191 routing_car_e2w_191" vType="Car" speedFactor="1.04" vaporized=""/>
    <tripinfo id="car_w2s_194" depart="194.00" departLane="w2sep_1" departPos="3.60" departPosLat="0.00" departSpeed="13.90" departDelay="0.00" arrival="389.10" arrivalLane="c2s_1" arrivalPos="990.00" arrivalPosLat="0.00" arrivalSpeed="14.21" duration="195.10" routeLength="1986.69" waitingTime="44.75" waitingCount="1" stopTime="0.00" timeLoss="54.55" rerouteNo="1" devices="tripinfo_car_w2s_194 routing_car_w2s_194" vType="Car" speedFactor="1.02" vaporized=""/>
    <tripinfo id="car_w2e_219" depart="219.00" departLane="w2sep_1" departPos="3.60" departPosLat="0.00" departSpeed="13.90" departDelay="0.00" arrival="389.95" arrivalLane="c2e_1" arrivalPos="990.00" arrivalPosLat="0.00" arrivalSpeed="14.50" duration="170.95" routeLength="1997.01" waitingTime="24.65" waitingCount="1" stopTime="0.00" timeLoss="33.23" rerouteNo="1" devices="tripinfo_car_w2e_219 routing_car_w2e_219" vType="Car" speedFactor="1.04" vaporized=""/>
    <tripinfo id="car_e2n_196" depart="196.00" departLane="e2sep_1" departPos="3.60" departPosLat="0.00" departSpeed="13.90" departDelay="0.00" arrival="391.80" arrivalLane="c2n_1" arrivalPos="990.00" arrivalPosLat="0.00" arrivalSpeed="14.13" duration="195.80" routeLength="1986.69" waitingTime="45.65" waitingCount="1" stopTime="0.00" timeLoss="54.48" rerouteNo="1" devices="tripinfo_car_e2n_196 routing_car_e2n_196" vType="Car" speedFactor="1.02" vaporized=""/>
    <tripinfo id="car_w2e_234" depart="234.00" departLane="w2sep_1" departPos="3.60" departPosLat="0.00" departSpeed="13.90" departDelay="0.00" arrival="392.40" arrivalLane="c2e_1" arrivalPos="990.00" arrivalPosLat="0.00" arrivalSpeed="15.36" duration="158.40" routeLength="1997.01" waitingTime="15.15" waitingCount="1" stopTime="0.00" timeLoss="30.30" rerouteNo="1" devices="tripinfo_car_w2e_234 routing_car_w2e_234" vType="Car" speedFactor="1.12" vaporized=""/>
    <tripinfo id="car_w2s_235" depart="235.30" departLane="w2sep_1" departPos="3.60" departPosLat="0.00" departSpeed="13.90" departDelay="0.30" arrival="392.55" arrivalLane="c2s_1" arrivalPos="990.00" arrivalPosLat="0.00" arrivalSpeed="15.20" duration="157.25" routeLength="1986.69" waitingTime="12.00" waitingCount="1" stopTime="0.00" timeLoss="26.32" rerouteNo="1" devices="tripinfo_car_w2s_235 routing_car_w2s_235" vType="Car" speedFactor="1.10" vaporized=""/>
    <tripinfo id="bus_e2w_202" depart="202.00" departLane="e2sep_1" departPos="12.10" departPosLat="0.00" departSpeed="13.90" departDelay="0.00" arrival="397.80" arrivalLane="c2w_1" arrivalPos="990.00" arrivalPosLat="0.00" arrivalSpeed="13.90" duration="195.80" routeLength="1988.51" waitingTime="41.05" waitingCount="1" stopTime="0.00" timeLoss="52.71" rerouteNo="1" devices="tripinfo_bus_e2w_202 routing_bus_e2w_202" vType="Bus" speedFactor="1.00" vaporized=""/>
    <tripinfo id="car_e2n_224" depart="224.00" departLane="e2sep_1" departPos="3.60" departPosLat="0.00" departSpeed="13.90" departDelay="0.00" arrival="398.25" arrivalLane="c2n_1" arrivalPos="990.00" arrivalPosLat="0.00" arrivalSpeed="14.69" duration="174.25" routeLength="1986.69" waitingTime="23.55" waitingCount="1" stopTime="0.00" timeLoss="38.30" rerouteNo="1" devices="tripinfo_car_e2n_224 routing_car_e2n_224" vType="Car" speedFactor="1.06" vaporized=""/>
    <tripinfo id="car_e2s_222" depart="222.00" departLane="e2sep_1" departPos="3.60" departPosLat="0.00" departSpeed="13.90" departDelay="0.00" arrival="398.65" arrivalLane="c2s_1" arrivalPos="990.00" arrivalPosLat="0.00" arrivalSpeed="15.16" duration="176.65" routeLength="1996.47" waitingTime="31.95" waitingCount="2" stopTime="0.00" timeLoss="44.33" rerouteNo="1" devices="tripinfo_car_e2s_222 routing_car_e2s_222" vType="Car" speedFactor="1.09" vaporized=""/>
    <tripinfo id="car_w2e_240" depart="240.00" departLane="w2sep_1" departPos="3.60" departPosLat="0.00" departSpeed="13.90" departDelay="0.00" arrival="399.80" arrivalLane="c2e_1" arrivalPos="990.00" arrivalPosLat="0.00" arrivalSpeed="13.90" duration="159.80" routeLength="1997.01" waitingTime="4.20" waitingCount="1" stopTime="0.00" timeLoss="16.10" rerouteNo="1" devices="tripinfo_car_w2e_240 routing_car_w2e_240" vType="Car" speedFactor="1.00" vaporized=""/>
    <tripinfo id="car_w2n_260" depart="260.00" departLane="w2sep_1" departPos="3.60" departPosLat="0.00" departSpeed="13.90" departDelay="0.00" arrival="400.60" arrivalLane="c2n_1" arrivalPos="990.00" arrivalPosLat="0.00" arrivalSpeed="15.93" duration="140.60" routeLength="1996.47" waitingTime="6.40" waitingCount="1" stopTime="0.00" timeLoss="17.10" rerouteNo="1" devices="tripinfo_car_w2n_260 routing_car_w2n_260" vType="Car" speedFactor="1.17" vaporized=""/>
    <tripinfo id="car_e2w_213" depart="213.00" departLane="e2sep_1" departPos="3.60" departPosLat="0.00" departSpeed="13.90" departDelay="0.00" arrival="401.45" arrivalLane="c2w_1" arrivalPos="990.00" arrivalPosLat="0.00" arrivalSpeed="14.38" duration="188.45" routeLength="1997.01" waitingTime="33.50" waitingCount="1" stopTime="0.00" timeLoss="49.98" rerouteNo="1" devices="tripinfo_car_e2w_213 routing_car_e2w_213" vType="Car" speedFactor="1.04" vaporized=""/>
    <tripinfo id="car_e2w_228" depart="228.00" departLane="e2sep_1" departPos="3.60" departPosLat="0.00" departSpeed="13.90" departDelay="0.00" arrival="403.75" arrivalLane="c2w_1" arrivalPos="990.00" arrivalPosLat="0.00" arrivalSpeed="14.86" duration="175.75" routeLength="1997.01" waitingTime="22.05" waitingCount="1" stopTime="0.00" timeLoss="43.70" rerouteNo="1" devices="tripinfo_car_e2w_228 routing_car_e2w_228" vType="Car" speedFactor="1.09" vaporized=""/>
    <tripinfo id="car_w2e_241" depart="241.50" departLane="w2sep_1" departPos="3.60" departPosLat="0.00" departSpeed="13.90" departDelay="0.50" arrival="403.85" arrivalLane="c2e_1" arrivalPos="990.00" arrivalPosLat="0.00" arrivalSpeed="13.89" duration="162.35" routeLength="1997.01" waitingTime="1.80" waitingCount="1" stopTime="0.00" timeLoss="18.68" rerouteNo="1" devices="tripinfo_car_w2e_241 routing_car_w2e_241" vType="Car" speedFactor="1.00" vaporized=""/>
    <tripinfo id="car_e2s_252" depart="252.00" departLane="e2sep_1" departPos="3.60" departPosLat="0.00" departSpeed="13.90" departDelay="0.00" arrival="406.05" arrivalLane="c2s_1" arrivalPos="990.00" arrivalPosLat="0.00" arrivalSpeed="14.09" duration="154.05" routeLength="1996.47" waitingTime="2.60" waitingCount="1" stopTime="0.00" timeLoss="11.69" rerouteNo="1" devices="tripinfo_car_e2s_252 routing_car_e2s_252" vType="Car" speedFactor="1.01" vaporized=""/>
    <tripinfo id="car_e2w_238" depart="238.00" departLane="e2sep_1" departPos="3.60" departPosLat="0.00" departSpeed="13.90" departDelay="0.00" arrival="407.80" arrivalLane="c2w_1" arrivalPos="990.00" arrivalPosLat="0.00" arrivalSpeed="13.89" duration="169.80" routeLength="1997.01" waitingTime="10.00" waitingCount="1" stopTime="0.00" timeLoss="26.11" rerouteNo="1" devices="tripinfo_car_e2w_238 routing_car_e2w_238" vType="Car" speedFactor="1.00" vaporized=""/>
    <tripinfo id="amb_w2e_300" depart="300.00" departLane="w2sep_1" departPos="6.60" departPosLat="0.00" departSpeed="13.90" departDelay="0.00" arrival="408.55" arrivalLane="c2e_1" arrivalPos="990.00" arrivalPosLat="-0.95" arrivalSpeed="20.77" duration="108.55" routeLength="1994.01" waitingTime="0.00" waitingCount="0" stopTime="0.00" timeLoss="12.90" rerouteNo="1" devices="tripinfo_amb_w2e_300 routing_amb_w2e_300 bluelight_amb_w2e_300 fcd_amb_w2e_300" vType="Ambulance" speedFactor="1.50" vaporized="">
        <example_device customValue1="0.00" customValue2="-1.00"/>
    </tripinfo>
    <tripinfo id="car_e2s_262" depart="262.00" departLane="e2sep_1" departPos="3.60" departPosLat="0.00" departSpeed="13.90" departDelay="0.00" arrival="410.10" arrivalLane="c2s_1" arrivalPos="990.00" arrivalPosLat="0.00" arrivalSpeed="14.12" duration="148.10" routeLength="1996.47" waitingTime="0.00" waitingCount="0" stopTime="0.00" timeLoss="6.12" rerouteNo="1" devices="tripinfo_car_e2s_262 routing_car_e2s_262" vType="Car" speedFactor="1.02" vaporized=""/>
    <tripinfo id="bus_e2w_266" depart="266.00" departLane="e2sep_1" departPos="12.10" departPosLat="0.00" departSpeed="13.90" departDelay="0.00" arrival="412.30" arrivalLane="c2w_1" arrivalPos="990.00" arrivalPosLat="0.00" arrivalSpeed="13.84" duration="146.30" routeLength="1988.51" waitingTime="0.00" waitingCount="0" stopTime="0.00" timeLoss="3.21" rerouteNo="1" devices="tripinfo_bus_e2w_266 routing_bus_e2w_266" vType="Bus" speedFactor="1.00" vaporized=""/>
    <tripinfo id="car_w2s_285" depart="285.00" departLane="w2sep_1" departPos="3.60" departPosLat="0.00" departSpeed="13.90" departDelay="0.00" arrival="420.20" arrivalLane="c2s_1" arrivalPos="990.00" arrivalPosLat="0.00" arrivalSpeed="15.23" duration="135.20" routeLength="1986.69" waitingTime="0.00" waitingCount="0" stopTime="0.00" timeLoss="4.09" rerouteNo="1" devices="tripinfo_car_w2s_285 routing_car_w2s_285" vType="Car" speedFactor="1.10" vaporized=""/>
    <tripinfo id="car_w2e_291" depart="291.00" departLane="w2sep_1" departPos="3.60" departPosLat="0.00" departSpeed="13.90" departDelay="0.00" arrival="422.40" arrivalLane="c2e_1" arrivalPos="990.00" arrivalPosLat="1.10" arrivalSpeed="15.33" duration="131.40" routeLength="1997.01" waitingTime="0.00" waitingCount="0" stopTime="0.00" timeLoss="1.17" rerouteNo="1" devices="tripinfo_car_w2e_291 routing_car_w2e_291" vType="Car@car_w2e_291" speedFactor="1.10" vaporized=""/>
    <tripinfo id="car_e2s_286" depart="286.00" departLane="e2sep_1" departPos="3.60" departPosLat="0.00" departSpeed="13.90" departDelay="0.00" arrival="427.85" arrivalLane="c2s_1" arrivalPos="990.00" arrivalPosLat="0.00" arrivalSpeed="16.36" duration="141.85" routeLength="1996.47" waitingTime="10.55" waitingCount="1" stopTime="0.00" timeLoss="19.22" rerouteNo="1" devices="tripinfo_car_e2s_286 routing_car_e2s_286" vType="Car" speedFactor="1.18" vaporized=""/>
    <tripinfo id="car_e2n_289" depart="289.00" departLane="e2sep_1" departPos="3.60" departPosLat="0.00" departSpeed="13.90" departDelay="0.00" arrival="436.40" arrivalLane="c2n_1" arrivalPos="990.00" arrivalPosLat="0.00" arrivalSpeed="13.94" duration="147.40" routeLength="1986.69" waitingTime="0.00" waitingCount="0" stopTime="0.00" timeLoss="4.21" rerouteNo="1" devices="tripinfo_car_e2n_289 routing_car_e2n_289" vType="Car" speedFactor="1.00" vaporized=""/>
    <tripinfo id="car_e2n_290" depart="290.50" departLane="e2sep_1" departPos="3.60" departPosLat="0.00" departSpeed="13.90" departDelay="0.50" arrival="441.70" arrivalLane="c2n_1" arrivalPos="990.00" arrivalPosLat="0.00" arrivalSpeed="13.90" duration="151.20" routeLength="1986.69" waitingTime="0.00" waitingCount="0" stopTime="0.00" timeLoss="7.52" rerouteNo="1" devices="tripinfo_car_e2n_290 routing_car_e2n_290" vType="Car" speedFactor="1.00" vaporized=""/>
    <tripinfo id="car_e2s_295" depart="295.55" departLane="e2sep_1" departPos="3.60" departPosLat="0.00" departSpeed="13.90" departDelay="0.55" arrival="442.05" arrivalLane="c2s_1" arrivalPos="990.00" arrivalPosLat="0.00" arrivalSpeed="14.75" duration="146.50" routeLength="1996.47" waitingTime="0.00" waitingCount="0" stopTime="0.00" timeLoss="10.44" rerouteNo="1" devices="tripinfo_car_e2s_295 routing_car_e2s_295" vType="Car" speedFactor="1.06" vaporized=""/>
    <tripinfo id="car_w2n_294" depart="294.00" departLane="w2sep_1" departPos="3.60" departPosLat="0.00" departSpeed="13.90" departDelay="0.00" arrival="444.70" arrivalLane="c2n_1" arrivalPos="990.00" arrivalPosLat="0.00" arrivalSpeed="14.26" duration="150.70" routeLength="1996.47" waitingTime="0.00" waitingCount="0" stopTime="0.00" timeLoss="10.77" rerouteNo="1" devices="tripinfo_car_w2n_294 routing_car_w2n_294" vType="Car" speedFactor="1.03" vaporized=""/>
    <tripinfo id="car_n2w_301" depart="301.00" departLane="n2sep_1" departPos="3.60" departPosLat="0.00" departSpeed="13.90" departDelay="0.00" arrival="449.20" arrivalLane="c2w_1" arrivalPos="990.00" arrivalPosLat="0.00" arrivalSpeed="16.02" duration="148.20" routeLength="1986.69" waitingTime="12.95" waitingCount="1" stopTime="0.00" timeLoss="23.56" rerouteNo="1" devices="tripinfo_car_n2w_301 routing_car_n2w_301" vType="Car" speedFactor="1.15" vaporized=""/>
    <tripinfo id="car_s2e_236" depart="236.00" departLane="s2sep_1" departPos="3.60" departPosLat="0.00" departSpeed="13.90" departDelay="0.00" arrival="449.65" arrivalLane="c2e_1" arrivalPos="990.00" arrivalPosLat="0.00" arrivalSpeed="14.80" duration="213.65" routeLength="1986.69" waitingTime="71.60" waitingCount="1" stopTime="0.00" timeLoss="78.74" rerouteNo="1" devices="tripinfo_car_s2e_236 routing_car_s2e_236" vType="Car" speedFactor="1.07" vaporized=""/>
    <tripinfo id="car_n2s_253" depart="253.00" departLane="n2sep_1" departPos="3.60" departPosLat="0.00" departSpeed="13.90" departDelay="0.00" arrival="450.05" arrivalLane="c2s_1" arrivalPos="990.00" arrivalPosLat="0.00" arrivalSpeed="14.80" duration="197.05" routeLength="1997.01" waitingTime="54.35" waitingCount="1" stopTime="0.00" timeLoss="62.11" rerouteNo="1" devices="tripinfo_car_n2s_253 routing_car_n2s_253" vType="Car" speedFactor="1.06" vaporized=""/>
    <tripinfo id="car_s2w_316" depart="316.00" departLane="s2sep_1" departPos="3.60" departPosLat="0.00" departSpeed="13.90" departDelay="0.00" arrival="455.15" arrivalLane="c2w_1" arrivalPos="990.00" arrivalPosLat="0.00" arrivalSpeed="15.54" duration="139.15" routeLength="1996.47" waitingTime="1.45" waitingCount="1" stopTime="0.00" timeLoss="10.10" rerouteNo="1" devices="tripinfo_car_s2w_316 routing_car_s2w_316" vType="Car" speedFactor="1.12" vaporized=""/>
    <tripinfo id="car_s2n_240" depart="240.00" departLane="s2sep_1" departPos="3.60" departPosLat="0.00" departSpeed="13.90" departDelay="0.00" arrival="456.20" arrivalLane="c2n_1" arrivalPos="990.00" arrivalPosLat="0.00" arrivalSpeed="13.90" duration="216.20" routeLength="1997.01" waitingTime="63.90" waitingCount="1" stopTime="0.00" timeLoss="72.51" rerouteNo="1" devices="tripinfo_car_s2n_240 routing_car_s2n_240" vType="Car" speedFactor="1.00" vaporized=""/>
    <tripinfo id="car_n2s_264" depart="265.30" departLane="n2sep_1" departPos="3.60" departPosLat="0.00" departSpeed="13.90" departDelay="1.30" arrival="456.65" arrivalLane="c2s_1" arrivalPos="990.00" arrivalPosLat="0.00" arrivalSpeed="14.02" duration="191.35" routeLength="1997.01" waitingTime="38.20" waitingCount="1" stopTime="0.00" timeLoss="48.96" rerouteNo="1" devices="tripinfo_car_n2s_264 routing_car_n2s_264" vType="Car" speedFactor="1.01" vaporized=""/>
    <tripinfo id="car_s2e_252" depart="252.00" departLane="s2sep_1" departPos="3.60" departPosLat="0.00" departSpeed="13.90" departDelay="0.00" arrival="458.65" arrivalLane="c2e_1" arrivalPos="990.00" arrivalPosLat="0.00" arrivalSpeed="14.38" duration="206.65" routeLength="1986.69" waitingTime="56.55" waitingCount="1" stopTime="0.00" timeLoss="67.75" rerouteNo="1" devices="tripinfo_car_s2e_252 routing_car_s2e_252" vType="Car" speedFactor="1.03" vaporized=""/>
    <tripinfo id="car_s2n_243" depart="243.00" departLane="s2sep_1" departPos="3.60" departPosLat="0.00" departSpeed="13.90" departDelay="0.00" arrival="458.70" arrivalLane="c2n_1" arrivalPos="990.00" arrivalPosLat="0.00" arrivalSpeed="14.72" duration="215.70" routeLength="1997.01" waitingTime="62.80" waitingCount="1" stopTime="0.00" timeLoss="81.76" rerouteNo="1" devices="tripinfo_car_s2n_243 routing_car_s2n_243" vType="Car" speedFactor="1.07" vaporized=""/>
    <tripinfo id="car_s2e_284" depart="284.00" departLane="s2sep_1" departPos="3.60" departPosLat="0.00" departSpeed="13.90" departDelay="0.00" arrival="461.50" arrivalLane="c2e_1" arrivalPos="990.00" arrivalPosLat="0.00" arrivalSpeed="15.12" duration="177.50" routeLength="1986.69" waitingTime="30.80" waitingCount="1" stopTime="0.00" timeLoss="46.44" rerouteNo="1" devices="tripinfo_car_s2e_284 routing_car_s2e_284" vType="Car" speedFactor="1.10" vaporized=""/>
    <tripinfo id="car_s2w_324" depart="324.00" departLane="s2sep_1" departPos="3.60" departPosLat="0.00" departSpeed="13.90" departDelay="0.00" arrival="463.35" arrivalLane="c2w_1" arrivalPos="990.00" arrivalPosLat="0.00" arrivalSpeed="14.85" duration="139.35" routeLength="1996.47" waitingTime="0.00" waitingCount="0" stopTime="0.00" timeLoss="4.22" rerouteNo="1" devices="tripinfo_car_s2w_324 routing_car_s2w_324" vType="Car" speedFactor="1.07" vaporized=""/>
    <tripinfo id="car_s2n_253" depart="253.40" departLane="s2sep_1" departPos="3.60" departPosLat="0.00" departSpeed="13.90" departDelay="0.40" arrival="463.65" arrivalLane="c2n_1" arrivalPos="990.00" arrivalPosLat="0.00" arrivalSpeed="13.90" duration="210.25" routeLength="1997.01" waitingTime="52.65" waitingCount="1" stopTime="0.00" timeLoss="66.59" rerouteNo="1" devices="tripinfo_car_s2n_253 routing_car_s2n_253" vType="Car" speedFactor="1.00" vaporized=""/>
    <tripinfo id="car_n2w_338" depart="338.00" departLane="n2sep_1" departPos="3.60" departPosLat="0.00" departSpeed="13.90" departDelay="0.00" arrival="465.25" arrivalLane="c2w_1" arrivalPos="990.00" arrivalPosLat="0.00" arrivalSpeed="16.27" duration="127.25" routeLength="1986.69" waitingTime="0.00" waitingCount="0" stopTime="0.00" timeLoss="10.05" rerouteNo="1" devices="tripinfo_car_n2w_338 routing_car_n2w_338" vType="Car" speedFactor="1.23" vaporized=""/>
    <tripinfo id="car_s2n_289" depart="289.00" departLane="s2sep_1" departPos="3.60" departPosLat="0.00" departSpeed="13.90" departDelay="0.00" arrival="466.50" arrivalLane="c2n_1" arrivalPos="990.00" arrivalPosLat="0.00" arrivalSpeed="14.77" duration="177.50" routeLength="1997.01" waitingTime="22.40" waitingCount="1" stopTime="0.00" timeLoss="43.31" rerouteNo="1" devices="tripinfo_car_s2n_289 routing_car_s2n_289" vType="Car" speedFactor="1.07" vaporized=""/>
    <tripinfo id="car_s2e_287" depart="287.00" departLane="s2sep_1" departPos="3.60" departPosLat="0.00" departSpeed="13.90" departDelay="0.00" arrival="468.10" arrivalLane="c2e_1" arrivalPos="990.00" arrivalPosLat="0.00" arrivalSpeed="13.96" duration="181.10" routeLength="1986.69" waitingTime="23.35" waitingCount="1" stopTime="0.00" timeLoss="38.05" rerouteNo="1" devices="tripinfo_car_s2e_287 routing_car_s2e_287" vType="Car" speedFactor="1.00" vaporized=""/>
</tripinfos>
