<?xml version="1.0" encoding="UTF-8"?>

<!-- generated on Sat Apr 24 18:12:48 2021 by Eclipse SUMO Version 1.4.0
<configuration xmlns:xsi="http://www.w3.org/2001/XMLSchema-instance" xsi:noNamespaceSchemaLocation="http://sumo.dlr.de/xsd/sumoConfiguration.xsd">

    <input>
        <net-file value="sumofiles/junction.net.xml"/>
        <route-files value="sumofiles/junction_preemption_33.rou.xml"/>
        <additional-files value="sumofiles/junction.det.xml"/>
    </input>

    <output>
        <tripinfo-output value="sumofiles/output/tripinfo_preemption_33.xml"/>
    </output>

    <time>
        <begin value="0"/>
        <end value="10000"/>
        <step-length value="0.05"/>
    </time>

    <processing>
        <lateral-resolution value="0.1"/>
    </processing>

    <report>
        <no-warnings value="true"/>
        <error-log value="sumofiles/output/errorlog_preemption_33.log"/>
        <no-step-log value="true"/>
    </report>

    <traci_server>
        <remote-port value="43853"/>
    </traci_server>

    <gui_only>
        <gui-settings-file value="sumofiles/junction-gui.settings.xml"/>
        <tracker-interval value="0.05"/>
    </gui_only>

</configuration>
-->

<tripinfos xmlns:xsi="http://www.w3.org/2001/XMLSchema-instance" xsi:noNamespaceSchemaLocation="http://sumo.dlr.de/xsd/tripinfo_file.xsd">
    <tripinfo id="car_e2n_1" depart="1.00" departLane="e2sep_1" departPos="3.60" departPosLat="0.00" departSpeed="13.90" departDelay="0.00" arrival="140.30" arrivalLane="c2n_1" arrivalPos="990.00" arrivalPosLat="0.00" arrivalSpeed="14.73" duration="139.30" routeLength="1986.69" waitingTime="0.00" waitingCount="0" stopTime="0.00" timeLoss="3.74" rerouteNo="1" devices="tripinfo_car_e2n_1 routing_car_e2n_1" vType="Car" speedFactor="1.06" vaporized=""/>
    <tripinfo id="car_w2e_6" depart="6.00" departLane="w2sep_1" departPos="3.60" departPosLat="0.00" departSpeed="13.90" departDelay="0.00" arrival="145.55" arrivalLane="c2e_1" arrivalPos="990.00" arrivalPosLat="0.00" arrivalSpeed="14.32" duration="139.55" routeLength="1997.01" waitingTime="0.00" waitingCount="0" stopTime="0.00" timeLoss="0.07" rerouteNo="1" devices="tripinfo_car_w2e_6 routing_car_w2e_6" vType="Car" speedFactor="1.03" vaporized=""/>
    <tripinfo id="car_w2e_9" depart="9.00" departLane="w2sep_1" departPos="3.60" departPosLat="0.00" departSpeed="13.90" departDelay="0.00" arrival="149.95" arrivalLane="c2e_1" arrivalPos="990.00" arrivalPosLat="0.00" arrivalSpeed="14.53" duration="140.95" routeLength="1997.01" waitingTime="0.00" waitingCount="0" stopTime="0.00" timeLoss="3.57" rerouteNo="1" devices="tripinfo_car_w2e_9 routing_car_w2e_9" vType="Car" speedFactor="1.05" vaporized=""/>
    <tripinfo id="car_s2n_1" depart="1.00" departLane="s2sep_1" departPos="3.60" departPosLat="0.00" departSpeed="13.90" departDelay="0.00" arrival="161.80" arrivalLane="c2n_1" arrivalPos="990.00" arrivalPosLat="0.00" arrivalSpeed="14.73" duration="160.80" routeLength="1997.01" waitingTime="17.75" waitingCount="1" stopTime="0.00" timeLoss="25.24" rerouteNo="1" devices="tripinfo_car_s2n_1 routing_car_s2n_1" vType="Car" speedFactor="1.06" vaporized=""/>
    <tripinfo id="car_n2e_20" depart="20.00" departLane="n2sep_1" departPos="3.60" departPosLat="0.00" departSpeed="13.90" departDelay="0.00" arrival="164.75" arrivalLane="c2e_1" arrivalPos="990.00" arrivalPosLat="0.00" arrivalSpeed="15.16" duration="144.75" routeLength="1996.47" waitingTime="0.60" waitingCount="1" stopTime="0.00" timeLoss="12.40" rerouteNo="1" devices="tripinfo_car_n2e_20 routing_car_n2e_20" vType="Car" speedFactor="1.09" vaporized=""/>
    <tripinfo id="car_n2w_3" depart="3.00" departLane="n2sep_1" departPos="3.60" departPosLat="0.00" departSpeed="13.90" departDelay="0.00" arrival="164.90" arrivalLane="c2w_1" arrivalPos="990.00" arrivalPosLat="0.00" arrivalSpeed="14.04" duration="161.90" routeLength="1986.69" waitingTime="12.65" waitingCount="1" stopTime="0.00" timeLoss="19.71" rerouteNo="1" devices="tripinfo_car_n2w_3 routing_car_n2w_3" vType="Car" speedFactor="1.01" vaporized=""/>
    <tripinfo id="car_n2s_17" depart="17.00" departLane="n2sep_1" departPos="3.60" departPosLat="0.00" departSpeed="13.90" departDelay="0.00" arrival="167.10" arrivalLane="c2s_1" arrivalPos="990.00" arrivalPosLat="0.00" arrivalSpeed="15.05" duration="150.10" routeLength="1997.01" waitingTime="5.85" waitingCount="1" stopTime="0.00" timeLoss="17.40" rerouteNo="1" devices="tripinfo_car_n2s_17 routing_car_n2s_17" vType="Car" speedFactor="1.08" vaporized=""/>
    <tripinfo id="car_s2n_19" depart="19.00" departLane="s2sep_1" departPos="3.60" departPosLat="0.00" departSpeed="13.90" departDelay="0.00" arrival="167.30" arrivalLane="c2n_1" arrivalPos="990.00" arrivalPosLat="0.00" arrivalSpeed="14.32" duration="148.30" routeLength="1997.01" waitingTime="0.00" waitingCount="0" stopTime="0.00" timeLoss="8.83" rerouteNo="1" devices="tripinfo_car_s2n_19 routing_car_s2n_19" vType="Car" speedFactor="1.03" vaporized=""/>
    <tripinfo id="car_n2w_5" depart="5.00" departLane="n2sep_1" departPos="3.60" departPosLat="0.00" departSpeed="13.90" departDelay="0.00" arrival="167.45" arrivalLane="c2w_1" arrivalPos="990.00" arrivalPosLat="0.00" arrivalSpeed="14.87" duration="162.45" routeLength="1986.69" waitingTime="11.40" waitingCount="1" stopTime="0.00" timeLoss="29.75" rerouteNo="1" devices="tripinfo_car_n2w_5 routing_car_n2w_5" vType="Car" speedFactor="1.08" vaporized=""/>
    <tripinfo id="car_s2e_41" depart="41.00" departLane="s2sep_1" departPos="3.60" departPosLat="0.00" departSpeed="13.90" departDelay="0.00" arrival="170.05" arrivalLane="c2e_1" arrivalPos="990.00" arrivalPosLat="0.00" arrivalSpeed="16.09" duration="129.05" routeLength="1986.69" waitingTime="0.00" waitingCount="0" stopTime="0.00" timeLoss="4.99" rerouteNo="1" devices="tripinfo_car_s2e_41 routing_car_s2e_41" vType="Car" speedFactor="1.16" vaporized=""/>
    <tripinfo id="car_n2w_7" depart="7.00" departLane="n2sep_1" departPos="3.60" departPosLat="0.00" departSpeed="13.90" departDelay="0.00" arrival="172.45" arrivalLane="c2w_1" arrivalPos="990.00" arrivalPosLat="0.00" arrivalSpeed="13.90" duration="165.45" routeLength="1986.69" waitingTime="7.95" waitingCount="1" stopTime="0.00" timeLoss="21.78" rerouteNo="1" devices="tripinfo_car_n2w_7 routing_car_n2w_7" vType="Car" speedFactor="1.00" vaporized=""/>
    <tripinfo id="car_n2w_23" depart="23.00" departLane="n2sep_1" departPos="3.60" departPosLat="0.00" departSpeed="13.90" departDelay="0.00" arrival="175.70" arrivalLane="c2w_1" arrivalPos="990.00" arrivalPosLat="0.00" arrivalSpeed="14.21" duration="152.70" routeLength="1986.69" waitingTime="0.00" waitingCount="0" stopTime="0.00" timeLoss="12.70" rerouteNo="1" devices="tripinfo_car_n2w_23 routing_car_n2w_23" vType="Car" speedFactor="1.03" vaporized=""/>
    <tripinfo id="car_s2n_44" depart="44.00" departLane="s2sep_1" departPos="3.60" departPosLat="0.00" departSpeed="13.90" departDelay="0.00" arrival="177.05" arrivalLane="c2n_1" arrivalPos="990.00" arrivalPosLat="0.00" arrivalSpeed="15.16" duration="133.05" routeLength="1997.01" waitingTime="0.00" waitingCount="0" stopTime="0.00" timeLoss="1.29" rerouteNo="1" devices="tripinfo_car_s2n_44 routing_car_s2n_44" vType="Car" speedFactor="1.09" vaporized=""/>
    <tripinfo id="car_n2w_33" depart="33.00" departLane="n2sep_1" departPos="3.60" departPosLat="0.00" departSpeed="13.90" departDelay="0.00" arrival="181.35" arrivalLane="c2w_1" arrivalPos="990.00" arrivalPosLat="0.00" arrivalSpeed="13.90" duration="148.35" routeLength="1986.69" waitingTime="0.00" waitingCount="0" stopTime="0.00" timeLoss="4.67" rerouteNo="1" devices="tripinfo_car_n2w_33 routing_car_n2w_33" vType="Car" speedFactor="1.00" vaporized=""/>
    <tripinfo id="car_s2n_47" depart="47.00" departLane="s2sep_1" departPos="3.60" departPosLat="0.00" departSpeed="13.90" departDelay="0.00" arrival="185.80" arrivalLane="c2n_1" arrivalPos="990.00" arrivalPosLat="0.00" arrivalSpeed="14.55" duration="138.80" routeLength="1997.01" waitingTime="0.00" waitingCount="0" stopTime="0.00" timeLoss="1.59" rerouteNo="1" devices="tripinfo_car_s2n_47 routing_car_s2n_47" vType="Car" speedFactor="1.05" vaporized=""/>
    <tripinfo id="car_n2w_38" depart="38.00" departLane="n2sep_1" departPos="3.60" departPosLat="0.00" departSpeed="13.90" departDelay="0.00" arrival="186.85" arrivalLane="c2w_1" arrivalPos="990.00" arrivalPosLat="0.00" arrivalSpeed="13.90" duration="148.85" routeLength="1986.69" waitingTime="0.00" waitingCount="0" stopTime="0.00" timeLoss="5.18" rerouteNo="1" devices="tripinfo_car_n2w_38 routing_car_n2w_38" vType="Car" speedFactor="1.00" vaporized=""/>
    <tripinfo id="car_n2s_40" depart="41.65" departLane="n2sep_1" departPos="3.60" departPosLat="0.00" departSpeed="13.90" departDelay="1.65" arrival="189.95" arrivalLane="c2s_1" arrivalPos="990.00" arrivalPosLat="0.00" arrivalSpeed="13.90" duration="148.30" routeLength="1997.01" waitingTime="0.00" waitingCount="0" stopTime="0.00" timeLoss="4.61" rerouteNo="1" devices="tripinfo_car_n2s_40 routing_car_n2s_40" vType="Car" speedFactor="1.00" vaporized=""/>
    <tripinfo id="car_n2e_40" depart="40.00" departLane="n2sep_1" departPos="3.60" departPosLat="0.00" departSpeed="13.90" departDelay="0.00" arrival="191.45" arrivalLane="c2e_1" arrivalPos="990.00" arrivalPosLat="0.00" arrivalSpeed="13.90" duration="151.45" routeLength="1996.47" waitingTime="0.00" waitingCount="0" stopTime="0.00" timeLoss="7.13" rerouteNo="1" devices="tripinfo_car_n2e_40 routing_car_n2e_40" vType="Car" speedFactor="1.00" vaporized=""/>
    <tripinfo id="car_n2s_50" depart="50.00" departLane="n2sep_1" departPos="3.60" departPosLat="0.00" departSpeed="13.90" departDelay="0.00" arrival="192.05" arrivalLane="c2s_1" arrivalPos="990.00" arrivalPosLat="0.00" arrivalSpeed="15.14" duration="142.05" routeLength="1997.01" waitingTime="0.00" waitingCount="0" stopTime="0.00" timeLoss="14.07" rerouteNo="1" devices="tripinfo_car_n2s_50 routing_car_n2s_50" vType="Car" speedFactor="1.12" vaporized=""/>
    <tripinfo id="car_n2e_42" depart="43.55" departLane="n2sep_1" departPos="3.60" departPosLat="0.00" departSpeed="13.90" departDelay="1.55" arrival="196.10" arrivalLane="c2e_1" arrivalPos="990.00" arrivalPosLat="0.00" arrivalSpeed="14.14" duration="152.55" routeLength="1996.47" waitingTime="0.00" waitingCount="0" stopTime="0.00" timeLoss="10.79" rerouteNo="1" devices="tripinfo_car_n2e_42 routing_car_n2e_42" vType="Car" speedFactor="1.02" vaporized=""/>
    <tripinfo id="car_e2n_24" depart="24.00" departLane="e2sep_1" departPos="3.60" departPosLat="0.00" departSpeed="13.90" departDelay="0.00" arrival="207.50" arrivalLane="c2n_1" arrivalPos="990.00" arrivalPosLat="0.00" arrivalSpeed="14.55" duration="183.50" routeLength="1986.69" waitingTime="39.05" waitingCount="1" stopTime="0.00" timeLoss="46.31" rerouteNo="1" devices="tripinfo_car_e2n_24 routing_car_e2n_24" vType="Car" speedFactor="1.05" vaporized=""/>
    <tripinfo id="car_w2s_58" depart="58.00" departLane="w2sep_1" departPos="3.60" departPosLat="0.00" departSpeed="13.90" departDelay="0.00" arrival="209.20" arrivalLane="c2s_1" arrivalPos="990.00" arrivalPosLat="0.00" arrivalSpeed="15.73" duration="151.20" routeLength="1986.69" waitingTime="5.30" waitingCount="1" stopTime="0.00" timeLoss="24.27" rerouteNo="1" devices="tripinfo_car_w2s_58 routing_car_w2s_58" vType="Car" speedFactor="1.13" vaporized=""/>
    <tripinfo id="car_e2n_27" depart="27.00" departLane="e2sep_1" departPos="3.60" departPosLat="0.00" departSpeed="13.90" departDelay="0.00" arrival="210.05" arrivalLane="c2n_1" arrivalPos="990.00" arrivalPosLat="0.00" arrivalSpeed="15.40" duration="183.05" routeLength="1986.69" waitingTime="37.80" waitingCount="1" stopTime="0.00" timeLoss="55.09" rerouteNo="1" devices="tripinfo_car_e2n_27 routing_car_e2n_27" vType="Car" speedFactor="1.12" vaporized=""/>
    <tripinfo id="car_w2e_11" depart="11.00" departLane="w2sep_1" departPos="3.60" departPosLat="0.00" departSpeed="13.90" departDelay="0.00" arrival="210.10" arrivalLane="c2e_1" arrivalPos="990.00" arrivalPosLat="0.00" arrivalSpeed="14.04" duration="199.10" routeLength="1997.01" waitingTime="47.70" waitingCount="1" stopTime="0.00" timeLoss="56.87" rerouteNo="1" devices="tripinfo_car_w2e_11 routing_car_w2e_11" vType="Car" speedFactor="1.01" vaporized=""/>
    <tripinfo id="car_w2e_38" depart="38.00" departLane="w2sep_1" departPos="3.60" departPosLat="0.00" departSpeed="13.90" departDelay="0.00" arrival="213.25" arrivalLane="c2e_1" arrivalPos="990.00" arrivalPosLat="0.00" arrivalSpeed="14.48" duration="175.25" routeLength="1997.01" waitingTime="25.75" waitingCount="1" stopTime="0.00" timeLoss="37.88" rerouteNo="1" devices="tripinfo_car_w2e_38 routing_car_w2e_38" vType="Car" speedFactor="1.05" vaporized=""/>
    <tripinfo id="car_e2n_72" depart="72.00" departLane="e2sep_1" departPos="3.60" departPosLat="0.00" departSpeed="13.90" departDelay="0.00" arrival="214.10" arrivalLane="c2n_1" arrivalPos="990.00" arrivalPosLat="0.00" arrivalSpeed="16.26" duration="142.10" routeLength="1986.69" waitingTime="4.25" waitingCount="1" stopTime="0.00" timeLoss="19.52" rerouteNo="1" devices="tripinfo_car_e2n_72 routing_car_e2n_72" vType="Car" speedFactor="1.17" vaporized=""/>
    <tripinfo id="car_e2w_44" depart="44.00" departLane="e2sep_1" departPos="3.60" departPosLat="0.00" departSpeed="13.90" departDelay="0.00" arrival="214.40" arrivalLane="c2w_1" arrivalPos="990.00" arrivalPosLat="0.00" arrivalSpeed="14.04" duration="170.40" routeLength="1997.01" waitingTime="18.65" waitingCount="1" stopTime="0.00" timeLoss="28.15" rerouteNo="1" devices="tripinfo_car_e2w_44 routing_car_e2w_44" vType="Car" speedFactor="1.01" vaporized=""/>
    <tripinfo id="car_w2e_56" depart="56.00" departLane="w2sep_1" departPos="3.60" departPosLat="0.00" departSpeed="13.90" departDelay="0.00" arrival="217.60" arrivalLane="c2e_1" arrivalPos="990.00" arrivalPosLat="0.00" arrivalSpeed="13.89" duration="161.60" routeLength="1997.01" waitingTime="6.00" waitingCount="1" stopTime="0.00" timeLoss="17.92" rerouteNo="1" devices="tripinfo_car_w2e_56 routing_car_w2e_56" vType="Car" speedFactor="1.00" vaporized=""/>
    <tripinfo id="car_e2w_47" depart="47.00" departLane="e2sep_1" departPos="3.60" departPosLat="0.00" departSpeed="13.90" departDelay="0.00" arrival="218.15" arrivalLane="c2w_1" arrivalPos="990.00" arrivalPosLat="0.00" arrivalSpeed="14.24" duration="171.15" routeLength="1997.01" waitingTime="16.45" waitingCount="1" stopTime="0.00" timeLoss="31.15" rerouteNo="1" devices="tripinfo_car_e2w_47 routing_car_e2w_47" vType="Car" speedFactor="1.03" vaporized=""/>
    <tripinfo id="car_e2s_73" depart="73.25" departLane="e2sep_1" departPos="3.60" departPosLat="0.00" departSpeed="13.90" departDelay="0.25" arrival="220.10" arrivalLane="c2s_1" arrivalPos="990.00" arrivalPosLat="0.00" arrivalSpeed="14.17" duration="146.85" routeLength="1996.47" waitingTime="0.00" waitingCount="0" stopTime="0.00" timeLoss="5.29" rerouteNo="1" devices="tripinfo_car_e2s_73 routing_car_e2s_73" vType="Car" speedFactor="1.02" vaporized=""/>
    <tripinfo id="car_w2e_68" depart="68.00" departLane="w2sep_1" departPos="3.60" departPosLat="0.00" departSpeed="13.90" departDelay="0.00" arrival="221.15" arrivalLane="c2e_1" arrivalPos="990.00" arrivalPosLat="0.00" arrivalSpeed="13.94" duration="153.15" routeLength="1997.01" waitingTime="0.00" waitingCount="0" stopTime="0.00" timeLoss="10.21" rerouteNo="1" devices="tripinfo_car_w2e_68 routing_car_w2e_68" vType="Car" speedFactor="1.01" vaporized=""/>
    <tripinfo id="car_e2s_82" depart="82.00" departLane="e2sep_1" departPos="3.60" departPosLat="0.00" departSpeed="13.90" departDelay="0.00" arrival="222.50" arrivalLane="c2s_1" arrivalPos="990.00" arrivalPosLat="0.00" arrivalSpeed="15.08" duration="140.50" routeLength="1996.47" waitingTime="0.00" waitingCount="0" stopTime="0.00" timeLoss="9.56" rerouteNo="1" devices="tripinfo_car_e2s_82 routing_car_e2s_82" vType="Car" speedFactor="1.10" vaporized=""/>
    <tripinfo id="bus_e2w_49" depart="49.15" departLane="e2sep_1" departPos="12.10" departPosLat="0.00" departSpeed="13.90" departDelay="0.15" arrival="222.60" arrivalLane="c2w_1" arrivalPos="990.00" arrivalPosLat="0.00" arrivalSpeed="13.85" duration="173.45" routeLength="1988.51" waitingTime="14.65" waitingCount="1" stopTime="0.00" timeLoss="30.37" rerouteNo="1" devices="tripinfo_bus_e2w_49 routing_bus_e2w_49" vType="Bus" speedFactor="1.00" vaporized=""/>
    <tripinfo id="car_w2n_75" depart="75.00" departLane="w2sep_1" departPos="3.60" departPosLat="0.00" departSpeed="13.90" departDelay="0.00" arrival="226.00" arrivalLane="c2n_1" arrivalPos="990.00" arrivalPosLat="0.00" arrivalSpeed="13.90" duration="151.00" routeLength="1996.47" waitingTime="0.00" waitingCount="0" stopTime="0.00" timeLoss="6.66" rerouteNo="1" devices="tripinfo_car_w2n_75 routing_car_w2n_75" vType="Car" speedFactor="1.00" vaporized=""/>
    <tripinfo id="car_w2s_92" depart="92.00" departLane="w2sep_1" departPos="3.60" departPosLat="0.00" departSpeed="13.90" departDelay="0.00" arrival="228.15" arrivalLane="c2s_1" arrivalPos="990.00" arrivalPosLat="0.00" arrivalSpeed="15.17" duration="136.15" routeLength="1986.69" waitingTime="0.00" waitingCount="0" stopTime="0.00" timeLoss="4.56" rerouteNo="1" devices="tripinfo_car_w2s_92 routing_car_w2s_92" vType="Car" speedFactor="1.09" vaporized=""/>
    <tripinfo id="car_e2n_89" depart="89.00" departLane="e2sep_1" departPos="3.60" departPosLat="0.00" departSpeed="13.90" departDelay="0.00" arrival="234.25" arrivalLane="c2n_1" arrivalPos="990.00" arrivalPosLat="0.00" arrivalSpeed="14.15" duration="145.25" routeLength="1986.69" waitingTime="0.00" waitingCount="0" stopTime="0.00" timeLoss="4.16" rerouteNo="1" devices="tripinfo_car_e2n_89 routing_car_e2n_89" vType="Car" speedFactor="1.02" vaporized=""/>
    <tripinfo id="car_e2w_102" depart="102.00" departLane="e2sep_1" departPos="3.60" departPosLat="0.00" departSpeed="13.90" departDelay="0.00" arrival="234.75" arrivalLane="c2w_1" arrivalPos="990.00" arrivalPosLat="0.00" arrivalSpeed="15.12" duration="132.75" routeLength="1997.01" waitingTime="0.00" waitingCount="0" stopTime="0.00" timeLoss="0.66" rerouteNo="1" devices="tripinfo_car_e2w_102 routing_car_e2w_102" vType="Car" speedFactor="1.09" vaporized=""/>
    <tripinfo id="car_n2w_66" depart="66.00" departLane="n2sep_1" departPos="3.60" departPosLat="0.00" departSpeed="13.90" departDelay="0.00" arrival="246.50" arrivalLane="c2w_1" arrivalPos="990.00" arrivalPosLat="0.00" arrivalSpeed="16.05" duration="180.50" routeLength="1986.69" waitingTime="48.00" waitingCount="1" stopTime="0.00" timeLoss="56.02" rerouteNo="1" devices="tripinfo_car_n2w_66 routing_car_n2w_66" vType="Car" speedFactor="1.15" vaporized=""/>
    <tripinfo id="car_n2w_80" depart="80.00" departLane="n2sep_1" departPos="3.60" departPosLat="0.00" departSpeed="13.90" departDelay="0.00" arrival="250.80" arrivalLane="c2w_1" arrivalPos="990.00" arrivalPosLat="0.00" arrivalSpeed="16.38" duration="170.80" routeLength="1986.69" waitingTime="32.15" waitingCount="1" stopTime="0.00" timeLoss="49.02" rerouteNo="1" devices="tripinfo_car_n2w_80 routing_car_n2w_80" vType="Car" speedFactor="1.18" vaporized=""/>
    <tripinfo id="car_n2w_86" depart="86.00" departLane="n2sep_1" departPos="3.60" departPosLat="0.00" departSpeed="13.90" departDelay="0.00" arrival="255.05" arrivalLane="c2w_1" arrivalPos="990.00" arrivalPosLat="0.00" arrivalSpeed="16.08" duration="169.05" routeLength="1986.69" waitingTime="30.75" waitingCount="1" stopTime="0.00" timeLoss="45.00" rerouteNo="1" devices="tripinfo_car_n2w_86 routing_car_n2w_86" vType="Car" speedFactor="1.16" vaporized=""/>
    <tripinfo id="car_s2n_56" depart="56.00" departLane="s2sep_1" departPos="3.60" departPosLat="0.00" departSpeed="13.90" departDelay="0.00" arrival="255.75" arrivalLane="c2n_1" arrivalPos="990.00" arrivalPosLat="0.00" arrivalSpeed="13.90" duration="199.75" routeLength="1997.01" waitingTime="49.25" waitingCount="1" stopTime="0.00" timeLoss="56.04" rerouteNo="1" devices="tripinfo_car_s2n_56 routing_car_s2n_56" vType="Car" speedFactor="1.00" vaporized=""/>
    <tripinfo id="car_n2s_73" depart="73.00" departLane="n2sep_1" departPos="3.60" departPosLat="0.00" departSpeed="13.90" departDelay="0.00" arrival="257.80" arrivalLane="c2s_1" arrivalPos="990.00" arrivalPosLat="0.00" arrivalSpeed="13.90" duration="184.80" routeLength="1997.01" waitingTime="32.85" waitingCount="1" stopTime="0.00" timeLoss="41.09" rerouteNo="1" devices="tripinfo_car_n2s_73 routing_car_n2s_73" vType="Car" speedFactor="1.00" vaporized=""/>
    <tripinfo id="car_s2e_98" depart="98.00" departLane="s2sep_1" departPos="3.60" departPosLat="0.00" departSpeed="13.90" departDelay="0.00" arrival="259.70" arrivalLane="c2e_1" arrivalPos="990.00" arrivalPosLat="0.00" arrivalSpeed="14.42" duration="161.70" routeLength="1986.69" waitingTime="12.60" waitingCount="1" stopTime="0.00" timeLoss="23.30" rerouteNo="1" devices="tripinfo_car_s2e_98 routing_car_s2e_98" vType="Car" speedFactor="1.04" vaporized=""/>
    <tripinfo id="car_n2s_124" depart="124.00" departLane="n2sep_1" departPos="3.60" departPosLat="0.00" departSpeed="13.90" departDelay="0.00" arrival="259.90" arrivalLane="c2s_1" arrivalPos="990.00" arrivalPosLat="0.00" arrivalSpeed="15.26" duration="135.90" routeLength="1997.01" waitingTime="0.00" waitingCount="0" stopTime="0.00" timeLoss="8.93" rerouteNo="1" devices="tripinfo_car_n2s_124 routing_car_n2s_124" vType="Car" speedFactor="1.13" vaporized=""/>
    <tripinfo id="car_s2n_58" depart="58.00" departLane="s2sep_1" departPos="3.60" departPosLat="0.00" departSpeed="13.90" departDelay="0.00" arrival="260.10" arrivalLane="c2n_1" arrivalPos="990.00" arrivalPosLat="0.00" arrivalSpeed="13.89" duration="202.10" routeLength="1997.01" waitingTime="45.80" waitingCount="1" stopTime="0.00" timeLoss="58.43" rerouteNo="1" devices="tripinfo_car_s2n_58 routing_car_s2n_58" vType="Car" speedFactor="1.00" vaporized=""/>
    <tripinfo id="car_s2e_113" depart="113.00" departLane="s2sep_1" departPos="3.60" departPosLat="0.00" departSpeed="13.90" departDelay="0.00" arrival="261.80" arrivalLane="c2e_1" arrivalPos="990.00" arrivalPosLat="0.00" arrivalSpeed="15.72" duration="148.80" routeLength="1986.69" waitingTime="2.90" waitingCount="1" stopTime="0.00" timeLoss="25.87" rerouteNo="1" devices="tripinfo_car_s2e_113 routing_car_s2e_113" vType="Car" speedFactor="1.17" vaporized=""/>
    <tripinfo id="car_s2n_59" depart="59.65" departLane="s2sep_1" departPos="3.60" departPosLat="0.00" departSpeed="13.90" departDelay="0.65" arrival="261.90" arrivalLane="c2n_1" arrivalPos="990.00" arrivalPosLat="0.00" arrivalSpeed="15.41" duration="202.25" routeLength="1997.01" waitingTime="45.15" waitingCount="1" stopTime="0.00" timeLoss="80.34" rerouteNo="1" devices="tripinfo_car_s2n_59 routing_car_s2n_59" vType="Car" speedFactor="1.18" vaporized=""/>
    <tripinfo id="car_n2s_129" depart="129.00" departLane="n2sep_1" departPos="3.60" departPosLat="0.00" departSpeed="13.90" departDelay="0.00" arrival="262.50" arrivalLane="c2s_1" arrivalPos="990.00" arrivalPosLat="0.00" arrivalSpeed="15.38" duration="133.50" routeLength="1997.01" waitingTime="0.00" waitingCount="0" stopTime="0.00" timeLoss="5.11" rerouteNo="1" devices="tripinfo_car_n2s_129 routing_car_n2s_129" vType="Car" speedFactor="1.12" vaporized=""/>
    <tripinfo id="car_n2s_141" depart="141.00" departLane="n2sep_1" departPos="3.60" departPosLat="0.00" departSpeed="13.90" departDelay="0.00" arrival="265.30" arrivalLane="c2s_1" arrivalPos="990.00" arrivalPosLat="0.00" arrivalSpeed="16.22" duration="124.30" routeLength="1997.01" waitingTime="0.00" waitingCount="0" stopTime="0.00" timeLoss="2.37" rerouteNo="1" devices="tripinfo_car_n2s_141 routing_car_n2s_141" vType="Car" speedFactor="1.18" vaporized=""/>
    <tripinfo id="car_s2n_102" depart="102.00" departLane="s2sep_1" departPos="3.60" departPosLat="0.00" departSpeed="13.90" departDelay="0.00" arrival="265.55" arrivalLane="c2n_1" arrivalPos="990.00" arrivalPosLat="0.00" arrivalSpeed="14.02" duration="163.55" routeLength="1997.01" waitingTime="7.65" waitingCount="1" stopTime="0.00" timeLoss="21.31" rerouteNo="1" devices="tripinfo_car_s2n_102 routing_car_s2n_102" vType="Car" speedFactor="1.01" vaporized=""/>
    <tripinfo id="car_s2n_119" depart="119.00" departLane="s2sep_1" departPos="3.60" departPosLat="0.00" departSpeed="13.90" departDelay="0.00" arrival="269.75" arrivalLane="c2n_1" arrivalPos="990.00" arrivalPosLat="0.00" arrivalSpeed="13.89" duration="150.75" routeLength="1997.01" waitingTime="0.00" waitingCount="0" stopTime="0.00" timeLoss="7.07" rerouteNo="1" devices="tripinfo_car_s2n_119 routing_car_s2n_119" vType="Car" speedFactor="1.00" vaporized=""/>
    <tripinfo id="car_s2w_105" depart="105.00" departLane="s2sep_1" departPos="3.60" departPosLat="0.00" departSpeed="13.90" departDelay="0.00" arrival="270.55" arrivalLane="c2w_1" arrivalPos="990.00" arrivalPosLat="0.00" arrivalSpeed="13.90" duration="165.55" routeLength="1996.47" waitingTime="10.80" waitingCount="1" stopTime="0.00" timeLoss="21.25" rerouteNo="1" devices="tripinfo_car_s2w_105 routing_car_s2w_105" vType="Car" speedFactor="1.00" vaporized=""/>
    <tripinfo id="car_n2e_87" depart="87.25" departLane="n2sep_1" departPos="3.60" departPosLat="0.00" departSpeed="13.90" departDelay="0.25" arrival="271.05" arrivalLane="c2e_1" arrivalPos="990.00" arrivalPosLat="0.00" arrivalSpeed="14.32" duration="183.80" routeLength="1996.47" waitingTime="31.40" waitingCount="2" stopTime="0.00" timeLoss="43.73" rerouteNo="1" devices="tripinfo_car_n2e_87 routing_car_n2e_87" vType="Car" speedFactor="1.03" vaporized=""/>
    <tripinfo id="car_s2n_128" depart="128.00" departLane="s2sep_1" departPos="3.60" departPosLat="0.00" departSpeed="13.90" departDelay="0.00" arrival="272.00" arrivalLane="c2n_1" arrivalPos="990.00" arrivalPosLat="0.00" arrivalSpeed="14.73" duration="144.00" routeLength="1997.01" waitingTime="0.00" waitingCount="0" stopTime="0.00" timeLoss="11.25" rerouteNo="1" devices="tripinfo_car_s2n_128 routing_car_s2n_128" vType="Car" speedFactor="1.08" vaporized=""/>
    <tripinfo id="car_s2e_131" depart="131.00" departLane="s2sep_1" departPos="3.60" departPosLat="0.00" departSpeed="13.90" departDelay="0.00" arrival="277.50" arrivalLane="c2e_1" arrivalPos="990.00" arrivalPosLat="0.00" arrivalSpeed="14.12" duration="146.50" routeLength="1986.69" waitingTime="0.00" waitingCount="0" stopTime="0.00" timeLoss="5.05" rerouteNo="1" devices="tripinfo_car_s2e_131 routing_car_s2e_131" vType="Car" speedFactor="1.02" vaporized=""/>
    <tripinfo id="car_s2n_134" depart="134.00" departLane="s2sep_1" departPos="3.60" departPosLat="0.00" departSpeed="13.90" departDelay="0.00" arrival="280.30" arrivalLane="c2n_1" arrivalPos="990.00" arrivalPosLat="0.00" arrivalSpeed="13.90" duration="146.30" routeLength="1997.01" waitingTime="0.00" waitingCount="0" stopTime="0.00" timeLoss="2.62" rerouteNo="1" devices="tripinfo_car_s2n_134 routing_car_s2n_134" vType="Car" speedFactor="1.00" vaporized=""/>
    <tripinfo id="car_n2e_102" depart="102.00" departLane="n2sep_1" departPos="3.60" departPosLat="0.00" departSpeed="13.90" departDelay="0.00" arrival="281.70" arrivalLane="c2e_1" arrivalPos="990.00" arrivalPosLat="0.00" arrivalSpeed="14.49" duration="179.70" routeLength="1996.47" waitingTime="23.60" waitingCount="3" stopTime="0.00" timeLoss="41.36" rerouteNo="1" devices="tripinfo_car_n2e_102 routing_car_n2e_102" vType="Car" speedFactor="1.04" vaporized=""/>
    <tripinfo id="car_s2w_149" depart="149.00" departLane="s2sep_1" departPos="3.60" departPosLat="0.00" departSpeed="13.90" departDelay="0.00" arrival="285.40" arrivalLane="c2w_1" arrivalPos="990.00" arrivalPosLat="0.00" arrivalSpeed="16.29" duration="136.40" routeLength="1996.47" waitingTime="0.00" waitingCount="0" stopTime="0.00" timeLoss="13.21" rerouteNo="1" devices="tripinfo_car_s2w_149 routing_car_s2w_149" vType="Car" speedFactor="1.17" vaporized=""/>
    <tripinfo id="car_n2e_104" depart="104.00" departLane="n2sep_1" departPos="3.60" departPosLat="0.00" departSpeed="13.90" departDelay="0.00" arrival="287.15" arrivalLane="c2e_1" arrivalPos="990.00" arrivalPosLat="0.00" arrivalSpeed="13.90" duration="183.15" routeLength="1996.47" waitingTime="15.45" waitingCount="3" stopTime="0.00" timeLoss="38.80" rerouteNo="1" devices="tripinfo_car_n2e_104 routing_car_n2e_104" vType="Car" speedFactor="1.00" vaporized=""/>
    <tripinfo id="bus_n2e_118" depart="118.00" departLane="n2sep_1" departPos="12.10" departPosLat="0.00" departSpeed="13.90" departDelay="0.00" arrival="292.30" arrivalLane="c2e_1" arrivalPos="990.00" arrivalPosLat="0.00" arrivalSpeed="13.87" duration="174.30" routeLength="1987.97" waitingTime="11.95" waitingCount="2" stopTime="0.00" timeLoss="30.57" rerouteNo="1" devices="tripinfo_bus_n2e_118 routing_bus_n2e_118" vType="Bus" speedFactor="1.00" vaporized=""/>
    <tripinfo id="car_n2e_147" depart="147.00" departLane="n2sep_1" departPos="3.60" departPosLat="0.00" departSpeed="13.90" departDelay="0.00" arrival="294.75" arrivalLane="c2e_1" arrivalPos="990.00" arrivalPosLat="0.00" arrivalSpeed="15.51" duration="147.75" routeLength="1996.47" waitingTime="0.00" waitingCount="0" stopTime="0.00" timeLoss="22.70" rerouteNo="1" devices="tripinfo_car_n2e_147 routing_car_n2e_147" vType="Car" speedFactor="1.15" vaporized=""/>
    <tripinfo id="car_e2n_117" depart="117.45" departLane="e2sep_1" departPos="3.60" departPosLat="0.00" departSpeed="13.90" departDelay="0.45" arrival="296.95" arrivalLane="c2n_1" arrivalPos="990.00" arrivalPosLat="0.00" arrivalSpeed="15.23" duration="179.50" routeLength="1986.69" waitingTime="33.75" waitingCount="1" stopTime="0.00" timeLoss="48.38" rerouteNo="1" devices="tripinfo_car_e2n_117 routing_car_e2n_117" vType="Car" speedFactor="1.10" vaporized=""/>
    <tripinfo id="car_w2s_110" depart="110.00" departLane="w2sep_1" departPos="3.60" departPosLat="0.00" departSpeed="13.90" departDelay="0.00" arrival="300.65" arrivalLane="c2s_1" arrivalPos="990.00" arrivalPosLat="0.00" arrivalSpeed="13.90" duration="190.65" routeLength="1986.69" waitingTime="40.05" waitingCount="1" stopTime="0.00" timeLoss="46.95" rerouteNo="1" devices="tripinfo_car_w2s_110 routing_car_w2s_110" vType="Car" speedFactor="1.00" vaporized=""/>
    <tripinfo id="car_e2w_106" depart="106.00" departLane="e2sep_1" departPos="3.60" departPosLat="0.00" departSpeed="13.90" departDelay="0.00" arrival="300.80" arrivalLane="c2w_1" arrivalPos="990.00" arrivalPosLat="0.00" arrivalSpeed="13.90" duration="194.80" routeLength="1997.01" waitingTime="43.75" waitingCount="1" stopTime="0.00" timeLoss="51.12" rerouteNo="1" devices="tripinfo_car_e2w_106 routing_car_e2w_106" vType="Car" speedFactor="1.00" vaporized=""/>
    <tripinfo id="car_w2e_119" depart="120.45" departLane="w2sep_1" departPos="3.60" departPosLat="0.00" departSpeed="13.90" departDelay="1.45" arrival="303.15" arrivalLane="c2e_1" arrivalPos="990.00" arrivalPosLat="0.00" arrivalSpeed="13.90" duration="182.70" routeLength="1997.01" waitingTime="27.85" waitingCount="1" stopTime="0.00" timeLoss="38.99" rerouteNo="1" devices="tripinfo_car_w2e_119 routing_car_w2e_119" vType="Car" speedFactor="1.00" vaporized=""/>
    <tripinfo id="car_w2s_122" depart="122.30" departLane="w2sep_1" departPos="3.60" departPosLat="0.00" departSpeed="13.90" departDelay="0.30" arrival="305.00" arrivalLane="c2s_1" arrivalPos="990.00" arrivalPosLat="0.00" arrivalSpeed="14.22" duration="182.70" routeLength="1986.69" waitingTime="26.35" waitingCount="1" stopTime="0.00" timeLoss="42.36" rerouteNo="1" devices="tripinfo_car_w2s_122 routing_car_w2s_122" vType="Car" speedFactor="1.02" vaporized=""/>
    <tripinfo id="bus_e2n_125" depart="125.00" departLane="e2sep_1" departPos="12.10" departPosLat="0.00" departSpeed="13.90" departDelay="0.00" arrival="308.65" arrivalLane="c2n_1" arrivalPos="990.00" arrivalPosLat="0.00" arrivalSpeed="13.90" duration="183.65" routeLength="1978.19" waitingTime="27.70" waitingCount="1" stopTime="0.00" timeLoss="40.60" rerouteNo="1" devices="tripinfo_bus_e2n_125 routing_bus_e2n_125" vType="Bus" speedFactor="1.00" vaporized=""/>
    <tripinfo id="car_e2s_116" depart="116.00" departLane="e2sep_1" departPos="3.60" departPosLat="0.00" departSpeed="13.90" departDelay="0.00" arrival="309.25" arrivalLane="c2s_1" arrivalPos="990.00" arrivalPosLat="0.00" arrivalSpeed="14.12" duration="193.25" routeLength="1996.47" waitingTime="38.45" waitingCount="2" stopTime="0.00" timeLoss="51.29" rerouteNo="1" devices="tripinfo_car_e2s_116 routing_car_e2s_116" vType="Car" speedFactor="1.02" vaporized=""/>
    <tripinfo id="car_e2w_173" depart="173.00" departLane="e2sep_1" departPos="3.60" departPosLat="0.00" departSpeed="13.90" departDelay="0.00" arrival="309.85" arrivalLane="c2w_1" arrivalPos="990.00" arrivalPosLat="0.00" arrivalSpeed="14.67" duration="136.85" routeLength="1997.01" waitingTime="0.00" waitingCount="0" stopTime="0.00" timeLoss="0.76" rerouteNo="1" devices="tripinfo_car_e2w_173 routing_car_e2w_173" vType="Car" speedFactor="1.06" vaporized=""/>
    <tripinfo id="car_e2s_120" depart="120.00" departLane="e2sep_1" departPos="3.60" departPosLat="0.00" departSpeed="13.90" departDelay="0.00" arrival="311.20" arrivalLane="c2s_1" arrivalPos="990.00" arrivalPosLat="0.00" arrivalSpeed="15.28" duration="191.20" routeLength="1996.47" waitingTime="34.45" waitingCount="2" stopTime="0.00" timeLoss="64.90" rerouteNo="1" devices="tripinfo_car_e2s_120 routing_car_e2s_120" vType="Car" speedFactor="1.14" vaporized=""/>
    <tripinfo id="car_e2s_176" depart="176.00" departLane="e2sep_1" departPos="3.60" departPosLat="0.00" departSpeed="13.90" departDelay="0.00" arrival="313.10" arrivalLane="c2s_1" arrivalPos="990.00" arrivalPosLat="0.00" arrivalSpeed="15.67" duration="137.10" routeLength="1996.47" waitingTime="0.00" waitingCount="0" stopTime="0.00" timeLoss="14.75" rerouteNo="1" devices="tripinfo_car_e2s_176 routing_car_e2s_176" vType="Car" speedFactor="1.18" vaporized=""/>
    <tripinfo id="car_w2n_119" depart="119.00" departLane="w2sep_1" departPos="3.60" departPosLat="0.00" departSpeed="13.90" departDelay="0.00" arrival="316.95" arrivalLane="c2n_1" arrivalPos="990.00" arrivalPosLat="0.00" arrivalSpeed="13.94" duration="197.95" routeLength="1996.47" waitingTime="42.65" waitingCount="3" stopTime="0.00" timeLoss="54.08" rerouteNo="1" devices="tripinfo_car_w2n_119 routing_car_w2n_119" vType="Car" speedFactor="1.00" vaporized=""/>
    <tripinfo id="car_w2n_173" depart="173.00" departLane="w2sep_1" departPos="3.60" departPosLat="0.00" departSpeed="13.90" departDelay="0.00" arrival="320.65" arrivalLane="c2n_1" arrivalPos="990.00" arrivalPosLat="0.00" arrivalSpeed="14.15" duration="147.65" routeLength="1996.47" waitingTime="0.00" waitingCount="0" stopTime="0.00" timeLoss="6.10" rerouteNo="1" devices="tripinfo_car_w2n_173 routing_car_w2n_173" vType="Car" speedFactor="1.02" vaporized=""/>
    <tripinfo id="car_e2n_187" depart="187.00" departLane="e2sep_1" departPos="3.60" departPosLat="0.00" departSpeed="13.90" departDelay="0.00" arrival="322.60" arrivalLane="c2n_1" arrivalPos="990.00" arrivalPosLat="0.00" arrivalSpeed="15.31" duration="135.60" routeLength="1986.69" waitingTime="0.00" waitingCount="0" stopTime="0.00" timeLoss="10.42" rerouteNo="1" devices="tripinfo_car_e2n_187 routing_car_e2n_187" vType="Car" speedFactor="1.15" vaporized=""/>
    <tripinfo id="car_w2n_175" depart="175.00" departLane="w2sep_1" departPos="3.60" departPosLat="0.00" departSpeed="13.90" departDelay="0.00" arrival="328.70" arrivalLane="c2n_1" arrivalPos="990.00" arrivalPosLat="0.00" arrivalSpeed="13.90" duration="153.70" routeLength="1996.47" waitingTime="0.00" waitingCount="0" stopTime="0.00" timeLoss="9.37" rerouteNo="1" devices="tripinfo_car_w2n_175 routing_car_w2n_175" vType="Car" speedFactor="1.00" vaporized=""/>
    <tripinfo id="car_w2n_179" depart="179.00" departLane="w2sep_1" departPos="3.60" departPosLat="0.00" departSpeed="13.90" departDelay="0.00" arrival="332.45" arrivalLane="c2n_1" arrivalPos="990.00" arrivalPosLat="0.00" arrivalSpeed="13.98" duration="153.45" routeLength="1996.47" waitingTime="0.00" waitingCount="0" stopTime="0.00" timeLoss="10.16" rerouteNo="1" devices="tripinfo_car_w2n_179 routing_car_w2n_179" vType="Car" speedFactor="1.01" vaporized=""/>
    <tripinfo id="car_w2n_182" depart="182.00" departLane="w2sep_1" departPos="3.60" departPosLat="0.00" departSpeed="13.90" departDelay="0.00" arrival="335.95" arrivalLane="c2n_1" arrivalPos="990.00" arrivalPosLat="0.00" arrivalSpeed="13.87" duration="153.95" routeLength="1996.47" waitingTime="0.00" waitingCount="0" stopTime="0.00" timeLoss="9.61" rerouteNo="1" devices="tripinfo_car_w2n_182 routing_car_w2n_182" vType="Car" speedFactor="1.00" vaporized=""/>
    <tripinfo id="car_n2s_150" depart="150.00" departLane="n2sep_1" departPos="3.60" departPosLat="0.00" departSpeed="13.90" departDelay="0.00" arrival="343.05" arrivalLane="c2s_1" arrivalPos="990.00" arrivalPosLat="0.00" arrivalSpeed="14.46" duration="193.05" routeLength="1997.01" waitingTime="47.45" waitingCount="1" stopTime="0.00" timeLoss="54.87" rerouteNo="1" devices="tripinfo_car_n2s_150 routing_car_n2s_150" vType="Car" speedFactor="1.04" vaporized=""/>
    <tripinfo id="car_s2e_147" depart="147.00" departLane="s2sep_1" departPos="3.60" departPosLat="0.00" departSpeed="13.90" departDelay="0.00" arrival="345.25" arrivalLane="c2e_1" arrivalPos="990.00" arrivalPosLat="0.00" arrivalSpeed="13.97" duration="198.25" routeLength="1986.69" waitingTime="48.45" waitingCount="1" stopTime="0.00" timeLoss="55.33" rerouteNo="1" devices="tripinfo_car_s2e_147 routing_car_s2e_147" vType="Car" speedFactor="1.01" vaporized=""/>
    <tripinfo id="car_s2n_156" depart="156.00" departLane="s2sep_1" departPos="3.60" departPosLat="0.00" departSpeed="13.90" departDelay="0.00" arrival="346.45" arrivalLane="c2n_1" arrivalPos="990.00" arrivalPosLat="0.00" arrivalSpeed="14.21" duration="190.45" routeLength="1997.01" waitingTime="41.00" waitingCount="1" stopTime="0.00" timeLoss="49.88" rerouteNo="1" devices="tripinfo_car_s2n_156 routing_car_s2n_156" vType="Car" speedFactor="1.02" vaporized=""/>
    <tripinfo id="car_n2w_179" depart="179.00" departLane="n2sep_1" departPos="3.60" departPosLat="0.00" departSpeed="13.90" departDelay="0.00" arrival="346.70" arrivalLane="c2w_1" arrivalPos="990.00" arrivalPosLat="0.00" arrivalSpeed="15.11" duration="167.70" routeLength="1986.69" waitingTime="20.70" waitingCount="1" stopTime="0.00" timeLoss="35.51" rerouteNo="1" devices="tripinfo_car_n2w_179 routing_car_n2w_179" vType="Car" speedFactor="1.09" vaporized=""/>
    <tripinfo id="car_n2s_157" depart="157.00" departLane="n2sep_1" departPos="3.60" departPosLat="0.00" departSpeed="13.90" departDelay="0.00" arrival="348.05" arrivalLane="c2s_1" arrivalPos="990.00" arrivalPosLat="0.00" arrivalSpeed="14.22" duration="191.05" routeLength="1997.01" waitingTime="40.15" waitingCount="1" stopTime="0.00" timeLoss="50.60" rerouteNo="1" devices="tripinfo_car_n2s_157 routing_car_n2s_157" vType="Car" speedFactor="1.02" vaporized=""/>
    <tripinfo id="car_s2n_178" depart="178.00" departLane="s2sep_1" departPos="3.60" departPosLat="0.00" departSpeed="13.90" departDelay="0.00" arrival="348.90" arrivalLane="c2n_1" arrivalPos="990.00" arrivalPosLat="0.00" arrivalSpeed="15.09" duration="170.90" routeLength="1997.01" waitingTime="25.15" waitingCount="1" stopTime="0.00" timeLoss="40.53" rerouteNo="1" devices="tripinfo_car_s2n_178 routing_car_s2n_178" vType="Car" speedFactor="1.10" vaporized=""/>
    <tripinfo id="car_n2s_163" depart="163.00" departLane="n2sep_1" departPos="3.60" departPosLat="0.00" departSpeed="13.90" departDelay="0.00" arrival="352.50" arrivalLane="c2s_1" arrivalPos="990.00" arrivalPosLat="0.00" arrivalSpeed="13.89" duration="189.50" routeLength="1997.01" waitingTime="33.75" waitingCount="1" stopTime="0.00" timeLoss="45.84" rerouteNo="1" devices="tripinfo_car_n2s_163 routing_car_n2s_163" vType="Car" speedFactor="1.00" vaporized=""/>
    <tripinfo id="car_s2n_186" depart="186.00" departLane="s2sep_1" departPos="3.60" departPosLat="0.00" departSpeed="13.90" departDelay="0.00" arrival="353.25" arrivalLane="c2n_1" arrivalPos="990.00" arrivalPosLat="0.00" arrivalSpeed="14.13" duration="167.25" routeLength="1997.01" waitingTime="13.00" waitingCount="1" stopTime="0.00" timeLoss="25.95" rerouteNo="1" devices="tripinfo_car_s2n_186 routing_car_s2n_186" vType="Car" speedFactor="1.02" vaporized=""/>
    <tripinfo id="car_n2w_190" depart="190.00" departLane="n2sep_1" departPos="3.60" departPosLat="0.00" departSpeed="13.90" departDelay="0.00" arrival="355.40" arrivalLane="c2w_1" arrivalPos="990.00" arrivalPosLat="0.00" arrivalSpeed="13.90" duration="165.40" routeLength="1986.69" waitingTime="9.45" waitingCount="1" stopTime="0.00" timeLoss="21.71" rerouteNo="1" devices="tripinfo_car_n2w_190 routing_car_n2w_190" vType="Car" speedFactor="1.00" vaporized=""/>
    <tripinfo id="car_n2s_195" depart="195.00" departLane="n2sep_1" departPos="3.60" departPosLat="0.00" departSpeed="13.90" departDelay="0.00" arrival="355.60" arrivalLane="c2s_1" arrivalPos="990.00" arrivalPosLat="0.00" arrivalSpeed="14.42" duration="160.60" routeLength="1997.01" waitingTime="7.50" waitingCount="1" stopTime="0.00" timeLoss="22.81" rerouteNo="1" devices="tripinfo_car_n2s_195 routing_car_n2s_195" vType="Car" speedFactor="1.04" vaporized=""/>
    <tripinfo id="car_s2e_206" depart="206.00" departLane="s2sep_1" departPos="3.60" departPosLat="0.00" departSpeed="13.90" departDelay="0.00" arrival="355.65" arrivalLane="c2e_1" arrivalPos="990.00" arrivalPosLat="0.00" arrivalSpeed="14.50" duration="149.65" routeLength="1986.69" waitingTime="0.00" waitingCount="0" stopTime="0.00" timeLoss="11.98" rerouteNo="1" devices="tripinfo_car_s2e_206 routing_car_s2e_206" vType="Car" speedFactor="1.04" vaporized=""/>
    <tripinfo id="car_s2n_197" depart="197.00" departLane="s2sep_1" departPos="3.60" departPosLat="0.00" departSpeed="13.90" departDelay="0.00" arrival="357.00" arrivalLane="c2n_1" arrivalPos="990.00" arrivalPosLat="0.00" arrivalSpeed="13.98" duration="160.00" routeLength="1997.01" waitingTime="2.95" waitingCount="1" stopTime="0.00" timeLoss="17.30" rerouteNo="1" devices="tripinfo_car_s2n_197 routing_car_s2n_197" vType="Car" speedFactor="1.01" vaporized=""/>
    <tripinfo id="car_s2w_179" depart="179.30" departLane="s2sep_1" departPos="3.60" departPosLat="0.00" departSpeed="13.90" departDelay="0.30" arrival="358.95" arrivalLane="c2w_1" arrivalPos="990.00" arrivalPosLat="0.00" arrivalSpeed="14.34" duration="179.65" routeLength="1996.47" waitingTime="25.70" waitingCount="2" stopTime="0.00" timeLoss="40.14" rerouteNo="1" devices="tripinfo_car_s2w_179 routing_car_s2w_179" vType="Car" speedFactor="1.03" vaporized=""/>
    <tripinfo id="car_s2n_199" depart="199.00" departLane="s2sep_1" departPos="3.60" departPosLat="0.00" departSpeed="13.90" departDelay="0.00" arrival="359.90" arrivalLane="c2n_1" arrivalPos="990.00" arrivalPosLat="0.00" arrivalSpeed="14.12" duration="160.90" routeLength="1997.01" waitingTime="0.80" waitingCount="1" stopTime="0.00" timeLoss="20.31" rerouteNo="1" devices="tripinfo_car_s2n_199 routing_car_s2n_199" vType="Car" speedFactor="1.02" vaporized=""/>
    <tripinfo id="car_s2n_221" depart="221.00" departLane="s2sep_1" departPos="3.60" departPosLat="0.00" departSpeed="13.90" departDelay="0.00" arrival="362.20" arrivalLane="c2n_1" arrivalPos="990.00" arrivalPosLat="0.00" arrivalSpeed="14.55" duration="141.20" routeLength="1997.01" waitingTime="0.00" waitingCount="0" stopTime="0.00" timeLoss="6.30" rerouteNo="1" devices="tripinfo_car_s2n_221 routing_car_s2n_221" vType="Car" speedFactor="1.07" vaporized=""/>
    <tripinfo id="car_n2e_177" depart="177.00" departLane="n2sep_1" departPos="3.60" departPosLat="0.00" departSpeed="13.90" departDelay="0.00" arrival="362.90" arrivalLane="c2e_1" arrivalPos="990.00" arrivalPosLat="0.00" arrivalSpeed="14.35" duration="185.90" routeLength="1996.47" waitingTime="34.45" waitingCount="2" stopTime="0.00" timeLoss="46.09" rerouteNo="1" devices="tripinfo_car_n2e_177 routing_car_n2e_177" vType="Car" speedFactor="1.03" vaporized=""/>
    <tripinfo id="car_n2w_227" depart="227.00" departLane="n2sep_1" departPos="3.60" departPosLat="0.00" departSpeed="13.90" departDelay="0.00" arrival="367.15" arrivalLane="c2w_1" arrivalPos="990.00" arrivalPosLat="0.00" arrivalSpeed="14.91" duration="140.15" routeLength="1986.69" waitingTime="0.00" waitingCount="0" stopTime="0.00" timeLoss="6.24" rerouteNo="1" devices="tripinfo_car_n2w_227 routing_car_n2w_227" vType="Car" speedFactor="1.07" vaporized=""/>
    <tripinfo id="car_n2e_222" depart="222.00" departLane="n2sep_1" departPos="3.60" departPosLat="0.00" departSpeed="13.90" departDelay="0.00" arrival="370.15" arrivalLane="c2e_1" arrivalPos="990.00" arrivalPosLat="0.00" arrivalSpeed="13.90" duration="148.15" routeLength="1996.47" waitingTime="0.00" waitingCount="0" stopTime="0.00" timeLoss="3.81" rerouteNo="1" devices="tripinfo_car_n2e_222 routing_car_n2e_222" vType="Car" speedFactor="1.00" vaporized=""/>
    <tripinfo id="car_s2n_224" depart="225.50" departLane="s2sep_1" departPos="3.60" departPosLat="0.00" departSpeed="13.90" departDelay="1.50" arrival="372.70" arrivalLane="c2n_1" arrivalPos="990.00" arrivalPosLat="0.00" arrivalSpeed="13.90" duration="147.20" routeLength="1997.01" waitingTime="0.00" waitingCount="0" stopTime="0.00" timeLoss="3.51" rerouteNo="1" devices="tripinfo_car_s2n_224 routing_car_s2n_224" vType="Car" speedFactor="1.00" vaporized=""/>
    <tripinfo id="car_n2w_230" depart="230.00" departLane="n2sep_1" departPos="3.60" departPosLat="0.00" departSpeed="13.90" departDelay="0.00" arrival="374.55" arrivalLane="c2w_1" arrivalPos="990.00" arrivalPosLat="0.00" arrivalSpeed="14.38" duration="144.55" routeLength="1986.69" waitingTime="0.00" waitingCount="0" stopTime="0.00" timeLoss="5.67" rerouteNo="1" devices="tripinfo_car_n2w_230 routing_car_n2w_230" vType="Car" speedFactor="1.03" vaporized=""/>
    <tripinfo id="car_n2e_238" depart="238.00" departLane="n2sep_1" departPos="3.60" departPosLat="0.00" departSpeed="13.90" departDelay="0.00" arrival="377.95" arrivalLane="c2e_1" arrivalPos="990.00" arrivalPosLat="0.00" arrivalSpeed="14.80" duration="139.95" routeLength="1996.47" waitingTime="0.00" waitingCount="0" stopTime="0.00" timeLoss="4.40" rerouteNo="1" devices="tripinfo_car_n2e_238 routing_car_n2e_238" vType="Car" speedFactor="1.06" vaporized=""/>
    <tripinfo id="car_s2w_224" depart="224.00" departLane="s2sep_1" departPos="3.60" departPosLat="0.00" departSpeed="13.90" departDelay="0.00" arrival="380.25" arrivalLane="c2w_1" arrivalPos="990.00" arrivalPosLat="0.00" arrivalSpeed="13.90" duration="156.25" routeLength="1996.47" waitingTime="2.60" waitingCount="2" stopTime="0.00" timeLoss="11.93" rerouteNo="1" devices="tripinfo_car_s2w_224 routing_car_s2w_224" vType="Car" speedFactor="1.00" vaporized=""/>
    <tripinfo id="car_s2w_244" depart="244.00" departLane="s2sep_1" departPos="3.60" departPosLat="0.00" departSpeed="13.90" departDelay="0.00" arrival="383.20" arrivalLane="c2w_1" arrivalPos="990.00" arrivalPosLat="0.00" arrivalSpeed="15.16" duration="139.20" routeLength="1996.47" waitingTime="0.00" waitingCount="0" stopTime="0.00" timeLoss="7.80" rerouteNo="1" devices="tripinfo_car_s2w_244 routing_car_s2w_244" vType="Car" speedFactor="1.10" vaporized=""/>
    <tripinfo id="car_w2s_187" depart="187.00" departLane="w2sep_1" departPos="3.60" departPosLat="0.00" departSpeed="13.90" departDelay="0.00" arrival="388.55" arrivalLane="c2s_1" arrivalPos="990.00" arrivalPosLat="0.00" arrivalSpeed="14.32" duration="201.55" routeLength="1986.69" waitingTime="53.15" waitingCount="1" stopTime="0.00" timeLoss="62.14" rerouteNo="1" devices="tripinfo_car_w2s_187 routing_car_w2s_187" vType="Car" speedFactor="1.03" vaporized=""/>
    <tripinfo id="car_e2w_190" depart="190.00" departLane="e2sep_1" departPos="3.60" departPosLat="0.00" departSpeed="13.90" departDelay="0.00" arrival="391.35" arrivalLane="c2w_1" arrivalPos="990.00" arrivalPosLat="0.00" arrivalSpeed="13.92" duration="201.35" routeLength="1997.01" waitingTime="50.30" waitingCount="1" stopTime="0.00" timeLoss="57.92" rerouteNo="1" devices="tripinfo_car_e2w_190 routing_car_e2w_190" vType="Car" speedFactor="1.00" vaporized=""/>
    <tripinfo id="car_e2n_213" depart="213.00" departLane="e2sep_1" departPos="3.60" departPosLat="0.00" departSpeed="13.90" departDelay="0.00" arrival="391.60" arrivalLane="c2n_1" arrivalPos="990.00" arrivalPosLat="0.00" arrivalSpeed="14.69" duration="178.60" routeLength="1986.69" waitingTime="32.45" waitingCount="1" stopTime="0.00" timeLoss="42.65" rerouteNo="1" devices="tripinfo_car_e2n_213 routing_car_e2n_213" vType="Car" speedFactor="1.06" vaporized=""/>
    <tripinfo id="car_w2s_200" depart="200.00" departLane="w2sep_1" departPos="3.60" departPosLat="0.00" departSpeed="13.90" departDelay="0.00" arrival="393.65" arrivalLane="c2s_1" arrivalPos="990.00" arrivalPosLat="0.00" arrivalSpeed="14.13" duration="193.65" routeLength="1986.69" waitingTime="42.00" waitingCount="1" stopTime="0.00" timeLoss="52.34" rerouteNo="1" devices="tripinfo_car_w2s_200 routing_car_w2s_200" vType="Car" speedFactor="1.02" vaporized=""/>
    <tripinfo id="car_e2w_200" depart="200.00" departLane="e2sep_1" departPos="3.60" departPosLat="0.00" departSpeed="13.90" departDelay="0.00" arrival="393.65" arrivalLane="c2w_1" arrivalPos="990.00" arrivalPosLat="0.00" arrivalSpeed="14.89" duration="193.65" routeLength="1997.01" waitingTime="46.30" waitingCount="1" stopTime="0.00" timeLoss="62.06" rerouteNo="1" devices="tripinfo_car_e2w_200 routing_car_e2w_200" vType="Car" speedFactor="1.09" vaporized=""/>
    <tripinfo id="car_e2n_253" depart="253.00" departLane="e2sep_1" departPos="3.60" departPosLat="0.00" departSpeed="13.90" departDelay="0.00" arrival="396.30" arrivalLane="c2n_1" arrivalPos="990.00" arrivalPosLat="0.00" arrivalSpeed="15.23" duration="143.30" routeLength="1986.69" waitingTime="0.00" waitingCount="0" stopTime="0.00" timeLoss="12.27" rerouteNo="1" devices="tripinfo_car_e2n_253 routing_car_e2n_253" vType="Car" speedFactor="1.10" vaporized=""/>
    <tripinfo id="car_w2e_214" depart="214.00" departLane="w2sep_1" departPos="3.60" departPosLat="0.00" departSpeed="13.90" departDelay="0.00" arrival="396.80" arrivalLane="c2e_1" arrivalPos="990.00" arrivalPosLat="0.00" arrivalSpeed="14.04" duration="182.80" routeLength="1997.01" waitingTime="29.85" waitingCount="1" stopTime="0.00" timeLoss="40.53" rerouteNo="1" devices="tripinfo_car_w2e_214 routing_car_w2e_214" vType="Car" speedFactor="1.01" vaporized=""/>
    <tripinfo id="car_w2s_204" depart="204.00" departLane="w2sep_1" departPos="3.60" departPosLat="0.00" departSpeed="13.90" departDelay="0.00" arrival="396.85" arrivalLane="c2s_1" arrivalPos="990.00" arrivalPosLat="0.00" arrivalSpeed="14.37" duration="192.85" routeLength="1986.69" waitingTime="39.40" waitingCount="1" stopTime="0.00" timeLoss="54.40" rerouteNo="1" devices="tripinfo_car_w2s_204 routing_car_w2s_204" vType="Car" speedFactor="1.04" vaporized=""/>
    <tripinfo id="car_e2w_225" depart="225.00" departLane="e2sep_1" departPos="3.60" departPosLat="0.00" departSpeed="13.90" departDelay="0.00" arrival="398.50" arrivalLane="c2w_1" arrivalPos="990.00" arrivalPosLat="0.00" arrivalSpeed="13.90" duration="173.50" routeLength="1997.01" waitingTime="18.30" waitingCount="1" stopTime="0.00" timeLoss="29.80" rerouteNo="1" devices="tripinfo_car_e2w_225 routing_car_e2w_225" vType="Car" speedFactor="1.00" vaporized=""/>
    <tripinfo id="car_w2s_217" depart="217.00" departLane="w2sep_1" departPos="3.60" departPosLat="0.00" departSpeed="13.90" departDelay="0.00" arrival="399.20" arrivalLane="c2s_1" arrivalPos="990.00" arrivalPosLat="0.00" arrivalSpeed="14.88" duration="182.20" routeLength="1986.69" waitingTime="28.95" waitingCount="1" stopTime="0.00" timeLoss="50.14" rerouteNo="1" devices="tripinfo_car_w2s_217 routing_car_w2s_217" vType="Car" speedFactor="1.09" vaporized=""/>
    <tripinfo id="car_w2s_221" depart="221.35" departLane="w2sep_1" departPos="3.60" departPosLat="0.00" departSpeed="13.90" departDelay="0.35" arrival="401.50" arrivalLane="c2s_1" arrivalPos="990.00" arrivalPosLat="0.00" arrivalSpeed="14.99" duration="180.15" routeLength="1986.69" waitingTime="25.75" waitingCount="1" stopTime="0.00" timeLoss="49.21" rerouteNo="1" devices="tripinfo_car_w2s_221 routing_car_w2s_221" vType="Car" speedFactor="1.10" vaporized=""/>
    <tripinfo id="car_e2w_243" depart="243.00" departLane="e2sep_1" departPos="3.60" departPosLat="0.00" departSpeed="13.90" departDelay="0.00" arrival="401.75" arrivalLane="c2w_1" arrivalPos="990.00" arrivalPosLat="0.00" arrivalSpeed="14.08" duration="158.75" routeLength="1997.01" waitingTime="2.65" waitingCount="1" stopTime="0.00" timeLoss="17.43" rerouteNo="1" devices="tripinfo_car_e2w_243 routing_car_e2w_243" vType="Car" speedFactor="1.02" vaporized=""/>
    <tripinfo id="car_w2s_254" depart="254.00" departLane="w2sep_1" departPos="3.60" departPosLat="0.00" departSpeed="13.90" departDelay="0.00" arrival="403.90" arrivalLane="c2s_1" arrivalPos="990.00" arrivalPosLat="0.00" arrivalSpeed="15.00" duration="149.90" routeLength="1986.69" waitingTime="0.00" waitingCount="0" stopTime="0.00" timeLoss="18.77" rerouteNo="1" devices="tripinfo_car_w2s_254 routing_car_w2s_254" vType="Car" speedFactor="1.10" vaporized=""/>
    <tripinfo id="amb_w2e_300" depart="300.00" departLane="w2sep_1" departPos="6.60" departPosLat="0.00" departSpeed="13.90" departDelay="0.00" arrival="404.05" arrivalLane="c2e_1" arrivalPos="990.00" arrivalPosLat="-0.95" arrivalSpeed="20.84" duration="104.05" routeLength="1994.01" waitingTime="0.00" waitingCount="0" stopTime="0.00" timeLoss="8.37" rerouteNo="1" devices="tripinfo_amb_w2e_300 routing_amb_w2e_300 bluelight_amb_w2e_300 fcd_amb_w2e_300" vType="Ambulance" speedFactor="1.50" vaporized="">
        <example_device customValue1="0.00" customValue2="-1.00"/>
    </tripinfo>
    <tripinfo id="car_e2n_262" depart="262.00" departLane="e2sep_1" departPos="3.60" departPosLat="0.00" departSpeed="13.90" departDelay="0.00" arrival="405.60" arrivalLane="c2n_1" arrivalPos="990.00" arrivalPosLat="0.00" arrivalSpeed="14.34" duration="143.60" routeLength="1986.69" waitingTime="0.00" waitingCount="0" stopTime="0.00" timeLoss="4.32" rerouteNo="1" devices="tripinfo_car_e2n_262 routing_car_e2n_262" vType="Car" speedFactor="1.03" vaporized=""/>
    <tripinfo id="car_e2s_207" depart="207.00" departLane="e2sep_1" departPos="3.60" departPosLat="0.00" departSpeed="13.90" departDelay="0.00" arrival="406.35" arrivalLane="c2s_1" arrivalPos="990.00" arrivalPosLat="0.00" arrivalSpeed="14.97" duration="199.35" routeLength="1996.47" waitingTime="51.20" waitingCount="2" stopTime="0.00" timeLoss="67.08" rerouteNo="1" devices="tripinfo_car_e2s_207 routing_car_e2s_207" vType="Car" speedFactor="1.09" vaporized=""/>
    <tripinfo id="car_w2n_220" depart="220.00" departLane="w2sep_1" departPos="3.60" departPosLat="0.00" departSpeed="13.90" departDelay="0.00" arrival="407.95" arrivalLane="c2n_1" arrivalPos="990.00" arrivalPosLat="0.00" arrivalSpeed="15.31" duration="187.95" routeLength="1996.47" waitingTime="37.60" waitingCount="2" stopTime="0.00" timeLoss="59.27" rerouteNo="1" devices="tripinfo_car_w2n_220 routing_car_w2n_220" vType="Car" speedFactor="1.12" vaporized=""/>
    <tripinfo id="car_w2s_280" depart="280.00" departLane="w2sep_1" departPos="3.60" departPosLat="0.00" departSpeed="13.90" departDelay="0.00" arrival="422.95" arrivalLane="c2s_1" arrivalPos="990.00" arrivalPosLat="0.00" arrivalSpeed="14.35" duration="142.95" routeLength="1986.69" waitingTime="0.00" waitingCount="0" stopTime="0.00" timeLoss="3.74" rerouteNo="1" devices="tripinfo_car_w2s_280 routing_car_w2s_280" vType="Car" speedFactor="1.03" vaporized=""/>
    <tripinfo id="car_e2w_299" depart="299.00" departLane="e2sep_1" departPos="3.60" departPosLat="0.00" departSpeed="13.90" departDelay="0.00" arrival="428.25" arrivalLane="c2w_1" arrivalPos="990.00" arrivalPosLat="0.00" arrivalSpeed="15.56" duration="129.25" routeLength="1997.01" waitingTime="0.00" waitingCount="0" stopTime="0.00" timeLoss="0.90" rerouteNo="1" devices="tripinfo_car_e2w_299 routing_car_e2w_299" vType="Car" speedFactor="1.12" vaporized=""/>
    <tripinfo id="car_e2s_278" depart="278.00" departLane="e2sep_1" departPos="3.60" departPosLat="0.00" departSpeed="13.90" departDelay="0.00" arrival="434.60" arrivalLane="c2s_1" arrivalPos="990.00" arrivalPosLat="0.00" arrivalSpeed="14.02" duration="156.60" routeLength="1996.47" waitingTime="6.05" waitingCount="1" stopTime="0.00" timeLoss="13.46" rerouteNo="1" devices="tripinfo_car_e2s_278 routing_car_e2s_278" vType="Car" speedFactor="1.01" vaporized=""/>
    <tripinfo id="car_e2s_295" depart="295.00" departLane="e2sep_1" departPos="3.60" departPosLat="0.00" departSpeed="13.90" departDelay="0.00" arrival="436.35" arrivalLane="c2s_1" arrivalPos="990.00" arrivalPosLat="0.00" arrivalSpeed="15.81" duration="141.35" routeLength="1996.47" waitingTime="1.30" waitingCount="1" stopTime="0.00" timeLoss="23.60" rerouteNo="1" devices="tripinfo_car_e2s_295 routing_car_e2s_295" vType="Car" speedFactor="1.23" vaporized=""/>
    <tripinfo id="car_e2s_299" depart="300.30" departLane="e2sep_1" departPos="3.60" departPosLat="0.00" departSpeed="13.90" departDelay="1.30" arrival="447.25" arrivalLane="c2s_1" arrivalPos="990.00" arrivalPosLat="0.00" arrivalSpeed="14.11" duration="146.95" routeLength="1996.47" waitingTime="0.00" waitingCount="0" stopTime="0.00" timeLoss="4.77" rerouteNo="1" devices="tripinfo_car_e2s_299 routing_car_e2s_299" vType="Car" speedFactor="1.02" vaporized=""/>
    <tripinfo id="car_n2s_240" depart="240.00" departLane="n2sep_1" departPos="3.60" departPosLat="0.00" departSpeed="13.90" departDelay="0.00" arrival="449.15" arrivalLane="c2s_1" arrivalPos="990.00" arrivalPosLat="0.00" arrivalSpeed="15.53" duration="209.15" routeLength="1997.01" waitingTime="64.25" waitingCount="1" stopTime="0.00" timeLoss="86.24" rerouteNo="1" devices="tripinfo_car_n2s_240 routing_car_n2s_240" vType="Car" speedFactor="1.17" vaporized=""/>
    <tripinfo id="car_s2e_228" depart="228.00" departLane="s2sep_1" departPos="3.60" departPosLat="0.00" departSpeed="13.90" departDelay="0.00" arrival="449.90" arrivalLane="c2e_1" arrivalPos="990.00" arrivalPosLat="0.00" arrivalSpeed="14.09" duration="221.90" routeLength="1986.69" waitingTime="68.80" waitingCount="1" stopTime="0.00" timeLoss="80.22" rerouteNo="1" devices="tripinfo_car_s2e_228 routing_car_s2e_228" vType="Car" speedFactor="1.01" vaporized=""/>
    <tripinfo id="car_n2s_256" depart="256.00" departLane="n2sep_1" departPos="3.60" departPosLat="0.00" departSpeed="13.90" departDelay="0.00" arrival="451.10" arrivalLane="c2s_1" arrivalPos="990.00" arrivalPosLat="0.00" arrivalSpeed="15.73" duration="195.10" routeLength="1997.01" waitingTime="55.15" waitingCount="1" stopTime="0.00" timeLoss="73.05" rerouteNo="1" devices="tripinfo_car_n2s_256 routing_car_n2s_256" vType="Car" speedFactor="1.18" vaporized=""/>
    <tripinfo id="car_s2n_238" depart="238.00" departLane="s2sep_1" departPos="3.60" departPosLat="0.00" departSpeed="13.90" departDelay="0.00" arrival="453.05" arrivalLane="c2n_1" arrivalPos="990.00" arrivalPosLat="0.00" arrivalSpeed="13.90" duration="215.05" routeLength="1997.01" waitingTime="63.00" waitingCount="1" stopTime="0.00" timeLoss="71.36" rerouteNo="1" devices="tripinfo_car_s2n_238 routing_car_s2n_238" vType="Car" speedFactor="1.00" vaporized=""/>
    <tripinfo id="car_n2w_257" depart="257.25" departLane="n2sep_1" departPos="3.60" departPosLat="0.00" departSpeed="13.90" departDelay="0.25" arrival="455.25" arrivalLane="c2w_1" arrivalPos="990.00" arrivalPosLat="0.00" arrivalSpeed="13.96" duration="198.00" routeLength="1986.69" waitingTime="44.75" waitingCount="1" stopTime="0.00" timeLoss="54.92" rerouteNo="1" devices="tripinfo_car_n2w_257 routing_car_n2w_257" vType="Car" speedFactor="1.00" vaporized=""/>
    <tripinfo id="car_s2n_252" depart="252.00" departLane="s2sep_1" departPos="3.60" departPosLat="0.00" departSpeed="13.90" departDelay="0.00" arrival="457.10" arrivalLane="c2n_1" arrivalPos="990.00" arrivalPosLat="0.00" arrivalSpeed="14.01" duration="205.10" routeLength="1997.01" waitingTime="50.80" waitingCount="1" stopTime="0.00" timeLoss="62.68" rerouteNo="1" devices="tripinfo_car_s2n_252 routing_car_s2n_252" vType="Car" speedFactor="1.01" vaporized=""/>
    <tripinfo id="car_n2s_258" depart="258.95" departLane="n2sep_1" departPos="3.60" departPosLat="0.00" departSpeed="13.90" departDelay="0.95" arrival="457.75" arrivalLane="c2s_1" arrivalPos="990.00" arrivalPosLat="0.00" arrivalSpeed="13.94" duration="198.80" routeLength="1997.01" waitingTime="42.20" waitingCount="1" stopTime="0.00" timeLoss="55.58" rerouteNo="1" devices="tripinfo_car_n2s_258 routing_car_n2s_258" vType="Car" speedFactor="1.00" vaporized=""/>
    <tripinfo id="car_n2w_259" depart="260.80" departLane="n2sep_1" departPos="3.60" departPosLat="0.00" departSpeed="13.90" departDelay="1.80" arrival="458.05" arrivalLane="c2w_1" arrivalPos="990.00" arrivalPosLat="0.00" arrivalSpeed="14.76" duration="197.25" routeLength="1986.69" waitingTime="41.25" waitingCount="1" stopTime="0.00" timeLoss="63.07" rerouteNo="1" devices="tripinfo_car_n2w_259 routing_car_n2w_259" vType="Car" speedFactor="1.07" vaporized=""/>
    <tripinfo id="car_s2e_262" depart="262.00" departLane="s2sep_1" departPos="3.60" departPosLat="0.00" departSpeed="13.90" departDelay="0.00" arrival="458.40" arrivalLane="c2e_1" arrivalPos="990.00" arrivalPosLat="0.00" arrivalSpeed="14.23" duration="196.40" routeLength="1986.69" waitingTime="41.60" waitingCount="1" stopTime="0.00" timeLoss="56.01" rerouteNo="1" devices="tripinfo_car_s2e_262 routing_car_s2e_262" vType="Car" speedFactor="1.02" vaporized=""/>
    <tripinfo id="car_n2s_262" depart="262.60" departLane="n2sep_1" departPos="3.60" departPosLat="0.00" departSpeed="13.90" departDelay="0.60" arrival="460.00" arrivalLane="c2s_1" arrivalPos="990.00" arrivalPosLat="0.00" arrivalSpeed="14.99" duration="197.40" routeLength="1997.01" waitingTime="40.40" waitingCount="1" stopTime="0.00" timeLoss="67.13" rerouteNo="1" devices="tripinfo_car_n2s_262 routing_car_n2s_262" vType="Car" speedFactor="1.10" vaporized=""/>
    <tripinfo id="car_s2n_260" depart="260.00" departLane="s2sep_1" departPos="3.60" departPosLat="0.00" departSpeed="13.90" departDelay="0.00" arrival="460.75" arrivalLane="c2n_1" arrivalPos="990.00" arrivalPosLat="0.00" arrivalSpeed="13.88" duration="200.75" routeLength="1997.01" waitingTime="43.35" waitingCount="1" stopTime="0.00" timeLoss="57.08" rerouteNo="1" devices="tripinfo_car_s2n_260 routing_car_s2n_260" vType="Car" speedFactor="1.00" vaporized=""/>
    <tripinfo id="car_s2e_283" depart="283.00" departLane="s2sep_1" departPos="3.60" departPosLat="0.00" departSpeed="13.90" departDelay="0.00" arrival="461.35" arrivalLane="c2e_1" arrivalPos="990.00" arrivalPosLat="0.00" arrivalSpeed="14.76" duration="178.35" routeLength="1986.69" waitingTime="27.25" waitingCount="1" stopTime="0.00" timeLoss="43.86" rerouteNo="1" devices="tripinfo_car_s2e_283 routing_car_s2e_283" vType="Car" speedFactor="1.07" vaporized=""/>
    <tripinfo id="car_n2w_266" depart="266.00" departLane="n2sep_1" departPos="3.60" departPosLat="0.00" departSpeed="13.90" departDelay="0.00" arrival="461.75" arrivalLane="c2w_1" arrivalPos="990.00" arrivalPosLat="0.00" arrivalSpeed="14.72" duration="195.75" routeLength="1986.69" waitingTime="39.35" waitingCount="1" stopTime="0.00" timeLoss="60.31" rerouteNo="1" devices="tripinfo_car_n2w_266 routing_car_n2w_266" vType="Car" speedFactor="1.06" vaporized=""/>
    <tripinfo id="car_s2n_303" depart="303.00" departLane="s2sep_1" departPos="3.60" departPosLat="0.00" departSpeed="13.90" departDelay="0.00" arrival="462.55" arrivalLane="c2n_1" arrivalPos="990.00" arrivalPosLat="0.00" arrivalSpeed="15.27" duration="159.55" routeLength="1997.01" waitingTime="6.30" waitingCount="1" stopTime="0.00" timeLoss="36.16" rerouteNo="1" devices="tripinfo_car_s2n_303 routing_car_s2n_303" vType="Car" speedFactor="1.16" vaporized=""/>
    <tripinfo id="car_n2s_287" depart="287.00" departLane="n2sep_1" departPos="3.60" departPosLat="0.00" departSpeed="13.90" departDelay="0.00" arrival="463.05" arrivalLane="c2s_1" arrivalPos="990.00" arrivalPosLat="0.00" arrivalSpeed="15.78" duration="176.05" routeLength="1997.01" waitingTime="28.65" waitingCount="1" stopTime="0.00" timeLoss="50.30" rerouteNo="1" devices="tripinfo_car_n2s_287 routing_car_n2s_287" vType="Car" speedFactor="1.14" vaporized=""/>
    <tripinfo id="car_n2w_272" depart="272.00" departLane="n2sep_1" departPos="3.60" departPosLat="0.00" departSpeed="13.90" departDelay="0.00" arrival="466.25" arrivalLane="c2w_1" arrivalPos="990.00" arrivalPosLat="0.00" arrivalSpeed="14.34" duration="194.25" routeLength="1986.69" waitingTime="32.25" waitingCount="1" stopTime="0.00" timeLoss="55.06" rerouteNo="1" devices="tripinfo_car_n2w_272 routing_car_n2w_272" vType="Car" speedFactor="1.03" vaporized=""/>
    <tripinfo id="car_s2e_303" depart="304.45" departLane="s2sep_1" departPos="3.60" departPosLat="0.00" departSpeed="13.90" departDelay="1.45" arrival="467.20" arrivalLane="c2e_1" arrivalPos="990.00" arrivalPosLat="0.00" arrivalSpeed="13.90" duration="162.75" routeLength="1986.69" waitingTime="2.45" waitingCount="1" stopTime="0.00" timeLoss="19.08" rerouteNo="1" devices="tripinfo_car_s2e_303 routing_car_s2e_303" vType="Car" speedFactor="1.00" vaporized=""/>
    <tripinfo id="car_s2n_312" depart="312.00" departLane="s2sep_1" departPos="3.60" departPosLat="0.00" departSpeed="13.90" departDelay="0.00" arrival="468.10" arrivalLane="c2n_1" arrivalPos="990.00" arrivalPosLat="0.00" arrivalSpeed="14.45" duration="156.10" routeLength="1997.01" waitingTime="0.00" waitingCount="0" stopTime="0.00" timeLoss="17.95" rerouteNo="1" devices="tripinfo_car_s2n_312 routing_car_s2n_312" vType="Car" speedFactor="1.04" vaporized=""/>
    <tripinfo id="car_s2e_304" depart="306.25" departLane="s2sep_1" departPos="3.60" departPosLat="0.00" departSpeed="13.90" departDelay="2.25" arrival="469.55" arrivalLane="c2e_1" arrivalPos="990.00" arrivalPosLat="0.00" arrivalSpeed="14.78" duration="163.30" routeLength="1986.69" waitingTime="1.65" waitingCount="1" stopTime="0.00" timeLoss="30.57" rerouteNo="1" devices="tripinfo_car_s2e_304 routing_car_s2e_304" vType="Car" speedFactor="1.08" vaporized=""/>
    <tripinfo id="car_n2s_293" depart="293.00" departLane="n2sep_1" departPos="3.60" departPosLat="0.00" departSpeed="13.90" departDelay="0.00" arrival="470.75" arrivalLane="c2s_1" arrivalPos="990.00" arrivalPosLat="0.00" arrivalSpeed="14.42" duration="177.75" routeLength="1997.01" waitingTime="22.00" waitingCount="1" stopTime="0.00" timeLoss="39.22" rerouteNo="1" devices="tripinfo_car_n2s_293 routing_car_n2s_293" vType="Car" speedFactor="1.04" vaporized=""/>
    <tripinfo id="car_n2w_274" depart="274.00" departLane="n2sep_1" departPos="3.60" departPosLat="0.00" departSpeed="13.90" departDelay="0.00" arrival="471.00" arrivalLane="c2w_1" arrivalPos="990.00" arrivalPosLat="0.00" arrivalSpeed="13.89" duration="197.00" routeLength="1986.69" waitingTime="30.90" waitingCount="1" stopTime="0.00" timeLoss="53.35" rerouteNo="1" devices="tripinfo_car_n2w_274 routing_car_n2w_274" vType="Car" speedFactor="1.00" vaporized=""/>
    <tripinfo id="car_s2e_330" depart="330.00" departLane="s2sep_1" departPos="3.60" departPosLat="0.00" departSpeed="13.90" departDelay="0.00" arrival="471.65" arrivalLane="c2e_1" arrivalPos="990.00" arrivalPosLat="0.00" arrivalSpeed="15.19" duration="141.65" routeLength="1986.69" waitingTime="0.00" waitingCount="0" stopTime="0.00" timeLoss="13.74" rerouteNo="1" devices="tripinfo_car_s2e_330 routing_car_s2e_330" vType="Car" speedFactor="1.12" vaporized=""/>
    <tripinfo id="car_n2w_305" depart="305.00" departLane="n2sep_1" departPos="3.60" departPosLat="0.00" departSpeed="13.90" departDelay="0.00" arrival="472.95" arrivalLane="c2w_1" arrivalPos="990.00" arrivalPosLat="0.00" arrivalSpeed="15.20" duration="167.95" routeLength="1986.69" waitingTime="16.80" waitingCount="1" stopTime="0.00" timeLoss="42.01" rerouteNo="1" devices="tripinfo_car_n2w_305 routing_car_n2w_305" vType="Car" speedFactor="1.14" vaporized=""/>
    <tripinfo id="car_s2n_318" depart="318.00" departLane="s2sep_1" departPos="3.60" departPosLat="0.00" departSpeed="13.90" departDelay="0.00" arrival="473.55" arrivalLane="c2n_1" arrivalPos="990.00" arrivalPosLat="0.00" arrivalSpeed="13.96" duration="155.55" routeLength="1997.01" waitingTime="0.00" waitingCount="0" stopTime="0.00" timeLoss="12.52" rerouteNo="1" devices="tripinfo_car_s2n_318 routing_car_s2n_318" vType="Car" speedFactor="1.00" vaporized=""/>
    <tripinfo id="car_n2s_310" depart="310.00" departLane="n2sep_1" departPos="3.60" departPosLat="0.00" departSpeed="13.90" departDelay="0.00" arrival="477.15" arrivalLane="c2s_1" arrivalPos="990.00" arrivalPosLat="0.00" arrivalSpeed="13.93" duration="167.15" routeLength="1997.01" waitingTime="5.15" waitingCount="1" stopTime="0.00" timeLoss="23.76" rerouteNo="1" devices="tripinfo_car_n2s_310 routing_car_n2s_310" vType="Car" speedFactor="1.00" vaporized=""/>
    <tripinfo id="car_n2s_334" depart="335.35" departLane="n2sep_1" departPos="3.60" departPosLat="0.00" departSpeed="13.90" departDelay="1.35" arrival="482.00" arrivalLane="c2s_1" arrivalPos="990.00" arrivalPosLat="0.00" arrivalSpeed="13.89" duration="146.65" routeLength="1997.01" waitingTime="0.00" waitingCount="0" stopTime="0.00" timeLoss="2.96" rerouteNo="1" devices="tripinfo_car_n2s_334 routing_car_n2s_334" vType="Car" speedFactor="1.00" vaporized=""/>
    <tripinfo id="bus_s2e_333" depart="333.00" departLane="s2sep_1" departPos="12.10" departPosLat="0.00" departSpeed="13.90" departDelay="0.00" arrival="482.40" arrivalLane="c2e_1" arrivalPos="990.00" arrivalPosLat="0.00" arrivalSpeed="13.90" duration="149.40" routeLength="1978.19" waitingTime="0.00" waitingCount="0" stopTime="0.00" timeLoss="6.36" rerouteNo="1" devices="tripinfo_bus_s2e_333 routing_bus_s2e_333" vType="Bus" speedFactor="1.00" vaporized=""/>
    <tripinfo id="car_s2w_301" depart="301.00" departLane="s2sep_1" departPos="3.60" departPosLat="0.00" departSpeed="13.90" departDelay="0.00" arrival="482.65" arrivalLane="c2w_1" arrivalPos="990.00" arrivalPosLat="0.00" arrivalSpeed="14.23" duration="181.65" routeLength="1996.47" waitingTime="29.20" waitingCount="3" stopTime="0.00" timeLoss="40.63" rerouteNo="1" devices="tripinfo_car_s2w_301 routing_car_s2w_301" vType="Car" speedFactor="1.02" vaporized=""/>
    <tripinfo id="car_s2w_337" depart="337.00" departLane="s2sep_1" departPos="3.60" departPosLat="0.00" departSpeed="13.90" departDelay="0.00" arrival="485.95" arrivalLane="c2w_1" arrivalPos="990.00" arrivalPosLat="0.00" arrivalSpeed="14.57" duration="148.95" routeLength="1996.47" waitingTime="0.00" waitingCount="0" stopTime="0.00" timeLoss="11.75" rerouteNo="1" devices="tripinfo_car_s2w_337 routing_car_s2w_337" vType="Car" speedFactor="1.05" vaporized=""/>
    <tripinfo id="bus_n2e_266" depart="268.15" departLane="n2sep_1" departPos="12.10" departPosLat="0.00" departSpeed="13.90" departDelay="2.15" arrival="488.70" arrivalLane="c2e_1" arrivalPos="990.00" arrivalPosLat="0.00" arrivalSpeed="13.88" duration="220.55" routeLength="1987.97" waitingTime="56.75" waitingCount="2" stopTime="0.00" timeLoss="76.82" rerouteNo="1" devices="tripinfo_bus_n2e_266 routing_bus_n2e_266" vType="Bus" speedFactor="1.00" vaporized=""/>
    <tripinfo id="car_s2w_339" depart="339.00" departLane="s2sep_1" departPos="3.60" departPosLat="0.00" departSpeed="13.90" departDelay="0.00" arrival="490.55" arrivalLane="c2w_1" arrivalPos="990.00" arrivalPosLat="0.00" arrivalSpeed="13.95" duration="151.55" routeLength="1996.47" waitingTime="0.00" waitingCount="0" stopTime="0.00" timeLoss="7.84" rerouteNo="1" devices="tripinfo_car_s2w_339 routing_car_s2w_339" vType="Car" speedFactor="1.00" vaporized=""/>
    <tripinfo id="car_n2e_267" depart="269.85" departLane="n2sep_1" departPos="3.60" departPosLat="0.00" departSpeed="13.90" departDelay="2.85" arrival="491.15" arrivalLane="c2e_1" arrivalPos="990.00" arrivalPosLat="0.00" arrivalSpeed="15.50" duration="221.30" routeLength="1996.47" waitingTime="54.75" waitingCount="2" stopTime="0.00" timeLoss="96.09" rerouteNo="1" devices="tripinfo_car_n2e_267 routing_car_n2e_267" vType="Car" speedFactor="1.15" vaporized=""/>
    <tripinfo id="car_n2e_276" depart="276.00" departLane="n2sep_1" departPos="3.60" departPosLat="0.00" departSpeed="13.90" departDelay="0.00" arrival="493.30" arrivalLane="c2e_1" arrivalPos="990.00" arrivalPosLat="0.00" arrivalSpeed="15.19" duration="217.30" routeLength="1996.47" waitingTime="48.80" waitingCount="2" stopTime="0.00" timeLoss="88.24" rerouteNo="1" devices="tripinfo_car_n2e_276 routing_car_n2e_276" vType="Car" speedFactor="1.12" vaporized=""/>
    <tripinfo id="car_s2w_341" depart="341.00" departLane="s2sep_1" departPos="3.60" departPosLat="0.00" departSpeed="13.90" departDelay="0.00" arrival="493.55" arrivalLane="c2w_1" arrivalPos="990.00" arrivalPosLat="0.00" arrivalSpeed="14.24" duration="152.55" routeLength="1996.47" waitingTime="0.00" waitingCount="0" stopTime="0.00" timeLoss="12.34" rerouteNo="1" devices="tripinfo_car_s2w_341 routing_car_s2w_341" vType="Car" speedFactor="1.03" vaporized=""/>
</tripinfos>
