%!PS-Adobe-3.0 EPSF-3.0
%%Creator: (MATLAB, The Mathworks, Inc. Version 9.9.0.1524771 \(R2020b\) Update 2. Operating System: Linux)
%%Title: ../pictures/visualize_control/I_2_L_18_Q_1_LTI_COST_CZ.eps
%%CreationDate: 2021-01-27T14:34:01
%%Pages: (atend)
%%BoundingBox:    39     0   551   277
%%LanguageLevel: 3
%%EndComments
%%BeginProlog
%%BeginResource: procset (Apache XML Graphics Std ProcSet) 1.2 0
%%Version: 1.2 0
%%Copyright: (Copyright 2001-2003,2010 The Apache Software Foundation. License terms: http://www.apache.org/licenses/LICENSE-2.0)
/bd{bind def}bind def
/ld{load def}bd
/GR/grestore ld
/GS/gsave ld
/RM/rmoveto ld
/C/curveto ld
/t/show ld
/L/lineto ld
/ML/setmiterlimit ld
/CT/concat ld
/f/fill ld
/N/newpath ld
/S/stroke ld
/CC/setcmykcolor ld
/A/ashow ld
/cp/closepath ld
/RC/setrgbcolor ld
/LJ/setlinejoin ld
/GC/setgray ld
/LW/setlinewidth ld
/M/moveto ld
/re {4 2 roll M
1 index 0 rlineto
0 exch rlineto
neg 0 rlineto
cp } bd
/_ctm matrix def
/_tm matrix def
/BT { _ctm currentmatrix pop matrix _tm copy pop 0 0 moveto } bd
/ET { _ctm setmatrix } bd
/iTm { _ctm setmatrix _tm concat } bd
/Tm { _tm astore pop iTm 0 0 moveto } bd
/ux 0.0 def
/uy 0.0 def
/F {
  /Tp exch def
  /Tf exch def
  Tf findfont Tp scalefont setfont
  /cf Tf def  /cs Tp def
} bd
/ULS {currentpoint /uy exch def /ux exch def} bd
/ULE {
  /Tcx currentpoint pop def
  gsave
  newpath
  cf findfont cs scalefont dup
  /FontMatrix get 0 get /Ts exch def /FontInfo get dup
  /UnderlinePosition get Ts mul /To exch def
  /UnderlineThickness get Ts mul /Tt exch def
  ux uy To add moveto  Tcx uy To add lineto
  Tt setlinewidth stroke
  grestore
} bd
/OLE {
  /Tcx currentpoint pop def
  gsave
  newpath
  cf findfont cs scalefont dup
  /FontMatrix get 0 get /Ts exch def /FontInfo get dup
  /UnderlinePosition get Ts mul /To exch def
  /UnderlineThickness get Ts mul /Tt exch def
  ux uy To add cs add moveto Tcx uy To add cs add lineto
  Tt setlinewidth stroke
  grestore
} bd
/SOE {
  /Tcx currentpoint pop def
  gsave
  newpath
  cf findfont cs scalefont dup
  /FontMatrix get 0 get /Ts exch def /FontInfo get dup
  /UnderlinePosition get Ts mul /To exch def
  /UnderlineThickness get Ts mul /Tt exch def
  ux uy To add cs 10 mul 26 idiv add moveto Tcx uy To add cs 10 mul 26 idiv add lineto
  Tt setlinewidth stroke
  grestore
} bd
/QT {
/Y22 exch store
/X22 exch store
/Y21 exch store
/X21 exch store
currentpoint
/Y21 load 2 mul add 3 div exch
/X21 load 2 mul add 3 div exch
/X21 load 2 mul /X22 load add 3 div
/Y21 load 2 mul /Y22 load add 3 div
/X22 load /Y22 load curveto
} bd
/SSPD {
dup length /d exch dict def
{
/v exch def
/k exch def
currentpagedevice k known {
/cpdv currentpagedevice k get def
v cpdv ne {
/upd false def
/nullv v type /nulltype eq def
/nullcpdv cpdv type /nulltype eq def
nullv nullcpdv or
{
/upd true def
} {
/sametype v type cpdv type eq def
sametype {
v type /arraytype eq {
/vlen v length def
/cpdvlen cpdv length def
vlen cpdvlen eq {
0 1 vlen 1 sub {
/i exch def
/obj v i get def
/cpdobj cpdv i get def
obj cpdobj ne {
/upd true def
exit
} if
} for
} {
/upd true def
} ifelse
} {
v type /dicttype eq {
v {
/dv exch def
/dk exch def
/cpddv cpdv dk get def
dv cpddv ne {
/upd true def
exit
} if
} forall
} {
/upd true def
} ifelse
} ifelse
} if
} ifelse
upd true eq {
d k v put
} if
} if
} if
} forall
d length 0 gt {
d setpagedevice
} if
} bd
/RE { % /NewFontName [NewEncodingArray] /FontName RE -
  findfont dup length dict begin
  {
    1 index /FID ne
    {def} {pop pop} ifelse
  } forall
  /Encoding exch def
  /FontName 1 index def
  currentdict definefont pop
  end
} bind def
%%EndResource
%%BeginResource: procset (Apache XML Graphics EPS ProcSet) 1.0 0
%%Version: 1.0 0
%%Copyright: (Copyright 2002-2003 The Apache Software Foundation. License terms: http://www.apache.org/licenses/LICENSE-2.0)
/BeginEPSF { %def
/b4_Inc_state save def         % Save state for cleanup
/dict_count countdictstack def % Count objects on dict stack
/op_count count 1 sub def      % Count objects on operand stack
userdict begin                 % Push userdict on dict stack
/showpage { } def              % Redefine showpage, { } = null proc
0 setgray 0 setlinecap         % Prepare graphics state
1 setlinewidth 0 setlinejoin
10 setmiterlimit [ ] 0 setdash newpath
/languagelevel where           % If level not equal to 1 then
{pop languagelevel             % set strokeadjust and
1 ne                           % overprint to their defaults.
{false setstrokeadjust false setoverprint
} if
} if
} bd
/EndEPSF { %def
count op_count sub {pop} repeat            % Clean up stacks
countdictstack dict_count sub {end} repeat
b4_Inc_state restore
} bd
%%EndResource
%FOPBeginFontDict
%%IncludeResource: font Courier-Oblique
%%IncludeResource: font Courier-BoldOblique
%%IncludeResource: font Courier-Bold
%%IncludeResource: font ZapfDingbats
%%IncludeResource: font Symbol
%%IncludeResource: font Helvetica
%%IncludeResource: font Helvetica-Oblique
%%IncludeResource: font Helvetica-Bold
%%IncludeResource: font Helvetica-BoldOblique
%%IncludeResource: font Times-Roman
%%IncludeResource: font Times-Italic
%%IncludeResource: font Times-Bold
%%IncludeResource: font Times-BoldItalic
%%IncludeResource: font Courier
%FOPEndFontDict
%%BeginResource: encoding WinAnsiEncoding
/WinAnsiEncoding [
/.notdef /.notdef /.notdef /.notdef /.notdef
/.notdef /.notdef /.notdef /.notdef /.notdef
/.notdef /.notdef /.notdef /.notdef /.notdef
/.notdef /.notdef /.notdef /.notdef /.notdef
/.notdef /.notdef /.notdef /.notdef /.notdef
/.notdef /.notdef /.notdef /.notdef /.notdef
/.notdef /.notdef /space /exclam /quotedbl
/numbersign /dollar /percent /ampersand /quotesingle
/parenleft /parenright /asterisk /plus /comma
/hyphen /period /slash /zero /one
/two /three /four /five /six
/seven /eight /nine /colon /semicolon
/less /equal /greater /question /at
/A /B /C /D /E
/F /G /H /I /J
/K /L /M /N /O
/P /Q /R /S /T
/U /V /W /X /Y
/Z /bracketleft /backslash /bracketright /asciicircum
/underscore /quoteleft /a /b /c
/d /e /f /g /h
/i /j /k /l /m
/n /o /p /q /r
/s /t /u /v /w
/x /y /z /braceleft /bar
/braceright /asciitilde /bullet /Euro /bullet
/quotesinglbase /florin /quotedblbase /ellipsis /dagger
/daggerdbl /circumflex /perthousand /Scaron /guilsinglleft
/OE /bullet /Zcaron /bullet /bullet
/quoteleft /quoteright /quotedblleft /quotedblright /bullet
/endash /emdash /asciitilde /trademark /scaron
/guilsinglright /oe /bullet /zcaron /Ydieresis
/space /exclamdown /cent /sterling /currency
/yen /brokenbar /section /dieresis /copyright
/ordfeminine /guillemotleft /logicalnot /sfthyphen /registered
/macron /degree /plusminus /twosuperior /threesuperior
/acute /mu /paragraph /middot /cedilla
/onesuperior /ordmasculine /guillemotright /onequarter /onehalf
/threequarters /questiondown /Agrave /Aacute /Acircumflex
/Atilde /Adieresis /Aring /AE /Ccedilla
/Egrave /Eacute /Ecircumflex /Edieresis /Igrave
/Iacute /Icircumflex /Idieresis /Eth /Ntilde
/Ograve /Oacute /Ocircumflex /Otilde /Odieresis
/multiply /Oslash /Ugrave /Uacute /Ucircumflex
/Udieresis /Yacute /Thorn /germandbls /agrave
/aacute /acircumflex /atilde /adieresis /aring
/ae /ccedilla /egrave /eacute /ecircumflex
/edieresis /igrave /iacute /icircumflex /idieresis
/eth /ntilde /ograve /oacute /ocircumflex
/otilde /odieresis /divide /oslash /ugrave
/uacute /ucircumflex /udieresis /yacute /thorn
/ydieresis
] def
%%EndResource
%FOPBeginFontReencode
/Courier-Oblique findfont
dup length dict begin
  {1 index /FID ne {def} {pop pop} ifelse} forall
  /Encoding WinAnsiEncoding def
  currentdict
end
/Courier-Oblique exch definefont pop
/Courier-BoldOblique findfont
dup length dict begin
  {1 index /FID ne {def} {pop pop} ifelse} forall
  /Encoding WinAnsiEncoding def
  currentdict
end
/Courier-BoldOblique exch definefont pop
/Courier-Bold findfont
dup length dict begin
  {1 index /FID ne {def} {pop pop} ifelse} forall
  /Encoding WinAnsiEncoding def
  currentdict
end
/Courier-Bold exch definefont pop
/Helvetica findfont
dup length dict begin
  {1 index /FID ne {def} {pop pop} ifelse} forall
  /Encoding WinAnsiEncoding def
  currentdict
end
/Helvetica exch definefont pop
/Helvetica-Oblique findfont
dup length dict begin
  {1 index /FID ne {def} {pop pop} ifelse} forall
  /Encoding WinAnsiEncoding def
  currentdict
end
/Helvetica-Oblique exch definefont pop
/Helvetica-Bold findfont
dup length dict begin
  {1 index /FID ne {def} {pop pop} ifelse} forall
  /Encoding WinAnsiEncoding def
  currentdict
end
/Helvetica-Bold exch definefont pop
/Helvetica-BoldOblique findfont
dup length dict begin
  {1 index /FID ne {def} {pop pop} ifelse} forall
  /Encoding WinAnsiEncoding def
  currentdict
end
/Helvetica-BoldOblique exch definefont pop
/Times-Roman findfont
dup length dict begin
  {1 index /FID ne {def} {pop pop} ifelse} forall
  /Encoding WinAnsiEncoding def
  currentdict
end
/Times-Roman exch definefont pop
/Times-Italic findfont
dup length dict begin
  {1 index /FID ne {def} {pop pop} ifelse} forall
  /Encoding WinAnsiEncoding def
  currentdict
end
/Times-Italic exch definefont pop
/Times-Bold findfont
dup length dict begin
  {1 index /FID ne {def} {pop pop} ifelse} forall
  /Encoding WinAnsiEncoding def
  currentdict
end
/Times-Bold exch definefont pop
/Times-BoldItalic findfont
dup length dict begin
  {1 index /FID ne {def} {pop pop} ifelse} forall
  /Encoding WinAnsiEncoding def
  currentdict
end
/Times-BoldItalic exch definefont pop
/Courier findfont
dup length dict begin
  {1 index /FID ne {def} {pop pop} ifelse} forall
  /Encoding WinAnsiEncoding def
  currentdict
end
/Courier exch definefont pop
%FOPEndFontReencode
%%EndProlog
%%Page: 1 1
%%PageBoundingBox: 0 0 608 295
%%BeginPageSetup
[1 0 0 -1 0 295] CT
%%EndPageSetup
GS
[0.75 0 0 0.75 0 0.25] CT
1 GC
N
0 0 810 393 re
f
GR
GS
[0.75 0 0 0.75 0 0.25] CT
1 GC
N
0 0 810 393 re
f
GR
GS
[0.75 0 0 0.75 0 0.25] CT
1 GC
N
105 345 M
733 345 L
733 29 L
105 29 L
cp
f
GR
GS
[0.75 0 0 0.75 0 0.25] CT
0.873 GC
1 LJ
0.667 LW
N
105 345 M
105 29 L
S
GR
GS
[0.75 0 0 0.75 0 0.25] CT
0.873 GC
1 LJ
0.667 LW
N
164.858 345 M
164.858 29 L
S
GR
GS
[0.75 0 0 0.75 0 0.25] CT
0.873 GC
1 LJ
0.667 LW
N
224.717 345 M
224.717 29 L
S
GR
GS
[0.75 0 0 0.75 0 0.25] CT
0.873 GC
1 LJ
0.667 LW
N
284.575 345 M
284.575 29 L
S
GR
GS
[0.75 0 0 0.75 0 0.25] CT
0.873 GC
1 LJ
0.667 LW
N
344.434 345 M
344.434 29 L
S
GR
GS
[0.75 0 0 0.75 0 0.25] CT
0.873 GC
1 LJ
0.667 LW
N
404.292 345 M
404.292 29 L
S
GR
GS
[0.75 0 0 0.75 0 0.25] CT
0.873 GC
1 LJ
0.667 LW
N
464.15 345 M
464.15 29 L
S
GR
GS
[0.75 0 0 0.75 0 0.25] CT
0.873 GC
1 LJ
0.667 LW
N
524.009 345 M
524.009 29 L
S
GR
GS
[0.75 0 0 0.75 0 0.25] CT
0.873 GC
1 LJ
0.667 LW
N
583.867 345 M
583.867 29 L
S
GR
GS
[0.75 0 0 0.75 0 0.25] CT
0.873 GC
1 LJ
0.667 LW
N
643.725 345 M
643.725 29 L
S
GR
GS
[0.75 0 0 0.75 0 0.25] CT
0.873 GC
1 LJ
0.667 LW
N
703.584 345 M
703.584 29 L
S
GR
GS
[0.75 0 0 0.75 0 0.25] CT
0.873 GC
1 LJ
0.667 LW
N
733 345 M
105 345 L
S
GR
GS
[0.75 0 0 0.75 0 0.25] CT
0.873 GC
1 LJ
0.667 LW
N
733 299.857 M
105 299.857 L
S
GR
GS
[0.75 0 0 0.75 0 0.25] CT
0.873 GC
1 LJ
0.667 LW
N
733 254.714 M
105 254.714 L
S
GR
GS
[0.75 0 0 0.75 0 0.25] CT
0.873 GC
1 LJ
0.667 LW
N
733 209.571 M
105 209.571 L
S
GR
GS
[0.75 0 0 0.75 0 0.25] CT
0.873 GC
1 LJ
0.667 LW
N
733 164.429 M
105 164.429 L
S
GR
GS
[0.75 0 0 0.75 0 0.25] CT
0.873 GC
1 LJ
0.667 LW
N
733 119.286 M
105 119.286 L
S
GR
GS
[0.75 0 0 0.75 0 0.25] CT
0.873 GC
1 LJ
0.667 LW
N
733 74.143 M
105 74.143 L
S
GR
GS
[0.75 0 0 0.75 0 0.25] CT
0.873 GC
1 LJ
0.667 LW
N
733 29 M
105 29 L
S
GR
GS
[0.75 0 0 0.75 0 0.25] CT
0.149 GC
2 setlinecap
1 LJ
0.667 LW
N
105 345 M
733 345 L
S
GR
GS
[0.75 0 0 0.75 0 0.25] CT
0.149 GC
2 setlinecap
1 LJ
0.667 LW
N
105 345 M
105 338.72 L
S
GR
GS
[0.75 0 0 0.75 0 0.25] CT
0.149 GC
2 setlinecap
1 LJ
0.667 LW
N
164.858 345 M
164.858 338.72 L
S
GR
GS
[0.75 0 0 0.75 0 0.25] CT
0.149 GC
2 setlinecap
1 LJ
0.667 LW
N
224.717 345 M
224.717 338.72 L
S
GR
GS
[0.75 0 0 0.75 0 0.25] CT
0.149 GC
2 setlinecap
1 LJ
0.667 LW
N
284.575 345 M
284.575 338.72 L
S
GR
GS
[0.75 0 0 0.75 0 0.25] CT
0.149 GC
2 setlinecap
1 LJ
0.667 LW
N
344.434 345 M
344.434 338.72 L
S
GR
GS
[0.75 0 0 0.75 0 0.25] CT
0.149 GC
2 setlinecap
1 LJ
0.667 LW
N
404.292 345 M
404.292 338.72 L
S
GR
GS
[0.75 0 0 0.75 0 0.25] CT
0.149 GC
2 setlinecap
1 LJ
0.667 LW
N
464.15 345 M
464.15 338.72 L
S
GR
GS
[0.75 0 0 0.75 0 0.25] CT
0.149 GC
2 setlinecap
1 LJ
0.667 LW
N
524.009 345 M
524.009 338.72 L
S
GR
GS
[0.75 0 0 0.75 0 0.25] CT
0.149 GC
2 setlinecap
1 LJ
0.667 LW
N
583.867 345 M
583.867 338.72 L
S
GR
GS
[0.75 0 0 0.75 0 0.25] CT
0.149 GC
2 setlinecap
1 LJ
0.667 LW
N
643.725 345 M
643.725 338.72 L
S
GR
GS
[0.75 0 0 0.75 0 0.25] CT
0.149 GC
2 setlinecap
1 LJ
0.667 LW
N
703.584 345 M
703.584 338.72 L
S
GR
GS
[0.75 0 0 0.75 78.75 263.00001] CT
0.149 GC
/Helvetica 13.333 F
GS
[1 0 0 1 0 0] CT
-4.5 13 moveto 
1 -1 scale
(0) t 
GR
GR
GS
[0.75 0 0 0.75 123.64379 263.00001] CT
0.149 GC
/Helvetica 13.333 F
GS
[1 0 0 1 0 0] CT
-4.5 13 moveto 
1 -1 scale
(5) t 
GR
GR
GS
[0.75 0 0 0.75 168.53759 263.00001] CT
0.149 GC
/Helvetica 13.333 F
GS
[1 0 0 1 0 0] CT
-8.5 13 moveto 
1 -1 scale
(10) t 
GR
GR
GS
[0.75 0 0 0.75 213.43137 263.00001] CT
0.149 GC
/Helvetica 13.333 F
GS
[1 0 0 1 0 0] CT
-8.5 13 moveto 
1 -1 scale
(15) t 
GR
GR
GS
[0.75 0 0 0.75 258.32517 263.00001] CT
0.149 GC
/Helvetica 13.333 F
GS
[1 0 0 1 0 0] CT
-8.5 13 moveto 
1 -1 scale
(20) t 
GR
GR
GS
[0.75 0 0 0.75 303.21895 263.00001] CT
0.149 GC
/Helvetica 13.333 F
GS
[1 0 0 1 0 0] CT
-8.5 13 moveto 
1 -1 scale
(25) t 
GR
GR
GS
[0.75 0 0 0.75 348.11275 263.00001] CT
0.149 GC
/Helvetica 13.333 F
GS
[1 0 0 1 0 0] CT
-8.5 13 moveto 
1 -1 scale
(30) t 
GR
GR
GS
[0.75 0 0 0.75 393.00655 263.00001] CT
0.149 GC
/Helvetica 13.333 F
GS
[1 0 0 1 0 0] CT
-8.5 13 moveto 
1 -1 scale
(35) t 
GR
GR
GS
[0.75 0 0 0.75 437.90034 263.00001] CT
0.149 GC
/Helvetica 13.333 F
GS
[1 0 0 1 0 0] CT
-8.5 13 moveto 
1 -1 scale
(40) t 
GR
GR
GS
[0.75 0 0 0.75 482.7941 263.00001] CT
0.149 GC
/Helvetica 13.333 F
GS
[1 0 0 1 0 0] CT
-8.5 13 moveto 
1 -1 scale
(45) t 
GR
GR
GS
[0.75 0 0 0.75 527.6879 263.00001] CT
0.149 GC
/Helvetica 13.333 F
GS
[1 0 0 1 0 0] CT
-8.5 13 moveto 
1 -1 scale
(50) t 
GR
GR
GS
[0.75 0 0 0.75 314.25023 277] CT
0.149 GC
N
-21.423 15.175 M
-21.423 14.878 -21.36 14.628 QT
-19.907 8.878 L
-22.016 8.878 L
-22.219 8.878 -22.219 8.612 QT
-22.141 8.175 -21.954 8.175 QT
-19.735 8.175 L
-18.938 4.909 L
-18.86 4.644 -18.626 4.464 QT
-18.391 4.284 -18.094 4.284 QT
-17.844 4.284 -17.673 4.433 QT
-17.501 4.581 -17.501 4.831 QT
-17.501 4.894 -17.509 4.925 QT
-17.516 4.956 -17.516 5.003 QT
-18.313 8.175 L
-16.266 8.175 L
-16.048 8.175 -16.048 8.441 QT
-16.063 8.487 -16.094 8.605 QT
-16.126 8.722 -16.173 8.8 QT
-16.219 8.878 -16.313 8.878 QT
-18.501 8.878 L
-19.938 14.659 L
-20.079 15.222 -20.079 15.644 QT
-20.079 16.503 -19.485 16.503 QT
-18.61 16.503 -17.93 15.675 QT
-17.251 14.847 -16.891 13.862 QT
-16.813 13.737 -16.735 13.737 QT
-16.501 13.737 L
-16.423 13.737 -16.368 13.792 QT
-16.313 13.847 -16.313 13.925 QT
-16.313 13.956 -16.344 13.972 QT
-16.782 15.191 -17.618 16.105 QT
-18.454 17.019 -19.548 17.019 QT
-20.329 17.019 -20.876 16.503 QT
-21.423 15.987 -21.423 15.175 QT
cp
f
GR
GS
[0.75 0 0 0.75 314.25023 277] CT
0.149 GC
N
-14.966 19.847 M
-14.966 17.55 L
-14.966 17.441 -14.841 17.441 QT
-14.669 17.441 L
-14.591 17.441 -14.56 17.55 QT
-14.169 19.581 -12.685 19.581 QT
-12.013 19.581 -11.568 19.284 QT
-11.122 18.987 -11.122 18.362 QT
-11.122 17.909 -11.474 17.589 QT
-11.825 17.269 -12.294 17.159 QT
-13.232 16.972 L
-13.7 16.862 -14.091 16.651 QT
-14.482 16.441 -14.724 16.089 QT
-14.966 15.737 -14.966 15.269 QT
-14.966 14.659 -14.646 14.269 QT
-14.325 13.878 -13.802 13.698 QT
-13.278 13.519 -12.685 13.519 QT
-11.966 13.519 -11.435 13.909 QT
-11.028 13.566 L
-11.028 13.519 -10.95 13.519 QT
-10.857 13.519 L
-10.81 13.519 -10.778 13.558 QT
-10.747 13.597 -10.747 13.644 QT
-10.747 15.472 L
-10.747 15.597 -10.857 15.597 QT
-11.028 15.597 L
-11.153 15.597 -11.153 15.472 QT
-11.153 14.737 -11.56 14.292 QT
-11.966 13.847 -12.7 13.847 QT
-13.325 13.847 -13.786 14.081 QT
-14.247 14.316 -14.247 14.878 QT
-14.247 15.269 -13.911 15.519 QT
-13.575 15.769 -13.138 15.878 QT
-12.185 16.066 L
-11.716 16.175 -11.302 16.433 QT
-10.888 16.691 -10.646 17.089 QT
-10.403 17.487 -10.403 17.987 QT
-10.403 18.487 -10.575 18.862 QT
-10.747 19.237 -11.06 19.48 QT
-11.372 19.722 -11.794 19.839 QT
-12.216 19.956 -12.685 19.956 QT
-13.56 19.956 -14.169 19.362 QT
-14.685 19.925 L
-14.685 19.956 -14.763 19.956 QT
-14.841 19.956 L
-14.966 19.956 -14.966 19.847 QT
cp
f
GR
GS
[0.75 0 0 0.75 314.25023 277] CT
0.149 GC
N
-9.475 19.8 M
-9.475 19.3 L
-9.006 19.3 -8.694 19.23 QT
-8.381 19.159 -8.381 18.862 QT
-8.381 15.034 L
-8.381 14.503 -8.592 14.378 QT
-8.803 14.253 -9.413 14.253 QT
-9.413 13.769 L
-7.397 13.612 L
-7.397 18.862 L
-7.397 19.159 -7.131 19.23 QT
-6.866 19.3 -6.428 19.3 QT
-6.428 19.8 L
-9.475 19.8 L
cp
-8.881 11.206 M
-8.881 10.894 -8.655 10.667 QT
-8.428 10.441 -8.116 10.441 QT
-7.928 10.441 -7.741 10.542 QT
-7.553 10.644 -7.452 10.823 QT
-7.35 11.003 -7.35 11.206 QT
-7.35 11.503 -7.584 11.737 QT
-7.819 11.972 -8.116 11.972 QT
-8.428 11.972 -8.655 11.737 QT
-8.881 11.503 -8.881 11.206 QT
cp
f
GR
GS
[0.75 0 0 0.75 314.25023 277] CT
0.149 GC
N
-5.633 20.894 M
-5.633 20.394 -5.274 20.019 QT
-4.914 19.644 -4.414 19.487 QT
-4.695 19.284 -4.836 18.964 QT
-4.977 18.644 -4.977 18.269 QT
-4.977 17.612 -4.57 17.112 QT
-5.211 16.487 -5.211 15.675 QT
-5.211 15.237 -5.024 14.855 QT
-4.836 14.472 -4.5 14.191 QT
-4.164 13.909 -3.75 13.761 QT
-3.336 13.612 -2.914 13.612 QT
-2.086 13.612 -1.414 14.097 QT
-1.133 13.784 -0.735 13.62 QT
-0.336 13.456 0.086 13.456 QT
0.383 13.456 0.57 13.675 QT
0.758 13.894 0.758 14.191 QT
0.758 14.362 0.633 14.487 QT
0.508 14.612 0.336 14.612 QT
0.164 14.612 0.031 14.487 QT
-0.102 14.362 -0.102 14.191 QT
-0.102 13.925 0.07 13.831 QT
-0.664 13.831 -1.18 14.331 QT
-0.93 14.581 -0.774 14.948 QT
-0.617 15.316 -0.617 15.675 QT
-0.617 16.269 -0.945 16.745 QT
-1.274 17.222 -1.813 17.48 QT
-2.352 17.737 -2.914 17.737 QT
-3.68 17.737 -4.32 17.331 QT
-4.508 17.597 -4.508 17.941 QT
-4.508 18.316 -4.266 18.589 QT
-4.024 18.862 -3.664 18.862 QT
-2.508 18.862 L
-1.68 18.862 -1.008 19.011 QT
-0.336 19.159 0.117 19.612 QT
0.57 20.066 0.57 20.894 QT
0.57 21.503 0.055 21.909 QT
-0.461 22.316 -1.188 22.503 QT
-1.914 22.691 -2.524 22.691 QT
-3.149 22.691 -3.875 22.503 QT
-4.602 22.316 -5.117 21.909 QT
-5.633 21.503 -5.633 20.894 QT
cp
-4.852 20.894 M
-4.852 21.362 -4.469 21.683 QT
-4.086 22.003 -3.547 22.159 QT
-3.008 22.316 -2.524 22.316 QT
-2.055 22.316 -1.516 22.159 QT
-0.977 22.003 -0.594 21.683 QT
-0.211 21.362 -0.211 20.894 QT
-0.211 20.159 -0.883 19.948 QT
-1.555 19.737 -2.508 19.737 QT
-3.664 19.737 L
-3.977 19.737 -4.25 19.886 QT
-4.524 20.034 -4.688 20.316 QT
-4.852 20.597 -4.852 20.894 QT
cp
-2.914 17.362 M
-1.727 17.362 -1.727 15.675 QT
-1.727 14.941 -1.977 14.464 QT
-2.227 13.987 -2.914 13.987 QT
-3.602 13.987 -3.852 14.464 QT
-4.102 14.941 -4.102 15.675 QT
-4.102 16.128 -4.008 16.511 QT
-3.914 16.894 -3.656 17.128 QT
-3.399 17.362 -2.914 17.362 QT
cp
f
GR
GS
[0.75 0 0 0.75 314.25023 277] CT
0.149 GC
N
4.53 21.8 M
4.53 1.8 L
7.265 1.8 L
7.265 2.597 L
5.343 2.597 L
5.343 21.003 L
7.265 21.003 L
7.265 21.8 L
4.53 21.8 L
cp
f
GR
GS
[0.75 0 0 0.75 314.25023 277] CT
0.149 GC
N
9.461 15.581 M
10.008 16.503 11.617 16.503 QT
12.32 16.503 12.961 16.261 QT
13.601 16.019 14.015 15.542 QT
14.43 15.066 14.43 14.378 QT
14.43 13.862 14.055 13.526 QT
13.68 13.191 13.148 13.081 QT
12.07 12.862 L
11.32 12.675 10.844 12.167 QT
10.367 11.659 10.367 10.941 QT
10.367 10.05 10.851 9.37 QT
11.336 8.691 12.125 8.323 QT
12.914 7.956 13.758 7.956 QT
14.664 7.956 15.383 8.394 QT
16.101 8.831 16.101 9.675 QT
16.101 10.144 15.844 10.495 QT
15.586 10.847 15.133 10.847 QT
14.867 10.847 14.68 10.675 QT
14.492 10.503 14.492 10.237 QT
14.492 10.003 14.617 9.784 QT
14.742 9.566 14.969 9.433 QT
15.195 9.3 15.43 9.3 QT
15.242 8.862 14.758 8.667 QT
14.273 8.472 13.726 8.472 QT
13.211 8.472 12.703 8.683 QT
12.195 8.894 11.89 9.284 QT
11.586 9.675 11.586 10.222 QT
11.586 10.581 11.836 10.855 QT
12.086 11.128 12.461 11.237 QT
13.633 11.472 L
14.18 11.597 14.648 11.894 QT
15.117 12.191 15.383 12.644 QT
15.648 13.097 15.648 13.691 QT
15.648 14.425 15.234 15.151 QT
14.82 15.878 14.211 16.3 QT
13.148 17.019 11.601 17.019 QT
10.539 17.019 9.648 16.534 QT
8.758 16.05 8.758 15.081 QT
8.758 14.534 9.078 14.128 QT
9.398 13.722 9.945 13.722 QT
10.273 13.722 10.492 13.917 QT
10.711 14.112 10.711 14.441 QT
10.711 14.894 10.367 15.237 QT
10.023 15.581 9.57 15.581 QT
9.461 15.581 L
cp
f
GR
GS
[0.75 0 0 0.75 314.25023 277] CT
0.149 GC
N
17.539 21.8 M
17.539 21.003 L
19.492 21.003 L
19.492 2.597 L
17.539 2.597 L
17.539 1.8 L
20.289 1.8 L
20.289 21.8 L
17.539 21.8 L
cp
f
GR
GS
[0.75 0 0 0.75 0 0.25] CT
0.149 GC
2 setlinecap
1 LJ
0.667 LW
N
105 345 M
105 29 L
S
GR
GS
[0.75 0 0 0.75 0 0.25] CT
0.149 GC
2 setlinecap
1 LJ
0.667 LW
N
105 345 M
111.28 345 L
S
GR
GS
[0.75 0 0 0.75 0 0.25] CT
0.149 GC
2 setlinecap
1 LJ
0.667 LW
N
105 299.857 M
111.28 299.857 L
S
GR
GS
[0.75 0 0 0.75 0 0.25] CT
0.149 GC
2 setlinecap
1 LJ
0.667 LW
N
105 254.714 M
111.28 254.714 L
S
GR
GS
[0.75 0 0 0.75 0 0.25] CT
0.149 GC
2 setlinecap
1 LJ
0.667 LW
N
105 209.571 M
111.28 209.571 L
S
GR
GS
[0.75 0 0 0.75 0 0.25] CT
0.149 GC
2 setlinecap
1 LJ
0.667 LW
N
105 164.429 M
111.28 164.429 L
S
GR
GS
[0.75 0 0 0.75 0 0.25] CT
0.149 GC
2 setlinecap
1 LJ
0.667 LW
N
105 119.286 M
111.28 119.286 L
S
GR
GS
[0.75 0 0 0.75 0 0.25] CT
0.149 GC
2 setlinecap
1 LJ
0.667 LW
N
105 74.143 M
111.28 74.143 L
S
GR
GS
[0.75 0 0 0.75 0 0.25] CT
0.149 GC
2 setlinecap
1 LJ
0.667 LW
N
105 29 M
111.28 29 L
S
GR
GS
[0.75 0 0 0.75 74.75 259] CT
0.149 GC
/Helvetica 13.333 F
GS
[1 0 0 1 0 0] CT
-9 4.5 moveto 
1 -1 scale
(0) t 
GR
GR
GS
[0.75 0 0 0.75 74.75 225.14286] CT
0.149 GC
/Helvetica 13.333 F
GS
[1 0 0 1 0 0] CT
-22 4.5 moveto 
1 -1 scale
(0.2) t 
GR
GR
GS
[0.75 0 0 0.75 74.75 191.28571] CT
0.149 GC
/Helvetica 13.333 F
GS
[1 0 0 1 0 0] CT
-22 4.5 moveto 
1 -1 scale
(0.4) t 
GR
GR
GS
[0.75 0 0 0.75 74.75 157.42857] CT
0.149 GC
/Helvetica 13.333 F
GS
[1 0 0 1 0 0] CT
-22 4.5 moveto 
1 -1 scale
(0.6) t 
GR
GR
GS
[0.75 0 0 0.75 74.75 123.57143] CT
0.149 GC
/Helvetica 13.333 F
GS
[1 0 0 1 0 0] CT
-22 4.5 moveto 
1 -1 scale
(0.8) t 
GR
GR
GS
[0.75 0 0 0.75 74.75 89.71428] CT
0.149 GC
/Helvetica 13.333 F
GS
[1 0 0 1 0 0] CT
-9 4.5 moveto 
1 -1 scale
(1) t 
GR
GR
GS
[0.75 0 0 0.75 74.75 55.85713] CT
0.149 GC
/Helvetica 13.333 F
GS
[1 0 0 1 0 0] CT
-22 4.5 moveto 
1 -1 scale
(1.2) t 
GR
GR
GS
[0.75 0 0 0.75 74.75 22] CT
0.149 GC
/Helvetica 13.333 F
GS
[1 0 0 1 0 0] CT
-22 4.5 moveto 
1 -1 scale
(1.4) t 
GR
GR
GS
[0 -0.75 0.75 0 55.25 140.49989] CT
0.149 GC
N
-4.335 -8.403 M
-4.132 -7.841 -3.608 -7.559 QT
-3.085 -7.278 -2.46 -7.278 QT
-1.835 -7.278 -1.257 -7.716 QT
-0.679 -8.153 -0.273 -8.802 QT
0.134 -9.45 0.29 -10.106 QT
2.649 -19.559 L
2.681 -19.638 2.681 -19.677 QT
2.681 -19.716 2.696 -19.763 QT
2.696 -19.981 2.54 -20.028 QT
2.009 -20.153 0.399 -20.153 QT
0.196 -20.153 0.196 -20.419 QT
0.227 -20.575 0.251 -20.669 QT
0.274 -20.763 0.345 -20.809 QT
0.415 -20.856 0.54 -20.856 QT
5.962 -20.856 L
6.149 -20.856 6.149 -20.606 QT
6.071 -20.153 5.899 -20.153 QT
5.196 -20.153 4.837 -20.052 QT
4.477 -19.95 4.337 -19.481 QT
1.977 -10.028 L
1.743 -9.091 1.056 -8.349 QT
0.368 -7.606 -0.577 -7.184 QT
-1.523 -6.763 -2.476 -6.763 QT
-3.538 -6.763 -4.335 -7.349 QT
-5.132 -7.934 -5.132 -8.934 QT
-5.132 -9.606 -4.773 -10.083 QT
-4.413 -10.559 -3.741 -10.559 QT
-3.366 -10.559 -3.108 -10.325 QT
-2.851 -10.091 -2.851 -9.716 QT
-2.851 -9.184 -3.249 -8.786 QT
-3.648 -8.388 -4.179 -8.388 QT
-4.288 -8.388 -4.335 -8.403 QT
cp
f
GR
GS
[0.75 0 0 0.75 0 0.25] CT
0 0.447 0.741 RC
1 LJ
2.667 LW
N
105 119.286 M
111.343 130.676 L
117.687 141.602 L
124.03 152.078 L
130.374 162.118 L
136.717 171.735 L
143.061 180.943 L
149.404 189.756 L
155.747 198.186 L
162.091 206.245 L
168.434 213.947 L
174.778 221.302 L
181.121 228.324 L
187.465 235.023 L
193.808 241.411 L
200.152 247.499 L
206.495 253.297 L
212.838 258.815 L
219.182 264.065 L
225.525 269.056 L
231.869 273.797 L
238.212 278.299 L
244.556 282.57 L
250.899 286.619 L
257.242 290.456 L
263.586 294.088 L
269.929 297.524 L
276.273 300.772 L
282.616 303.84 L
288.96 306.735 L
295.303 309.464 L
301.646 312.036 L
307.99 314.457 L
314.333 316.733 L
320.677 318.872 L
327.02 320.879 L
333.364 322.76 L
339.707 324.523 L
346.051 326.172 L
352.394 327.713 L
358.737 326.136 L
365.081 321.63 L
371.424 315.46 L
377.768 309.183 L
384.111 302.695 L
390.455 296.576 L
396.798 289.565 L
403.141 281.874 L
409.485 273.899 L
415.828 264.926 L
422.172 256.493 L
428.515 248.928 L
434.859 242.445 L
441.202 232.304 L
447.545 223.726 L
453.889 214.761 L
460.232 204.47 L
466.576 191.485 L
472.919 181.162 L
479.263 171.328 L
485.606 158.679 L
491.949 147.372 L
498.293 139.27 L
504.636 129.405 L
510.98 120.898 L
517.323 110.927 L
523.667 102.792 L
530.01 101.211 L
536.354 93.48 L
542.697 83.623 L
549.04 81.7 L
555.384 78.886 L
561.727 74.024 L
568.071 67.496 L
574.414 66.378 L
580.758 64.367 L
587.101 61.875 L
593.444 61.032 L
599.788 59.707 L
606.131 59.692 L
612.475 58.263 L
618.818 57.675 L
625.162 56.43 L
631.505 56.136 L
637.848 56.065 L
644.192 55.848 L
650.535 55.485 L
656.879 55.402 L
663.222 56.481 L
669.566 56.589 L
675.909 59.211 L
682.253 59.931 L
688.596 59.668 L
694.939 60.524 L
701.283 61.234 L
707.626 61.207 L
713.97 61.878 L
720.313 62.557 L
726.657 62.698 L
733 62.838 L
S
GR
GS
[0.75 0 0 0.75 0 0.25] CT
0.851 0.325 0.098 RC
[8 8] 0 setdash
2 LJ
2.667 LW
N
105 345 M
111.343 345 L
117.687 345 L
124.03 345 L
130.374 345 L
136.717 345 L
143.061 345 L
149.404 345 L
155.747 345 L
162.091 345 L
168.434 345 L
174.778 345 L
181.121 345 L
187.465 345 L
193.808 345 L
200.152 345 L
206.495 345 L
212.838 345 L
219.182 345 L
225.525 345 L
231.869 345 L
238.212 345 L
244.556 345 L
250.899 345 L
257.242 345 L
263.586 345 L
269.929 345 L
276.273 345 L
282.616 345 L
288.96 345 L
295.303 345 L
301.646 345 L
307.99 345 L
314.333 344.998 L
320.677 344.73 L
327.02 343.703 L
333.364 341.61 L
339.707 338.656 L
346.051 335.171 L
352.394 330.713 L
358.737 326.136 L
365.081 321.63 L
371.424 315.46 L
377.768 309.183 L
384.111 302.695 L
390.455 296.576 L
396.798 289.565 L
403.141 281.874 L
409.485 273.899 L
415.828 264.926 L
422.172 256.493 L
428.515 248.928 L
434.859 242.445 L
441.202 232.304 L
447.545 223.726 L
453.889 214.761 L
460.232 204.47 L
466.576 191.485 L
472.919 181.162 L
479.263 171.328 L
485.606 158.679 L
491.949 147.372 L
498.293 139.27 L
504.636 129.405 L
510.98 120.898 L
517.323 110.927 L
523.667 102.792 L
530.01 101.211 L
536.354 93.48 L
542.697 83.623 L
549.04 81.7 L
555.384 78.886 L
561.727 74.024 L
568.071 67.496 L
574.414 66.378 L
580.758 64.367 L
587.101 61.875 L
593.444 61.032 L
599.788 59.707 L
606.131 59.692 L
612.475 58.263 L
618.818 57.675 L
625.162 56.43 L
631.505 56.136 L
637.848 56.065 L
644.192 55.848 L
650.535 55.485 L
656.879 55.402 L
663.222 56.481 L
669.566 56.589 L
675.909 59.211 L
682.253 59.931 L
688.596 59.668 L
694.939 60.524 L
701.283 61.234 L
707.626 61.207 L
713.97 61.878 L
720.313 62.557 L
726.657 62.698 L
733 62.838 L
S
GR
GS
[0.75 0 0 0.75 0 0.25] CT
0.929 0.694 0.125 RC
[8 8] 0 setdash
2 LJ
2.667 LW
N
105 119.286 M
111.343 130.676 L
117.687 141.602 L
124.03 152.078 L
130.374 162.118 L
136.717 171.735 L
143.061 180.943 L
149.404 189.756 L
155.747 198.186 L
162.091 206.245 L
168.434 213.947 L
174.778 221.302 L
181.121 228.324 L
187.465 235.023 L
193.808 241.411 L
200.152 247.499 L
206.495 253.297 L
212.838 258.815 L
219.182 264.065 L
225.525 269.056 L
231.869 273.797 L
238.212 278.299 L
244.556 282.57 L
250.899 286.619 L
257.242 290.456 L
263.586 294.088 L
269.929 297.524 L
276.273 300.772 L
282.616 303.84 L
288.96 306.735 L
295.303 309.464 L
301.646 312.036 L
307.99 314.457 L
314.333 316.733 L
320.677 318.872 L
327.02 320.879 L
333.364 322.76 L
339.707 324.523 L
346.051 326.172 L
352.394 327.713 L
358.737 329.151 L
365.081 330.492 L
371.424 331.741 L
377.768 332.902 L
384.111 333.98 L
390.455 334.98 L
396.798 335.906 L
403.141 336.763 L
409.485 337.553 L
415.828 338.282 L
422.172 338.952 L
428.515 339.568 L
434.859 340.133 L
441.202 340.649 L
447.545 341.121 L
453.889 341.551 L
460.232 341.942 L
466.576 342.297 L
472.919 342.618 L
479.263 342.908 L
485.606 343.168 L
491.949 343.402 L
498.293 343.612 L
504.636 343.799 L
510.98 343.965 L
517.323 344.113 L
523.667 344.243 L
530.01 344.357 L
536.354 344.457 L
542.697 344.544 L
549.04 344.62 L
555.384 344.685 L
561.727 344.741 L
568.071 344.789 L
574.414 344.829 L
580.758 344.863 L
587.101 344.891 L
593.444 344.915 L
599.788 344.934 L
606.131 344.95 L
612.475 344.962 L
618.818 344.972 L
625.162 344.98 L
631.505 344.986 L
637.848 344.99 L
644.192 344.993 L
650.535 344.996 L
656.879 344.997 L
663.222 344.998 L
669.566 344.999 L
675.909 345 L
682.253 345 L
688.596 345 L
694.939 345 L
701.283 345 L
707.626 345 L
713.97 345 L
720.313 345 L
726.657 345 L
733 345 L
S
GR
GS
[0.75 0 0 0.75 0 0.25] CT
1 GC
N
402 117 M
402 40 L
116 40 L
116 117 L
cp
f
GR
GS
[0.75 0 0 0.75 122.27052 40.75] CT
N
0.516 4.8 M
0.516 4.097 L
1.203 4.097 1.641 3.987 QT
2.078 3.878 2.078 3.456 QT
2.078 -7.044 L
2.078 -7.575 1.922 -7.817 QT
1.766 -8.059 1.461 -8.106 QT
1.156 -8.153 0.516 -8.153 QT
0.516 -8.856 L
3.484 -9.075 L
3.484 0.409 L
6.156 -1.934 L
6.563 -2.325 6.563 -2.638 QT
6.563 -2.872 6.398 -2.997 QT
6.234 -3.122 6 -3.122 QT
6 -3.825 L
9.75 -3.825 L
9.75 -3.122 L
8.406 -3.122 7.047 -1.934 QT
5.609 -0.7 L
8.172 2.909 L
8.688 3.659 9.047 3.878 QT
9.406 4.097 10.219 4.097 QT
10.219 4.8 L
6.234 4.8 L
6.234 4.097 L
6.922 4.097 6.922 3.675 QT
6.922 3.378 6.563 2.909 QT
4.641 0.175 L
3.422 1.237 L
3.422 3.456 L
3.422 3.878 3.867 3.987 QT
4.313 4.097 4.984 4.097 QT
4.984 4.8 L
0.516 4.8 L
cp
f
GR
GS
[0.75 0 0 0.75 122.27052 40.75] CT
N
11.071 4.8 M
11.071 4.097 L
11.759 4.097 12.196 3.987 QT
12.634 3.878 12.634 3.456 QT
12.634 -1.997 L
12.634 -2.528 12.477 -2.77 QT
12.321 -3.013 12.017 -3.067 QT
11.712 -3.122 11.071 -3.122 QT
11.071 -3.825 L
13.931 -4.044 L
13.931 -2.091 L
14.259 -2.95 14.852 -3.497 QT
15.446 -4.044 16.306 -4.044 QT
16.899 -4.044 17.368 -3.692 QT
17.837 -3.341 17.837 -2.763 QT
17.837 -2.403 17.579 -2.13 QT
17.321 -1.856 16.931 -1.856 QT
16.556 -1.856 16.298 -2.122 QT
16.04 -2.388 16.04 -2.763 QT
16.04 -3.294 16.415 -3.528 QT
16.306 -3.528 L
15.493 -3.528 14.977 -2.942 QT
14.462 -2.356 14.251 -1.481 QT
14.04 -0.606 14.04 0.175 QT
14.04 3.456 L
14.04 4.097 15.977 4.097 QT
15.977 4.8 L
11.071 4.8 L
cp
f
GR
GS
[0.75 0 0 0.75 122.27052 40.75] CT
N
18.998 4.8 M
18.998 4.097 L
19.686 4.097 20.123 3.987 QT
20.561 3.878 20.561 3.456 QT
20.561 -1.997 L
20.561 -2.763 20.264 -2.942 QT
19.967 -3.122 19.092 -3.122 QT
19.092 -3.825 L
21.967 -4.044 L
21.967 3.456 L
21.967 3.878 22.35 3.987 QT
22.733 4.097 23.373 4.097 QT
23.373 4.8 L
18.998 4.8 L
cp
19.858 -7.481 M
19.858 -7.919 20.186 -8.247 QT
20.514 -8.575 20.951 -8.575 QT
21.233 -8.575 21.498 -8.434 QT
21.764 -8.294 21.905 -8.028 QT
22.045 -7.763 22.045 -7.481 QT
22.045 -7.044 21.717 -6.716 QT
21.389 -6.388 20.951 -6.388 QT
20.514 -6.388 20.186 -6.716 QT
19.858 -7.044 19.858 -7.481 QT
cp
f
GR
GS
[0.75 0 0 0.75 122.27052 40.75] CT
N
25.991 2.394 M
25.991 -3.122 L
24.32 -3.122 L
24.32 -3.638 L
25.632 -3.638 26.249 -4.856 QT
26.866 -6.075 26.866 -7.513 QT
27.445 -7.513 L
27.445 -3.825 L
30.257 -3.825 L
30.257 -3.122 L
27.445 -3.122 L
27.445 2.362 L
27.445 3.191 27.718 3.816 QT
27.991 4.441 28.726 4.441 QT
29.398 4.441 29.702 3.776 QT
30.007 3.112 30.007 2.362 QT
30.007 1.175 L
30.585 1.175 L
30.585 2.394 L
30.585 3.019 30.359 3.628 QT
30.132 4.237 29.679 4.628 QT
29.226 5.019 28.585 5.019 QT
27.382 5.019 26.687 4.3 QT
25.991 3.581 25.991 2.394 QT
cp
f
GR
GS
[0.75 0 0 0.75 122.27052 40.75] CT
N
36.707 5.019 M
35.488 5.019 34.465 4.378 QT
33.441 3.737 32.863 2.675 QT
32.285 1.612 32.285 0.409 QT
32.285 -0.763 32.816 -1.817 QT
33.347 -2.872 34.3 -3.52 QT
35.254 -4.169 36.425 -4.169 QT
37.332 -4.169 38.011 -3.856 QT
38.691 -3.544 39.136 -2.997 QT
39.582 -2.45 39.8 -1.708 QT
40.019 -0.966 40.019 -0.091 QT
40.019 0.175 39.816 0.175 QT
34.035 0.175 L
34.035 0.394 L
34.035 2.05 34.699 3.245 QT
35.363 4.441 36.879 4.441 QT
37.488 4.441 38.011 4.167 QT
38.535 3.894 38.925 3.401 QT
39.316 2.909 39.441 2.362 QT
39.472 2.284 39.527 2.23 QT
39.582 2.175 39.644 2.175 QT
39.816 2.175 L
40.019 2.175 40.019 2.441 QT
39.738 3.566 38.8 4.292 QT
37.863 5.019 36.707 5.019 QT
cp
34.05 -0.325 M
38.613 -0.325 L
38.613 -1.075 38.402 -1.841 QT
38.191 -2.606 37.699 -3.122 QT
37.207 -3.638 36.425 -3.638 QT
35.285 -3.638 34.668 -2.575 QT
34.05 -1.513 34.05 -0.325 QT
cp
f
GR
GS
[0.75 0 0 0.75 122.27052 40.75] CT
N
41.127 4.8 M
41.127 4.097 L
41.814 4.097 42.252 3.987 QT
42.689 3.878 42.689 3.456 QT
42.689 -1.997 L
42.689 -2.528 42.533 -2.77 QT
42.377 -3.013 42.072 -3.067 QT
41.767 -3.122 41.127 -3.122 QT
41.127 -3.825 L
43.986 -4.044 L
43.986 -2.091 L
44.314 -2.95 44.908 -3.497 QT
45.502 -4.044 46.361 -4.044 QT
46.955 -4.044 47.424 -3.692 QT
47.892 -3.341 47.892 -2.763 QT
47.892 -2.403 47.635 -2.13 QT
47.377 -1.856 46.986 -1.856 QT
46.611 -1.856 46.353 -2.122 QT
46.096 -2.388 46.096 -2.763 QT
46.096 -3.294 46.471 -3.528 QT
46.361 -3.528 L
45.549 -3.528 45.033 -2.942 QT
44.517 -2.356 44.307 -1.481 QT
44.096 -0.606 44.096 0.175 QT
44.096 3.456 L
44.096 4.097 46.033 4.097 QT
46.033 4.8 L
41.127 4.8 L
cp
f
GR
GS
[0.75 0 0 0.75 122.27052 40.75] CT
N
49.054 4.8 M
49.054 4.097 L
49.741 4.097 50.179 3.987 QT
50.616 3.878 50.616 3.456 QT
50.616 -1.997 L
50.616 -2.763 50.32 -2.942 QT
50.023 -3.122 49.148 -3.122 QT
49.148 -3.825 L
52.023 -4.044 L
52.023 3.456 L
52.023 3.878 52.405 3.987 QT
52.788 4.097 53.429 4.097 QT
53.429 4.8 L
49.054 4.8 L
cp
49.913 -7.481 M
49.913 -7.919 50.241 -8.247 QT
50.57 -8.575 51.007 -8.575 QT
51.288 -8.575 51.554 -8.434 QT
51.82 -8.294 51.96 -8.028 QT
52.101 -7.763 52.101 -7.481 QT
52.101 -7.044 51.773 -6.716 QT
51.445 -6.388 51.007 -6.388 QT
50.57 -6.388 50.241 -6.716 QT
49.913 -7.044 49.913 -7.481 QT
cp
f
GR
GS
[0.75 0 0 0.75 122.27052 40.75] CT
N
58.109 -5.778 M
60.5 -8.856 L
60.734 -9.169 61.078 -9.169 QT
61.391 -9.169 61.617 -8.942 QT
61.844 -8.716 61.844 -8.403 QT
61.844 -8.091 61.563 -7.841 QT
58.516 -5.372 L
58.109 -5.778 L
cp
f
GR
GS
[0.75 0 0 0.75 122.27052 40.75] CT
N
54.797 2.831 M
54.797 1.644 55.734 0.894 QT
56.672 0.144 57.984 -0.161 QT
59.297 -0.466 60.484 -0.466 QT
60.484 -1.278 L
60.484 -1.856 60.234 -2.403 QT
59.984 -2.95 59.5 -3.294 QT
59.016 -3.638 58.438 -3.638 QT
57.109 -3.638 56.422 -3.044 QT
56.797 -3.044 57.047 -2.755 QT
57.297 -2.466 57.297 -2.091 QT
57.297 -1.684 57.016 -1.403 QT
56.734 -1.122 56.344 -1.122 QT
55.938 -1.122 55.656 -1.403 QT
55.375 -1.684 55.375 -2.091 QT
55.375 -3.138 56.336 -3.653 QT
57.297 -4.169 58.438 -4.169 QT
59.25 -4.169 60.07 -3.817 QT
60.891 -3.466 61.414 -2.825 QT
61.938 -2.184 61.938 -1.325 QT
61.938 3.175 L
61.938 3.566 62.102 3.894 QT
62.266 4.222 62.625 4.222 QT
62.953 4.222 63.117 3.894 QT
63.281 3.566 63.281 3.175 QT
63.281 1.894 L
63.859 1.894 L
63.859 3.175 L
63.859 3.628 63.625 4.034 QT
63.391 4.441 63 4.683 QT
62.609 4.925 62.141 4.925 QT
61.563 4.925 61.133 4.464 QT
60.703 4.003 60.656 3.378 QT
60.297 4.128 59.57 4.573 QT
58.844 5.019 58.031 5.019 QT
57.266 5.019 56.524 4.8 QT
55.781 4.581 55.289 4.097 QT
54.797 3.612 54.797 2.831 QT
cp
56.422 2.831 M
56.422 3.534 56.938 4.019 QT
57.453 4.503 58.156 4.503 QT
58.813 4.503 59.336 4.175 QT
59.859 3.847 60.172 3.292 QT
60.484 2.737 60.484 2.128 QT
60.484 0.05 L
59.578 0.05 58.625 0.347 QT
57.672 0.644 57.047 1.276 QT
56.422 1.909 56.422 2.831 QT
cp
f
GR
GS
[0.75 0 0 0.75 122.27052 40.75] CT
N
64.61 4.8 M
64.61 4.097 L
65.297 4.097 65.735 3.987 QT
66.172 3.878 66.172 3.456 QT
66.172 -7.044 L
66.172 -7.575 66.016 -7.817 QT
65.86 -8.059 65.555 -8.106 QT
65.25 -8.153 64.61 -8.153 QT
64.61 -8.856 L
67.578 -9.075 L
67.578 3.456 L
67.578 3.878 68.024 3.987 QT
68.469 4.097 69.141 4.097 QT
69.141 4.8 L
64.61 4.8 L
cp
f
GR
GS
[0.75 0 0 0.75 122.27052 40.75] CT
N
70.149 4.8 M
70.149 4.097 L
70.837 4.097 71.274 3.987 QT
71.712 3.878 71.712 3.456 QT
71.712 -1.997 L
71.712 -2.528 71.556 -2.77 QT
71.399 -3.013 71.095 -3.067 QT
70.79 -3.122 70.149 -3.122 QT
70.149 -3.825 L
73.056 -4.044 L
73.056 -2.091 L
73.446 -2.95 74.235 -3.497 QT
75.024 -4.044 75.946 -4.044 QT
77.337 -4.044 78.04 -3.38 QT
78.743 -2.716 78.743 -1.341 QT
78.743 3.456 L
78.743 3.878 79.181 3.987 QT
79.618 4.097 80.306 4.097 QT
80.306 4.8 L
75.712 4.8 L
75.712 4.097 L
76.399 4.097 76.837 3.987 QT
77.274 3.878 77.274 3.456 QT
77.274 -1.278 L
77.274 -2.263 76.993 -2.895 QT
76.712 -3.528 75.837 -3.528 QT
74.681 -3.528 73.931 -2.599 QT
73.181 -1.669 73.181 -0.481 QT
73.181 3.456 L
73.181 3.878 73.618 3.987 QT
74.056 4.097 74.728 4.097 QT
74.728 4.8 L
70.149 4.8 L
cp
f
GR
GS
[0.75 0 0 0.75 122.27052 40.75] CT
N
82.554 -5.778 M
84.945 -8.856 L
85.179 -9.169 85.523 -9.169 QT
85.835 -9.169 86.062 -8.942 QT
86.288 -8.716 86.288 -8.403 QT
86.288 -8.091 86.007 -7.841 QT
82.96 -5.372 L
82.554 -5.778 L
cp
f
GR
GS
[0.75 0 0 0.75 122.27052 40.75] CT
N
81.276 4.8 M
81.276 4.097 L
81.964 4.097 82.401 3.987 QT
82.839 3.878 82.839 3.456 QT
82.839 -1.997 L
82.839 -2.763 82.542 -2.942 QT
82.245 -3.122 81.37 -3.122 QT
81.37 -3.825 L
84.245 -4.044 L
84.245 3.456 L
84.245 3.878 84.628 3.987 QT
85.011 4.097 85.651 4.097 QT
85.651 4.8 L
81.276 4.8 L
cp
f
GR
GS
[0.75 0 0 0.75 122.27052 40.75] CT
N
93.53 4.8 M
93.53 4.097 L
94.202 4.097 94.647 3.987 QT
95.092 3.878 95.092 3.456 QT
95.092 -3.122 L
93.561 -3.122 L
93.561 -3.825 L
95.092 -3.825 L
95.092 -6.216 L
95.092 -6.856 95.358 -7.419 QT
95.623 -7.981 96.077 -8.403 QT
96.53 -8.825 97.123 -9.067 QT
97.717 -9.309 98.342 -9.309 QT
99.03 -9.309 99.569 -8.903 QT
100.108 -8.497 100.108 -7.841 QT
100.108 -7.45 99.85 -7.192 QT
99.592 -6.934 99.202 -6.934 QT
98.827 -6.934 98.561 -7.192 QT
98.295 -7.45 98.295 -7.841 QT
98.295 -8.466 98.827 -8.684 QT
98.498 -8.778 98.248 -8.778 QT
97.67 -8.778 97.256 -8.364 QT
96.842 -7.95 96.631 -7.356 QT
96.42 -6.763 96.42 -6.184 QT
96.42 -3.825 L
98.733 -3.825 L
98.733 -3.122 L
96.498 -3.122 L
96.498 3.456 L
96.498 3.878 97.084 3.987 QT
97.67 4.097 98.42 4.097 QT
98.42 4.8 L
93.53 4.8 L
cp
f
GR
GS
[0.75 0 0 0.75 122.27052 40.75] CT
N
101.156 2.409 M
101.156 -1.997 L
101.156 -2.528 101 -2.77 QT
100.844 -3.013 100.539 -3.067 QT
100.235 -3.122 99.594 -3.122 QT
99.594 -3.825 L
102.625 -4.044 L
102.625 2.409 L
102.625 3.191 102.735 3.628 QT
102.844 4.066 103.211 4.284 QT
103.578 4.503 104.375 4.503 QT
105.453 4.503 106.086 3.605 QT
106.719 2.706 106.719 1.55 QT
106.719 -1.997 L
106.719 -2.528 106.555 -2.77 QT
106.391 -3.013 106.094 -3.067 QT
105.797 -3.122 105.156 -3.122 QT
105.156 -3.825 L
108.188 -4.044 L
108.188 2.987 L
108.188 3.503 108.344 3.745 QT
108.5 3.987 108.805 4.042 QT
109.11 4.097 109.75 4.097 QT
109.75 4.8 L
106.781 5.019 L
106.781 3.331 L
106.406 4.081 105.742 4.55 QT
105.078 5.019 104.281 5.019 QT
102.844 5.019 102 4.409 QT
101.156 3.8 101.156 2.409 QT
cp
f
GR
GS
[0.75 0 0 0.75 122.27052 40.75] CT
N
110.705 4.8 M
110.705 4.097 L
111.393 4.097 111.83 3.987 QT
112.268 3.878 112.268 3.456 QT
112.268 -1.997 L
112.268 -2.528 112.111 -2.77 QT
111.955 -3.013 111.65 -3.067 QT
111.346 -3.122 110.705 -3.122 QT
110.705 -3.825 L
113.611 -4.044 L
113.611 -2.091 L
114.002 -2.95 114.791 -3.497 QT
115.58 -4.044 116.502 -4.044 QT
117.893 -4.044 118.596 -3.38 QT
119.299 -2.716 119.299 -1.341 QT
119.299 3.456 L
119.299 3.878 119.736 3.987 QT
120.174 4.097 120.861 4.097 QT
120.861 4.8 L
116.268 4.8 L
116.268 4.097 L
116.955 4.097 117.393 3.987 QT
117.83 3.878 117.83 3.456 QT
117.83 -1.278 L
117.83 -2.263 117.549 -2.895 QT
117.268 -3.528 116.393 -3.528 QT
115.236 -3.528 114.486 -2.599 QT
113.736 -1.669 113.736 -0.481 QT
113.736 3.456 L
113.736 3.878 114.174 3.987 QT
114.611 4.097 115.283 4.097 QT
115.283 4.8 L
110.705 4.8 L
cp
f
GR
GS
[0.75 0 0 0.75 122.27052 40.75] CT
N
121.738 4.8 M
121.738 4.097 L
122.426 4.097 122.863 3.987 QT
123.301 3.878 123.301 3.456 QT
123.301 -7.044 L
123.301 -7.575 123.144 -7.817 QT
122.988 -8.059 122.683 -8.106 QT
122.379 -8.153 121.738 -8.153 QT
121.738 -8.856 L
124.707 -9.075 L
124.707 0.409 L
127.379 -1.934 L
127.785 -2.325 127.785 -2.638 QT
127.785 -2.872 127.621 -2.997 QT
127.457 -3.122 127.223 -3.122 QT
127.223 -3.825 L
130.973 -3.825 L
130.973 -3.122 L
129.629 -3.122 128.269 -1.934 QT
126.832 -0.7 L
129.394 2.909 L
129.91 3.659 130.269 3.878 QT
130.629 4.097 131.441 4.097 QT
131.441 4.8 L
127.457 4.8 L
127.457 4.097 L
128.144 4.097 128.144 3.675 QT
128.144 3.378 127.785 2.909 QT
125.863 0.175 L
124.644 1.237 L
124.644 3.456 L
124.644 3.878 125.09 3.987 QT
125.535 4.097 126.207 4.097 QT
126.207 4.8 L
121.738 4.8 L
cp
f
GR
GS
[0.75 0 0 0.75 122.27052 40.75] CT
N
136.207 5.019 M
134.988 5.019 134.004 4.394 QT
133.019 3.769 132.457 2.714 QT
131.894 1.659 131.894 0.487 QT
131.894 -0.7 132.449 -1.786 QT
133.004 -2.872 133.996 -3.52 QT
134.988 -4.169 136.207 -4.169 QT
137.379 -4.169 138.34 -3.708 QT
139.301 -3.247 139.301 -2.2 QT
139.301 -1.809 139.019 -1.52 QT
138.738 -1.231 138.348 -1.231 QT
137.941 -1.231 137.66 -1.52 QT
137.379 -1.809 137.379 -2.2 QT
137.379 -2.559 137.605 -2.817 QT
137.832 -3.075 138.16 -3.138 QT
137.473 -3.575 136.223 -3.575 QT
135.269 -3.575 134.684 -2.942 QT
134.098 -2.309 133.863 -1.372 QT
133.629 -0.434 133.629 0.487 QT
133.629 1.456 133.918 2.355 QT
134.207 3.253 134.848 3.847 QT
135.488 4.441 136.441 4.441 QT
137.394 4.441 138.059 3.855 QT
138.723 3.269 138.973 2.331 QT
138.973 2.222 139.129 2.222 QT
139.363 2.222 L
139.426 2.222 139.473 2.276 QT
139.519 2.331 139.519 2.394 QT
139.519 2.456 L
139.223 3.644 138.324 4.331 QT
137.426 5.019 136.207 5.019 QT
cp
f
GR
GS
[0.75 0 0 0.75 122.27052 40.75] CT
N
145.096 5.019 M
143.877 5.019 142.854 4.378 QT
141.83 3.737 141.252 2.675 QT
140.674 1.612 140.674 0.409 QT
140.674 -0.763 141.205 -1.817 QT
141.736 -2.872 142.69 -3.52 QT
143.643 -4.169 144.815 -4.169 QT
145.721 -4.169 146.401 -3.856 QT
147.08 -3.544 147.526 -2.997 QT
147.971 -2.45 148.19 -1.708 QT
148.408 -0.966 148.408 -0.091 QT
148.408 0.175 148.205 0.175 QT
142.424 0.175 L
142.424 0.394 L
142.424 2.05 143.088 3.245 QT
143.752 4.441 145.268 4.441 QT
145.877 4.441 146.401 4.167 QT
146.924 3.894 147.315 3.401 QT
147.705 2.909 147.83 2.362 QT
147.861 2.284 147.916 2.23 QT
147.971 2.175 148.033 2.175 QT
148.205 2.175 L
148.408 2.175 148.408 2.441 QT
148.127 3.566 147.19 4.292 QT
146.252 5.019 145.096 5.019 QT
cp
142.44 -0.325 M
147.002 -0.325 L
147.002 -1.075 146.791 -1.841 QT
146.58 -2.606 146.088 -3.122 QT
145.596 -3.638 144.815 -3.638 QT
143.674 -3.638 143.057 -2.575 QT
142.44 -1.513 142.44 -0.325 QT
cp
f
GR
GS
[0.75 0 0 0.75 0 0.25] CT
0 0.447 0.741 RC
1 LJ
2.667 LW
N
120.002 54 M
160.026 54 L
S
GR
GS
[0.75 0 0 0.75 122.27052 59.125] CT
N
4.984 5.019 M
3.766 5.019 2.781 4.394 QT
1.797 3.769 1.234 2.714 QT
0.672 1.659 0.672 0.487 QT
0.672 -0.7 1.227 -1.786 QT
1.781 -2.872 2.773 -3.52 QT
3.766 -4.169 4.984 -4.169 QT
6.156 -4.169 7.117 -3.708 QT
8.078 -3.247 8.078 -2.2 QT
8.078 -1.809 7.797 -1.52 QT
7.516 -1.231 7.125 -1.231 QT
6.719 -1.231 6.438 -1.52 QT
6.156 -1.809 6.156 -2.2 QT
6.156 -2.559 6.383 -2.817 QT
6.609 -3.075 6.938 -3.138 QT
6.25 -3.575 5 -3.575 QT
4.047 -3.575 3.461 -2.942 QT
2.875 -2.309 2.641 -1.372 QT
2.406 -0.434 2.406 0.487 QT
2.406 1.456 2.695 2.355 QT
2.984 3.253 3.625 3.847 QT
4.266 4.441 5.219 4.441 QT
6.172 4.441 6.836 3.855 QT
7.5 3.269 7.75 2.331 QT
7.75 2.222 7.906 2.222 QT
8.141 2.222 L
8.203 2.222 8.25 2.276 QT
8.297 2.331 8.297 2.394 QT
8.297 2.456 L
8 3.644 7.102 4.331 QT
6.203 5.019 4.984 5.019 QT
cp
f
GR
GS
[0.75 0 0 0.75 122.27052 59.125] CT
N
13.873 5.019 M
12.655 5.019 11.631 4.378 QT
10.608 3.737 10.03 2.675 QT
9.451 1.612 9.451 0.409 QT
9.451 -0.763 9.983 -1.817 QT
10.514 -2.872 11.467 -3.52 QT
12.42 -4.169 13.592 -4.169 QT
14.498 -4.169 15.178 -3.856 QT
15.858 -3.544 16.303 -2.997 QT
16.748 -2.45 16.967 -1.708 QT
17.186 -0.966 17.186 -0.091 QT
17.186 0.175 16.983 0.175 QT
11.201 0.175 L
11.201 0.394 L
11.201 2.05 11.865 3.245 QT
12.53 4.441 14.045 4.441 QT
14.655 4.441 15.178 4.167 QT
15.701 3.894 16.092 3.401 QT
16.483 2.909 16.608 2.362 QT
16.639 2.284 16.694 2.23 QT
16.748 2.175 16.811 2.175 QT
16.983 2.175 L
17.186 2.175 17.186 2.441 QT
16.905 3.566 15.967 4.292 QT
15.03 5.019 13.873 5.019 QT
cp
11.217 -0.325 M
15.78 -0.325 L
15.78 -1.075 15.569 -1.841 QT
15.358 -2.606 14.865 -3.122 QT
14.373 -3.638 13.592 -3.638 QT
12.451 -3.638 11.834 -2.575 QT
11.217 -1.513 11.217 -0.325 QT
cp
f
GR
GS
[0.75 0 0 0.75 122.27052 59.125] CT
N
18.372 4.8 M
18.372 4.097 L
19.059 4.097 19.497 3.987 QT
19.934 3.878 19.934 3.456 QT
19.934 -1.997 L
19.934 -2.528 19.778 -2.77 QT
19.622 -3.013 19.317 -3.067 QT
19.012 -3.122 18.372 -3.122 QT
18.372 -3.825 L
21.278 -4.044 L
21.278 -2.091 L
21.668 -2.95 22.457 -3.497 QT
23.247 -4.044 24.168 -4.044 QT
25.559 -4.044 26.262 -3.38 QT
26.965 -2.716 26.965 -1.341 QT
26.965 3.456 L
26.965 3.878 27.403 3.987 QT
27.84 4.097 28.528 4.097 QT
28.528 4.8 L
23.934 4.8 L
23.934 4.097 L
24.622 4.097 25.059 3.987 QT
25.497 3.878 25.497 3.456 QT
25.497 -1.278 L
25.497 -2.263 25.215 -2.895 QT
24.934 -3.528 24.059 -3.528 QT
22.903 -3.528 22.153 -2.599 QT
21.403 -1.669 21.403 -0.481 QT
21.403 3.456 L
21.403 3.878 21.84 3.987 QT
22.278 4.097 22.95 4.097 QT
22.95 4.8 L
18.372 4.8 L
cp
f
GR
GS
[0.75 0 0 0.75 122.27052 59.125] CT
N
29.686 2.831 M
29.686 1.644 30.623 0.894 QT
31.561 0.144 32.873 -0.161 QT
34.186 -0.466 35.373 -0.466 QT
35.373 -1.278 L
35.373 -1.856 35.123 -2.403 QT
34.873 -2.95 34.389 -3.294 QT
33.905 -3.638 33.326 -3.638 QT
31.998 -3.638 31.311 -3.044 QT
31.686 -3.044 31.936 -2.755 QT
32.186 -2.466 32.186 -2.091 QT
32.186 -1.684 31.905 -1.403 QT
31.623 -1.122 31.233 -1.122 QT
30.826 -1.122 30.545 -1.403 QT
30.264 -1.684 30.264 -2.091 QT
30.264 -3.138 31.225 -3.653 QT
32.186 -4.169 33.326 -4.169 QT
34.139 -4.169 34.959 -3.817 QT
35.78 -3.466 36.303 -2.825 QT
36.826 -2.184 36.826 -1.325 QT
36.826 3.175 L
36.826 3.566 36.99 3.894 QT
37.155 4.222 37.514 4.222 QT
37.842 4.222 38.006 3.894 QT
38.17 3.566 38.17 3.175 QT
38.17 1.894 L
38.748 1.894 L
38.748 3.175 L
38.748 3.628 38.514 4.034 QT
38.28 4.441 37.889 4.683 QT
37.498 4.925 37.03 4.925 QT
36.451 4.925 36.022 4.464 QT
35.592 4.003 35.545 3.378 QT
35.186 4.128 34.459 4.573 QT
33.733 5.019 32.92 5.019 QT
32.155 5.019 31.412 4.8 QT
30.67 4.581 30.178 4.097 QT
29.686 3.612 29.686 2.831 QT
cp
31.311 2.831 M
31.311 3.534 31.826 4.019 QT
32.342 4.503 33.045 4.503 QT
33.701 4.503 34.225 4.175 QT
34.748 3.847 35.061 3.292 QT
35.373 2.737 35.373 2.128 QT
35.373 0.05 L
34.467 0.05 33.514 0.347 QT
32.561 0.644 31.936 1.276 QT
31.311 1.909 31.311 2.831 QT
cp
f
GR
GS
[0.75 0 0 0.75 122.27052 59.125] CT
N
46.337 4.8 M
46.118 4.8 46.118 4.581 QT
46.118 4.425 L
46.118 4.347 46.165 4.284 QT
51.759 -3.294 L
49.962 -3.294 L
49.118 -3.294 48.563 -3.184 QT
48.009 -3.075 47.649 -2.778 QT
47.29 -2.481 47.134 -1.958 QT
46.977 -1.434 46.977 -0.528 QT
46.399 -0.528 L
46.618 -3.825 L
53.321 -3.825 L
53.415 -3.825 53.477 -3.763 QT
53.54 -3.7 53.54 -3.606 QT
53.54 -3.481 L
53.54 -3.419 53.493 -3.341 QT
47.899 4.222 L
49.821 4.222 L
50.681 4.222 51.267 4.112 QT
51.852 4.003 52.259 3.597 QT
52.634 3.222 52.774 2.573 QT
52.915 1.925 52.993 0.987 QT
53.571 0.987 L
53.227 4.8 L
46.337 4.8 L
cp
f
GR
GS
[0.75 0 0 0.75 122.27052 59.125] CT
N
55.241 2.831 M
55.241 1.644 56.179 0.894 QT
57.116 0.144 58.429 -0.161 QT
59.741 -0.466 60.929 -0.466 QT
60.929 -1.278 L
60.929 -1.856 60.679 -2.403 QT
60.429 -2.95 59.944 -3.294 QT
59.46 -3.638 58.882 -3.638 QT
57.554 -3.638 56.866 -3.044 QT
57.241 -3.044 57.491 -2.755 QT
57.741 -2.466 57.741 -2.091 QT
57.741 -1.684 57.46 -1.403 QT
57.179 -1.122 56.788 -1.122 QT
56.382 -1.122 56.101 -1.403 QT
55.819 -1.684 55.819 -2.091 QT
55.819 -3.138 56.78 -3.653 QT
57.741 -4.169 58.882 -4.169 QT
59.694 -4.169 60.515 -3.817 QT
61.335 -3.466 61.859 -2.825 QT
62.382 -2.184 62.382 -1.325 QT
62.382 3.175 L
62.382 3.566 62.546 3.894 QT
62.71 4.222 63.069 4.222 QT
63.398 4.222 63.562 3.894 QT
63.726 3.566 63.726 3.175 QT
63.726 1.894 L
64.304 1.894 L
64.304 3.175 L
64.304 3.628 64.069 4.034 QT
63.835 4.441 63.444 4.683 QT
63.054 4.925 62.585 4.925 QT
62.007 4.925 61.577 4.464 QT
61.148 4.003 61.101 3.378 QT
60.741 4.128 60.015 4.573 QT
59.288 5.019 58.476 5.019 QT
57.71 5.019 56.968 4.8 QT
56.226 4.581 55.734 4.097 QT
55.241 3.612 55.241 2.831 QT
cp
56.866 2.831 M
56.866 3.534 57.382 4.019 QT
57.898 4.503 58.601 4.503 QT
59.257 4.503 59.78 4.175 QT
60.304 3.847 60.616 3.292 QT
60.929 2.737 60.929 2.128 QT
60.929 0.05 L
60.023 0.05 59.069 0.347 QT
58.116 0.644 57.491 1.276 QT
56.866 1.909 56.866 2.831 QT
cp
f
GR
GS
[0.75 0 0 0.75 122.27052 59.125] CT
N
73.189 4.8 M
73.189 -7.044 L
73.189 -7.575 73.033 -7.817 QT
72.877 -8.059 72.572 -8.106 QT
72.267 -8.153 71.627 -8.153 QT
71.627 -8.856 L
74.596 -9.075 L
74.596 -2.825 L
74.924 -3.184 75.369 -3.466 QT
75.814 -3.747 76.322 -3.895 QT
76.83 -4.044 77.346 -4.044 QT
78.252 -4.044 79.017 -3.677 QT
79.783 -3.309 80.353 -2.677 QT
80.924 -2.044 81.236 -1.224 QT
81.549 -0.403 81.549 0.487 QT
81.549 1.691 80.963 2.737 QT
80.377 3.784 79.353 4.401 QT
78.33 5.019 77.111 5.019 QT
76.346 5.019 75.635 4.628 QT
74.924 4.237 74.455 3.597 QT
73.767 4.8 L
73.189 4.8 L
cp
74.642 2.831 M
74.986 3.566 75.611 4.034 QT
76.236 4.503 76.986 4.503 QT
78.033 4.503 78.666 3.901 QT
79.299 3.3 79.556 2.394 QT
79.814 1.487 79.814 0.487 QT
79.814 -1.2 79.377 -2.091 QT
79.174 -2.481 78.838 -2.809 QT
78.502 -3.138 78.088 -3.333 QT
77.674 -3.528 77.221 -3.528 QT
76.408 -3.528 75.728 -3.099 QT
75.049 -2.669 74.642 -1.966 QT
74.642 2.831 L
cp
f
GR
GS
[0.75 0 0 0.75 122.27052 59.125] CT
N
82.738 4.8 M
82.738 4.097 L
83.425 4.097 83.863 3.987 QT
84.3 3.878 84.3 3.456 QT
84.3 -1.997 L
84.3 -2.528 84.144 -2.77 QT
83.988 -3.013 83.683 -3.067 QT
83.379 -3.122 82.738 -3.122 QT
82.738 -3.825 L
85.597 -4.044 L
85.597 -2.091 L
85.925 -2.95 86.519 -3.497 QT
87.113 -4.044 87.972 -4.044 QT
88.566 -4.044 89.035 -3.692 QT
89.504 -3.341 89.504 -2.763 QT
89.504 -2.403 89.246 -2.13 QT
88.988 -1.856 88.597 -1.856 QT
88.222 -1.856 87.965 -2.122 QT
87.707 -2.388 87.707 -2.763 QT
87.707 -3.294 88.082 -3.528 QT
87.972 -3.528 L
87.16 -3.528 86.644 -2.942 QT
86.129 -2.356 85.918 -1.481 QT
85.707 -0.606 85.707 0.175 QT
85.707 3.456 L
85.707 4.097 87.644 4.097 QT
87.644 4.8 L
82.738 4.8 L
cp
f
GR
GS
[0.75 0 0 0.75 122.27052 59.125] CT
N
91.844 -7.528 M
92.156 -7.997 L
94.5 -6.638 L
96.828 -7.997 L
97.141 -7.528 L
94.5 -5.497 L
91.844 -7.528 L
cp
f
GR
GS
[0.75 0 0 0.75 122.27052 59.125] CT
N
90.837 4.8 M
90.618 4.8 90.618 4.581 QT
90.618 4.425 L
90.618 4.347 90.665 4.284 QT
96.259 -3.294 L
94.462 -3.294 L
93.618 -3.294 93.063 -3.184 QT
92.509 -3.075 92.149 -2.778 QT
91.79 -2.481 91.634 -1.958 QT
91.478 -1.434 91.478 -0.528 QT
90.899 -0.528 L
91.118 -3.825 L
97.821 -3.825 L
97.915 -3.825 97.978 -3.763 QT
98.04 -3.7 98.04 -3.606 QT
98.04 -3.481 L
98.04 -3.419 97.993 -3.341 QT
92.399 4.222 L
94.321 4.222 L
95.181 4.222 95.767 4.112 QT
96.353 4.003 96.759 3.597 QT
97.134 3.222 97.274 2.573 QT
97.415 1.925 97.493 0.987 QT
98.071 0.987 L
97.728 4.8 L
90.837 4.8 L
cp
f
GR
GS
[0.75 0 0 0.75 122.27052 59.125] CT
N
103.835 5.019 M
102.648 5.019 101.671 4.378 QT
100.695 3.737 100.155 2.698 QT
99.616 1.659 99.616 0.487 QT
99.616 -0.731 100.202 -1.77 QT
100.788 -2.809 101.804 -3.427 QT
102.82 -4.044 104.038 -4.044 QT
104.773 -4.044 105.429 -3.731 QT
106.085 -3.419 106.57 -2.872 QT
106.57 -7.044 L
106.57 -7.575 106.405 -7.817 QT
106.241 -8.059 105.945 -8.106 QT
105.648 -8.153 105.007 -8.153 QT
105.007 -8.856 L
107.976 -9.075 L
107.976 2.987 L
107.976 3.503 108.132 3.745 QT
108.288 3.987 108.585 4.042 QT
108.882 4.097 109.523 4.097 QT
109.523 4.8 L
106.507 5.019 L
106.507 3.769 L
105.991 4.362 105.273 4.691 QT
104.554 5.019 103.835 5.019 QT
cp
101.788 3.066 M
102.132 3.722 102.702 4.112 QT
103.273 4.503 103.945 4.503 QT
104.773 4.503 105.468 4.019 QT
106.163 3.534 106.507 2.784 QT
106.507 -2.013 L
106.273 -2.45 105.913 -2.802 QT
105.554 -3.153 105.109 -3.341 QT
104.663 -3.528 104.163 -3.528 QT
103.132 -3.528 102.491 -2.934 QT
101.851 -2.341 101.601 -1.419 QT
101.351 -0.497 101.351 0.503 QT
101.351 1.3 101.429 1.894 QT
101.507 2.487 101.788 3.066 QT
cp
f
GR
GS
[0.75 0 0 0.75 122.27052 59.125] CT
N
111.844 -7.528 M
112.156 -7.997 L
114.5 -6.638 L
116.828 -7.997 L
117.141 -7.528 L
114.5 -5.497 L
111.844 -7.528 L
cp
f
GR
GS
[0.75 0 0 0.75 122.27052 59.125] CT
N
115.04 5.019 M
113.821 5.019 112.798 4.378 QT
111.774 3.737 111.196 2.675 QT
110.618 1.612 110.618 0.409 QT
110.618 -0.763 111.149 -1.817 QT
111.681 -2.872 112.634 -3.52 QT
113.587 -4.169 114.759 -4.169 QT
115.665 -4.169 116.345 -3.856 QT
117.024 -3.544 117.47 -2.997 QT
117.915 -2.45 118.134 -1.708 QT
118.353 -0.966 118.353 -0.091 QT
118.353 0.175 118.149 0.175 QT
112.368 0.175 L
112.368 0.394 L
112.368 2.05 113.032 3.245 QT
113.696 4.441 115.212 4.441 QT
115.821 4.441 116.345 4.167 QT
116.868 3.894 117.259 3.401 QT
117.649 2.909 117.774 2.362 QT
117.806 2.284 117.86 2.23 QT
117.915 2.175 117.978 2.175 QT
118.149 2.175 L
118.353 2.175 118.353 2.441 QT
118.071 3.566 117.134 4.292 QT
116.196 5.019 115.04 5.019 QT
cp
112.384 -0.325 M
116.946 -0.325 L
116.946 -1.075 116.735 -1.841 QT
116.524 -2.606 116.032 -3.122 QT
115.54 -3.638 114.759 -3.638 QT
113.618 -3.638 113.001 -2.575 QT
112.384 -1.513 112.384 -0.325 QT
cp
f
GR
GS
[0.75 0 0 0.75 122.27052 59.125] CT
N
119.538 4.8 M
119.538 4.097 L
120.226 4.097 120.663 3.987 QT
121.101 3.878 121.101 3.456 QT
121.101 -1.997 L
121.101 -2.528 120.945 -2.77 QT
120.788 -3.013 120.484 -3.067 QT
120.179 -3.122 119.538 -3.122 QT
119.538 -3.825 L
122.445 -4.044 L
122.445 -2.091 L
122.835 -2.95 123.624 -3.497 QT
124.413 -4.044 125.335 -4.044 QT
126.726 -4.044 127.429 -3.38 QT
128.132 -2.716 128.132 -1.341 QT
128.132 3.456 L
128.132 3.878 128.57 3.987 QT
129.007 4.097 129.695 4.097 QT
129.695 4.8 L
125.101 4.8 L
125.101 4.097 L
125.788 4.097 126.226 3.987 QT
126.663 3.878 126.663 3.456 QT
126.663 -1.278 L
126.663 -2.263 126.382 -2.895 QT
126.101 -3.528 125.226 -3.528 QT
124.07 -3.528 123.32 -2.599 QT
122.57 -1.669 122.57 -0.481 QT
122.57 3.456 L
122.57 3.878 123.007 3.987 QT
123.445 4.097 124.116 4.097 QT
124.116 4.8 L
119.538 4.8 L
cp
f
GR
GS
[0.75 0 0 0.75 122.27052 59.125] CT
N
131.943 -5.778 M
134.333 -8.856 L
134.568 -9.169 134.912 -9.169 QT
135.224 -9.169 135.451 -8.942 QT
135.677 -8.716 135.677 -8.403 QT
135.677 -8.091 135.396 -7.841 QT
132.349 -5.372 L
131.943 -5.778 L
cp
f
GR
GS
[0.75 0 0 0.75 122.27052 59.125] CT
N
130.665 4.8 M
130.665 4.097 L
131.353 4.097 131.79 3.987 QT
132.228 3.878 132.228 3.456 QT
132.228 -1.997 L
132.228 -2.763 131.931 -2.942 QT
131.634 -3.122 130.759 -3.122 QT
130.759 -3.825 L
133.634 -4.044 L
133.634 3.456 L
133.634 3.878 134.017 3.987 QT
134.399 4.097 135.04 4.097 QT
135.04 4.8 L
130.665 4.8 L
cp
f
GR
GS
[0.75 0 0 0.75 0 0.25] CT
0.851 0.325 0.098 RC
[8 8] 0 setdash
2 LJ
2.667 LW
N
120.002 78.5 M
160.026 78.5 L
S
GR
GS
[0.75 0 0 0.75 122.27052 77.5] CT
N
/f-1983251996{4.984 5.019 M
3.766 5.019 2.781 4.394 QT
1.797 3.769 1.234 2.714 QT
0.672 1.659 0.672 0.487 QT
0.672 -0.7 1.227 -1.786 QT
1.781 -2.872 2.773 -3.52 QT
3.766 -4.169 4.984 -4.169 QT
6.156 -4.169 7.117 -3.708 QT
8.078 -3.247 8.078 -2.2 QT
8.078 -1.809 7.797 -1.52 QT
7.516 -1.231 7.125 -1.231 QT
6.719 -1.231 6.438 -1.52 QT
6.156 -1.809 6.156 -2.2 QT
6.156 -2.559 6.383 -2.817 QT
6.609 -3.075 6.938 -3.138 QT
6.25 -3.575 5 -3.575 QT
4.047 -3.575 3.461 -2.942 QT
2.875 -2.309 2.641 -1.372 QT
2.406 -0.434 2.406 0.487 QT
2.406 1.456 2.695 2.355 QT
2.984 3.253 3.625 3.847 QT
4.266 4.441 5.219 4.441 QT
6.172 4.441 6.836 3.855 QT
7.5 3.269 7.75 2.331 QT
7.75 2.222 7.906 2.222 QT
8.141 2.222 L
8.203 2.222 8.25 2.276 QT
8.297 2.331 8.297 2.394 QT
8.297 2.456 L
8 3.644 7.102 4.331 QT
6.203 5.019 4.984 5.019 QT
cp}def
f-1983251996
f
GR
GS
[0.75 0 0 0.75 122.27052 77.5] CT
N
/f265761673{13.873 5.019 M
12.655 5.019 11.631 4.378 QT
10.608 3.737 10.03 2.675 QT
9.451 1.612 9.451 0.409 QT
9.451 -0.763 9.983 -1.817 QT
10.514 -2.872 11.467 -3.52 QT
12.42 -4.169 13.592 -4.169 QT
14.498 -4.169 15.178 -3.856 QT
15.858 -3.544 16.303 -2.997 QT
16.748 -2.45 16.967 -1.708 QT
17.186 -0.966 17.186 -0.091 QT
17.186 0.175 16.983 0.175 QT
11.201 0.175 L
11.201 0.394 L
11.201 2.05 11.865 3.245 QT
12.53 4.441 14.045 4.441 QT
14.655 4.441 15.178 4.167 QT
15.701 3.894 16.092 3.401 QT
16.483 2.909 16.608 2.362 QT
16.639 2.284 16.694 2.23 QT
16.748 2.175 16.811 2.175 QT
16.983 2.175 L
17.186 2.175 17.186 2.441 QT
16.905 3.566 15.967 4.292 QT
15.03 5.019 13.873 5.019 QT
cp
11.217 -0.325 M
15.78 -0.325 L
15.78 -1.075 15.569 -1.841 QT
15.358 -2.606 14.865 -3.122 QT
14.373 -3.638 13.592 -3.638 QT
12.451 -3.638 11.834 -2.575 QT
11.217 -1.513 11.217 -0.325 QT
cp}def
f265761673
f
GR
GS
[0.75 0 0 0.75 122.27052 77.5] CT
N
/f-1882016182{18.372 4.8 M
18.372 4.097 L
19.059 4.097 19.497 3.987 QT
19.934 3.878 19.934 3.456 QT
19.934 -1.997 L
19.934 -2.528 19.778 -2.77 QT
19.622 -3.013 19.317 -3.067 QT
19.012 -3.122 18.372 -3.122 QT
18.372 -3.825 L
21.278 -4.044 L
21.278 -2.091 L
21.668 -2.95 22.457 -3.497 QT
23.247 -4.044 24.168 -4.044 QT
25.559 -4.044 26.262 -3.38 QT
26.965 -2.716 26.965 -1.341 QT
26.965 3.456 L
26.965 3.878 27.403 3.987 QT
27.84 4.097 28.528 4.097 QT
28.528 4.8 L
23.934 4.8 L
23.934 4.097 L
24.622 4.097 25.059 3.987 QT
25.497 3.878 25.497 3.456 QT
25.497 -1.278 L
25.497 -2.263 25.215 -2.895 QT
24.934 -3.528 24.059 -3.528 QT
22.903 -3.528 22.153 -2.599 QT
21.403 -1.669 21.403 -0.481 QT
21.403 3.456 L
21.403 3.878 21.84 3.987 QT
22.278 4.097 22.95 4.097 QT
22.95 4.8 L
18.372 4.8 L
cp}def
f-1882016182
f
GR
GS
[0.75 0 0 0.75 122.27052 77.5] CT
N
/f-1660582890{29.686 2.831 M
29.686 1.644 30.623 0.894 QT
31.561 0.144 32.873 -0.161 QT
34.186 -0.466 35.373 -0.466 QT
35.373 -1.278 L
35.373 -1.856 35.123 -2.403 QT
34.873 -2.95 34.389 -3.294 QT
33.905 -3.638 33.326 -3.638 QT
31.998 -3.638 31.311 -3.044 QT
31.686 -3.044 31.936 -2.755 QT
32.186 -2.466 32.186 -2.091 QT
32.186 -1.684 31.905 -1.403 QT
31.623 -1.122 31.233 -1.122 QT
30.826 -1.122 30.545 -1.403 QT
30.264 -1.684 30.264 -2.091 QT
30.264 -3.138 31.225 -3.653 QT
32.186 -4.169 33.326 -4.169 QT
34.139 -4.169 34.959 -3.817 QT
35.78 -3.466 36.303 -2.825 QT
36.826 -2.184 36.826 -1.325 QT
36.826 3.175 L
36.826 3.566 36.99 3.894 QT
37.155 4.222 37.514 4.222 QT
37.842 4.222 38.006 3.894 QT
38.17 3.566 38.17 3.175 QT
38.17 1.894 L
38.748 1.894 L
38.748 3.175 L
38.748 3.628 38.514 4.034 QT
38.28 4.441 37.889 4.683 QT
37.498 4.925 37.03 4.925 QT
36.451 4.925 36.022 4.464 QT
35.592 4.003 35.545 3.378 QT
35.186 4.128 34.459 4.573 QT
33.733 5.019 32.92 5.019 QT
32.155 5.019 31.412 4.8 QT
30.67 4.581 30.178 4.097 QT
29.686 3.612 29.686 2.831 QT
cp
31.311 2.831 M
31.311 3.534 31.826 4.019 QT
32.342 4.503 33.045 4.503 QT
33.701 4.503 34.225 4.175 QT
34.748 3.847 35.061 3.292 QT
35.373 2.737 35.373 2.128 QT
35.373 0.05 L
34.467 0.05 33.514 0.347 QT
32.561 0.644 31.936 1.276 QT
31.311 1.909 31.311 2.831 QT
cp}def
f-1660582890
f
GR
GS
[0.75 0 0 0.75 122.27052 77.5] CT
N
/f1397089790{46.337 4.8 M
46.118 4.8 46.118 4.581 QT
46.118 4.425 L
46.118 4.347 46.165 4.284 QT
51.759 -3.294 L
49.962 -3.294 L
49.118 -3.294 48.563 -3.184 QT
48.009 -3.075 47.649 -2.778 QT
47.29 -2.481 47.134 -1.958 QT
46.977 -1.434 46.977 -0.528 QT
46.399 -0.528 L
46.618 -3.825 L
53.321 -3.825 L
53.415 -3.825 53.477 -3.763 QT
53.54 -3.7 53.54 -3.606 QT
53.54 -3.481 L
53.54 -3.419 53.493 -3.341 QT
47.899 4.222 L
49.821 4.222 L
50.681 4.222 51.267 4.112 QT
51.852 4.003 52.259 3.597 QT
52.634 3.222 52.774 2.573 QT
52.915 1.925 52.993 0.987 QT
53.571 0.987 L
53.227 4.8 L
46.337 4.8 L
cp}def
f1397089790
f
GR
GS
[0.75 0 0 0.75 122.27052 77.5] CT
N
/f-649568178{55.241 2.831 M
55.241 1.644 56.179 0.894 QT
57.116 0.144 58.429 -0.161 QT
59.741 -0.466 60.929 -0.466 QT
60.929 -1.278 L
60.929 -1.856 60.679 -2.403 QT
60.429 -2.95 59.944 -3.294 QT
59.46 -3.638 58.882 -3.638 QT
57.554 -3.638 56.866 -3.044 QT
57.241 -3.044 57.491 -2.755 QT
57.741 -2.466 57.741 -2.091 QT
57.741 -1.684 57.46 -1.403 QT
57.179 -1.122 56.788 -1.122 QT
56.382 -1.122 56.101 -1.403 QT
55.819 -1.684 55.819 -2.091 QT
55.819 -3.138 56.78 -3.653 QT
57.741 -4.169 58.882 -4.169 QT
59.694 -4.169 60.515 -3.817 QT
61.335 -3.466 61.859 -2.825 QT
62.382 -2.184 62.382 -1.325 QT
62.382 3.175 L
62.382 3.566 62.546 3.894 QT
62.71 4.222 63.069 4.222 QT
63.398 4.222 63.562 3.894 QT
63.726 3.566 63.726 3.175 QT
63.726 1.894 L
64.304 1.894 L
64.304 3.175 L
64.304 3.628 64.069 4.034 QT
63.835 4.441 63.444 4.683 QT
63.054 4.925 62.585 4.925 QT
62.007 4.925 61.577 4.464 QT
61.148 4.003 61.101 3.378 QT
60.741 4.128 60.015 4.573 QT
59.288 5.019 58.476 5.019 QT
57.71 5.019 56.968 4.8 QT
56.226 4.581 55.734 4.097 QT
55.241 3.612 55.241 2.831 QT
cp
56.866 2.831 M
56.866 3.534 57.382 4.019 QT
57.898 4.503 58.601 4.503 QT
59.257 4.503 59.78 4.175 QT
60.304 3.847 60.616 3.292 QT
60.929 2.737 60.929 2.128 QT
60.929 0.05 L
60.023 0.05 59.069 0.347 QT
58.116 0.644 57.491 1.276 QT
56.866 1.909 56.866 2.831 QT
cp}def
f-649568178
f
GR
GS
[0.75 0 0 0.75 122.27052 77.5] CT
N
/f-1529780539{71.627 8.675 M
71.627 7.987 L
72.314 7.987 72.752 7.87 QT
73.189 7.753 73.189 7.347 QT
73.189 -2.294 L
73.189 -2.841 72.799 -2.981 QT
72.408 -3.122 71.627 -3.122 QT
71.627 -3.825 L
74.596 -4.044 L
74.596 -2.794 L
75.142 -3.403 75.869 -3.724 QT
76.596 -4.044 77.408 -4.044 QT
78.596 -4.044 79.541 -3.403 QT
80.486 -2.763 81.017 -1.724 QT
81.549 -0.684 81.549 0.487 QT
81.549 1.691 80.963 2.737 QT
80.377 3.784 79.353 4.401 QT
78.33 5.019 77.111 5.019 QT
75.658 5.019 74.642 3.847 QT
74.642 7.347 L
74.642 7.753 75.088 7.87 QT
75.533 7.987 76.205 7.987 QT
76.205 8.675 L
71.627 8.675 L
cp
74.642 2.862 M
75.002 3.566 75.627 4.034 QT
76.252 4.503 76.986 4.503 QT
77.689 4.503 78.221 4.128 QT
78.752 3.753 79.111 3.128 QT
79.471 2.503 79.642 1.816 QT
79.814 1.128 79.814 0.487 QT
79.814 -0.325 79.525 -1.255 QT
79.236 -2.184 78.642 -2.825 QT
78.049 -3.466 77.221 -3.466 QT
76.408 -3.466 75.728 -3.052 QT
75.049 -2.638 74.642 -1.919 QT
74.642 2.862 L
cp}def
f-1529780539
f
GR
GS
[0.75 0 0 0.75 122.27052 77.5] CT
N
/f1724082257{83.483 -7.528 M
83.795 -7.997 L
86.139 -6.638 L
88.467 -7.997 L
88.78 -7.528 L
86.139 -5.497 L
83.483 -7.528 L
cp}def
f1724082257
f
GR
GS
[0.75 0 0 0.75 122.27052 77.5] CT
N
/f1931575791{82.738 4.8 M
82.738 4.097 L
83.425 4.097 83.863 3.987 QT
84.3 3.878 84.3 3.456 QT
84.3 -1.997 L
84.3 -2.528 84.144 -2.77 QT
83.988 -3.013 83.683 -3.067 QT
83.379 -3.122 82.738 -3.122 QT
82.738 -3.825 L
85.597 -4.044 L
85.597 -2.091 L
85.925 -2.95 86.519 -3.497 QT
87.113 -4.044 87.972 -4.044 QT
88.566 -4.044 89.035 -3.692 QT
89.504 -3.341 89.504 -2.763 QT
89.504 -2.403 89.246 -2.13 QT
88.988 -1.856 88.597 -1.856 QT
88.222 -1.856 87.965 -2.122 QT
87.707 -2.388 87.707 -2.763 QT
87.707 -3.294 88.082 -3.528 QT
87.972 -3.528 L
87.16 -3.528 86.644 -2.942 QT
86.129 -2.356 85.918 -1.481 QT
85.707 -0.606 85.707 0.175 QT
85.707 3.456 L
85.707 4.097 87.644 4.097 QT
87.644 4.8 L
82.738 4.8 L
cp}def
f1931575791
f
GR
GS
[0.75 0 0 0.75 122.27052 77.5] CT
N
/f569440830{95.04 5.019 M
93.821 5.019 92.798 4.378 QT
91.774 3.737 91.196 2.675 QT
90.618 1.612 90.618 0.409 QT
90.618 -0.763 91.149 -1.817 QT
91.681 -2.872 92.634 -3.52 QT
93.587 -4.169 94.759 -4.169 QT
95.665 -4.169 96.345 -3.856 QT
97.024 -3.544 97.47 -2.997 QT
97.915 -2.45 98.134 -1.708 QT
98.353 -0.966 98.353 -0.091 QT
98.353 0.175 98.149 0.175 QT
92.368 0.175 L
92.368 0.394 L
92.368 2.05 93.032 3.245 QT
93.696 4.441 95.212 4.441 QT
95.821 4.441 96.345 4.167 QT
96.868 3.894 97.259 3.401 QT
97.649 2.909 97.774 2.362 QT
97.806 2.284 97.86 2.23 QT
97.915 2.175 97.978 2.175 QT
98.149 2.175 L
98.353 2.175 98.353 2.441 QT
98.071 3.566 97.134 4.292 QT
96.196 5.019 95.04 5.019 QT
cp
92.384 -0.325 M
96.946 -0.325 L
96.946 -1.075 96.735 -1.841 QT
96.524 -2.606 96.032 -3.122 QT
95.54 -3.638 94.759 -3.638 QT
93.618 -3.638 93.001 -2.575 QT
92.384 -1.513 92.384 -0.325 QT
cp}def
f569440830
f
GR
GS
[0.75 0 0 0.75 122.27052 77.5] CT
N
/f505479896{103.835 5.019 M
102.648 5.019 101.671 4.378 QT
100.695 3.737 100.155 2.698 QT
99.616 1.659 99.616 0.487 QT
99.616 -0.731 100.202 -1.77 QT
100.788 -2.809 101.804 -3.427 QT
102.82 -4.044 104.038 -4.044 QT
104.773 -4.044 105.429 -3.731 QT
106.085 -3.419 106.57 -2.872 QT
106.57 -7.044 L
106.57 -7.575 106.405 -7.817 QT
106.241 -8.059 105.945 -8.106 QT
105.648 -8.153 105.007 -8.153 QT
105.007 -8.856 L
107.976 -9.075 L
107.976 2.987 L
107.976 3.503 108.132 3.745 QT
108.288 3.987 108.585 4.042 QT
108.882 4.097 109.523 4.097 QT
109.523 4.8 L
106.507 5.019 L
106.507 3.769 L
105.991 4.362 105.273 4.691 QT
104.554 5.019 103.835 5.019 QT
cp
101.788 3.066 M
102.132 3.722 102.702 4.112 QT
103.273 4.503 103.945 4.503 QT
104.773 4.503 105.468 4.019 QT
106.163 3.534 106.507 2.784 QT
106.507 -2.013 L
106.273 -2.45 105.913 -2.802 QT
105.554 -3.153 105.109 -3.341 QT
104.663 -3.528 104.163 -3.528 QT
103.132 -3.528 102.491 -2.934 QT
101.851 -2.341 101.601 -1.419 QT
101.351 -0.497 101.351 0.503 QT
101.351 1.3 101.429 1.894 QT
101.507 2.487 101.788 3.066 QT
cp}def
f505479896
f
GR
GS
[0.75 0 0 0.75 122.27052 77.5] CT
N
/f1498646898{111.844 -7.528 M
112.156 -7.997 L
114.5 -6.638 L
116.828 -7.997 L
117.141 -7.528 L
114.5 -5.497 L
111.844 -7.528 L
cp}def
f1498646898
f
GR
GS
[0.75 0 0 0.75 122.27052 77.5] CT
N
/f-1149792252{115.04 5.019 M
113.821 5.019 112.837 4.394 QT
111.853 3.769 111.29 2.714 QT
110.728 1.659 110.728 0.487 QT
110.728 -0.7 111.282 -1.786 QT
111.837 -2.872 112.829 -3.52 QT
113.821 -4.169 115.04 -4.169 QT
116.212 -4.169 117.173 -3.708 QT
118.134 -3.247 118.134 -2.2 QT
118.134 -1.809 117.853 -1.52 QT
117.571 -1.231 117.181 -1.231 QT
116.774 -1.231 116.493 -1.52 QT
116.212 -1.809 116.212 -2.2 QT
116.212 -2.559 116.439 -2.817 QT
116.665 -3.075 116.993 -3.138 QT
116.306 -3.575 115.056 -3.575 QT
114.103 -3.575 113.517 -2.942 QT
112.931 -2.309 112.696 -1.372 QT
112.462 -0.434 112.462 0.487 QT
112.462 1.456 112.751 2.355 QT
113.04 3.253 113.681 3.847 QT
114.321 4.441 115.274 4.441 QT
116.228 4.441 116.892 3.855 QT
117.556 3.269 117.806 2.331 QT
117.806 2.222 117.962 2.222 QT
118.196 2.222 L
118.259 2.222 118.306 2.276 QT
118.353 2.331 118.353 2.394 QT
118.353 2.456 L
118.056 3.644 117.157 4.331 QT
116.259 5.019 115.04 5.019 QT
cp}def
f-1149792252
f
GR
GS
[0.75 0 0 0.75 122.27052 77.5] CT
N
/f467272633{119.741 2.831 M
119.741 1.644 120.679 0.894 QT
121.616 0.144 122.929 -0.161 QT
124.241 -0.466 125.429 -0.466 QT
125.429 -1.278 L
125.429 -1.856 125.179 -2.403 QT
124.929 -2.95 124.445 -3.294 QT
123.96 -3.638 123.382 -3.638 QT
122.054 -3.638 121.366 -3.044 QT
121.741 -3.044 121.991 -2.755 QT
122.241 -2.466 122.241 -2.091 QT
122.241 -1.684 121.96 -1.403 QT
121.679 -1.122 121.288 -1.122 QT
120.882 -1.122 120.601 -1.403 QT
120.32 -1.684 120.32 -2.091 QT
120.32 -3.138 121.281 -3.653 QT
122.241 -4.169 123.382 -4.169 QT
124.195 -4.169 125.015 -3.817 QT
125.835 -3.466 126.359 -2.825 QT
126.882 -2.184 126.882 -1.325 QT
126.882 3.175 L
126.882 3.566 127.046 3.894 QT
127.21 4.222 127.57 4.222 QT
127.898 4.222 128.062 3.894 QT
128.226 3.566 128.226 3.175 QT
128.226 1.894 L
128.804 1.894 L
128.804 3.175 L
128.804 3.628 128.57 4.034 QT
128.335 4.441 127.945 4.683 QT
127.554 4.925 127.085 4.925 QT
126.507 4.925 126.077 4.464 QT
125.648 4.003 125.601 3.378 QT
125.241 4.128 124.515 4.573 QT
123.788 5.019 122.976 5.019 QT
122.21 5.019 121.468 4.8 QT
120.726 4.581 120.234 4.097 QT
119.741 3.612 119.741 2.831 QT
cp
121.366 2.831 M
121.366 3.534 121.882 4.019 QT
122.398 4.503 123.101 4.503 QT
123.757 4.503 124.281 4.175 QT
124.804 3.847 125.116 3.292 QT
125.429 2.737 125.429 2.128 QT
125.429 0.05 L
124.523 0.05 123.57 0.347 QT
122.616 0.644 121.991 1.276 QT
121.366 1.909 121.366 2.831 QT
cp}def
f467272633
f
GR
GS
[0.75 0 0 0.75 122.27052 77.5] CT
N
/f-986605712{129.616 4.862 M
129.616 1.597 L
129.616 1.441 129.788 1.441 QT
130.023 1.441 L
130.148 1.441 130.179 1.597 QT
130.741 4.503 132.882 4.503 QT
133.835 4.503 134.468 4.073 QT
135.101 3.644 135.101 2.737 QT
135.101 2.097 134.609 1.644 QT
134.116 1.191 133.429 1.019 QT
132.085 0.753 L
131.413 0.612 130.866 0.308 QT
130.32 0.003 129.968 -0.497 QT
129.616 -0.997 129.616 -1.669 QT
129.616 -2.544 130.077 -3.106 QT
130.538 -3.669 131.281 -3.919 QT
132.023 -4.169 132.882 -4.169 QT
133.913 -4.169 134.663 -3.622 QT
135.241 -4.122 L
135.241 -4.169 135.335 -4.169 QT
135.491 -4.169 L
135.554 -4.169 135.601 -4.114 QT
135.648 -4.059 135.648 -3.997 QT
135.648 -1.388 L
135.648 -1.2 135.491 -1.2 QT
135.241 -1.2 L
135.07 -1.2 135.07 -1.388 QT
135.07 -2.434 134.491 -3.067 QT
133.913 -3.7 132.866 -3.7 QT
131.96 -3.7 131.304 -3.364 QT
130.648 -3.028 130.648 -2.216 QT
130.648 -1.669 131.116 -1.309 QT
131.585 -0.95 132.226 -0.794 QT
133.585 -0.544 L
134.273 -0.388 134.859 -0.013 QT
135.445 0.362 135.796 0.925 QT
136.148 1.487 136.148 2.206 QT
136.148 2.925 135.898 3.456 QT
135.648 3.987 135.202 4.339 QT
134.757 4.691 134.148 4.855 QT
133.538 5.019 132.882 5.019 QT
131.632 5.019 130.741 4.191 QT
130.007 4.972 L
130.007 5.019 129.898 5.019 QT
129.788 5.019 L
129.616 5.019 129.616 4.862 QT
cp}def
f-986605712
f
GR
GS
[0.75 0 0 0.75 122.27052 77.5] CT
N
/f-1315281312{137.427 4.8 M
137.427 4.097 L
138.115 4.097 138.552 3.987 QT
138.99 3.878 138.99 3.456 QT
138.99 -1.997 L
138.99 -2.528 138.833 -2.77 QT
138.677 -3.013 138.373 -3.067 QT
138.068 -3.122 137.427 -3.122 QT
137.427 -3.825 L
140.333 -4.044 L
140.333 -2.091 L
140.724 -2.95 141.513 -3.497 QT
142.302 -4.044 143.224 -4.044 QT
144.615 -4.044 145.318 -3.38 QT
146.021 -2.716 146.021 -1.341 QT
146.021 3.456 L
146.021 3.878 146.458 3.987 QT
146.896 4.097 147.583 4.097 QT
147.583 4.8 L
142.99 4.8 L
142.99 4.097 L
143.677 4.097 144.115 3.987 QT
144.552 3.878 144.552 3.456 QT
144.552 -1.278 L
144.552 -2.263 144.271 -2.895 QT
143.99 -3.528 143.115 -3.528 QT
141.958 -3.528 141.208 -2.599 QT
140.458 -1.669 140.458 -0.481 QT
140.458 3.456 L
140.458 3.878 140.896 3.987 QT
141.333 4.097 142.005 4.097 QT
142.005 4.8 L
137.427 4.8 L
cp}def
f-1315281312
f
GR
GS
[0.75 0 0 0.75 122.27052 77.5] CT
N
/f-1670348492{151.498 -5.778 M
153.889 -8.856 L
154.123 -9.169 154.467 -9.169 QT
154.78 -9.169 155.006 -8.942 QT
155.233 -8.716 155.233 -8.403 QT
155.233 -8.091 154.952 -7.841 QT
151.905 -5.372 L
151.498 -5.778 L
cp}def
f-1670348492
f
GR
GS
[0.75 0 0 0.75 122.27052 77.5] CT
N
/f55200843{152.929 5.019 M
151.71 5.019 150.687 4.378 QT
149.663 3.737 149.085 2.675 QT
148.507 1.612 148.507 0.409 QT
148.507 -0.763 149.038 -1.817 QT
149.57 -2.872 150.523 -3.52 QT
151.476 -4.169 152.648 -4.169 QT
153.554 -4.169 154.234 -3.856 QT
154.913 -3.544 155.359 -2.997 QT
155.804 -2.45 156.023 -1.708 QT
156.242 -0.966 156.242 -0.091 QT
156.242 0.175 156.038 0.175 QT
150.257 0.175 L
150.257 0.394 L
150.257 2.05 150.921 3.245 QT
151.585 4.441 153.101 4.441 QT
153.71 4.441 154.234 4.167 QT
154.757 3.894 155.148 3.401 QT
155.538 2.909 155.663 2.362 QT
155.695 2.284 155.749 2.23 QT
155.804 2.175 155.867 2.175 QT
156.038 2.175 L
156.242 2.175 156.242 2.441 QT
155.96 3.566 155.023 4.292 QT
154.085 5.019 152.929 5.019 QT
cp
150.273 -0.325 M
154.835 -0.325 L
154.835 -1.075 154.624 -1.841 QT
154.413 -2.606 153.921 -3.122 QT
153.429 -3.638 152.648 -3.638 QT
151.507 -3.638 150.89 -2.575 QT
150.273 -1.513 150.273 -0.325 QT
cp}def
f55200843
f
GR
GS
[0.75 0 0 0.75 122.27052 77.5] CT
N
/f938515561{164.172 4.862 M
164.172 1.597 L
164.172 1.441 164.344 1.441 QT
164.578 1.441 L
164.703 1.441 164.735 1.597 QT
165.297 4.503 167.438 4.503 QT
168.391 4.503 169.024 4.073 QT
169.656 3.644 169.656 2.737 QT
169.656 2.097 169.164 1.644 QT
168.672 1.191 167.985 1.019 QT
166.641 0.753 L
165.969 0.612 165.422 0.308 QT
164.875 0.003 164.524 -0.497 QT
164.172 -0.997 164.172 -1.669 QT
164.172 -2.544 164.633 -3.106 QT
165.094 -3.669 165.836 -3.919 QT
166.578 -4.169 167.438 -4.169 QT
168.469 -4.169 169.219 -3.622 QT
169.797 -4.122 L
169.797 -4.169 169.891 -4.169 QT
170.047 -4.169 L
170.11 -4.169 170.156 -4.114 QT
170.203 -4.059 170.203 -3.997 QT
170.203 -1.388 L
170.203 -1.2 170.047 -1.2 QT
169.797 -1.2 L
169.625 -1.2 169.625 -1.388 QT
169.625 -2.434 169.047 -3.067 QT
168.469 -3.7 167.422 -3.7 QT
166.516 -3.7 165.86 -3.364 QT
165.203 -3.028 165.203 -2.216 QT
165.203 -1.669 165.672 -1.309 QT
166.141 -0.95 166.781 -0.794 QT
168.141 -0.544 L
168.828 -0.388 169.414 -0.013 QT
170 0.362 170.352 0.925 QT
170.703 1.487 170.703 2.206 QT
170.703 2.925 170.453 3.456 QT
170.203 3.987 169.758 4.339 QT
169.313 4.691 168.703 4.855 QT
168.094 5.019 167.438 5.019 QT
166.188 5.019 165.297 4.191 QT
164.563 4.972 L
164.563 5.019 164.453 5.019 QT
164.344 5.019 L
164.172 5.019 164.172 4.862 QT
cp}def
f938515561
f
GR
GS
[0.75 0 0 0.75 122.27052 77.5] CT
N
/f1230812839{171.905 8.675 M
171.905 7.987 L
172.592 7.987 173.03 7.87 QT
173.467 7.753 173.467 7.347 QT
173.467 -2.294 L
173.467 -2.841 173.077 -2.981 QT
172.686 -3.122 171.905 -3.122 QT
171.905 -3.825 L
174.873 -4.044 L
174.873 -2.794 L
175.42 -3.403 176.147 -3.724 QT
176.873 -4.044 177.686 -4.044 QT
178.873 -4.044 179.819 -3.403 QT
180.764 -2.763 181.295 -1.724 QT
181.827 -0.684 181.827 0.487 QT
181.827 1.691 181.241 2.737 QT
180.655 3.784 179.631 4.401 QT
178.608 5.019 177.389 5.019 QT
175.936 5.019 174.92 3.847 QT
174.92 7.347 L
174.92 7.753 175.366 7.87 QT
175.811 7.987 176.483 7.987 QT
176.483 8.675 L
171.905 8.675 L
cp
174.92 2.862 M
175.28 3.566 175.905 4.034 QT
176.53 4.503 177.264 4.503 QT
177.967 4.503 178.498 4.128 QT
179.03 3.753 179.389 3.128 QT
179.748 2.503 179.92 1.816 QT
180.092 1.128 180.092 0.487 QT
180.092 -0.325 179.803 -1.255 QT
179.514 -2.184 178.92 -2.825 QT
178.327 -3.466 177.498 -3.466 QT
176.686 -3.466 176.006 -3.052 QT
175.327 -2.638 174.92 -1.919 QT
174.92 2.862 L
cp}def
f1230812839
f
GR
GS
[0.75 0 0 0.75 122.27052 77.5] CT
N
/f983854{184.656 2.409 M
184.656 -1.997 L
184.656 -2.528 184.5 -2.77 QT
184.344 -3.013 184.039 -3.067 QT
183.735 -3.122 183.094 -3.122 QT
183.094 -3.825 L
186.125 -4.044 L
186.125 2.409 L
186.125 3.191 186.235 3.628 QT
186.344 4.066 186.711 4.284 QT
187.078 4.503 187.875 4.503 QT
188.953 4.503 189.586 3.605 QT
190.219 2.706 190.219 1.55 QT
190.219 -1.997 L
190.219 -2.528 190.055 -2.77 QT
189.891 -3.013 189.594 -3.067 QT
189.297 -3.122 188.656 -3.122 QT
188.656 -3.825 L
191.688 -4.044 L
191.688 2.987 L
191.688 3.503 191.844 3.745 QT
192 3.987 192.305 4.042 QT
192.61 4.097 193.25 4.097 QT
193.25 4.8 L
190.281 5.019 L
190.281 3.331 L
189.906 4.081 189.242 4.55 QT
188.578 5.019 187.781 5.019 QT
186.344 5.019 185.5 4.409 QT
184.656 3.8 184.656 2.409 QT
cp}def
f983854
f
GR
GS
[0.75 0 0 0.75 122.27052 77.5] CT
N
/f-2111252456{194.9 -7.528 M
195.212 -7.997 L
197.556 -6.638 L
199.884 -7.997 L
200.196 -7.528 L
197.556 -5.497 L
194.9 -7.528 L
cp}def
f-2111252456
f
GR
GS
[0.75 0 0 0.75 122.27052 77.5] CT
N
/f-1297267303{194.283 4.862 M
194.283 1.597 L
194.283 1.441 194.455 1.441 QT
194.689 1.441 L
194.814 1.441 194.846 1.597 QT
195.408 4.503 197.549 4.503 QT
198.502 4.503 199.135 4.073 QT
199.768 3.644 199.768 2.737 QT
199.768 2.097 199.275 1.644 QT
198.783 1.191 198.096 1.019 QT
196.752 0.753 L
196.08 0.612 195.533 0.308 QT
194.986 0.003 194.635 -0.497 QT
194.283 -0.997 194.283 -1.669 QT
194.283 -2.544 194.744 -3.106 QT
195.205 -3.669 195.947 -3.919 QT
196.689 -4.169 197.549 -4.169 QT
198.58 -4.169 199.33 -3.622 QT
199.908 -4.122 L
199.908 -4.169 200.002 -4.169 QT
200.158 -4.169 L
200.221 -4.169 200.268 -4.114 QT
200.314 -4.059 200.314 -3.997 QT
200.314 -1.388 L
200.314 -1.2 200.158 -1.2 QT
199.908 -1.2 L
199.736 -1.2 199.736 -1.388 QT
199.736 -2.434 199.158 -3.067 QT
198.58 -3.7 197.533 -3.7 QT
196.627 -3.7 195.971 -3.364 QT
195.314 -3.028 195.314 -2.216 QT
195.314 -1.669 195.783 -1.309 QT
196.252 -0.95 196.893 -0.794 QT
198.252 -0.544 L
198.939 -0.388 199.525 -0.013 QT
200.111 0.362 200.463 0.925 QT
200.814 1.487 200.814 2.206 QT
200.814 2.925 200.564 3.456 QT
200.314 3.987 199.869 4.339 QT
199.424 4.691 198.814 4.855 QT
198.205 5.019 197.549 5.019 QT
196.299 5.019 195.408 4.191 QT
194.674 4.972 L
194.674 5.019 194.564 5.019 QT
194.455 5.019 L
194.283 5.019 194.283 4.862 QT
cp}def
f-1297267303
f
GR
GS
[0.75 0 0 0.75 122.27052 77.5] CT
N
/f-726111576{203.547 2.394 M
203.547 -3.122 L
201.875 -3.122 L
201.875 -3.638 L
203.188 -3.638 203.805 -4.856 QT
204.422 -6.075 204.422 -7.513 QT
205 -7.513 L
205 -3.825 L
207.813 -3.825 L
207.813 -3.122 L
205 -3.122 L
205 2.362 L
205 3.191 205.274 3.816 QT
205.547 4.441 206.281 4.441 QT
206.953 4.441 207.258 3.776 QT
207.563 3.112 207.563 2.362 QT
207.563 1.175 L
208.141 1.175 L
208.141 2.394 L
208.141 3.019 207.914 3.628 QT
207.688 4.237 207.235 4.628 QT
206.781 5.019 206.141 5.019 QT
204.938 5.019 204.242 4.3 QT
203.547 3.581 203.547 2.394 QT
cp}def
f-726111576
f
GR
GS
[0.75 0 0 0.75 122.27052 77.5] CT
N
/f1375902548{211.066 -7.528 M
211.379 -7.997 L
213.722 -6.638 L
216.051 -7.997 L
216.363 -7.528 L
213.722 -5.497 L
211.066 -7.528 L
cp}def
f1375902548
f
GR
GS
[0.75 0 0 0.75 122.27052 77.5] CT
N
/f413755601{214.262 5.019 M
213.044 5.019 212.02 4.378 QT
210.997 3.737 210.419 2.675 QT
209.841 1.612 209.841 0.409 QT
209.841 -0.763 210.372 -1.817 QT
210.903 -2.872 211.856 -3.52 QT
212.809 -4.169 213.981 -4.169 QT
214.887 -4.169 215.567 -3.856 QT
216.247 -3.544 216.692 -2.997 QT
217.137 -2.45 217.356 -1.708 QT
217.575 -0.966 217.575 -0.091 QT
217.575 0.175 217.372 0.175 QT
211.591 0.175 L
211.591 0.394 L
211.591 2.05 212.255 3.245 QT
212.919 4.441 214.434 4.441 QT
215.044 4.441 215.567 4.167 QT
216.091 3.894 216.481 3.401 QT
216.872 2.909 216.997 2.362 QT
217.028 2.284 217.083 2.23 QT
217.137 2.175 217.2 2.175 QT
217.372 2.175 L
217.575 2.175 217.575 2.441 QT
217.294 3.566 216.356 4.292 QT
215.419 5.019 214.262 5.019 QT
cp
211.606 -0.325 M
216.169 -0.325 L
216.169 -1.075 215.958 -1.841 QT
215.747 -2.606 215.255 -3.122 QT
214.762 -3.638 213.981 -3.638 QT
212.841 -3.638 212.223 -2.575 QT
211.606 -1.513 211.606 -0.325 QT
cp}def
f413755601
f
GR
GS
[0.75 0 0 0.75 122.27052 77.5] CT
N
/f-263686975{218.761 4.8 M
218.761 4.097 L
219.448 4.097 219.886 3.987 QT
220.323 3.878 220.323 3.456 QT
220.323 -1.997 L
220.323 -2.528 220.167 -2.77 QT
220.011 -3.013 219.706 -3.067 QT
219.401 -3.122 218.761 -3.122 QT
218.761 -3.825 L
221.667 -4.044 L
221.667 -2.091 L
222.058 -2.95 222.847 -3.497 QT
223.636 -4.044 224.558 -4.044 QT
225.948 -4.044 226.651 -3.38 QT
227.354 -2.716 227.354 -1.341 QT
227.354 3.456 L
227.354 3.878 227.792 3.987 QT
228.229 4.097 228.917 4.097 QT
228.917 4.8 L
224.323 4.8 L
224.323 4.097 L
225.011 4.097 225.448 3.987 QT
225.886 3.878 225.886 3.456 QT
225.886 -1.278 L
225.886 -2.263 225.604 -2.895 QT
225.323 -3.528 224.448 -3.528 QT
223.292 -3.528 222.542 -2.599 QT
221.792 -1.669 221.792 -0.481 QT
221.792 3.456 L
221.792 3.878 222.229 3.987 QT
222.667 4.097 223.339 4.097 QT
223.339 4.8 L
218.761 4.8 L
cp}def
f-263686975
f
GR
GS
[0.75 0 0 0.75 122.27052 77.5] CT
N
/f1241123755{231.165 -5.778 M
233.556 -8.856 L
233.79 -9.169 234.134 -9.169 QT
234.446 -9.169 234.673 -8.942 QT
234.9 -8.716 234.9 -8.403 QT
234.9 -8.091 234.618 -7.841 QT
231.571 -5.372 L
231.165 -5.778 L
cp}def
f1241123755
f
GR
GS
[0.75 0 0 0.75 122.27052 77.5] CT
N
/f992436318{229.887 4.8 M
229.887 4.097 L
230.575 4.097 231.012 3.987 QT
231.45 3.878 231.45 3.456 QT
231.45 -1.997 L
231.45 -2.763 231.153 -2.942 QT
230.856 -3.122 229.981 -3.122 QT
229.981 -3.825 L
232.856 -4.044 L
232.856 3.456 L
232.856 3.878 233.239 3.987 QT
233.622 4.097 234.262 4.097 QT
234.262 4.8 L
229.887 4.8 L
cp}def
f992436318
f
GR
GS
[0.75 0 0 0.75 0 0.25] CT
0.929 0.694 0.125 RC
[8 8] 0 setdash
2 LJ
2.667 LW
N
120.002 103 M
160.026 103 L
S
GR
GS
[0.75 0 0 0.75 0 0.25] CT
0.149 GC
10.0 ML
0.667 LW
N
116 117 M
116 40 L
402 40 L
402 117 L
cp
S
GR
%%Trailer
%%Pages: 1
%%EOF
