<?xml version="1.0" encoding="UTF-8"?>

<!-- generated on 2021-05-21 17:28:16 by Eclipse SUMO GUI Version 1.9.2
<configuration xmlns:xsi="http://www.w3.org/2001/XMLSchema-instance" xsi:noNamespaceSchemaLocation="http://sumo.dlr.de/xsd/sumoConfiguration.xsd">

    <input>
        <net-file value="sumofiles/junction.net.xml"/>
        <route-files value="sumofiles/junction_prune_0.rou.xml"/>
        <additional-files value="sumofiles/junction.det.xml"/>
    </input>

    <output>
        <tripinfo-output value="sumofiles/output/tripinfo_prune_0.xml"/>
    </output>

    <time>
        <begin value="0"/>
        <end value="10000"/>
        <step-length value="1.0"/>
    </time>

    <processing>
        <lateral-resolution value="0.1"/>
    </processing>

    <report>
        <no-warnings value="true"/>
        <error-log value="sumofiles/output/errorlog_prune_0.log"/>
        <no-step-log value="true"/>
    </report>

    <traci_server>
        <remote-port value="34675"/>
    </traci_server>

    <gui_only>
        <gui-settings-file value="sumofiles/junction-gui.settings.xml"/>
        <start value="true"/>
        <tracker-interval value="1"/>
    </gui_only>

</configuration>
-->

<detector xmlns:xsi="http://www.w3.org/2001/XMLSchema-instance" xsi:noNamespaceSchemaLocation="http://sumo.dlr.de/xsd/det_e2_file.xsd">
   <interval begin="0.00" end="347.00" id="det_e2c_l" sampledSeconds="2385.06" nVehEntered="24" nVehLeft="16" nVehSeen="24" meanSpeed="7.32" meanTimeLoss="49.41" meanOccupancy="3.41" maxOccupancy="7.19" meanMaxJamLengthInVehicles="2.61" meanMaxJamLengthInMeters="14.68" maxJamLengthInVehicles="9" maxJamLengthInMeters="57.10" jamLengthInVehiclesSum="921" jamLengthInMetersSum="5167.11" meanHaltingDuration="20.80" maxHaltingDuration="46.00" haltingDurationSum="957.00" meanIntervalHaltingDuration="20.80" maxIntervalHaltingDuration="46.00" intervalHaltingDurationSum="957.00" startedHalts="48.00" meanVehicleNumber="6.93" maxVehicleNumber="14" />
</detector>
