<?xml version="1.0" encoding="UTF-8"?>

<!-- generated on Sat Apr 24 18:39:37 2021 by Eclipse SUMO Version 1.4.0
<configuration xmlns:xsi="http://www.w3.org/2001/XMLSchema-instance" xsi:noNamespaceSchemaLocation="http://sumo.dlr.de/xsd/sumoConfiguration.xsd">

    <input>
        <net-file value="sumofiles/junction.net.xml"/>
        <route-files value="sumofiles/junction_preemption_275.rou.xml"/>
        <additional-files value="sumofiles/junction.det.xml"/>
    </input>

    <output>
        <tripinfo-output value="sumofiles/output/tripinfo_preemption_275.xml"/>
    </output>

    <time>
        <begin value="0"/>
        <end value="10000"/>
        <step-length value="0.05"/>
    </time>

    <processing>
        <lateral-resolution value="0.1"/>
    </processing>

    <report>
        <no-warnings value="true"/>
        <error-log value="sumofiles/output/errorlog_preemption_275.log"/>
        <no-step-log value="true"/>
    </report>

    <traci_server>
        <remote-port value="44653"/>
    </traci_server>

    <gui_only>
        <gui-settings-file value="sumofiles/junction-gui.settings.xml"/>
        <tracker-interval value="0.05"/>
    </gui_only>

</configuration>
-->

<tripinfos xmlns:xsi="http://www.w3.org/2001/XMLSchema-instance" xsi:noNamespaceSchemaLocation="http://sumo.dlr.de/xsd/tripinfo_file.xsd">
    <tripinfo id="car_s2n_1" depart="1.00" departLane="s2sep_1" departPos="3.60" departPosLat="0.00" departSpeed="13.90" departDelay="0.00" arrival="161.75" arrivalLane="c2n_1" arrivalPos="990.00" arrivalPosLat="0.00" arrivalSpeed="14.73" duration="160.75" routeLength="1997.01" waitingTime="17.75" waitingCount="1" stopTime="0.00" timeLoss="25.20" rerouteNo="1" devices="tripinfo_car_s2n_1 routing_car_s2n_1" vType="Car" speedFactor="1.06" vaporized=""/>
    <tripinfo id="car_n2s_11" depart="11.00" departLane="n2sep_1" departPos="3.60" departPosLat="0.00" departSpeed="13.90" departDelay="0.00" arrival="161.75" arrivalLane="c2s_1" arrivalPos="990.00" arrivalPosLat="0.00" arrivalSpeed="14.73" duration="150.75" routeLength="1997.01" waitingTime="7.75" waitingCount="1" stopTime="0.00" timeLoss="15.20" rerouteNo="1" devices="tripinfo_car_n2s_11 routing_car_n2s_11" vType="Car" speedFactor="1.06" vaporized=""/>
    <tripinfo id="car_s2e_20" depart="20.00" departLane="s2sep_1" departPos="3.60" departPosLat="0.00" departSpeed="13.90" departDelay="0.00" arrival="162.60" arrivalLane="c2e_1" arrivalPos="990.00" arrivalPosLat="0.00" arrivalSpeed="15.05" duration="142.60" routeLength="1986.69" waitingTime="0.90" waitingCount="1" stopTime="0.00" timeLoss="9.91" rerouteNo="1" devices="tripinfo_car_s2e_20 routing_car_s2e_20" vType="Car" speedFactor="1.08" vaporized=""/>
    <tripinfo id="car_s2n_38" depart="38.00" departLane="s2sep_1" departPos="3.60" departPosLat="0.00" departSpeed="13.90" departDelay="0.00" arrival="167.25" arrivalLane="c2n_1" arrivalPos="990.00" arrivalPosLat="0.00" arrivalSpeed="15.60" duration="129.25" routeLength="1997.01" waitingTime="0.00" waitingCount="0" stopTime="0.00" timeLoss="1.27" rerouteNo="1" devices="tripinfo_car_s2n_38 routing_car_s2n_38" vType="Car" speedFactor="1.12" vaporized=""/>
    <tripinfo id="car_n2s_16" depart="16.00" departLane="n2sep_1" departPos="3.60" departPosLat="0.00" departSpeed="13.90" departDelay="0.00" arrival="168.30" arrivalLane="c2s_1" arrivalPos="990.00" arrivalPosLat="0.00" arrivalSpeed="14.04" duration="152.30" routeLength="1997.01" waitingTime="0.00" waitingCount="0" stopTime="0.00" timeLoss="10.11" rerouteNo="1" devices="tripinfo_car_n2s_16 routing_car_n2s_16" vType="Car" speedFactor="1.01" vaporized=""/>
    <tripinfo id="car_n2e_24" depart="24.00" departLane="n2sep_1" departPos="3.60" departPosLat="0.00" departSpeed="13.90" departDelay="0.00" arrival="171.20" arrivalLane="c2e_1" arrivalPos="990.00" arrivalPosLat="0.00" arrivalSpeed="14.04" duration="147.20" routeLength="1996.47" waitingTime="0.00" waitingCount="0" stopTime="0.00" timeLoss="4.35" rerouteNo="1" devices="tripinfo_car_n2e_24 routing_car_n2e_24" vType="Car" speedFactor="1.01" vaporized=""/>
    <tripinfo id="car_n2s_36" depart="36.00" departLane="n2sep_1" departPos="3.60" departPosLat="0.00" departSpeed="13.90" departDelay="0.00" arrival="176.65" arrivalLane="c2s_1" arrivalPos="990.00" arrivalPosLat="0.00" arrivalSpeed="14.27" duration="140.65" routeLength="1997.01" waitingTime="0.00" waitingCount="0" stopTime="0.00" timeLoss="0.63" rerouteNo="1" devices="tripinfo_car_n2s_36 routing_car_n2s_36" vType="Car" speedFactor="1.03" vaporized=""/>
    <tripinfo id="car_n2e_41" depart="41.00" departLane="n2sep_1" departPos="3.60" departPosLat="0.00" departSpeed="13.90" departDelay="0.00" arrival="185.00" arrivalLane="c2e_1" arrivalPos="990.00" arrivalPosLat="0.00" arrivalSpeed="14.54" duration="144.00" routeLength="1996.47" waitingTime="0.00" waitingCount="0" stopTime="0.00" timeLoss="6.01" rerouteNo="1" devices="tripinfo_car_n2e_41 routing_car_n2e_41" vType="Car" speedFactor="1.05" vaporized=""/>
    <tripinfo id="car_s2n_41" depart="41.00" departLane="s2sep_1" departPos="3.60" departPosLat="0.00" departSpeed="13.90" departDelay="0.00" arrival="185.20" arrivalLane="c2n_1" arrivalPos="990.00" arrivalPosLat="0.00" arrivalSpeed="13.90" duration="144.20" routeLength="1997.01" waitingTime="0.00" waitingCount="0" stopTime="0.00" timeLoss="0.50" rerouteNo="1" devices="tripinfo_car_s2n_41 routing_car_s2n_41" vType="Car" speedFactor="1.00" vaporized=""/>
    <tripinfo id="car_n2e_52" depart="52.00" departLane="n2sep_1" departPos="3.60" departPosLat="0.00" departSpeed="13.90" departDelay="0.00" arrival="199.75" arrivalLane="c2e_1" arrivalPos="990.00" arrivalPosLat="0.00" arrivalSpeed="13.90" duration="147.75" routeLength="1996.47" waitingTime="0.00" waitingCount="0" stopTime="0.00" timeLoss="3.43" rerouteNo="1" devices="tripinfo_car_n2e_52 routing_car_n2e_52" vType="Car" speedFactor="1.00" vaporized=""/>
    <tripinfo id="car_n2e_58" depart="59.45" departLane="n2sep_1" departPos="3.60" departPosLat="0.00" departSpeed="13.90" departDelay="1.45" arrival="203.00" arrivalLane="c2e_1" arrivalPos="990.00" arrivalPosLat="0.00" arrivalSpeed="15.09" duration="143.55" routeLength="1996.47" waitingTime="0.00" waitingCount="0" stopTime="0.00" timeLoss="11.23" rerouteNo="1" devices="tripinfo_car_n2e_58 routing_car_n2e_58" vType="Car" speedFactor="1.09" vaporized=""/>
    <tripinfo id="car_w2e_22" depart="22.00" departLane="w2sep_1" departPos="3.60" departPosLat="0.00" departSpeed="13.90" departDelay="0.00" arrival="209.50" arrivalLane="c2e_1" arrivalPos="990.00" arrivalPosLat="0.00" arrivalSpeed="14.32" duration="187.50" routeLength="1997.01" waitingTime="40.05" waitingCount="1" stopTime="0.00" timeLoss="48.04" rerouteNo="1" devices="tripinfo_car_w2e_22 routing_car_w2e_22" vType="Car" speedFactor="1.03" vaporized=""/>
    <tripinfo id="car_e2n_22" depart="22.00" departLane="e2sep_1" departPos="3.60" departPosLat="0.00" departSpeed="13.90" departDelay="0.00" arrival="210.65" arrivalLane="c2n_1" arrivalPos="990.00" arrivalPosLat="0.00" arrivalSpeed="13.90" duration="188.65" routeLength="1986.69" waitingTime="38.05" waitingCount="1" stopTime="0.00" timeLoss="44.97" rerouteNo="1" devices="tripinfo_car_e2n_22 routing_car_e2n_22" vType="Car" speedFactor="1.00" vaporized=""/>
    <tripinfo id="car_e2w_25" depart="25.00" departLane="e2sep_1" departPos="3.60" departPosLat="0.00" departSpeed="13.90" departDelay="0.00" arrival="210.75" arrivalLane="c2w_1" arrivalPos="990.00" arrivalPosLat="0.00" arrivalSpeed="14.32" duration="185.75" routeLength="1997.01" waitingTime="35.90" waitingCount="1" stopTime="0.00" timeLoss="46.28" rerouteNo="1" devices="tripinfo_car_e2w_25 routing_car_e2w_25" vType="Car" speedFactor="1.03" vaporized=""/>
    <tripinfo id="car_w2e_23" depart="23.40" departLane="w2sep_1" departPos="3.60" departPosLat="0.00" departSpeed="13.90" departDelay="0.40" arrival="213.00" arrivalLane="c2e_1" arrivalPos="990.00" arrivalPosLat="0.00" arrivalSpeed="14.50" duration="189.60" routeLength="1997.01" waitingTime="37.60" waitingCount="1" stopTime="0.00" timeLoss="52.21" rerouteNo="1" devices="tripinfo_car_w2e_23 routing_car_w2e_23" vType="Car" speedFactor="1.05" vaporized=""/>
    <tripinfo id="car_e2w_26" depart="26.50" departLane="e2sep_1" departPos="3.60" departPosLat="0.00" departSpeed="13.90" departDelay="0.50" arrival="213.45" arrivalLane="c2w_1" arrivalPos="990.00" arrivalPosLat="0.00" arrivalSpeed="15.02" duration="186.95" routeLength="1997.01" waitingTime="34.80" waitingCount="1" stopTime="0.00" timeLoss="55.21" rerouteNo="1" devices="tripinfo_car_e2w_26 routing_car_e2w_26" vType="Car" speedFactor="1.09" vaporized=""/>
    <tripinfo id="car_e2n_37" depart="37.00" departLane="e2sep_1" departPos="3.60" departPosLat="0.00" departSpeed="13.90" departDelay="0.00" arrival="215.20" arrivalLane="c2n_1" arrivalPos="990.00" arrivalPosLat="0.00" arrivalSpeed="14.54" duration="178.20" routeLength="1986.69" waitingTime="29.05" waitingCount="1" stopTime="0.00" timeLoss="40.98" rerouteNo="1" devices="tripinfo_car_e2n_37 routing_car_e2n_37" vType="Car" speedFactor="1.05" vaporized=""/>
    <tripinfo id="car_w2e_25" depart="25.15" departLane="w2sep_1" departPos="3.60" departPosLat="0.00" departSpeed="13.90" departDelay="0.15" arrival="215.55" arrivalLane="c2e_1" arrivalPos="990.00" arrivalPosLat="0.00" arrivalSpeed="14.88" duration="190.40" routeLength="1997.01" waitingTime="36.30" waitingCount="1" stopTime="0.00" timeLoss="57.69" rerouteNo="1" devices="tripinfo_car_w2e_25 routing_car_w2e_25" vType="Car" speedFactor="1.08" vaporized=""/>
    <tripinfo id="car_e2w_53" depart="53.00" departLane="e2sep_1" departPos="3.60" departPosLat="0.00" departSpeed="13.90" departDelay="0.00" arrival="215.55" arrivalLane="c2w_1" arrivalPos="990.00" arrivalPosLat="0.00" arrivalSpeed="15.64" duration="162.55" routeLength="1997.01" waitingTime="20.45" waitingCount="1" stopTime="0.00" timeLoss="38.49" rerouteNo="1" devices="tripinfo_car_e2w_53 routing_car_e2w_53" vType="Car" speedFactor="1.16" vaporized=""/>
    <tripinfo id="car_w2e_39" depart="39.00" departLane="w2sep_1" departPos="3.60" departPosLat="0.00" departSpeed="13.90" departDelay="0.00" arrival="219.90" arrivalLane="c2e_1" arrivalPos="990.00" arrivalPosLat="0.00" arrivalSpeed="13.89" duration="180.90" routeLength="1997.01" waitingTime="24.20" waitingCount="1" stopTime="0.00" timeLoss="37.19" rerouteNo="1" devices="tripinfo_car_w2e_39 routing_car_w2e_39" vType="Car" speedFactor="1.00" vaporized=""/>
    <tripinfo id="car_w2s_73" depart="73.00" departLane="w2sep_1" departPos="3.60" departPosLat="0.00" departSpeed="13.90" departDelay="0.00" arrival="221.45" arrivalLane="c2s_1" arrivalPos="990.00" arrivalPosLat="0.00" arrivalSpeed="13.90" duration="148.45" routeLength="1986.69" waitingTime="0.00" waitingCount="0" stopTime="0.00" timeLoss="4.79" rerouteNo="1" devices="tripinfo_car_w2s_73 routing_car_w2s_73" vType="Car" speedFactor="1.00" vaporized=""/>
    <tripinfo id="car_e2n_74" depart="74.00" departLane="e2sep_1" departPos="3.60" departPosLat="0.00" departSpeed="13.90" departDelay="0.00" arrival="222.75" arrivalLane="c2n_1" arrivalPos="990.00" arrivalPosLat="0.00" arrivalSpeed="13.90" duration="148.75" routeLength="1986.69" waitingTime="0.00" waitingCount="0" stopTime="0.00" timeLoss="5.07" rerouteNo="1" devices="tripinfo_car_e2n_74 routing_car_e2n_74" vType="Car" speedFactor="1.00" vaporized=""/>
    <tripinfo id="car_w2e_58" depart="58.00" departLane="w2sep_1" departPos="3.60" departPosLat="0.00" departSpeed="13.90" departDelay="0.00" arrival="222.90" arrivalLane="c2e_1" arrivalPos="990.00" arrivalPosLat="0.00" arrivalSpeed="14.08" duration="164.90" routeLength="1997.01" waitingTime="7.60" waitingCount="1" stopTime="0.00" timeLoss="23.76" rerouteNo="1" devices="tripinfo_car_w2e_58 routing_car_w2e_58" vType="Car" speedFactor="1.02" vaporized=""/>
    <tripinfo id="car_w2n_42" depart="42.00" departLane="w2sep_1" departPos="3.60" departPosLat="0.00" departSpeed="13.90" departDelay="0.00" arrival="227.20" arrivalLane="c2n_1" arrivalPos="990.00" arrivalPosLat="0.00" arrivalSpeed="13.89" duration="185.20" routeLength="1996.47" waitingTime="26.65" waitingCount="3" stopTime="0.00" timeLoss="40.88" rerouteNo="1" devices="tripinfo_car_w2n_42 routing_car_w2n_42" vType="Car" speedFactor="1.00" vaporized=""/>
    <tripinfo id="car_w2s_82" depart="82.00" departLane="w2sep_1" departPos="3.60" departPosLat="0.00" departSpeed="13.90" departDelay="0.00" arrival="229.20" arrivalLane="c2s_1" arrivalPos="990.00" arrivalPosLat="0.00" arrivalSpeed="13.97" duration="147.20" routeLength="1986.69" waitingTime="0.00" waitingCount="0" stopTime="0.00" timeLoss="4.24" rerouteNo="1" devices="tripinfo_car_w2s_82 routing_car_w2s_82" vType="Car" speedFactor="1.01" vaporized=""/>
    <tripinfo id="car_w2e_88" depart="88.50" departLane="w2sep_1" departPos="3.60" departPosLat="0.00" departSpeed="13.90" departDelay="0.50" arrival="235.15" arrivalLane="c2e_1" arrivalPos="990.00" arrivalPosLat="0.00" arrivalSpeed="14.17" duration="146.65" routeLength="1997.01" waitingTime="0.00" waitingCount="0" stopTime="0.00" timeLoss="5.75" rerouteNo="1" devices="tripinfo_car_w2e_88 routing_car_w2e_88" vType="Car" speedFactor="1.02" vaporized=""/>
    <tripinfo id="car_w2s_87" depart="87.00" departLane="w2sep_1" departPos="3.60" departPosLat="0.00" departSpeed="13.90" departDelay="0.00" arrival="235.60" arrivalLane="c2s_1" arrivalPos="990.00" arrivalPosLat="0.00" arrivalSpeed="13.90" duration="148.60" routeLength="1986.69" waitingTime="0.00" waitingCount="0" stopTime="0.00" timeLoss="4.92" rerouteNo="1" devices="tripinfo_car_w2s_87 routing_car_w2s_87" vType="Car" speedFactor="1.00" vaporized=""/>
    <tripinfo id="car_w2e_97" depart="97.00" departLane="w2sep_1" departPos="3.60" departPosLat="0.00" departSpeed="13.90" departDelay="0.00" arrival="237.15" arrivalLane="c2e_1" arrivalPos="990.00" arrivalPosLat="0.00" arrivalSpeed="15.50" duration="140.15" routeLength="1997.01" waitingTime="0.00" waitingCount="0" stopTime="0.00" timeLoss="16.09" rerouteNo="1" devices="tripinfo_car_w2e_97 routing_car_w2e_97" vType="Car" speedFactor="1.16" vaporized=""/>
    <tripinfo id="car_e2s_63" depart="63.00" departLane="e2sep_1" departPos="3.60" departPosLat="0.00" departSpeed="13.90" departDelay="0.00" arrival="239.40" arrivalLane="c2s_1" arrivalPos="990.00" arrivalPosLat="0.00" arrivalSpeed="14.53" duration="176.40" routeLength="1996.47" waitingTime="26.10" waitingCount="2" stopTime="0.00" timeLoss="38.57" rerouteNo="1" devices="tripinfo_car_e2s_63 routing_car_e2s_63" vType="Car" speedFactor="1.05" vaporized=""/>
    <tripinfo id="car_w2n_103" depart="103.00" departLane="w2sep_1" departPos="3.60" departPosLat="0.00" departSpeed="13.90" departDelay="0.00" arrival="239.50" arrivalLane="c2n_1" arrivalPos="990.00" arrivalPosLat="0.00" arrivalSpeed="15.18" duration="136.50" routeLength="1996.47" waitingTime="0.00" waitingCount="0" stopTime="0.00" timeLoss="4.31" rerouteNo="1" devices="tripinfo_car_w2n_103 routing_car_w2n_103" vType="Car" speedFactor="1.09" vaporized=""/>
    <tripinfo id="car_e2s_76" depart="76.00" departLane="e2sep_1" departPos="3.60" departPosLat="0.00" departSpeed="13.90" departDelay="0.00" arrival="241.35" arrivalLane="c2s_1" arrivalPos="990.00" arrivalPosLat="0.00" arrivalSpeed="15.71" duration="165.35" routeLength="1996.47" waitingTime="15.90" waitingCount="1" stopTime="0.00" timeLoss="42.89" rerouteNo="1" devices="tripinfo_car_e2s_76 routing_car_e2s_76" vType="Car" speedFactor="1.18" vaporized=""/>
    <tripinfo id="car_w2n_104" depart="104.30" departLane="w2sep_1" departPos="3.60" departPosLat="0.00" departSpeed="13.90" departDelay="0.30" arrival="248.40" arrivalLane="c2n_1" arrivalPos="990.00" arrivalPosLat="0.00" arrivalSpeed="14.50" duration="144.10" routeLength="1996.47" waitingTime="0.00" waitingCount="0" stopTime="0.00" timeLoss="5.75" rerouteNo="1" devices="tripinfo_car_w2n_104 routing_car_w2n_104" vType="Car" speedFactor="1.04" vaporized=""/>
    <tripinfo id="car_s2n_83" depart="83.00" departLane="s2sep_1" departPos="3.60" departPosLat="0.00" departSpeed="13.90" departDelay="0.00" arrival="250.45" arrivalLane="c2n_1" arrivalPos="990.00" arrivalPosLat="0.00" arrivalSpeed="15.76" duration="167.45" routeLength="1997.01" waitingTime="29.45" waitingCount="1" stopTime="0.00" timeLoss="44.83" rerouteNo="1" devices="tripinfo_car_s2n_83 routing_car_s2n_83" vType="Car" speedFactor="1.17" vaporized=""/>
    <tripinfo id="car_n2w_58" depart="58.00" departLane="n2sep_1" departPos="3.60" departPosLat="0.00" departSpeed="13.90" departDelay="0.00" arrival="254.90" arrivalLane="c2w_1" arrivalPos="990.00" arrivalPosLat="0.00" arrivalSpeed="14.04" duration="196.90" routeLength="1986.69" waitingTime="47.35" waitingCount="1" stopTime="0.00" timeLoss="54.70" rerouteNo="1" devices="tripinfo_car_n2w_58 routing_car_n2w_58" vType="Car" speedFactor="1.01" vaporized=""/>
    <tripinfo id="car_s2e_102" depart="102.00" departLane="s2sep_1" departPos="3.60" departPosLat="0.00" departSpeed="13.90" departDelay="0.00" arrival="256.75" arrivalLane="c2e_1" arrivalPos="990.00" arrivalPosLat="0.00" arrivalSpeed="14.15" duration="154.75" routeLength="1986.69" waitingTime="4.95" waitingCount="1" stopTime="0.00" timeLoss="13.66" rerouteNo="1" devices="tripinfo_car_s2e_102 routing_car_s2e_102" vType="Car" speedFactor="1.02" vaporized=""/>
    <tripinfo id="car_n2w_64" depart="64.00" departLane="n2sep_1" departPos="3.60" departPosLat="0.00" departSpeed="13.90" departDelay="0.00" arrival="257.05" arrivalLane="c2w_1" arrivalPos="990.00" arrivalPosLat="0.00" arrivalSpeed="15.20" duration="193.05" routeLength="1986.69" waitingTime="40.75" waitingCount="1" stopTime="0.00" timeLoss="65.12" rerouteNo="1" devices="tripinfo_car_n2w_64 routing_car_n2w_64" vType="Car" speedFactor="1.12" vaporized=""/>
    <tripinfo id="car_s2n_115" depart="115.00" departLane="s2sep_1" departPos="3.60" departPosLat="0.00" departSpeed="13.90" departDelay="0.00" arrival="260.35" arrivalLane="c2n_1" arrivalPos="990.00" arrivalPosLat="0.00" arrivalSpeed="13.90" duration="145.35" routeLength="1997.01" waitingTime="0.00" waitingCount="0" stopTime="0.00" timeLoss="1.64" rerouteNo="1" devices="tripinfo_car_s2n_115 routing_car_s2n_115" vType="Car" speedFactor="1.00" vaporized=""/>
    <tripinfo id="car_n2w_66" depart="66.00" departLane="n2sep_1" departPos="3.60" departPosLat="0.00" departSpeed="13.90" departDelay="0.00" arrival="262.25" arrivalLane="c2w_1" arrivalPos="990.00" arrivalPosLat="0.00" arrivalSpeed="13.90" duration="196.25" routeLength="1986.69" waitingTime="37.95" waitingCount="1" stopTime="0.00" timeLoss="52.57" rerouteNo="1" devices="tripinfo_car_n2w_66 routing_car_n2w_66" vType="Car" speedFactor="1.00" vaporized=""/>
    <tripinfo id="car_n2s_90" depart="90.00" departLane="n2sep_1" departPos="3.60" departPosLat="0.00" departSpeed="13.90" departDelay="0.00" arrival="262.50" arrivalLane="c2s_1" arrivalPos="990.00" arrivalPosLat="0.00" arrivalSpeed="13.90" duration="172.50" routeLength="1997.01" waitingTime="18.25" waitingCount="1" stopTime="0.00" timeLoss="28.81" rerouteNo="1" devices="tripinfo_car_n2s_90 routing_car_n2s_90" vType="Car" speedFactor="1.00" vaporized=""/>
    <tripinfo id="car_n2w_91" depart="91.45" departLane="n2sep_1" departPos="3.60" departPosLat="0.00" departSpeed="13.90" departDelay="0.45" arrival="264.05" arrivalLane="c2w_1" arrivalPos="990.00" arrivalPosLat="0.00" arrivalSpeed="15.44" duration="172.60" routeLength="1986.69" waitingTime="17.70" waitingCount="1" stopTime="0.00" timeLoss="50.79" rerouteNo="1" devices="tripinfo_car_n2w_91 routing_car_n2w_91" vType="Car" speedFactor="1.18" vaporized=""/>
    <tripinfo id="car_n2s_120" depart="120.00" departLane="n2sep_1" departPos="3.60" departPosLat="0.00" departSpeed="13.90" departDelay="0.00" arrival="264.50" arrivalLane="c2s_1" arrivalPos="990.00" arrivalPosLat="0.00" arrivalSpeed="15.59" duration="144.50" routeLength="1997.01" waitingTime="1.20" waitingCount="1" stopTime="0.00" timeLoss="21.55" rerouteNo="1" devices="tripinfo_car_n2s_120 routing_car_n2s_120" vType="Car" speedFactor="1.17" vaporized=""/>
    <tripinfo id="car_s2n_136" depart="136.00" departLane="s2sep_1" departPos="3.60" departPosLat="0.00" departSpeed="13.90" departDelay="0.00" arrival="265.75" arrivalLane="c2n_1" arrivalPos="990.00" arrivalPosLat="0.00" arrivalSpeed="15.55" duration="129.75" routeLength="1997.01" waitingTime="0.00" waitingCount="0" stopTime="0.00" timeLoss="1.37" rerouteNo="1" devices="tripinfo_car_s2n_136 routing_car_s2n_136" vType="Car" speedFactor="1.12" vaporized=""/>
    <tripinfo id="car_s2e_120" depart="120.00" departLane="s2sep_1" departPos="3.60" departPosLat="0.00" departSpeed="13.90" departDelay="0.00" arrival="266.20" arrivalLane="c2e_1" arrivalPos="990.00" arrivalPosLat="0.00" arrivalSpeed="14.13" duration="146.20" routeLength="1986.69" waitingTime="0.00" waitingCount="0" stopTime="0.00" timeLoss="4.89" rerouteNo="1" devices="tripinfo_car_s2e_120 routing_car_s2e_120" vType="Car" speedFactor="1.02" vaporized=""/>
    <tripinfo id="car_n2w_103" depart="103.00" departLane="n2sep_1" departPos="3.60" departPosLat="0.00" departSpeed="13.90" departDelay="0.00" arrival="267.25" arrivalLane="c2w_1" arrivalPos="990.00" arrivalPosLat="0.00" arrivalSpeed="14.37" duration="164.25" routeLength="1986.69" waitingTime="8.60" waitingCount="1" stopTime="0.00" timeLoss="25.82" rerouteNo="1" devices="tripinfo_car_n2w_103 routing_car_n2w_103" vType="Car" speedFactor="1.04" vaporized=""/>
    <tripinfo id="car_s2e_122" depart="122.00" departLane="s2sep_1" departPos="3.60" departPosLat="0.00" departSpeed="13.90" departDelay="0.00" arrival="268.60" arrivalLane="c2e_1" arrivalPos="990.00" arrivalPosLat="0.00" arrivalSpeed="15.00" duration="146.60" routeLength="1986.69" waitingTime="0.00" waitingCount="0" stopTime="0.00" timeLoss="15.51" rerouteNo="1" devices="tripinfo_car_s2e_122 routing_car_s2e_122" vType="Car" speedFactor="1.10" vaporized=""/>
    <tripinfo id="car_n2s_134" depart="134.00" departLane="n2sep_1" departPos="3.60" departPosLat="0.00" departSpeed="13.90" departDelay="0.00" arrival="271.30" arrivalLane="c2s_1" arrivalPos="990.00" arrivalPosLat="0.00" arrivalSpeed="15.73" duration="137.30" routeLength="1997.01" waitingTime="0.00" waitingCount="0" stopTime="0.00" timeLoss="10.35" rerouteNo="1" devices="tripinfo_car_n2s_134 routing_car_n2s_134" vType="Car" speedFactor="1.13" vaporized=""/>
    <tripinfo id="car_n2w_110" depart="110.00" departLane="n2sep_1" departPos="3.60" departPosLat="0.00" departSpeed="13.90" departDelay="0.00" arrival="271.70" arrivalLane="c2w_1" arrivalPos="990.00" arrivalPosLat="0.00" arrivalSpeed="13.89" duration="161.70" routeLength="1986.69" waitingTime="1.95" waitingCount="1" stopTime="0.00" timeLoss="18.04" rerouteNo="1" devices="tripinfo_car_n2w_110 routing_car_n2w_110" vType="Car" speedFactor="1.00" vaporized=""/>
    <tripinfo id="car_n2e_62" depart="62.00" departLane="n2sep_1" departPos="3.60" departPosLat="0.00" departSpeed="13.90" departDelay="0.00" arrival="275.05" arrivalLane="c2e_1" arrivalPos="990.00" arrivalPosLat="0.00" arrivalSpeed="14.26" duration="213.05" routeLength="1996.47" waitingTime="57.65" waitingCount="2" stopTime="0.00" timeLoss="72.39" rerouteNo="1" devices="tripinfo_car_n2e_62 routing_car_n2e_62" vType="Car" speedFactor="1.03" vaporized=""/>
    <tripinfo id="car_n2s_136" depart="136.00" departLane="n2sep_1" departPos="3.60" departPosLat="0.00" departSpeed="13.90" departDelay="0.00" arrival="277.00" arrivalLane="c2s_1" arrivalPos="990.00" arrivalPosLat="0.00" arrivalSpeed="15.04" duration="141.00" routeLength="1997.01" waitingTime="0.00" waitingCount="0" stopTime="0.00" timeLoss="8.27" rerouteNo="1" devices="tripinfo_car_n2s_136 routing_car_n2s_136" vType="Car" speedFactor="1.08" vaporized=""/>
    <tripinfo id="car_n2w_130" depart="130.00" departLane="n2sep_1" departPos="3.60" departPosLat="0.00" departSpeed="13.90" departDelay="0.00" arrival="278.05" arrivalLane="c2w_1" arrivalPos="990.00" arrivalPosLat="0.00" arrivalSpeed="13.90" duration="148.05" routeLength="1986.69" waitingTime="0.00" waitingCount="0" stopTime="0.00" timeLoss="4.40" rerouteNo="1" devices="tripinfo_car_n2w_130 routing_car_n2w_130" vType="Car" speedFactor="1.00" vaporized=""/>
    <tripinfo id="car_n2e_100" depart="100.00" departLane="n2sep_1" departPos="3.60" departPosLat="0.00" departSpeed="13.90" departDelay="0.00" arrival="278.95" arrivalLane="c2e_1" arrivalPos="990.00" arrivalPosLat="0.00" arrivalSpeed="14.30" duration="178.95" routeLength="1996.47" waitingTime="22.60" waitingCount="2" stopTime="0.00" timeLoss="38.87" rerouteNo="1" devices="tripinfo_car_n2e_100 routing_car_n2e_100" vType="Car" speedFactor="1.03" vaporized=""/>
    <tripinfo id="car_s2w_73" depart="73.00" departLane="s2sep_1" departPos="3.60" departPosLat="0.00" departSpeed="13.90" departDelay="0.00" arrival="280.10" arrivalLane="c2w_1" arrivalPos="990.00" arrivalPosLat="0.00" arrivalSpeed="15.21" duration="207.10" routeLength="1996.47" waitingTime="63.75" waitingCount="2" stopTime="0.00" timeLoss="79.58" rerouteNo="1" devices="tripinfo_car_s2w_73 routing_car_s2w_73" vType="Car" speedFactor="1.13" vaporized=""/>
    <tripinfo id="car_s2w_81" depart="81.00" departLane="s2sep_1" departPos="3.60" departPosLat="0.00" departSpeed="13.90" departDelay="0.00" arrival="282.15" arrivalLane="c2w_1" arrivalPos="990.00" arrivalPosLat="0.00" arrivalSpeed="15.53" duration="201.15" routeLength="1996.47" waitingTime="56.25" waitingCount="2" stopTime="0.00" timeLoss="76.12" rerouteNo="1" devices="tripinfo_car_s2w_81 routing_car_s2w_81" vType="Car" speedFactor="1.15" vaporized=""/>
    <tripinfo id="car_s2w_94" depart="94.00" departLane="s2sep_1" departPos="3.60" departPosLat="0.00" departSpeed="13.90" departDelay="0.00" arrival="284.95" arrivalLane="c2w_1" arrivalPos="990.00" arrivalPosLat="0.00" arrivalSpeed="15.20" duration="190.95" routeLength="1996.47" waitingTime="39.35" waitingCount="2" stopTime="0.00" timeLoss="60.01" rerouteNo="1" devices="tripinfo_car_s2w_94 routing_car_s2w_94" vType="Car" speedFactor="1.10" vaporized=""/>
    <tripinfo id="car_s2w_105" depart="105.00" departLane="s2sep_1" departPos="3.60" departPosLat="0.00" departSpeed="13.90" departDelay="0.00" arrival="291.35" arrivalLane="c2w_1" arrivalPos="990.00" arrivalPosLat="0.00" arrivalSpeed="14.04" duration="186.35" routeLength="1996.47" waitingTime="22.20" waitingCount="2" stopTime="0.00" timeLoss="43.47" rerouteNo="1" devices="tripinfo_car_s2w_105 routing_car_s2w_105" vType="Car" speedFactor="1.01" vaporized=""/>
    <tripinfo id="car_w2s_105" depart="106.05" departLane="w2sep_1" departPos="3.60" departPosLat="0.00" departSpeed="13.90" departDelay="1.05" arrival="295.05" arrivalLane="c2s_1" arrivalPos="990.00" arrivalPosLat="0.00" arrivalSpeed="15.12" duration="189.00" routeLength="1986.69" waitingTime="44.20" waitingCount="1" stopTime="0.00" timeLoss="56.95" rerouteNo="1" devices="tripinfo_car_w2s_105 routing_car_w2s_105" vType="Car" speedFactor="1.09" vaporized=""/>
    <tripinfo id="car_e2w_109" depart="109.00" departLane="e2sep_1" departPos="3.60" departPosLat="0.00" departSpeed="13.90" departDelay="0.00" arrival="300.95" arrivalLane="c2w_1" arrivalPos="990.00" arrivalPosLat="0.00" arrivalSpeed="13.90" duration="191.95" routeLength="1997.01" waitingTime="41.05" waitingCount="1" stopTime="0.00" timeLoss="48.26" rerouteNo="1" devices="tripinfo_car_e2w_109 routing_car_e2w_109" vType="Car" speedFactor="1.00" vaporized=""/>
    <tripinfo id="car_w2s_131" depart="131.00" departLane="w2sep_1" departPos="3.60" departPosLat="0.00" departSpeed="13.90" departDelay="0.00" arrival="302.45" arrivalLane="c2s_1" arrivalPos="990.00" arrivalPosLat="0.00" arrivalSpeed="14.23" duration="171.45" routeLength="1986.69" waitingTime="21.40" waitingCount="1" stopTime="0.00" timeLoss="31.10" rerouteNo="1" devices="tripinfo_car_w2s_131 routing_car_w2s_131" vType="Car" speedFactor="1.02" vaporized=""/>
    <tripinfo id="car_e2w_128" depart="128.00" departLane="e2sep_1" departPos="3.60" departPosLat="0.00" departSpeed="13.90" departDelay="0.00" arrival="305.10" arrivalLane="c2w_1" arrivalPos="990.00" arrivalPosLat="0.00" arrivalSpeed="13.93" duration="177.10" routeLength="1997.01" waitingTime="23.00" waitingCount="1" stopTime="0.00" timeLoss="33.86" rerouteNo="1" devices="tripinfo_car_e2w_128 routing_car_e2w_128" vType="Car" speedFactor="1.00" vaporized=""/>
    <tripinfo id="car_w2e_159" depart="159.00" departLane="w2sep_1" departPos="3.60" departPosLat="0.00" departSpeed="13.90" departDelay="0.00" arrival="305.95" arrivalLane="c2e_1" arrivalPos="990.00" arrivalPosLat="0.00" arrivalSpeed="14.22" duration="146.95" routeLength="1997.01" waitingTime="0.00" waitingCount="0" stopTime="0.00" timeLoss="6.48" rerouteNo="1" devices="tripinfo_car_w2e_159 routing_car_w2e_159" vType="Car" speedFactor="1.02" vaporized=""/>
    <tripinfo id="car_w2s_138" depart="138.00" departLane="w2sep_1" departPos="3.60" departPosLat="0.00" departSpeed="13.90" departDelay="0.00" arrival="306.85" arrivalLane="c2s_1" arrivalPos="990.00" arrivalPosLat="0.00" arrivalSpeed="14.11" duration="168.85" routeLength="1986.69" waitingTime="14.85" waitingCount="1" stopTime="0.00" timeLoss="27.42" rerouteNo="1" devices="tripinfo_car_w2s_138 routing_car_w2s_138" vType="Car" speedFactor="1.02" vaporized=""/>
    <tripinfo id="car_e2w_150" depart="150.00" departLane="e2sep_1" departPos="3.60" departPosLat="0.00" departSpeed="13.90" departDelay="0.00" arrival="308.10" arrivalLane="c2w_1" arrivalPos="990.00" arrivalPosLat="0.00" arrivalSpeed="14.14" duration="158.10" routeLength="1997.01" waitingTime="3.40" waitingCount="1" stopTime="0.00" timeLoss="17.54" rerouteNo="1" devices="tripinfo_car_e2w_150 routing_car_e2w_150" vType="Car" speedFactor="1.02" vaporized=""/>
    <tripinfo id="car_w2n_162" depart="162.00" departLane="w2sep_1" departPos="3.60" departPosLat="0.00" departSpeed="13.90" departDelay="0.00" arrival="310.75" arrivalLane="c2n_1" arrivalPos="990.00" arrivalPosLat="0.00" arrivalSpeed="13.90" duration="148.75" routeLength="1996.47" waitingTime="0.00" waitingCount="0" stopTime="0.00" timeLoss="4.44" rerouteNo="1" devices="tripinfo_car_w2n_162 routing_car_w2n_162" vType="Car" speedFactor="1.00" vaporized=""/>
    <tripinfo id="car_e2s_113" depart="113.00" departLane="e2sep_1" departPos="3.60" departPosLat="0.00" departSpeed="13.90" departDelay="0.00" arrival="311.70" arrivalLane="c2s_1" arrivalPos="990.00" arrivalPosLat="0.00" arrivalSpeed="13.89" duration="198.70" routeLength="1996.47" waitingTime="41.35" waitingCount="2" stopTime="0.00" timeLoss="54.35" rerouteNo="1" devices="tripinfo_car_e2s_113 routing_car_e2s_113" vType="Car" speedFactor="1.00" vaporized=""/>
    <tripinfo id="car_e2s_129" depart="129.45" departLane="e2sep_1" departPos="3.60" departPosLat="0.00" departSpeed="13.90" departDelay="0.45" arrival="315.45" arrivalLane="c2s_1" arrivalPos="990.00" arrivalPosLat="0.00" arrivalSpeed="13.88" duration="186.00" routeLength="1996.47" waitingTime="23.10" waitingCount="2" stopTime="0.00" timeLoss="41.69" rerouteNo="1" devices="tripinfo_car_e2s_129 routing_car_e2s_129" vType="Car" speedFactor="1.00" vaporized=""/>
    <tripinfo id="car_e2s_130" depart="131.25" departLane="e2sep_1" departPos="3.60" departPosLat="0.00" departSpeed="13.90" departDelay="1.25" arrival="317.35" arrivalLane="c2s_1" arrivalPos="990.00" arrivalPosLat="0.00" arrivalSpeed="15.15" duration="186.10" routeLength="1996.47" waitingTime="20.05" waitingCount="2" stopTime="0.00" timeLoss="59.77" rerouteNo="1" devices="tripinfo_car_e2s_130 routing_car_e2s_130" vType="Car" speedFactor="1.14" vaporized=""/>
    <tripinfo id="car_w2n_185" depart="185.00" departLane="w2sep_1" departPos="3.60" departPosLat="0.00" departSpeed="13.90" departDelay="0.00" arrival="322.50" arrivalLane="c2n_1" arrivalPos="990.00" arrivalPosLat="0.00" arrivalSpeed="15.11" duration="137.50" routeLength="1996.47" waitingTime="0.00" waitingCount="0" stopTime="0.00" timeLoss="4.71" rerouteNo="1" devices="tripinfo_car_w2n_185 routing_car_w2n_185" vType="Car" speedFactor="1.09" vaporized=""/>
    <tripinfo id="car_e2w_182" depart="182.00" departLane="e2sep_1" departPos="3.60" departPosLat="0.00" departSpeed="13.90" departDelay="0.00" arrival="324.80" arrivalLane="c2w_1" arrivalPos="990.00" arrivalPosLat="0.00" arrivalSpeed="14.00" duration="142.80" routeLength="1997.01" waitingTime="0.00" waitingCount="0" stopTime="0.00" timeLoss="0.17" rerouteNo="1" devices="tripinfo_car_e2w_182 routing_car_e2w_182" vType="Car" speedFactor="1.01" vaporized=""/>
    <tripinfo id="car_e2w_197" depart="197.00" departLane="e2sep_1" departPos="3.60" departPosLat="0.00" departSpeed="13.90" departDelay="0.00" arrival="326.85" arrivalLane="c2w_1" arrivalPos="990.00" arrivalPosLat="0.00" arrivalSpeed="15.41" duration="129.85" routeLength="1997.01" waitingTime="0.00" waitingCount="0" stopTime="0.00" timeLoss="4.67" rerouteNo="1" devices="tripinfo_car_e2w_197 routing_car_e2w_197" vType="Car" speedFactor="1.15" vaporized=""/>
    <tripinfo id="car_w2n_187" depart="187.00" departLane="w2sep_1" departPos="3.60" departPosLat="0.00" departSpeed="13.90" departDelay="0.00" arrival="332.85" arrivalLane="c2n_1" arrivalPos="990.00" arrivalPosLat="0.00" arrivalSpeed="14.38" duration="145.85" routeLength="1996.47" waitingTime="0.00" waitingCount="0" stopTime="0.00" timeLoss="6.31" rerouteNo="1" devices="tripinfo_car_w2n_187 routing_car_w2n_187" vType="Car" speedFactor="1.03" vaporized=""/>
    <tripinfo id="car_n2s_146" depart="147.45" departLane="n2sep_1" departPos="3.60" departPosLat="0.00" departSpeed="13.90" departDelay="1.45" arrival="337.30" arrivalLane="c2s_1" arrivalPos="990.00" arrivalPosLat="0.00" arrivalSpeed="16.38" duration="189.85" routeLength="1997.01" waitingTime="48.20" waitingCount="1" stopTime="0.00" timeLoss="67.94" rerouteNo="1" devices="tripinfo_car_n2s_146 routing_car_n2s_146" vType="Car" speedFactor="1.18" vaporized=""/>
    <tripinfo id="car_s2e_165" depart="165.00" departLane="s2sep_1" departPos="3.60" departPosLat="0.00" departSpeed="13.90" departDelay="0.00" arrival="341.95" arrivalLane="c2e_1" arrivalPos="990.00" arrivalPosLat="0.00" arrivalSpeed="14.67" duration="176.95" routeLength="1986.69" waitingTime="33.55" waitingCount="1" stopTime="0.00" timeLoss="40.86" rerouteNo="1" devices="tripinfo_car_s2e_165 routing_car_s2e_165" vType="Car" speedFactor="1.06" vaporized=""/>
    <tripinfo id="car_n2w_146" depart="146.00" departLane="n2sep_1" departPos="3.60" departPosLat="0.00" departSpeed="13.90" departDelay="0.00" arrival="345.65" arrivalLane="c2w_1" arrivalPos="990.00" arrivalPosLat="0.00" arrivalSpeed="13.90" duration="199.65" routeLength="1986.69" waitingTime="49.10" waitingCount="1" stopTime="0.00" timeLoss="55.99" rerouteNo="1" devices="tripinfo_car_n2w_146 routing_car_n2w_146" vType="Car" speedFactor="1.00" vaporized=""/>
    <tripinfo id="car_n2w_147" depart="149.10" departLane="n2sep_1" departPos="3.60" departPosLat="0.00" departSpeed="13.90" departDelay="2.10" arrival="347.60" arrivalLane="c2w_1" arrivalPos="990.00" arrivalPosLat="0.00" arrivalSpeed="15.36" duration="198.50" routeLength="1986.69" waitingTime="47.45" waitingCount="1" stopTime="0.00" timeLoss="74.05" rerouteNo="1" devices="tripinfo_car_n2w_147 routing_car_n2w_147" vType="Car" speedFactor="1.15" vaporized=""/>
    <tripinfo id="car_s2n_169" depart="169.00" departLane="s2sep_1" departPos="3.60" departPosLat="0.00" departSpeed="13.90" departDelay="0.00" arrival="347.90" arrivalLane="c2n_1" arrivalPos="990.00" arrivalPosLat="0.00" arrivalSpeed="13.90" duration="178.90" routeLength="1997.01" waitingTime="26.50" waitingCount="1" stopTime="0.00" timeLoss="35.19" rerouteNo="1" devices="tripinfo_car_s2n_169 routing_car_s2n_169" vType="Car" speedFactor="1.00" vaporized=""/>
    <tripinfo id="car_n2w_149" depart="152.65" departLane="n2sep_1" departPos="3.60" departPosLat="0.00" departSpeed="13.90" departDelay="3.65" arrival="349.50" arrivalLane="c2w_1" arrivalPos="990.00" arrivalPosLat="0.00" arrivalSpeed="15.61" duration="196.85" routeLength="1986.69" waitingTime="43.30" waitingCount="1" stopTime="0.00" timeLoss="74.27" rerouteNo="1" devices="tripinfo_car_n2w_149 routing_car_n2w_149" vType="Car" speedFactor="1.17" vaporized=""/>
    <tripinfo id="car_n2e_148" depart="150.80" departLane="n2sep_1" departPos="3.60" departPosLat="0.00" departSpeed="13.90" departDelay="2.80" arrival="350.70" arrivalLane="c2e_1" arrivalPos="990.00" arrivalPosLat="0.00" arrivalSpeed="13.97" duration="199.90" routeLength="1996.47" waitingTime="41.85" waitingCount="2" stopTime="0.00" timeLoss="56.29" rerouteNo="1" devices="tripinfo_car_n2e_148 routing_car_n2e_148" vType="Car" speedFactor="1.01" vaporized=""/>
    <tripinfo id="car_n2w_176" depart="176.00" departLane="n2sep_1" departPos="3.60" departPosLat="0.00" departSpeed="13.90" departDelay="0.00" arrival="351.45" arrivalLane="c2w_1" arrivalPos="990.00" arrivalPosLat="0.00" arrivalSpeed="15.76" duration="175.45" routeLength="1986.69" waitingTime="34.45" waitingCount="1" stopTime="0.00" timeLoss="53.67" rerouteNo="1" devices="tripinfo_car_n2w_176 routing_car_n2w_176" vType="Car" speedFactor="1.18" vaporized=""/>
    <tripinfo id="car_s2n_214" depart="214.00" departLane="s2sep_1" departPos="3.60" departPosLat="0.00" departSpeed="13.90" departDelay="0.00" arrival="352.10" arrivalLane="c2n_1" arrivalPos="990.00" arrivalPosLat="0.00" arrivalSpeed="14.67" duration="138.10" routeLength="1997.01" waitingTime="0.00" waitingCount="0" stopTime="0.00" timeLoss="2.14" rerouteNo="1" devices="tripinfo_car_s2n_214 routing_car_s2n_214" vType="Car" speedFactor="1.06" vaporized=""/>
    <tripinfo id="car_n2s_164" depart="164.00" departLane="n2sep_1" departPos="3.60" departPosLat="0.00" departSpeed="13.90" departDelay="0.00" arrival="353.15" arrivalLane="c2s_1" arrivalPos="990.00" arrivalPosLat="0.00" arrivalSpeed="14.17" duration="189.15" routeLength="1997.01" waitingTime="36.35" waitingCount="1" stopTime="0.00" timeLoss="48.26" rerouteNo="1" devices="tripinfo_car_n2s_164 routing_car_n2s_164" vType="Car" speedFactor="1.02" vaporized=""/>
    <tripinfo id="car_s2n_217" depart="217.00" departLane="s2sep_1" departPos="3.60" departPosLat="0.00" departSpeed="13.90" departDelay="0.00" arrival="354.55" arrivalLane="c2n_1" arrivalPos="990.00" arrivalPosLat="0.00" arrivalSpeed="15.36" duration="137.55" routeLength="1997.01" waitingTime="0.00" waitingCount="0" stopTime="0.00" timeLoss="9.43" rerouteNo="1" devices="tripinfo_car_s2n_217 routing_car_s2n_217" vType="Car" speedFactor="1.12" vaporized=""/>
    <tripinfo id="car_n2s_181" depart="181.00" departLane="n2sep_1" departPos="3.60" departPosLat="0.00" departSpeed="13.90" departDelay="0.00" arrival="356.25" arrivalLane="c2s_1" arrivalPos="990.00" arrivalPosLat="0.00" arrivalSpeed="15.23" duration="175.25" routeLength="1997.01" waitingTime="24.05" waitingCount="1" stopTime="0.00" timeLoss="44.87" rerouteNo="1" devices="tripinfo_car_n2s_181 routing_car_n2s_181" vType="Car" speedFactor="1.10" vaporized=""/>
    <tripinfo id="car_n2w_179" depart="179.00" departLane="n2sep_1" departPos="3.60" departPosLat="0.00" departSpeed="13.90" departDelay="0.00" arrival="357.90" arrivalLane="c2w_1" arrivalPos="990.00" arrivalPosLat="0.00" arrivalSpeed="14.35" duration="178.90" routeLength="1986.69" waitingTime="25.00" waitingCount="1" stopTime="0.00" timeLoss="39.76" rerouteNo="1" devices="tripinfo_car_n2w_179 routing_car_n2w_179" vType="Car" speedFactor="1.03" vaporized=""/>
    <tripinfo id="car_n2e_150" depart="154.40" departLane="n2sep_1" departPos="3.60" departPosLat="0.00" departSpeed="13.90" departDelay="4.40" arrival="358.45" arrivalLane="c2e_1" arrivalPos="990.00" arrivalPosLat="0.00" arrivalSpeed="14.46" duration="204.05" routeLength="1996.47" waitingTime="42.95" waitingCount="2" stopTime="0.00" timeLoss="65.27" rerouteNo="1" devices="tripinfo_car_n2e_150 routing_car_n2e_150" vType="Car" speedFactor="1.04" vaporized=""/>
    <tripinfo id="car_n2s_190" depart="190.00" departLane="n2sep_1" departPos="3.60" departPosLat="0.00" departSpeed="13.90" departDelay="0.00" arrival="363.85" arrivalLane="c2s_1" arrivalPos="990.00" arrivalPosLat="0.00" arrivalSpeed="13.90" duration="173.85" routeLength="1997.01" waitingTime="14.70" waitingCount="1" stopTime="0.00" timeLoss="30.17" rerouteNo="1" devices="tripinfo_car_n2s_190 routing_car_n2s_190" vType="Car" speedFactor="1.00" vaporized=""/>
    <tripinfo id="car_n2w_194" depart="194.00" departLane="n2sep_1" departPos="3.60" departPosLat="0.00" departSpeed="13.90" departDelay="0.00" arrival="363.85" arrivalLane="c2w_1" arrivalPos="990.00" arrivalPosLat="0.00" arrivalSpeed="14.32" duration="169.85" routeLength="1986.69" waitingTime="12.80" waitingCount="1" stopTime="0.00" timeLoss="30.44" rerouteNo="1" devices="tripinfo_car_n2w_194 routing_car_n2w_194" vType="Car" speedFactor="1.03" vaporized=""/>
    <tripinfo id="car_n2s_202" depart="202.00" departLane="n2sep_1" departPos="3.60" departPosLat="0.00" departSpeed="13.90" departDelay="0.00" arrival="368.50" arrivalLane="c2s_1" arrivalPos="990.00" arrivalPosLat="0.00" arrivalSpeed="13.89" duration="166.50" routeLength="1997.01" waitingTime="5.40" waitingCount="1" stopTime="0.00" timeLoss="22.79" rerouteNo="1" devices="tripinfo_car_n2s_202 routing_car_n2s_202" vType="Car" speedFactor="1.00" vaporized=""/>
    <tripinfo id="car_n2s_207" depart="207.00" departLane="n2sep_1" departPos="3.60" departPosLat="0.00" departSpeed="13.90" departDelay="0.00" arrival="371.20" arrivalLane="c2s_1" arrivalPos="990.00" arrivalPosLat="0.00" arrivalSpeed="14.37" duration="164.20" routeLength="1997.01" waitingTime="3.45" waitingCount="1" stopTime="0.00" timeLoss="26.39" rerouteNo="1" devices="tripinfo_car_n2s_207 routing_car_n2s_207" vType="Car" speedFactor="1.04" vaporized=""/>
    <tripinfo id="car_s2w_193" depart="193.00" departLane="s2sep_1" departPos="3.60" departPosLat="0.00" departSpeed="13.90" departDelay="0.00" arrival="372.50" arrivalLane="c2w_1" arrivalPos="990.00" arrivalPosLat="0.00" arrivalSpeed="14.13" duration="179.50" routeLength="1996.47" waitingTime="26.25" waitingCount="2" stopTime="0.00" timeLoss="37.56" rerouteNo="1" devices="tripinfo_car_s2w_193 routing_car_s2w_193" vType="Car" speedFactor="1.02" vaporized=""/>
    <tripinfo id="car_n2s_210" depart="210.00" departLane="n2sep_1" departPos="3.60" departPosLat="0.00" departSpeed="13.90" departDelay="0.00" arrival="374.20" arrivalLane="c2s_1" arrivalPos="990.00" arrivalPosLat="0.00" arrivalSpeed="14.14" duration="164.20" routeLength="1997.01" waitingTime="0.00" waitingCount="0" stopTime="0.00" timeLoss="23.62" rerouteNo="1" devices="tripinfo_car_n2s_210 routing_car_n2s_210" vType="Car" speedFactor="1.02" vaporized=""/>
    <tripinfo id="car_s2e_228" depart="228.00" departLane="s2sep_1" departPos="3.60" departPosLat="0.00" departSpeed="13.90" departDelay="0.00" arrival="375.30" arrivalLane="c2e_1" arrivalPos="990.00" arrivalPosLat="0.00" arrivalSpeed="13.90" duration="147.30" routeLength="1986.69" waitingTime="0.00" waitingCount="0" stopTime="0.00" timeLoss="3.60" rerouteNo="1" devices="tripinfo_car_s2e_228 routing_car_s2e_228" vType="Car" speedFactor="1.00" vaporized=""/>
    <tripinfo id="car_s2n_231" depart="231.00" departLane="s2sep_1" departPos="3.60" departPosLat="0.00" departSpeed="13.90" departDelay="0.00" arrival="375.85" arrivalLane="c2n_1" arrivalPos="990.00" arrivalPosLat="0.00" arrivalSpeed="14.09" duration="144.85" routeLength="1997.01" waitingTime="0.00" waitingCount="0" stopTime="0.00" timeLoss="3.16" rerouteNo="1" devices="tripinfo_car_s2n_231 routing_car_s2n_231" vType="Car" speedFactor="1.01" vaporized=""/>
    <tripinfo id="car_s2w_207" depart="207.00" departLane="s2sep_1" departPos="3.60" departPosLat="0.00" departSpeed="13.90" departDelay="0.00" arrival="378.25" arrivalLane="c2w_1" arrivalPos="990.00" arrivalPosLat="0.00" arrivalSpeed="14.00" duration="171.25" routeLength="1996.47" waitingTime="16.65" waitingCount="1" stopTime="0.00" timeLoss="27.91" rerouteNo="1" devices="tripinfo_car_s2w_207 routing_car_s2w_207" vType="Car" speedFactor="1.01" vaporized=""/>
    <tripinfo id="car_n2e_230" depart="230.00" departLane="n2sep_1" departPos="3.60" departPosLat="0.00" departSpeed="13.90" departDelay="0.00" arrival="380.75" arrivalLane="c2e_1" arrivalPos="990.00" arrivalPosLat="0.00" arrivalSpeed="13.90" duration="150.75" routeLength="1996.47" waitingTime="0.00" waitingCount="0" stopTime="0.00" timeLoss="6.41" rerouteNo="1" devices="tripinfo_car_n2e_230 routing_car_n2e_230" vType="Car" speedFactor="1.00" vaporized=""/>
    <tripinfo id="car_e2n_211" depart="211.00" departLane="e2sep_1" departPos="3.60" departPosLat="0.00" departSpeed="13.90" departDelay="0.00" arrival="387.20" arrivalLane="c2n_1" arrivalPos="990.00" arrivalPosLat="0.00" arrivalSpeed="15.18" duration="176.20" routeLength="1986.69" waitingTime="33.70" waitingCount="1" stopTime="0.00" timeLoss="44.63" rerouteNo="1" devices="tripinfo_car_e2n_211 routing_car_e2n_211" vType="Car" speedFactor="1.09" vaporized=""/>
    <tripinfo id="car_w2s_212" depart="212.45" departLane="w2sep_1" departPos="3.60" departPosLat="0.00" departSpeed="13.90" departDelay="0.45" arrival="388.15" arrivalLane="c2s_1" arrivalPos="990.00" arrivalPosLat="0.00" arrivalSpeed="14.42" duration="175.70" routeLength="1986.69" waitingTime="26.80" waitingCount="1" stopTime="0.00" timeLoss="37.29" rerouteNo="1" devices="tripinfo_car_w2s_212 routing_car_w2s_212" vType="Car" speedFactor="1.04" vaporized=""/>
    <tripinfo id="car_e2w_205" depart="205.00" departLane="e2sep_1" departPos="3.60" departPosLat="0.00" departSpeed="13.90" departDelay="0.00" arrival="390.70" arrivalLane="c2w_1" arrivalPos="990.00" arrivalPosLat="0.00" arrivalSpeed="13.92" duration="185.70" routeLength="1997.01" waitingTime="35.05" waitingCount="1" stopTime="0.00" timeLoss="42.27" rerouteNo="1" devices="tripinfo_car_e2w_205 routing_car_e2w_205" vType="Car" speedFactor="1.00" vaporized=""/>
    <tripinfo id="car_e2n_212" depart="212.35" departLane="e2sep_1" departPos="3.60" departPosLat="0.00" departSpeed="13.90" departDelay="0.35" arrival="393.60" arrivalLane="c2n_1" arrivalPos="990.00" arrivalPosLat="0.00" arrivalSpeed="14.50" duration="181.25" routeLength="1986.69" waitingTime="30.50" waitingCount="1" stopTime="0.00" timeLoss="43.56" rerouteNo="1" devices="tripinfo_car_e2n_212 routing_car_e2n_212" vType="Car" speedFactor="1.04" vaporized=""/>
    <tripinfo id="car_w2s_217" depart="217.00" departLane="w2sep_1" departPos="3.60" departPosLat="0.00" departSpeed="13.90" departDelay="0.00" arrival="393.85" arrivalLane="c2s_1" arrivalPos="990.00" arrivalPosLat="0.00" arrivalSpeed="14.04" duration="176.85" routeLength="1986.69" waitingTime="23.35" waitingCount="1" stopTime="0.00" timeLoss="34.61" rerouteNo="1" devices="tripinfo_car_w2s_217 routing_car_w2s_217" vType="Car" speedFactor="1.01" vaporized=""/>
    <tripinfo id="car_e2w_217" depart="217.00" departLane="e2sep_1" departPos="3.60" departPosLat="0.00" departSpeed="13.90" departDelay="0.00" arrival="394.80" arrivalLane="c2w_1" arrivalPos="990.00" arrivalPosLat="0.00" arrivalSpeed="15.10" duration="177.80" routeLength="1997.01" waitingTime="28.05" waitingCount="1" stopTime="0.00" timeLoss="45.74" rerouteNo="1" devices="tripinfo_car_e2w_217 routing_car_e2w_217" vType="Car" speedFactor="1.09" vaporized=""/>
    <tripinfo id="car_w2e_228" depart="228.00" departLane="w2sep_1" departPos="3.60" departPosLat="0.00" departSpeed="13.90" departDelay="0.00" arrival="395.20" arrivalLane="c2e_1" arrivalPos="990.00" arrivalPosLat="0.00" arrivalSpeed="13.90" duration="167.20" routeLength="1997.01" waitingTime="13.55" waitingCount="1" stopTime="0.00" timeLoss="23.53" rerouteNo="1" devices="tripinfo_car_w2e_228 routing_car_w2e_228" vType="Car" speedFactor="1.00" vaporized=""/>
    <tripinfo id="car_w2s_254" depart="254.00" departLane="w2sep_1" departPos="3.60" departPosLat="0.00" departSpeed="13.90" departDelay="0.00" arrival="396.35" arrivalLane="c2s_1" arrivalPos="990.00" arrivalPosLat="0.00" arrivalSpeed="15.02" duration="142.35" routeLength="1986.69" waitingTime="0.00" waitingCount="0" stopTime="0.00" timeLoss="11.23" rerouteNo="1" devices="tripinfo_car_w2s_254 routing_car_w2s_254" vType="Car" speedFactor="1.10" vaporized=""/>
    <tripinfo id="car_e2n_214" depart="214.05" departLane="e2sep_1" departPos="3.60" departPosLat="0.00" departSpeed="13.90" departDelay="0.05" arrival="396.40" arrivalLane="c2n_1" arrivalPos="990.00" arrivalPosLat="0.00" arrivalSpeed="15.04" duration="182.35" routeLength="1986.69" waitingTime="29.30" waitingCount="1" stopTime="0.00" timeLoss="50.66" rerouteNo="1" devices="tripinfo_car_e2n_214 routing_car_e2n_214" vType="Car" speedFactor="1.09" vaporized=""/>
    <tripinfo id="car_e2n_218" depart="218.50" departLane="e2sep_1" departPos="3.60" departPosLat="0.00" departSpeed="13.90" departDelay="0.50" arrival="399.15" arrivalLane="c2n_1" arrivalPos="990.00" arrivalPosLat="0.00" arrivalSpeed="15.12" duration="180.65" routeLength="1986.69" waitingTime="26.90" waitingCount="1" stopTime="0.00" timeLoss="49.70" rerouteNo="1" devices="tripinfo_car_e2n_218 routing_car_e2n_218" vType="Car" speedFactor="1.10" vaporized=""/>
    <tripinfo id="car_w2e_229" depart="229.50" departLane="w2sep_1" departPos="3.60" departPosLat="0.00" departSpeed="13.90" departDelay="0.50" arrival="399.55" arrivalLane="c2e_1" arrivalPos="990.00" arrivalPosLat="0.00" arrivalSpeed="13.89" duration="170.05" routeLength="1997.01" waitingTime="11.20" waitingCount="1" stopTime="0.00" timeLoss="26.36" rerouteNo="1" devices="tripinfo_car_w2e_229 routing_car_w2e_229" vType="Car" speedFactor="1.00" vaporized=""/>
    <tripinfo id="car_e2s_231" depart="231.00" departLane="e2sep_1" departPos="3.60" departPosLat="0.00" departSpeed="13.90" departDelay="0.00" arrival="401.30" arrivalLane="c2s_1" arrivalPos="990.00" arrivalPosLat="0.00" arrivalSpeed="14.90" duration="170.30" routeLength="1996.47" waitingTime="23.35" waitingCount="2" stopTime="0.00" timeLoss="35.74" rerouteNo="1" devices="tripinfo_car_e2s_231 routing_car_e2s_231" vType="Car" speedFactor="1.07" vaporized=""/>
    <tripinfo id="car_e2w_232" depart="232.35" departLane="e2sep_1" departPos="3.60" departPosLat="0.00" departSpeed="13.90" departDelay="0.35" arrival="402.00" arrivalLane="c2w_1" arrivalPos="990.00" arrivalPosLat="0.00" arrivalSpeed="14.38" duration="169.65" routeLength="1997.01" waitingTime="15.05" waitingCount="1" stopTime="0.00" timeLoss="30.75" rerouteNo="1" devices="tripinfo_car_e2w_232 routing_car_e2w_232" vType="Car" speedFactor="1.03" vaporized=""/>
    <tripinfo id="car_w2e_257" depart="257.00" departLane="w2sep_1" departPos="3.60" departPosLat="0.00" departSpeed="13.90" departDelay="0.00" arrival="403.40" arrivalLane="c2e_1" arrivalPos="990.00" arrivalPosLat="0.00" arrivalSpeed="13.94" duration="146.40" routeLength="1997.01" waitingTime="0.00" waitingCount="0" stopTime="0.00" timeLoss="3.36" rerouteNo="1" devices="tripinfo_car_w2e_257 routing_car_w2e_257" vType="Car" speedFactor="1.00" vaporized=""/>
    <tripinfo id="car_e2w_237" depart="237.00" departLane="e2sep_1" departPos="3.60" departPosLat="0.00" departSpeed="13.90" departDelay="0.00" arrival="405.15" arrivalLane="c2w_1" arrivalPos="990.00" arrivalPosLat="0.00" arrivalSpeed="14.74" duration="168.15" routeLength="1997.01" waitingTime="13.55" waitingCount="1" stopTime="0.00" timeLoss="33.23" rerouteNo="1" devices="tripinfo_car_e2w_237 routing_car_e2w_237" vType="Car" speedFactor="1.06" vaporized=""/>
    <tripinfo id="amb_w2e_300" depart="300.55" departLane="w2sep_1" departPos="6.60" departPosLat="0.00" departSpeed="13.90" departDelay="0.55" arrival="408.25" arrivalLane="c2e_1" arrivalPos="990.00" arrivalPosLat="-0.95" arrivalSpeed="20.78" duration="107.70" routeLength="1994.01" waitingTime="0.00" waitingCount="0" stopTime="0.00" timeLoss="12.04" rerouteNo="1" devices="tripinfo_amb_w2e_300 routing_amb_w2e_300 bluelight_amb_w2e_300 fcd_amb_w2e_300" vType="Ambulance" speedFactor="1.50" vaporized="">
        <example_device customValue1="0.00" customValue2="-1.00"/>
    </tripinfo>
    <tripinfo id="car_e2w_258" depart="258.00" departLane="e2sep_1" departPos="3.60" departPosLat="0.00" departSpeed="13.90" departDelay="0.00" arrival="409.90" arrivalLane="c2w_1" arrivalPos="990.00" arrivalPosLat="0.00" arrivalSpeed="13.94" duration="151.90" routeLength="1997.01" waitingTime="0.00" waitingCount="0" stopTime="0.00" timeLoss="8.69" rerouteNo="1" devices="tripinfo_car_e2w_258 routing_car_e2w_258" vType="Car" speedFactor="1.00" vaporized=""/>
    <tripinfo id="car_w2n_211" depart="211.00" departLane="w2sep_1" departPos="3.60" departPosLat="0.00" departSpeed="13.90" departDelay="0.00" arrival="411.10" arrivalLane="c2n_1" arrivalPos="990.00" arrivalPosLat="0.00" arrivalSpeed="14.13" duration="200.10" routeLength="1996.47" waitingTime="47.10" waitingCount="2" stopTime="0.00" timeLoss="58.13" rerouteNo="1" devices="tripinfo_car_w2n_211 routing_car_w2n_211" vType="Car" speedFactor="1.02" vaporized=""/>
    <tripinfo id="car_e2w_261" depart="261.50" departLane="e2sep_1" departPos="3.60" departPosLat="0.00" departSpeed="13.90" departDelay="0.50" arrival="412.85" arrivalLane="c2w_1" arrivalPos="990.00" arrivalPosLat="0.00" arrivalSpeed="14.25" duration="151.35" routeLength="1997.01" waitingTime="0.00" waitingCount="0" stopTime="0.00" timeLoss="12.02" rerouteNo="1" devices="tripinfo_car_e2w_261 routing_car_e2w_261" vType="Car" speedFactor="1.03" vaporized=""/>
    <tripinfo id="bus_w2s_264" depart="264.00" departLane="w2sep_1" departPos="12.10" departPosLat="0.00" departSpeed="13.90" departDelay="0.00" arrival="413.25" arrivalLane="c2s_1" arrivalPos="990.00" arrivalPosLat="0.00" arrivalSpeed="13.90" duration="149.25" routeLength="1978.19" waitingTime="0.00" waitingCount="0" stopTime="0.00" timeLoss="6.19" rerouteNo="1" devices="tripinfo_bus_w2s_264 routing_bus_w2s_264" vType="Bus" speedFactor="1.00" vaporized=""/>
    <tripinfo id="car_w2n_224" depart="224.00" departLane="w2sep_1" departPos="3.60" departPosLat="0.00" departSpeed="13.90" departDelay="0.00" arrival="414.00" arrivalLane="c2n_1" arrivalPos="990.00" arrivalPosLat="0.00" arrivalSpeed="14.71" duration="190.00" routeLength="1996.47" waitingTime="35.85" waitingCount="2" stopTime="0.00" timeLoss="54.48" rerouteNo="1" devices="tripinfo_car_w2n_224 routing_car_w2n_224" vType="Car" speedFactor="1.07" vaporized=""/>
    <tripinfo id="car_w2s_266" depart="266.00" departLane="w2sep_1" departPos="3.60" departPosLat="0.00" departSpeed="13.90" departDelay="0.00" arrival="415.70" arrivalLane="c2s_1" arrivalPos="990.00" arrivalPosLat="0.00" arrivalSpeed="15.52" duration="149.70" routeLength="1986.69" waitingTime="0.00" waitingCount="0" stopTime="0.00" timeLoss="25.09" rerouteNo="1" devices="tripinfo_car_w2s_266 routing_car_w2s_266" vType="Car" speedFactor="1.15" vaporized=""/>
    <tripinfo id="car_w2n_291" depart="291.00" departLane="w2sep_1" departPos="3.60" departPosLat="0.00" departSpeed="13.90" departDelay="0.00" arrival="415.95" arrivalLane="c2n_1" arrivalPos="990.00" arrivalPosLat="0.00" arrivalSpeed="16.30" duration="124.95" routeLength="1996.47" waitingTime="0.00" waitingCount="0" stopTime="0.00" timeLoss="7.24" rerouteNo="1" devices="tripinfo_car_w2n_291 routing_car_w2n_291" vType="Car" speedFactor="1.23" vaporized=""/>
    <tripinfo id="car_w2s_273" depart="273.00" departLane="w2sep_1" departPos="3.60" departPosLat="0.00" departSpeed="13.90" departDelay="0.00" arrival="421.55" arrivalLane="c2s_1" arrivalPos="990.00" arrivalPosLat="0.00" arrivalSpeed="13.90" duration="148.55" routeLength="1986.69" waitingTime="0.00" waitingCount="0" stopTime="0.00" timeLoss="4.90" rerouteNo="1" devices="tripinfo_car_w2s_273 routing_car_w2s_273" vType="Car" speedFactor="1.00" vaporized=""/>
    <tripinfo id="car_e2s_260" depart="260.00" departLane="e2sep_1" departPos="3.60" departPosLat="0.00" departSpeed="13.90" departDelay="0.00" arrival="423.70" arrivalLane="c2s_1" arrivalPos="990.00" arrivalPosLat="0.00" arrivalSpeed="14.95" duration="163.70" routeLength="1996.47" waitingTime="12.95" waitingCount="1" stopTime="0.00" timeLoss="32.88" rerouteNo="1" devices="tripinfo_car_e2s_260 routing_car_e2s_260" vType="Car" speedFactor="1.10" vaporized=""/>
    <tripinfo id="car_w2e_291" depart="292.20" departLane="w2sep_1" departPos="3.60" departPosLat="0.00" departSpeed="13.90" departDelay="1.20" arrival="434.85" arrivalLane="c2e_1" arrivalPos="990.00" arrivalPosLat="0.00" arrivalSpeed="14.06" duration="142.65" routeLength="1997.01" waitingTime="0.00" waitingCount="0" stopTime="0.00" timeLoss="0.63" rerouteNo="1" devices="tripinfo_car_w2e_291 routing_car_w2e_291" vType="Car" speedFactor="1.01" vaporized=""/>
    <tripinfo id="car_e2w_282" depart="282.00" departLane="e2sep_1" departPos="3.60" departPosLat="0.00" departSpeed="13.90" departDelay="0.00" arrival="437.50" arrivalLane="c2w_1" arrivalPos="990.00" arrivalPosLat="0.00" arrivalSpeed="14.02" duration="155.50" routeLength="1997.01" waitingTime="6.10" waitingCount="1" stopTime="0.00" timeLoss="13.00" rerouteNo="1" devices="tripinfo_car_e2w_282 routing_car_e2w_282" vType="Car" speedFactor="1.01" vaporized=""/>
    <tripinfo id="car_w2e_296" depart="296.00" departLane="w2sep_1" departPos="3.60" departPosLat="0.00" departSpeed="13.90" departDelay="0.00" arrival="439.55" arrivalLane="c2e_1" arrivalPos="990.00" arrivalPosLat="0.00" arrivalSpeed="14.22" duration="143.55" routeLength="1997.01" waitingTime="0.00" waitingCount="0" stopTime="0.00" timeLoss="3.19" rerouteNo="1" devices="tripinfo_car_w2e_296 routing_car_w2e_296" vType="Car" speedFactor="1.02" vaporized=""/>
    <tripinfo id="car_e2s_294" depart="294.00" departLane="e2sep_1" departPos="3.60" departPosLat="0.00" departSpeed="13.90" departDelay="0.00" arrival="441.95" arrivalLane="c2s_1" arrivalPos="990.00" arrivalPosLat="0.00" arrivalSpeed="14.11" duration="147.95" routeLength="1996.47" waitingTime="0.00" waitingCount="0" stopTime="0.00" timeLoss="5.76" rerouteNo="1" devices="tripinfo_car_e2s_294 routing_car_e2s_294" vType="Car" speedFactor="1.02" vaporized=""/>
    <tripinfo id="car_n2w_239" depart="239.00" departLane="n2sep_1" departPos="3.60" departPosLat="0.00" departSpeed="13.90" departDelay="0.00" arrival="445.25" arrivalLane="c2w_1" arrivalPos="990.00" arrivalPosLat="0.00" arrivalSpeed="16.25" duration="206.25" routeLength="1986.69" waitingTime="73.05" waitingCount="1" stopTime="0.00" timeLoss="83.31" rerouteNo="1" devices="tripinfo_car_n2w_239 routing_car_n2w_239" vType="Car" speedFactor="1.17" vaporized=""/>
    <tripinfo id="car_w2n_302" depart="302.00" departLane="w2sep_1" departPos="3.60" departPosLat="0.00" departSpeed="13.90" departDelay="0.00" arrival="451.15" arrivalLane="c2n_1" arrivalPos="990.00" arrivalPosLat="0.00" arrivalSpeed="13.90" duration="149.15" routeLength="1996.47" waitingTime="0.00" waitingCount="0" stopTime="0.00" timeLoss="4.84" rerouteNo="1" devices="tripinfo_car_w2n_302 routing_car_w2n_302" vType="Car" speedFactor="1.00" vaporized=""/>
    <tripinfo id="car_s2e_238" depart="238.00" departLane="s2sep_1" departPos="3.60" departPosLat="0.00" departSpeed="13.90" departDelay="0.00" arrival="455.05" arrivalLane="c2e_1" arrivalPos="990.00" arrivalPosLat="0.00" arrivalSpeed="13.90" duration="217.05" routeLength="1986.69" waitingTime="66.00" waitingCount="1" stopTime="0.00" timeLoss="73.38" rerouteNo="1" devices="tripinfo_car_s2e_238 routing_car_s2e_238" vType="Car" speedFactor="1.00" vaporized=""/>
    <tripinfo id="car_s2n_239" depart="239.45" departLane="s2sep_1" departPos="3.60" departPosLat="0.00" departSpeed="13.90" departDelay="0.45" arrival="456.75" arrivalLane="c2n_1" arrivalPos="990.00" arrivalPosLat="0.00" arrivalSpeed="14.13" duration="217.30" routeLength="1997.01" waitingTime="63.75" waitingCount="1" stopTime="0.00" timeLoss="75.99" rerouteNo="1" devices="tripinfo_car_s2n_239 routing_car_s2n_239" vType="Car" speedFactor="1.02" vaporized=""/>
    <tripinfo id="car_n2w_250" depart="250.00" departLane="n2sep_1" departPos="3.60" departPosLat="0.00" departSpeed="13.90" departDelay="0.00" arrival="457.25" arrivalLane="c2w_1" arrivalPos="990.00" arrivalPosLat="0.00" arrivalSpeed="14.03" duration="207.25" routeLength="1986.69" waitingTime="55.85" waitingCount="1" stopTime="0.00" timeLoss="64.88" rerouteNo="1" devices="tripinfo_car_n2w_250 routing_car_n2w_250" vType="Car" speedFactor="1.01" vaporized=""/>
    <tripinfo id="car_s2e_258" depart="258.00" departLane="s2sep_1" departPos="3.60" departPosLat="0.00" departSpeed="13.90" departDelay="0.00" arrival="461.70" arrivalLane="c2e_1" arrivalPos="990.00" arrivalPosLat="0.00" arrivalSpeed="14.88" duration="203.70" routeLength="1986.69" waitingTime="55.80" waitingCount="1" stopTime="0.00" timeLoss="69.55" rerouteNo="1" devices="tripinfo_car_s2e_258 routing_car_s2e_258" vType="Car" speedFactor="1.07" vaporized=""/>
    <tripinfo id="car_n2w_260" depart="260.00" departLane="n2sep_1" departPos="3.60" departPosLat="0.00" departSpeed="13.90" departDelay="0.00" arrival="462.00" arrivalLane="c2w_1" arrivalPos="990.00" arrivalPosLat="0.00" arrivalSpeed="13.89" duration="202.00" routeLength="1986.69" waitingTime="46.20" waitingCount="1" stopTime="0.00" timeLoss="58.35" rerouteNo="1" devices="tripinfo_car_n2w_260 routing_car_n2w_260" vType="Car" speedFactor="1.00" vaporized=""/>
    <tripinfo id="car_n2s_285" depart="285.00" departLane="n2sep_1" departPos="3.60" departPosLat="0.00" departSpeed="13.90" departDelay="0.00" arrival="462.05" arrivalLane="c2s_1" arrivalPos="990.00" arrivalPosLat="0.00" arrivalSpeed="14.85" duration="177.05" routeLength="1997.01" waitingTime="29.30" waitingCount="1" stopTime="0.00" timeLoss="42.55" rerouteNo="1" devices="tripinfo_car_n2s_285 routing_car_n2s_285" vType="Car" speedFactor="1.07" vaporized=""/>
    <tripinfo id="bus_s2n_239" depart="242.10" departLane="s2sep_1" departPos="12.10" departPosLat="0.00" departSpeed="13.90" departDelay="3.10" arrival="462.70" arrivalLane="c2n_1" arrivalPos="990.00" arrivalPosLat="0.00" arrivalSpeed="13.88" duration="220.60" routeLength="1988.51" waitingTime="62.35" waitingCount="1" stopTime="0.00" timeLoss="77.50" rerouteNo="1" devices="tripinfo_bus_s2n_239 routing_bus_s2n_239" vType="Bus" speedFactor="1.00" vaporized=""/>
    <tripinfo id="car_n2w_264" depart="264.00" departLane="n2sep_1" departPos="3.60" departPosLat="0.00" departSpeed="13.90" departDelay="0.00" arrival="464.50" arrivalLane="c2w_1" arrivalPos="990.00" arrivalPosLat="0.00" arrivalSpeed="14.56" duration="200.50" routeLength="1986.69" waitingTime="45.00" waitingCount="1" stopTime="0.00" timeLoss="65.05" rerouteNo="1" devices="tripinfo_car_n2w_264 routing_car_n2w_264" vType="Car" speedFactor="1.06" vaporized=""/>
    <tripinfo id="car_s2n_246" depart="246.00" departLane="s2sep_1" departPos="3.60" departPosLat="0.00" departSpeed="13.90" departDelay="0.00" arrival="465.45" arrivalLane="c2n_1" arrivalPos="990.00" arrivalPosLat="0.00" arrivalSpeed="15.02" duration="219.45" routeLength="1997.01" waitingTime="60.95" waitingCount="1" stopTime="0.00" timeLoss="88.63" rerouteNo="1" devices="tripinfo_car_s2n_246 routing_car_s2n_246" vType="Car" speedFactor="1.10" vaporized=""/>
    <tripinfo id="car_n2w_267" depart="267.00" departLane="n2sep_1" departPos="3.60" departPosLat="0.00" departSpeed="13.90" departDelay="0.00" arrival="467.35" arrivalLane="c2w_1" arrivalPos="990.00" arrivalPosLat="0.00" arrivalSpeed="14.26" duration="200.35" routeLength="1986.69" waitingTime="42.55" waitingCount="1" stopTime="0.00" timeLoss="61.16" rerouteNo="1" devices="tripinfo_car_n2w_267 routing_car_n2w_267" vType="Car" speedFactor="1.03" vaporized=""/>
    <tripinfo id="car_s2n_282" depart="282.00" departLane="s2sep_1" departPos="3.60" departPosLat="0.00" departSpeed="13.90" departDelay="0.00" arrival="468.65" arrivalLane="c2n_1" arrivalPos="990.00" arrivalPosLat="0.00" arrivalSpeed="14.30" duration="186.65" routeLength="1997.01" waitingTime="31.15" waitingCount="1" stopTime="0.00" timeLoss="47.44" rerouteNo="1" devices="tripinfo_car_s2n_282 routing_car_s2n_282" vType="Car" speedFactor="1.03" vaporized=""/>
    <tripinfo id="car_n2w_293" depart="293.00" departLane="n2sep_1" departPos="3.60" departPosLat="0.00" departSpeed="13.90" departDelay="0.00" arrival="469.35" arrivalLane="c2w_1" arrivalPos="990.00" arrivalPosLat="0.00" arrivalSpeed="15.04" duration="176.35" routeLength="1986.69" waitingTime="25.25" waitingCount="1" stopTime="0.00" timeLoss="48.03" rerouteNo="1" devices="tripinfo_car_n2w_293 routing_car_n2w_293" vType="Car" speedFactor="1.12" vaporized=""/>
    <tripinfo id="car_s2e_328" depart="328.00" departLane="s2sep_1" departPos="3.60" departPosLat="0.00" departSpeed="13.90" departDelay="0.00" arrival="469.85" arrivalLane="c2e_1" arrivalPos="990.00" arrivalPosLat="0.00" arrivalSpeed="14.80" duration="141.85" routeLength="1986.69" waitingTime="0.00" waitingCount="0" stopTime="0.00" timeLoss="6.91" rerouteNo="1" devices="tripinfo_car_s2e_328 routing_car_s2e_328" vType="Car" speedFactor="1.06" vaporized=""/>
    <tripinfo id="car_s2n_286" depart="286.00" departLane="s2sep_1" departPos="3.60" departPosLat="0.00" departSpeed="13.90" departDelay="0.00" arrival="470.60" arrivalLane="c2n_1" arrivalPos="990.00" arrivalPosLat="0.00" arrivalSpeed="15.27" duration="184.60" routeLength="1997.01" waitingTime="30.50" waitingCount="1" stopTime="0.00" timeLoss="58.84" rerouteNo="1" devices="tripinfo_car_s2n_286 routing_car_s2n_286" vType="Car" speedFactor="1.14" vaporized=""/>
    <tripinfo id="car_s2e_332" depart="332.00" departLane="s2sep_1" departPos="3.60" departPosLat="0.00" departSpeed="13.90" departDelay="0.00" arrival="472.05" arrivalLane="c2e_1" arrivalPos="990.00" arrivalPosLat="0.00" arrivalSpeed="15.87" duration="140.05" routeLength="1986.69" waitingTime="0.00" waitingCount="0" stopTime="0.00" timeLoss="17.37" rerouteNo="1" devices="tripinfo_car_s2e_332 routing_car_s2e_332" vType="Car" speedFactor="1.17" vaporized=""/>
    <tripinfo id="car_s2n_303" depart="303.00" departLane="s2sep_1" departPos="3.60" departPosLat="0.00" departSpeed="13.90" departDelay="0.00" arrival="472.65" arrivalLane="c2n_1" arrivalPos="990.00" arrivalPosLat="0.00" arrivalSpeed="15.24" duration="169.65" routeLength="1997.01" waitingTime="17.65" waitingCount="1" stopTime="0.00" timeLoss="42.39" rerouteNo="1" devices="tripinfo_car_s2n_303 routing_car_s2n_303" vType="Car" speedFactor="1.13" vaporized=""/>
    <tripinfo id="car_n2w_295" depart="295.00" departLane="n2sep_1" departPos="3.60" departPosLat="0.00" departSpeed="13.90" departDelay="0.00" arrival="473.15" arrivalLane="c2w_1" arrivalPos="990.00" arrivalPosLat="0.00" arrivalSpeed="13.93" duration="178.15" routeLength="1986.69" waitingTime="17.55" waitingCount="1" stopTime="0.00" timeLoss="35.02" rerouteNo="1" devices="tripinfo_car_n2w_295 routing_car_n2w_295" vType="Car" speedFactor="1.00" vaporized=""/>
    <tripinfo id="bus_n2s_302" depart="302.00" departLane="n2sep_1" departPos="12.10" departPosLat="0.00" departSpeed="13.90" departDelay="0.00" arrival="474.50" arrivalLane="c2s_1" arrivalPos="990.00" arrivalPosLat="0.00" arrivalSpeed="13.90" duration="172.50" routeLength="1988.51" waitingTime="13.55" waitingCount="1" stopTime="0.00" timeLoss="29.42" rerouteNo="1" devices="tripinfo_bus_n2s_302 routing_bus_n2s_302" vType="Bus" speedFactor="1.00" vaporized=""/>
    <tripinfo id="car_s2n_340" depart="340.00" departLane="s2sep_1" departPos="3.60" departPosLat="0.00" departSpeed="13.90" departDelay="0.00" arrival="474.70" arrivalLane="c2n_1" arrivalPos="990.00" arrivalPosLat="0.00" arrivalSpeed="15.37" duration="134.70" routeLength="1997.01" waitingTime="0.00" waitingCount="0" stopTime="0.00" timeLoss="8.87" rerouteNo="1" devices="tripinfo_car_s2n_340 routing_car_s2n_340" vType="Car" speedFactor="1.14" vaporized=""/>
</tripinfos>
