<?xml version="1.0" encoding="UTF-8"?>

<!-- generated on 2021-05-18 18:07:18 by Eclipse SUMO GUI Version 1.9.1
<configuration xmlns:xsi="http://www.w3.org/2001/XMLSchema-instance" xsi:noNamespaceSchemaLocation="http://sumo.dlr.de/xsd/sumoConfiguration.xsd">

    <input>
        <net-file value="sumofiles/junction.net.xml"/>
        <route-files value="sumofiles/junction_preemption_24.rou.xml"/>
        <additional-files value="sumofiles/junction.det.xml"/>
    </input>

    <output>
        <tripinfo-output value="sumofiles/output/tripinfo_preemption_24.xml"/>
    </output>

    <time>
        <begin value="0"/>
        <end value="10000"/>
        <step-length value="1.0"/>
    </time>

    <processing>
        <lateral-resolution value="0.5"/>
    </processing>

    <report>
        <no-warnings value="true"/>
        <error-log value="sumofiles/output/errorlog_preemption_24.log"/>
        <no-step-log value="true"/>
    </report>

    <traci_server>
        <remote-port value="37999"/>
    </traci_server>

    <gui_only>
        <gui-settings-file value="sumofiles/junction-gui.settings.xml"/>
        <start value="true"/>
        <tracker-interval value="1"/>
    </gui_only>

</configuration>
-->

<tripinfos xmlns:xsi="http://www.w3.org/2001/XMLSchema-instance" xsi:noNamespaceSchemaLocation="http://sumo.dlr.de/xsd/tripinfo_file.xsd">
    <tripinfo id="car_n2s_4" depart="4.00" departLane="n2sep_1" departPos="3.60" departPosLat="0.00" departSpeed="13.90" departDelay="0.00" arrival="161.00" arrivalLane="c2s_1" arrivalPos="990.00" arrivalPosLat="0.00" arrivalSpeed="14.73" duration="157.00" routeLength="1997.01" waitingTime="10.00" waitingCount="1" stopTime="0.00" timeLoss="20.76" rerouteNo="1" devices="tripinfo_car_n2s_4 routing_car_n2s_4" vType="Car" speedFactor="1.06" vaporized=""/>
    <tripinfo id="car_n2s_16" depart="16.00" departLane="n2sep_1" departPos="3.60" departPosLat="0.00" departSpeed="13.90" departDelay="0.00" arrival="164.00" arrivalLane="c2s_1" arrivalPos="990.00" arrivalPosLat="0.00" arrivalSpeed="15.00" duration="148.00" routeLength="1997.01" waitingTime="1.00" waitingCount="1" stopTime="0.00" timeLoss="15.16" rerouteNo="1" devices="tripinfo_car_n2s_16 routing_car_n2s_16" vType="Car" speedFactor="1.08" vaporized=""/>
    <tripinfo id="car_s2n_19" depart="19.00" departLane="s2sep_1" departPos="3.60" departPosLat="0.00" departSpeed="13.90" departDelay="0.00" arrival="164.00" arrivalLane="c2n_1" arrivalPos="990.00" arrivalPosLat="0.00" arrivalSpeed="13.90" duration="145.00" routeLength="1997.01" waitingTime="0.00" waitingCount="0" stopTime="0.00" timeLoss="1.15" rerouteNo="1" devices="tripinfo_car_s2n_19 routing_car_s2n_19" vType="Car" speedFactor="1.00" vaporized=""/>
    <tripinfo id="car_n2e_14" depart="14.00" departLane="n2sep_1" departPos="3.60" departPosLat="0.00" departSpeed="13.90" departDelay="0.00" arrival="166.00" arrivalLane="c2e_1" arrivalPos="990.00" arrivalPosLat="0.00" arrivalSpeed="14.04" duration="152.00" routeLength="1996.47" waitingTime="0.00" waitingCount="0" stopTime="0.00" timeLoss="8.56" rerouteNo="1" devices="tripinfo_car_n2e_14 routing_car_n2e_14" vType="Car" speedFactor="1.01" vaporized=""/>
    <tripinfo id="car_s2w_12" depart="12.00" departLane="s2sep_1" departPos="3.60" departPosLat="0.00" departSpeed="13.90" departDelay="0.00" arrival="167.00" arrivalLane="c2w_1" arrivalPos="990.00" arrivalPosLat="0.00" arrivalSpeed="14.73" duration="155.00" routeLength="1996.47" waitingTime="2.00" waitingCount="1" stopTime="0.00" timeLoss="18.48" rerouteNo="1" devices="tripinfo_car_s2w_12 routing_car_s2w_12" vType="Car" speedFactor="1.06" vaporized=""/>
    <tripinfo id="car_n2s_17" depart="18.00" departLane="n2sep_1" departPos="3.60" departPosLat="0.00" departSpeed="13.90" departDelay="1.00" arrival="169.00" arrivalLane="c2s_1" arrivalPos="990.00" arrivalPosLat="0.00" arrivalSpeed="14.32" duration="151.00" routeLength="1997.01" waitingTime="0.00" waitingCount="0" stopTime="0.00" timeLoss="11.23" rerouteNo="1" devices="tripinfo_car_n2s_17 routing_car_n2s_17" vType="Car" speedFactor="1.03" vaporized=""/>
    <tripinfo id="car_s2e_35" depart="35.00" departLane="s2sep_1" departPos="3.60" departPosLat="0.00" departSpeed="13.90" departDelay="0.00" arrival="173.00" arrivalLane="c2e_1" arrivalPos="990.00" arrivalPosLat="0.00" arrivalSpeed="15.16" duration="138.00" routeLength="1986.69" waitingTime="0.00" waitingCount="0" stopTime="0.00" timeLoss="5.65" rerouteNo="1" devices="tripinfo_car_s2e_35 routing_car_s2e_35" vType="Car" speedFactor="1.09" vaporized=""/>
    <tripinfo id="car_n2e_36" depart="36.00" departLane="n2sep_1" departPos="3.60" departPosLat="0.00" departSpeed="13.90" departDelay="0.00" arrival="182.00" arrivalLane="c2e_1" arrivalPos="990.00" arrivalPosLat="0.00" arrivalSpeed="14.27" duration="146.00" routeLength="1996.47" waitingTime="0.00" waitingCount="0" stopTime="0.00" timeLoss="4.87" rerouteNo="1" devices="tripinfo_car_n2e_36 routing_car_n2e_36" vType="Car" speedFactor="1.03" vaporized=""/>
    <tripinfo id="car_n2s_41" depart="41.00" departLane="n2sep_1" departPos="3.60" departPosLat="0.00" departSpeed="13.90" departDelay="0.00" arrival="185.00" arrivalLane="c2s_1" arrivalPos="990.00" arrivalPosLat="0.00" arrivalSpeed="13.90" duration="144.00" routeLength="1997.01" waitingTime="0.00" waitingCount="0" stopTime="0.00" timeLoss="0.27" rerouteNo="1" devices="tripinfo_car_n2s_41 routing_car_n2s_41" vType="Car" speedFactor="1.00" vaporized=""/>
    <tripinfo id="car_n2s_43" depart="43.00" departLane="n2sep_1" departPos="3.60" departPosLat="0.00" departSpeed="13.90" departDelay="0.00" arrival="188.00" arrivalLane="c2s_1" arrivalPos="990.00" arrivalPosLat="0.00" arrivalSpeed="14.47" duration="145.00" routeLength="1997.01" waitingTime="0.00" waitingCount="0" stopTime="0.00" timeLoss="7.58" rerouteNo="1" devices="tripinfo_car_n2s_43 routing_car_n2s_43" vType="Car" speedFactor="1.05" vaporized=""/>
    <tripinfo id="car_s2n_49" depart="49.00" departLane="s2sep_1" departPos="3.60" departPosLat="0.00" departSpeed="13.90" departDelay="0.00" arrival="191.00" arrivalLane="c2n_1" arrivalPos="990.00" arrivalPosLat="0.00" arrivalSpeed="14.15" duration="142.00" routeLength="1997.01" waitingTime="0.00" waitingCount="0" stopTime="0.00" timeLoss="0.17" rerouteNo="1" devices="tripinfo_car_s2n_49 routing_car_s2n_49" vType="Car" speedFactor="1.02" vaporized=""/>
    <tripinfo id="car_n2s_44" depart="45.00" departLane="n2sep_1" departPos="3.60" departPosLat="0.00" departSpeed="13.90" departDelay="1.00" arrival="194.00" arrivalLane="c2s_1" arrivalPos="990.00" arrivalPosLat="0.00" arrivalSpeed="13.90" duration="149.00" routeLength="1997.01" waitingTime="0.00" waitingCount="0" stopTime="0.00" timeLoss="4.48" rerouteNo="1" devices="tripinfo_car_n2s_44 routing_car_n2s_44" vType="Car" speedFactor="1.00" vaporized=""/>
    <tripinfo id="car_s2w_51" depart="51.00" departLane="s2sep_1" departPos="3.60" departPosLat="0.00" departSpeed="13.90" departDelay="0.00" arrival="199.00" arrivalLane="c2w_1" arrivalPos="990.00" arrivalPosLat="0.00" arrivalSpeed="14.04" duration="148.00" routeLength="1996.47" waitingTime="0.00" waitingCount="0" stopTime="0.00" timeLoss="4.25" rerouteNo="1" devices="tripinfo_car_s2w_51 routing_car_s2w_51" vType="Car" speedFactor="1.01" vaporized=""/>
    <tripinfo id="car_n2e_60" depart="60.00" departLane="n2sep_1" departPos="3.60" departPosLat="0.00" departSpeed="13.90" departDelay="0.00" arrival="201.00" arrivalLane="c2e_1" arrivalPos="990.00" arrivalPosLat="0.00" arrivalSpeed="14.55" duration="141.00" routeLength="1996.47" waitingTime="0.00" waitingCount="0" stopTime="0.00" timeLoss="3.17" rerouteNo="1" devices="tripinfo_car_n2e_60 routing_car_n2e_60" vType="Car" speedFactor="1.05" vaporized=""/>
    <tripinfo id="car_w2s_21" depart="21.00" departLane="w2sep_1" departPos="3.60" departPosLat="0.00" departSpeed="13.90" departDelay="0.00" arrival="206.00" arrivalLane="c2s_1" arrivalPos="990.00" arrivalPosLat="0.00" arrivalSpeed="14.54" duration="185.00" routeLength="1986.69" waitingTime="38.00" waitingCount="1" stopTime="0.00" timeLoss="47.85" rerouteNo="1" devices="tripinfo_car_w2s_21 routing_car_w2s_21" vType="Car" speedFactor="1.05" vaporized=""/>
    <tripinfo id="car_e2w_27" depart="27.00" departLane="e2sep_1" departPos="3.60" departPosLat="0.00" departSpeed="13.90" departDelay="0.00" arrival="207.00" arrivalLane="c2w_1" arrivalPos="990.00" arrivalPosLat="0.00" arrivalSpeed="15.05" duration="180.00" routeLength="1997.01" waitingTime="34.00" waitingCount="1" stopTime="0.00" timeLoss="46.56" rerouteNo="1" devices="tripinfo_car_e2w_27 routing_car_e2w_27" vType="Car" speedFactor="1.08" vaporized=""/>
    <tripinfo id="car_w2e_38" depart="39.00" departLane="w2sep_1" departPos="3.60" departPosLat="0.00" departSpeed="13.90" departDelay="1.00" arrival="207.00" arrivalLane="c2e_1" arrivalPos="990.00" arrivalPosLat="0.00" arrivalSpeed="15.61" duration="168.00" routeLength="1997.01" waitingTime="22.00" waitingCount="1" stopTime="0.00" timeLoss="39.69" rerouteNo="1" devices="tripinfo_car_w2e_38 routing_car_w2e_38" vType="Car" speedFactor="1.12" vaporized=""/>
    <tripinfo id="car_e2n_21" depart="21.00" departLane="e2sep_1" departPos="3.60" departPosLat="0.00" departSpeed="13.90" departDelay="0.00" arrival="209.00" arrivalLane="c2n_1" arrivalPos="990.00" arrivalPosLat="0.00" arrivalSpeed="14.04" duration="188.00" routeLength="1986.69" waitingTime="35.00" waitingCount="1" stopTime="0.00" timeLoss="45.32" rerouteNo="1" devices="tripinfo_car_e2n_21 routing_car_e2n_21" vType="Car" speedFactor="1.01" vaporized=""/>
    <tripinfo id="car_w2s_37" depart="37.00" departLane="w2sep_1" departPos="3.60" departPosLat="0.00" departSpeed="13.90" departDelay="0.00" arrival="211.00" arrivalLane="c2s_1" arrivalPos="990.00" arrivalPosLat="0.00" arrivalSpeed="14.55" duration="174.00" routeLength="1986.69" waitingTime="23.00" waitingCount="1" stopTime="0.00" timeLoss="36.24" rerouteNo="1" devices="tripinfo_car_w2s_37 routing_car_w2s_37" vType="Car" speedFactor="1.05" vaporized=""/>
    <tripinfo id="car_e2w_62" depart="62.00" departLane="e2sep_1" departPos="3.60" departPosLat="0.00" departSpeed="13.90" departDelay="0.00" arrival="211.00" arrivalLane="c2w_1" arrivalPos="990.00" arrivalPosLat="0.00" arrivalSpeed="15.59" duration="149.00" routeLength="1997.01" waitingTime="5.00" waitingCount="1" stopTime="0.00" timeLoss="20.42" rerouteNo="1" devices="tripinfo_car_e2w_62 routing_car_e2w_62" vType="Car" speedFactor="1.12" vaporized=""/>
    <tripinfo id="car_e2n_46" depart="46.00" departLane="e2sep_1" departPos="3.60" departPosLat="0.00" departSpeed="13.90" departDelay="0.00" arrival="216.00" arrivalLane="c2n_1" arrivalPos="990.00" arrivalPosLat="0.00" arrivalSpeed="13.90" duration="170.00" routeLength="1986.69" waitingTime="13.00" waitingCount="1" stopTime="0.00" timeLoss="25.81" rerouteNo="1" devices="tripinfo_car_e2n_46 routing_car_e2n_46" vType="Car" speedFactor="1.00" vaporized=""/>
    <tripinfo id="car_e2w_73" depart="75.00" departLane="e2sep_1" departPos="3.60" departPosLat="0.00" departSpeed="13.90" departDelay="2.00" arrival="216.00" arrivalLane="c2w_1" arrivalPos="990.00" arrivalPosLat="0.00" arrivalSpeed="16.37" duration="141.00" routeLength="1997.01" waitingTime="0.00" waitingCount="0" stopTime="0.00" timeLoss="18.18" rerouteNo="1" devices="tripinfo_car_e2w_73 routing_car_e2w_73" vType="Car" speedFactor="1.18" vaporized=""/>
    <tripinfo id="car_w2e_46" depart="46.00" departLane="w2sep_1" departPos="3.60" departPosLat="0.00" departSpeed="13.90" departDelay="0.00" arrival="217.00" arrivalLane="c2e_1" arrivalPos="990.00" arrivalPosLat="0.00" arrivalSpeed="13.90" duration="171.00" routeLength="1997.01" waitingTime="14.00" waitingCount="1" stopTime="0.00" timeLoss="26.78" rerouteNo="1" devices="tripinfo_car_w2e_46 routing_car_w2e_46" vType="Car" speedFactor="1.00" vaporized=""/>
    <tripinfo id="car_w2s_58" depart="58.00" departLane="w2sep_1" departPos="3.60" departPosLat="0.00" departSpeed="13.90" departDelay="0.00" arrival="217.00" arrivalLane="c2s_1" arrivalPos="990.00" arrivalPosLat="0.00" arrivalSpeed="15.16" duration="159.00" routeLength="1986.69" waitingTime="10.00" waitingCount="1" stopTime="0.00" timeLoss="26.71" rerouteNo="1" devices="tripinfo_car_w2s_58 routing_car_w2s_58" vType="Car" speedFactor="1.09" vaporized=""/>
    <tripinfo id="car_w2e_49" depart="49.00" departLane="w2sep_1" departPos="3.60" departPosLat="0.00" departSpeed="13.90" departDelay="0.00" arrival="219.00" arrivalLane="c2e_1" arrivalPos="990.00" arrivalPosLat="0.00" arrivalSpeed="15.45" duration="170.00" routeLength="1997.01" waitingTime="14.00" waitingCount="1" stopTime="0.00" timeLoss="45.34" rerouteNo="1" devices="tripinfo_car_w2e_49 routing_car_w2e_49" vType="Car" speedFactor="1.16" vaporized=""/>
    <tripinfo id="car_w2s_84" depart="84.00" departLane="w2sep_1" departPos="3.60" departPosLat="0.00" departSpeed="13.90" departDelay="0.00" arrival="219.00" arrivalLane="c2s_1" arrivalPos="990.00" arrivalPosLat="0.00" arrivalSpeed="16.08" duration="135.00" routeLength="1986.69" waitingTime="0.00" waitingCount="0" stopTime="0.00" timeLoss="13.26" rerouteNo="1" devices="tripinfo_car_w2s_84 routing_car_w2s_84" vType="Car" speedFactor="1.18" vaporized=""/>
    <tripinfo id="car_e2n_63" depart="64.00" departLane="e2sep_1" departPos="3.60" departPosLat="0.00" departSpeed="13.90" departDelay="1.00" arrival="221.00" arrivalLane="c2n_1" arrivalPos="990.00" arrivalPosLat="0.00" arrivalSpeed="13.90" duration="157.00" routeLength="1986.69" waitingTime="0.00" waitingCount="0" stopTime="0.00" timeLoss="13.12" rerouteNo="1" devices="tripinfo_car_e2n_63 routing_car_e2n_63" vType="Car" speedFactor="1.00" vaporized=""/>
    <tripinfo id="car_w2e_74" depart="74.00" departLane="w2sep_1" departPos="3.60" departPosLat="0.00" departSpeed="13.90" departDelay="0.00" arrival="221.00" arrivalLane="c2e_1" arrivalPos="990.00" arrivalPosLat="0.00" arrivalSpeed="15.50" duration="147.00" routeLength="1997.01" waitingTime="0.00" waitingCount="0" stopTime="0.00" timeLoss="21.94" rerouteNo="1" devices="tripinfo_car_w2e_74 routing_car_w2e_74" vType="Car" speedFactor="1.15" vaporized=""/>
    <tripinfo id="car_e2w_85" depart="85.00" departLane="e2sep_1" departPos="3.60" departPosLat="0.00" departSpeed="13.90" departDelay="0.00" arrival="222.00" arrivalLane="c2w_1" arrivalPos="990.00" arrivalPosLat="0.00" arrivalSpeed="15.32" duration="137.00" routeLength="1997.01" waitingTime="0.00" waitingCount="0" stopTime="0.00" timeLoss="6.15" rerouteNo="1" devices="tripinfo_car_e2w_85 routing_car_e2w_85" vType="Car" speedFactor="1.10" vaporized=""/>
    <tripinfo id="car_e2n_71" depart="71.00" departLane="e2sep_1" departPos="3.60" departPosLat="0.00" departSpeed="13.90" departDelay="0.00" arrival="225.00" arrivalLane="c2n_1" arrivalPos="990.00" arrivalPosLat="0.00" arrivalSpeed="13.89" duration="154.00" routeLength="1986.69" waitingTime="0.00" waitingCount="0" stopTime="0.00" timeLoss="10.31" rerouteNo="1" devices="tripinfo_car_e2n_71 routing_car_e2n_71" vType="Car" speedFactor="1.00" vaporized=""/>
    <tripinfo id="car_e2s_29" depart="29.00" departLane="e2sep_1" departPos="3.60" departPosLat="0.00" departSpeed="13.90" departDelay="0.00" arrival="228.00" arrivalLane="c2s_1" arrivalPos="990.00" arrivalPosLat="0.00" arrivalSpeed="14.32" duration="199.00" routeLength="1996.47" waitingTime="40.00" waitingCount="2" stopTime="0.00" timeLoss="58.62" rerouteNo="1" devices="tripinfo_car_e2s_29 routing_car_e2s_29" vType="Car" speedFactor="1.03" vaporized=""/>
    <tripinfo id="car_e2s_71" depart="73.00" departLane="e2sep_1" departPos="3.60" departPosLat="0.00" departSpeed="13.90" departDelay="2.00" arrival="230.00" arrivalLane="c2s_1" arrivalPos="990.00" arrivalPosLat="0.00" arrivalSpeed="15.35" duration="157.00" routeLength="1996.47" waitingTime="9.00" waitingCount="1" stopTime="0.00" timeLoss="29.48" rerouteNo="1" devices="tripinfo_car_e2s_71 routing_car_e2s_71" vType="Car" speedFactor="1.13" vaporized=""/>
    <tripinfo id="car_e2s_76" depart="77.00" departLane="e2sep_1" departPos="3.60" departPosLat="0.00" departSpeed="13.90" departDelay="1.00" arrival="236.00" arrivalLane="c2s_1" arrivalPos="990.00" arrivalPosLat="0.00" arrivalSpeed="13.90" duration="159.00" routeLength="1996.47" waitingTime="0.00" waitingCount="0" stopTime="0.00" timeLoss="14.21" rerouteNo="1" devices="tripinfo_car_e2s_76 routing_car_e2s_76" vType="Car" speedFactor="1.00" vaporized=""/>
    <tripinfo id="car_e2s_86" depart="87.00" departLane="e2sep_1" departPos="3.60" departPosLat="0.00" departSpeed="13.90" departDelay="1.00" arrival="238.00" arrivalLane="c2s_1" arrivalPos="990.00" arrivalPosLat="0.00" arrivalSpeed="15.43" duration="151.00" routeLength="1996.47" waitingTime="0.00" waitingCount="0" stopTime="0.00" timeLoss="25.80" rerouteNo="1" devices="tripinfo_car_e2s_86 routing_car_e2s_86" vType="Car" speedFactor="1.16" vaporized=""/>
    <tripinfo id="car_w2n_111" depart="111.00" departLane="w2sep_1" departPos="3.60" departPosLat="0.00" departSpeed="13.90" departDelay="0.00" arrival="238.00" arrivalLane="c2n_1" arrivalPos="990.00" arrivalPosLat="0.00" arrivalSpeed="16.25" duration="127.00" routeLength="1996.47" waitingTime="0.00" waitingCount="0" stopTime="0.00" timeLoss="2.79" rerouteNo="1" devices="tripinfo_car_w2n_111 routing_car_w2n_111" vType="Car" speedFactor="1.17" vaporized=""/>
    <tripinfo id="car_n2w_58" depart="58.00" departLane="n2sep_1" departPos="3.60" departPosLat="0.00" departSpeed="13.90" departDelay="0.00" arrival="253.00" arrivalLane="c2w_1" arrivalPos="990.00" arrivalPosLat="0.00" arrivalSpeed="14.27" duration="195.00" routeLength="1986.69" waitingTime="44.00" waitingCount="1" stopTime="0.00" timeLoss="54.40" rerouteNo="1" devices="tripinfo_car_n2w_58 routing_car_n2w_58" vType="Car" speedFactor="1.03" vaporized=""/>
    <tripinfo id="car_s2e_71" depart="71.00" departLane="s2sep_1" departPos="3.60" departPosLat="0.00" departSpeed="13.90" departDelay="0.00" arrival="254.00" arrivalLane="c2e_1" arrivalPos="990.00" arrivalPosLat="0.00" arrivalSpeed="13.90" duration="183.00" routeLength="1986.69" waitingTime="30.00" waitingCount="1" stopTime="0.00" timeLoss="39.51" rerouteNo="1" devices="tripinfo_car_s2e_71 routing_car_s2e_71" vType="Car" speedFactor="1.00" vaporized=""/>
    <tripinfo id="car_s2e_74" depart="74.00" departLane="s2sep_1" departPos="3.60" departPosLat="0.00" departSpeed="13.90" departDelay="0.00" arrival="256.00" arrivalLane="c2e_1" arrivalPos="990.00" arrivalPosLat="0.00" arrivalSpeed="15.57" duration="182.00" routeLength="1986.69" waitingTime="29.00" waitingCount="1" stopTime="0.00" timeLoss="59.20" rerouteNo="1" devices="tripinfo_car_s2e_74 routing_car_s2e_74" vType="Car" speedFactor="1.17" vaporized=""/>
    <tripinfo id="car_n2s_82" depart="82.00" departLane="n2sep_1" departPos="3.60" departPosLat="0.00" departSpeed="13.90" departDelay="0.00" arrival="257.00" arrivalLane="c2s_1" arrivalPos="990.00" arrivalPosLat="0.00" arrivalSpeed="13.90" duration="175.00" routeLength="1997.01" waitingTime="20.00" waitingCount="1" stopTime="0.00" timeLoss="30.69" rerouteNo="1" devices="tripinfo_car_n2s_82 routing_car_n2s_82" vType="Car" speedFactor="1.00" vaporized=""/>
    <tripinfo id="car_s2n_77" depart="77.00" departLane="s2sep_1" departPos="3.60" departPosLat="0.00" departSpeed="13.90" departDelay="0.00" arrival="258.00" arrivalLane="c2n_1" arrivalPos="990.00" arrivalPosLat="0.00" arrivalSpeed="14.17" duration="181.00" routeLength="1997.01" waitingTime="27.00" waitingCount="1" stopTime="0.00" timeLoss="39.55" rerouteNo="1" devices="tripinfo_car_s2n_77 routing_car_s2n_77" vType="Car" speedFactor="1.02" vaporized=""/>
    <tripinfo id="car_n2w_93" depart="93.00" departLane="n2sep_1" departPos="3.60" departPosLat="0.00" departSpeed="13.90" departDelay="0.00" arrival="258.00" arrivalLane="c2w_1" arrivalPos="990.00" arrivalPosLat="0.00" arrivalSpeed="14.50" duration="165.00" routeLength="1986.69" waitingTime="13.00" waitingCount="1" stopTime="0.00" timeLoss="27.10" rerouteNo="1" devices="tripinfo_car_n2w_93 routing_car_n2w_93" vType="Car" speedFactor="1.04" vaporized=""/>
    <tripinfo id="car_s2n_87" depart="87.00" departLane="s2sep_1" departPos="3.60" departPosLat="0.00" departSpeed="13.90" departDelay="0.00" arrival="262.00" arrivalLane="c2n_1" arrivalPos="990.00" arrivalPosLat="0.00" arrivalSpeed="14.31" duration="175.00" routeLength="1997.01" waitingTime="20.00" waitingCount="1" stopTime="0.00" timeLoss="34.95" rerouteNo="1" devices="tripinfo_car_s2n_87 routing_car_s2n_87" vType="Car" speedFactor="1.03" vaporized=""/>
    <tripinfo id="car_s2e_89" depart="89.00" departLane="s2sep_1" departPos="3.60" departPosLat="0.00" departSpeed="13.90" departDelay="0.00" arrival="264.00" arrivalLane="c2e_1" arrivalPos="990.00" arrivalPosLat="0.00" arrivalSpeed="14.15" duration="175.00" routeLength="1986.69" waitingTime="17.00" waitingCount="1" stopTime="0.00" timeLoss="33.72" rerouteNo="1" devices="tripinfo_car_s2e_89 routing_car_s2e_89" vType="Car" speedFactor="1.02" vaporized=""/>
    <tripinfo id="car_n2w_104" depart="104.00" departLane="n2sep_1" departPos="3.60" departPosLat="0.00" departSpeed="13.90" departDelay="0.00" arrival="264.00" arrivalLane="c2w_1" arrivalPos="990.00" arrivalPosLat="0.00" arrivalSpeed="13.90" duration="160.00" routeLength="1986.69" waitingTime="1.00" waitingCount="1" stopTime="0.00" timeLoss="16.36" rerouteNo="1" devices="tripinfo_car_n2w_104 routing_car_n2w_104" vType="Car" speedFactor="1.00" vaporized=""/>
    <tripinfo id="car_s2e_90" depart="91.00" departLane="s2sep_1" departPos="3.60" departPosLat="0.00" departSpeed="13.90" departDelay="1.00" arrival="267.00" arrivalLane="c2e_1" arrivalPos="990.00" arrivalPosLat="0.00" arrivalSpeed="15.05" duration="176.00" routeLength="1986.69" waitingTime="16.00" waitingCount="1" stopTime="0.00" timeLoss="43.72" rerouteNo="1" devices="tripinfo_car_s2e_90 routing_car_s2e_90" vType="Car" speedFactor="1.09" vaporized=""/>
    <tripinfo id="car_n2w_109" depart="109.00" departLane="n2sep_1" departPos="3.60" departPosLat="0.00" departSpeed="13.90" departDelay="0.00" arrival="268.00" arrivalLane="c2w_1" arrivalPos="990.00" arrivalPosLat="0.00" arrivalSpeed="13.89" duration="159.00" routeLength="1986.69" waitingTime="0.00" waitingCount="0" stopTime="0.00" timeLoss="15.21" rerouteNo="1" devices="tripinfo_car_n2w_109 routing_car_n2w_109" vType="Car" speedFactor="1.00" vaporized=""/>
    <tripinfo id="car_s2n_108" depart="108.00" departLane="s2sep_1" departPos="3.60" departPosLat="0.00" departSpeed="13.90" departDelay="0.00" arrival="271.00" arrivalLane="c2n_1" arrivalPos="990.00" arrivalPosLat="0.00" arrivalSpeed="13.90" duration="163.00" routeLength="1997.01" waitingTime="1.00" waitingCount="1" stopTime="0.00" timeLoss="18.57" rerouteNo="1" devices="tripinfo_car_s2n_108 routing_car_s2n_108" vType="Car" speedFactor="1.00" vaporized=""/>
    <tripinfo id="car_n2w_117" depart="117.00" departLane="n2sep_1" departPos="3.60" departPosLat="0.00" departSpeed="13.90" departDelay="0.00" arrival="272.00" arrivalLane="c2w_1" arrivalPos="990.00" arrivalPosLat="0.00" arrivalSpeed="13.88" duration="155.00" routeLength="1986.69" waitingTime="0.00" waitingCount="0" stopTime="0.00" timeLoss="10.80" rerouteNo="1" devices="tripinfo_car_n2w_117 routing_car_n2w_117" vType="Car" speedFactor="1.00" vaporized=""/>
    <tripinfo id="car_s2n_112" depart="112.00" departLane="s2sep_1" departPos="3.60" departPosLat="0.00" departSpeed="13.90" departDelay="0.00" arrival="274.00" arrivalLane="c2n_1" arrivalPos="990.00" arrivalPosLat="0.00" arrivalSpeed="14.10" duration="162.00" routeLength="1997.01" waitingTime="0.00" waitingCount="0" stopTime="0.00" timeLoss="20.59" rerouteNo="1" devices="tripinfo_car_s2n_112 routing_car_s2n_112" vType="Car" speedFactor="1.02" vaporized=""/>
    <tripinfo id="car_s2w_92" depart="93.00" departLane="s2sep_1" departPos="3.60" departPosLat="0.00" departSpeed="13.90" departDelay="1.00" arrival="275.00" arrivalLane="c2w_1" arrivalPos="990.00" arrivalPosLat="0.00" arrivalSpeed="14.33" duration="182.00" routeLength="1996.47" waitingTime="18.00" waitingCount="2" stopTime="0.00" timeLoss="42.21" rerouteNo="1" devices="tripinfo_car_s2w_92 routing_car_s2w_92" vType="Car" speedFactor="1.04" vaporized=""/>
    <tripinfo id="car_s2e_121" depart="121.00" departLane="s2sep_1" departPos="3.60" departPosLat="0.00" departSpeed="13.90" departDelay="0.00" arrival="276.00" arrivalLane="c2e_1" arrivalPos="990.00" arrivalPosLat="0.00" arrivalSpeed="13.90" duration="155.00" routeLength="1986.69" waitingTime="0.00" waitingCount="0" stopTime="0.00" timeLoss="10.47" rerouteNo="1" devices="tripinfo_car_s2e_121 routing_car_s2e_121" vType="Car" speedFactor="1.00" vaporized=""/>
    <tripinfo id="car_s2w_95" depart="95.00" departLane="s2sep_1" departPos="3.60" departPosLat="0.00" departSpeed="13.90" departDelay="0.00" arrival="277.00" arrivalLane="c2w_1" arrivalPos="990.00" arrivalPosLat="0.00" arrivalSpeed="14.75" duration="182.00" routeLength="1996.47" waitingTime="16.00" waitingCount="2" stopTime="0.00" timeLoss="48.64" rerouteNo="1" devices="tripinfo_car_s2w_95 routing_car_s2w_95" vType="Car" speedFactor="1.09" vaporized=""/>
    <tripinfo id="car_s2e_131" depart="131.00" departLane="s2sep_1" departPos="3.60" departPosLat="0.00" departSpeed="13.90" departDelay="0.00" arrival="278.00" arrivalLane="c2e_1" arrivalPos="990.00" arrivalPosLat="0.00" arrivalSpeed="15.42" duration="147.00" routeLength="1986.69" waitingTime="0.00" waitingCount="0" stopTime="0.00" timeLoss="21.75" rerouteNo="1" devices="tripinfo_car_s2e_131 routing_car_s2e_131" vType="Car" speedFactor="1.15" vaporized=""/>
    <tripinfo id="car_s2w_127" depart="127.00" departLane="s2sep_1" departPos="3.60" departPosLat="0.00" departSpeed="13.90" departDelay="0.00" arrival="279.00" arrivalLane="c2w_1" arrivalPos="990.00" arrivalPosLat="0.00" arrivalSpeed="15.05" duration="152.00" routeLength="1996.47" waitingTime="0.00" waitingCount="0" stopTime="0.00" timeLoss="22.47" rerouteNo="1" devices="tripinfo_car_s2w_127 routing_car_s2w_127" vType="Car" speedFactor="1.12" vaporized=""/>
    <tripinfo id="car_n2e_74" depart="74.00" departLane="n2sep_1" departPos="3.60" departPosLat="0.00" departSpeed="13.90" departDelay="0.00" arrival="282.00" arrivalLane="c2e_1" arrivalPos="990.00" arrivalPosLat="0.00" arrivalSpeed="13.96" duration="208.00" routeLength="1996.47" waitingTime="45.00" waitingCount="2" stopTime="0.00" timeLoss="64.03" rerouteNo="1" devices="tripinfo_car_n2e_74 routing_car_n2e_74" vType="Car" speedFactor="1.01" vaporized=""/>
    <tripinfo id="car_w2e_122" depart="122.00" departLane="w2sep_1" departPos="3.60" departPosLat="0.00" departSpeed="13.90" departDelay="0.00" arrival="296.00" arrivalLane="c2e_1" arrivalPos="990.00" arrivalPosLat="0.00" arrivalSpeed="15.88" duration="174.00" routeLength="1997.01" waitingTime="35.00" waitingCount="1" stopTime="0.00" timeLoss="47.41" rerouteNo="1" devices="tripinfo_car_w2e_122 routing_car_w2e_122" vType="Car" speedFactor="1.14" vaporized=""/>
    <tripinfo id="car_e2w_98" depart="98.00" departLane="e2sep_1" departPos="3.60" departPosLat="0.00" departSpeed="13.90" departDelay="0.00" arrival="299.00" arrivalLane="c2w_1" arrivalPos="990.00" arrivalPosLat="0.00" arrivalSpeed="14.04" duration="201.00" routeLength="1997.01" waitingTime="49.00" waitingCount="1" stopTime="0.00" timeLoss="58.35" rerouteNo="1" devices="tripinfo_car_e2w_98 routing_car_e2w_98" vType="Car" speedFactor="1.01" vaporized=""/>
    <tripinfo id="car_w2s_105" depart="105.00" departLane="w2sep_1" departPos="3.60" departPosLat="0.00" departSpeed="13.90" departDelay="0.00" arrival="299.00" arrivalLane="c2s_1" arrivalPos="990.00" arrivalPosLat="0.00" arrivalSpeed="13.90" duration="194.00" routeLength="1986.69" waitingTime="41.00" waitingCount="1" stopTime="0.00" timeLoss="50.51" rerouteNo="1" devices="tripinfo_car_w2s_105 routing_car_w2s_105" vType="Car" speedFactor="1.00" vaporized=""/>
    <tripinfo id="car_w2s_114" depart="114.00" departLane="w2sep_1" departPos="3.60" departPosLat="0.00" departSpeed="13.90" departDelay="0.00" arrival="302.00" arrivalLane="c2s_1" arrivalPos="990.00" arrivalPosLat="0.00" arrivalSpeed="15.07" duration="188.00" routeLength="1986.69" waitingTime="39.00" waitingCount="1" stopTime="0.00" timeLoss="56.14" rerouteNo="1" devices="tripinfo_car_w2s_114 routing_car_w2s_114" vType="Car" speedFactor="1.10" vaporized=""/>
    <tripinfo id="car_e2w_115" depart="115.00" departLane="e2sep_1" departPos="3.60" departPosLat="0.00" departSpeed="13.90" departDelay="0.00" arrival="304.00" arrivalLane="c2w_1" arrivalPos="990.00" arrivalPosLat="0.00" arrivalSpeed="13.94" duration="189.00" routeLength="1997.01" waitingTime="32.00" waitingCount="1" stopTime="0.00" timeLoss="45.05" rerouteNo="1" devices="tripinfo_car_e2w_115 routing_car_e2w_115" vType="Car" speedFactor="1.00" vaporized=""/>
    <tripinfo id="car_e2s_126" depart="128.00" departLane="e2sep_1" departPos="3.60" departPosLat="0.00" departSpeed="13.90" departDelay="2.00" arrival="304.00" arrivalLane="c2s_1" arrivalPos="990.00" arrivalPosLat="0.00" arrivalSpeed="15.33" duration="176.00" routeLength="1996.47" waitingTime="26.00" waitingCount="2" stopTime="0.00" timeLoss="47.90" rerouteNo="1" devices="tripinfo_car_e2s_126 routing_car_e2s_126" vType="Car" speedFactor="1.13" vaporized=""/>
    <tripinfo id="car_e2n_129" depart="132.00" departLane="e2sep_1" departPos="3.60" departPosLat="0.00" departSpeed="13.90" departDelay="3.00" arrival="306.00" arrivalLane="c2n_1" arrivalPos="990.00" arrivalPosLat="0.00" arrivalSpeed="14.12" duration="174.00" routeLength="1986.69" waitingTime="18.00" waitingCount="1" stopTime="0.00" timeLoss="32.36" rerouteNo="1" devices="tripinfo_car_e2n_129 routing_car_e2n_129" vType="Car" speedFactor="1.02" vaporized=""/>
    <tripinfo id="car_e2w_126" depart="126.00" departLane="e2sep_1" departPos="3.60" departPosLat="0.00" departSpeed="13.90" departDelay="0.00" arrival="307.00" arrivalLane="c2w_1" arrivalPos="990.00" arrivalPosLat="0.00" arrivalSpeed="14.17" duration="181.00" routeLength="1997.01" waitingTime="24.00" waitingCount="1" stopTime="0.00" timeLoss="40.02" rerouteNo="1" devices="tripinfo_car_e2w_126 routing_car_e2w_126" vType="Car" speedFactor="1.02" vaporized=""/>
    <tripinfo id="car_e2n_130" depart="134.00" departLane="e2sep_1" departPos="3.60" departPosLat="0.00" departSpeed="13.90" departDelay="4.00" arrival="312.00" arrivalLane="c2n_1" arrivalPos="990.00" arrivalPosLat="0.00" arrivalSpeed="13.90" duration="178.00" routeLength="1986.69" waitingTime="15.00" waitingCount="1" stopTime="0.00" timeLoss="33.59" rerouteNo="1" devices="tripinfo_car_e2n_130 routing_car_e2n_130" vType="Car" speedFactor="1.00" vaporized=""/>
    <tripinfo id="car_w2n_131" depart="131.00" departLane="w2sep_1" departPos="3.60" departPosLat="0.00" departSpeed="13.90" departDelay="0.00" arrival="313.00" arrivalLane="c2n_1" arrivalPos="990.00" arrivalPosLat="0.00" arrivalSpeed="14.94" duration="182.00" routeLength="1996.47" waitingTime="36.00" waitingCount="2" stopTime="0.00" timeLoss="59.55" rerouteNo="1" devices="tripinfo_car_w2n_131 routing_car_w2n_131" vType="Car" speedFactor="1.18" vaporized=""/>
    <tripinfo id="car_e2w_137" depart="137.00" departLane="e2sep_1" departPos="3.60" departPosLat="0.00" departSpeed="13.90" departDelay="0.00" arrival="313.00" arrivalLane="c2w_1" arrivalPos="990.00" arrivalPosLat="0.00" arrivalSpeed="13.97" duration="176.00" routeLength="1997.01" waitingTime="14.00" waitingCount="1" stopTime="0.00" timeLoss="32.27" rerouteNo="1" devices="tripinfo_car_e2w_137 routing_car_e2w_137" vType="Car" speedFactor="1.01" vaporized=""/>
    <tripinfo id="car_w2s_165" depart="165.00" departLane="w2sep_1" departPos="3.60" departPosLat="0.00" departSpeed="13.90" departDelay="0.00" arrival="314.00" arrivalLane="c2s_1" arrivalPos="990.00" arrivalPosLat="0.00" arrivalSpeed="13.90" duration="149.00" routeLength="1986.69" waitingTime="0.00" waitingCount="0" stopTime="0.00" timeLoss="5.45" rerouteNo="1" devices="tripinfo_car_w2s_165 routing_car_w2s_165" vType="Car" speedFactor="1.00" vaporized=""/>
    <tripinfo id="car_e2w_164" depart="164.00" departLane="e2sep_1" departPos="3.60" departPosLat="0.00" departSpeed="13.90" departDelay="0.00" arrival="315.00" arrivalLane="c2w_1" arrivalPos="990.00" arrivalPosLat="0.00" arrivalSpeed="14.48" duration="151.00" routeLength="1997.01" waitingTime="0.00" waitingCount="0" stopTime="0.00" timeLoss="14.85" rerouteNo="1" devices="tripinfo_car_e2w_164 routing_car_e2w_164" vType="Car" speedFactor="1.06" vaporized=""/>
    <tripinfo id="car_e2s_127" depart="130.00" departLane="e2sep_1" departPos="3.60" departPosLat="0.00" departSpeed="13.90" departDelay="3.00" arrival="317.00" arrivalLane="c2s_1" arrivalPos="990.00" arrivalPosLat="0.00" arrivalSpeed="14.91" duration="187.00" routeLength="1996.47" waitingTime="22.00" waitingCount="2" stopTime="0.00" timeLoss="53.07" rerouteNo="1" devices="tripinfo_car_e2s_127 routing_car_e2s_127" vType="Car" speedFactor="1.08" vaporized=""/>
    <tripinfo id="car_e2s_140" depart="140.00" departLane="e2sep_1" departPos="3.60" departPosLat="0.00" departSpeed="13.90" departDelay="0.00" arrival="319.00" arrivalLane="c2s_1" arrivalPos="990.00" arrivalPosLat="0.00" arrivalSpeed="15.67" duration="179.00" routeLength="1996.47" waitingTime="19.00" waitingCount="2" stopTime="0.00" timeLoss="55.09" rerouteNo="1" devices="tripinfo_car_e2s_140 routing_car_e2s_140" vType="Car" speedFactor="1.17" vaporized=""/>
    <tripinfo id="car_w2n_152" depart="152.00" departLane="w2sep_1" departPos="3.60" departPosLat="0.00" departSpeed="13.90" departDelay="0.00" arrival="320.00" arrivalLane="c2n_1" arrivalPos="990.00" arrivalPosLat="0.00" arrivalSpeed="13.90" duration="168.00" routeLength="1996.47" waitingTime="10.00" waitingCount="1" stopTime="0.00" timeLoss="23.25" rerouteNo="1" devices="tripinfo_car_w2n_152 routing_car_w2n_152" vType="Car" speedFactor="1.00" vaporized=""/>
    <tripinfo id="car_e2s_142" depart="142.00" departLane="e2sep_1" departPos="3.60" departPosLat="0.00" departSpeed="13.90" departDelay="0.00" arrival="322.00" arrivalLane="c2s_1" arrivalPos="990.00" arrivalPosLat="0.00" arrivalSpeed="14.40" duration="180.00" routeLength="1996.47" waitingTime="10.00" waitingCount="1" stopTime="0.00" timeLoss="40.73" rerouteNo="1" devices="tripinfo_car_e2s_142 routing_car_e2s_142" vType="Car" speedFactor="1.04" vaporized=""/>
    <tripinfo id="car_w2n_173" depart="173.00" departLane="w2sep_1" departPos="3.60" departPosLat="0.00" departSpeed="13.90" departDelay="0.00" arrival="323.00" arrivalLane="c2n_1" arrivalPos="990.00" arrivalPosLat="0.00" arrivalSpeed="14.30" duration="150.00" routeLength="1996.47" waitingTime="0.00" waitingCount="0" stopTime="0.00" timeLoss="9.86" rerouteNo="1" devices="tripinfo_car_w2n_173 routing_car_w2n_173" vType="Car" speedFactor="1.03" vaporized=""/>
    <tripinfo id="car_e2n_181" depart="181.00" departLane="e2sep_1" departPos="3.60" departPosLat="0.00" departSpeed="13.90" departDelay="0.00" arrival="329.00" arrivalLane="c2n_1" arrivalPos="990.00" arrivalPosLat="0.00" arrivalSpeed="14.00" duration="148.00" routeLength="1986.69" waitingTime="0.00" waitingCount="0" stopTime="0.00" timeLoss="5.29" rerouteNo="1" devices="tripinfo_car_e2n_181 routing_car_e2n_181" vType="Car" speedFactor="1.01" vaporized=""/>
    <tripinfo id="car_n2w_168" depart="168.00" departLane="n2sep_1" departPos="3.60" departPosLat="0.00" departSpeed="13.90" departDelay="0.00" arrival="337.00" arrivalLane="c2w_1" arrivalPos="990.00" arrivalPosLat="0.00" arrivalSpeed="16.40" duration="169.00" routeLength="1986.69" waitingTime="34.00" waitingCount="1" stopTime="0.00" timeLoss="46.45" rerouteNo="1" devices="tripinfo_car_n2w_168 routing_car_n2w_168" vType="Car" speedFactor="1.18" vaporized=""/>
    <tripinfo id="car_s2e_145" depart="145.00" departLane="s2sep_1" departPos="3.60" departPosLat="0.00" departSpeed="13.90" departDelay="0.00" arrival="343.00" arrivalLane="c2e_1" arrivalPos="990.00" arrivalPosLat="0.00" arrivalSpeed="14.21" duration="198.00" routeLength="1986.69" waitingTime="47.00" waitingCount="1" stopTime="0.00" timeLoss="57.10" rerouteNo="1" devices="tripinfo_car_s2e_145 routing_car_s2e_145" vType="Car" speedFactor="1.02" vaporized=""/>
    <tripinfo id="car_n2s_150" depart="150.00" departLane="n2sep_1" departPos="3.60" departPosLat="0.00" departSpeed="13.90" departDelay="0.00" arrival="343.00" arrivalLane="c2s_1" arrivalPos="990.00" arrivalPosLat="0.00" arrivalSpeed="14.22" duration="193.00" routeLength="1997.01" waitingTime="42.00" waitingCount="1" stopTime="0.00" timeLoss="52.27" rerouteNo="1" devices="tripinfo_car_n2s_150 routing_car_n2s_150" vType="Car" speedFactor="1.02" vaporized=""/>
    <tripinfo id="car_s2n_157" depart="157.00" departLane="s2sep_1" departPos="3.60" departPosLat="0.00" departSpeed="13.90" departDelay="0.00" arrival="346.00" arrivalLane="c2n_1" arrivalPos="990.00" arrivalPosLat="0.00" arrivalSpeed="14.17" duration="189.00" routeLength="1997.01" waitingTime="36.00" waitingCount="1" stopTime="0.00" timeLoss="47.13" rerouteNo="1" devices="tripinfo_car_s2n_157 routing_car_s2n_157" vType="Car" speedFactor="1.02" vaporized=""/>
    <tripinfo id="car_n2s_179" depart="179.00" departLane="n2sep_1" departPos="3.60" departPosLat="0.00" departSpeed="13.90" departDelay="0.00" arrival="346.00" arrivalLane="c2s_1" arrivalPos="990.00" arrivalPosLat="0.00" arrivalSpeed="15.20" duration="167.00" routeLength="1997.01" waitingTime="21.00" waitingCount="1" stopTime="0.00" timeLoss="35.96" rerouteNo="1" devices="tripinfo_car_n2s_179 routing_car_n2s_179" vType="Car" speedFactor="1.10" vaporized=""/>
    <tripinfo id="car_n2s_185" depart="185.00" departLane="n2sep_1" departPos="3.60" departPosLat="0.00" departSpeed="13.90" departDelay="0.00" arrival="349.00" arrivalLane="c2s_1" arrivalPos="990.00" arrivalPosLat="0.00" arrivalSpeed="15.04" duration="164.00" routeLength="1997.01" waitingTime="15.00" waitingCount="1" stopTime="0.00" timeLoss="31.20" rerouteNo="1" devices="tripinfo_car_n2s_185 routing_car_n2s_185" vType="Car" speedFactor="1.09" vaporized=""/>
    <tripinfo id="car_n2s_197" depart="197.00" departLane="n2sep_1" departPos="3.60" departPosLat="0.00" departSpeed="13.90" departDelay="0.00" arrival="358.00" arrivalLane="c2s_1" arrivalPos="990.00" arrivalPosLat="0.00" arrivalSpeed="14.32" duration="161.00" routeLength="1997.01" waitingTime="3.00" waitingCount="1" stopTime="0.00" timeLoss="21.31" rerouteNo="1" devices="tripinfo_car_n2s_197 routing_car_n2s_197" vType="Car" speedFactor="1.03" vaporized=""/>
    <tripinfo id="bus_n2w_188" depart="188.00" departLane="n2sep_1" departPos="12.10" departPosLat="0.00" departSpeed="13.90" departDelay="0.00" arrival="359.00" arrivalLane="c2w_1" arrivalPos="990.00" arrivalPosLat="0.00" arrivalSpeed="13.90" duration="171.00" routeLength="1978.19" waitingTime="9.00" waitingCount="1" stopTime="0.00" timeLoss="27.02" rerouteNo="1" devices="tripinfo_bus_n2w_188 routing_bus_n2w_188" vType="Bus" speedFactor="1.00" vaporized=""/>
    <tripinfo id="car_n2s_206" depart="206.00" departLane="n2sep_1" departPos="3.60" departPosLat="0.00" departSpeed="13.90" departDelay="0.00" arrival="364.00" arrivalLane="c2s_1" arrivalPos="990.00" arrivalPosLat="0.00" arrivalSpeed="13.92" duration="158.00" routeLength="1997.01" waitingTime="0.00" waitingCount="0" stopTime="0.00" timeLoss="13.76" rerouteNo="1" devices="tripinfo_car_n2s_206 routing_car_n2s_206" vType="Car" speedFactor="1.00" vaporized=""/>
    <tripinfo id="car_n2w_217" depart="217.00" departLane="n2sep_1" departPos="3.60" departPosLat="0.00" departSpeed="13.90" departDelay="0.00" arrival="365.00" arrivalLane="c2w_1" arrivalPos="990.00" arrivalPosLat="0.00" arrivalSpeed="14.20" duration="148.00" routeLength="1986.69" waitingTime="0.00" waitingCount="0" stopTime="0.00" timeLoss="7.24" rerouteNo="1" devices="tripinfo_car_n2w_217 routing_car_n2w_217" vType="Car" speedFactor="1.02" vaporized=""/>
    <tripinfo id="car_s2n_230" depart="230.00" departLane="s2sep_1" departPos="3.60" departPosLat="0.00" departSpeed="13.90" departDelay="0.00" arrival="366.00" arrivalLane="c2n_1" arrivalPos="990.00" arrivalPosLat="0.00" arrivalSpeed="14.80" duration="136.00" routeLength="1997.01" waitingTime="0.00" waitingCount="0" stopTime="0.00" timeLoss="0.20" rerouteNo="1" devices="tripinfo_car_s2n_230 routing_car_s2n_230" vType="Car" speedFactor="1.07" vaporized=""/>
    <tripinfo id="car_s2w_188" depart="188.00" departLane="s2sep_1" departPos="3.60" departPosLat="0.00" departSpeed="13.90" departDelay="0.00" arrival="369.00" arrivalLane="c2w_1" arrivalPos="990.00" arrivalPosLat="0.00" arrivalSpeed="14.36" duration="181.00" routeLength="1996.47" waitingTime="21.00" waitingCount="2" stopTime="0.00" timeLoss="41.12" rerouteNo="1" devices="tripinfo_car_s2w_188 routing_car_s2w_188" vType="Car" speedFactor="1.03" vaporized=""/>
    <tripinfo id="car_n2e_223" depart="223.00" departLane="n2sep_1" departPos="3.60" departPosLat="0.00" departSpeed="13.90" departDelay="0.00" arrival="371.00" arrivalLane="c2e_1" arrivalPos="990.00" arrivalPosLat="0.00" arrivalSpeed="14.04" duration="148.00" routeLength="1996.47" waitingTime="0.00" waitingCount="0" stopTime="0.00" timeLoss="4.35" rerouteNo="1" devices="tripinfo_car_n2e_223 routing_car_n2e_223" vType="Car" speedFactor="1.01" vaporized=""/>
    <tripinfo id="bus_s2w_216" depart="216.00" departLane="s2sep_1" departPos="12.10" departPosLat="0.00" departSpeed="13.90" departDelay="0.00" arrival="374.00" arrivalLane="c2w_1" arrivalPos="990.00" arrivalPosLat="0.00" arrivalSpeed="13.87" duration="158.00" routeLength="1987.97" waitingTime="0.00" waitingCount="0" stopTime="0.00" timeLoss="14.15" rerouteNo="1" devices="tripinfo_bus_s2w_216 routing_bus_s2w_216" vType="Bus" speedFactor="1.00" vaporized=""/>
    <tripinfo id="car_w2s_205" depart="205.00" departLane="w2sep_1" departPos="3.60" departPosLat="0.00" departSpeed="13.90" departDelay="0.00" arrival="381.00" arrivalLane="c2s_1" arrivalPos="990.00" arrivalPosLat="0.00" arrivalSpeed="15.95" duration="176.00" routeLength="1986.69" waitingTime="39.00" waitingCount="1" stopTime="0.00" timeLoss="50.12" rerouteNo="1" devices="tripinfo_car_w2s_205 routing_car_w2s_205" vType="Car" speedFactor="1.15" vaporized=""/>
    <tripinfo id="car_n2e_241" depart="241.00" departLane="n2sep_1" departPos="3.60" departPosLat="0.00" departSpeed="13.90" departDelay="0.00" arrival="384.00" arrivalLane="c2e_1" arrivalPos="990.00" arrivalPosLat="0.00" arrivalSpeed="14.38" duration="143.00" routeLength="1996.47" waitingTime="0.00" waitingCount="0" stopTime="0.00" timeLoss="2.61" rerouteNo="1" devices="tripinfo_car_n2e_241 routing_car_n2e_241" vType="Car" speedFactor="1.03" vaporized=""/>
    <tripinfo id="car_e2n_190" depart="190.00" departLane="e2sep_1" departPos="3.60" departPosLat="0.00" departSpeed="13.90" departDelay="0.00" arrival="389.00" arrivalLane="c2n_1" arrivalPos="990.00" arrivalPosLat="0.00" arrivalSpeed="13.90" duration="199.00" routeLength="1986.69" waitingTime="46.00" waitingCount="1" stopTime="0.00" timeLoss="55.53" rerouteNo="1" devices="tripinfo_car_e2n_190 routing_car_e2n_190" vType="Car" speedFactor="1.00" vaporized=""/>
    <tripinfo id="car_w2s_213" depart="213.00" departLane="w2sep_1" departPos="3.60" departPosLat="0.00" departSpeed="13.90" departDelay="0.00" arrival="392.00" arrivalLane="c2s_1" arrivalPos="990.00" arrivalPosLat="0.00" arrivalSpeed="14.00" duration="179.00" routeLength="1986.69" waitingTime="25.00" waitingCount="1" stopTime="0.00" timeLoss="36.03" rerouteNo="1" devices="tripinfo_car_w2s_213 routing_car_w2s_213" vType="Car" speedFactor="1.01" vaporized=""/>
    <tripinfo id="car_w2e_221" depart="221.00" departLane="w2sep_1" departPos="3.60" departPosLat="0.00" departSpeed="13.90" departDelay="0.00" arrival="392.00" arrivalLane="c2e_1" arrivalPos="990.00" arrivalPosLat="0.00" arrivalSpeed="14.50" duration="171.00" routeLength="1997.01" waitingTime="20.00" waitingCount="1" stopTime="0.00" timeLoss="32.50" rerouteNo="1" devices="tripinfo_car_w2e_221 routing_car_w2e_221" vType="Car" speedFactor="1.04" vaporized=""/>
    <tripinfo id="car_e2n_194" depart="194.00" departLane="e2sep_1" departPos="3.60" departPosLat="0.00" departSpeed="13.90" departDelay="0.00" arrival="393.00" arrivalLane="c2n_1" arrivalPos="990.00" arrivalPosLat="0.00" arrivalSpeed="14.12" duration="199.00" routeLength="1986.69" waitingTime="43.00" waitingCount="1" stopTime="0.00" timeLoss="57.62" rerouteNo="1" devices="tripinfo_car_e2n_194 routing_car_e2n_194" vType="Car" speedFactor="1.02" vaporized=""/>
    <tripinfo id="car_w2s_221" depart="223.00" departLane="w2sep_1" departPos="3.60" departPosLat="0.00" departSpeed="13.90" departDelay="2.00" arrival="395.00" arrivalLane="c2s_1" arrivalPos="990.00" arrivalPosLat="0.00" arrivalSpeed="15.04" duration="172.00" routeLength="1986.69" waitingTime="19.00" waitingCount="1" stopTime="0.00" timeLoss="39.49" rerouteNo="1" devices="tripinfo_car_w2s_221 routing_car_w2s_221" vType="Car" speedFactor="1.09" vaporized=""/>
    <tripinfo id="car_w2e_226" depart="226.00" departLane="w2sep_1" departPos="3.60" departPosLat="0.00" departSpeed="13.90" departDelay="0.00" arrival="395.00" arrivalLane="c2e_1" arrivalPos="990.00" arrivalPosLat="0.00" arrivalSpeed="15.07" duration="169.00" routeLength="1997.01" waitingTime="18.00" waitingCount="1" stopTime="0.00" timeLoss="36.67" rerouteNo="1" devices="tripinfo_car_w2e_226 routing_car_w2e_226" vType="Car" speedFactor="1.09" vaporized=""/>
    <tripinfo id="car_e2n_208" depart="208.00" departLane="e2sep_1" departPos="3.60" departPosLat="0.00" departSpeed="13.90" departDelay="0.00" arrival="396.00" arrivalLane="c2n_1" arrivalPos="990.00" arrivalPosLat="0.00" arrivalSpeed="14.42" duration="188.00" routeLength="1986.69" waitingTime="33.00" waitingCount="1" stopTime="0.00" timeLoss="50.07" rerouteNo="1" devices="tripinfo_car_e2n_208 routing_car_e2n_208" vType="Car" speedFactor="1.04" vaporized=""/>
    <tripinfo id="car_e2w_218" depart="218.00" departLane="e2sep_1" departPos="3.60" departPosLat="0.00" departSpeed="13.90" departDelay="0.00" arrival="396.00" arrivalLane="c2w_1" arrivalPos="990.00" arrivalPosLat="0.00" arrivalSpeed="14.13" duration="178.00" routeLength="1997.01" waitingTime="23.00" waitingCount="1" stopTime="0.00" timeLoss="36.38" rerouteNo="1" devices="tripinfo_car_e2w_218 routing_car_e2w_218" vType="Car" speedFactor="1.02" vaporized=""/>
    <tripinfo id="car_w2e_227" depart="228.00" departLane="w2sep_1" departPos="3.60" departPosLat="0.00" departSpeed="13.90" departDelay="1.00" arrival="398.00" arrivalLane="c2e_1" arrivalPos="990.00" arrivalPosLat="0.00" arrivalSpeed="15.48" duration="170.00" routeLength="1997.01" waitingTime="17.00" waitingCount="1" stopTime="0.00" timeLoss="41.30" rerouteNo="1" devices="tripinfo_car_w2e_227 routing_car_w2e_227" vType="Car" speedFactor="1.12" vaporized=""/>
    <tripinfo id="car_e2n_218" depart="220.00" departLane="e2sep_1" departPos="3.60" departPosLat="0.00" departSpeed="13.90" departDelay="2.00" arrival="399.00" arrivalLane="c2n_1" arrivalPos="990.00" arrivalPosLat="0.00" arrivalSpeed="15.03" duration="179.00" routeLength="1986.69" waitingTime="22.00" waitingCount="1" stopTime="0.00" timeLoss="46.56" rerouteNo="1" devices="tripinfo_car_e2n_218 routing_car_e2n_218" vType="Car" speedFactor="1.09" vaporized=""/>
    <tripinfo id="car_w2s_230" depart="230.00" departLane="w2sep_1" departPos="3.60" departPosLat="0.00" departSpeed="13.90" departDelay="0.00" arrival="399.00" arrivalLane="c2s_1" arrivalPos="990.00" arrivalPosLat="0.00" arrivalSpeed="15.23" duration="169.00" routeLength="1986.69" waitingTime="16.00" waitingCount="1" stopTime="0.00" timeLoss="37.60" rerouteNo="1" devices="tripinfo_car_w2s_230 routing_car_w2s_230" vType="Car" speedFactor="1.10" vaporized=""/>
    <tripinfo id="car_e2n_219" depart="222.00" departLane="e2sep_1" departPos="3.60" departPosLat="0.00" departSpeed="13.90" departDelay="3.00" arrival="402.00" arrivalLane="c2n_1" arrivalPos="990.00" arrivalPosLat="0.00" arrivalSpeed="14.39" duration="180.00" routeLength="1986.69" waitingTime="21.00" waitingCount="1" stopTime="0.00" timeLoss="41.66" rerouteNo="1" devices="tripinfo_car_e2n_219 routing_car_e2n_219" vType="Car" speedFactor="1.04" vaporized=""/>
    <tripinfo id="car_e2w_221" depart="224.00" departLane="e2sep_1" departPos="3.60" departPosLat="0.00" departSpeed="13.90" departDelay="3.00" arrival="402.00" arrivalLane="c2w_1" arrivalPos="990.00" arrivalPosLat="0.00" arrivalSpeed="14.69" duration="178.00" routeLength="1997.01" waitingTime="19.00" waitingCount="1" stopTime="0.00" timeLoss="41.75" rerouteNo="1" devices="tripinfo_car_e2w_221 routing_car_e2w_221" vType="Car" speedFactor="1.06" vaporized=""/>
    <tripinfo id="car_w2s_234" depart="234.00" departLane="w2sep_1" departPos="3.60" departPosLat="0.00" departSpeed="13.90" departDelay="0.00" arrival="408.00" arrivalLane="c2s_1" arrivalPos="990.00" arrivalPosLat="0.00" arrivalSpeed="13.90" duration="174.00" routeLength="1986.69" waitingTime="11.00" waitingCount="1" stopTime="0.00" timeLoss="29.83" rerouteNo="1" devices="tripinfo_car_w2s_234 routing_car_w2s_234" vType="Car" speedFactor="1.00" vaporized=""/>
    <tripinfo id="car_e2n_232" depart="232.00" departLane="e2sep_1" departPos="3.60" departPosLat="0.00" departSpeed="13.90" departDelay="0.00" arrival="409.00" arrivalLane="c2n_1" arrivalPos="990.00" arrivalPosLat="0.00" arrivalSpeed="13.90" duration="177.00" routeLength="1986.69" waitingTime="14.00" waitingCount="1" stopTime="0.00" timeLoss="32.87" rerouteNo="1" devices="tripinfo_car_e2n_232 routing_car_e2n_232" vType="Car" speedFactor="1.00" vaporized=""/>
    <tripinfo id="car_w2s_242" depart="242.00" departLane="w2sep_1" departPos="3.60" departPosLat="0.00" departSpeed="13.90" departDelay="0.00" arrival="410.00" arrivalLane="c2s_1" arrivalPos="990.00" arrivalPosLat="0.00" arrivalSpeed="14.58" duration="168.00" routeLength="1986.69" waitingTime="9.00" waitingCount="1" stopTime="0.00" timeLoss="32.93" rerouteNo="1" devices="tripinfo_car_w2s_242 routing_car_w2s_242" vType="Car" speedFactor="1.06" vaporized=""/>
    <tripinfo id="car_e2n_239" depart="240.00" departLane="e2sep_1" departPos="3.60" departPosLat="0.00" departSpeed="13.90" departDelay="1.00" arrival="411.00" arrivalLane="c2n_1" arrivalPos="990.00" arrivalPosLat="0.00" arrivalSpeed="14.65" duration="171.00" routeLength="1986.69" waitingTime="11.00" waitingCount="1" stopTime="0.00" timeLoss="37.13" rerouteNo="1" devices="tripinfo_car_e2n_239 routing_car_e2n_239" vType="Car" speedFactor="1.07" vaporized=""/>
    <tripinfo id="car_w2e_249" depart="249.00" departLane="w2sep_1" departPos="3.60" departPosLat="0.00" departSpeed="13.90" departDelay="0.00" arrival="411.00" arrivalLane="c2e_1" arrivalPos="990.00" arrivalPosLat="0.00" arrivalSpeed="14.13" duration="162.00" routeLength="1997.01" waitingTime="1.00" waitingCount="1" stopTime="0.00" timeLoss="20.60" rerouteNo="1" devices="tripinfo_car_w2e_249 routing_car_w2e_249" vType="Car" speedFactor="1.02" vaporized=""/>
    <tripinfo id="car_w2e_265" depart="265.00" departLane="w2sep_1" departPos="3.60" departPosLat="0.00" departSpeed="13.90" departDelay="0.00" arrival="414.00" arrivalLane="c2e_1" arrivalPos="990.00" arrivalPosLat="0.00" arrivalSpeed="15.19" duration="149.00" routeLength="1997.01" waitingTime="0.00" waitingCount="0" stopTime="0.00" timeLoss="18.02" rerouteNo="1" devices="tripinfo_car_w2e_265 routing_car_w2e_265" vType="Car" speedFactor="1.10" vaporized=""/>
    <tripinfo id="car_e2n_240" depart="242.00" departLane="e2sep_1" departPos="3.60" departPosLat="0.00" departSpeed="13.90" departDelay="2.00" arrival="415.00" arrivalLane="c2n_1" arrivalPos="990.00" arrivalPosLat="0.00" arrivalSpeed="14.08" duration="173.00" routeLength="1986.69" waitingTime="6.00" waitingCount="1" stopTime="0.00" timeLoss="31.07" rerouteNo="1" devices="tripinfo_car_e2n_240 routing_car_e2n_240" vType="Car" speedFactor="1.01" vaporized=""/>
    <tripinfo id="car_e2w_250" depart="250.00" departLane="e2sep_1" departPos="3.60" departPosLat="0.00" departSpeed="13.90" departDelay="0.00" arrival="416.00" arrivalLane="c2w_1" arrivalPos="990.00" arrivalPosLat="0.00" arrivalSpeed="14.03" duration="166.00" routeLength="1997.01" waitingTime="1.00" waitingCount="1" stopTime="0.00" timeLoss="23.04" rerouteNo="1" devices="tripinfo_car_e2w_250 routing_car_e2w_250" vType="Car" speedFactor="1.01" vaporized=""/>
    <tripinfo id="car_w2e_270" depart="270.00" departLane="w2sep_1" departPos="3.60" departPosLat="0.00" departSpeed="13.90" departDelay="0.00" arrival="417.00" arrivalLane="c2e_1" arrivalPos="990.00" arrivalPosLat="0.00" arrivalSpeed="14.32" duration="147.00" routeLength="1997.01" waitingTime="0.00" waitingCount="0" stopTime="0.00" timeLoss="7.81" rerouteNo="1" devices="tripinfo_car_w2e_270 routing_car_w2e_270" vType="Car" speedFactor="1.03" vaporized=""/>
    <tripinfo id="car_e2w_266" depart="267.00" departLane="e2sep_1" departPos="3.60" departPosLat="0.00" departSpeed="13.90" departDelay="1.00" arrival="418.00" arrivalLane="c2w_1" arrivalPos="990.00" arrivalPosLat="0.00" arrivalSpeed="15.45" duration="151.00" routeLength="1997.01" waitingTime="0.00" waitingCount="0" stopTime="0.00" timeLoss="25.80" rerouteNo="1" devices="tripinfo_car_e2w_266 routing_car_e2w_266" vType="Car" speedFactor="1.15" vaporized=""/>
    <tripinfo id="car_e2s_238" depart="238.00" departLane="e2sep_1" departPos="3.60" departPosLat="0.00" departSpeed="13.90" departDelay="0.00" arrival="419.00" arrivalLane="c2s_1" arrivalPos="990.00" arrivalPosLat="0.00" arrivalSpeed="13.90" duration="181.00" routeLength="1996.47" waitingTime="23.00" waitingCount="1" stopTime="0.00" timeLoss="36.53" rerouteNo="1" devices="tripinfo_car_e2s_238 routing_car_e2s_238" vType="Car" speedFactor="1.00" vaporized=""/>
    <tripinfo id="car_e2s_265" depart="265.00" departLane="e2sep_1" departPos="3.60" departPosLat="0.00" departSpeed="13.90" departDelay="0.00" arrival="422.00" arrivalLane="c2s_1" arrivalPos="990.00" arrivalPosLat="0.00" arrivalSpeed="14.65" duration="157.00" routeLength="1996.47" waitingTime="5.00" waitingCount="1" stopTime="0.00" timeLoss="20.57" rerouteNo="1" devices="tripinfo_car_e2s_265 routing_car_e2s_265" vType="Car" speedFactor="1.06" vaporized=""/>
    <tripinfo id="bus_e2w_267" depart="269.00" departLane="e2sep_1" departPos="12.10" departPosLat="0.00" departSpeed="13.90" departDelay="2.00" arrival="423.00" arrivalLane="c2w_1" arrivalPos="990.00" arrivalPosLat="0.00" arrivalSpeed="13.87" duration="154.00" routeLength="1988.51" waitingTime="0.00" waitingCount="0" stopTime="0.00" timeLoss="10.59" rerouteNo="1" devices="tripinfo_bus_e2w_267 routing_bus_e2w_267" vType="Bus" speedFactor="1.00" vaporized=""/>
    <tripinfo id="car_w2n_206" depart="207.00" departLane="w2sep_1" departPos="3.60" departPosLat="0.00" departSpeed="13.90" departDelay="1.00" arrival="424.00" arrivalLane="c2n_1" arrivalPos="990.00" arrivalPosLat="0.00" arrivalSpeed="13.90" duration="217.00" routeLength="1996.47" waitingTime="56.00" waitingCount="2" stopTime="0.00" timeLoss="72.54" rerouteNo="1" devices="tripinfo_car_w2n_206 routing_car_w2n_206" vType="Car" speedFactor="1.00" vaporized=""/>
    <tripinfo id="car_w2n_277" depart="277.00" departLane="w2sep_1" departPos="3.60" departPosLat="0.00" departSpeed="13.90" departDelay="0.00" arrival="426.00" arrivalLane="c2n_1" arrivalPos="990.00" arrivalPosLat="0.00" arrivalSpeed="15.10" duration="149.00" routeLength="1996.47" waitingTime="1.00" waitingCount="1" stopTime="0.00" timeLoss="19.99" rerouteNo="1" devices="tripinfo_car_w2n_277 routing_car_w2n_277" vType="Car" speedFactor="1.12" vaporized=""/>
    <tripinfo id="car_n2w_247" depart="247.00" departLane="n2sep_1" departPos="3.60" departPosLat="0.00" departSpeed="13.90" departDelay="0.00" arrival="428.00" arrivalLane="c2w_1" arrivalPos="990.00" arrivalPosLat="0.00" arrivalSpeed="16.23" duration="181.00" routeLength="1986.69" waitingTime="36.00" waitingCount="1" stopTime="0.00" timeLoss="57.51" rerouteNo="1" devices="tripinfo_car_n2w_247 routing_car_n2w_247" vType="Car" speedFactor="1.17" vaporized=""/>
    <tripinfo id="car_w2n_286" depart="286.00" departLane="w2sep_1" departPos="3.60" departPosLat="0.00" departSpeed="13.90" departDelay="0.00" arrival="429.00" arrivalLane="c2n_1" arrivalPos="990.00" arrivalPosLat="0.00" arrivalSpeed="14.75" duration="143.00" routeLength="1996.47" waitingTime="0.00" waitingCount="0" stopTime="0.00" timeLoss="7.44" rerouteNo="1" devices="tripinfo_car_w2n_286 routing_car_w2n_286" vType="Car" speedFactor="1.07" vaporized=""/>
    <tripinfo id="car_s2e_249" depart="249.00" departLane="s2sep_1" departPos="3.60" departPosLat="0.00" departSpeed="13.90" departDelay="0.00" arrival="431.00" arrivalLane="c2e_1" arrivalPos="990.00" arrivalPosLat="0.00" arrivalSpeed="15.27" duration="182.00" routeLength="1986.69" waitingTime="39.00" waitingCount="1" stopTime="0.00" timeLoss="50.85" rerouteNo="1" devices="tripinfo_car_s2e_249 routing_car_s2e_249" vType="Car" speedFactor="1.10" vaporized=""/>
</tripinfos>
