<?xml version="1.0" encoding="UTF-8"?>

<!-- generated on Sat Apr 24 18:36:27 2021 by Eclipse SUMO Version 1.4.0
<configuration xmlns:xsi="http://www.w3.org/2001/XMLSchema-instance" xsi:noNamespaceSchemaLocation="http://sumo.dlr.de/xsd/sumoConfiguration.xsd">

    <input>
        <net-file value="sumofiles/junction.net.xml"/>
        <route-files value="sumofiles/junction_preemption_228.rou.xml"/>
        <additional-files value="sumofiles/junction.det.xml"/>
    </input>

    <output>
        <tripinfo-output value="sumofiles/output/tripinfo_preemption_228.xml"/>
    </output>

    <time>
        <begin value="0"/>
        <end value="10000"/>
        <step-length value="0.05"/>
    </time>

    <processing>
        <lateral-resolution value="0.1"/>
    </processing>

    <report>
        <no-warnings value="true"/>
        <error-log value="sumofiles/output/errorlog_preemption_228.log"/>
        <no-step-log value="true"/>
    </report>

    <traci_server>
        <remote-port value="53827"/>
    </traci_server>

    <gui_only>
        <gui-settings-file value="sumofiles/junction-gui.settings.xml"/>
        <tracker-interval value="0.05"/>
    </gui_only>

</configuration>
-->

<tripinfos xmlns:xsi="http://www.w3.org/2001/XMLSchema-instance" xsi:noNamespaceSchemaLocation="http://sumo.dlr.de/xsd/tripinfo_file.xsd">
    <tripinfo id="car_s2n_7" depart="7.00" departLane="s2sep_1" departPos="3.60" departPosLat="0.00" departSpeed="13.90" departDelay="0.00" arrival="160.40" arrivalLane="c2n_1" arrivalPos="990.00" arrivalPosLat="0.00" arrivalSpeed="15.05" duration="153.40" routeLength="1997.01" waitingTime="13.05" waitingCount="1" stopTime="0.00" timeLoss="20.67" rerouteNo="1" devices="tripinfo_car_s2n_7 routing_car_s2n_7" vType="Car" speedFactor="1.08" vaporized=""/>
    <tripinfo id="car_n2s_5" depart="6.35" departLane="n2sep_1" departPos="3.60" departPosLat="0.00" departSpeed="13.90" departDelay="1.35" arrival="161.75" arrivalLane="c2s_1" arrivalPos="990.00" arrivalPosLat="0.00" arrivalSpeed="14.73" duration="155.40" routeLength="1997.01" waitingTime="9.85" waitingCount="1" stopTime="0.00" timeLoss="19.85" rerouteNo="1" devices="tripinfo_car_n2s_5 routing_car_n2s_5" vType="Car" speedFactor="1.06" vaporized=""/>
    <tripinfo id="car_n2e_5" depart="5.00" departLane="n2sep_1" departPos="3.60" departPosLat="0.00" departSpeed="13.90" departDelay="0.00" arrival="163.85" arrivalLane="c2e_1" arrivalPos="990.00" arrivalPosLat="0.00" arrivalSpeed="14.73" duration="158.85" routeLength="1996.47" waitingTime="13.75" waitingCount="1" stopTime="0.00" timeLoss="22.69" rerouteNo="1" devices="tripinfo_car_n2e_5 routing_car_n2e_5" vType="Car" speedFactor="1.06" vaporized=""/>
    <tripinfo id="car_n2s_6" depart="8.05" departLane="n2sep_1" departPos="3.60" departPosLat="0.00" departSpeed="13.90" departDelay="2.05" arrival="168.30" arrivalLane="c2s_1" arrivalPos="990.00" arrivalPosLat="0.00" arrivalSpeed="14.04" duration="160.25" routeLength="1997.01" waitingTime="5.95" waitingCount="1" stopTime="0.00" timeLoss="18.06" rerouteNo="1" devices="tripinfo_car_n2s_6 routing_car_n2s_6" vType="Car" speedFactor="1.01" vaporized=""/>
    <tripinfo id="car_n2w_26" depart="26.00" departLane="n2sep_1" departPos="3.60" departPosLat="0.00" departSpeed="13.90" departDelay="0.00" arrival="172.15" arrivalLane="c2w_1" arrivalPos="990.00" arrivalPosLat="0.00" arrivalSpeed="14.32" duration="146.15" routeLength="1986.69" waitingTime="0.00" waitingCount="0" stopTime="0.00" timeLoss="6.69" rerouteNo="1" devices="tripinfo_car_n2w_26 routing_car_n2w_26" vType="Car" speedFactor="1.03" vaporized=""/>
    <tripinfo id="car_n2s_24" depart="24.00" departLane="n2sep_1" departPos="3.60" departPosLat="0.00" departSpeed="13.90" departDelay="0.00" arrival="172.25" arrivalLane="c2s_1" arrivalPos="990.00" arrivalPosLat="0.00" arrivalSpeed="14.03" duration="148.25" routeLength="1997.01" waitingTime="0.00" waitingCount="0" stopTime="0.00" timeLoss="6.03" rerouteNo="1" devices="tripinfo_car_n2s_24 routing_car_n2s_24" vType="Car" speedFactor="1.01" vaporized=""/>
    <tripinfo id="bus_n2e_12" depart="12.00" departLane="n2sep_1" departPos="12.10" departPosLat="0.00" departSpeed="13.90" departDelay="0.00" arrival="172.95" arrivalLane="c2e_1" arrivalPos="990.00" arrivalPosLat="0.00" arrivalSpeed="13.90" duration="160.95" routeLength="1987.97" waitingTime="2.70" waitingCount="1" stopTime="0.00" timeLoss="17.24" rerouteNo="1" devices="tripinfo_bus_n2e_12 routing_bus_n2e_12" vType="Bus" speedFactor="1.00" vaporized=""/>
    <tripinfo id="car_s2w_28" depart="28.00" departLane="s2sep_1" departPos="3.60" departPosLat="0.00" departSpeed="13.90" departDelay="0.00" arrival="174.95" arrivalLane="c2w_1" arrivalPos="990.00" arrivalPosLat="0.00" arrivalSpeed="15.04" duration="146.95" routeLength="1996.47" waitingTime="3.75" waitingCount="1" stopTime="0.00" timeLoss="14.60" rerouteNo="1" devices="tripinfo_car_s2w_28 routing_car_s2w_28" vType="Car" speedFactor="1.09" vaporized=""/>
    <tripinfo id="bus_s2n_34" depart="34.00" departLane="s2sep_1" departPos="12.10" departPosLat="0.00" departSpeed="13.90" departDelay="0.00" arrival="177.60" arrivalLane="c2n_1" arrivalPos="990.00" arrivalPosLat="0.00" arrivalSpeed="13.90" duration="143.60" routeLength="1988.51" waitingTime="0.00" waitingCount="0" stopTime="0.00" timeLoss="0.53" rerouteNo="1" devices="tripinfo_bus_s2n_34 routing_bus_s2n_34" vType="Bus" speedFactor="1.00" vaporized=""/>
    <tripinfo id="car_n2s_37" depart="37.00" departLane="n2sep_1" departPos="3.60" departPosLat="0.00" departSpeed="13.90" departDelay="0.00" arrival="177.80" arrivalLane="c2s_1" arrivalPos="990.00" arrivalPosLat="0.00" arrivalSpeed="14.55" duration="140.80" routeLength="1997.01" waitingTime="0.00" waitingCount="0" stopTime="0.00" timeLoss="3.58" rerouteNo="1" devices="tripinfo_car_n2s_37 routing_car_n2s_37" vType="Car" speedFactor="1.05" vaporized=""/>
    <tripinfo id="car_n2s_39" depart="39.00" departLane="n2sep_1" departPos="3.60" departPosLat="0.00" departSpeed="13.90" departDelay="0.00" arrival="180.20" arrivalLane="c2s_1" arrivalPos="990.00" arrivalPosLat="0.00" arrivalSpeed="15.36" duration="141.20" routeLength="1997.01" waitingTime="0.00" waitingCount="0" stopTime="0.00" timeLoss="13.25" rerouteNo="1" devices="tripinfo_car_n2s_39 routing_car_n2s_39" vType="Car" speedFactor="1.12" vaporized=""/>
    <tripinfo id="bus_n2e_33" depart="33.00" departLane="n2sep_1" departPos="12.10" departPosLat="0.00" departSpeed="13.90" departDelay="0.00" arrival="183.05" arrivalLane="c2e_1" arrivalPos="990.00" arrivalPosLat="0.00" arrivalSpeed="13.90" duration="150.05" routeLength="1987.97" waitingTime="0.00" waitingCount="0" stopTime="0.00" timeLoss="6.34" rerouteNo="1" devices="tripinfo_bus_n2e_33 routing_bus_n2e_33" vType="Bus" speedFactor="1.00" vaporized=""/>
    <tripinfo id="car_n2w_45" depart="45.00" departLane="n2sep_1" departPos="3.60" departPosLat="0.00" departSpeed="13.90" departDelay="0.00" arrival="192.70" arrivalLane="c2w_1" arrivalPos="990.00" arrivalPosLat="0.00" arrivalSpeed="13.90" duration="147.70" routeLength="1986.69" waitingTime="0.00" waitingCount="0" stopTime="0.00" timeLoss="4.04" rerouteNo="1" devices="tripinfo_car_n2w_45 routing_car_n2w_45" vType="Car" speedFactor="1.00" vaporized=""/>
    <tripinfo id="car_s2w_48" depart="48.00" departLane="s2sep_1" departPos="3.60" departPosLat="0.00" departSpeed="13.90" departDelay="0.00" arrival="197.35" arrivalLane="c2w_1" arrivalPos="990.00" arrivalPosLat="0.00" arrivalSpeed="13.89" duration="149.35" routeLength="1996.47" waitingTime="0.00" waitingCount="0" stopTime="0.00" timeLoss="5.02" rerouteNo="1" devices="tripinfo_car_s2w_48 routing_car_s2w_48" vType="Car" speedFactor="1.00" vaporized=""/>
    <tripinfo id="car_n2e_50" depart="50.00" departLane="n2sep_1" departPos="3.60" departPosLat="0.00" departSpeed="13.90" departDelay="0.00" arrival="198.45" arrivalLane="c2e_1" arrivalPos="990.00" arrivalPosLat="0.00" arrivalSpeed="13.90" duration="148.45" routeLength="1996.47" waitingTime="0.00" waitingCount="0" stopTime="0.00" timeLoss="4.13" rerouteNo="1" devices="tripinfo_car_n2e_50 routing_car_n2e_50" vType="Car" speedFactor="1.00" vaporized=""/>
    <tripinfo id="car_s2w_59" depart="59.00" departLane="s2sep_1" departPos="3.60" departPosLat="0.00" departSpeed="13.90" departDelay="0.00" arrival="199.20" arrivalLane="c2w_1" arrivalPos="990.00" arrivalPosLat="0.00" arrivalSpeed="15.29" duration="140.20" routeLength="1996.47" waitingTime="0.00" waitingCount="0" stopTime="0.00" timeLoss="15.59" rerouteNo="1" devices="tripinfo_car_s2w_59 routing_car_s2w_59" vType="Car" speedFactor="1.16" vaporized=""/>
    <tripinfo id="car_s2w_66" depart="66.00" departLane="s2sep_1" departPos="3.60" departPosLat="0.00" departSpeed="13.90" departDelay="0.00" arrival="203.15" arrivalLane="c2w_1" arrivalPos="990.00" arrivalPosLat="0.00" arrivalSpeed="15.13" duration="137.15" routeLength="1996.47" waitingTime="0.00" waitingCount="0" stopTime="0.00" timeLoss="4.83" rerouteNo="1" devices="tripinfo_car_s2w_66 routing_car_s2w_66" vType="Car" speedFactor="1.09" vaporized=""/>
    <tripinfo id="car_w2s_33" depart="33.00" departLane="w2sep_1" departPos="3.60" departPosLat="0.00" departSpeed="13.90" departDelay="0.00" arrival="208.85" arrivalLane="c2s_1" arrivalPos="990.00" arrivalPosLat="0.00" arrivalSpeed="14.27" duration="175.85" routeLength="1986.69" waitingTime="28.65" waitingCount="1" stopTime="0.00" timeLoss="35.86" rerouteNo="1" devices="tripinfo_car_w2s_33 routing_car_w2s_33" vType="Car" speedFactor="1.03" vaporized=""/>
    <tripinfo id="car_e2n_19" depart="19.00" departLane="e2sep_1" departPos="3.60" departPosLat="0.00" departSpeed="13.90" departDelay="0.00" arrival="210.65" arrivalLane="c2n_1" arrivalPos="990.00" arrivalPosLat="0.00" arrivalSpeed="13.90" duration="191.65" routeLength="1986.69" waitingTime="41.10" waitingCount="1" stopTime="0.00" timeLoss="47.96" rerouteNo="1" devices="tripinfo_car_e2n_19 routing_car_e2n_19" vType="Car" speedFactor="1.00" vaporized=""/>
    <tripinfo id="car_e2s_19" depart="20.45" departLane="e2sep_1" departPos="3.60" departPosLat="0.00" departSpeed="13.90" departDelay="1.45" arrival="212.45" arrivalLane="c2s_1" arrivalPos="990.00" arrivalPosLat="0.00" arrivalSpeed="14.50" duration="192.00" routeLength="1996.47" waitingTime="38.50" waitingCount="1" stopTime="0.00" timeLoss="54.01" rerouteNo="1" devices="tripinfo_car_e2s_19 routing_car_e2s_19" vType="Car" speedFactor="1.05" vaporized=""/>
    <tripinfo id="car_e2n_24" depart="24.00" departLane="e2sep_1" departPos="3.60" departPosLat="0.00" departSpeed="13.90" departDelay="0.00" arrival="213.05" arrivalLane="c2n_1" arrivalPos="990.00" arrivalPosLat="0.00" arrivalSpeed="14.81" duration="189.05" routeLength="1986.69" waitingTime="37.15" waitingCount="1" stopTime="0.00" timeLoss="56.34" rerouteNo="1" devices="tripinfo_car_e2n_24 routing_car_e2n_24" vType="Car" speedFactor="1.08" vaporized=""/>
    <tripinfo id="car_e2w_69" depart="69.00" departLane="e2sep_1" departPos="3.60" departPosLat="0.00" departSpeed="13.90" departDelay="0.00" arrival="215.80" arrivalLane="c2w_1" arrivalPos="990.00" arrivalPosLat="0.00" arrivalSpeed="14.27" duration="146.80" routeLength="1997.01" waitingTime="0.00" waitingCount="0" stopTime="0.00" timeLoss="6.80" rerouteNo="1" devices="tripinfo_car_e2w_69 routing_car_e2w_69" vType="Car" speedFactor="1.03" vaporized=""/>
    <tripinfo id="car_e2n_45" depart="45.00" departLane="e2sep_1" departPos="3.60" departPosLat="0.00" departSpeed="13.90" departDelay="0.00" arrival="216.15" arrivalLane="c2n_1" arrivalPos="990.00" arrivalPosLat="0.00" arrivalSpeed="14.47" duration="171.15" routeLength="1986.69" waitingTime="19.90" waitingCount="1" stopTime="0.00" timeLoss="33.77" rerouteNo="1" devices="tripinfo_car_e2n_45 routing_car_e2n_45" vType="Car" speedFactor="1.05" vaporized=""/>
    <tripinfo id="car_e2s_51" depart="51.00" departLane="e2sep_1" departPos="3.60" departPosLat="0.00" departSpeed="13.90" departDelay="0.00" arrival="217.15" arrivalLane="c2s_1" arrivalPos="990.00" arrivalPosLat="0.00" arrivalSpeed="13.89" duration="166.15" routeLength="1996.47" waitingTime="9.65" waitingCount="1" stopTime="0.00" timeLoss="21.83" rerouteNo="1" devices="tripinfo_car_e2s_51 routing_car_e2s_51" vType="Car" speedFactor="1.00" vaporized=""/>
    <tripinfo id="car_e2s_63" depart="63.00" departLane="e2sep_1" departPos="3.60" departPosLat="0.00" departSpeed="13.90" departDelay="0.00" arrival="220.25" arrivalLane="c2s_1" arrivalPos="990.00" arrivalPosLat="0.00" arrivalSpeed="14.09" duration="157.25" routeLength="1996.47" waitingTime="0.00" waitingCount="0" stopTime="0.00" timeLoss="15.51" rerouteNo="1" devices="tripinfo_car_e2s_63 routing_car_e2s_63" vType="Car" speedFactor="1.02" vaporized=""/>
    <tripinfo id="car_e2s_69" depart="70.45" departLane="e2sep_1" departPos="3.60" departPosLat="0.00" departSpeed="13.90" departDelay="1.45" arrival="222.80" arrivalLane="c2s_1" arrivalPos="990.00" arrivalPosLat="0.00" arrivalSpeed="14.39" duration="152.35" routeLength="1996.47" waitingTime="0.00" waitingCount="0" stopTime="0.00" timeLoss="14.49" rerouteNo="1" devices="tripinfo_car_e2s_69 routing_car_e2s_69" vType="Car" speedFactor="1.05" vaporized=""/>
    <tripinfo id="car_w2e_80" depart="80.00" departLane="w2sep_1" departPos="3.60" departPosLat="0.00" departSpeed="13.90" departDelay="0.00" arrival="224.35" arrivalLane="c2e_1" arrivalPos="990.00" arrivalPosLat="0.00" arrivalSpeed="13.90" duration="144.35" routeLength="1997.01" waitingTime="0.00" waitingCount="0" stopTime="0.00" timeLoss="0.66" rerouteNo="1" devices="tripinfo_car_w2e_80 routing_car_w2e_80" vType="Car" speedFactor="1.00" vaporized=""/>
    <tripinfo id="car_e2n_77" depart="77.00" departLane="e2sep_1" departPos="3.60" departPosLat="0.00" departSpeed="13.90" departDelay="0.00" arrival="225.15" arrivalLane="c2n_1" arrivalPos="990.00" arrivalPosLat="0.00" arrivalSpeed="13.90" duration="148.15" routeLength="1986.69" waitingTime="0.00" waitingCount="0" stopTime="0.00" timeLoss="4.46" rerouteNo="1" devices="tripinfo_car_e2n_77 routing_car_e2n_77" vType="Car" speedFactor="1.00" vaporized=""/>
    <tripinfo id="car_w2n_19" depart="19.00" departLane="w2sep_1" departPos="3.60" departPosLat="0.00" departSpeed="13.90" departDelay="0.00" arrival="228.55" arrivalLane="c2n_1" arrivalPos="990.00" arrivalPosLat="0.00" arrivalSpeed="14.28" duration="209.55" routeLength="1996.47" waitingTime="56.00" waitingCount="3" stopTime="0.00" timeLoss="69.49" rerouteNo="1" devices="tripinfo_car_w2n_19 routing_car_w2n_19" vType="Car" speedFactor="1.03" vaporized=""/>
    <tripinfo id="car_w2e_100" depart="100.00" departLane="w2sep_1" departPos="3.60" departPosLat="0.00" departSpeed="13.90" departDelay="0.00" arrival="229.30" arrivalLane="c2e_1" arrivalPos="990.00" arrivalPosLat="0.00" arrivalSpeed="16.38" duration="129.30" routeLength="1997.01" waitingTime="0.00" waitingCount="0" stopTime="0.00" timeLoss="7.47" rerouteNo="1" devices="tripinfo_car_w2e_100 routing_car_w2e_100" vType="Car" speedFactor="1.18" vaporized=""/>
    <tripinfo id="car_e2n_91" depart="92.45" departLane="e2sep_1" departPos="3.60" departPosLat="0.00" departSpeed="13.90" departDelay="1.45" arrival="230.95" arrivalLane="c2n_1" arrivalPos="990.00" arrivalPosLat="0.00" arrivalSpeed="15.96" duration="138.50" routeLength="1986.69" waitingTime="0.00" waitingCount="0" stopTime="0.00" timeLoss="15.90" rerouteNo="1" devices="tripinfo_car_e2n_91 routing_car_e2n_91" vType="Car" speedFactor="1.17" vaporized=""/>
    <tripinfo id="car_e2w_91" depart="91.00" departLane="e2sep_1" departPos="3.60" departPosLat="0.00" departSpeed="13.90" departDelay="0.00" arrival="234.20" arrivalLane="c2w_1" arrivalPos="990.00" arrivalPosLat="0.00" arrivalSpeed="13.97" duration="143.20" routeLength="1997.01" waitingTime="0.00" waitingCount="0" stopTime="0.00" timeLoss="0.24" rerouteNo="1" devices="tripinfo_car_e2w_91 routing_car_e2w_91" vType="Car" speedFactor="1.01" vaporized=""/>
    <tripinfo id="car_e2s_91" depart="94.10" departLane="e2sep_1" departPos="3.60" departPosLat="0.00" departSpeed="13.90" departDelay="3.10" arrival="244.55" arrivalLane="c2s_1" arrivalPos="990.00" arrivalPosLat="0.00" arrivalSpeed="13.90" duration="150.45" routeLength="1996.47" waitingTime="0.00" waitingCount="0" stopTime="0.00" timeLoss="6.13" rerouteNo="1" devices="tripinfo_car_e2s_91 routing_car_e2s_91" vType="Car" speedFactor="1.00" vaporized=""/>
    <tripinfo id="car_e2s_105" depart="105.00" departLane="e2sep_1" departPos="3.60" departPosLat="0.00" departSpeed="13.90" departDelay="0.00" arrival="246.45" arrivalLane="c2s_1" arrivalPos="990.00" arrivalPosLat="0.00" arrivalSpeed="15.37" duration="141.45" routeLength="1996.47" waitingTime="0.00" waitingCount="0" stopTime="0.00" timeLoss="16.84" rerouteNo="1" devices="tripinfo_car_e2s_105 routing_car_e2s_105" vType="Car" speedFactor="1.16" vaporized=""/>
    <tripinfo id="bus_w2n_74" depart="74.00" departLane="w2sep_1" departPos="12.10" departPosLat="0.00" departSpeed="13.90" departDelay="0.00" arrival="246.55" arrivalLane="c2n_1" arrivalPos="990.00" arrivalPosLat="0.00" arrivalSpeed="13.90" duration="172.55" routeLength="1987.97" waitingTime="14.60" waitingCount="2" stopTime="0.00" timeLoss="28.82" rerouteNo="1" devices="tripinfo_bus_w2n_74 routing_bus_w2n_74" vType="Bus" speedFactor="1.00" vaporized=""/>
    <tripinfo id="car_w2n_90" depart="90.00" departLane="w2sep_1" departPos="3.60" departPosLat="0.00" departSpeed="13.90" departDelay="0.00" arrival="249.00" arrivalLane="c2n_1" arrivalPos="990.00" arrivalPosLat="0.00" arrivalSpeed="15.54" duration="159.00" routeLength="1996.47" waitingTime="8.30" waitingCount="1" stopTime="0.00" timeLoss="33.98" rerouteNo="1" devices="tripinfo_car_w2n_90 routing_car_w2n_90" vType="Car" speedFactor="1.15" vaporized=""/>
    <tripinfo id="car_w2n_96" depart="96.00" departLane="w2sep_1" departPos="3.60" departPosLat="0.00" departSpeed="13.90" departDelay="0.00" arrival="252.70" arrivalLane="c2n_1" arrivalPos="990.00" arrivalPosLat="0.00" arrivalSpeed="14.15" duration="156.70" routeLength="1996.47" waitingTime="0.00" waitingCount="0" stopTime="0.00" timeLoss="15.16" rerouteNo="1" devices="tripinfo_car_w2n_96 routing_car_w2n_96" vType="Car" speedFactor="1.02" vaporized=""/>
    <tripinfo id="car_s2n_79" depart="79.00" departLane="s2sep_1" departPos="3.60" departPosLat="0.00" departSpeed="13.90" departDelay="0.00" arrival="254.75" arrivalLane="c2n_1" arrivalPos="990.00" arrivalPosLat="0.00" arrivalSpeed="15.21" duration="175.75" routeLength="1997.01" waitingTime="28.75" waitingCount="1" stopTime="0.00" timeLoss="48.77" rerouteNo="1" devices="tripinfo_car_s2n_79 routing_car_s2n_79" vType="Car" speedFactor="1.13" vaporized=""/>
    <tripinfo id="car_n2w_64" depart="64.00" departLane="n2sep_1" departPos="3.60" departPosLat="0.00" departSpeed="13.90" departDelay="0.00" arrival="254.95" arrivalLane="c2w_1" arrivalPos="990.00" arrivalPosLat="0.00" arrivalSpeed="14.04" duration="190.95" routeLength="1986.69" waitingTime="41.65" waitingCount="1" stopTime="0.00" timeLoss="48.73" rerouteNo="1" devices="tripinfo_car_n2w_64 routing_car_n2w_64" vType="Car" speedFactor="1.01" vaporized=""/>
    <tripinfo id="car_s2e_73" depart="74.30" departLane="s2sep_1" departPos="3.60" departPosLat="0.00" departSpeed="13.90" departDelay="1.30" arrival="255.65" arrivalLane="c2e_1" arrivalPos="990.00" arrivalPosLat="0.00" arrivalSpeed="13.90" duration="181.35" routeLength="1986.69" waitingTime="29.70" waitingCount="1" stopTime="0.00" timeLoss="37.66" rerouteNo="1" devices="tripinfo_car_s2e_73 routing_car_s2e_73" vType="Car" speedFactor="1.00" vaporized=""/>
    <tripinfo id="car_n2w_104" depart="104.00" departLane="n2sep_1" departPos="3.60" departPosLat="0.00" departSpeed="13.90" departDelay="0.00" arrival="257.25" arrivalLane="c2w_1" arrivalPos="990.00" arrivalPosLat="0.00" arrivalSpeed="15.03" duration="153.25" routeLength="1986.69" waitingTime="8.05" waitingCount="1" stopTime="0.00" timeLoss="22.94" rerouteNo="1" devices="tripinfo_car_n2w_104 routing_car_n2w_104" vType="Car" speedFactor="1.10" vaporized=""/>
    <tripinfo id="car_n2e_80" depart="80.00" departLane="n2sep_1" departPos="3.60" departPosLat="0.00" departSpeed="13.90" departDelay="0.00" arrival="257.45" arrivalLane="c2e_1" arrivalPos="990.00" arrivalPosLat="0.00" arrivalSpeed="15.47" duration="177.45" routeLength="1996.47" waitingTime="35.55" waitingCount="2" stopTime="0.00" timeLoss="55.00" rerouteNo="1" devices="tripinfo_car_n2e_80 routing_car_n2e_80" vType="Car" speedFactor="1.18" vaporized=""/>
    <tripinfo id="car_n2w_107" depart="107.00" departLane="n2sep_1" departPos="3.60" departPosLat="0.00" departSpeed="13.90" departDelay="0.00" arrival="261.10" arrivalLane="c2w_1" arrivalPos="990.00" arrivalPosLat="0.00" arrivalSpeed="14.30" duration="154.10" routeLength="1986.69" waitingTime="1.50" waitingCount="1" stopTime="0.00" timeLoss="14.64" rerouteNo="1" devices="tripinfo_car_n2w_107 routing_car_n2w_107" vType="Car" speedFactor="1.03" vaporized=""/>
    <tripinfo id="car_s2w_73" depart="73.00" departLane="s2sep_1" departPos="3.60" departPosLat="0.00" departSpeed="13.90" departDelay="0.00" arrival="263.20" arrivalLane="c2w_1" arrivalPos="990.00" arrivalPosLat="0.00" arrivalSpeed="15.19" duration="190.20" routeLength="1996.47" waitingTime="42.75" waitingCount="2" stopTime="0.00" timeLoss="61.68" rerouteNo="1" devices="tripinfo_car_s2w_73 routing_car_s2w_73" vType="Car" speedFactor="1.12" vaporized=""/>
    <tripinfo id="car_s2w_120" depart="120.00" departLane="s2sep_1" departPos="3.60" departPosLat="0.00" departSpeed="13.90" departDelay="0.00" arrival="266.55" arrivalLane="c2w_1" arrivalPos="990.00" arrivalPosLat="0.00" arrivalSpeed="14.38" duration="146.55" routeLength="1996.47" waitingTime="0.00" waitingCount="0" stopTime="0.00" timeLoss="7.46" rerouteNo="1" devices="tripinfo_car_s2w_120 routing_car_s2w_120" vType="Car" speedFactor="1.04" vaporized=""/>
    <tripinfo id="bus_s2w_137" depart="137.00" departLane="s2sep_1" departPos="12.10" departPosLat="0.00" departSpeed="13.90" departDelay="0.00" arrival="291.50" arrivalLane="c2w_1" arrivalPos="990.00" arrivalPosLat="0.00" arrivalSpeed="13.90" duration="154.50" routeLength="1987.97" waitingTime="1.10" waitingCount="1" stopTime="0.00" timeLoss="10.77" rerouteNo="1" devices="tripinfo_bus_s2w_137 routing_bus_s2w_137" vType="Bus" speedFactor="1.00" vaporized=""/>
    <tripinfo id="car_w2e_109" depart="109.00" departLane="w2sep_1" departPos="3.60" departPosLat="0.00" departSpeed="13.90" departDelay="0.00" arrival="299.45" arrivalLane="c2e_1" arrivalPos="990.00" arrivalPosLat="0.00" arrivalSpeed="14.15" duration="190.45" routeLength="1997.01" waitingTime="42.15" waitingCount="1" stopTime="0.00" timeLoss="49.33" rerouteNo="1" devices="tripinfo_car_w2e_109 routing_car_w2e_109" vType="Car" speedFactor="1.02" vaporized=""/>
    <tripinfo id="car_w2s_125" depart="125.00" departLane="w2sep_1" departPos="3.60" departPosLat="0.00" departSpeed="13.90" departDelay="0.00" arrival="300.00" arrivalLane="c2s_1" arrivalPos="990.00" arrivalPosLat="0.00" arrivalSpeed="14.50" duration="175.00" routeLength="1986.69" waitingTime="28.60" waitingCount="1" stopTime="0.00" timeLoss="37.34" rerouteNo="1" devices="tripinfo_car_w2s_125 routing_car_w2s_125" vType="Car" speedFactor="1.04" vaporized=""/>
    <tripinfo id="car_e2w_99" depart="99.00" departLane="e2sep_1" departPos="3.60" departPosLat="0.00" departSpeed="13.90" departDelay="0.00" arrival="301.00" arrivalLane="c2w_1" arrivalPos="990.00" arrivalPosLat="0.00" arrivalSpeed="13.90" duration="202.00" routeLength="1997.01" waitingTime="49.50" waitingCount="1" stopTime="0.00" timeLoss="58.30" rerouteNo="1" devices="tripinfo_car_e2w_99 routing_car_e2w_99" vType="Car" speedFactor="1.00" vaporized=""/>
    <tripinfo id="car_e2n_130" depart="130.00" departLane="e2sep_1" departPos="3.60" departPosLat="0.00" departSpeed="13.90" departDelay="0.00" arrival="302.25" arrivalLane="c2n_1" arrivalPos="990.00" arrivalPosLat="0.00" arrivalSpeed="14.04" duration="172.25" routeLength="1986.69" waitingTime="20.65" waitingCount="1" stopTime="0.00" timeLoss="30.05" rerouteNo="1" devices="tripinfo_car_e2n_130 routing_car_e2n_130" vType="Car" speedFactor="1.01" vaporized=""/>
    <tripinfo id="car_e2s_111" depart="111.00" departLane="e2sep_1" departPos="3.60" departPosLat="0.00" departSpeed="13.90" departDelay="0.00" arrival="303.00" arrivalLane="c2s_1" arrivalPos="990.00" arrivalPosLat="0.00" arrivalSpeed="15.08" duration="192.00" routeLength="1996.47" waitingTime="44.15" waitingCount="1" stopTime="0.00" timeLoss="59.80" rerouteNo="1" devices="tripinfo_car_e2s_111 routing_car_e2s_111" vType="Car" speedFactor="1.09" vaporized=""/>
    <tripinfo id="car_e2s_128" depart="128.00" departLane="e2sep_1" departPos="3.60" departPosLat="0.00" departSpeed="13.90" departDelay="0.00" arrival="305.95" arrivalLane="c2s_1" arrivalPos="990.00" arrivalPosLat="0.00" arrivalSpeed="15.04" duration="177.95" routeLength="1996.47" waitingTime="28.30" waitingCount="1" stopTime="0.00" timeLoss="45.29" rerouteNo="1" devices="tripinfo_car_e2s_128 routing_car_e2s_128" vType="Car" speedFactor="1.09" vaporized=""/>
    <tripinfo id="car_e2n_138" depart="138.00" departLane="e2sep_1" departPos="3.60" departPosLat="0.00" departSpeed="13.90" departDelay="0.00" arrival="307.20" arrivalLane="c2n_1" arrivalPos="990.00" arrivalPosLat="0.00" arrivalSpeed="13.90" duration="169.20" routeLength="1986.69" waitingTime="13.80" waitingCount="1" stopTime="0.00" timeLoss="25.53" rerouteNo="1" devices="tripinfo_car_e2n_138 routing_car_e2n_138" vType="Car" speedFactor="1.00" vaporized=""/>
    <tripinfo id="car_e2w_161" depart="161.00" departLane="e2sep_1" departPos="3.60" departPosLat="0.00" departSpeed="13.90" departDelay="0.00" arrival="307.30" arrivalLane="c2w_1" arrivalPos="990.00" arrivalPosLat="0.00" arrivalSpeed="13.94" duration="146.30" routeLength="1997.01" waitingTime="0.00" waitingCount="0" stopTime="0.00" timeLoss="3.09" rerouteNo="1" devices="tripinfo_car_e2w_161 routing_car_e2w_161" vType="Car" speedFactor="1.00" vaporized=""/>
    <tripinfo id="car_w2n_133" depart="133.00" departLane="w2sep_1" departPos="3.60" departPosLat="0.00" departSpeed="13.90" departDelay="0.00" arrival="311.60" arrivalLane="c2n_1" arrivalPos="990.00" arrivalPosLat="0.00" arrivalSpeed="13.89" duration="178.60" routeLength="1996.47" waitingTime="21.75" waitingCount="2" stopTime="0.00" timeLoss="34.25" rerouteNo="1" devices="tripinfo_car_w2n_133 routing_car_w2n_133" vType="Car" speedFactor="1.00" vaporized=""/>
    <tripinfo id="car_e2w_179" depart="179.00" departLane="e2sep_1" departPos="3.60" departPosLat="0.00" departSpeed="13.90" departDelay="0.00" arrival="313.15" arrivalLane="c2w_1" arrivalPos="990.00" arrivalPosLat="0.00" arrivalSpeed="15.55" duration="134.15" routeLength="1997.01" waitingTime="0.00" waitingCount="0" stopTime="0.00" timeLoss="5.79" rerouteNo="1" devices="tripinfo_car_e2w_179 routing_car_e2w_179" vType="Car" speedFactor="1.12" vaporized=""/>
    <tripinfo id="car_e2n_173" depart="173.00" departLane="e2sep_1" departPos="3.60" departPosLat="0.00" departSpeed="13.90" departDelay="0.00" arrival="317.65" arrivalLane="c2n_1" arrivalPos="990.00" arrivalPosLat="0.00" arrivalSpeed="14.23" duration="144.65" routeLength="1986.69" waitingTime="0.00" waitingCount="0" stopTime="0.00" timeLoss="4.31" rerouteNo="1" devices="tripinfo_car_e2n_173 routing_car_e2n_173" vType="Car" speedFactor="1.02" vaporized=""/>
    <tripinfo id="car_w2n_169" depart="169.00" departLane="w2sep_1" departPos="3.60" departPosLat="0.00" departSpeed="13.90" departDelay="0.00" arrival="324.05" arrivalLane="c2n_1" arrivalPos="990.00" arrivalPosLat="0.00" arrivalSpeed="13.90" duration="155.05" routeLength="1996.47" waitingTime="3.20" waitingCount="1" stopTime="0.00" timeLoss="10.70" rerouteNo="1" devices="tripinfo_car_w2n_169 routing_car_w2n_169" vType="Car" speedFactor="1.00" vaporized=""/>
    <tripinfo id="car_s2e_158" depart="158.00" departLane="s2sep_1" departPos="3.60" departPosLat="0.00" departSpeed="13.90" departDelay="0.00" arrival="344.05" arrivalLane="c2e_1" arrivalPos="990.00" arrivalPosLat="0.00" arrivalSpeed="15.23" duration="186.05" routeLength="1986.69" waitingTime="40.90" waitingCount="1" stopTime="0.00" timeLoss="54.94" rerouteNo="1" devices="tripinfo_car_s2e_158 routing_car_s2e_158" vType="Car" speedFactor="1.10" vaporized=""/>
    <tripinfo id="car_n2w_142" depart="142.00" departLane="n2sep_1" departPos="3.60" departPosLat="0.00" departSpeed="13.90" departDelay="0.00" arrival="345.65" arrivalLane="c2w_1" arrivalPos="990.00" arrivalPosLat="0.00" arrivalSpeed="13.90" duration="203.65" routeLength="1986.69" waitingTime="53.30" waitingCount="1" stopTime="0.00" timeLoss="59.95" rerouteNo="1" devices="tripinfo_car_n2w_142 routing_car_n2w_142" vType="Car" speedFactor="1.00" vaporized=""/>
    <tripinfo id="car_s2n_144" depart="144.00" departLane="s2sep_1" departPos="3.60" departPosLat="0.00" departSpeed="13.90" departDelay="0.00" arrival="345.75" arrivalLane="c2n_1" arrivalPos="990.00" arrivalPosLat="0.00" arrivalSpeed="13.90" duration="201.75" routeLength="1997.01" waitingTime="51.35" waitingCount="1" stopTime="0.00" timeLoss="58.04" rerouteNo="1" devices="tripinfo_car_s2n_144 routing_car_s2n_144" vType="Car" speedFactor="1.00" vaporized=""/>
    <tripinfo id="car_n2s_191" depart="191.00" departLane="n2sep_1" departPos="3.60" departPosLat="0.00" departSpeed="13.90" departDelay="0.00" arrival="347.00" arrivalLane="c2s_1" arrivalPos="990.00" arrivalPosLat="0.00" arrivalSpeed="16.38" duration="156.00" routeLength="1997.01" waitingTime="18.15" waitingCount="1" stopTime="0.00" timeLoss="34.06" rerouteNo="1" devices="tripinfo_car_n2s_191 routing_car_n2s_191" vType="Car" speedFactor="1.18" vaporized=""/>
    <tripinfo id="car_s2n_155" depart="155.00" departLane="s2sep_1" departPos="3.60" departPosLat="0.00" departSpeed="13.90" departDelay="0.00" arrival="349.50" arrivalLane="c2n_1" arrivalPos="990.00" arrivalPosLat="0.00" arrivalSpeed="14.11" duration="194.50" routeLength="1997.01" waitingTime="41.90" waitingCount="1" stopTime="0.00" timeLoss="53.17" rerouteNo="1" devices="tripinfo_car_s2n_155 routing_car_s2n_155" vType="Car" speedFactor="1.02" vaporized=""/>
    <tripinfo id="car_s2n_174" depart="174.00" departLane="s2sep_1" departPos="3.60" departPosLat="0.00" departSpeed="13.90" departDelay="0.00" arrival="351.50" arrivalLane="c2n_1" arrivalPos="990.00" arrivalPosLat="0.00" arrivalSpeed="15.18" duration="177.50" routeLength="1997.01" waitingTime="31.85" waitingCount="1" stopTime="0.00" timeLoss="50.54" rerouteNo="1" devices="tripinfo_car_s2n_174 routing_car_s2n_174" vType="Car" speedFactor="1.13" vaporized=""/>
    <tripinfo id="bus_n2w_151" depart="151.00" departLane="n2sep_1" departPos="12.10" departPosLat="0.00" departSpeed="13.90" departDelay="0.00" arrival="352.05" arrivalLane="c2w_1" arrivalPos="990.00" arrivalPosLat="0.00" arrivalSpeed="13.89" duration="201.05" routeLength="1978.19" waitingTime="46.20" waitingCount="1" stopTime="0.00" timeLoss="57.99" rerouteNo="1" devices="tripinfo_bus_n2w_151 routing_bus_n2w_151" vType="Bus" speedFactor="1.00" vaporized=""/>
    <tripinfo id="car_s2n_196" depart="196.00" departLane="s2sep_1" departPos="3.60" departPosLat="0.00" departSpeed="13.90" departDelay="0.00" arrival="353.35" arrivalLane="c2n_1" arrivalPos="990.00" arrivalPosLat="0.00" arrivalSpeed="15.54" duration="157.35" routeLength="1997.01" waitingTime="12.80" waitingCount="1" stopTime="0.00" timeLoss="34.75" rerouteNo="1" devices="tripinfo_car_s2n_196 routing_car_s2n_196" vType="Car" speedFactor="1.17" vaporized=""/>
    <tripinfo id="car_s2e_179" depart="179.00" departLane="s2sep_1" departPos="3.60" departPosLat="0.00" departSpeed="13.90" departDelay="0.00" arrival="353.85" arrivalLane="c2e_1" arrivalPos="990.00" arrivalPosLat="0.00" arrivalSpeed="14.12" duration="174.85" routeLength="1986.69" waitingTime="21.40" waitingCount="1" stopTime="0.00" timeLoss="33.38" rerouteNo="1" devices="tripinfo_car_s2e_179 routing_car_s2e_179" vType="Car" speedFactor="1.02" vaporized=""/>
    <tripinfo id="car_n2w_171" depart="171.00" departLane="n2sep_1" departPos="3.60" departPosLat="0.00" departSpeed="13.90" departDelay="0.00" arrival="354.55" arrivalLane="c2w_1" arrivalPos="990.00" arrivalPosLat="0.00" arrivalSpeed="15.42" duration="183.55" routeLength="1986.69" waitingTime="33.05" waitingCount="1" stopTime="0.00" timeLoss="57.79" rerouteNo="1" devices="tripinfo_car_n2w_171 routing_car_n2w_171" vType="Car" speedFactor="1.14" vaporized=""/>
    <tripinfo id="car_s2e_198" depart="198.00" departLane="s2sep_1" departPos="3.60" departPosLat="0.00" departSpeed="13.90" departDelay="0.00" arrival="357.75" arrivalLane="c2e_1" arrivalPos="990.00" arrivalPosLat="0.00" arrivalSpeed="14.43" duration="159.75" routeLength="1986.69" waitingTime="5.90" waitingCount="1" stopTime="0.00" timeLoss="21.62" rerouteNo="1" devices="tripinfo_car_s2e_198 routing_car_s2e_198" vType="Car" speedFactor="1.04" vaporized=""/>
    <tripinfo id="car_n2w_180" depart="180.00" departLane="n2sep_1" departPos="3.60" departPosLat="0.00" departSpeed="13.90" departDelay="0.00" arrival="358.70" arrivalLane="c2w_1" arrivalPos="990.00" arrivalPosLat="0.00" arrivalSpeed="13.89" duration="178.70" routeLength="1986.69" waitingTime="18.95" waitingCount="1" stopTime="0.00" timeLoss="35.03" rerouteNo="1" devices="tripinfo_car_n2w_180 routing_car_n2w_180" vType="Car" speedFactor="1.00" vaporized=""/>
    <tripinfo id="car_s2w_193" depart="193.00" departLane="s2sep_1" departPos="3.60" departPosLat="0.00" departSpeed="13.90" departDelay="0.00" arrival="360.55" arrivalLane="c2w_1" arrivalPos="990.00" arrivalPosLat="0.00" arrivalSpeed="15.24" duration="167.55" routeLength="1996.47" waitingTime="21.00" waitingCount="2" stopTime="0.00" timeLoss="42.52" rerouteNo="1" devices="tripinfo_car_s2w_193 routing_car_s2w_193" vType="Car" speedFactor="1.15" vaporized=""/>
    <tripinfo id="car_s2n_219" depart="219.00" departLane="s2sep_1" departPos="3.60" departPosLat="0.00" departSpeed="13.90" departDelay="0.00" arrival="363.40" arrivalLane="c2n_1" arrivalPos="990.00" arrivalPosLat="0.00" arrivalSpeed="13.90" duration="144.40" routeLength="1997.01" waitingTime="0.00" waitingCount="0" stopTime="0.00" timeLoss="0.73" rerouteNo="1" devices="tripinfo_car_s2n_219 routing_car_s2n_219" vType="Car" speedFactor="1.00" vaporized=""/>
    <tripinfo id="car_s2e_221" depart="221.00" departLane="s2sep_1" departPos="3.60" departPosLat="0.00" departSpeed="13.90" departDelay="0.00" arrival="370.65" arrivalLane="c2e_1" arrivalPos="990.00" arrivalPosLat="0.00" arrivalSpeed="13.90" duration="149.65" routeLength="1986.69" waitingTime="0.00" waitingCount="0" stopTime="0.00" timeLoss="5.96" rerouteNo="1" devices="tripinfo_car_s2e_221 routing_car_s2e_221" vType="Car" speedFactor="1.00" vaporized=""/>
    <tripinfo id="car_n2e_151" depart="152.45" departLane="n2sep_1" departPos="3.60" departPosLat="0.00" departSpeed="13.90" departDelay="1.45" arrival="372.50" arrivalLane="c2e_1" arrivalPos="990.00" arrivalPosLat="0.00" arrivalSpeed="15.42" duration="220.05" routeLength="1996.47" waitingTime="66.20" waitingCount="3" stopTime="0.00" timeLoss="96.58" rerouteNo="1" devices="tripinfo_car_n2e_151 routing_car_n2e_151" vType="Car" speedFactor="1.17" vaporized=""/>
    <tripinfo id="car_n2e_163" depart="163.00" departLane="n2sep_1" departPos="3.60" departPosLat="0.00" departSpeed="13.90" departDelay="0.00" arrival="377.45" arrivalLane="c2e_1" arrivalPos="990.00" arrivalPosLat="0.00" arrivalSpeed="13.90" duration="214.45" routeLength="1996.47" waitingTime="55.40" waitingCount="2" stopTime="0.00" timeLoss="70.12" rerouteNo="1" devices="tripinfo_car_n2e_163 routing_car_n2e_163" vType="Car" speedFactor="1.00" vaporized=""/>
    <tripinfo id="car_n2e_175" depart="175.00" departLane="n2sep_1" departPos="3.60" departPosLat="0.00" departSpeed="13.90" departDelay="0.00" arrival="379.70" arrivalLane="c2e_1" arrivalPos="990.00" arrivalPosLat="0.00" arrivalSpeed="14.75" duration="204.70" routeLength="1996.47" waitingTime="46.85" waitingCount="2" stopTime="0.00" timeLoss="71.38" rerouteNo="1" devices="tripinfo_car_n2e_175 routing_car_n2e_175" vType="Car" speedFactor="1.08" vaporized=""/>
    <tripinfo id="car_n2e_213" depart="213.00" departLane="n2sep_1" departPos="3.60" departPosLat="0.00" departSpeed="13.90" departDelay="0.00" arrival="382.90" arrivalLane="c2e_1" arrivalPos="990.00" arrivalPosLat="0.00" arrivalSpeed="14.16" duration="169.90" routeLength="1996.47" waitingTime="15.75" waitingCount="1" stopTime="0.00" timeLoss="28.72" rerouteNo="1" devices="tripinfo_car_n2e_213 routing_car_n2e_213" vType="Car" speedFactor="1.02" vaporized=""/>
    <tripinfo id="car_n2e_221" depart="221.00" departLane="n2sep_1" departPos="3.60" departPosLat="0.00" departSpeed="13.90" departDelay="0.00" arrival="385.45" arrivalLane="c2e_1" arrivalPos="990.00" arrivalPosLat="0.00" arrivalSpeed="14.50" duration="164.45" routeLength="1996.47" waitingTime="10.90" waitingCount="1" stopTime="0.00" timeLoss="27.72" rerouteNo="1" devices="tripinfo_car_n2e_221 routing_car_n2e_221" vType="Car" speedFactor="1.06" vaporized=""/>
    <tripinfo id="car_n2e_224" depart="224.00" departLane="n2sep_1" departPos="3.60" departPosLat="0.00" departSpeed="13.90" departDelay="0.00" arrival="387.25" arrivalLane="c2e_1" arrivalPos="990.00" arrivalPosLat="0.00" arrivalSpeed="15.49" duration="163.25" routeLength="1996.47" waitingTime="10.15" waitingCount="1" stopTime="0.00" timeLoss="40.89" rerouteNo="1" devices="tripinfo_car_n2e_224 routing_car_n2e_224" vType="Car" speedFactor="1.18" vaporized=""/>
    <tripinfo id="car_e2w_217" depart="217.00" departLane="e2sep_1" departPos="3.60" departPosLat="0.00" departSpeed="13.90" departDelay="0.00" arrival="389.15" arrivalLane="c2w_1" arrivalPos="990.00" arrivalPosLat="0.00" arrivalSpeed="14.22" duration="172.15" routeLength="1997.01" waitingTime="24.50" waitingCount="1" stopTime="0.00" timeLoss="31.69" rerouteNo="1" devices="tripinfo_car_e2w_217 routing_car_e2w_217" vType="Car" speedFactor="1.02" vaporized=""/>
    <tripinfo id="car_w2s_195" depart="195.00" departLane="w2sep_1" departPos="3.60" departPosLat="0.00" departSpeed="13.90" departDelay="0.00" arrival="390.25" arrivalLane="c2s_1" arrivalPos="990.00" arrivalPosLat="0.00" arrivalSpeed="13.97" duration="195.25" routeLength="1986.69" waitingTime="45.55" waitingCount="1" stopTime="0.00" timeLoss="52.33" rerouteNo="1" devices="tripinfo_car_w2s_195 routing_car_w2s_195" vType="Car" speedFactor="1.01" vaporized=""/>
    <tripinfo id="car_e2n_220" depart="220.00" departLane="e2sep_1" departPos="3.60" departPosLat="0.00" departSpeed="13.90" departDelay="0.00" arrival="391.65" arrivalLane="c2n_1" arrivalPos="990.00" arrivalPosLat="0.00" arrivalSpeed="14.17" duration="171.65" routeLength="1986.69" waitingTime="20.95" waitingCount="1" stopTime="0.00" timeLoss="30.74" rerouteNo="1" devices="tripinfo_car_e2n_220 routing_car_e2n_220" vType="Car" speedFactor="1.02" vaporized=""/>
    <tripinfo id="car_w2s_225" depart="225.00" departLane="w2sep_1" departPos="3.60" departPosLat="0.00" departSpeed="13.90" departDelay="0.00" arrival="393.75" arrivalLane="c2s_1" arrivalPos="990.00" arrivalPosLat="0.00" arrivalSpeed="14.31" duration="168.75" routeLength="1986.69" waitingTime="18.00" waitingCount="1" stopTime="0.00" timeLoss="29.62" rerouteNo="1" devices="tripinfo_car_w2s_225 routing_car_w2s_225" vType="Car" speedFactor="1.03" vaporized=""/>
    <tripinfo id="car_e2n_226" depart="226.00" departLane="e2sep_1" departPos="3.60" departPosLat="0.00" departSpeed="13.90" departDelay="0.00" arrival="394.05" arrivalLane="c2n_1" arrivalPos="990.00" arrivalPosLat="0.00" arrivalSpeed="15.08" duration="168.05" routeLength="1986.69" waitingTime="19.85" waitingCount="1" stopTime="0.00" timeLoss="37.72" rerouteNo="1" devices="tripinfo_car_e2n_226 routing_car_e2n_226" vType="Car" speedFactor="1.10" vaporized=""/>
    <tripinfo id="car_w2e_237" depart="237.00" departLane="w2sep_1" departPos="3.60" departPosLat="0.00" departSpeed="13.90" departDelay="0.00" arrival="394.35" arrivalLane="c2e_1" arrivalPos="990.00" arrivalPosLat="0.00" arrivalSpeed="14.13" duration="157.35" routeLength="1997.01" waitingTime="5.95" waitingCount="1" stopTime="0.00" timeLoss="16.04" rerouteNo="1" devices="tripinfo_car_w2e_237 routing_car_w2e_237" vType="Car" speedFactor="1.02" vaporized=""/>
    <tripinfo id="car_e2w_227" depart="227.30" departLane="e2sep_1" departPos="3.60" departPosLat="0.00" departSpeed="13.90" departDelay="0.30" arrival="397.10" arrivalLane="c2w_1" arrivalPos="990.00" arrivalPosLat="0.00" arrivalSpeed="14.00" duration="169.80" routeLength="1997.01" waitingTime="15.05" waitingCount="1" stopTime="0.00" timeLoss="27.16" rerouteNo="1" devices="tripinfo_car_e2w_227 routing_car_e2w_227" vType="Car" speedFactor="1.01" vaporized=""/>
    <tripinfo id="car_w2e_242" depart="242.00" departLane="w2sep_1" departPos="3.60" departPosLat="0.00" departSpeed="13.90" departDelay="0.00" arrival="397.65" arrivalLane="c2e_1" arrivalPos="990.00" arrivalPosLat="0.00" arrivalSpeed="14.44" duration="155.65" routeLength="1997.01" waitingTime="0.00" waitingCount="0" stopTime="0.00" timeLoss="17.85" rerouteNo="1" devices="tripinfo_car_w2e_242 routing_car_w2e_242" vType="Car" speedFactor="1.04" vaporized=""/>
    <tripinfo id="car_w2s_242" depart="243.55" departLane="w2sep_1" departPos="3.60" departPosLat="0.00" departSpeed="13.90" departDelay="1.55" arrival="399.90" arrivalLane="c2s_1" arrivalPos="990.00" arrivalPosLat="0.00" arrivalSpeed="14.00" duration="156.35" routeLength="1986.69" waitingTime="0.00" waitingCount="0" stopTime="0.00" timeLoss="13.66" rerouteNo="1" devices="tripinfo_car_w2s_242 routing_car_w2s_242" vType="Car" speedFactor="1.01" vaporized=""/>
    <tripinfo id="car_e2n_239" depart="239.25" departLane="e2sep_1" departPos="3.60" departPosLat="0.00" departSpeed="13.90" departDelay="0.25" arrival="400.55" arrivalLane="c2n_1" arrivalPos="990.00" arrivalPosLat="0.00" arrivalSpeed="13.90" duration="161.30" routeLength="1986.69" waitingTime="4.45" waitingCount="1" stopTime="0.00" timeLoss="17.62" rerouteNo="1" devices="tripinfo_car_e2n_239 routing_car_e2n_239" vType="Car" speedFactor="1.00" vaporized=""/>
    <tripinfo id="car_e2w_261" depart="261.00" departLane="e2sep_1" departPos="3.60" departPosLat="0.00" departSpeed="13.90" departDelay="0.00" arrival="401.35" arrivalLane="c2w_1" arrivalPos="990.00" arrivalPosLat="0.00" arrivalSpeed="15.10" duration="140.35" routeLength="1997.01" waitingTime="0.00" waitingCount="0" stopTime="0.00" timeLoss="8.31" rerouteNo="1" devices="tripinfo_car_e2w_261 routing_car_e2w_261" vType="Car" speedFactor="1.09" vaporized=""/>
    <tripinfo id="car_w2e_250" depart="250.00" departLane="w2sep_1" departPos="3.60" departPosLat="0.00" departSpeed="13.90" departDelay="0.00" arrival="402.00" arrivalLane="c2e_1" arrivalPos="990.00" arrivalPosLat="0.00" arrivalSpeed="14.49" duration="152.00" routeLength="1997.01" waitingTime="0.00" waitingCount="0" stopTime="0.00" timeLoss="14.29" rerouteNo="1" devices="tripinfo_car_w2e_250 routing_car_w2e_250" vType="Car" speedFactor="1.04" vaporized=""/>
    <tripinfo id="car_w2s_246" depart="246.00" departLane="w2sep_1" departPos="3.60" departPosLat="0.00" departSpeed="13.90" departDelay="0.00" arrival="403.65" arrivalLane="c2s_1" arrivalPos="990.00" arrivalPosLat="0.00" arrivalSpeed="14.11" duration="157.65" routeLength="1986.69" waitingTime="0.00" waitingCount="0" stopTime="0.00" timeLoss="16.33" rerouteNo="1" devices="tripinfo_car_w2s_246 routing_car_w2s_246" vType="Car" speedFactor="1.02" vaporized=""/>
    <tripinfo id="car_e2n_242" depart="242.00" departLane="e2sep_1" departPos="3.60" departPosLat="0.00" departSpeed="13.90" departDelay="0.00" arrival="403.90" arrivalLane="c2n_1" arrivalPos="990.00" arrivalPosLat="0.00" arrivalSpeed="14.16" duration="161.90" routeLength="1986.69" waitingTime="2.70" waitingCount="1" stopTime="0.00" timeLoss="21.34" rerouteNo="1" devices="tripinfo_car_e2n_242 routing_car_e2n_242" vType="Car" speedFactor="1.02" vaporized=""/>
    <tripinfo id="car_e2w_263" depart="263.00" departLane="e2sep_1" departPos="3.60" departPosLat="0.00" departSpeed="13.90" departDelay="0.00" arrival="404.25" arrivalLane="c2w_1" arrivalPos="990.00" arrivalPosLat="0.00" arrivalSpeed="15.48" duration="141.25" routeLength="1997.01" waitingTime="0.00" waitingCount="0" stopTime="0.00" timeLoss="13.15" rerouteNo="1" devices="tripinfo_car_e2w_263 routing_car_e2w_263" vType="Car" speedFactor="1.12" vaporized=""/>
    <tripinfo id="car_w2e_265" depart="265.00" departLane="w2sep_1" departPos="3.60" departPosLat="0.00" departSpeed="13.90" departDelay="0.00" arrival="404.70" arrivalLane="c2e_1" arrivalPos="990.00" arrivalPosLat="0.00" arrivalSpeed="15.10" duration="139.70" routeLength="1997.01" waitingTime="0.00" waitingCount="0" stopTime="0.00" timeLoss="8.73" rerouteNo="1" devices="tripinfo_car_w2e_265 routing_car_w2e_265" vType="Car" speedFactor="1.10" vaporized=""/>
    <tripinfo id="car_e2n_251" depart="251.00" departLane="e2sep_1" departPos="3.60" departPosLat="0.00" departSpeed="13.90" departDelay="0.00" arrival="406.15" arrivalLane="c2n_1" arrivalPos="990.00" arrivalPosLat="0.00" arrivalSpeed="14.85" duration="155.15" routeLength="1986.69" waitingTime="0.50" waitingCount="1" stopTime="0.00" timeLoss="23.45" rerouteNo="1" devices="tripinfo_car_e2n_251 routing_car_e2n_251" vType="Car" speedFactor="1.09" vaporized=""/>
    <tripinfo id="car_w2s_252" depart="252.00" departLane="w2sep_1" departPos="3.60" departPosLat="0.00" departSpeed="13.90" departDelay="0.00" arrival="406.30" arrivalLane="c2s_1" arrivalPos="990.00" arrivalPosLat="0.00" arrivalSpeed="14.55" duration="154.30" routeLength="1986.69" waitingTime="0.00" waitingCount="0" stopTime="0.00" timeLoss="18.35" rerouteNo="1" devices="tripinfo_car_w2s_252 routing_car_w2s_252" vType="Car" speedFactor="1.06" vaporized=""/>
    <tripinfo id="car_e2s_238" depart="238.00" departLane="e2sep_1" departPos="3.60" departPosLat="0.00" departSpeed="13.90" departDelay="0.00" arrival="408.25" arrivalLane="c2s_1" arrivalPos="990.00" arrivalPosLat="0.00" arrivalSpeed="15.36" duration="170.25" routeLength="1996.47" waitingTime="27.05" waitingCount="2" stopTime="0.00" timeLoss="44.52" rerouteNo="1" devices="tripinfo_car_e2s_238 routing_car_e2s_238" vType="Car" speedFactor="1.15" vaporized=""/>
    <tripinfo id="car_w2e_266" depart="266.30" departLane="w2sep_1" departPos="3.60" departPosLat="0.00" departSpeed="13.90" departDelay="0.30" arrival="408.25" arrivalLane="c2e_1" arrivalPos="990.00" arrivalPosLat="0.00" arrivalSpeed="14.77" duration="141.95" routeLength="1997.01" waitingTime="0.00" waitingCount="0" stopTime="0.00" timeLoss="7.03" rerouteNo="1" devices="tripinfo_car_w2e_266 routing_car_w2e_266" vType="Car" speedFactor="1.07" vaporized=""/>
    <tripinfo id="car_w2n_231" depart="231.00" departLane="w2sep_1" departPos="3.60" departPosLat="0.00" departSpeed="13.90" departDelay="0.00" arrival="409.90" arrivalLane="c2n_1" arrivalPos="990.00" arrivalPosLat="0.00" arrivalSpeed="15.08" duration="178.90" routeLength="1996.47" waitingTime="32.70" waitingCount="2" stopTime="0.00" timeLoss="46.13" rerouteNo="1" devices="tripinfo_car_w2n_231 routing_car_w2n_231" vType="Car" speedFactor="1.09" vaporized=""/>
    <tripinfo id="car_e2w_266" depart="266.00" departLane="e2sep_1" departPos="3.60" departPosLat="0.00" departSpeed="13.90" departDelay="0.00" arrival="412.00" arrivalLane="c2w_1" arrivalPos="990.00" arrivalPosLat="0.00" arrivalSpeed="13.90" duration="146.00" routeLength="1997.01" waitingTime="0.00" waitingCount="0" stopTime="0.00" timeLoss="2.32" rerouteNo="1" devices="tripinfo_car_e2w_266 routing_car_e2w_266" vType="Car" speedFactor="1.00" vaporized=""/>
    <tripinfo id="amb_w2e_300" depart="300.00" departLane="w2sep_1" departPos="6.60" departPosLat="0.00" departSpeed="13.90" departDelay="0.00" arrival="412.60" arrivalLane="c2e_1" arrivalPos="990.00" arrivalPosLat="0.85" arrivalSpeed="20.74" duration="112.60" routeLength="1994.01" waitingTime="0.00" waitingCount="0" stopTime="0.00" timeLoss="16.96" rerouteNo="1" devices="tripinfo_amb_w2e_300 routing_amb_w2e_300 bluelight_amb_w2e_300 fcd_amb_w2e_300" vType="Ambulance" speedFactor="1.50" vaporized="">
        <example_device customValue1="0.00" customValue2="-1.00"/>
    </tripinfo>
    <tripinfo id="bus_w2n_239" depart="239.05" departLane="w2sep_1" departPos="12.10" departPosLat="0.00" departSpeed="13.90" departDelay="0.05" arrival="419.95" arrivalLane="c2n_1" arrivalPos="990.00" arrivalPosLat="0.00" arrivalSpeed="13.90" duration="180.90" routeLength="1987.97" waitingTime="19.30" waitingCount="2" stopTime="0.00" timeLoss="37.18" rerouteNo="1" devices="tripinfo_bus_w2n_239 routing_bus_w2n_239" vType="Bus" speedFactor="1.00" vaporized=""/>
    <tripinfo id="car_w2s_296" depart="296.00" departLane="w2sep_1" departPos="3.60" departPosLat="0.00" departSpeed="13.90" departDelay="0.00" arrival="423.40" arrivalLane="c2s_1" arrivalPos="990.00" arrivalPosLat="0.00" arrivalSpeed="16.25" duration="127.40" routeLength="1986.69" waitingTime="0.00" waitingCount="0" stopTime="0.00" timeLoss="4.48" rerouteNo="1" devices="tripinfo_car_w2s_296 routing_car_w2s_296" vType="Car" speedFactor="1.17" vaporized=""/>
    <tripinfo id="car_w2n_279" depart="279.00" departLane="w2sep_1" departPos="3.60" departPosLat="0.00" departSpeed="13.90" departDelay="0.00" arrival="425.85" arrivalLane="c2n_1" arrivalPos="990.00" arrivalPosLat="0.00" arrivalSpeed="14.09" duration="146.85" routeLength="1996.47" waitingTime="0.00" waitingCount="0" stopTime="0.00" timeLoss="4.52" rerouteNo="1" devices="tripinfo_car_w2n_279 routing_car_w2n_279" vType="Car" speedFactor="1.01" vaporized=""/>
    <tripinfo id="car_w2e_305" depart="305.00" departLane="w2sep_1" departPos="3.60" departPosLat="0.00" departSpeed="13.90" departDelay="0.00" arrival="436.45" arrivalLane="c2e_1" arrivalPos="990.00" arrivalPosLat="0.00" arrivalSpeed="15.24" duration="131.45" routeLength="1997.01" waitingTime="0.00" waitingCount="0" stopTime="0.00" timeLoss="0.40" rerouteNo="1" devices="tripinfo_car_w2e_305 routing_car_w2e_305" vType="Car" speedFactor="1.10" vaporized=""/>
    <tripinfo id="car_w2n_307" depart="307.00" departLane="w2sep_1" departPos="3.60" departPosLat="0.00" departSpeed="13.90" departDelay="0.00" arrival="438.40" arrivalLane="c2n_1" arrivalPos="990.00" arrivalPosLat="0.00" arrivalSpeed="16.36" duration="131.40" routeLength="1996.47" waitingTime="0.00" waitingCount="0" stopTime="0.00" timeLoss="8.77" rerouteNo="1" devices="tripinfo_car_w2n_307 routing_car_w2n_307" vType="Car" speedFactor="1.18" vaporized=""/>
    <tripinfo id="car_e2w_295" depart="295.00" departLane="e2sep_1" departPos="3.60" departPosLat="0.00" departSpeed="13.90" departDelay="0.00" arrival="439.65" arrivalLane="c2w_1" arrivalPos="990.00" arrivalPosLat="0.00" arrivalSpeed="13.90" duration="144.65" routeLength="1997.01" waitingTime="0.00" waitingCount="0" stopTime="0.00" timeLoss="0.96" rerouteNo="1" devices="tripinfo_car_e2w_295 routing_car_e2w_295" vType="Car" speedFactor="1.00" vaporized=""/>
    <tripinfo id="car_e2w_298" depart="298.00" departLane="e2sep_1" departPos="3.60" departPosLat="0.00" departSpeed="13.90" departDelay="0.00" arrival="441.90" arrivalLane="c2w_1" arrivalPos="990.00" arrivalPosLat="0.00" arrivalSpeed="14.95" duration="143.90" routeLength="1997.01" waitingTime="0.00" waitingCount="0" stopTime="0.00" timeLoss="13.09" rerouteNo="1" devices="tripinfo_car_e2w_298 routing_car_e2w_298" vType="Car" speedFactor="1.10" vaporized=""/>
    <tripinfo id="car_e2s_273" depart="273.00" departLane="e2sep_1" departPos="3.60" departPosLat="0.00" departSpeed="13.90" departDelay="0.00" arrival="446.10" arrivalLane="c2s_1" arrivalPos="990.00" arrivalPosLat="0.00" arrivalSpeed="13.90" duration="173.10" routeLength="1996.47" waitingTime="20.00" waitingCount="2" stopTime="0.00" timeLoss="28.77" rerouteNo="1" devices="tripinfo_car_e2s_273 routing_car_e2s_273" vType="Car" speedFactor="1.00" vaporized=""/>
    <tripinfo id="car_e2s_301" depart="301.00" departLane="e2sep_1" departPos="3.60" departPosLat="0.00" departSpeed="13.90" departDelay="0.00" arrival="450.50" arrivalLane="c2s_1" arrivalPos="990.00" arrivalPosLat="0.00" arrivalSpeed="14.01" duration="149.50" routeLength="1996.47" waitingTime="0.00" waitingCount="0" stopTime="0.00" timeLoss="6.47" rerouteNo="1" devices="tripinfo_car_e2s_301 routing_car_e2s_301" vType="Car" speedFactor="1.01" vaporized=""/>
    <tripinfo id="car_n2s_247" depart="247.00" departLane="n2sep_1" departPos="3.60" departPosLat="0.00" departSpeed="13.90" departDelay="0.00" arrival="455.40" arrivalLane="c2s_1" arrivalPos="990.00" arrivalPosLat="0.00" arrivalSpeed="14.42" duration="208.40" routeLength="1997.01" waitingTime="61.90" waitingCount="1" stopTime="0.00" timeLoss="69.95" rerouteNo="1" devices="tripinfo_car_n2s_247 routing_car_n2s_247" vType="Car" speedFactor="1.04" vaporized=""/>
    <tripinfo id="car_s2e_236" depart="236.00" departLane="s2sep_1" departPos="3.60" departPosLat="0.00" departSpeed="13.90" departDelay="0.00" arrival="457.10" arrivalLane="c2e_1" arrivalPos="990.00" arrivalPosLat="0.00" arrivalSpeed="13.90" duration="221.10" routeLength="1986.69" waitingTime="70.60" waitingCount="1" stopTime="0.00" timeLoss="77.43" rerouteNo="1" devices="tripinfo_car_s2e_236 routing_car_s2e_236" vType="Car" speedFactor="1.00" vaporized=""/>
    <tripinfo id="car_s2e_237" depart="237.45" departLane="s2sep_1" departPos="3.60" departPosLat="0.00" departSpeed="13.90" departDelay="0.45" arrival="460.50" arrivalLane="c2e_1" arrivalPos="990.00" arrivalPosLat="0.00" arrivalSpeed="14.28" duration="223.05" routeLength="1986.69" waitingTime="68.50" waitingCount="1" stopTime="0.00" timeLoss="83.63" rerouteNo="1" devices="tripinfo_car_s2e_237 routing_car_s2e_237" vType="Car" speedFactor="1.03" vaporized=""/>
    <tripinfo id="bus_n2s_258" depart="258.00" departLane="n2sep_1" departPos="12.10" departPosLat="0.00" departSpeed="13.90" departDelay="0.00" arrival="462.75" arrivalLane="c2s_1" arrivalPos="990.00" arrivalPosLat="0.00" arrivalSpeed="13.89" duration="204.75" routeLength="1988.51" waitingTime="50.50" waitingCount="1" stopTime="0.00" timeLoss="61.69" rerouteNo="1" devices="tripinfo_bus_n2s_258 routing_bus_n2s_258" vType="Bus" speedFactor="1.00" vaporized=""/>
    <tripinfo id="car_n2w_261" depart="261.00" departLane="n2sep_1" departPos="3.60" departPosLat="0.00" departSpeed="13.90" departDelay="0.00" arrival="463.40" arrivalLane="c2w_1" arrivalPos="990.00" arrivalPosLat="0.00" arrivalSpeed="14.04" duration="202.40" routeLength="1986.69" waitingTime="47.55" waitingCount="1" stopTime="0.00" timeLoss="60.10" rerouteNo="1" devices="tripinfo_car_n2w_261 routing_car_n2w_261" vType="Car" speedFactor="1.01" vaporized=""/>
    <tripinfo id="car_s2e_241" depart="241.00" departLane="s2sep_1" departPos="3.60" departPosLat="0.00" departSpeed="13.90" departDelay="0.00" arrival="464.60" arrivalLane="c2e_1" arrivalPos="990.00" arrivalPosLat="0.00" arrivalSpeed="13.91" duration="223.60" routeLength="1986.69" waitingTime="65.65" waitingCount="1" stopTime="0.00" timeLoss="80.16" rerouteNo="1" devices="tripinfo_car_s2e_241 routing_car_s2e_241" vType="Car" speedFactor="1.00" vaporized=""/>
    <tripinfo id="car_n2w_277" depart="277.00" departLane="n2sep_1" departPos="3.60" departPosLat="0.00" departSpeed="13.90" departDelay="0.00" arrival="466.05" arrivalLane="c2w_1" arrivalPos="990.00" arrivalPosLat="0.00" arrivalSpeed="14.76" duration="189.05" routeLength="1986.69" waitingTime="37.95" waitingCount="1" stopTime="0.00" timeLoss="55.14" rerouteNo="1" devices="tripinfo_car_n2w_277 routing_car_n2w_277" vType="Car" speedFactor="1.07" vaporized=""/>
    <tripinfo id="bus_s2n_295" depart="295.00" departLane="s2sep_1" departPos="12.10" departPosLat="0.00" departSpeed="13.90" departDelay="0.00" arrival="468.00" arrivalLane="c2n_1" arrivalPos="990.00" arrivalPosLat="0.00" arrivalSpeed="13.90" duration="173.00" routeLength="1988.51" waitingTime="17.35" waitingCount="1" stopTime="0.00" timeLoss="29.93" rerouteNo="1" devices="tripinfo_bus_s2n_295 routing_bus_s2n_295" vType="Bus" speedFactor="1.00" vaporized=""/>
    <tripinfo id="car_s2e_266" depart="266.00" departLane="s2sep_1" departPos="3.60" departPosLat="0.00" departSpeed="13.90" departDelay="0.00" arrival="468.10" arrivalLane="c2e_1" arrivalPos="990.00" arrivalPosLat="0.00" arrivalSpeed="13.87" duration="202.10" routeLength="1986.69" waitingTime="43.70" waitingCount="1" stopTime="0.00" timeLoss="58.43" rerouteNo="1" devices="tripinfo_car_s2e_266 routing_car_s2e_266" vType="Car" speedFactor="1.00" vaporized=""/>
    <tripinfo id="car_n2w_288" depart="288.00" departLane="n2sep_1" departPos="3.60" departPosLat="0.00" departSpeed="13.90" departDelay="0.00" arrival="469.55" arrivalLane="c2w_1" arrivalPos="990.00" arrivalPosLat="0.00" arrivalSpeed="14.35" duration="181.55" routeLength="1986.69" waitingTime="26.00" waitingCount="1" stopTime="0.00" timeLoss="42.67" rerouteNo="1" devices="tripinfo_car_n2w_288 routing_car_n2w_288" vType="Car" speedFactor="1.03" vaporized=""/>
    <tripinfo id="car_n2w_306" depart="306.00" departLane="n2sep_1" departPos="3.60" departPosLat="0.00" departSpeed="13.90" departDelay="0.00" arrival="471.95" arrivalLane="c2w_1" arrivalPos="990.00" arrivalPosLat="0.00" arrivalSpeed="14.99" duration="165.95" routeLength="1986.69" waitingTime="13.50" waitingCount="1" stopTime="0.00" timeLoss="34.81" rerouteNo="1" devices="tripinfo_car_n2w_306 routing_car_n2w_306" vType="Car" speedFactor="1.10" vaporized=""/>
    <tripinfo id="bus_n2s_293" depart="294.90" departLane="n2sep_1" departPos="12.10" departPosLat="0.00" departSpeed="13.90" departDelay="1.90" arrival="472.05" arrivalLane="c2s_1" arrivalPos="990.00" arrivalPosLat="0.00" arrivalSpeed="13.90" duration="177.15" routeLength="1988.51" waitingTime="18.30" waitingCount="1" stopTime="0.00" timeLoss="34.07" rerouteNo="1" devices="tripinfo_bus_n2s_293 routing_bus_n2s_293" vType="Bus" speedFactor="1.00" vaporized=""/>
    <tripinfo id="car_s2n_307" depart="307.00" departLane="s2sep_1" departPos="3.60" departPosLat="0.00" departSpeed="13.90" departDelay="0.00" arrival="472.80" arrivalLane="c2n_1" arrivalPos="990.00" arrivalPosLat="0.00" arrivalSpeed="13.94" duration="165.80" routeLength="1997.01" waitingTime="6.45" waitingCount="1" stopTime="0.00" timeLoss="22.54" rerouteNo="1" devices="tripinfo_car_s2n_307 routing_car_s2n_307" vType="Car" speedFactor="1.00" vaporized=""/>
    <tripinfo id="car_n2w_323" depart="323.00" departLane="n2sep_1" departPos="3.60" departPosLat="0.00" departSpeed="13.90" departDelay="0.00" arrival="475.45" arrivalLane="c2w_1" arrivalPos="990.00" arrivalPosLat="0.00" arrivalSpeed="14.81" duration="152.45" routeLength="1986.69" waitingTime="0.00" waitingCount="0" stopTime="0.00" timeLoss="17.96" rerouteNo="1" devices="tripinfo_car_n2w_323 routing_car_n2w_323" vType="Car" speedFactor="1.07" vaporized=""/>
    <tripinfo id="car_s2n_308" depart="310.15" departLane="s2sep_1" departPos="3.60" departPosLat="0.00" departSpeed="13.90" departDelay="2.15" arrival="475.60" arrivalLane="c2n_1" arrivalPos="990.00" arrivalPosLat="0.00" arrivalSpeed="14.24" duration="165.45" routeLength="1997.01" waitingTime="2.60" waitingCount="1" stopTime="0.00" timeLoss="26.16" rerouteNo="1" devices="tripinfo_car_s2n_308 routing_car_s2n_308" vType="Car" speedFactor="1.03" vaporized=""/>
    <tripinfo id="car_n2s_309" depart="309.00" departLane="n2sep_1" departPos="3.60" departPosLat="0.00" departSpeed="13.90" departDelay="0.00" arrival="476.35" arrivalLane="c2s_1" arrivalPos="990.00" arrivalPosLat="0.00" arrivalSpeed="14.21" duration="167.35" routeLength="1997.01" waitingTime="8.80" waitingCount="1" stopTime="0.00" timeLoss="26.95" rerouteNo="1" devices="tripinfo_car_n2s_309 routing_car_n2s_309" vType="Car" speedFactor="1.02" vaporized=""/>
    <tripinfo id="car_s2n_309" depart="312.00" departLane="s2sep_1" departPos="3.60" departPosLat="0.00" departSpeed="13.90" departDelay="3.00" arrival="478.00" arrivalLane="c2n_1" arrivalPos="990.00" arrivalPosLat="0.00" arrivalSpeed="14.53" duration="166.00" routeLength="1997.01" waitingTime="1.50" waitingCount="1" stopTime="0.00" timeLoss="30.57" rerouteNo="1" devices="tripinfo_car_s2n_309 routing_car_s2n_309" vType="Car" speedFactor="1.06" vaporized=""/>
    <tripinfo id="car_s2e_314" depart="315.80" departLane="s2sep_1" departPos="3.60" departPosLat="0.00" departSpeed="13.90" departDelay="1.80" arrival="478.15" arrivalLane="c2e_1" arrivalPos="990.00" arrivalPosLat="0.00" arrivalSpeed="13.90" duration="162.35" routeLength="1986.69" waitingTime="0.00" waitingCount="0" stopTime="0.00" timeLoss="18.69" rerouteNo="1" devices="tripinfo_car_s2e_314 routing_car_s2e_314" vType="Car" speedFactor="1.00" vaporized=""/>
    <tripinfo id="car_s2n_314" depart="314.00" departLane="s2sep_1" departPos="3.60" departPosLat="0.00" departSpeed="13.90" departDelay="0.00" arrival="480.70" arrivalLane="c2n_1" arrivalPos="990.00" arrivalPosLat="0.00" arrivalSpeed="14.23" duration="166.70" routeLength="1997.01" waitingTime="0.00" waitingCount="0" stopTime="0.00" timeLoss="27.50" rerouteNo="1" devices="tripinfo_car_s2n_314 routing_car_s2n_314" vType="Car" speedFactor="1.03" vaporized=""/>
</tripinfos>
