<?xml version="1.0" encoding="UTF-8"?>

<!-- generated on Sat Apr 24 18:30:49 2021 by Eclipse SUMO Version 1.4.0
<configuration xmlns:xsi="http://www.w3.org/2001/XMLSchema-instance" xsi:noNamespaceSchemaLocation="http://sumo.dlr.de/xsd/sumoConfiguration.xsd">

    <input>
        <net-file value="sumofiles/junction.net.xml"/>
        <route-files value="sumofiles/junction_preemption_221.rou.xml"/>
        <additional-files value="sumofiles/junction.det.xml"/>
    </input>

    <output>
        <tripinfo-output value="sumofiles/output/tripinfo_preemption_221.xml"/>
    </output>

    <time>
        <begin value="0"/>
        <end value="10000"/>
        <step-length value="0.05"/>
    </time>

    <processing>
        <lateral-resolution value="0.1"/>
    </processing>

    <report>
        <no-warnings value="true"/>
        <error-log value="sumofiles/output/errorlog_preemption_221.log"/>
        <no-step-log value="true"/>
    </report>

    <traci_server>
        <remote-port value="45913"/>
    </traci_server>

    <gui_only>
        <gui-settings-file value="sumofiles/junction-gui.settings.xml"/>
        <tracker-interval value="0.05"/>
    </gui_only>

</configuration>
-->

<tripinfos xmlns:xsi="http://www.w3.org/2001/XMLSchema-instance" xsi:noNamespaceSchemaLocation="http://sumo.dlr.de/xsd/tripinfo_file.xsd">
    <tripinfo id="car_e2n_2" depart="2.00" departLane="e2sep_1" departPos="3.60" departPosLat="0.00" departSpeed="13.90" departDelay="0.00" arrival="141.30" arrivalLane="c2n_1" arrivalPos="990.00" arrivalPosLat="0.00" arrivalSpeed="14.73" duration="139.30" routeLength="1986.69" waitingTime="0.00" waitingCount="0" stopTime="0.00" timeLoss="3.74" rerouteNo="1" devices="tripinfo_car_e2n_2 routing_car_e2n_2" vType="Car" speedFactor="1.06" vaporized=""/>
    <tripinfo id="car_w2n_2" depart="2.00" departLane="w2sep_1" departPos="3.60" departPosLat="0.00" departSpeed="13.90" departDelay="0.00" arrival="145.55" arrivalLane="c2n_1" arrivalPos="990.00" arrivalPosLat="0.00" arrivalSpeed="14.72" duration="143.55" routeLength="1996.47" waitingTime="0.00" waitingCount="0" stopTime="0.00" timeLoss="7.36" rerouteNo="1" devices="tripinfo_car_w2n_2 routing_car_w2n_2" vType="Car" speedFactor="1.06" vaporized=""/>
    <tripinfo id="car_e2s_2" depart="3.35" departLane="e2sep_1" departPos="3.60" departPosLat="0.00" departSpeed="13.90" departDelay="1.35" arrival="151.15" arrivalLane="c2s_1" arrivalPos="990.00" arrivalPosLat="0.00" arrivalSpeed="14.04" duration="147.80" routeLength="1996.47" waitingTime="0.00" waitingCount="0" stopTime="0.00" timeLoss="4.95" rerouteNo="1" devices="tripinfo_car_e2s_2 routing_car_e2s_2" vType="Car" speedFactor="1.01" vaporized=""/>
    <tripinfo id="car_e2s_4" depart="5.15" departLane="e2sep_1" departPos="3.60" departPosLat="0.00" departSpeed="13.90" departDelay="1.15" arrival="155.05" arrivalLane="c2s_1" arrivalPos="990.00" arrivalPosLat="0.00" arrivalSpeed="14.30" duration="149.90" routeLength="1996.47" waitingTime="0.00" waitingCount="0" stopTime="0.00" timeLoss="9.83" rerouteNo="1" devices="tripinfo_car_e2s_4 routing_car_e2s_4" vType="Car" speedFactor="1.03" vaporized=""/>
    <tripinfo id="car_w2n_11" depart="11.00" departLane="w2sep_1" departPos="3.60" departPosLat="0.00" departSpeed="13.90" departDelay="0.00" arrival="158.80" arrivalLane="c2n_1" arrivalPos="990.00" arrivalPosLat="0.00" arrivalSpeed="13.90" duration="147.80" routeLength="1996.47" waitingTime="0.00" waitingCount="0" stopTime="0.00" timeLoss="3.47" rerouteNo="1" devices="tripinfo_car_w2n_11 routing_car_w2n_11" vType="Car" speedFactor="1.00" vaporized=""/>
    <tripinfo id="car_w2n_22" depart="22.00" departLane="w2sep_1" departPos="3.60" departPosLat="0.00" departSpeed="13.90" departDelay="0.00" arrival="160.85" arrivalLane="c2n_1" arrivalPos="990.00" arrivalPosLat="0.00" arrivalSpeed="15.13" duration="138.85" routeLength="1996.47" waitingTime="0.00" waitingCount="0" stopTime="0.00" timeLoss="10.34" rerouteNo="1" devices="tripinfo_car_w2n_22 routing_car_w2n_22" vType="Car" speedFactor="1.12" vaporized=""/>
    <tripinfo id="car_s2e_13" depart="13.00" departLane="s2sep_1" departPos="3.60" departPosLat="0.00" departSpeed="13.90" departDelay="0.00" arrival="162.65" arrivalLane="c2e_1" arrivalPos="990.00" arrivalPosLat="0.00" arrivalSpeed="15.05" duration="149.65" routeLength="1986.69" waitingTime="7.90" waitingCount="1" stopTime="0.00" timeLoss="16.96" rerouteNo="1" devices="tripinfo_car_s2e_13 routing_car_s2e_13" vType="Car" speedFactor="1.08" vaporized=""/>
    <tripinfo id="car_n2s_11" depart="11.00" departLane="n2sep_1" departPos="3.60" departPosLat="0.00" departSpeed="13.90" departDelay="0.00" arrival="162.95" arrivalLane="c2s_1" arrivalPos="990.00" arrivalPosLat="0.00" arrivalSpeed="14.54" duration="151.95" routeLength="1997.01" waitingTime="6.90" waitingCount="1" stopTime="0.00" timeLoss="14.57" rerouteNo="1" devices="tripinfo_car_n2s_11 routing_car_n2s_11" vType="Car" speedFactor="1.05" vaporized=""/>
    <tripinfo id="car_s2n_2" depart="2.00" departLane="s2sep_1" departPos="3.60" departPosLat="0.00" departSpeed="13.90" departDelay="0.00" arrival="163.55" arrivalLane="c2n_1" arrivalPos="990.00" arrivalPosLat="0.00" arrivalSpeed="14.91" duration="161.55" routeLength="1997.01" waitingTime="18.10" waitingCount="1" stopTime="0.00" timeLoss="28.82" rerouteNo="1" devices="tripinfo_car_s2n_2 routing_car_s2n_2" vType="Car" speedFactor="1.08" vaporized=""/>
    <tripinfo id="car_s2n_17" depart="17.45" departLane="s2sep_1" departPos="3.60" departPosLat="0.00" departSpeed="13.90" departDelay="0.45" arrival="166.45" arrivalLane="c2n_1" arrivalPos="990.00" arrivalPosLat="0.00" arrivalSpeed="15.06" duration="149.00" routeLength="1997.01" waitingTime="0.00" waitingCount="0" stopTime="0.00" timeLoss="17.26" rerouteNo="1" devices="tripinfo_car_s2n_17 routing_car_s2n_17" vType="Car" speedFactor="1.09" vaporized=""/>
    <tripinfo id="car_n2s_19" depart="19.00" departLane="n2sep_1" departPos="3.60" departPosLat="0.00" departSpeed="13.90" departDelay="0.00" arrival="167.05" arrivalLane="c2s_1" arrivalPos="990.00" arrivalPosLat="0.00" arrivalSpeed="14.54" duration="148.05" routeLength="1997.01" waitingTime="0.00" waitingCount="0" stopTime="0.00" timeLoss="10.83" rerouteNo="1" devices="tripinfo_car_n2s_19 routing_car_n2s_19" vType="Car" speedFactor="1.05" vaporized=""/>
    <tripinfo id="car_s2e_22" depart="22.00" departLane="s2sep_1" departPos="3.60" departPosLat="0.00" departSpeed="13.90" departDelay="0.00" arrival="172.65" arrivalLane="c2e_1" arrivalPos="990.00" arrivalPosLat="0.00" arrivalSpeed="13.90" duration="150.65" routeLength="1986.69" waitingTime="0.00" waitingCount="0" stopTime="0.00" timeLoss="6.99" rerouteNo="1" devices="tripinfo_car_s2e_22 routing_car_s2e_22" vType="Car" speedFactor="1.00" vaporized=""/>
    <tripinfo id="car_n2s_28" depart="28.00" departLane="n2sep_1" departPos="3.60" departPosLat="0.00" departSpeed="13.90" departDelay="0.00" arrival="173.25" arrivalLane="c2s_1" arrivalPos="990.00" arrivalPosLat="0.00" arrivalSpeed="13.90" duration="145.25" routeLength="1997.01" waitingTime="0.00" waitingCount="0" stopTime="0.00" timeLoss="1.58" rerouteNo="1" devices="tripinfo_car_n2s_28 routing_car_n2s_28" vType="Car" speedFactor="1.00" vaporized=""/>
    <tripinfo id="car_s2w_16" depart="16.00" departLane="s2sep_1" departPos="3.60" departPosLat="0.00" departSpeed="13.90" departDelay="0.00" arrival="173.65" arrivalLane="c2w_1" arrivalPos="990.00" arrivalPosLat="0.00" arrivalSpeed="14.32" duration="157.65" routeLength="1996.47" waitingTime="5.80" waitingCount="2" stopTime="0.00" timeLoss="17.56" rerouteNo="1" devices="tripinfo_car_s2w_16 routing_car_s2w_16" vType="Car" speedFactor="1.03" vaporized=""/>
    <tripinfo id="car_s2n_32" depart="32.00" departLane="s2sep_1" departPos="3.60" departPosLat="0.00" departSpeed="13.90" departDelay="0.00" arrival="176.60" arrivalLane="c2n_1" arrivalPos="990.00" arrivalPosLat="0.00" arrivalSpeed="13.90" duration="144.60" routeLength="1997.01" waitingTime="0.00" waitingCount="0" stopTime="0.00" timeLoss="0.90" rerouteNo="1" devices="tripinfo_car_s2n_32 routing_car_s2n_32" vType="Car" speedFactor="1.00" vaporized=""/>
    <tripinfo id="car_s2n_38" depart="38.00" departLane="s2sep_1" departPos="3.60" departPosLat="0.00" departSpeed="13.90" departDelay="0.00" arrival="181.25" arrivalLane="c2n_1" arrivalPos="990.00" arrivalPosLat="0.00" arrivalSpeed="14.14" duration="143.25" routeLength="1997.01" waitingTime="0.00" waitingCount="0" stopTime="0.00" timeLoss="2.13" rerouteNo="1" devices="tripinfo_car_s2n_38 routing_car_s2n_38" vType="Car" speedFactor="1.02" vaporized=""/>
    <tripinfo id="car_s2n_53" depart="53.00" departLane="s2sep_1" departPos="3.60" departPosLat="0.00" departSpeed="13.90" departDelay="0.00" arrival="190.65" arrivalLane="c2n_1" arrivalPos="990.00" arrivalPosLat="0.00" arrivalSpeed="14.55" duration="137.65" routeLength="1997.01" waitingTime="0.00" waitingCount="0" stopTime="0.00" timeLoss="0.44" rerouteNo="1" devices="tripinfo_car_s2n_53 routing_car_s2n_53" vType="Car" speedFactor="1.05" vaporized=""/>
    <tripinfo id="car_e2n_34" depart="34.00" departLane="e2sep_1" departPos="3.60" departPosLat="0.00" departSpeed="13.90" departDelay="0.00" arrival="205.70" arrivalLane="c2n_1" arrivalPos="990.00" arrivalPosLat="0.00" arrivalSpeed="16.10" duration="171.70" routeLength="1986.69" waitingTime="37.00" waitingCount="1" stopTime="0.00" timeLoss="47.68" rerouteNo="1" devices="tripinfo_car_e2n_34 routing_car_e2n_34" vType="Car" speedFactor="1.16" vaporized=""/>
    <tripinfo id="car_w2s_23" depart="23.30" departLane="w2sep_1" departPos="3.60" departPosLat="0.00" departSpeed="13.90" departDelay="0.30" arrival="207.55" arrivalLane="c2s_1" arrivalPos="990.00" arrivalPosLat="0.00" arrivalSpeed="14.54" duration="184.25" routeLength="1986.69" waitingTime="38.25" waitingCount="1" stopTime="0.00" timeLoss="46.90" rerouteNo="1" devices="tripinfo_car_w2s_23 routing_car_w2s_23" vType="Car" speedFactor="1.05" vaporized=""/>
    <tripinfo id="car_e2w_12" depart="12.00" departLane="e2sep_1" departPos="3.60" departPosLat="0.00" departSpeed="13.90" departDelay="0.00" arrival="210.00" arrivalLane="c2w_1" arrivalPos="990.00" arrivalPosLat="0.00" arrivalSpeed="14.04" duration="198.00" routeLength="1997.01" waitingTime="48.00" waitingCount="1" stopTime="0.00" timeLoss="55.78" rerouteNo="1" devices="tripinfo_car_e2w_12 routing_car_e2w_12" vType="Car" speedFactor="1.01" vaporized=""/>
    <tripinfo id="car_w2e_28" depart="28.00" departLane="w2sep_1" departPos="3.60" departPosLat="0.00" departSpeed="13.90" departDelay="0.00" arrival="212.80" arrivalLane="c2e_1" arrivalPos="990.00" arrivalPosLat="0.00" arrivalSpeed="13.90" duration="184.80" routeLength="1997.01" waitingTime="32.35" waitingCount="1" stopTime="0.00" timeLoss="41.11" rerouteNo="1" devices="tripinfo_car_w2e_28 routing_car_w2e_28" vType="Car" speedFactor="1.00" vaporized=""/>
    <tripinfo id="car_e2w_18" depart="18.00" departLane="e2sep_1" departPos="3.60" departPosLat="0.00" departSpeed="13.90" departDelay="0.00" arrival="213.75" arrivalLane="c2w_1" arrivalPos="990.00" arrivalPosLat="0.00" arrivalSpeed="14.24" duration="195.75" routeLength="1997.01" waitingTime="44.00" waitingCount="1" stopTime="0.00" timeLoss="55.77" rerouteNo="1" devices="tripinfo_car_e2w_18 routing_car_e2w_18" vType="Car" speedFactor="1.03" vaporized=""/>
    <tripinfo id="car_w2s_41" depart="41.00" departLane="w2sep_1" departPos="3.60" departPosLat="0.00" departSpeed="13.90" departDelay="0.00" arrival="215.20" arrivalLane="c2s_1" arrivalPos="990.00" arrivalPosLat="0.00" arrivalSpeed="14.04" duration="174.20" routeLength="1986.69" waitingTime="21.65" waitingCount="1" stopTime="0.00" timeLoss="31.96" rerouteNo="1" devices="tripinfo_car_w2s_41 routing_car_w2s_41" vType="Car" speedFactor="1.01" vaporized=""/>
    <tripinfo id="car_e2n_53" depart="53.00" departLane="e2sep_1" departPos="3.60" departPosLat="0.00" departSpeed="13.90" departDelay="0.00" arrival="216.25" arrivalLane="c2n_1" arrivalPos="990.00" arrivalPosLat="0.00" arrivalSpeed="14.27" duration="163.25" routeLength="1986.69" waitingTime="11.90" waitingCount="1" stopTime="0.00" timeLoss="23.26" rerouteNo="1" devices="tripinfo_car_e2n_53 routing_car_e2n_53" vType="Car" speedFactor="1.03" vaporized=""/>
    <tripinfo id="car_w2s_54" depart="54.00" departLane="w2sep_1" departPos="3.60" departPosLat="0.00" departSpeed="13.90" departDelay="0.00" arrival="217.30" arrivalLane="c2s_1" arrivalPos="990.00" arrivalPosLat="0.00" arrivalSpeed="15.17" duration="163.30" routeLength="1986.69" waitingTime="16.00" waitingCount="1" stopTime="0.00" timeLoss="35.36" rerouteNo="1" devices="tripinfo_car_w2s_54 routing_car_w2s_54" vType="Car" speedFactor="1.12" vaporized=""/>
    <tripinfo id="car_e2w_70" depart="70.00" departLane="e2sep_1" departPos="3.60" departPosLat="0.00" departSpeed="13.90" departDelay="0.00" arrival="219.70" arrivalLane="c2w_1" arrivalPos="990.00" arrivalPosLat="0.00" arrivalSpeed="13.97" duration="149.70" routeLength="1997.01" waitingTime="0.00" waitingCount="0" stopTime="0.00" timeLoss="6.73" rerouteNo="1" devices="tripinfo_car_e2w_70 routing_car_e2w_70" vType="Car" speedFactor="1.01" vaporized=""/>
    <tripinfo id="car_w2n_47" depart="47.00" departLane="w2sep_1" departPos="3.60" departPosLat="0.00" departSpeed="13.90" departDelay="0.00" arrival="220.00" arrivalLane="c2n_1" arrivalPos="990.00" arrivalPosLat="0.00" arrivalSpeed="15.13" duration="173.00" routeLength="1996.47" waitingTime="26.40" waitingCount="2" stopTime="0.00" timeLoss="40.69" rerouteNo="1" devices="tripinfo_car_w2n_47 routing_car_w2n_47" vType="Car" speedFactor="1.09" vaporized=""/>
    <tripinfo id="car_w2s_56" depart="56.00" departLane="w2sep_1" departPos="3.60" departPosLat="0.00" departSpeed="13.90" departDelay="0.00" arrival="222.05" arrivalLane="c2s_1" arrivalPos="990.00" arrivalPosLat="0.00" arrivalSpeed="13.89" duration="166.05" routeLength="1986.69" waitingTime="8.00" waitingCount="1" stopTime="0.00" timeLoss="22.38" rerouteNo="1" devices="tripinfo_car_w2s_56 routing_car_w2s_56" vType="Car" speedFactor="1.00" vaporized=""/>
    <tripinfo id="car_w2n_68" depart="68.00" departLane="w2sep_1" departPos="3.60" departPosLat="0.00" departSpeed="13.90" departDelay="0.00" arrival="222.20" arrivalLane="c2n_1" arrivalPos="990.00" arrivalPosLat="0.00" arrivalSpeed="15.98" duration="154.20" routeLength="1996.47" waitingTime="8.50" waitingCount="1" stopTime="0.00" timeLoss="31.74" rerouteNo="1" devices="tripinfo_car_w2n_68 routing_car_w2n_68" vType="Car" speedFactor="1.18" vaporized=""/>
    <tripinfo id="car_e2w_73" depart="73.50" departLane="e2sep_1" departPos="3.60" departPosLat="0.00" departSpeed="13.90" departDelay="0.50" arrival="223.90" arrivalLane="c2w_1" arrivalPos="990.00" arrivalPosLat="0.00" arrivalSpeed="13.89" duration="150.40" routeLength="1997.01" waitingTime="0.00" waitingCount="0" stopTime="0.00" timeLoss="6.72" rerouteNo="1" devices="tripinfo_car_e2w_73 routing_car_e2w_73" vType="Car" speedFactor="1.00" vaporized=""/>
    <tripinfo id="car_w2s_57" depart="57.60" departLane="w2sep_1" departPos="3.60" departPosLat="0.00" departSpeed="13.90" departDelay="0.60" arrival="225.75" arrivalLane="c2s_1" arrivalPos="990.00" arrivalPosLat="0.00" arrivalSpeed="13.88" duration="168.15" routeLength="1986.69" waitingTime="5.60" waitingCount="1" stopTime="0.00" timeLoss="24.46" rerouteNo="1" devices="tripinfo_car_w2s_57 routing_car_w2s_57" vType="Car" speedFactor="1.00" vaporized=""/>
    <tripinfo id="bus_w2e_82" depart="82.00" departLane="w2sep_1" departPos="12.10" departPosLat="0.00" departSpeed="13.90" departDelay="0.00" arrival="227.25" arrivalLane="c2e_1" arrivalPos="990.00" arrivalPosLat="0.00" arrivalSpeed="13.90" duration="145.25" routeLength="1988.51" waitingTime="0.00" waitingCount="0" stopTime="0.00" timeLoss="2.15" rerouteNo="1" devices="tripinfo_bus_w2e_82 routing_bus_w2e_82" vType="Bus" speedFactor="1.00" vaporized=""/>
    <tripinfo id="car_w2s_76" depart="76.00" departLane="w2sep_1" departPos="3.60" departPosLat="0.00" departSpeed="13.90" departDelay="0.00" arrival="229.00" arrivalLane="c2s_1" arrivalPos="990.00" arrivalPosLat="0.00" arrivalSpeed="13.86" duration="153.00" routeLength="1986.69" waitingTime="0.00" waitingCount="0" stopTime="0.00" timeLoss="9.33" rerouteNo="1" devices="tripinfo_car_w2s_76 routing_car_w2s_76" vType="Car" speedFactor="1.00" vaporized=""/>
    <tripinfo id="car_w2e_97" depart="97.00" departLane="w2sep_1" departPos="3.60" departPosLat="0.00" departSpeed="13.90" departDelay="0.00" arrival="231.10" arrivalLane="c2e_1" arrivalPos="990.00" arrivalPosLat="0.00" arrivalSpeed="15.13" duration="134.10" routeLength="1997.01" waitingTime="0.00" waitingCount="0" stopTime="0.00" timeLoss="2.50" rerouteNo="1" devices="tripinfo_car_w2e_97 routing_car_w2e_97" vType="Car" speedFactor="1.09" vaporized=""/>
    <tripinfo id="car_w2n_90" depart="90.00" departLane="w2sep_1" departPos="3.60" departPosLat="0.00" departSpeed="13.90" departDelay="0.00" arrival="234.10" arrivalLane="c2n_1" arrivalPos="990.00" arrivalPosLat="0.00" arrivalSpeed="14.32" duration="144.10" routeLength="1996.47" waitingTime="0.00" waitingCount="0" stopTime="0.00" timeLoss="4.02" rerouteNo="1" devices="tripinfo_car_w2n_90 routing_car_w2n_90" vType="Car" speedFactor="1.03" vaporized=""/>
    <tripinfo id="bus_e2s_60" depart="60.00" departLane="e2sep_1" departPos="12.10" departPosLat="0.00" departSpeed="13.90" departDelay="0.00" arrival="246.50" arrivalLane="c2s_1" arrivalPos="990.00" arrivalPosLat="0.00" arrivalSpeed="13.90" duration="186.50" routeLength="1987.97" waitingTime="27.50" waitingCount="2" stopTime="0.00" timeLoss="42.81" rerouteNo="1" devices="tripinfo_bus_e2s_60 routing_bus_e2s_60" vType="Bus" speedFactor="1.00" vaporized=""/>
    <tripinfo id="car_s2e_62" depart="62.00" departLane="s2sep_1" departPos="3.60" departPosLat="0.00" departSpeed="13.90" departDelay="0.00" arrival="247.60" arrivalLane="c2e_1" arrivalPos="990.00" arrivalPosLat="0.00" arrivalSpeed="15.73" duration="185.60" routeLength="1986.69" waitingTime="50.50" waitingCount="1" stopTime="0.00" timeLoss="58.66" rerouteNo="1" devices="tripinfo_car_s2e_62 routing_car_s2e_62" vType="Car" speedFactor="1.13" vaporized=""/>
    <tripinfo id="car_e2s_68" depart="68.00" departLane="e2sep_1" departPos="3.60" departPosLat="0.00" departSpeed="13.90" departDelay="0.00" arrival="249.00" arrivalLane="c2s_1" arrivalPos="990.00" arrivalPosLat="0.00" arrivalSpeed="15.56" duration="181.00" routeLength="1996.47" waitingTime="26.25" waitingCount="1" stopTime="0.00" timeLoss="55.97" rerouteNo="1" devices="tripinfo_car_e2s_68 routing_car_e2s_68" vType="Car" speedFactor="1.15" vaporized=""/>
    <tripinfo id="car_e2s_72" depart="72.00" departLane="e2sep_1" departPos="3.60" departPosLat="0.00" departSpeed="13.90" departDelay="0.00" arrival="250.95" arrivalLane="c2s_1" arrivalPos="990.00" arrivalPosLat="0.00" arrivalSpeed="15.67" duration="178.95" routeLength="1996.47" waitingTime="23.50" waitingCount="1" stopTime="0.00" timeLoss="55.77" rerouteNo="1" devices="tripinfo_car_e2s_72 routing_car_e2s_72" vType="Car" speedFactor="1.17" vaporized=""/>
    <tripinfo id="car_s2w_102" depart="102.00" departLane="s2sep_1" departPos="3.60" departPosLat="0.00" departSpeed="13.90" departDelay="0.00" arrival="252.20" arrivalLane="c2w_1" arrivalPos="990.00" arrivalPosLat="0.00" arrivalSpeed="15.12" duration="150.20" routeLength="1996.47" waitingTime="8.35" waitingCount="1" stopTime="0.00" timeLoss="17.53" rerouteNo="1" devices="tripinfo_car_s2w_102 routing_car_s2w_102" vType="Car" speedFactor="1.09" vaporized=""/>
    <tripinfo id="car_n2e_87" depart="87.00" departLane="n2sep_1" departPos="3.60" departPosLat="0.00" departSpeed="13.90" departDelay="0.00" arrival="252.75" arrivalLane="c2e_1" arrivalPos="990.00" arrivalPosLat="0.00" arrivalSpeed="16.39" duration="165.75" routeLength="1996.47" waitingTime="30.70" waitingCount="2" stopTime="0.00" timeLoss="43.41" rerouteNo="1" devices="tripinfo_car_n2e_87 routing_car_n2e_87" vType="Car" speedFactor="1.18" vaporized=""/>
    <tripinfo id="car_e2s_75" depart="75.35" departLane="e2sep_1" departPos="3.60" departPosLat="0.00" departSpeed="13.90" departDelay="0.35" arrival="254.65" arrivalLane="c2s_1" arrivalPos="990.00" arrivalPosLat="0.00" arrivalSpeed="14.15" duration="179.30" routeLength="1996.47" waitingTime="17.35" waitingCount="1" stopTime="0.00" timeLoss="37.75" rerouteNo="1" devices="tripinfo_car_e2s_75 routing_car_e2s_75" vType="Car" speedFactor="1.02" vaporized=""/>
    <tripinfo id="car_n2s_89" depart="89.00" departLane="n2sep_1" departPos="3.60" departPosLat="0.00" departSpeed="13.90" departDelay="0.00" arrival="256.80" arrivalLane="c2s_1" arrivalPos="990.00" arrivalPosLat="0.00" arrivalSpeed="14.95" duration="167.80" routeLength="1997.01" waitingTime="21.35" waitingCount="1" stopTime="0.00" timeLoss="37.46" rerouteNo="1" devices="tripinfo_car_n2s_89 routing_car_n2s_89" vType="Car" speedFactor="1.10" vaporized=""/>
    <tripinfo id="car_s2n_63" depart="63.30" departLane="s2sep_1" departPos="3.60" departPosLat="0.00" departSpeed="13.90" departDelay="0.30" arrival="257.80" arrivalLane="c2n_1" arrivalPos="990.00" arrivalPosLat="0.00" arrivalSpeed="13.90" duration="194.50" routeLength="1997.01" waitingTime="41.80" waitingCount="1" stopTime="0.00" timeLoss="50.81" rerouteNo="1" devices="tripinfo_car_s2n_63 routing_car_s2n_63" vType="Car" speedFactor="1.00" vaporized=""/>
    <tripinfo id="car_s2n_89" depart="89.00" departLane="s2sep_1" departPos="3.60" departPosLat="0.00" departSpeed="13.90" departDelay="0.00" arrival="259.70" arrivalLane="c2n_1" arrivalPos="990.00" arrivalPosLat="0.00" arrivalSpeed="15.36" duration="170.70" routeLength="1997.01" waitingTime="27.00" waitingCount="1" stopTime="0.00" timeLoss="46.64" rerouteNo="1" devices="tripinfo_car_s2n_89 routing_car_s2n_89" vType="Car" speedFactor="1.16" vaporized=""/>
    <tripinfo id="car_s2n_122" depart="122.00" departLane="s2sep_1" departPos="3.60" departPosLat="0.00" departSpeed="13.90" departDelay="0.00" arrival="266.80" arrivalLane="c2n_1" arrivalPos="990.00" arrivalPosLat="0.00" arrivalSpeed="13.90" duration="144.80" routeLength="1997.01" waitingTime="0.00" waitingCount="0" stopTime="0.00" timeLoss="1.09" rerouteNo="1" devices="tripinfo_car_s2n_122 routing_car_s2n_122" vType="Car" speedFactor="1.00" vaporized=""/>
    <tripinfo id="car_n2e_119" depart="119.00" departLane="n2sep_1" departPos="3.60" departPosLat="0.00" departSpeed="13.90" departDelay="0.00" arrival="269.45" arrivalLane="c2e_1" arrivalPos="990.00" arrivalPosLat="0.00" arrivalSpeed="13.90" duration="150.45" routeLength="1996.47" waitingTime="0.00" waitingCount="0" stopTime="0.00" timeLoss="6.11" rerouteNo="1" devices="tripinfo_car_n2e_119 routing_car_n2e_119" vType="Car" speedFactor="1.00" vaporized=""/>
    <tripinfo id="car_n2s_128" depart="128.00" departLane="n2sep_1" departPos="3.60" departPosLat="0.00" departSpeed="13.90" departDelay="0.00" arrival="271.70" arrivalLane="c2s_1" arrivalPos="990.00" arrivalPosLat="0.00" arrivalSpeed="14.13" duration="143.70" routeLength="1997.01" waitingTime="0.00" waitingCount="0" stopTime="0.00" timeLoss="2.38" rerouteNo="1" devices="tripinfo_car_n2s_128 routing_car_n2s_128" vType="Car" speedFactor="1.02" vaporized=""/>
    <tripinfo id="car_n2e_125" depart="125.00" departLane="n2sep_1" departPos="3.60" departPosLat="0.00" departSpeed="13.90" departDelay="0.00" arrival="274.45" arrivalLane="c2e_1" arrivalPos="990.00" arrivalPosLat="0.00" arrivalSpeed="13.90" duration="149.45" routeLength="1996.47" waitingTime="0.00" waitingCount="0" stopTime="0.00" timeLoss="5.12" rerouteNo="1" devices="tripinfo_car_n2e_125 routing_car_n2e_125" vType="Car" speedFactor="1.00" vaporized=""/>
    <tripinfo id="car_s2e_135" depart="135.00" departLane="s2sep_1" departPos="3.60" departPosLat="0.00" departSpeed="13.90" departDelay="0.00" arrival="282.60" arrivalLane="c2e_1" arrivalPos="990.00" arrivalPosLat="0.00" arrivalSpeed="13.90" duration="147.60" routeLength="1986.69" waitingTime="0.00" waitingCount="0" stopTime="0.00" timeLoss="3.91" rerouteNo="1" devices="tripinfo_car_s2e_135 routing_car_s2e_135" vType="Car" speedFactor="1.00" vaporized=""/>
    <tripinfo id="car_e2w_129" depart="129.00" departLane="e2sep_1" departPos="3.60" departPosLat="0.00" departSpeed="13.90" departDelay="0.00" arrival="296.70" arrivalLane="c2w_1" arrivalPos="990.00" arrivalPosLat="0.00" arrivalSpeed="15.23" duration="167.70" routeLength="1997.01" waitingTime="27.65" waitingCount="1" stopTime="0.00" timeLoss="36.57" rerouteNo="1" devices="tripinfo_car_e2w_129 routing_car_e2w_129" vType="Car" speedFactor="1.10" vaporized=""/>
    <tripinfo id="car_e2n_113" depart="113.00" departLane="e2sep_1" departPos="3.60" departPosLat="0.00" departSpeed="13.90" departDelay="0.00" arrival="300.65" arrivalLane="c2n_1" arrivalPos="990.00" arrivalPosLat="0.00" arrivalSpeed="13.90" duration="187.65" routeLength="1986.69" waitingTime="36.95" waitingCount="1" stopTime="0.00" timeLoss="43.96" rerouteNo="1" devices="tripinfo_car_e2n_113 routing_car_e2n_113" vType="Car" speedFactor="1.00" vaporized=""/>
    <tripinfo id="car_w2s_100" depart="100.50" departLane="w2sep_1" departPos="3.60" departPosLat="0.00" departSpeed="13.90" departDelay="0.50" arrival="302.85" arrivalLane="c2s_1" arrivalPos="990.00" arrivalPosLat="0.00" arrivalSpeed="14.42" duration="202.35" routeLength="1986.69" waitingTime="49.25" waitingCount="1" stopTime="0.00" timeLoss="63.92" rerouteNo="1" devices="tripinfo_car_w2s_100 routing_car_w2s_100" vType="Car" speedFactor="1.04" vaporized=""/>
    <tripinfo id="bus_w2e_98" depart="98.85" departLane="w2sep_1" departPos="12.10" departPosLat="0.00" departSpeed="13.90" departDelay="0.85" arrival="304.20" arrivalLane="c2e_1" arrivalPos="990.00" arrivalPosLat="0.00" arrivalSpeed="13.90" duration="205.35" routeLength="1988.51" waitingTime="51.35" waitingCount="1" stopTime="0.00" timeLoss="62.30" rerouteNo="1" devices="tripinfo_bus_w2e_98 routing_bus_w2e_98" vType="Bus" speedFactor="1.00" vaporized=""/>
    <tripinfo id="car_e2w_151" depart="151.00" departLane="e2sep_1" departPos="3.60" departPosLat="0.00" departSpeed="13.90" departDelay="0.00" arrival="304.20" arrivalLane="c2w_1" arrivalPos="990.00" arrivalPosLat="0.00" arrivalSpeed="14.23" duration="153.20" routeLength="1997.01" waitingTime="2.55" waitingCount="1" stopTime="0.00" timeLoss="12.83" rerouteNo="1" devices="tripinfo_car_e2w_151 routing_car_e2w_151" vType="Car" speedFactor="1.02" vaporized=""/>
    <tripinfo id="car_e2n_168" depart="168.00" departLane="e2sep_1" departPos="3.60" departPosLat="0.00" departSpeed="13.90" departDelay="0.00" arrival="306.00" arrivalLane="c2n_1" arrivalPos="990.00" arrivalPosLat="0.00" arrivalSpeed="15.04" duration="138.00" routeLength="1986.69" waitingTime="0.00" waitingCount="0" stopTime="0.00" timeLoss="5.25" rerouteNo="1" devices="tripinfo_car_e2n_168 routing_car_e2n_168" vType="Car" speedFactor="1.08" vaporized=""/>
    <tripinfo id="car_e2w_163" depart="163.00" departLane="e2sep_1" departPos="3.60" departPosLat="0.00" departSpeed="13.90" departDelay="0.00" arrival="306.35" arrivalLane="c2w_1" arrivalPos="990.00" arrivalPosLat="0.00" arrivalSpeed="15.32" duration="143.35" routeLength="1997.01" waitingTime="0.00" waitingCount="0" stopTime="0.00" timeLoss="16.41" rerouteNo="1" devices="tripinfo_car_e2w_163 routing_car_e2w_163" vType="Car" speedFactor="1.13" vaporized=""/>
    <tripinfo id="car_w2e_128" depart="128.00" departLane="w2sep_1" departPos="3.60" departPosLat="0.00" departSpeed="13.90" departDelay="0.00" arrival="306.65" arrivalLane="c2e_1" arrivalPos="990.00" arrivalPosLat="0.00" arrivalSpeed="15.68" duration="178.65" routeLength="1997.01" waitingTime="34.25" waitingCount="1" stopTime="0.00" timeLoss="55.70" rerouteNo="1" devices="tripinfo_car_w2e_128 routing_car_w2e_128" vType="Car" speedFactor="1.17" vaporized=""/>
    <tripinfo id="car_e2s_94" depart="94.00" departLane="e2sep_1" departPos="3.60" departPosLat="0.00" departSpeed="13.90" departDelay="0.00" arrival="309.50" arrivalLane="c2s_1" arrivalPos="990.00" arrivalPosLat="0.00" arrivalSpeed="14.15" duration="215.50" routeLength="1996.47" waitingTime="53.85" waitingCount="3" stopTime="0.00" timeLoss="73.76" rerouteNo="1" devices="tripinfo_car_e2s_94 routing_car_e2s_94" vType="Car" speedFactor="1.02" vaporized=""/>
    <tripinfo id="car_e2s_102" depart="102.00" departLane="e2sep_1" departPos="3.60" departPosLat="0.00" departSpeed="13.90" departDelay="0.00" arrival="312.80" arrivalLane="c2s_1" arrivalPos="990.00" arrivalPosLat="0.00" arrivalSpeed="14.45" duration="210.80" routeLength="1996.47" waitingTime="47.20" waitingCount="2" stopTime="0.00" timeLoss="72.48" rerouteNo="1" devices="tripinfo_car_e2s_102 routing_car_e2s_102" vType="Car" speedFactor="1.04" vaporized=""/>
    <tripinfo id="car_w2n_104" depart="104.00" departLane="w2sep_1" departPos="3.60" departPosLat="0.00" departSpeed="13.90" departDelay="0.00" arrival="313.90" arrivalLane="c2n_1" arrivalPos="990.00" arrivalPosLat="0.00" arrivalSpeed="14.04" duration="209.90" routeLength="1996.47" waitingTime="52.70" waitingCount="2" stopTime="0.00" timeLoss="67.00" rerouteNo="1" devices="tripinfo_car_w2n_104 routing_car_w2n_104" vType="Car" speedFactor="1.01" vaporized=""/>
    <tripinfo id="car_w2n_130" depart="130.00" departLane="w2sep_1" departPos="3.60" departPosLat="0.00" departSpeed="13.90" departDelay="0.00" arrival="318.25" arrivalLane="c2n_1" arrivalPos="990.00" arrivalPosLat="0.00" arrivalSpeed="13.93" duration="188.25" routeLength="1996.47" waitingTime="28.50" waitingCount="2" stopTime="0.00" timeLoss="44.40" rerouteNo="1" devices="tripinfo_car_w2n_130 routing_car_w2n_130" vType="Car" speedFactor="1.00" vaporized=""/>
    <tripinfo id="car_w2n_174" depart="174.00" departLane="w2sep_1" departPos="3.60" departPosLat="0.00" departSpeed="13.90" departDelay="0.00" arrival="321.80" arrivalLane="c2n_1" arrivalPos="990.00" arrivalPosLat="0.00" arrivalSpeed="14.09" duration="147.80" routeLength="1996.47" waitingTime="0.00" waitingCount="0" stopTime="0.00" timeLoss="5.70" rerouteNo="1" devices="tripinfo_car_w2n_174 routing_car_w2n_174" vType="Car" speedFactor="1.02" vaporized=""/>
    <tripinfo id="car_w2n_175" depart="175.45" departLane="w2sep_1" departPos="3.60" departPosLat="0.00" departSpeed="13.90" departDelay="0.45" arrival="326.55" arrivalLane="c2n_1" arrivalPos="990.00" arrivalPosLat="0.00" arrivalSpeed="13.89" duration="151.10" routeLength="1996.47" waitingTime="0.00" waitingCount="0" stopTime="0.00" timeLoss="6.80" rerouteNo="1" devices="tripinfo_car_w2n_175 routing_car_w2n_175" vType="Car" speedFactor="1.00" vaporized=""/>
    <tripinfo id="car_s2e_150" depart="150.00" departLane="s2sep_1" departPos="3.60" departPosLat="0.00" departSpeed="13.90" departDelay="0.00" arrival="337.00" arrivalLane="c2e_1" arrivalPos="990.00" arrivalPosLat="0.00" arrivalSpeed="15.88" duration="187.00" routeLength="1986.69" waitingTime="53.25" waitingCount="1" stopTime="0.00" timeLoss="61.24" rerouteNo="1" devices="tripinfo_car_s2e_150 routing_car_s2e_150" vType="Car" speedFactor="1.14" vaporized=""/>
    <tripinfo id="car_e2s_192" depart="192.40" departLane="e2sep_1" departPos="3.60" departPosLat="0.00" departSpeed="13.90" departDelay="0.40" arrival="339.20" arrivalLane="c2s_1" arrivalPos="990.00" arrivalPosLat="0.00" arrivalSpeed="14.21" duration="146.80" routeLength="1996.47" waitingTime="0.00" waitingCount="0" stopTime="0.00" timeLoss="5.61" rerouteNo="1" devices="tripinfo_car_e2s_192 routing_car_e2s_192" vType="Car" speedFactor="1.02" vaporized=""/>
    <tripinfo id="car_s2n_171" depart="171.00" departLane="s2sep_1" departPos="3.60" departPosLat="0.00" departSpeed="13.90" departDelay="0.00" arrival="340.45" arrivalLane="c2n_1" arrivalPos="990.00" arrivalPosLat="0.00" arrivalSpeed="15.56" duration="169.45" routeLength="1997.01" waitingTime="31.95" waitingCount="1" stopTime="0.00" timeLoss="41.06" rerouteNo="1" devices="tripinfo_car_s2n_171 routing_car_s2n_171" vType="Car" speedFactor="1.12" vaporized=""/>
    <tripinfo id="car_n2w_141" depart="141.00" departLane="n2sep_1" departPos="3.60" departPosLat="0.00" departSpeed="13.90" departDelay="0.00" arrival="345.65" arrivalLane="c2w_1" arrivalPos="990.00" arrivalPosLat="0.00" arrivalSpeed="13.90" duration="204.65" routeLength="1986.69" waitingTime="54.40" waitingCount="1" stopTime="0.00" timeLoss="60.95" rerouteNo="1" devices="tripinfo_car_n2w_141 routing_car_n2w_141" vType="Car" speedFactor="1.00" vaporized=""/>
    <tripinfo id="car_n2w_181" depart="181.00" departLane="n2sep_1" departPos="3.60" departPosLat="0.00" departSpeed="13.90" departDelay="0.00" arrival="347.45" arrivalLane="c2w_1" arrivalPos="990.00" arrivalPosLat="0.00" arrivalSpeed="15.47" duration="166.45" routeLength="1986.69" waitingTime="24.95" waitingCount="1" stopTime="0.00" timeLoss="44.56" rerouteNo="1" devices="tripinfo_car_n2w_181 routing_car_n2w_181" vType="Car" speedFactor="1.18" vaporized=""/>
    <tripinfo id="car_s2n_215" depart="215.00" departLane="s2sep_1" departPos="3.60" departPosLat="0.00" departSpeed="13.90" departDelay="0.00" arrival="349.10" arrivalLane="c2n_1" arrivalPos="990.00" arrivalPosLat="0.00" arrivalSpeed="15.32" duration="134.10" routeLength="1997.01" waitingTime="0.00" waitingCount="0" stopTime="0.00" timeLoss="3.76" rerouteNo="1" devices="tripinfo_car_s2n_215 routing_car_s2n_215" vType="Car" speedFactor="1.10" vaporized=""/>
    <tripinfo id="bus_s2e_202" depart="202.00" departLane="s2sep_1" departPos="12.10" departPosLat="0.00" departSpeed="13.90" departDelay="0.00" arrival="351.95" arrivalLane="c2e_1" arrivalPos="990.00" arrivalPosLat="0.00" arrivalSpeed="13.90" duration="149.95" routeLength="1978.19" waitingTime="0.00" waitingCount="0" stopTime="0.00" timeLoss="6.88" rerouteNo="1" devices="tripinfo_bus_s2e_202 routing_bus_s2e_202" vType="Bus" speedFactor="1.00" vaporized=""/>
    <tripinfo id="bus_s2w_152" depart="152.00" departLane="s2sep_1" departPos="12.10" departPosLat="0.00" departSpeed="13.90" departDelay="0.00" arrival="353.45" arrivalLane="c2w_1" arrivalPos="990.00" arrivalPosLat="0.00" arrivalSpeed="13.88" duration="201.45" routeLength="1987.97" waitingTime="43.20" waitingCount="1" stopTime="0.00" timeLoss="57.75" rerouteNo="1" devices="tripinfo_bus_s2w_152 routing_bus_s2w_152" vType="Bus" speedFactor="1.00" vaporized=""/>
    <tripinfo id="car_s2e_207" depart="207.00" departLane="s2sep_1" departPos="3.60" departPosLat="0.00" departSpeed="13.90" departDelay="0.00" arrival="354.30" arrivalLane="c2e_1" arrivalPos="990.00" arrivalPosLat="0.00" arrivalSpeed="15.73" duration="147.30" routeLength="1986.69" waitingTime="0.00" waitingCount="0" stopTime="0.00" timeLoss="25.52" rerouteNo="1" devices="tripinfo_car_s2e_207 routing_car_s2e_207" vType="Car" speedFactor="1.18" vaporized=""/>
    <tripinfo id="car_s2w_184" depart="184.00" departLane="s2sep_1" departPos="3.60" departPosLat="0.00" departSpeed="13.90" departDelay="0.00" arrival="355.90" arrivalLane="c2w_1" arrivalPos="990.00" arrivalPosLat="0.00" arrivalSpeed="15.52" duration="171.90" routeLength="1996.47" waitingTime="21.35" waitingCount="1" stopTime="0.00" timeLoss="46.89" rerouteNo="1" devices="tripinfo_car_s2w_184 routing_car_s2w_184" vType="Car" speedFactor="1.15" vaporized=""/>
    <tripinfo id="car_n2s_216" depart="216.00" departLane="n2sep_1" departPos="3.60" departPosLat="0.00" departSpeed="13.90" departDelay="0.00" arrival="358.95" arrivalLane="c2s_1" arrivalPos="990.00" arrivalPosLat="0.00" arrivalSpeed="14.00" duration="142.95" routeLength="1997.01" waitingTime="0.00" waitingCount="0" stopTime="0.00" timeLoss="0.29" rerouteNo="1" devices="tripinfo_car_n2s_216 routing_car_n2s_216" vType="Car" speedFactor="1.01" vaporized=""/>
    <tripinfo id="car_n2e_186" depart="186.00" departLane="n2sep_1" departPos="3.60" departPosLat="0.00" departSpeed="13.90" departDelay="0.00" arrival="359.35" arrivalLane="c2e_1" arrivalPos="990.00" arrivalPosLat="0.00" arrivalSpeed="13.97" duration="173.35" routeLength="1996.47" waitingTime="17.55" waitingCount="2" stopTime="0.00" timeLoss="29.79" rerouteNo="1" devices="tripinfo_car_n2e_186 routing_car_n2e_186" vType="Car" speedFactor="1.01" vaporized=""/>
    <tripinfo id="car_s2e_220" depart="220.00" departLane="s2sep_1" departPos="3.60" departPosLat="0.00" departSpeed="13.90" departDelay="0.00" arrival="363.90" arrivalLane="c2e_1" arrivalPos="990.00" arrivalPosLat="0.00" arrivalSpeed="14.37" duration="143.90" routeLength="1986.69" waitingTime="0.00" waitingCount="0" stopTime="0.00" timeLoss="5.01" rerouteNo="1" devices="tripinfo_car_s2e_220 routing_car_s2e_220" vType="Car" speedFactor="1.03" vaporized=""/>
    <tripinfo id="car_n2e_190" depart="190.00" departLane="n2sep_1" departPos="3.60" departPosLat="0.00" departSpeed="13.90" departDelay="0.00" arrival="365.85" arrivalLane="c2e_1" arrivalPos="990.00" arrivalPosLat="0.00" arrivalSpeed="15.64" duration="175.85" routeLength="1996.47" waitingTime="23.25" waitingCount="3" stopTime="0.00" timeLoss="52.68" rerouteNo="1" devices="tripinfo_car_n2e_190 routing_car_n2e_190" vType="Car" speedFactor="1.17" vaporized=""/>
    <tripinfo id="car_s2n_224" depart="224.00" departLane="s2sep_1" departPos="3.60" departPosLat="0.00" departSpeed="13.90" departDelay="0.00" arrival="366.80" arrivalLane="c2n_1" arrivalPos="990.00" arrivalPosLat="0.00" arrivalSpeed="14.13" duration="142.80" routeLength="1997.01" waitingTime="0.00" waitingCount="0" stopTime="0.00" timeLoss="1.49" rerouteNo="1" devices="tripinfo_car_s2n_224 routing_car_s2n_224" vType="Car" speedFactor="1.02" vaporized=""/>
    <tripinfo id="car_n2e_218" depart="218.00" departLane="n2sep_1" departPos="3.60" departPosLat="0.00" departSpeed="13.90" departDelay="0.00" arrival="369.85" arrivalLane="c2e_1" arrivalPos="990.00" arrivalPosLat="0.00" arrivalSpeed="15.09" duration="151.85" routeLength="1996.47" waitingTime="3.80" waitingCount="1" stopTime="0.00" timeLoss="19.07" rerouteNo="1" devices="tripinfo_car_n2e_218 routing_car_n2e_218" vType="Car" speedFactor="1.09" vaporized=""/>
    <tripinfo id="car_n2s_228" depart="228.00" departLane="n2sep_1" departPos="3.60" departPosLat="0.00" departSpeed="13.90" departDelay="0.00" arrival="372.05" arrivalLane="c2s_1" arrivalPos="990.00" arrivalPosLat="0.00" arrivalSpeed="13.90" duration="144.05" routeLength="1997.01" waitingTime="0.00" waitingCount="0" stopTime="0.00" timeLoss="0.35" rerouteNo="1" devices="tripinfo_car_n2s_228 routing_car_n2s_228" vType="Car" speedFactor="1.00" vaporized=""/>
    <tripinfo id="car_s2n_233" depart="233.00" departLane="s2sep_1" departPos="3.60" departPosLat="0.00" departSpeed="13.90" departDelay="0.00" arrival="375.45" arrivalLane="c2n_1" arrivalPos="990.00" arrivalPosLat="0.00" arrivalSpeed="14.21" duration="142.45" routeLength="1997.01" waitingTime="0.00" waitingCount="0" stopTime="0.00" timeLoss="1.83" rerouteNo="1" devices="tripinfo_car_s2n_233 routing_car_s2n_233" vType="Car" speedFactor="1.02" vaporized=""/>
    <tripinfo id="bus_s2w_225" depart="226.10" departLane="s2sep_1" departPos="12.10" departPosLat="0.00" departSpeed="13.90" departDelay="1.10" arrival="380.15" arrivalLane="c2w_1" arrivalPos="990.00" arrivalPosLat="0.00" arrivalSpeed="13.90" duration="154.05" routeLength="1987.97" waitingTime="0.00" waitingCount="0" stopTime="0.00" timeLoss="10.33" rerouteNo="1" devices="tripinfo_bus_s2w_225 routing_bus_s2w_225" vType="Bus" speedFactor="1.00" vaporized=""/>
    <tripinfo id="car_n2e_233" depart="233.00" departLane="n2sep_1" departPos="3.60" departPosLat="0.00" departSpeed="13.90" departDelay="0.00" arrival="382.30" arrivalLane="c2e_1" arrivalPos="990.00" arrivalPosLat="0.00" arrivalSpeed="14.00" duration="149.30" routeLength="1996.47" waitingTime="0.00" waitingCount="0" stopTime="0.00" timeLoss="6.01" rerouteNo="1" devices="tripinfo_car_n2e_233 routing_car_n2e_233" vType="Car" speedFactor="1.01" vaporized=""/>
    <tripinfo id="car_e2n_191" depart="191.00" departLane="e2sep_1" departPos="3.60" departPosLat="0.00" departSpeed="13.90" departDelay="0.00" arrival="388.05" arrivalLane="c2n_1" arrivalPos="990.00" arrivalPosLat="0.00" arrivalSpeed="14.46" duration="197.05" routeLength="1986.69" waitingTime="51.90" waitingCount="1" stopTime="0.00" timeLoss="58.91" rerouteNo="1" devices="tripinfo_car_e2n_191 routing_car_e2n_191" vType="Car" speedFactor="1.04" vaporized=""/>
    <tripinfo id="car_w2e_202" depart="202.45" departLane="w2sep_1" departPos="3.60" departPosLat="0.00" departSpeed="13.90" departDelay="0.45" arrival="389.75" arrivalLane="c2e_1" arrivalPos="990.00" arrivalPosLat="0.00" arrivalSpeed="14.17" duration="187.30" routeLength="1997.01" waitingTime="35.65" waitingCount="1" stopTime="0.00" timeLoss="46.39" rerouteNo="1" devices="tripinfo_car_w2e_202 routing_car_w2e_202" vType="Car" speedFactor="1.02" vaporized=""/>
    <tripinfo id="car_w2s_213" depart="213.00" departLane="w2sep_1" departPos="3.60" departPosLat="0.00" departSpeed="13.90" departDelay="0.00" arrival="390.80" arrivalLane="c2s_1" arrivalPos="990.00" arrivalPosLat="0.00" arrivalSpeed="14.35" duration="177.80" routeLength="1986.69" waitingTime="29.35" waitingCount="1" stopTime="0.00" timeLoss="38.67" rerouteNo="1" devices="tripinfo_car_w2s_213 routing_car_w2s_213" vType="Car" speedFactor="1.03" vaporized=""/>
    <tripinfo id="car_e2n_195" depart="195.00" departLane="e2sep_1" departPos="3.60" departPosLat="0.00" departSpeed="13.90" departDelay="0.00" arrival="393.20" arrivalLane="c2n_1" arrivalPos="990.00" arrivalPosLat="0.00" arrivalSpeed="14.22" duration="198.20" routeLength="1986.69" waitingTime="44.35" waitingCount="1" stopTime="0.00" timeLoss="57.75" rerouteNo="1" devices="tripinfo_car_e2n_195 routing_car_e2n_195" vType="Car" speedFactor="1.02" vaporized=""/>
    <tripinfo id="car_e2w_225" depart="225.00" departLane="e2sep_1" departPos="3.60" departPosLat="0.00" departSpeed="13.90" departDelay="0.00" arrival="395.50" arrivalLane="c2w_1" arrivalPos="990.00" arrivalPosLat="0.00" arrivalSpeed="14.32" duration="170.50" routeLength="1997.01" waitingTime="20.20" waitingCount="1" stopTime="0.00" timeLoss="31.03" rerouteNo="1" devices="tripinfo_car_e2w_225 routing_car_e2w_225" vType="Car" speedFactor="1.03" vaporized=""/>
    <tripinfo id="car_e2n_206" depart="206.00" departLane="e2sep_1" departPos="3.60" departPosLat="0.00" departSpeed="13.90" departDelay="0.00" arrival="397.85" arrivalLane="c2n_1" arrivalPos="990.00" arrivalPosLat="0.00" arrivalSpeed="13.89" duration="191.85" routeLength="1986.69" waitingTime="35.90" waitingCount="1" stopTime="0.00" timeLoss="48.19" rerouteNo="1" devices="tripinfo_car_e2n_206 routing_car_e2n_206" vType="Car" speedFactor="1.00" vaporized=""/>
    <tripinfo id="car_e2n_225" depart="226.40" departLane="e2sep_1" departPos="3.60" departPosLat="0.00" departSpeed="13.90" departDelay="1.40" arrival="399.75" arrivalLane="c2n_1" arrivalPos="990.00" arrivalPosLat="0.00" arrivalSpeed="15.23" duration="173.35" routeLength="1986.69" waitingTime="19.55" waitingCount="1" stopTime="0.00" timeLoss="48.15" rerouteNo="1" devices="tripinfo_car_e2n_225 routing_car_e2n_225" vType="Car" speedFactor="1.15" vaporized=""/>
    <tripinfo id="car_e2w_252" depart="252.00" departLane="e2sep_1" departPos="3.60" departPosLat="0.00" departSpeed="13.90" departDelay="0.00" arrival="400.95" arrivalLane="c2w_1" arrivalPos="990.00" arrivalPosLat="0.00" arrivalSpeed="14.69" duration="148.95" routeLength="1997.01" waitingTime="0.00" waitingCount="0" stopTime="0.00" timeLoss="13.01" rerouteNo="1" devices="tripinfo_car_e2w_252 routing_car_e2w_252" vType="Car" speedFactor="1.06" vaporized=""/>
    <tripinfo id="car_e2n_247" depart="247.00" departLane="e2sep_1" departPos="3.60" departPosLat="0.00" departSpeed="13.90" departDelay="0.00" arrival="402.75" arrivalLane="c2n_1" arrivalPos="990.00" arrivalPosLat="0.00" arrivalSpeed="14.36" duration="155.75" routeLength="1986.69" waitingTime="1.10" waitingCount="1" stopTime="0.00" timeLoss="17.32" rerouteNo="1" devices="tripinfo_car_e2n_247 routing_car_e2n_247" vType="Car" speedFactor="1.04" vaporized=""/>
    <tripinfo id="car_w2s_257" depart="257.00" departLane="w2sep_1" departPos="3.60" departPosLat="0.00" departSpeed="13.90" departDelay="0.00" arrival="403.15" arrivalLane="c2s_1" arrivalPos="990.00" arrivalPosLat="0.00" arrivalSpeed="14.04" duration="146.15" routeLength="1986.69" waitingTime="0.00" waitingCount="0" stopTime="0.00" timeLoss="3.90" rerouteNo="1" devices="tripinfo_car_w2s_257 routing_car_w2s_257" vType="Car" speedFactor="1.01" vaporized=""/>
    <tripinfo id="car_w2s_259" depart="259.00" departLane="w2sep_1" departPos="3.60" departPosLat="0.00" departSpeed="13.90" departDelay="0.00" arrival="405.60" arrivalLane="c2s_1" arrivalPos="990.00" arrivalPosLat="0.00" arrivalSpeed="14.91" duration="146.60" routeLength="1986.69" waitingTime="0.00" waitingCount="0" stopTime="0.00" timeLoss="14.57" rerouteNo="1" devices="tripinfo_car_w2s_259 routing_car_w2s_259" vType="Car" speedFactor="1.09" vaporized=""/>
    <tripinfo id="car_w2s_261" depart="261.00" departLane="w2sep_1" departPos="3.60" departPosLat="0.00" departSpeed="13.90" departDelay="0.00" arrival="407.80" arrivalLane="c2s_1" arrivalPos="990.00" arrivalPosLat="0.00" arrivalSpeed="15.24" duration="146.80" routeLength="1986.69" waitingTime="0.00" waitingCount="0" stopTime="0.00" timeLoss="18.69" rerouteNo="1" devices="tripinfo_car_w2s_261 routing_car_w2s_261" vType="Car" speedFactor="1.12" vaporized=""/>
    <tripinfo id="car_w2n_201" depart="201.00" departLane="w2sep_1" departPos="3.60" departPosLat="0.00" departSpeed="13.90" departDelay="0.00" arrival="408.00" arrivalLane="c2n_1" arrivalPos="990.00" arrivalPosLat="0.00" arrivalSpeed="13.90" duration="207.00" routeLength="1996.47" waitingTime="51.10" waitingCount="2" stopTime="0.00" timeLoss="62.65" rerouteNo="1" devices="tripinfo_car_w2n_201 routing_car_w2n_201" vType="Car" speedFactor="1.00" vaporized=""/>
    <tripinfo id="car_w2n_205" depart="205.00" departLane="w2sep_1" departPos="3.60" departPosLat="0.00" departSpeed="13.90" departDelay="0.00" arrival="410.60" arrivalLane="c2n_1" arrivalPos="990.00" arrivalPosLat="0.00" arrivalSpeed="14.52" duration="205.60" routeLength="1996.47" waitingTime="45.05" waitingCount="2" stopTime="0.00" timeLoss="68.86" rerouteNo="1" devices="tripinfo_car_w2n_205 routing_car_w2n_205" vType="Car" speedFactor="1.06" vaporized=""/>
    <tripinfo id="car_w2s_268" depart="268.00" departLane="w2sep_1" departPos="3.60" departPosLat="0.00" departSpeed="13.90" departDelay="0.00" arrival="410.80" arrivalLane="c2s_1" arrivalPos="990.00" arrivalPosLat="0.00" arrivalSpeed="14.73" duration="142.80" routeLength="1986.69" waitingTime="0.00" waitingCount="0" stopTime="0.00" timeLoss="7.89" rerouteNo="1" devices="tripinfo_car_w2s_268 routing_car_w2s_268" vType="Car" speedFactor="1.07" vaporized=""/>
    <tripinfo id="car_w2n_223" depart="223.00" departLane="w2sep_1" departPos="3.60" departPosLat="0.00" departSpeed="13.90" departDelay="0.00" arrival="414.45" arrivalLane="c2n_1" arrivalPos="990.00" arrivalPosLat="0.00" arrivalSpeed="13.88" duration="191.45" routeLength="1996.47" waitingTime="27.45" waitingCount="2" stopTime="0.00" timeLoss="47.13" rerouteNo="1" devices="tripinfo_car_w2n_223 routing_car_w2n_223" vType="Car" speedFactor="1.00" vaporized=""/>
    <tripinfo id="amb_w2e_300" depart="300.00" departLane="w2sep_1" departPos="6.60" departPosLat="0.00" departSpeed="13.90" departDelay="0.00" arrival="414.95" arrivalLane="c2e_1" arrivalPos="990.00" arrivalPosLat="-0.95" arrivalSpeed="20.85" duration="114.95" routeLength="1994.01" waitingTime="0.00" waitingCount="0" stopTime="0.00" timeLoss="19.27" rerouteNo="1" devices="tripinfo_amb_w2e_300 routing_amb_w2e_300 bluelight_amb_w2e_300 fcd_amb_w2e_300" vType="Ambulance" speedFactor="1.50" vaporized="">
        <example_device customValue1="0.00" customValue2="-1.00"/>
    </tripinfo>
    <tripinfo id="car_w2n_230" depart="230.00" departLane="w2sep_1" departPos="3.60" departPosLat="0.00" departSpeed="13.90" departDelay="0.00" arrival="417.80" arrivalLane="c2n_1" arrivalPos="990.00" arrivalPosLat="0.00" arrivalSpeed="13.88" duration="187.80" routeLength="1996.47" waitingTime="20.95" waitingCount="2" stopTime="0.00" timeLoss="43.70" rerouteNo="1" devices="tripinfo_car_w2n_230 routing_car_w2n_230" vType="Car" speedFactor="1.00" vaporized=""/>
    <tripinfo id="car_w2n_274" depart="274.00" departLane="w2sep_1" departPos="3.60" departPosLat="0.00" departSpeed="13.90" departDelay="0.00" arrival="422.90" arrivalLane="c2n_1" arrivalPos="990.00" arrivalPosLat="0.00" arrivalSpeed="13.90" duration="148.90" routeLength="1996.47" waitingTime="0.00" waitingCount="0" stopTime="0.00" timeLoss="4.55" rerouteNo="1" devices="tripinfo_car_w2n_274 routing_car_w2n_274" vType="Car" speedFactor="1.00" vaporized=""/>
    <tripinfo id="car_w2s_274" depart="275.45" departLane="w2sep_1" departPos="3.60" departPosLat="0.00" departSpeed="13.90" departDelay="1.45" arrival="425.55" arrivalLane="c2s_1" arrivalPos="990.00" arrivalPosLat="0.00" arrivalSpeed="13.90" duration="150.10" routeLength="1986.69" waitingTime="0.00" waitingCount="0" stopTime="0.00" timeLoss="6.42" rerouteNo="1" devices="tripinfo_car_w2s_274 routing_car_w2s_274" vType="Car" speedFactor="1.00" vaporized=""/>
    <tripinfo id="car_w2n_277" depart="277.30" departLane="w2sep_1" departPos="3.60" departPosLat="0.00" departSpeed="13.90" departDelay="0.30" arrival="428.60" arrivalLane="c2n_1" arrivalPos="990.00" arrivalPosLat="0.00" arrivalSpeed="14.09" duration="151.30" routeLength="1996.47" waitingTime="0.00" waitingCount="0" stopTime="0.00" timeLoss="8.97" rerouteNo="1" devices="tripinfo_car_w2n_277 routing_car_w2n_277" vType="Car" speedFactor="1.01" vaporized=""/>
    <tripinfo id="car_w2e_286" depart="286.00" departLane="w2sep_1" departPos="3.60" departPosLat="0.00" departSpeed="13.90" departDelay="0.00" arrival="429.50" arrivalLane="c2e_1" arrivalPos="990.00" arrivalPosLat="1.10" arrivalSpeed="15.27" duration="143.50" routeLength="1997.01" waitingTime="0.00" waitingCount="0" stopTime="0.00" timeLoss="12.71" rerouteNo="1" devices="tripinfo_car_w2e_286 routing_car_w2e_286" vType="Car@car_w2e_286" speedFactor="1.10" vaporized=""/>
    <tripinfo id="car_w2n_279" depart="279.15" departLane="w2sep_1" departPos="3.60" departPosLat="0.00" departSpeed="13.90" departDelay="0.15" arrival="432.05" arrivalLane="c2n_1" arrivalPos="990.00" arrivalPosLat="0.00" arrivalSpeed="14.34" duration="152.90" routeLength="1996.47" waitingTime="0.00" waitingCount="0" stopTime="0.00" timeLoss="13.38" rerouteNo="1" devices="tripinfo_car_w2n_279 routing_car_w2n_279" vType="Car" speedFactor="1.03" vaporized=""/>
    <tripinfo id="car_w2s_283" depart="283.00" departLane="w2sep_1" departPos="3.60" departPosLat="0.00" departSpeed="13.90" departDelay="0.00" arrival="434.50" arrivalLane="c2s_1" arrivalPos="990.00" arrivalPosLat="0.00" arrivalSpeed="13.90" duration="151.50" routeLength="1986.69" waitingTime="0.00" waitingCount="0" stopTime="0.00" timeLoss="7.81" rerouteNo="1" devices="tripinfo_car_w2s_283 routing_car_w2s_283" vType="Car" speedFactor="1.00" vaporized=""/>
    <tripinfo id="car_e2w_289" depart="289.00" departLane="e2sep_1" departPos="3.60" departPosLat="0.00" departSpeed="13.90" departDelay="0.00" arrival="439.70" arrivalLane="c2w_1" arrivalPos="990.00" arrivalPosLat="0.00" arrivalSpeed="15.23" duration="150.70" routeLength="1997.01" waitingTime="10.50" waitingCount="1" stopTime="0.00" timeLoss="19.59" rerouteNo="1" devices="tripinfo_car_e2w_289 routing_car_e2w_289" vType="Car" speedFactor="1.10" vaporized=""/>
    <tripinfo id="bus_w2n_290" depart="290.00" departLane="w2sep_1" departPos="12.10" departPosLat="0.00" departSpeed="13.90" departDelay="0.00" arrival="441.90" arrivalLane="c2n_1" arrivalPos="990.00" arrivalPosLat="0.00" arrivalSpeed="13.90" duration="151.90" routeLength="1987.97" waitingTime="0.00" waitingCount="0" stopTime="0.00" timeLoss="8.17" rerouteNo="1" devices="tripinfo_bus_w2n_290 routing_bus_w2n_290" vType="Bus" speedFactor="1.00" vaporized=""/>
    <tripinfo id="car_w2s_296" depart="296.00" departLane="w2sep_1" departPos="3.60" departPosLat="0.00" departSpeed="13.90" departDelay="0.00" arrival="443.95" arrivalLane="c2s_1" arrivalPos="990.00" arrivalPosLat="0.00" arrivalSpeed="13.96" duration="147.95" routeLength="1986.69" waitingTime="0.00" waitingCount="0" stopTime="0.00" timeLoss="4.90" rerouteNo="1" devices="tripinfo_car_w2s_296 routing_car_w2s_296" vType="Car" speedFactor="1.00" vaporized=""/>
    <tripinfo id="car_e2n_284" depart="284.00" departLane="e2sep_1" departPos="3.60" departPosLat="0.00" departSpeed="13.90" departDelay="0.00" arrival="444.30" arrivalLane="c2n_1" arrivalPos="990.00" arrivalPosLat="0.00" arrivalSpeed="15.65" duration="160.30" routeLength="1986.69" waitingTime="18.95" waitingCount="1" stopTime="0.00" timeLoss="37.38" rerouteNo="1" devices="tripinfo_car_e2n_284 routing_car_e2n_284" vType="Car" speedFactor="1.17" vaporized=""/>
    <tripinfo id="car_s2n_287" depart="287.00" departLane="s2sep_1" departPos="3.60" departPosLat="0.00" departSpeed="13.90" departDelay="0.00" arrival="456.65" arrivalLane="c2n_1" arrivalPos="990.00" arrivalPosLat="0.00" arrivalSpeed="15.24" duration="169.65" routeLength="1997.01" waitingTime="29.40" waitingCount="1" stopTime="0.00" timeLoss="38.57" rerouteNo="1" devices="tripinfo_car_s2n_287 routing_car_s2n_287" vType="Car" speedFactor="1.10" vaporized=""/>
    <tripinfo id="car_s2e_247" depart="247.00" departLane="s2sep_1" departPos="3.60" departPosLat="0.00" departSpeed="13.90" departDelay="0.00" arrival="457.60" arrivalLane="c2e_1" arrivalPos="990.00" arrivalPosLat="0.00" arrivalSpeed="14.50" duration="210.60" routeLength="1986.69" waitingTime="65.60" waitingCount="1" stopTime="0.00" timeLoss="72.89" rerouteNo="1" devices="tripinfo_car_s2e_247 routing_car_s2e_247" vType="Car" speedFactor="1.04" vaporized=""/>
    <tripinfo id="car_n2w_231" depart="231.00" departLane="n2sep_1" departPos="3.60" departPosLat="0.00" departSpeed="13.90" departDelay="0.00" arrival="457.65" arrivalLane="c2w_1" arrivalPos="990.00" arrivalPosLat="0.00" arrivalSpeed="14.49" duration="226.65" routeLength="1986.69" waitingTime="79.15" waitingCount="1" stopTime="0.00" timeLoss="88.89" rerouteNo="1" devices="tripinfo_car_n2w_231 routing_car_n2w_231" vType="Car" speedFactor="1.04" vaporized=""/>
    <tripinfo id="car_s2n_293" depart="293.00" departLane="s2sep_1" departPos="3.60" departPosLat="0.00" departSpeed="13.90" departDelay="0.00" arrival="459.10" arrivalLane="c2n_1" arrivalPos="990.00" arrivalPosLat="0.00" arrivalSpeed="16.10" duration="166.10" routeLength="1997.01" waitingTime="27.90" waitingCount="1" stopTime="0.00" timeLoss="44.01" rerouteNo="1" devices="tripinfo_car_s2n_293 routing_car_s2n_293" vType="Car" speedFactor="1.18" vaporized=""/>
    <tripinfo id="car_s2e_331" depart="331.00" departLane="s2sep_1" departPos="3.60" departPosLat="0.00" departSpeed="13.90" departDelay="0.00" arrival="460.00" arrivalLane="c2e_1" arrivalPos="990.00" arrivalPosLat="0.00" arrivalSpeed="16.68" duration="129.00" routeLength="1986.69" waitingTime="0.00" waitingCount="0" stopTime="0.00" timeLoss="11.82" rerouteNo="1" devices="tripinfo_car_s2e_331 routing_car_s2e_331" vType="Car" speedFactor="1.23" vaporized=""/>
    <tripinfo id="car_n2w_281" depart="281.00" departLane="n2sep_1" departPos="3.60" departPosLat="0.00" departSpeed="13.90" departDelay="0.00" arrival="462.10" arrivalLane="c2w_1" arrivalPos="990.00" arrivalPosLat="0.00" arrivalSpeed="14.79" duration="181.10" routeLength="1986.69" waitingTime="34.70" waitingCount="1" stopTime="0.00" timeLoss="46.20" rerouteNo="1" devices="tripinfo_car_n2w_281 routing_car_n2w_281" vType="Car" speedFactor="1.06" vaporized=""/>
    <tripinfo id="car_n2s_272" depart="272.00" departLane="n2sep_1" departPos="3.60" departPosLat="0.00" departSpeed="13.90" departDelay="0.00" arrival="462.70" arrivalLane="c2s_1" arrivalPos="990.00" arrivalPosLat="0.00" arrivalSpeed="13.90" duration="190.70" routeLength="1997.01" waitingTime="38.70" waitingCount="1" stopTime="0.00" timeLoss="47.00" rerouteNo="1" devices="tripinfo_car_n2s_272 routing_car_n2s_272" vType="Car" speedFactor="1.00" vaporized=""/>
    <tripinfo id="car_s2n_299" depart="299.00" departLane="s2sep_1" departPos="3.60" departPosLat="0.00" departSpeed="13.90" departDelay="0.00" arrival="464.00" arrivalLane="c2n_1" arrivalPos="990.00" arrivalPosLat="0.00" arrivalSpeed="14.88" duration="165.00" routeLength="1997.01" waitingTime="18.35" waitingCount="1" stopTime="0.00" timeLoss="30.82" rerouteNo="1" devices="tripinfo_car_s2n_299 routing_car_s2n_299" vType="Car" speedFactor="1.07" vaporized=""/>
    <tripinfo id="car_n2s_285" depart="285.00" departLane="n2sep_1" departPos="3.60" departPosLat="0.00" departSpeed="13.90" departDelay="0.00" arrival="467.15" arrivalLane="c2s_1" arrivalPos="990.00" arrivalPosLat="0.00" arrivalSpeed="14.12" duration="182.15" routeLength="1997.01" waitingTime="28.80" waitingCount="1" stopTime="0.00" timeLoss="40.85" rerouteNo="1" devices="tripinfo_car_n2s_285 routing_car_n2s_285" vType="Car" speedFactor="1.02" vaporized=""/>
    <tripinfo id="car_s2n_311" depart="311.00" departLane="s2sep_1" departPos="3.60" departPosLat="0.00" departSpeed="13.90" departDelay="0.00" arrival="467.80" arrivalLane="c2n_1" arrivalPos="990.00" arrivalPosLat="0.00" arrivalSpeed="14.72" duration="156.80" routeLength="1997.01" waitingTime="7.10" waitingCount="1" stopTime="0.00" timeLoss="21.37" rerouteNo="1" devices="tripinfo_car_s2n_311 routing_car_s2n_311" vType="Car" speedFactor="1.06" vaporized=""/>
    <tripinfo id="car_n2s_296" depart="296.00" departLane="n2sep_1" departPos="3.60" departPosLat="0.00" departSpeed="13.90" departDelay="0.00" arrival="471.35" arrivalLane="c2s_1" arrivalPos="990.00" arrivalPosLat="0.00" arrivalSpeed="13.93" duration="175.35" routeLength="1997.01" waitingTime="18.35" waitingCount="1" stopTime="0.00" timeLoss="32.10" rerouteNo="1" devices="tripinfo_car_n2s_296 routing_car_n2s_296" vType="Car" speedFactor="1.00" vaporized=""/>
    <tripinfo id="car_n2e_241" depart="241.00" departLane="n2sep_1" departPos="3.60" departPosLat="0.00" departSpeed="13.90" departDelay="0.00" arrival="472.60" arrivalLane="c2e_1" arrivalPos="990.00" arrivalPosLat="0.00" arrivalSpeed="14.13" duration="231.60" routeLength="1996.47" waitingTime="77.45" waitingCount="2" stopTime="0.00" timeLoss="89.66" rerouteNo="1" devices="tripinfo_car_n2e_241 routing_car_n2e_241" vType="Car" speedFactor="1.02" vaporized=""/>
    <tripinfo id="car_n2s_302" depart="302.00" departLane="n2sep_1" departPos="3.60" departPosLat="0.00" departSpeed="13.90" departDelay="0.00" arrival="474.85" arrivalLane="c2s_1" arrivalPos="990.00" arrivalPosLat="0.00" arrivalSpeed="13.87" duration="172.85" routeLength="1997.01" waitingTime="13.40" waitingCount="1" stopTime="0.00" timeLoss="29.18" rerouteNo="1" devices="tripinfo_car_n2s_302 routing_car_n2s_302" vType="Car" speedFactor="1.00" vaporized=""/>
    <tripinfo id="car_n2e_242" depart="242.45" departLane="n2sep_1" departPos="3.60" departPosLat="0.00" departSpeed="13.90" departDelay="0.45" arrival="475.10" arrivalLane="c2e_1" arrivalPos="990.00" arrivalPosLat="0.00" arrivalSpeed="14.97" duration="232.65" routeLength="1996.47" waitingTime="75.00" waitingCount="2" stopTime="0.00" timeLoss="100.48" rerouteNo="1" devices="tripinfo_car_n2e_242 routing_car_n2e_242" vType="Car" speedFactor="1.09" vaporized=""/>
</tripinfos>
