<?xml version="1.0" encoding="UTF-8"?>

<!-- generated on Sat Apr 24 18:05:37 2021 by Eclipse SUMO Version 1.4.0
<configuration xmlns:xsi="http://www.w3.org/2001/XMLSchema-instance" xsi:noNamespaceSchemaLocation="http://sumo.dlr.de/xsd/sumoConfiguration.xsd">

    <input>
        <net-file value="sumofiles/junction.net.xml"/>
        <route-files value="sumofiles/junction_preemption_108.rou.xml"/>
        <additional-files value="sumofiles/junction.det.xml"/>
    </input>

    <output>
        <tripinfo-output value="sumofiles/output/tripinfo_preemption_108.xml"/>
    </output>

    <time>
        <begin value="0"/>
        <end value="10000"/>
        <step-length value="0.05"/>
    </time>

    <processing>
        <lateral-resolution value="0.1"/>
    </processing>

    <report>
        <no-warnings value="true"/>
        <error-log value="sumofiles/output/errorlog_preemption_108.log"/>
        <no-step-log value="true"/>
    </report>

    <traci_server>
        <remote-port value="43553"/>
    </traci_server>

    <gui_only>
        <gui-settings-file value="sumofiles/junction-gui.settings.xml"/>
        <tracker-interval value="0.05"/>
    </gui_only>

</configuration>
-->

<tripinfos xmlns:xsi="http://www.w3.org/2001/XMLSchema-instance" xsi:noNamespaceSchemaLocation="http://sumo.dlr.de/xsd/tripinfo_file.xsd">
    <tripinfo id="car_w2n_2" depart="2.00" departLane="w2sep_1" departPos="3.60" departPosLat="0.00" departSpeed="13.90" departDelay="0.00" arrival="141.70" arrivalLane="c2n_1" arrivalPos="990.00" arrivalPosLat="0.00" arrivalSpeed="14.73" duration="139.70" routeLength="1996.47" waitingTime="0.00" waitingCount="0" stopTime="0.00" timeLoss="3.53" rerouteNo="1" devices="tripinfo_car_w2n_2 routing_car_w2n_2" vType="Car" speedFactor="1.06" vaporized=""/>
    <tripinfo id="car_w2n_7" depart="7.00" departLane="w2sep_1" departPos="3.60" departPosLat="0.00" departSpeed="13.90" departDelay="0.00" arrival="153.70" arrivalLane="c2n_1" arrivalPos="990.00" arrivalPosLat="0.00" arrivalSpeed="14.04" duration="146.70" routeLength="1996.47" waitingTime="0.00" waitingCount="0" stopTime="0.00" timeLoss="3.86" rerouteNo="1" devices="tripinfo_car_w2n_7 routing_car_w2n_7" vType="Car" speedFactor="1.01" vaporized=""/>
    <tripinfo id="car_w2n_10" depart="10.00" departLane="w2sep_1" departPos="3.60" departPosLat="0.00" departSpeed="13.90" departDelay="0.00" arrival="156.25" arrivalLane="c2n_1" arrivalPos="990.00" arrivalPosLat="0.00" arrivalSpeed="14.86" duration="146.25" routeLength="1996.47" waitingTime="0.00" waitingCount="0" stopTime="0.00" timeLoss="12.92" rerouteNo="1" devices="tripinfo_car_w2n_10 routing_car_w2n_10" vType="Car" speedFactor="1.08" vaporized=""/>
    <tripinfo id="car_n2s_4" depart="4.00" departLane="n2sep_1" departPos="3.60" departPosLat="0.00" departSpeed="13.90" departDelay="0.00" arrival="161.75" arrivalLane="c2s_1" arrivalPos="990.00" arrivalPosLat="0.00" arrivalSpeed="14.73" duration="157.75" routeLength="1997.01" waitingTime="14.75" waitingCount="1" stopTime="0.00" timeLoss="22.20" rerouteNo="1" devices="tripinfo_car_n2s_4 routing_car_n2s_4" vType="Car" speedFactor="1.06" vaporized=""/>
    <tripinfo id="car_n2s_16" depart="16.00" departLane="n2sep_1" departPos="3.60" departPosLat="0.00" departSpeed="13.90" departDelay="0.00" arrival="167.30" arrivalLane="c2s_1" arrivalPos="990.00" arrivalPosLat="0.00" arrivalSpeed="14.32" duration="151.30" routeLength="1997.01" waitingTime="1.75" waitingCount="1" stopTime="0.00" timeLoss="11.84" rerouteNo="1" devices="tripinfo_car_n2s_16 routing_car_n2s_16" vType="Car" speedFactor="1.03" vaporized=""/>
    <tripinfo id="car_n2w_37" depart="37.00" departLane="n2sep_1" departPos="3.60" departPosLat="0.00" departSpeed="13.90" departDelay="0.00" arrival="169.45" arrivalLane="c2w_1" arrivalPos="990.00" arrivalPosLat="0.00" arrivalSpeed="15.61" duration="132.45" routeLength="1986.69" waitingTime="0.00" waitingCount="0" stopTime="0.00" timeLoss="4.50" rerouteNo="1" devices="tripinfo_car_n2w_37 routing_car_n2w_37" vType="Car" speedFactor="1.12" vaporized=""/>
    <tripinfo id="car_n2e_20" depart="20.00" departLane="n2sep_1" departPos="3.60" departPosLat="0.00" departSpeed="13.90" departDelay="0.00" arrival="169.80" arrivalLane="c2e_1" arrivalPos="990.00" arrivalPosLat="0.00" arrivalSpeed="14.04" duration="149.80" routeLength="1996.47" waitingTime="0.00" waitingCount="0" stopTime="0.00" timeLoss="6.95" rerouteNo="1" devices="tripinfo_car_n2e_20 routing_car_n2e_20" vType="Car" speedFactor="1.01" vaporized=""/>
    <tripinfo id="car_n2s_17" depart="17.40" departLane="n2sep_1" departPos="3.60" departPosLat="0.00" departSpeed="13.90" departDelay="0.40" arrival="172.15" arrivalLane="c2s_1" arrivalPos="990.00" arrivalPosLat="0.00" arrivalSpeed="13.89" duration="154.75" routeLength="1997.01" waitingTime="0.00" waitingCount="0" stopTime="0.00" timeLoss="11.09" rerouteNo="1" devices="tripinfo_car_n2s_17 routing_car_n2s_17" vType="Car" speedFactor="1.00" vaporized=""/>
    <tripinfo id="car_s2w_19" depart="19.00" departLane="s2sep_1" departPos="3.60" departPosLat="0.00" departSpeed="13.90" departDelay="0.00" arrival="177.80" arrivalLane="c2w_1" arrivalPos="990.00" arrivalPosLat="0.00" arrivalSpeed="14.54" duration="158.80" routeLength="1996.47" waitingTime="10.35" waitingCount="2" stopTime="0.00" timeLoss="20.79" rerouteNo="1" devices="tripinfo_car_s2w_19 routing_car_s2w_19" vType="Car" speedFactor="1.05" vaporized=""/>
    <tripinfo id="car_s2n_41" depart="41.00" departLane="s2sep_1" departPos="3.60" departPosLat="0.00" departSpeed="13.90" departDelay="0.00" arrival="184.80" arrivalLane="c2n_1" arrivalPos="990.00" arrivalPosLat="0.00" arrivalSpeed="13.90" duration="143.80" routeLength="1997.01" waitingTime="0.00" waitingCount="0" stopTime="0.00" timeLoss="0.10" rerouteNo="1" devices="tripinfo_car_s2n_41 routing_car_s2n_41" vType="Car" speedFactor="1.00" vaporized=""/>
    <tripinfo id="car_s2e_42" depart="42.45" departLane="s2sep_1" departPos="3.60" departPosLat="0.00" departSpeed="13.90" departDelay="0.45" arrival="192.40" arrivalLane="c2e_1" arrivalPos="990.00" arrivalPosLat="0.00" arrivalSpeed="13.90" duration="149.95" routeLength="1986.69" waitingTime="0.00" waitingCount="0" stopTime="0.00" timeLoss="6.32" rerouteNo="1" devices="tripinfo_car_s2e_42 routing_car_s2e_42" vType="Car" speedFactor="1.00" vaporized=""/>
    <tripinfo id="car_n2e_46" depart="46.00" departLane="n2sep_1" departPos="3.60" departPosLat="0.00" departSpeed="13.90" departDelay="0.00" arrival="197.65" arrivalLane="c2e_1" arrivalPos="990.00" arrivalPosLat="0.00" arrivalSpeed="14.15" duration="151.65" routeLength="1996.47" waitingTime="2.20" waitingCount="1" stopTime="0.00" timeLoss="9.86" rerouteNo="1" devices="tripinfo_car_n2e_46 routing_car_n2e_46" vType="Car" speedFactor="1.02" vaporized=""/>
    <tripinfo id="car_n2e_47" depart="47.45" departLane="n2sep_1" departPos="3.60" departPosLat="0.00" departSpeed="13.90" departDelay="0.45" arrival="201.80" arrivalLane="c2e_1" arrivalPos="990.00" arrivalPosLat="0.00" arrivalSpeed="14.03" duration="154.35" routeLength="1996.47" waitingTime="0.00" waitingCount="0" stopTime="0.00" timeLoss="11.50" rerouteNo="1" devices="tripinfo_car_n2e_47 routing_car_n2e_47" vType="Car" speedFactor="1.01" vaporized=""/>
    <tripinfo id="car_e2w_23" depart="23.00" departLane="e2sep_1" departPos="3.60" departPosLat="0.00" departSpeed="13.90" departDelay="0.00" arrival="205.40" arrivalLane="c2w_1" arrivalPos="990.00" arrivalPosLat="0.00" arrivalSpeed="15.05" duration="182.40" routeLength="1997.01" waitingTime="42.25" waitingCount="1" stopTime="0.00" timeLoss="49.69" rerouteNo="1" devices="tripinfo_car_e2w_23 routing_car_e2w_23" vType="Car" speedFactor="1.08" vaporized=""/>
    <tripinfo id="car_w2s_31" depart="31.00" departLane="w2sep_1" departPos="3.60" departPosLat="0.00" departSpeed="13.90" departDelay="0.00" arrival="208.55" arrivalLane="c2s_1" arrivalPos="990.00" arrivalPosLat="0.00" arrivalSpeed="14.32" duration="177.55" routeLength="1986.69" waitingTime="30.95" waitingCount="1" stopTime="0.00" timeLoss="38.13" rerouteNo="1" devices="tripinfo_car_w2s_31 routing_car_w2s_31" vType="Car" speedFactor="1.03" vaporized=""/>
    <tripinfo id="car_w2e_37" depart="37.00" departLane="w2sep_1" departPos="3.60" departPosLat="0.00" departSpeed="13.90" departDelay="0.00" arrival="209.95" arrivalLane="c2e_1" arrivalPos="990.00" arrivalPosLat="0.00" arrivalSpeed="14.55" duration="172.95" routeLength="1997.01" waitingTime="26.50" waitingCount="1" stopTime="0.00" timeLoss="35.71" rerouteNo="1" devices="tripinfo_car_w2e_37 routing_car_w2e_37" vType="Car" speedFactor="1.05" vaporized=""/>
    <tripinfo id="car_w2e_44" depart="44.00" departLane="w2sep_1" departPos="3.60" departPosLat="0.00" departSpeed="13.90" departDelay="0.00" arrival="212.10" arrivalLane="c2e_1" arrivalPos="990.00" arrivalPosLat="0.00" arrivalSpeed="15.68" duration="168.10" routeLength="1997.01" waitingTime="19.90" waitingCount="1" stopTime="0.00" timeLoss="44.05" rerouteNo="1" devices="tripinfo_car_w2e_44 routing_car_w2e_44" vType="Car" speedFactor="1.16" vaporized=""/>
    <tripinfo id="car_e2w_73" depart="73.00" departLane="e2sep_1" departPos="3.60" departPosLat="0.00" departSpeed="13.90" departDelay="0.00" arrival="212.80" arrivalLane="c2w_1" arrivalPos="990.00" arrivalPosLat="0.00" arrivalSpeed="16.05" duration="139.80" routeLength="1997.01" waitingTime="0.00" waitingCount="0" stopTime="0.00" timeLoss="15.34" rerouteNo="1" devices="tripinfo_car_e2w_73 routing_car_e2w_73" vType="Car" speedFactor="1.15" vaporized=""/>
    <tripinfo id="car_e2n_38" depart="38.00" departLane="e2sep_1" departPos="3.60" departPosLat="0.00" departSpeed="13.90" departDelay="0.00" arrival="213.00" arrivalLane="c2n_1" arrivalPos="990.00" arrivalPosLat="0.00" arrivalSpeed="13.90" duration="175.00" routeLength="1986.69" waitingTime="21.10" waitingCount="1" stopTime="0.00" timeLoss="31.32" rerouteNo="1" devices="tripinfo_car_e2n_38 routing_car_e2n_38" vType="Car" speedFactor="1.00" vaporized=""/>
    <tripinfo id="car_w2s_41" depart="41.00" departLane="w2sep_1" departPos="3.60" departPosLat="0.00" departSpeed="13.90" departDelay="0.00" arrival="215.90" arrivalLane="c2s_1" arrivalPos="990.00" arrivalPosLat="0.00" arrivalSpeed="13.90" duration="174.90" routeLength="1986.69" waitingTime="20.55" waitingCount="1" stopTime="0.00" timeLoss="31.27" rerouteNo="1" devices="tripinfo_car_w2s_41 routing_car_w2s_41" vType="Car" speedFactor="1.00" vaporized=""/>
    <tripinfo id="car_e2n_58" depart="58.00" departLane="e2sep_1" departPos="3.60" departPosLat="0.00" departSpeed="13.90" departDelay="0.00" arrival="216.50" arrivalLane="c2n_1" arrivalPos="990.00" arrivalPosLat="0.00" arrivalSpeed="14.23" duration="158.50" routeLength="1986.69" waitingTime="5.65" waitingCount="1" stopTime="0.00" timeLoss="18.50" rerouteNo="1" devices="tripinfo_car_e2n_58 routing_car_e2n_58" vType="Car" speedFactor="1.03" vaporized=""/>
    <tripinfo id="car_e2n_60" depart="60.00" departLane="e2sep_1" departPos="3.60" departPosLat="0.00" departSpeed="13.90" departDelay="0.00" arrival="218.55" arrivalLane="c2n_1" arrivalPos="990.00" arrivalPosLat="0.00" arrivalSpeed="15.14" duration="158.55" routeLength="1986.69" waitingTime="4.85" waitingCount="1" stopTime="0.00" timeLoss="30.62" rerouteNo="1" devices="tripinfo_car_e2n_60 routing_car_e2n_60" vType="Car" speedFactor="1.12" vaporized=""/>
    <tripinfo id="car_w2s_59" depart="59.00" departLane="w2sep_1" departPos="3.60" departPosLat="0.00" departSpeed="13.90" departDelay="0.00" arrival="219.00" arrivalLane="c2s_1" arrivalPos="990.00" arrivalPosLat="0.00" arrivalSpeed="14.48" duration="160.00" routeLength="1986.69" waitingTime="8.45" waitingCount="1" stopTime="0.00" timeLoss="22.82" rerouteNo="1" devices="tripinfo_car_w2s_59 routing_car_w2s_59" vType="Car" speedFactor="1.05" vaporized=""/>
    <tripinfo id="car_e2n_71" depart="71.00" departLane="e2sep_1" departPos="3.60" departPosLat="0.00" departSpeed="13.90" departDelay="0.00" arrival="220.45" arrivalLane="c2n_1" arrivalPos="990.00" arrivalPosLat="0.00" arrivalSpeed="15.63" duration="149.45" routeLength="1986.69" waitingTime="3.00" waitingCount="1" stopTime="0.00" timeLoss="27.53" rerouteNo="1" devices="tripinfo_car_e2n_71 routing_car_e2n_71" vType="Car" speedFactor="1.18" vaporized=""/>
    <tripinfo id="car_w2s_88" depart="88.00" departLane="w2sep_1" departPos="3.60" departPosLat="0.00" departSpeed="13.90" departDelay="0.00" arrival="221.05" arrivalLane="c2s_1" arrivalPos="990.00" arrivalPosLat="0.00" arrivalSpeed="15.57" duration="133.05" routeLength="1986.69" waitingTime="0.00" waitingCount="0" stopTime="0.00" timeLoss="9.02" rerouteNo="1" devices="tripinfo_car_w2s_88 routing_car_w2s_88" vType="Car" speedFactor="1.16" vaporized=""/>
    <tripinfo id="bus_w2e_74" depart="74.00" departLane="w2sep_1" departPos="12.10" departPosLat="0.00" departSpeed="13.90" departDelay="0.00" arrival="222.70" arrivalLane="c2e_1" arrivalPos="990.00" arrivalPosLat="0.00" arrivalSpeed="13.90" duration="148.70" routeLength="1988.51" waitingTime="0.00" waitingCount="0" stopTime="0.00" timeLoss="5.61" rerouteNo="1" devices="tripinfo_bus_w2e_74 routing_bus_w2e_74" vType="Bus" speedFactor="1.00" vaporized=""/>
    <tripinfo id="car_e2w_80" depart="80.00" departLane="e2sep_1" departPos="3.60" departPosLat="0.00" departSpeed="13.90" departDelay="0.00" arrival="224.65" arrivalLane="c2w_1" arrivalPos="990.00" arrivalPosLat="0.00" arrivalSpeed="14.17" duration="144.65" routeLength="1997.01" waitingTime="0.00" waitingCount="0" stopTime="0.00" timeLoss="3.73" rerouteNo="1" devices="tripinfo_car_e2w_80 routing_car_e2w_80" vType="Car" speedFactor="1.02" vaporized=""/>
    <tripinfo id="car_w2e_76" depart="76.00" departLane="w2sep_1" departPos="3.60" departPosLat="0.00" departSpeed="13.90" departDelay="0.00" arrival="225.10" arrivalLane="c2e_1" arrivalPos="990.00" arrivalPosLat="0.00" arrivalSpeed="15.68" duration="149.10" routeLength="1997.01" waitingTime="0.00" waitingCount="0" stopTime="0.00" timeLoss="26.46" rerouteNo="1" devices="tripinfo_car_w2e_76 routing_car_w2e_76" vType="Car" speedFactor="1.17" vaporized=""/>
    <tripinfo id="car_e2s_32" depart="32.00" departLane="e2sep_1" departPos="3.60" departPosLat="0.00" departSpeed="13.90" departDelay="0.00" arrival="225.65" arrivalLane="c2s_1" arrivalPos="990.00" arrivalPosLat="0.00" arrivalSpeed="15.15" duration="193.65" routeLength="1996.47" waitingTime="48.70" waitingCount="2" stopTime="0.00" timeLoss="61.34" rerouteNo="1" devices="tripinfo_car_e2s_32 routing_car_e2s_32" vType="Car" speedFactor="1.09" vaporized=""/>
    <tripinfo id="car_e2s_36" depart="36.00" departLane="e2sep_1" departPos="3.60" departPosLat="0.00" departSpeed="13.90" departDelay="0.00" arrival="232.05" arrivalLane="c2s_1" arrivalPos="990.00" arrivalPosLat="0.00" arrivalSpeed="14.26" duration="196.05" routeLength="1996.47" waitingTime="40.45" waitingCount="2" stopTime="0.00" timeLoss="55.41" rerouteNo="1" devices="tripinfo_car_e2s_36 routing_car_e2s_36" vType="Car" speedFactor="1.03" vaporized=""/>
    <tripinfo id="car_e2s_39" depart="39.65" departLane="e2sep_1" departPos="3.60" departPosLat="0.00" departSpeed="13.90" departDelay="0.65" arrival="235.40" arrivalLane="c2s_1" arrivalPos="990.00" arrivalPosLat="0.00" arrivalSpeed="14.49" duration="195.75" routeLength="1996.47" waitingTime="31.75" waitingCount="2" stopTime="0.00" timeLoss="57.74" rerouteNo="1" devices="tripinfo_car_e2s_39 routing_car_e2s_39" vType="Car" speedFactor="1.05" vaporized=""/>
    <tripinfo id="car_e2n_94" depart="94.00" departLane="e2sep_1" departPos="3.60" departPosLat="0.00" departSpeed="13.90" departDelay="0.00" arrival="235.60" arrivalLane="c2n_1" arrivalPos="990.00" arrivalPosLat="0.00" arrivalSpeed="14.50" duration="141.60" routeLength="1986.69" waitingTime="0.00" waitingCount="0" stopTime="0.00" timeLoss="3.92" rerouteNo="1" devices="tripinfo_car_e2n_94 routing_car_e2n_94" vType="Car" speedFactor="1.04" vaporized=""/>
    <tripinfo id="car_e2s_78" depart="78.00" departLane="e2sep_1" departPos="3.60" departPosLat="0.00" departSpeed="13.90" departDelay="0.00" arrival="239.85" arrivalLane="c2s_1" arrivalPos="990.00" arrivalPosLat="0.00" arrivalSpeed="13.89" duration="161.85" routeLength="1996.47" waitingTime="5.75" waitingCount="1" stopTime="0.00" timeLoss="17.54" rerouteNo="1" devices="tripinfo_car_e2s_78 routing_car_e2s_78" vType="Car" speedFactor="1.00" vaporized=""/>
    <tripinfo id="car_e2s_95" depart="95.40" departLane="e2sep_1" departPos="3.60" departPosLat="0.00" departSpeed="13.90" departDelay="0.40" arrival="242.10" arrivalLane="c2s_1" arrivalPos="990.00" arrivalPosLat="0.00" arrivalSpeed="14.80" duration="146.70" routeLength="1996.47" waitingTime="0.00" waitingCount="0" stopTime="0.00" timeLoss="14.03" rerouteNo="1" devices="tripinfo_car_e2s_95 routing_car_e2s_95" vType="Car" speedFactor="1.09" vaporized=""/>
    <tripinfo id="car_s2e_56" depart="56.00" departLane="s2sep_1" departPos="3.60" departPosLat="0.00" departSpeed="13.90" departDelay="0.00" arrival="249.85" arrivalLane="c2e_1" arrivalPos="990.00" arrivalPosLat="0.00" arrivalSpeed="15.16" duration="193.85" routeLength="1986.69" waitingTime="55.00" waitingCount="1" stopTime="0.00" timeLoss="62.14" rerouteNo="1" devices="tripinfo_car_s2e_56 routing_car_s2e_56" vType="Car" speedFactor="1.09" vaporized=""/>
    <tripinfo id="car_n2s_66" depart="66.00" departLane="n2sep_1" departPos="3.60" departPosLat="0.00" departSpeed="13.90" departDelay="0.00" arrival="249.95" arrivalLane="c2s_1" arrivalPos="990.00" arrivalPosLat="0.00" arrivalSpeed="15.73" duration="183.95" routeLength="1997.01" waitingTime="40.05" waitingCount="1" stopTime="0.00" timeLoss="56.99" rerouteNo="1" devices="tripinfo_car_n2s_66 routing_car_n2s_66" vType="Car" speedFactor="1.13" vaporized=""/>
    <tripinfo id="car_s2n_83" depart="83.00" departLane="s2sep_1" departPos="3.60" departPosLat="0.00" departSpeed="13.90" departDelay="0.00" arrival="251.90" arrivalLane="c2n_1" arrivalPos="990.00" arrivalPosLat="0.00" arrivalSpeed="16.40" duration="168.90" routeLength="1997.01" waitingTime="33.55" waitingCount="1" stopTime="0.00" timeLoss="47.11" rerouteNo="1" devices="tripinfo_car_s2n_83 routing_car_s2n_83" vType="Car" speedFactor="1.18" vaporized=""/>
    <tripinfo id="car_n2w_64" depart="64.00" departLane="n2sep_1" departPos="3.60" departPosLat="0.00" departSpeed="13.90" departDelay="0.00" arrival="255.65" arrivalLane="c2w_1" arrivalPos="990.00" arrivalPosLat="0.00" arrivalSpeed="13.90" duration="191.65" routeLength="1986.69" waitingTime="41.00" waitingCount="1" stopTime="0.00" timeLoss="47.96" rerouteNo="1" devices="tripinfo_car_n2w_64 routing_car_n2w_64" vType="Car" speedFactor="1.00" vaporized=""/>
    <tripinfo id="car_n2w_84" depart="84.00" departLane="n2sep_1" departPos="3.60" departPosLat="0.00" departSpeed="13.90" departDelay="0.00" arrival="257.90" arrivalLane="c2w_1" arrivalPos="990.00" arrivalPosLat="0.00" arrivalSpeed="15.00" duration="173.90" routeLength="1986.69" waitingTime="23.10" waitingCount="1" stopTime="0.00" timeLoss="43.56" rerouteNo="1" devices="tripinfo_car_n2w_84 routing_car_n2w_84" vType="Car" speedFactor="1.10" vaporized=""/>
    <tripinfo id="car_s2e_62" depart="62.00" departLane="s2sep_1" departPos="3.60" departPosLat="0.00" departSpeed="13.90" departDelay="0.00" arrival="258.85" arrivalLane="c2e_1" arrivalPos="990.00" arrivalPosLat="0.00" arrivalSpeed="13.90" duration="196.85" routeLength="1986.69" waitingTime="43.85" waitingCount="1" stopTime="0.00" timeLoss="53.19" rerouteNo="1" devices="tripinfo_car_s2e_62 routing_car_s2e_62" vType="Car" speedFactor="1.00" vaporized=""/>
    <tripinfo id="car_n2s_90" depart="90.00" departLane="n2sep_1" departPos="3.60" departPosLat="0.00" departSpeed="13.90" departDelay="0.00" arrival="260.35" arrivalLane="c2s_1" arrivalPos="990.00" arrivalPosLat="0.00" arrivalSpeed="14.32" duration="170.35" routeLength="1997.01" waitingTime="19.65" waitingCount="1" stopTime="0.00" timeLoss="30.88" rerouteNo="1" devices="tripinfo_car_n2s_90 routing_car_n2s_90" vType="Car" speedFactor="1.03" vaporized=""/>
    <tripinfo id="car_s2e_73" depart="73.00" departLane="s2sep_1" departPos="3.60" departPosLat="0.00" departSpeed="13.90" departDelay="0.00" arrival="262.90" arrivalLane="c2e_1" arrivalPos="990.00" arrivalPosLat="0.00" arrivalSpeed="13.96" duration="189.90" routeLength="1986.69" waitingTime="34.30" waitingCount="1" stopTime="0.00" timeLoss="46.97" rerouteNo="1" devices="tripinfo_car_s2e_73 routing_car_s2e_73" vType="Car" speedFactor="1.01" vaporized=""/>
    <tripinfo id="car_n2s_91" depart="91.45" departLane="n2sep_1" departPos="3.60" departPosLat="0.00" departSpeed="13.90" departDelay="0.45" arrival="265.00" arrivalLane="c2s_1" arrivalPos="990.00" arrivalPosLat="0.00" arrivalSpeed="14.14" duration="173.55" routeLength="1997.01" waitingTime="16.95" waitingCount="1" stopTime="0.00" timeLoss="32.41" rerouteNo="1" devices="tripinfo_car_n2s_91 routing_car_n2s_91" vType="Car" speedFactor="1.02" vaporized=""/>
    <tripinfo id="car_s2e_91" depart="91.00" departLane="s2sep_1" departPos="3.60" departPosLat="0.00" departSpeed="13.90" departDelay="0.00" arrival="265.05" arrivalLane="c2e_1" arrivalPos="990.00" arrivalPosLat="0.00" arrivalSpeed="14.82" duration="174.05" routeLength="1986.69" waitingTime="24.00" waitingCount="1" stopTime="0.00" timeLoss="42.49" rerouteNo="1" devices="tripinfo_car_s2e_91 routing_car_s2e_91" vType="Car" speedFactor="1.09" vaporized=""/>
    <tripinfo id="car_n2w_127" depart="127.00" departLane="n2sep_1" departPos="3.60" departPosLat="0.00" departSpeed="13.90" departDelay="0.00" arrival="265.40" arrivalLane="c2w_1" arrivalPos="990.00" arrivalPosLat="0.00" arrivalSpeed="15.88" duration="138.40" routeLength="1986.69" waitingTime="0.00" waitingCount="0" stopTime="0.00" timeLoss="12.67" rerouteNo="1" devices="tripinfo_car_n2w_127 routing_car_n2w_127" vType="Car" speedFactor="1.14" vaporized=""/>
    <tripinfo id="car_s2e_92" depart="92.30" departLane="s2sep_1" departPos="3.60" departPosLat="0.00" departSpeed="13.90" departDelay="0.30" arrival="268.05" arrivalLane="c2e_1" arrivalPos="990.00" arrivalPosLat="0.00" arrivalSpeed="14.35" duration="175.75" routeLength="1986.69" waitingTime="19.50" waitingCount="1" stopTime="0.00" timeLoss="37.29" rerouteNo="1" devices="tripinfo_car_s2e_92 routing_car_s2e_92" vType="Car" speedFactor="1.04" vaporized=""/>
    <tripinfo id="car_n2s_107" depart="107.00" departLane="n2sep_1" departPos="3.60" departPosLat="0.00" departSpeed="13.90" departDelay="0.00" arrival="269.15" arrivalLane="c2s_1" arrivalPos="990.00" arrivalPosLat="0.00" arrivalSpeed="13.89" duration="162.15" routeLength="1997.01" waitingTime="3.70" waitingCount="1" stopTime="0.00" timeLoss="18.45" rerouteNo="1" devices="tripinfo_car_n2s_107 routing_car_n2s_107" vType="Car" speedFactor="1.00" vaporized=""/>
    <tripinfo id="car_n2s_109" depart="109.00" departLane="n2sep_1" departPos="3.60" departPosLat="0.00" departSpeed="13.90" departDelay="0.00" arrival="270.95" arrivalLane="c2s_1" arrivalPos="990.00" arrivalPosLat="0.00" arrivalSpeed="15.33" duration="161.95" routeLength="1997.01" waitingTime="3.20" waitingCount="1" stopTime="0.00" timeLoss="39.03" rerouteNo="1" devices="tripinfo_car_n2s_109 routing_car_n2s_109" vType="Car" speedFactor="1.17" vaporized=""/>
    <tripinfo id="car_s2n_106" depart="106.00" departLane="s2sep_1" departPos="3.60" departPosLat="0.00" departSpeed="13.90" departDelay="0.00" arrival="271.45" arrivalLane="c2n_1" arrivalPos="990.00" arrivalPosLat="0.00" arrivalSpeed="13.90" duration="165.45" routeLength="1997.01" waitingTime="5.60" waitingCount="1" stopTime="0.00" timeLoss="21.77" rerouteNo="1" devices="tripinfo_car_s2n_106 routing_car_s2n_106" vType="Car" speedFactor="1.00" vaporized=""/>
    <tripinfo id="car_s2e_104" depart="104.00" departLane="s2sep_1" departPos="3.60" departPosLat="0.00" departSpeed="13.90" departDelay="0.00" arrival="272.10" arrivalLane="c2e_1" arrivalPos="990.00" arrivalPosLat="0.00" arrivalSpeed="13.89" duration="168.10" routeLength="1986.69" waitingTime="8.10" waitingCount="1" stopTime="0.00" timeLoss="24.46" rerouteNo="1" devices="tripinfo_car_s2e_104 routing_car_s2e_104" vType="Car" speedFactor="1.00" vaporized=""/>
    <tripinfo id="car_s2w_113" depart="113.00" departLane="s2sep_1" departPos="3.60" departPosLat="0.00" departSpeed="13.90" departDelay="0.00" arrival="272.80" arrivalLane="c2w_1" arrivalPos="990.00" arrivalPosLat="0.00" arrivalSpeed="15.23" duration="159.80" routeLength="1996.47" waitingTime="17.05" waitingCount="1" stopTime="0.00" timeLoss="28.08" rerouteNo="1" devices="tripinfo_car_s2w_113 routing_car_s2w_113" vType="Car" speedFactor="1.10" vaporized=""/>
    <tripinfo id="car_n2s_131" depart="131.00" departLane="n2sep_1" departPos="3.60" departPosLat="0.00" departSpeed="13.90" departDelay="0.00" arrival="273.35" arrivalLane="c2s_1" arrivalPos="990.00" arrivalPosLat="0.00" arrivalSpeed="14.82" duration="142.35" routeLength="1997.01" waitingTime="0.00" waitingCount="0" stopTime="0.00" timeLoss="9.58" rerouteNo="1" devices="tripinfo_car_n2s_131 routing_car_n2s_131" vType="Car" speedFactor="1.08" vaporized=""/>
    <tripinfo id="car_s2e_120" depart="120.00" departLane="s2sep_1" departPos="3.60" departPosLat="0.00" departSpeed="13.90" departDelay="0.00" arrival="275.80" arrivalLane="c2e_1" arrivalPos="990.00" arrivalPosLat="0.00" arrivalSpeed="13.92" duration="155.80" routeLength="1986.69" waitingTime="0.00" waitingCount="0" stopTime="0.00" timeLoss="12.57" rerouteNo="1" devices="tripinfo_car_s2e_120 routing_car_s2e_120" vType="Car" speedFactor="1.00" vaporized=""/>
    <tripinfo id="car_s2w_131" depart="131.00" departLane="s2sep_1" departPos="3.60" departPosLat="0.00" departSpeed="13.90" departDelay="0.00" arrival="276.15" arrivalLane="c2w_1" arrivalPos="990.00" arrivalPosLat="0.00" arrivalSpeed="15.50" duration="145.15" routeLength="1996.47" waitingTime="4.20" waitingCount="1" stopTime="0.00" timeLoss="16.20" rerouteNo="1" devices="tripinfo_car_s2w_131 routing_car_s2w_131" vType="Car" speedFactor="1.12" vaporized=""/>
    <tripinfo id="car_s2e_144" depart="144.00" departLane="s2sep_1" departPos="3.60" departPosLat="0.00" departSpeed="13.90" departDelay="0.00" arrival="277.60" arrivalLane="c2e_1" arrivalPos="990.00" arrivalPosLat="0.00" arrivalSpeed="15.39" duration="133.60" routeLength="1986.69" waitingTime="0.00" waitingCount="0" stopTime="0.00" timeLoss="11.68" rerouteNo="1" devices="tripinfo_car_s2e_144 routing_car_s2e_144" vType="Car" speedFactor="1.18" vaporized=""/>
    <tripinfo id="car_n2e_70" depart="70.00" departLane="n2sep_1" departPos="3.60" departPosLat="0.00" departSpeed="13.90" departDelay="0.00" arrival="284.85" arrivalLane="c2e_1" arrivalPos="990.00" arrivalPosLat="0.00" arrivalSpeed="13.90" duration="214.85" routeLength="1996.47" waitingTime="58.10" waitingCount="3" stopTime="0.00" timeLoss="70.51" rerouteNo="1" devices="tripinfo_car_n2e_70 routing_car_n2e_70" vType="Car" speedFactor="1.00" vaporized=""/>
    <tripinfo id="car_n2e_82" depart="82.00" departLane="n2sep_1" departPos="3.60" departPosLat="0.00" departSpeed="13.90" departDelay="0.00" arrival="289.00" arrivalLane="c2e_1" arrivalPos="990.00" arrivalPosLat="0.00" arrivalSpeed="13.89" duration="207.00" routeLength="1996.47" waitingTime="47.00" waitingCount="2" stopTime="0.00" timeLoss="62.69" rerouteNo="1" devices="tripinfo_car_n2e_82 routing_car_n2e_82" vType="Car" speedFactor="1.00" vaporized=""/>
    <tripinfo id="car_n2e_96" depart="96.00" departLane="n2sep_1" departPos="3.60" departPosLat="0.00" departSpeed="13.90" departDelay="0.00" arrival="292.25" arrivalLane="c2e_1" arrivalPos="990.00" arrivalPosLat="0.00" arrivalSpeed="13.99" duration="196.25" routeLength="1996.47" waitingTime="31.00" waitingCount="2" stopTime="0.00" timeLoss="53.38" rerouteNo="1" devices="tripinfo_car_n2e_96 routing_car_n2e_96" vType="Car" speedFactor="1.01" vaporized=""/>
    <tripinfo id="car_n2e_125" depart="125.00" departLane="n2sep_1" departPos="3.60" departPosLat="0.00" departSpeed="13.90" departDelay="0.00" arrival="295.50" arrivalLane="c2e_1" arrivalPos="990.00" arrivalPosLat="0.00" arrivalSpeed="13.86" duration="170.50" routeLength="1996.47" waitingTime="12.90" waitingCount="1" stopTime="0.00" timeLoss="26.19" rerouteNo="1" devices="tripinfo_car_n2e_125 routing_car_n2e_125" vType="Car" speedFactor="1.00" vaporized=""/>
    <tripinfo id="car_n2e_149" depart="149.00" departLane="n2sep_1" departPos="3.60" departPosLat="0.00" departSpeed="13.90" departDelay="0.00" arrival="297.30" arrivalLane="c2e_1" arrivalPos="990.00" arrivalPosLat="0.00" arrivalSpeed="15.28" duration="148.30" routeLength="1996.47" waitingTime="0.00" waitingCount="0" stopTime="0.00" timeLoss="25.11" rerouteNo="1" devices="tripinfo_car_n2e_149 routing_car_n2e_149" vType="Car" speedFactor="1.17" vaporized=""/>
    <tripinfo id="car_e2n_113" depart="113.00" departLane="e2sep_1" departPos="3.60" departPosLat="0.00" departSpeed="13.90" departDelay="0.00" arrival="299.45" arrivalLane="c2n_1" arrivalPos="990.00" arrivalPosLat="0.00" arrivalSpeed="14.13" duration="186.45" routeLength="1986.69" waitingTime="38.10" waitingCount="1" stopTime="0.00" timeLoss="45.19" rerouteNo="1" devices="tripinfo_car_e2n_113 routing_car_e2n_113" vType="Car" speedFactor="1.02" vaporized=""/>
    <tripinfo id="bus_w2s_97" depart="97.00" departLane="w2sep_1" departPos="12.10" departPosLat="0.00" departSpeed="13.90" departDelay="0.00" arrival="303.95" arrivalLane="c2s_1" arrivalPos="990.00" arrivalPosLat="0.00" arrivalSpeed="13.90" duration="206.95" routeLength="1978.19" waitingTime="53.60" waitingCount="1" stopTime="0.00" timeLoss="63.88" rerouteNo="1" devices="tripinfo_bus_w2s_97 routing_bus_w2s_97" vType="Bus" speedFactor="1.00" vaporized=""/>
    <tripinfo id="car_w2e_98" depart="98.45" departLane="w2sep_1" departPos="3.60" departPosLat="0.00" departSpeed="13.90" departDelay="0.45" arrival="305.45" arrivalLane="c2e_1" arrivalPos="990.00" arrivalPosLat="0.00" arrivalSpeed="13.90" duration="207.00" routeLength="1997.01" waitingTime="50.85" waitingCount="1" stopTime="0.00" timeLoss="63.32" rerouteNo="1" devices="tripinfo_car_w2e_98 routing_car_w2e_98" vType="Car" speedFactor="1.00" vaporized=""/>
    <tripinfo id="bus_e2w_127" depart="127.00" departLane="e2sep_1" departPos="12.10" departPosLat="0.00" departSpeed="13.90" departDelay="0.00" arrival="306.00" arrivalLane="c2w_1" arrivalPos="990.00" arrivalPosLat="0.00" arrivalSpeed="13.90" duration="179.00" routeLength="1988.51" waitingTime="25.10" waitingCount="1" stopTime="0.00" timeLoss="35.91" rerouteNo="1" devices="tripinfo_bus_e2w_127 routing_bus_e2w_127" vType="Bus" speedFactor="1.00" vaporized=""/>
    <tripinfo id="car_e2n_136" depart="136.00" departLane="e2sep_1" departPos="3.60" departPosLat="0.00" departSpeed="13.90" departDelay="0.00" arrival="308.05" arrivalLane="c2n_1" arrivalPos="990.00" arrivalPosLat="0.00" arrivalSpeed="13.90" duration="172.05" routeLength="1986.69" waitingTime="16.50" waitingCount="1" stopTime="0.00" timeLoss="28.39" rerouteNo="1" devices="tripinfo_car_e2n_136 routing_car_e2n_136" vType="Car" speedFactor="1.00" vaporized=""/>
    <tripinfo id="car_w2s_125" depart="125.00" departLane="w2sep_1" departPos="3.60" departPosLat="0.00" departSpeed="13.90" departDelay="0.00" arrival="309.30" arrivalLane="c2s_1" arrivalPos="990.00" arrivalPosLat="0.00" arrivalSpeed="13.90" duration="184.30" routeLength="1986.69" waitingTime="27.85" waitingCount="1" stopTime="0.00" timeLoss="40.65" rerouteNo="1" devices="tripinfo_car_w2s_125 routing_car_w2s_125" vType="Car" speedFactor="1.00" vaporized=""/>
    <tripinfo id="car_e2w_161" depart="161.00" departLane="e2sep_1" departPos="3.60" departPosLat="0.00" departSpeed="13.90" departDelay="0.00" arrival="310.40" arrivalLane="c2w_1" arrivalPos="990.00" arrivalPosLat="0.00" arrivalSpeed="14.16" duration="149.40" routeLength="1997.01" waitingTime="0.00" waitingCount="0" stopTime="0.00" timeLoss="8.50" rerouteNo="1" devices="tripinfo_car_e2w_161 routing_car_e2w_161" vType="Car" speedFactor="1.02" vaporized=""/>
    <tripinfo id="car_w2e_153" depart="153.00" departLane="w2sep_1" departPos="3.60" departPosLat="0.00" departSpeed="13.90" departDelay="0.00" arrival="311.05" arrivalLane="c2e_1" arrivalPos="990.00" arrivalPosLat="0.00" arrivalSpeed="14.20" duration="158.05" routeLength="1997.01" waitingTime="2.45" waitingCount="1" stopTime="0.00" timeLoss="17.46" rerouteNo="1" devices="tripinfo_car_w2e_153 routing_car_w2e_153" vType="Car" speedFactor="1.02" vaporized=""/>
    <tripinfo id="car_w2s_151" depart="151.00" departLane="w2sep_1" departPos="3.60" departPosLat="0.00" departSpeed="13.90" departDelay="0.00" arrival="312.10" arrivalLane="c2s_1" arrivalPos="990.00" arrivalPosLat="0.00" arrivalSpeed="14.35" duration="161.10" routeLength="1986.69" waitingTime="5.60" waitingCount="1" stopTime="0.00" timeLoss="22.94" rerouteNo="1" devices="tripinfo_car_w2s_151 routing_car_w2s_151" vType="Car" speedFactor="1.04" vaporized=""/>
    <tripinfo id="car_e2w_169" depart="169.00" departLane="e2sep_1" departPos="3.60" departPosLat="0.00" departSpeed="13.90" departDelay="0.00" arrival="312.75" arrivalLane="c2w_1" arrivalPos="990.00" arrivalPosLat="0.00" arrivalSpeed="14.85" duration="143.75" routeLength="1997.01" waitingTime="0.00" waitingCount="0" stopTime="0.00" timeLoss="11.55" rerouteNo="1" devices="tripinfo_car_e2w_169 routing_car_e2w_169" vType="Car" speedFactor="1.09" vaporized=""/>
    <tripinfo id="car_w2s_164" depart="164.00" departLane="w2sep_1" departPos="3.60" departPosLat="0.00" departSpeed="13.90" departDelay="0.00" arrival="313.90" arrivalLane="c2s_1" arrivalPos="990.00" arrivalPosLat="0.00" arrivalSpeed="15.48" duration="149.90" routeLength="1986.69" waitingTime="0.00" waitingCount="0" stopTime="0.00" timeLoss="28.12" rerouteNo="1" devices="tripinfo_car_w2s_164 routing_car_w2s_164" vType="Car" speedFactor="1.18" vaporized=""/>
    <tripinfo id="car_w2e_179" depart="179.00" departLane="w2sep_1" departPos="3.60" departPosLat="0.00" departSpeed="13.90" departDelay="0.00" arrival="314.90" arrivalLane="c2e_1" arrivalPos="990.00" arrivalPosLat="0.00" arrivalSpeed="15.91" duration="135.90" routeLength="1997.01" waitingTime="0.00" waitingCount="0" stopTime="0.00" timeLoss="10.69" rerouteNo="1" devices="tripinfo_car_w2e_179 routing_car_w2e_179" vType="Car" speedFactor="1.15" vaporized=""/>
    <tripinfo id="car_e2n_171" depart="171.00" departLane="e2sep_1" departPos="3.60" departPosLat="0.00" departSpeed="13.90" departDelay="0.00" arrival="315.35" arrivalLane="c2n_1" arrivalPos="990.00" arrivalPosLat="0.00" arrivalSpeed="14.38" duration="144.35" routeLength="1986.69" waitingTime="0.00" waitingCount="0" stopTime="0.00" timeLoss="5.45" rerouteNo="1" devices="tripinfo_car_e2n_171 routing_car_e2n_171" vType="Car" speedFactor="1.03" vaporized=""/>
    <tripinfo id="car_w2n_129" depart="129.00" departLane="w2sep_1" departPos="3.60" departPosLat="0.00" departSpeed="13.90" departDelay="0.00" arrival="317.55" arrivalLane="c2n_1" arrivalPos="990.00" arrivalPosLat="0.00" arrivalSpeed="15.38" duration="188.55" routeLength="1996.47" waitingTime="37.00" waitingCount="2" stopTime="0.00" timeLoss="61.05" rerouteNo="1" devices="tripinfo_car_w2n_129 routing_car_w2n_129" vType="Car" speedFactor="1.13" vaporized=""/>
    <tripinfo id="car_w2s_175" depart="175.00" departLane="w2sep_1" departPos="3.60" departPosLat="0.00" departSpeed="13.90" departDelay="0.00" arrival="320.70" arrivalLane="c2s_1" arrivalPos="990.00" arrivalPosLat="0.00" arrivalSpeed="14.13" duration="145.70" routeLength="1986.69" waitingTime="0.00" waitingCount="0" stopTime="0.00" timeLoss="4.45" rerouteNo="1" devices="tripinfo_car_w2s_175 routing_car_w2s_175" vType="Car" speedFactor="1.02" vaporized=""/>
    <tripinfo id="car_w2n_132" depart="132.00" departLane="w2sep_1" departPos="3.60" departPosLat="0.00" departSpeed="13.90" departDelay="0.00" arrival="322.60" arrivalLane="c2n_1" arrivalPos="990.00" arrivalPosLat="0.00" arrivalSpeed="14.11" duration="190.60" routeLength="1996.47" waitingTime="31.75" waitingCount="2" stopTime="0.00" timeLoss="48.50" rerouteNo="1" devices="tripinfo_car_w2n_132 routing_car_w2n_132" vType="Car" speedFactor="1.02" vaporized=""/>
    <tripinfo id="car_e2s_127" depart="128.45" departLane="e2sep_1" departPos="3.60" departPosLat="0.00" departSpeed="13.90" departDelay="1.45" arrival="325.55" arrivalLane="c2s_1" arrivalPos="990.00" arrivalPosLat="0.00" arrivalSpeed="14.22" duration="197.10" routeLength="1996.47" waitingTime="40.45" waitingCount="3" stopTime="0.00" timeLoss="56.07" rerouteNo="1" devices="tripinfo_car_e2s_127 routing_car_e2s_127" vType="Car" speedFactor="1.02" vaporized=""/>
    <tripinfo id="car_e2s_147" depart="147.00" departLane="e2sep_1" departPos="3.60" departPosLat="0.00" departSpeed="13.90" departDelay="0.00" arrival="327.50" arrivalLane="c2s_1" arrivalPos="990.00" arrivalPosLat="0.00" arrivalSpeed="15.43" duration="180.50" routeLength="1996.47" waitingTime="31.75" waitingCount="2" stopTime="0.00" timeLoss="55.49" rerouteNo="1" devices="tripinfo_car_e2s_147 routing_car_e2s_147" vType="Car" speedFactor="1.15" vaporized=""/>
    <tripinfo id="bus_w2n_158" depart="158.00" departLane="w2sep_1" departPos="12.10" departPosLat="0.00" departSpeed="13.90" departDelay="0.00" arrival="328.25" arrivalLane="c2n_1" arrivalPos="990.00" arrivalPosLat="0.00" arrivalSpeed="13.88" duration="170.25" routeLength="1987.97" waitingTime="11.70" waitingCount="1" stopTime="0.00" timeLoss="26.56" rerouteNo="1" devices="tripinfo_bus_w2n_158 routing_bus_w2n_158" vType="Bus" speedFactor="1.00" vaporized=""/>
    <tripinfo id="car_w2e_187" depart="187.00" departLane="w2sep_1" departPos="3.60" departPosLat="0.00" departSpeed="13.90" departDelay="0.00" arrival="331.15" arrivalLane="c2e_1" arrivalPos="990.00" arrivalPosLat="0.00" arrivalSpeed="13.92" duration="144.15" routeLength="1997.01" waitingTime="0.00" waitingCount="0" stopTime="0.00" timeLoss="0.69" rerouteNo="1" devices="tripinfo_car_w2e_187 routing_car_w2e_187" vType="Car" speedFactor="1.00" vaporized=""/>
    <tripinfo id="car_w2n_162" depart="162.00" departLane="w2sep_1" departPos="3.60" departPosLat="0.00" departSpeed="13.90" departDelay="0.00" arrival="331.45" arrivalLane="c2n_1" arrivalPos="990.00" arrivalPosLat="0.00" arrivalSpeed="14.57" duration="169.45" routeLength="1996.47" waitingTime="11.00" waitingCount="1" stopTime="0.00" timeLoss="32.75" rerouteNo="1" devices="tripinfo_car_w2n_162 routing_car_w2n_162" vType="Car" speedFactor="1.06" vaporized=""/>
    <tripinfo id="car_w2n_167" depart="167.00" departLane="w2sep_1" departPos="3.60" departPosLat="0.00" departSpeed="13.90" departDelay="0.00" arrival="333.65" arrivalLane="c2n_1" arrivalPos="990.00" arrivalPosLat="0.00" arrivalSpeed="14.99" duration="166.65" routeLength="1996.47" waitingTime="9.75" waitingCount="1" stopTime="0.00" timeLoss="35.72" rerouteNo="1" devices="tripinfo_car_w2n_167 routing_car_w2n_167" vType="Car" speedFactor="1.10" vaporized=""/>
    <tripinfo id="car_e2s_148" depart="148.25" departLane="e2sep_1" departPos="3.60" departPosLat="0.00" departSpeed="13.90" departDelay="0.25" arrival="334.65" arrivalLane="c2s_1" arrivalPos="990.00" arrivalPosLat="0.00" arrivalSpeed="13.97" duration="186.40" routeLength="1996.47" waitingTime="21.20" waitingCount="3" stopTime="0.00" timeLoss="42.84" rerouteNo="1" devices="tripinfo_car_e2s_148 routing_car_e2s_148" vType="Car" speedFactor="1.01" vaporized=""/>
    <tripinfo id="car_n2w_164" depart="164.00" departLane="n2sep_1" departPos="3.60" departPosLat="0.00" departSpeed="13.90" departDelay="0.00" arrival="343.45" arrivalLane="c2w_1" arrivalPos="990.00" arrivalPosLat="0.00" arrivalSpeed="14.35" duration="179.45" routeLength="1986.69" waitingTime="33.10" waitingCount="1" stopTime="0.00" timeLoss="40.29" rerouteNo="1" devices="tripinfo_car_n2w_164 routing_car_n2w_164" vType="Car" speedFactor="1.03" vaporized=""/>
    <tripinfo id="car_s2e_156" depart="157.40" departLane="s2sep_1" departPos="3.60" departPosLat="0.00" departSpeed="13.90" departDelay="1.40" arrival="345.70" arrivalLane="c2e_1" arrivalPos="990.00" arrivalPosLat="0.00" arrivalSpeed="13.90" duration="188.30" routeLength="1986.69" waitingTime="35.50" waitingCount="1" stopTime="0.00" timeLoss="44.64" rerouteNo="1" devices="tripinfo_car_s2e_156 routing_car_s2e_156" vType="Car" speedFactor="1.00" vaporized=""/>
    <tripinfo id="car_s2n_163" depart="163.00" departLane="s2sep_1" departPos="3.60" departPosLat="0.00" departSpeed="13.90" departDelay="0.00" arrival="347.90" arrivalLane="c2n_1" arrivalPos="990.00" arrivalPosLat="0.00" arrivalSpeed="13.90" duration="184.90" routeLength="1997.01" waitingTime="32.00" waitingCount="1" stopTime="0.00" timeLoss="41.21" rerouteNo="1" devices="tripinfo_car_s2n_163 routing_car_s2n_163" vType="Car" speedFactor="1.00" vaporized=""/>
    <tripinfo id="car_s2w_156" depart="156.00" departLane="s2sep_1" departPos="3.60" departPosLat="0.00" departSpeed="13.90" departDelay="0.00" arrival="348.10" arrivalLane="c2w_1" arrivalPos="990.00" arrivalPosLat="0.00" arrivalSpeed="14.21" duration="192.10" routeLength="1996.47" waitingTime="40.80" waitingCount="1" stopTime="0.00" timeLoss="51.01" rerouteNo="1" devices="tripinfo_car_s2w_156 routing_car_s2w_156" vType="Car" speedFactor="1.02" vaporized=""/>
    <tripinfo id="car_s2e_176" depart="176.00" departLane="s2sep_1" departPos="3.60" departPosLat="0.00" departSpeed="13.90" departDelay="0.00" arrival="351.10" arrivalLane="c2e_1" arrivalPos="990.00" arrivalPosLat="0.00" arrivalSpeed="14.32" duration="175.10" routeLength="1986.69" waitingTime="20.90" waitingCount="1" stopTime="0.00" timeLoss="35.65" rerouteNo="1" devices="tripinfo_car_s2e_176 routing_car_s2e_176" vType="Car" speedFactor="1.03" vaporized=""/>
    <tripinfo id="car_n2s_217" depart="217.00" departLane="n2sep_1" departPos="3.60" departPosLat="0.00" departSpeed="13.90" departDelay="0.00" arrival="351.25" arrivalLane="c2s_1" arrivalPos="990.00" arrivalPosLat="0.00" arrivalSpeed="15.16" duration="134.25" routeLength="1997.01" waitingTime="0.00" waitingCount="0" stopTime="0.00" timeLoss="2.55" rerouteNo="1" devices="tripinfo_car_n2s_217 routing_car_n2s_217" vType="Car" speedFactor="1.09" vaporized=""/>
    <tripinfo id="car_s2n_167" depart="167.00" departLane="s2sep_1" departPos="3.60" departPosLat="0.00" departSpeed="13.90" departDelay="0.00" arrival="351.95" arrivalLane="c2n_1" arrivalPos="990.00" arrivalPosLat="0.00" arrivalSpeed="13.99" duration="184.95" routeLength="1997.01" waitingTime="29.30" waitingCount="1" stopTime="0.00" timeLoss="42.31" rerouteNo="1" devices="tripinfo_car_s2n_167 routing_car_s2n_167" vType="Car" speedFactor="1.01" vaporized=""/>
    <tripinfo id="car_s2w_174" depart="174.00" departLane="s2sep_1" departPos="3.60" departPosLat="0.00" departSpeed="13.90" departDelay="0.00" arrival="352.45" arrivalLane="c2w_1" arrivalPos="990.00" arrivalPosLat="0.00" arrivalSpeed="13.89" duration="178.45" routeLength="1996.47" waitingTime="21.45" waitingCount="1" stopTime="0.00" timeLoss="34.12" rerouteNo="1" devices="tripinfo_car_s2w_174 routing_car_s2w_174" vType="Car" speedFactor="1.00" vaporized=""/>
    <tripinfo id="car_s2n_202" depart="202.00" departLane="s2sep_1" departPos="3.60" departPosLat="0.00" departSpeed="13.90" departDelay="0.00" arrival="354.15" arrivalLane="c2n_1" arrivalPos="990.00" arrivalPosLat="0.00" arrivalSpeed="14.84" duration="152.15" routeLength="1997.01" waitingTime="2.30" waitingCount="1" stopTime="0.00" timeLoss="20.56" rerouteNo="1" devices="tripinfo_car_s2n_202 routing_car_s2n_202" vType="Car" speedFactor="1.09" vaporized=""/>
    <tripinfo id="car_s2w_188" depart="188.00" departLane="s2sep_1" departPos="3.60" departPosLat="0.00" departSpeed="13.90" departDelay="0.00" arrival="355.10" arrivalLane="c2w_1" arrivalPos="990.00" arrivalPosLat="0.00" arrivalSpeed="14.36" duration="167.10" routeLength="1996.47" waitingTime="11.60" waitingCount="1" stopTime="0.00" timeLoss="28.67" rerouteNo="1" devices="tripinfo_car_s2w_188 routing_car_s2w_188" vType="Car" speedFactor="1.04" vaporized=""/>
    <tripinfo id="car_s2n_210" depart="210.00" departLane="s2sep_1" departPos="3.60" departPosLat="0.00" departSpeed="13.90" departDelay="0.00" arrival="357.10" arrivalLane="c2n_1" arrivalPos="990.00" arrivalPosLat="0.00" arrivalSpeed="14.35" duration="147.10" routeLength="1997.01" waitingTime="0.00" waitingCount="0" stopTime="0.00" timeLoss="8.65" rerouteNo="1" devices="tripinfo_car_s2n_210 routing_car_s2n_210" vType="Car" speedFactor="1.04" vaporized=""/>
    <tripinfo id="car_s2w_194" depart="194.00" departLane="s2sep_1" departPos="3.60" departPosLat="0.00" departSpeed="13.90" departDelay="0.00" arrival="358.30" arrivalLane="c2w_1" arrivalPos="990.00" arrivalPosLat="0.00" arrivalSpeed="13.95" duration="164.30" routeLength="1996.47" waitingTime="4.50" waitingCount="1" stopTime="0.00" timeLoss="20.97" rerouteNo="1" devices="tripinfo_car_s2w_194 routing_car_s2w_194" vType="Car" speedFactor="1.01" vaporized=""/>
    <tripinfo id="car_s2n_220" depart="220.00" departLane="s2sep_1" departPos="3.60" departPosLat="0.00" departSpeed="13.90" departDelay="0.00" arrival="359.85" arrivalLane="c2n_1" arrivalPos="990.00" arrivalPosLat="0.00" arrivalSpeed="14.57" duration="139.85" routeLength="1997.01" waitingTime="0.00" waitingCount="0" stopTime="0.00" timeLoss="3.88" rerouteNo="1" devices="tripinfo_car_s2n_220 routing_car_s2n_220" vType="Car" speedFactor="1.06" vaporized=""/>
    <tripinfo id="car_s2n_227" depart="227.00" departLane="s2sep_1" departPos="3.60" departPosLat="0.00" departSpeed="13.90" departDelay="0.00" arrival="361.95" arrivalLane="c2n_1" arrivalPos="990.00" arrivalPosLat="0.00" arrivalSpeed="15.17" duration="134.95" routeLength="1997.01" waitingTime="0.00" waitingCount="0" stopTime="0.00" timeLoss="6.86" rerouteNo="1" devices="tripinfo_car_s2n_227 routing_car_s2n_227" vType="Car" speedFactor="1.12" vaporized=""/>
    <tripinfo id="car_s2n_229" depart="229.00" departLane="s2sep_1" departPos="3.60" departPosLat="0.00" departSpeed="13.90" departDelay="0.00" arrival="364.65" arrivalLane="c2n_1" arrivalPos="990.00" arrivalPosLat="0.00" arrivalSpeed="15.11" duration="135.65" routeLength="1997.01" waitingTime="0.00" waitingCount="0" stopTime="0.00" timeLoss="4.69" rerouteNo="1" devices="tripinfo_car_s2n_229 routing_car_s2n_229" vType="Car" speedFactor="1.10" vaporized=""/>
    <tripinfo id="car_n2e_184" depart="184.00" departLane="n2sep_1" departPos="3.60" departPosLat="0.00" departSpeed="13.90" departDelay="0.00" arrival="371.95" arrivalLane="c2e_1" arrivalPos="990.00" arrivalPosLat="0.00" arrivalSpeed="13.90" duration="187.95" routeLength="1996.47" waitingTime="32.70" waitingCount="3" stopTime="0.00" timeLoss="43.64" rerouteNo="1" devices="tripinfo_car_n2e_184 routing_car_n2e_184" vType="Car" speedFactor="1.00" vaporized=""/>
    <tripinfo id="bus_s2n_232" depart="232.00" departLane="s2sep_1" departPos="12.10" departPosLat="0.00" departSpeed="13.90" departDelay="0.00" arrival="376.45" arrivalLane="c2n_1" arrivalPos="990.00" arrivalPosLat="0.00" arrivalSpeed="13.90" duration="144.45" routeLength="1988.51" waitingTime="0.00" waitingCount="0" stopTime="0.00" timeLoss="1.39" rerouteNo="1" devices="tripinfo_bus_s2n_232 routing_bus_s2n_232" vType="Bus" speedFactor="1.00" vaporized=""/>
    <tripinfo id="car_n2e_201" depart="201.00" departLane="n2sep_1" departPos="3.60" departPosLat="0.00" departSpeed="13.90" departDelay="0.00" arrival="379.55" arrivalLane="c2e_1" arrivalPos="990.00" arrivalPosLat="0.00" arrivalSpeed="14.13" duration="178.55" routeLength="1996.47" waitingTime="24.15" waitingCount="2" stopTime="0.00" timeLoss="36.56" rerouteNo="1" devices="tripinfo_car_n2e_201 routing_car_n2e_201" vType="Car" speedFactor="1.02" vaporized=""/>
    <tripinfo id="car_n2e_213" depart="213.00" departLane="n2sep_1" departPos="3.60" departPosLat="0.00" departSpeed="13.90" departDelay="0.00" arrival="382.85" arrivalLane="c2e_1" arrivalPos="990.00" arrivalPosLat="0.00" arrivalSpeed="14.45" duration="169.85" routeLength="1996.47" waitingTime="13.30" waitingCount="2" stopTime="0.00" timeLoss="31.52" rerouteNo="1" devices="tripinfo_car_n2e_213 routing_car_n2e_213" vType="Car" speedFactor="1.04" vaporized=""/>
    <tripinfo id="car_w2e_201" depart="201.00" departLane="w2sep_1" departPos="3.60" departPosLat="0.00" departSpeed="13.90" departDelay="0.00" arrival="389.70" arrivalLane="c2e_1" arrivalPos="990.00" arrivalPosLat="0.00" arrivalSpeed="14.21" duration="188.70" routeLength="1997.01" waitingTime="40.40" waitingCount="1" stopTime="0.00" timeLoss="48.08" rerouteNo="1" devices="tripinfo_car_w2e_201 routing_car_w2e_201" vType="Car" speedFactor="1.02" vaporized=""/>
    <tripinfo id="car_e2w_235" depart="235.00" departLane="e2sep_1" departPos="3.60" departPosLat="0.00" departSpeed="13.90" departDelay="0.00" arrival="390.70" arrivalLane="c2w_1" arrivalPos="990.00" arrivalPosLat="0.00" arrivalSpeed="13.90" duration="155.70" routeLength="1997.01" waitingTime="4.95" waitingCount="1" stopTime="0.00" timeLoss="12.02" rerouteNo="1" devices="tripinfo_car_e2w_235 routing_car_e2w_235" vType="Car" speedFactor="1.00" vaporized=""/>
    <tripinfo id="car_w2s_221" depart="221.00" departLane="w2sep_1" departPos="3.60" departPosLat="0.00" departSpeed="13.90" departDelay="0.00" arrival="392.30" arrivalLane="c2s_1" arrivalPos="990.00" arrivalPosLat="0.00" arrivalSpeed="14.04" duration="171.30" routeLength="1986.69" waitingTime="20.40" waitingCount="1" stopTime="0.00" timeLoss="29.03" rerouteNo="1" devices="tripinfo_car_w2s_221 routing_car_w2s_221" vType="Car" speedFactor="1.01" vaporized=""/>
    <tripinfo id="car_w2e_243" depart="243.00" departLane="w2sep_1" departPos="3.60" departPosLat="0.00" departSpeed="13.90" departDelay="0.00" arrival="392.65" arrivalLane="c2e_1" arrivalPos="990.00" arrivalPosLat="0.00" arrivalSpeed="14.82" duration="149.65" routeLength="1997.01" waitingTime="3.00" waitingCount="1" stopTime="0.00" timeLoss="15.72" rerouteNo="1" devices="tripinfo_car_w2e_243 routing_car_w2e_243" vType="Car" speedFactor="1.07" vaporized=""/>
    <tripinfo id="bus_w2n_209" depart="209.00" departLane="w2sep_1" departPos="12.10" departPosLat="0.00" departSpeed="13.90" departDelay="0.00" arrival="395.20" arrivalLane="c2n_1" arrivalPos="990.00" arrivalPosLat="0.00" arrivalSpeed="13.90" duration="186.20" routeLength="1987.97" waitingTime="31.25" waitingCount="1" stopTime="0.00" timeLoss="42.49" rerouteNo="1" devices="tripinfo_bus_w2n_209 routing_bus_w2n_209" vType="Bus" speedFactor="1.00" vaporized=""/>
    <tripinfo id="car_w2n_224" depart="224.00" departLane="w2sep_1" departPos="3.60" departPosLat="0.00" departSpeed="13.90" departDelay="0.00" arrival="398.10" arrivalLane="c2n_1" arrivalPos="990.00" arrivalPosLat="0.00" arrivalSpeed="14.94" duration="174.10" routeLength="1996.47" waitingTime="19.05" waitingCount="1" stopTime="0.00" timeLoss="41.47" rerouteNo="1" devices="tripinfo_car_w2n_224 routing_car_w2n_224" vType="Car" speedFactor="1.09" vaporized=""/>
    <tripinfo id="car_w2n_231" depart="231.00" departLane="w2sep_1" departPos="3.60" departPosLat="0.00" departSpeed="13.90" departDelay="0.00" arrival="400.80" arrivalLane="c2n_1" arrivalPos="990.00" arrivalPosLat="0.00" arrivalSpeed="14.68" duration="169.80" routeLength="1996.47" waitingTime="15.55" waitingCount="1" stopTime="0.00" timeLoss="34.29" rerouteNo="1" devices="tripinfo_car_w2n_231 routing_car_w2n_231" vType="Car" speedFactor="1.07" vaporized=""/>
    <tripinfo id="car_w2n_234" depart="234.00" departLane="w2sep_1" departPos="3.60" departPosLat="0.00" departSpeed="13.90" departDelay="0.00" arrival="404.85" arrivalLane="c2n_1" arrivalPos="990.00" arrivalPosLat="0.00" arrivalSpeed="13.89" duration="170.85" routeLength="1996.47" waitingTime="9.55" waitingCount="1" stopTime="0.00" timeLoss="26.54" rerouteNo="1" devices="tripinfo_car_w2n_234 routing_car_w2n_234" vType="Car" speedFactor="1.00" vaporized=""/>
    <tripinfo id="amb_w2e_300" depart="300.60" departLane="w2sep_1" departPos="6.60" departPosLat="0.00" departSpeed="13.90" departDelay="0.60" arrival="405.45" arrivalLane="c2e_1" arrivalPos="990.00" arrivalPosLat="-0.95" arrivalSpeed="20.70" duration="104.85" routeLength="1994.01" waitingTime="0.00" waitingCount="0" stopTime="0.00" timeLoss="9.19" rerouteNo="1" devices="tripinfo_amb_w2e_300 routing_amb_w2e_300 bluelight_amb_w2e_300 fcd_amb_w2e_300" vType="Ambulance" speedFactor="1.50" vaporized="">
        <example_device customValue1="0.00" customValue2="-1.00"/>
    </tripinfo>
    <tripinfo id="car_w2e_262" depart="262.00" departLane="w2sep_1" departPos="3.60" departPosLat="0.00" departSpeed="13.90" departDelay="0.00" arrival="406.65" arrivalLane="c2e_1" arrivalPos="990.00" arrivalPosLat="1.10" arrivalSpeed="14.13" duration="144.65" routeLength="1997.01" waitingTime="0.00" waitingCount="0" stopTime="0.00" timeLoss="3.35" rerouteNo="1" devices="tripinfo_car_w2e_262 routing_car_w2e_262" vType="Car@car_w2e_262" speedFactor="1.02" vaporized=""/>
    <tripinfo id="car_e2n_267" depart="267.00" departLane="e2sep_1" departPos="3.60" departPosLat="0.00" departSpeed="13.90" departDelay="0.00" arrival="407.00" arrivalLane="c2n_1" arrivalPos="990.00" arrivalPosLat="0.00" arrivalSpeed="14.87" duration="140.00" routeLength="1986.69" waitingTime="0.00" waitingCount="0" stopTime="0.00" timeLoss="9.18" rerouteNo="1" devices="tripinfo_car_e2n_267 routing_car_e2n_267" vType="Car" speedFactor="1.10" vaporized=""/>
    <tripinfo id="car_w2n_252" depart="252.00" departLane="w2sep_1" departPos="3.60" departPosLat="0.00" departSpeed="13.90" departDelay="0.00" arrival="410.60" arrivalLane="c2n_1" arrivalPos="990.00" arrivalPosLat="0.00" arrivalSpeed="14.35" duration="158.60" routeLength="1996.47" waitingTime="3.95" waitingCount="1" stopTime="0.00" timeLoss="19.07" rerouteNo="1" devices="tripinfo_car_w2n_252 routing_car_w2n_252" vType="Car" speedFactor="1.03" vaporized=""/>
    <tripinfo id="car_w2n_256" depart="256.00" departLane="w2sep_1" departPos="3.60" departPosLat="0.00" departSpeed="13.90" departDelay="0.00" arrival="413.35" arrivalLane="c2n_1" arrivalPos="990.00" arrivalPosLat="0.00" arrivalSpeed="14.68" duration="157.35" routeLength="1996.47" waitingTime="3.15" waitingCount="1" stopTime="0.00" timeLoss="21.83" rerouteNo="1" devices="tripinfo_car_w2n_256 routing_car_w2n_256" vType="Car" speedFactor="1.06" vaporized=""/>
    <tripinfo id="car_e2s_267" depart="268.30" departLane="e2sep_1" departPos="3.60" departPosLat="0.00" departSpeed="13.90" departDelay="1.30" arrival="415.85" arrivalLane="c2s_1" arrivalPos="990.00" arrivalPosLat="0.00" arrivalSpeed="14.03" duration="147.55" routeLength="1996.47" waitingTime="0.00" waitingCount="0" stopTime="0.00" timeLoss="4.53" rerouteNo="1" devices="tripinfo_car_e2s_267 routing_car_e2s_267" vType="Car" speedFactor="1.01" vaporized=""/>
    <tripinfo id="car_w2n_260" depart="260.00" departLane="w2sep_1" departPos="3.60" departPosLat="0.00" departSpeed="13.90" departDelay="0.00" arrival="418.00" arrivalLane="c2n_1" arrivalPos="990.00" arrivalPosLat="0.00" arrivalSpeed="13.89" duration="158.00" routeLength="1996.47" waitingTime="0.00" waitingCount="0" stopTime="0.00" timeLoss="13.68" rerouteNo="1" devices="tripinfo_car_w2n_260 routing_car_w2n_260" vType="Car" speedFactor="1.00" vaporized=""/>
    <tripinfo id="car_e2s_269" depart="270.05" departLane="e2sep_1" departPos="3.60" departPosLat="0.00" departSpeed="13.90" departDelay="1.05" arrival="418.25" arrivalLane="c2s_1" arrivalPos="990.00" arrivalPosLat="0.00" arrivalSpeed="14.99" duration="148.20" routeLength="1996.47" waitingTime="0.00" waitingCount="0" stopTime="0.00" timeLoss="16.54" rerouteNo="1" devices="tripinfo_car_e2s_269 routing_car_e2s_269" vType="Car" speedFactor="1.10" vaporized=""/>
    <tripinfo id="car_e2n_292" depart="292.00" departLane="e2sep_1" departPos="3.60" departPosLat="0.00" departSpeed="13.90" departDelay="0.00" arrival="426.70" arrivalLane="c2n_1" arrivalPos="990.00" arrivalPosLat="0.00" arrivalSpeed="15.33" duration="134.70" routeLength="1986.69" waitingTime="0.00" waitingCount="0" stopTime="0.00" timeLoss="4.45" rerouteNo="1" devices="tripinfo_car_e2n_292 routing_car_e2n_292" vType="Car" speedFactor="1.10" vaporized=""/>
    <tripinfo id="car_n2w_237" depart="237.00" departLane="n2sep_1" departPos="3.60" departPosLat="0.00" departSpeed="13.90" departDelay="0.00" arrival="448.60" arrivalLane="c2w_1" arrivalPos="990.00" arrivalPosLat="0.00" arrivalSpeed="13.90" duration="211.60" routeLength="1986.69" waitingTime="61.25" waitingCount="1" stopTime="0.00" timeLoss="67.95" rerouteNo="1" devices="tripinfo_car_n2w_237 routing_car_n2w_237" vType="Car" speedFactor="1.00" vaporized=""/>
    <tripinfo id="car_s2e_242" depart="242.00" departLane="s2sep_1" departPos="3.60" departPosLat="0.00" departSpeed="13.90" departDelay="0.00" arrival="448.65" arrivalLane="c2e_1" arrivalPos="990.00" arrivalPosLat="0.00" arrivalSpeed="13.90" duration="206.65" routeLength="1986.69" waitingTime="55.85" waitingCount="1" stopTime="0.00" timeLoss="62.95" rerouteNo="1" devices="tripinfo_car_s2e_242 routing_car_s2e_242" vType="Car" speedFactor="1.00" vaporized=""/>
    <tripinfo id="car_n2s_245" depart="245.00" departLane="n2sep_1" departPos="3.60" departPosLat="0.00" departSpeed="13.90" departDelay="0.00" arrival="449.85" arrivalLane="c2s_1" arrivalPos="990.00" arrivalPosLat="0.00" arrivalSpeed="14.09" duration="204.85" routeLength="1997.01" waitingTime="54.60" waitingCount="1" stopTime="0.00" timeLoss="63.14" rerouteNo="1" devices="tripinfo_car_n2s_245 routing_car_n2s_245" vType="Car" speedFactor="1.01" vaporized=""/>
    <tripinfo id="car_n2w_278" depart="278.00" departLane="n2sep_1" departPos="3.60" departPosLat="0.00" departSpeed="13.90" departDelay="0.00" arrival="450.45" arrivalLane="c2w_1" arrivalPos="990.00" arrivalPosLat="0.00" arrivalSpeed="15.49" duration="172.45" routeLength="1986.69" waitingTime="31.95" waitingCount="1" stopTime="0.00" timeLoss="50.41" rerouteNo="1" devices="tripinfo_car_n2w_278 routing_car_n2w_278" vType="Car" speedFactor="1.18" vaporized=""/>
    <tripinfo id="car_s2e_260" depart="260.00" departLane="s2sep_1" departPos="3.60" departPosLat="0.00" departSpeed="13.90" departDelay="0.00" arrival="450.50" arrivalLane="c2e_1" arrivalPos="990.00" arrivalPosLat="0.00" arrivalSpeed="15.42" duration="190.50" routeLength="1986.69" waitingTime="48.45" waitingCount="1" stopTime="0.00" timeLoss="67.58" rerouteNo="1" devices="tripinfo_car_s2e_260 routing_car_s2e_260" vType="Car" speedFactor="1.17" vaporized=""/>
    <tripinfo id="car_s2e_271" depart="271.00" departLane="s2sep_1" departPos="3.60" departPosLat="0.00" departSpeed="13.90" departDelay="0.00" arrival="452.85" arrivalLane="c2e_1" arrivalPos="990.00" arrivalPosLat="0.00" arrivalSpeed="14.99" duration="181.85" routeLength="1986.69" waitingTime="34.80" waitingCount="1" stopTime="0.00" timeLoss="50.75" rerouteNo="1" devices="tripinfo_car_s2e_271 routing_car_s2e_271" vType="Car" speedFactor="1.10" vaporized=""/>
    <tripinfo id="car_n2w_290" depart="290.00" departLane="n2sep_1" departPos="3.60" departPosLat="0.00" departSpeed="13.90" departDelay="0.00" arrival="453.50" arrivalLane="c2w_1" arrivalPos="990.00" arrivalPosLat="0.00" arrivalSpeed="14.81" duration="163.50" routeLength="1986.69" waitingTime="13.05" waitingCount="1" stopTime="0.00" timeLoss="29.33" rerouteNo="1" devices="tripinfo_car_n2w_290 routing_car_n2w_290" vType="Car" speedFactor="1.07" vaporized=""/>
    <tripinfo id="car_s2n_293" depart="293.00" departLane="s2sep_1" departPos="3.60" departPosLat="0.00" departSpeed="13.90" departDelay="0.00" arrival="453.85" arrivalLane="c2n_1" arrivalPos="990.00" arrivalPosLat="0.00" arrivalSpeed="14.23" duration="160.85" routeLength="1997.01" waitingTime="6.90" waitingCount="1" stopTime="0.00" timeLoss="20.42" rerouteNo="1" devices="tripinfo_car_s2n_293 routing_car_s2n_293" vType="Car" speedFactor="1.02" vaporized=""/>
    <tripinfo id="car_s2e_297" depart="297.00" departLane="s2sep_1" departPos="3.60" departPosLat="0.00" departSpeed="13.90" departDelay="0.00" arrival="454.85" arrivalLane="c2e_1" arrivalPos="990.00" arrivalPosLat="0.00" arrivalSpeed="15.48" duration="157.85" routeLength="1986.69" waitingTime="6.30" waitingCount="1" stopTime="0.00" timeLoss="33.24" rerouteNo="1" devices="tripinfo_car_s2e_297 routing_car_s2e_297" vType="Car" speedFactor="1.15" vaporized=""/>
    <tripinfo id="car_n2s_293" depart="293.00" departLane="n2sep_1" departPos="3.60" departPosLat="0.00" departSpeed="13.90" departDelay="0.00" arrival="455.95" arrivalLane="c2s_1" arrivalPos="990.00" arrivalPosLat="0.00" arrivalSpeed="14.33" duration="162.95" routeLength="1997.01" waitingTime="10.35" waitingCount="1" stopTime="0.00" timeLoss="23.64" rerouteNo="1" devices="tripinfo_car_n2s_293 routing_car_n2s_293" vType="Car" speedFactor="1.03" vaporized=""/>
    <tripinfo id="car_n2w_315" depart="315.00" departLane="n2sep_1" departPos="3.60" departPosLat="0.00" departSpeed="13.90" departDelay="0.00" arrival="460.85" arrivalLane="c2w_1" arrivalPos="990.00" arrivalPosLat="0.00" arrivalSpeed="14.23" duration="145.85" routeLength="1986.69" waitingTime="0.00" waitingCount="0" stopTime="0.00" timeLoss="5.52" rerouteNo="1" devices="tripinfo_car_n2w_315 routing_car_n2w_315" vType="Car" speedFactor="1.02" vaporized=""/>
    <tripinfo id="car_n2s_300" depart="300.00" departLane="n2sep_1" departPos="3.60" departPosLat="0.00" departSpeed="13.90" departDelay="0.00" arrival="461.25" arrivalLane="c2s_1" arrivalPos="990.00" arrivalPosLat="0.00" arrivalSpeed="13.90" duration="161.25" routeLength="1997.01" waitingTime="3.15" waitingCount="1" stopTime="0.00" timeLoss="17.56" rerouteNo="1" devices="tripinfo_car_n2s_300 routing_car_n2s_300" vType="Car" speedFactor="1.00" vaporized=""/>
    <tripinfo id="car_n2e_286" depart="286.00" departLane="n2sep_1" departPos="3.60" departPosLat="0.00" departSpeed="13.90" departDelay="0.00" arrival="461.55" arrivalLane="c2e_1" arrivalPos="990.00" arrivalPosLat="0.00" arrivalSpeed="13.94" duration="175.55" routeLength="1996.47" waitingTime="20.05" waitingCount="2" stopTime="0.00" timeLoss="31.69" rerouteNo="1" devices="tripinfo_car_n2e_286 routing_car_n2e_286" vType="Car" speedFactor="1.00" vaporized=""/>
    <tripinfo id="car_n2e_295" depart="295.00" departLane="n2sep_1" departPos="3.60" departPosLat="0.00" departSpeed="13.90" departDelay="0.00" arrival="464.20" arrivalLane="c2e_1" arrivalPos="990.00" arrivalPosLat="0.00" arrivalSpeed="14.60" duration="169.20" routeLength="1996.47" waitingTime="10.70" waitingCount="2" stopTime="0.00" timeLoss="33.16" rerouteNo="1" devices="tripinfo_car_n2e_295 routing_car_n2e_295" vType="Car" speedFactor="1.06" vaporized=""/>
    <tripinfo id="car_s2w_282" depart="282.00" departLane="s2sep_1" departPos="3.60" departPosLat="0.00" departSpeed="13.90" departDelay="0.00" arrival="466.25" arrivalLane="c2w_1" arrivalPos="990.00" arrivalPosLat="0.00" arrivalSpeed="13.96" duration="184.25" routeLength="1996.47" waitingTime="28.30" waitingCount="2" stopTime="0.00" timeLoss="40.54" rerouteNo="1" devices="tripinfo_car_s2w_282 routing_car_s2w_282" vType="Car" speedFactor="1.00" vaporized=""/>
    <tripinfo id="car_n2s_324" depart="324.00" departLane="n2sep_1" departPos="3.60" departPosLat="0.00" departSpeed="13.90" departDelay="0.00" arrival="468.75" arrivalLane="c2s_1" arrivalPos="990.00" arrivalPosLat="0.00" arrivalSpeed="13.90" duration="144.75" routeLength="1997.01" waitingTime="0.00" waitingCount="0" stopTime="0.00" timeLoss="1.07" rerouteNo="1" devices="tripinfo_car_n2s_324 routing_car_n2s_324" vType="Car" speedFactor="1.00" vaporized=""/>
    <tripinfo id="car_s2e_323" depart="323.00" departLane="s2sep_1" departPos="3.60" departPosLat="0.00" departSpeed="13.90" departDelay="0.00" arrival="470.40" arrivalLane="c2e_1" arrivalPos="990.00" arrivalPosLat="0.00" arrivalSpeed="13.95" duration="147.40" routeLength="1986.69" waitingTime="0.00" waitingCount="0" stopTime="0.00" timeLoss="4.32" rerouteNo="1" devices="tripinfo_car_s2e_323 routing_car_s2e_323" vType="Car" speedFactor="1.00" vaporized=""/>
    <tripinfo id="car_n2s_329" depart="329.00" departLane="n2sep_1" departPos="3.60" departPosLat="0.00" departSpeed="13.90" departDelay="0.00" arrival="470.65" arrivalLane="c2s_1" arrivalPos="990.00" arrivalPosLat="0.00" arrivalSpeed="15.40" duration="141.65" routeLength="1997.01" waitingTime="0.00" waitingCount="0" stopTime="0.00" timeLoss="18.22" rerouteNo="1" devices="tripinfo_car_n2s_329 routing_car_n2s_329" vType="Car" speedFactor="1.16" vaporized=""/>
</tripinfos>
