<?xml version="1.0" encoding="UTF-8"?>

<!-- generated on Sat Apr 24 18:06:25 2021 by Eclipse SUMO Version 1.4.0
<configuration xmlns:xsi="http://www.w3.org/2001/XMLSchema-instance" xsi:noNamespaceSchemaLocation="http://sumo.dlr.de/xsd/sumoConfiguration.xsd">

    <input>
        <net-file value="sumofiles/junction.net.xml"/>
        <route-files value="sumofiles/junction_preemption_46.rou.xml"/>
        <additional-files value="sumofiles/junction.det.xml"/>
    </input>

    <output>
        <tripinfo-output value="sumofiles/output/tripinfo_preemption_46.xml"/>
    </output>

    <time>
        <begin value="0"/>
        <end value="10000"/>
        <step-length value="0.05"/>
    </time>

    <processing>
        <lateral-resolution value="0.1"/>
    </processing>

    <report>
        <no-warnings value="true"/>
        <error-log value="sumofiles/output/errorlog_preemption_46.log"/>
        <no-step-log value="true"/>
    </report>

    <traci_server>
        <remote-port value="59191"/>
    </traci_server>

    <gui_only>
        <gui-settings-file value="sumofiles/junction-gui.settings.xml"/>
        <tracker-interval value="0.05"/>
    </gui_only>

</configuration>
-->

<tripinfos xmlns:xsi="http://www.w3.org/2001/XMLSchema-instance" xsi:noNamespaceSchemaLocation="http://sumo.dlr.de/xsd/tripinfo_file.xsd">
    <tripinfo id="car_w2n_5" depart="5.00" departLane="w2sep_1" departPos="3.60" departPosLat="0.00" departSpeed="13.90" departDelay="0.00" arrival="147.25" arrivalLane="c2n_1" arrivalPos="990.00" arrivalPosLat="0.00" arrivalSpeed="14.73" duration="142.25" routeLength="1996.47" waitingTime="0.00" waitingCount="0" stopTime="0.00" timeLoss="6.07" rerouteNo="1" devices="tripinfo_car_w2n_5 routing_car_w2n_5" vType="Car" speedFactor="1.06" vaporized=""/>
    <tripinfo id="car_e2w_5" depart="5.00" departLane="e2sep_1" departPos="3.60" departPosLat="0.00" departSpeed="13.90" departDelay="0.00" arrival="147.25" arrivalLane="c2w_1" arrivalPos="990.00" arrivalPosLat="0.00" arrivalSpeed="14.04" duration="142.25" routeLength="1997.01" waitingTime="0.00" waitingCount="0" stopTime="0.00" timeLoss="0.06" rerouteNo="1" devices="tripinfo_car_e2w_5 routing_car_e2w_5" vType="Car" speedFactor="1.01" vaporized=""/>
    <tripinfo id="car_s2n_7" depart="7.00" departLane="s2sep_1" departPos="3.60" departPosLat="0.00" departSpeed="13.90" departDelay="0.00" arrival="160.50" arrivalLane="c2n_1" arrivalPos="990.00" arrivalPosLat="0.00" arrivalSpeed="15.05" duration="153.50" routeLength="1997.01" waitingTime="13.05" waitingCount="1" stopTime="0.00" timeLoss="20.78" rerouteNo="1" devices="tripinfo_car_s2n_7 routing_car_s2n_7" vType="Car" speedFactor="1.08" vaporized=""/>
    <tripinfo id="car_n2w_24" depart="24.00" departLane="n2sep_1" departPos="3.60" departPosLat="0.00" departSpeed="13.90" departDelay="0.00" arrival="167.05" arrivalLane="c2w_1" arrivalPos="990.00" arrivalPosLat="0.00" arrivalSpeed="15.05" duration="143.05" routeLength="1986.69" waitingTime="0.00" waitingCount="0" stopTime="0.00" timeLoss="10.34" rerouteNo="1" devices="tripinfo_car_n2w_24 routing_car_n2w_24" vType="Car" speedFactor="1.08" vaporized=""/>
    <tripinfo id="car_s2e_10" depart="10.00" departLane="s2sep_1" departPos="3.60" departPosLat="0.00" departSpeed="13.90" departDelay="0.00" arrival="167.95" arrivalLane="c2e_1" arrivalPos="990.00" arrivalPosLat="0.00" arrivalSpeed="13.90" duration="157.95" routeLength="1986.69" waitingTime="5.35" waitingCount="1" stopTime="0.00" timeLoss="14.30" rerouteNo="1" devices="tripinfo_car_s2e_10 routing_car_s2e_10" vType="Car" speedFactor="1.00" vaporized=""/>
    <tripinfo id="bus_n2s_2" depart="2.00" departLane="n2sep_1" departPos="12.10" departPosLat="0.00" departSpeed="13.90" departDelay="0.00" arrival="169.20" arrivalLane="c2s_1" arrivalPos="990.00" arrivalPosLat="0.00" arrivalSpeed="13.90" duration="167.20" routeLength="1988.51" waitingTime="12.10" waitingCount="1" stopTime="0.00" timeLoss="24.11" rerouteNo="1" devices="tripinfo_bus_n2s_2 routing_bus_n2s_2" vType="Bus" speedFactor="1.00" vaporized=""/>
    <tripinfo id="car_s2e_24" depart="24.00" departLane="s2sep_1" departPos="3.60" departPosLat="0.00" departSpeed="13.90" departDelay="0.00" arrival="171.40" arrivalLane="c2e_1" arrivalPos="990.00" arrivalPosLat="0.00" arrivalSpeed="14.28" duration="147.40" routeLength="1986.69" waitingTime="0.00" waitingCount="0" stopTime="0.00" timeLoss="7.94" rerouteNo="1" devices="tripinfo_car_s2e_24 routing_car_s2e_24" vType="Car" speedFactor="1.03" vaporized=""/>
    <tripinfo id="car_n2s_9" depart="9.00" departLane="n2sep_1" departPos="3.60" departPosLat="0.00" departSpeed="13.90" departDelay="0.00" arrival="173.10" arrivalLane="c2s_1" arrivalPos="990.00" arrivalPosLat="0.00" arrivalSpeed="14.29" duration="164.10" routeLength="1997.01" waitingTime="9.05" waitingCount="1" stopTime="0.00" timeLoss="24.62" rerouteNo="1" devices="tripinfo_car_n2s_9 routing_car_n2s_9" vType="Car" speedFactor="1.03" vaporized=""/>
    <tripinfo id="car_n2e_0" depart="0.00" departLane="n2sep_1" departPos="3.60" departPosLat="0.00" departSpeed="13.90" departDelay="0.00" arrival="174.10" arrivalLane="c2e_1" arrivalPos="990.00" arrivalPosLat="0.00" arrivalSpeed="14.60" duration="174.10" routeLength="1996.47" waitingTime="22.45" waitingCount="2" stopTime="0.00" timeLoss="37.91" rerouteNo="1" devices="tripinfo_car_n2e_0 routing_car_n2e_0" vType="Car" speedFactor="1.06" vaporized=""/>
    <tripinfo id="car_s2w_20" depart="20.00" departLane="s2sep_1" departPos="3.60" departPosLat="0.00" departSpeed="13.90" departDelay="0.00" arrival="174.50" arrivalLane="c2w_1" arrivalPos="990.00" arrivalPosLat="0.00" arrivalSpeed="14.54" duration="154.50" routeLength="1996.47" waitingTime="7.35" waitingCount="1" stopTime="0.00" timeLoss="16.47" rerouteNo="1" devices="tripinfo_car_s2w_20 routing_car_s2w_20" vType="Car" speedFactor="1.05" vaporized=""/>
    <tripinfo id="car_n2s_26" depart="26.00" departLane="n2sep_1" departPos="3.60" departPosLat="0.00" departSpeed="13.90" departDelay="0.00" arrival="175.40" arrivalLane="c2s_1" arrivalPos="990.00" arrivalPosLat="0.00" arrivalSpeed="14.88" duration="149.40" routeLength="1997.01" waitingTime="0.00" waitingCount="0" stopTime="0.00" timeLoss="17.63" rerouteNo="1" devices="tripinfo_car_n2s_26 routing_car_n2s_26" vType="Car" speedFactor="1.09" vaporized=""/>
    <tripinfo id="car_n2e_21" depart="21.00" departLane="n2sep_1" departPos="3.60" departPosLat="0.00" departSpeed="13.90" departDelay="0.00" arrival="177.95" arrivalLane="c2e_1" arrivalPos="990.00" arrivalPosLat="0.00" arrivalSpeed="14.03" duration="156.95" routeLength="1996.47" waitingTime="2.80" waitingCount="1" stopTime="0.00" timeLoss="14.13" rerouteNo="1" devices="tripinfo_car_n2e_21 routing_car_n2e_21" vType="Car" speedFactor="1.01" vaporized=""/>
    <tripinfo id="car_s2w_34" depart="34.00" departLane="s2sep_1" departPos="3.60" departPosLat="0.00" departSpeed="13.90" departDelay="0.00" arrival="182.25" arrivalLane="c2w_1" arrivalPos="990.00" arrivalPosLat="0.00" arrivalSpeed="13.90" duration="148.25" routeLength="1996.47" waitingTime="0.00" waitingCount="0" stopTime="0.00" timeLoss="3.93" rerouteNo="1" devices="tripinfo_car_s2w_34 routing_car_s2w_34" vType="Car" speedFactor="1.00" vaporized=""/>
    <tripinfo id="car_s2e_40" depart="40.00" departLane="s2sep_1" departPos="3.60" departPosLat="0.00" departSpeed="13.90" departDelay="0.00" arrival="182.85" arrivalLane="c2e_1" arrivalPos="990.00" arrivalPosLat="0.00" arrivalSpeed="14.53" duration="142.85" routeLength="1986.69" waitingTime="0.00" waitingCount="0" stopTime="0.00" timeLoss="5.45" rerouteNo="1" devices="tripinfo_car_s2e_40 routing_car_s2e_40" vType="Car" speedFactor="1.05" vaporized=""/>
    <tripinfo id="car_n2s_44" depart="44.00" departLane="n2sep_1" departPos="3.60" departPosLat="0.00" departSpeed="13.90" departDelay="0.00" arrival="187.95" arrivalLane="c2s_1" arrivalPos="990.00" arrivalPosLat="0.00" arrivalSpeed="13.90" duration="143.95" routeLength="1997.01" waitingTime="0.00" waitingCount="0" stopTime="0.00" timeLoss="0.28" rerouteNo="1" devices="tripinfo_car_n2s_44 routing_car_n2s_44" vType="Car" speedFactor="1.00" vaporized=""/>
    <tripinfo id="car_s2w_62" depart="62.00" departLane="s2sep_1" departPos="3.60" departPosLat="0.00" departSpeed="13.90" departDelay="0.00" arrival="203.35" arrivalLane="c2w_1" arrivalPos="990.00" arrivalPosLat="0.00" arrivalSpeed="14.55" duration="141.35" routeLength="1996.47" waitingTime="0.00" waitingCount="0" stopTime="0.00" timeLoss="3.51" rerouteNo="1" devices="tripinfo_car_s2w_62 routing_car_s2w_62" vType="Car" speedFactor="1.05" vaporized=""/>
    <tripinfo id="car_n2e_61" depart="61.00" departLane="n2sep_1" departPos="3.60" departPosLat="0.00" departSpeed="13.90" departDelay="0.00" arrival="205.05" arrivalLane="c2e_1" arrivalPos="990.00" arrivalPosLat="0.00" arrivalSpeed="14.27" duration="144.05" routeLength="1996.47" waitingTime="0.00" waitingCount="0" stopTime="0.00" timeLoss="3.42" rerouteNo="1" devices="tripinfo_car_n2e_61 routing_car_n2e_61" vType="Car" speedFactor="1.03" vaporized=""/>
    <tripinfo id="car_w2e_34" depart="34.00" departLane="w2sep_1" departPos="3.60" departPosLat="0.00" departSpeed="13.90" departDelay="0.00" arrival="207.35" arrivalLane="c2e_1" arrivalPos="990.00" arrivalPosLat="0.00" arrivalSpeed="15.30" duration="173.35" routeLength="1997.01" waitingTime="30.75" waitingCount="1" stopTime="0.00" timeLoss="45.40" rerouteNo="1" devices="tripinfo_car_w2e_34 routing_car_w2e_34" vType="Car" speedFactor="1.12" vaporized=""/>
    <tripinfo id="car_w2n_30" depart="30.00" departLane="w2sep_1" departPos="3.60" departPosLat="0.00" departSpeed="13.90" departDelay="0.00" arrival="208.60" arrivalLane="c2n_1" arrivalPos="990.00" arrivalPosLat="0.00" arrivalSpeed="14.55" duration="178.60" routeLength="1996.47" waitingTime="33.15" waitingCount="1" stopTime="0.00" timeLoss="40.79" rerouteNo="1" devices="tripinfo_car_w2n_30 routing_car_w2n_30" vType="Car" speedFactor="1.05" vaporized=""/>
    <tripinfo id="car_w2e_52" depart="52.00" departLane="w2sep_1" departPos="3.60" departPosLat="0.00" departSpeed="13.90" departDelay="0.00" arrival="209.55" arrivalLane="c2e_1" arrivalPos="990.00" arrivalPosLat="0.00" arrivalSpeed="15.71" duration="157.55" routeLength="1997.01" waitingTime="10.35" waitingCount="1" stopTime="0.00" timeLoss="33.47" rerouteNo="1" devices="tripinfo_car_w2e_52 routing_car_w2e_52" vType="Car" speedFactor="1.16" vaporized=""/>
    <tripinfo id="car_w2s_42" depart="42.00" departLane="w2sep_1" departPos="3.60" departPosLat="0.00" departSpeed="13.90" departDelay="0.00" arrival="213.00" arrivalLane="c2s_1" arrivalPos="990.00" arrivalPosLat="0.00" arrivalSpeed="13.90" duration="171.00" routeLength="1986.69" waitingTime="18.75" waitingCount="1" stopTime="0.00" timeLoss="27.33" rerouteNo="1" devices="tripinfo_car_w2s_42 routing_car_w2s_42" vType="Car" speedFactor="1.00" vaporized=""/>
    <tripinfo id="car_w2s_81" depart="81.00" departLane="w2sep_1" departPos="3.60" departPosLat="0.00" departSpeed="13.90" departDelay="0.00" arrival="214.80" arrivalLane="c2s_1" arrivalPos="990.00" arrivalPosLat="0.00" arrivalSpeed="15.47" duration="133.80" routeLength="1986.69" waitingTime="0.00" waitingCount="0" stopTime="0.00" timeLoss="11.91" rerouteNo="1" devices="tripinfo_car_w2s_81 routing_car_w2s_81" vType="Car" speedFactor="1.18" vaporized=""/>
    <tripinfo id="car_w2n_50" depart="50.00" departLane="w2sep_1" departPos="3.60" departPosLat="0.00" departSpeed="13.90" departDelay="0.00" arrival="215.40" arrivalLane="c2n_1" arrivalPos="990.00" arrivalPosLat="0.00" arrivalSpeed="13.90" duration="165.40" routeLength="1996.47" waitingTime="10.65" waitingCount="1" stopTime="0.00" timeLoss="21.05" rerouteNo="1" devices="tripinfo_car_w2n_50 routing_car_w2n_50" vType="Car" speedFactor="1.00" vaporized=""/>
    <tripinfo id="car_w2e_54" depart="54.00" departLane="w2sep_1" departPos="3.60" departPosLat="0.00" departSpeed="13.90" departDelay="0.00" arrival="216.45" arrivalLane="c2e_1" arrivalPos="990.00" arrivalPosLat="0.00" arrivalSpeed="14.15" duration="162.45" routeLength="1997.01" waitingTime="7.90" waitingCount="1" stopTime="0.00" timeLoss="21.34" rerouteNo="1" devices="tripinfo_car_w2e_54 routing_car_w2e_54" vType="Car" speedFactor="1.02" vaporized=""/>
    <tripinfo id="car_w2n_58" depart="58.00" departLane="w2sep_1" departPos="3.60" departPosLat="0.00" departSpeed="13.90" departDelay="0.00" arrival="217.65" arrivalLane="c2n_1" arrivalPos="990.00" arrivalPosLat="0.00" arrivalSpeed="14.85" duration="159.65" routeLength="1996.47" waitingTime="4.50" waitingCount="1" stopTime="0.00" timeLoss="27.32" rerouteNo="1" devices="tripinfo_car_w2n_58 routing_car_w2n_58" vType="Car" speedFactor="1.09" vaporized=""/>
    <tripinfo id="car_e2w_76" depart="76.00" departLane="e2sep_1" departPos="3.60" departPosLat="0.00" departSpeed="13.90" departDelay="0.00" arrival="220.10" arrivalLane="c2w_1" arrivalPos="990.00" arrivalPosLat="0.00" arrivalSpeed="13.90" duration="144.10" routeLength="1997.01" waitingTime="0.00" waitingCount="0" stopTime="0.00" timeLoss="0.41" rerouteNo="1" devices="tripinfo_car_e2w_76 routing_car_e2w_76" vType="Car" speedFactor="1.00" vaporized=""/>
    <tripinfo id="car_e2s_29" depart="29.00" departLane="e2sep_1" departPos="3.60" departPosLat="0.00" departSpeed="13.90" departDelay="0.00" arrival="220.70" arrivalLane="c2s_1" arrivalPos="990.00" arrivalPosLat="0.00" arrivalSpeed="14.26" duration="191.70" routeLength="1996.47" waitingTime="38.35" waitingCount="2" stopTime="0.00" timeLoss="51.05" rerouteNo="1" devices="tripinfo_car_e2s_29 routing_car_e2s_29" vType="Car" speedFactor="1.03" vaporized=""/>
    <tripinfo id="car_e2s_57" depart="57.00" departLane="e2sep_1" departPos="3.60" departPosLat="0.00" departSpeed="13.90" departDelay="0.00" arrival="225.30" arrivalLane="c2s_1" arrivalPos="990.00" arrivalPosLat="0.00" arrivalSpeed="14.03" duration="168.30" routeLength="1996.47" waitingTime="9.15" waitingCount="2" stopTime="0.00" timeLoss="25.40" rerouteNo="1" devices="tripinfo_car_e2s_57 routing_car_e2s_57" vType="Car" speedFactor="1.01" vaporized=""/>
    <tripinfo id="car_e2w_103" depart="103.00" departLane="e2sep_1" departPos="3.60" departPosLat="0.00" departSpeed="13.90" departDelay="0.00" arrival="227.85" arrivalLane="c2w_1" arrivalPos="990.00" arrivalPosLat="0.00" arrivalSpeed="16.10" duration="124.85" routeLength="1997.01" waitingTime="0.00" waitingCount="0" stopTime="0.00" timeLoss="0.79" rerouteNo="1" devices="tripinfo_car_e2w_103 routing_car_e2w_103" vType="Car" speedFactor="1.16" vaporized=""/>
    <tripinfo id="car_w2n_87" depart="87.00" departLane="w2sep_1" departPos="3.60" departPosLat="0.00" departSpeed="13.90" departDelay="0.00" arrival="234.75" arrivalLane="c2n_1" arrivalPos="990.00" arrivalPosLat="0.00" arrivalSpeed="13.90" duration="147.75" routeLength="1996.47" waitingTime="0.00" waitingCount="0" stopTime="0.00" timeLoss="3.40" rerouteNo="1" devices="tripinfo_car_w2n_87 routing_car_w2n_87" vType="Car" speedFactor="1.00" vaporized=""/>
    <tripinfo id="car_w2n_88" depart="88.45" departLane="w2sep_1" departPos="3.60" departPosLat="0.00" departSpeed="13.90" departDelay="0.45" arrival="239.95" arrivalLane="c2n_1" arrivalPos="990.00" arrivalPosLat="0.00" arrivalSpeed="14.17" duration="151.50" routeLength="1996.47" waitingTime="0.00" waitingCount="0" stopTime="0.00" timeLoss="9.95" rerouteNo="1" devices="tripinfo_car_w2n_88 routing_car_w2n_88" vType="Car" speedFactor="1.02" vaporized=""/>
    <tripinfo id="car_n2s_82" depart="82.00" departLane="n2sep_1" departPos="3.60" departPosLat="0.00" departSpeed="13.90" departDelay="0.00" arrival="248.50" arrivalLane="c2s_1" arrivalPos="990.00" arrivalPosLat="0.00" arrivalSpeed="16.05" duration="166.50" routeLength="1997.01" waitingTime="32.70" waitingCount="1" stopTime="0.00" timeLoss="42.05" rerouteNo="1" devices="tripinfo_car_n2s_82 routing_car_n2s_82" vType="Car" speedFactor="1.15" vaporized=""/>
    <tripinfo id="car_w2n_106" depart="106.00" departLane="w2sep_1" departPos="3.60" departPosLat="0.00" departSpeed="13.90" departDelay="0.00" arrival="249.75" arrivalLane="c2n_1" arrivalPos="990.00" arrivalPosLat="0.00" arrivalSpeed="14.32" duration="143.75" routeLength="1996.47" waitingTime="0.00" waitingCount="0" stopTime="0.00" timeLoss="3.68" rerouteNo="1" devices="tripinfo_car_w2n_106 routing_car_w2n_106" vType="Car" speedFactor="1.03" vaporized=""/>
    <tripinfo id="car_n2s_86" depart="86.00" departLane="n2sep_1" departPos="3.60" departPosLat="0.00" departSpeed="13.90" departDelay="0.00" arrival="252.10" arrivalLane="c2s_1" arrivalPos="990.00" arrivalPosLat="0.00" arrivalSpeed="16.24" duration="166.10" routeLength="1997.01" waitingTime="30.00" waitingCount="1" stopTime="0.00" timeLoss="43.49" rerouteNo="1" devices="tripinfo_car_n2s_86 routing_car_n2s_86" vType="Car" speedFactor="1.17" vaporized=""/>
    <tripinfo id="car_s2n_74" depart="74.00" departLane="s2sep_1" departPos="3.60" departPosLat="0.00" departSpeed="13.90" departDelay="0.00" arrival="252.25" arrivalLane="c2n_1" arrivalPos="990.00" arrivalPosLat="0.00" arrivalSpeed="15.49" duration="178.25" routeLength="1997.01" waitingTime="38.05" waitingCount="1" stopTime="0.00" timeLoss="51.28" rerouteNo="1" devices="tripinfo_car_s2n_74 routing_car_s2n_74" vType="Car" speedFactor="1.13" vaporized=""/>
    <tripinfo id="car_n2w_65" depart="65.00" departLane="n2sep_1" departPos="3.60" departPosLat="0.00" departSpeed="13.90" departDelay="0.00" arrival="255.65" arrivalLane="c2w_1" arrivalPos="990.00" arrivalPosLat="0.00" arrivalSpeed="13.90" duration="190.65" routeLength="1986.69" waitingTime="38.20" waitingCount="1" stopTime="0.00" timeLoss="46.96" rerouteNo="1" devices="tripinfo_car_n2w_65 routing_car_n2w_65" vType="Car" speedFactor="1.00" vaporized=""/>
    <tripinfo id="car_s2e_65" depart="65.00" departLane="s2sep_1" departPos="3.60" departPosLat="0.00" departSpeed="13.90" departDelay="0.00" arrival="255.65" arrivalLane="c2e_1" arrivalPos="990.00" arrivalPosLat="0.00" arrivalSpeed="13.90" duration="190.65" routeLength="1986.69" waitingTime="39.20" waitingCount="1" stopTime="0.00" timeLoss="46.95" rerouteNo="1" devices="tripinfo_car_s2e_65 routing_car_s2e_65" vType="Car" speedFactor="1.00" vaporized=""/>
    <tripinfo id="car_s2n_113" depart="113.00" departLane="s2sep_1" departPos="3.60" departPosLat="0.00" departSpeed="13.90" departDelay="0.00" arrival="257.35" arrivalLane="c2n_1" arrivalPos="990.00" arrivalPosLat="0.00" arrivalSpeed="15.12" duration="144.35" routeLength="1997.01" waitingTime="0.00" waitingCount="0" stopTime="0.00" timeLoss="12.27" rerouteNo="1" devices="tripinfo_car_s2n_113 routing_car_s2n_113" vType="Car" speedFactor="1.09" vaporized=""/>
    <tripinfo id="car_n2w_100" depart="100.00" departLane="n2sep_1" departPos="3.60" departPosLat="0.00" departSpeed="13.90" departDelay="0.00" arrival="258.20" arrivalLane="c2w_1" arrivalPos="990.00" arrivalPosLat="0.00" arrivalSpeed="15.12" duration="158.20" routeLength="1986.69" waitingTime="14.30" waitingCount="1" stopTime="0.00" timeLoss="27.86" rerouteNo="1" devices="tripinfo_car_n2w_100 routing_car_n2w_100" vType="Car" speedFactor="1.10" vaporized=""/>
    <tripinfo id="car_s2e_88" depart="88.00" departLane="s2sep_1" departPos="3.60" departPosLat="0.00" departSpeed="13.90" departDelay="0.00" arrival="261.25" arrivalLane="c2e_1" arrivalPos="990.00" arrivalPosLat="0.00" arrivalSpeed="13.90" duration="173.25" routeLength="1986.69" waitingTime="18.60" waitingCount="1" stopTime="0.00" timeLoss="29.58" rerouteNo="1" devices="tripinfo_car_s2e_88 routing_car_s2e_88" vType="Car" speedFactor="1.00" vaporized=""/>
    <tripinfo id="car_n2e_63" depart="63.00" departLane="n2sep_1" departPos="3.60" departPosLat="0.00" departSpeed="13.90" departDelay="0.00" arrival="263.45" arrivalLane="c2e_1" arrivalPos="990.00" arrivalPosLat="0.00" arrivalSpeed="15.22" duration="200.45" routeLength="1996.47" waitingTime="51.75" waitingCount="2" stopTime="0.00" timeLoss="71.93" rerouteNo="1" devices="tripinfo_car_n2e_63 routing_car_n2e_63" vType="Car" speedFactor="1.12" vaporized=""/>
    <tripinfo id="car_n2e_92" depart="92.00" departLane="n2sep_1" departPos="3.60" departPosLat="0.00" departSpeed="13.90" departDelay="0.00" arrival="265.45" arrivalLane="c2e_1" arrivalPos="990.00" arrivalPosLat="0.00" arrivalSpeed="15.81" duration="173.45" routeLength="1996.47" waitingTime="30.50" waitingCount="2" stopTime="0.00" timeLoss="51.12" rerouteNo="1" devices="tripinfo_car_n2e_92 routing_car_n2e_92" vType="Car" speedFactor="1.18" vaporized=""/>
    <tripinfo id="car_s2n_120" depart="120.00" departLane="s2sep_1" departPos="3.60" departPosLat="0.00" departSpeed="13.90" departDelay="0.00" arrival="265.60" arrivalLane="c2n_1" arrivalPos="990.00" arrivalPosLat="0.00" arrivalSpeed="13.90" duration="145.60" routeLength="1997.01" waitingTime="0.00" waitingCount="0" stopTime="0.00" timeLoss="1.92" rerouteNo="1" devices="tripinfo_car_s2n_120 routing_car_s2n_120" vType="Car" speedFactor="1.00" vaporized=""/>
    <tripinfo id="car_n2w_118" depart="118.00" departLane="n2sep_1" departPos="3.60" departPosLat="0.00" departSpeed="13.90" departDelay="0.00" arrival="266.30" arrivalLane="c2w_1" arrivalPos="990.00" arrivalPosLat="0.00" arrivalSpeed="13.90" duration="148.30" routeLength="1986.69" waitingTime="0.00" waitingCount="0" stopTime="0.00" timeLoss="4.62" rerouteNo="1" devices="tripinfo_car_n2w_118 routing_car_n2w_118" vType="Car" speedFactor="1.00" vaporized=""/>
    <tripinfo id="car_n2w_120" depart="120.00" departLane="n2sep_1" departPos="3.60" departPosLat="0.00" departSpeed="13.90" departDelay="0.00" arrival="271.00" arrivalLane="c2w_1" arrivalPos="990.00" arrivalPosLat="0.00" arrivalSpeed="13.89" duration="151.00" routeLength="1986.69" waitingTime="0.00" waitingCount="0" stopTime="0.00" timeLoss="7.33" rerouteNo="1" devices="tripinfo_car_n2w_120 routing_car_n2w_120" vType="Car" speedFactor="1.00" vaporized=""/>
    <tripinfo id="car_s2e_136" depart="136.00" departLane="s2sep_1" departPos="3.60" departPosLat="0.00" departSpeed="13.90" departDelay="0.00" arrival="272.60" arrivalLane="c2e_1" arrivalPos="990.00" arrivalPosLat="0.00" arrivalSpeed="15.73" duration="136.60" routeLength="1986.69" waitingTime="0.00" waitingCount="0" stopTime="0.00" timeLoss="9.70" rerouteNo="1" devices="tripinfo_car_s2e_136 routing_car_s2e_136" vType="Car" speedFactor="1.13" vaporized=""/>
    <tripinfo id="car_s2n_130" depart="130.00" departLane="s2sep_1" departPos="3.60" departPosLat="0.00" departSpeed="13.90" departDelay="0.00" arrival="273.95" arrivalLane="c2n_1" arrivalPos="990.00" arrivalPosLat="0.00" arrivalSpeed="14.23" duration="143.95" routeLength="1997.01" waitingTime="0.00" waitingCount="0" stopTime="0.00" timeLoss="3.59" rerouteNo="1" devices="tripinfo_car_s2n_130 routing_car_s2n_130" vType="Car" speedFactor="1.02" vaporized=""/>
    <tripinfo id="car_s2w_82" depart="82.00" departLane="s2sep_1" departPos="3.60" departPosLat="0.00" departSpeed="13.90" departDelay="0.00" arrival="274.75" arrivalLane="c2w_1" arrivalPos="990.00" arrivalPosLat="0.00" arrivalSpeed="13.95" duration="192.75" routeLength="1996.47" waitingTime="35.90" waitingCount="2" stopTime="0.00" timeLoss="49.18" rerouteNo="1" devices="tripinfo_car_s2w_82 routing_car_s2w_82" vType="Car" speedFactor="1.01" vaporized=""/>
    <tripinfo id="car_n2s_128" depart="129.45" departLane="n2sep_1" departPos="3.60" departPosLat="0.00" departSpeed="13.90" departDelay="1.45" arrival="276.35" arrivalLane="c2s_1" arrivalPos="990.00" arrivalPosLat="0.00" arrivalSpeed="13.90" duration="146.90" routeLength="1997.01" waitingTime="0.00" waitingCount="0" stopTime="0.00" timeLoss="3.21" rerouteNo="1" devices="tripinfo_car_n2s_128 routing_car_n2s_128" vType="Car" speedFactor="1.00" vaporized=""/>
    <tripinfo id="car_s2e_140" depart="140.00" departLane="s2sep_1" departPos="3.60" departPosLat="0.00" departSpeed="13.90" departDelay="0.00" arrival="277.15" arrivalLane="c2e_1" arrivalPos="990.00" arrivalPosLat="0.00" arrivalSpeed="15.55" duration="137.15" routeLength="1986.69" waitingTime="0.00" waitingCount="0" stopTime="0.00" timeLoss="8.79" rerouteNo="1" devices="tripinfo_car_s2e_140 routing_car_s2e_140" vType="Car" speedFactor="1.12" vaporized=""/>
    <tripinfo id="car_n2s_130" depart="131.30" departLane="n2sep_1" departPos="3.60" departPosLat="0.00" departSpeed="13.90" departDelay="1.30" arrival="278.30" arrivalLane="c2s_1" arrivalPos="990.00" arrivalPosLat="0.00" arrivalSpeed="15.26" duration="147.00" routeLength="1997.01" waitingTime="0.00" waitingCount="0" stopTime="0.00" timeLoss="21.25" rerouteNo="1" devices="tripinfo_car_n2s_130 routing_car_n2s_130" vType="Car" speedFactor="1.14" vaporized=""/>
    <tripinfo id="car_s2w_108" depart="108.00" departLane="s2sep_1" departPos="3.60" departPosLat="0.00" departSpeed="13.90" departDelay="0.00" arrival="279.55" arrivalLane="c2w_1" arrivalPos="990.00" arrivalPosLat="0.00" arrivalSpeed="14.50" duration="171.55" routeLength="1996.47" waitingTime="16.00" waitingCount="3" stopTime="0.00" timeLoss="33.23" rerouteNo="1" devices="tripinfo_car_s2w_108 routing_car_s2w_108" vType="Car" speedFactor="1.04" vaporized=""/>
    <tripinfo id="car_s2w_128" depart="128.00" departLane="s2sep_1" departPos="3.60" departPosLat="0.00" departSpeed="13.90" departDelay="0.00" arrival="285.30" arrivalLane="c2w_1" arrivalPos="990.00" arrivalPosLat="0.00" arrivalSpeed="13.90" duration="157.30" routeLength="1996.47" waitingTime="2.90" waitingCount="1" stopTime="0.00" timeLoss="12.99" rerouteNo="1" devices="tripinfo_car_s2w_128 routing_car_s2w_128" vType="Car" speedFactor="1.00" vaporized=""/>
    <tripinfo id="car_n2e_128" depart="128.00" departLane="n2sep_1" departPos="3.60" departPosLat="0.00" departSpeed="13.90" departDelay="0.00" arrival="285.95" arrivalLane="c2e_1" arrivalPos="990.00" arrivalPosLat="0.00" arrivalSpeed="13.94" duration="157.95" routeLength="1996.47" waitingTime="5.25" waitingCount="2" stopTime="0.00" timeLoss="14.07" rerouteNo="1" devices="tripinfo_car_n2e_128 routing_car_n2e_128" vType="Car" speedFactor="1.00" vaporized=""/>
    <tripinfo id="car_s2w_145" depart="145.00" departLane="s2sep_1" departPos="3.60" departPosLat="0.00" departSpeed="13.90" departDelay="0.00" arrival="287.15" arrivalLane="c2w_1" arrivalPos="990.00" arrivalPosLat="0.00" arrivalSpeed="15.47" duration="142.15" routeLength="1996.47" waitingTime="0.00" waitingCount="0" stopTime="0.00" timeLoss="19.67" rerouteNo="1" devices="tripinfo_car_s2w_145 routing_car_s2w_145" vType="Car" speedFactor="1.18" vaporized=""/>
    <tripinfo id="car_w2e_122" depart="122.00" departLane="w2sep_1" departPos="3.60" departPosLat="0.00" departSpeed="13.90" departDelay="0.00" arrival="291.20" arrivalLane="c2e_1" arrivalPos="990.00" arrivalPosLat="0.00" arrivalSpeed="16.24" duration="169.20" routeLength="1997.01" waitingTime="37.55" waitingCount="1" stopTime="0.00" timeLoss="46.25" rerouteNo="1" devices="tripinfo_car_w2e_122 routing_car_w2e_122" vType="Car" speedFactor="1.17" vaporized=""/>
    <tripinfo id="car_e2w_108" depart="108.45" departLane="e2sep_1" departPos="3.60" departPosLat="0.00" departSpeed="13.90" departDelay="0.45" arrival="295.10" arrivalLane="c2w_1" arrivalPos="990.00" arrivalPosLat="0.00" arrivalSpeed="15.18" duration="186.65" routeLength="1997.01" waitingTime="41.95" waitingCount="1" stopTime="0.00" timeLoss="55.08" rerouteNo="1" devices="tripinfo_car_e2w_108 routing_car_e2w_108" vType="Car" speedFactor="1.09" vaporized=""/>
    <tripinfo id="car_w2s_128" depart="128.00" departLane="w2sep_1" departPos="3.60" departPosLat="0.00" departSpeed="13.90" departDelay="0.00" arrival="296.90" arrivalLane="c2s_1" arrivalPos="990.00" arrivalPosLat="0.00" arrivalSpeed="15.23" duration="168.90" routeLength="1986.69" waitingTime="25.75" waitingCount="1" stopTime="0.00" timeLoss="37.78" rerouteNo="1" devices="tripinfo_car_w2s_128 routing_car_w2s_128" vType="Car" speedFactor="1.10" vaporized=""/>
    <tripinfo id="car_e2n_108" depart="110.15" departLane="e2sep_1" departPos="3.60" departPosLat="0.00" departSpeed="13.90" departDelay="2.15" arrival="300.40" arrivalLane="c2n_1" arrivalPos="990.00" arrivalPosLat="0.00" arrivalSpeed="14.42" duration="190.25" routeLength="1986.69" waitingTime="39.40" waitingCount="1" stopTime="0.00" timeLoss="51.82" rerouteNo="1" devices="tripinfo_car_e2n_108 routing_car_e2n_108" vType="Car" speedFactor="1.04" vaporized=""/>
    <tripinfo id="car_w2s_137" depart="137.00" departLane="w2sep_1" departPos="3.60" departPosLat="0.00" departSpeed="13.90" departDelay="0.00" arrival="301.70" arrivalLane="c2s_1" arrivalPos="990.00" arrivalPosLat="0.00" arrivalSpeed="15.04" duration="164.70" routeLength="1986.69" waitingTime="19.90" waitingCount="1" stopTime="0.00" timeLoss="31.98" rerouteNo="1" devices="tripinfo_car_w2s_137 routing_car_w2s_137" vType="Car" speedFactor="1.08" vaporized=""/>
    <tripinfo id="car_w2s_146" depart="146.00" departLane="w2sep_1" departPos="3.60" departPosLat="0.00" departSpeed="13.90" departDelay="0.00" arrival="304.10" arrivalLane="c2s_1" arrivalPos="990.00" arrivalPosLat="0.00" arrivalSpeed="15.78" duration="158.10" routeLength="1986.69" waitingTime="15.85" waitingCount="1" stopTime="0.00" timeLoss="33.64" rerouteNo="1" devices="tripinfo_car_w2s_146 routing_car_w2s_146" vType="Car" speedFactor="1.15" vaporized=""/>
    <tripinfo id="bus_e2n_112" depart="112.85" departLane="e2sep_1" departPos="12.10" departPosLat="0.00" departSpeed="13.90" departDelay="0.85" arrival="308.85" arrivalLane="c2n_1" arrivalPos="990.00" arrivalPosLat="0.00" arrivalSpeed="13.90" duration="196.00" routeLength="1978.19" waitingTime="37.45" waitingCount="1" stopTime="0.00" timeLoss="52.95" rerouteNo="1" devices="tripinfo_bus_e2n_112 routing_bus_e2n_112" vType="Bus" speedFactor="1.00" vaporized=""/>
    <tripinfo id="car_w2e_151" depart="151.00" departLane="w2sep_1" departPos="3.60" departPosLat="0.00" departSpeed="13.90" departDelay="0.00" arrival="309.20" arrivalLane="c2e_1" arrivalPos="990.00" arrivalPosLat="0.00" arrivalSpeed="13.97" duration="158.20" routeLength="1997.01" waitingTime="3.75" waitingCount="1" stopTime="0.00" timeLoss="15.24" rerouteNo="1" devices="tripinfo_car_w2e_151 routing_car_w2e_151" vType="Car" speedFactor="1.01" vaporized=""/>
    <tripinfo id="car_e2s_107" depart="107.00" departLane="e2sep_1" departPos="3.60" departPosLat="0.00" departSpeed="13.90" departDelay="0.00" arrival="311.75" arrivalLane="c2s_1" arrivalPos="990.00" arrivalPosLat="0.00" arrivalSpeed="14.15" duration="204.75" routeLength="1996.47" waitingTime="51.80" waitingCount="2" stopTime="0.00" timeLoss="63.01" rerouteNo="1" devices="tripinfo_car_e2s_107 routing_car_e2s_107" vType="Car" speedFactor="1.02" vaporized=""/>
    <tripinfo id="car_e2n_114" depart="114.55" departLane="e2sep_1" departPos="3.60" departPosLat="0.00" departSpeed="13.90" departDelay="0.55" arrival="313.25" arrivalLane="c2n_1" arrivalPos="990.00" arrivalPosLat="0.00" arrivalSpeed="14.03" duration="198.70" routeLength="1986.69" waitingTime="35.15" waitingCount="1" stopTime="0.00" timeLoss="56.47" rerouteNo="1" devices="tripinfo_car_e2n_114 routing_car_e2n_114" vType="Car" speedFactor="1.01" vaporized=""/>
    <tripinfo id="car_e2w_157" depart="157.00" departLane="e2sep_1" departPos="3.60" departPosLat="0.00" departSpeed="13.90" departDelay="0.00" arrival="316.60" arrivalLane="c2w_1" arrivalPos="990.00" arrivalPosLat="0.00" arrivalSpeed="14.46" duration="159.60" routeLength="1997.01" waitingTime="4.80" waitingCount="1" stopTime="0.00" timeLoss="21.45" rerouteNo="1" devices="tripinfo_car_e2w_157 routing_car_e2w_157" vType="Car" speedFactor="1.04" vaporized=""/>
    <tripinfo id="car_e2n_119" depart="119.00" departLane="e2sep_1" departPos="3.60" departPosLat="0.00" departSpeed="13.90" departDelay="0.00" arrival="316.85" arrivalLane="c2n_1" arrivalPos="990.00" arrivalPosLat="0.00" arrivalSpeed="13.87" duration="197.85" routeLength="1986.69" waitingTime="33.40" waitingCount="1" stopTime="0.00" timeLoss="54.15" rerouteNo="1" devices="tripinfo_car_e2n_119 routing_car_e2n_119" vType="Car" speedFactor="1.00" vaporized=""/>
    <tripinfo id="car_e2n_143" depart="143.00" departLane="e2sep_1" departPos="3.60" departPosLat="0.00" departSpeed="13.90" departDelay="0.00" arrival="319.70" arrivalLane="c2n_1" arrivalPos="990.00" arrivalPosLat="0.00" arrivalSpeed="14.03" duration="176.70" routeLength="1986.69" waitingTime="14.75" waitingCount="1" stopTime="0.00" timeLoss="35.25" rerouteNo="1" devices="tripinfo_car_e2n_143 routing_car_e2n_143" vType="Car" speedFactor="1.02" vaporized=""/>
    <tripinfo id="car_e2w_163" depart="163.45" departLane="e2sep_1" departPos="3.60" departPosLat="0.00" departSpeed="13.90" departDelay="0.45" arrival="321.05" arrivalLane="c2w_1" arrivalPos="990.00" arrivalPosLat="0.00" arrivalSpeed="14.66" duration="157.60" routeLength="1997.01" waitingTime="0.00" waitingCount="0" stopTime="0.00" timeLoss="21.50" rerouteNo="1" devices="tripinfo_car_e2w_163 routing_car_e2w_163" vType="Car" speedFactor="1.06" vaporized=""/>
    <tripinfo id="car_e2n_144" depart="144.45" departLane="e2sep_1" departPos="3.60" departPosLat="0.00" departSpeed="13.90" departDelay="0.45" arrival="322.70" arrivalLane="c2n_1" arrivalPos="990.00" arrivalPosLat="0.00" arrivalSpeed="13.84" duration="178.25" routeLength="1986.69" waitingTime="11.70" waitingCount="1" stopTime="0.00" timeLoss="34.59" rerouteNo="1" devices="tripinfo_car_e2n_144 routing_car_e2n_144" vType="Car" speedFactor="1.00" vaporized=""/>
    <tripinfo id="car_e2w_167" depart="167.00" departLane="e2sep_1" departPos="3.60" departPosLat="0.00" departSpeed="13.90" departDelay="0.00" arrival="323.05" arrivalLane="c2w_1" arrivalPos="990.00" arrivalPosLat="0.00" arrivalSpeed="15.80" duration="156.05" routeLength="1997.01" waitingTime="0.00" waitingCount="0" stopTime="0.00" timeLoss="34.25" rerouteNo="1" devices="tripinfo_car_e2w_167 routing_car_e2w_167" vType="Car" speedFactor="1.18" vaporized=""/>
    <tripinfo id="car_e2n_162" depart="162.00" departLane="e2sep_1" departPos="3.60" departPosLat="0.00" departSpeed="13.90" departDelay="0.00" arrival="325.30" arrivalLane="c2n_1" arrivalPos="990.00" arrivalPosLat="0.00" arrivalSpeed="14.04" duration="163.30" routeLength="1986.69" waitingTime="0.00" waitingCount="0" stopTime="0.00" timeLoss="22.37" rerouteNo="1" devices="tripinfo_car_e2n_162 routing_car_e2n_162" vType="Car" speedFactor="1.02" vaporized=""/>
    <tripinfo id="car_e2w_179" depart="179.00" departLane="e2sep_1" departPos="3.60" departPosLat="0.00" departSpeed="13.90" departDelay="0.00" arrival="326.25" arrivalLane="c2w_1" arrivalPos="990.00" arrivalPosLat="0.00" arrivalSpeed="15.05" duration="147.25" routeLength="1997.01" waitingTime="0.00" waitingCount="0" stopTime="0.00" timeLoss="15.05" rerouteNo="1" devices="tripinfo_car_e2w_179 routing_car_e2w_179" vType="Car" speedFactor="1.09" vaporized=""/>
    <tripinfo id="car_e2n_176" depart="176.00" departLane="e2sep_1" departPos="3.60" departPosLat="0.00" departSpeed="13.90" departDelay="0.00" arrival="328.75" arrivalLane="c2n_1" arrivalPos="990.00" arrivalPosLat="0.00" arrivalSpeed="13.97" duration="152.75" routeLength="1986.69" waitingTime="0.00" waitingCount="0" stopTime="0.00" timeLoss="10.14" rerouteNo="1" devices="tripinfo_car_e2n_176 routing_car_e2n_176" vType="Car" speedFactor="1.01" vaporized=""/>
    <tripinfo id="car_w2n_123" depart="123.25" departLane="w2sep_1" departPos="3.60" departPosLat="0.00" departSpeed="13.90" departDelay="0.25" arrival="332.70" arrivalLane="c2n_1" arrivalPos="990.00" arrivalPosLat="0.00" arrivalSpeed="14.11" duration="209.45" routeLength="1996.47" waitingTime="54.30" waitingCount="2" stopTime="0.00" timeLoss="67.48" rerouteNo="1" devices="tripinfo_car_w2n_123 routing_car_w2n_123" vType="Car" speedFactor="1.02" vaporized=""/>
    <tripinfo id="car_w2n_154" depart="154.00" departLane="w2sep_1" departPos="3.60" departPosLat="0.00" departSpeed="13.90" departDelay="0.00" arrival="334.55" arrivalLane="c2n_1" arrivalPos="990.00" arrivalPosLat="0.00" arrivalSpeed="15.46" duration="180.55" routeLength="1996.47" waitingTime="26.30" waitingCount="1" stopTime="0.00" timeLoss="57.36" rerouteNo="1" devices="tripinfo_car_w2n_154 routing_car_w2n_154" vType="Car" speedFactor="1.17" vaporized=""/>
    <tripinfo id="car_w2n_186" depart="186.00" departLane="w2sep_1" departPos="3.60" departPosLat="0.00" departSpeed="13.90" departDelay="0.00" arrival="338.90" arrivalLane="c2n_1" arrivalPos="990.00" arrivalPosLat="0.00" arrivalSpeed="13.89" duration="152.90" routeLength="1996.47" waitingTime="0.00" waitingCount="0" stopTime="0.00" timeLoss="8.56" rerouteNo="1" devices="tripinfo_car_w2n_186 routing_car_w2n_186" vType="Car" speedFactor="1.00" vaporized=""/>
    <tripinfo id="car_n2w_159" depart="159.40" departLane="n2sep_1" departPos="3.60" departPosLat="0.00" departSpeed="13.90" departDelay="0.40" arrival="344.10" arrivalLane="c2w_1" arrivalPos="990.00" arrivalPosLat="0.00" arrivalSpeed="14.22" duration="184.70" routeLength="1986.69" waitingTime="34.50" waitingCount="1" stopTime="0.00" timeLoss="44.27" rerouteNo="1" devices="tripinfo_car_n2w_159 routing_car_n2w_159" vType="Car" speedFactor="1.02" vaporized=""/>
    <tripinfo id="car_s2e_192" depart="192.00" departLane="s2sep_1" departPos="3.60" departPosLat="0.00" departSpeed="13.90" departDelay="0.00" arrival="344.45" arrivalLane="c2e_1" arrivalPos="990.00" arrivalPosLat="0.00" arrivalSpeed="14.13" duration="152.45" routeLength="1986.69" waitingTime="4.05" waitingCount="1" stopTime="0.00" timeLoss="11.19" rerouteNo="1" devices="tripinfo_car_s2e_192 routing_car_s2e_192" vType="Car" speedFactor="1.02" vaporized=""/>
    <tripinfo id="car_n2w_173" depart="173.00" departLane="n2sep_1" departPos="3.60" departPosLat="0.00" departSpeed="13.90" departDelay="0.00" arrival="347.40" arrivalLane="c2w_1" arrivalPos="990.00" arrivalPosLat="0.00" arrivalSpeed="15.25" duration="174.40" routeLength="1986.69" waitingTime="25.65" waitingCount="1" stopTime="0.00" timeLoss="44.04" rerouteNo="1" devices="tripinfo_car_n2w_173 routing_car_n2w_173" vType="Car" speedFactor="1.10" vaporized=""/>
    <tripinfo id="car_n2s_162" depart="162.00" departLane="n2sep_1" departPos="3.60" departPosLat="0.00" departSpeed="13.90" departDelay="0.00" arrival="347.80" arrivalLane="c2s_1" arrivalPos="990.00" arrivalPosLat="0.00" arrivalSpeed="13.90" duration="185.80" routeLength="1997.01" waitingTime="31.45" waitingCount="1" stopTime="0.00" timeLoss="42.11" rerouteNo="1" devices="tripinfo_car_n2s_162 routing_car_n2s_162" vType="Car" speedFactor="1.00" vaporized=""/>
    <tripinfo id="car_n2e_158" depart="158.00" departLane="n2sep_1" departPos="3.60" departPosLat="0.00" departSpeed="13.90" departDelay="0.00" arrival="348.60" arrivalLane="c2e_1" arrivalPos="990.00" arrivalPosLat="0.00" arrivalSpeed="14.19" duration="190.60" routeLength="1996.47" waitingTime="38.75" waitingCount="1" stopTime="0.00" timeLoss="49.37" rerouteNo="1" devices="tripinfo_car_n2e_158 routing_car_n2e_158" vType="Car" speedFactor="1.02" vaporized=""/>
    <tripinfo id="car_n2e_171" depart="171.00" departLane="n2sep_1" departPos="3.60" departPosLat="0.00" departSpeed="13.90" departDelay="0.00" arrival="351.75" arrivalLane="c2e_1" arrivalPos="990.00" arrivalPosLat="0.00" arrivalSpeed="14.29" duration="180.75" routeLength="1996.47" waitingTime="25.05" waitingCount="1" stopTime="0.00" timeLoss="40.97" rerouteNo="1" devices="tripinfo_car_n2e_171 routing_car_n2e_171" vType="Car" speedFactor="1.03" vaporized=""/>
    <tripinfo id="car_n2s_165" depart="165.00" departLane="n2sep_1" departPos="3.60" departPosLat="0.00" departSpeed="13.90" departDelay="0.00" arrival="352.20" arrivalLane="c2s_1" arrivalPos="990.00" arrivalPosLat="0.00" arrivalSpeed="13.89" duration="187.20" routeLength="1997.01" waitingTime="29.30" waitingCount="1" stopTime="0.00" timeLoss="43.50" rerouteNo="1" devices="tripinfo_car_n2s_165 routing_car_n2s_165" vType="Car" speedFactor="1.00" vaporized=""/>
    <tripinfo id="car_n2w_182" depart="182.00" departLane="n2sep_1" departPos="3.60" departPosLat="0.00" departSpeed="13.90" departDelay="0.00" arrival="353.60" arrivalLane="c2w_1" arrivalPos="990.00" arrivalPosLat="0.00" arrivalSpeed="14.38" duration="171.60" routeLength="1986.69" waitingTime="19.60" waitingCount="1" stopTime="0.00" timeLoss="32.71" rerouteNo="1" devices="tripinfo_car_n2w_182 routing_car_n2w_182" vType="Car" speedFactor="1.03" vaporized=""/>
    <tripinfo id="car_n2w_196" depart="196.00" departLane="n2sep_1" departPos="3.60" departPosLat="0.00" departSpeed="13.90" departDelay="0.00" arrival="355.70" arrivalLane="c2w_1" arrivalPos="990.00" arrivalPosLat="0.00" arrivalSpeed="15.49" duration="159.70" routeLength="1986.69" waitingTime="13.15" waitingCount="1" stopTime="0.00" timeLoss="34.52" rerouteNo="1" devices="tripinfo_car_n2w_196 routing_car_n2w_196" vType="Car" speedFactor="1.15" vaporized=""/>
    <tripinfo id="car_n2s_204" depart="204.00" departLane="n2sep_1" departPos="3.60" departPosLat="0.00" departSpeed="13.90" departDelay="0.00" arrival="358.70" arrivalLane="c2s_1" arrivalPos="990.00" arrivalPosLat="0.00" arrivalSpeed="14.49" duration="154.70" routeLength="1997.01" waitingTime="1.05" waitingCount="1" stopTime="0.00" timeLoss="16.93" rerouteNo="1" devices="tripinfo_car_n2s_204 routing_car_n2s_204" vType="Car" speedFactor="1.04" vaporized=""/>
    <tripinfo id="car_n2w_199" depart="199.00" departLane="n2sep_1" departPos="3.60" departPosLat="0.00" departSpeed="13.90" departDelay="0.00" arrival="361.05" arrivalLane="c2w_1" arrivalPos="990.00" arrivalPosLat="0.00" arrivalSpeed="13.92" duration="162.05" routeLength="1986.69" waitingTime="3.05" waitingCount="1" stopTime="0.00" timeLoss="18.63" rerouteNo="1" devices="tripinfo_car_n2w_199 routing_car_n2w_199" vType="Car" speedFactor="1.00" vaporized=""/>
    <tripinfo id="car_n2s_229" depart="229.00" departLane="n2sep_1" departPos="3.60" departPosLat="0.00" departSpeed="13.90" departDelay="0.00" arrival="362.85" arrivalLane="c2s_1" arrivalPos="990.00" arrivalPosLat="0.00" arrivalSpeed="15.10" duration="133.85" routeLength="1997.01" waitingTime="0.00" waitingCount="0" stopTime="0.00" timeLoss="1.81" rerouteNo="1" devices="tripinfo_car_n2s_229 routing_car_n2s_229" vType="Car" speedFactor="1.09" vaporized=""/>
    <tripinfo id="car_s2w_194" depart="194.00" departLane="s2sep_1" departPos="3.60" departPosLat="0.00" departSpeed="13.90" departDelay="0.00" arrival="364.35" arrivalLane="c2w_1" arrivalPos="990.00" arrivalPosLat="0.00" arrivalSpeed="14.27" duration="170.35" routeLength="1996.47" waitingTime="14.45" waitingCount="2" stopTime="0.00" timeLoss="30.29" rerouteNo="1" devices="tripinfo_car_s2w_194 routing_car_s2w_194" vType="Car" speedFactor="1.03" vaporized=""/>
    <tripinfo id="car_n2s_231" depart="231.00" departLane="n2sep_1" departPos="3.60" departPosLat="0.00" departSpeed="13.90" departDelay="0.00" arrival="365.80" arrivalLane="c2s_1" arrivalPos="990.00" arrivalPosLat="0.00" arrivalSpeed="15.49" duration="134.80" routeLength="1997.01" waitingTime="0.00" waitingCount="0" stopTime="0.00" timeLoss="6.70" rerouteNo="1" devices="tripinfo_car_n2s_231 routing_car_n2s_231" vType="Car" speedFactor="1.12" vaporized=""/>
    <tripinfo id="car_s2w_198" depart="198.00" departLane="s2sep_1" departPos="3.60" departPosLat="0.00" departSpeed="13.90" departDelay="0.00" arrival="374.15" arrivalLane="c2w_1" arrivalPos="990.00" arrivalPosLat="0.00" arrivalSpeed="13.90" duration="176.15" routeLength="1996.47" waitingTime="17.80" waitingCount="2" stopTime="0.00" timeLoss="31.83" rerouteNo="1" devices="tripinfo_car_s2w_198 routing_car_s2w_198" vType="Car" speedFactor="1.00" vaporized=""/>
    <tripinfo id="car_s2w_232" depart="232.00" departLane="s2sep_1" departPos="3.60" departPosLat="0.00" departSpeed="13.90" departDelay="0.00" arrival="376.40" arrivalLane="c2w_1" arrivalPos="990.00" arrivalPosLat="0.00" arrivalSpeed="14.93" duration="144.40" routeLength="1996.47" waitingTime="0.00" waitingCount="0" stopTime="0.00" timeLoss="12.86" rerouteNo="1" devices="tripinfo_car_s2w_232 routing_car_s2w_232" vType="Car" speedFactor="1.10" vaporized=""/>
    <tripinfo id="bus_n2e_232" depart="233.00" departLane="n2sep_1" departPos="12.10" departPosLat="0.00" departSpeed="13.90" departDelay="1.00" arrival="383.35" arrivalLane="c2e_1" arrivalPos="990.00" arrivalPosLat="0.00" arrivalSpeed="13.90" duration="150.35" routeLength="1987.97" waitingTime="0.00" waitingCount="0" stopTime="0.00" timeLoss="6.61" rerouteNo="1" devices="tripinfo_bus_n2e_232 routing_bus_n2e_232" vType="Bus" speedFactor="1.00" vaporized=""/>
    <tripinfo id="car_w2e_213" depart="213.35" departLane="w2sep_1" departPos="3.60" departPosLat="0.00" departSpeed="13.90" departDelay="0.35" arrival="388.95" arrivalLane="c2e_1" arrivalPos="990.00" arrivalPosLat="0.00" arrivalSpeed="14.42" duration="175.60" routeLength="1997.01" waitingTime="27.10" waitingCount="1" stopTime="0.00" timeLoss="37.15" rerouteNo="1" devices="tripinfo_car_w2e_213 routing_car_w2e_213" vType="Car" speedFactor="1.04" vaporized=""/>
    <tripinfo id="car_e2w_209" depart="209.00" departLane="e2sep_1" departPos="3.60" departPosLat="0.00" departSpeed="13.90" departDelay="0.00" arrival="389.30" arrivalLane="c2w_1" arrivalPos="990.00" arrivalPosLat="0.00" arrivalSpeed="14.21" duration="180.30" routeLength="1997.01" waitingTime="32.40" waitingCount="1" stopTime="0.00" timeLoss="39.72" rerouteNo="1" devices="tripinfo_car_e2w_209 routing_car_e2w_209" vType="Car" speedFactor="1.02" vaporized=""/>
    <tripinfo id="car_w2e_215" depart="215.05" departLane="w2sep_1" departPos="3.60" departPosLat="0.00" departSpeed="13.90" departDelay="0.05" arrival="392.65" arrivalLane="c2e_1" arrivalPos="990.00" arrivalPosLat="0.00" arrivalSpeed="14.48" duration="177.60" routeLength="1997.01" waitingTime="24.90" waitingCount="1" stopTime="0.00" timeLoss="39.91" rerouteNo="1" devices="tripinfo_car_w2e_215 routing_car_w2e_215" vType="Car" speedFactor="1.04" vaporized=""/>
    <tripinfo id="car_e2w_239" depart="239.00" departLane="e2sep_1" departPos="3.60" departPosLat="0.00" departSpeed="13.90" departDelay="0.00" arrival="394.60" arrivalLane="c2w_1" arrivalPos="990.00" arrivalPosLat="0.00" arrivalSpeed="13.90" duration="155.60" routeLength="1997.01" waitingTime="1.80" waitingCount="1" stopTime="0.00" timeLoss="11.89" rerouteNo="1" devices="tripinfo_car_e2w_239 routing_car_e2w_239" vType="Car" speedFactor="1.00" vaporized=""/>
    <tripinfo id="car_w2e_220" depart="220.00" departLane="w2sep_1" departPos="3.60" departPosLat="0.00" departSpeed="13.90" departDelay="0.00" arrival="395.65" arrivalLane="c2e_1" arrivalPos="990.00" arrivalPosLat="0.00" arrivalSpeed="14.61" duration="175.65" routeLength="1997.01" waitingTime="23.20" waitingCount="1" stopTime="0.00" timeLoss="39.70" rerouteNo="1" devices="tripinfo_car_w2e_220 routing_car_w2e_220" vType="Car" speedFactor="1.06" vaporized=""/>
    <tripinfo id="car_e2s_211" depart="211.00" departLane="e2sep_1" departPos="3.60" departPosLat="0.00" departSpeed="13.90" departDelay="0.00" arrival="396.35" arrivalLane="c2s_1" arrivalPos="990.00" arrivalPosLat="0.00" arrivalSpeed="14.13" duration="185.35" routeLength="1996.47" waitingTime="30.45" waitingCount="2" stopTime="0.00" timeLoss="43.39" rerouteNo="1" devices="tripinfo_car_e2s_211 routing_car_e2s_211" vType="Car" speedFactor="1.02" vaporized=""/>
    <tripinfo id="car_w2n_206" depart="206.00" departLane="w2sep_1" departPos="3.60" departPosLat="0.00" departSpeed="13.90" departDelay="0.00" arrival="397.30" arrivalLane="c2n_1" arrivalPos="990.00" arrivalPosLat="0.00" arrivalSpeed="14.00" duration="191.30" routeLength="1996.47" waitingTime="37.20" waitingCount="2" stopTime="0.00" timeLoss="47.98" rerouteNo="1" devices="tripinfo_car_w2n_206 routing_car_w2n_206" vType="Car" speedFactor="1.01" vaporized=""/>
    <tripinfo id="car_e2w_250" depart="250.00" departLane="e2sep_1" departPos="3.60" departPosLat="0.00" departSpeed="13.90" departDelay="0.00" arrival="397.95" arrivalLane="c2w_1" arrivalPos="990.00" arrivalPosLat="0.00" arrivalSpeed="14.05" duration="147.95" routeLength="1997.01" waitingTime="0.00" waitingCount="0" stopTime="0.00" timeLoss="6.22" rerouteNo="1" devices="tripinfo_car_e2w_250 routing_car_e2w_250" vType="Car" speedFactor="1.01" vaporized=""/>
    <tripinfo id="car_e2s_216" depart="216.00" departLane="e2sep_1" departPos="3.60" departPosLat="0.00" departSpeed="13.90" departDelay="0.00" arrival="398.85" arrivalLane="c2s_1" arrivalPos="990.00" arrivalPosLat="0.00" arrivalSpeed="14.97" duration="182.85" routeLength="1996.47" waitingTime="28.25" waitingCount="2" stopTime="0.00" timeLoss="50.57" rerouteNo="1" devices="tripinfo_car_e2s_216 routing_car_e2s_216" vType="Car" speedFactor="1.09" vaporized=""/>
    <tripinfo id="car_w2n_212" depart="212.00" departLane="w2sep_1" departPos="3.60" departPosLat="0.00" departSpeed="13.90" departDelay="0.00" arrival="399.70" arrivalLane="c2n_1" arrivalPos="990.00" arrivalPosLat="0.00" arrivalSpeed="14.93" duration="187.70" routeLength="1996.47" waitingTime="34.65" waitingCount="2" stopTime="0.00" timeLoss="55.50" rerouteNo="1" devices="tripinfo_car_w2n_212 routing_car_w2n_212" vType="Car" speedFactor="1.09" vaporized=""/>
    <tripinfo id="car_e2s_223" depart="223.00" departLane="e2sep_1" departPos="3.60" departPosLat="0.00" departSpeed="13.90" departDelay="0.00" arrival="403.50" arrivalLane="c2s_1" arrivalPos="990.00" arrivalPosLat="0.00" arrivalSpeed="14.03" duration="180.50" routeLength="1996.47" waitingTime="20.00" waitingCount="2" stopTime="0.00" timeLoss="37.57" rerouteNo="1" devices="tripinfo_car_e2s_223 routing_car_e2s_223" vType="Car" speedFactor="1.01" vaporized=""/>
    <tripinfo id="car_w2n_246" depart="246.00" departLane="w2sep_1" departPos="3.60" departPosLat="0.00" departSpeed="13.90" departDelay="0.00" arrival="404.40" arrivalLane="c2n_1" arrivalPos="990.00" arrivalPosLat="0.00" arrivalSpeed="13.89" duration="158.40" routeLength="1996.47" waitingTime="0.00" waitingCount="0" stopTime="0.00" timeLoss="14.09" rerouteNo="1" devices="tripinfo_car_w2n_246 routing_car_w2n_246" vType="Car" speedFactor="1.00" vaporized=""/>
    <tripinfo id="car_e2w_278" depart="278.00" departLane="e2sep_1" departPos="3.60" departPosLat="0.00" departSpeed="13.90" departDelay="0.00" arrival="404.60" arrivalLane="c2w_1" arrivalPos="990.00" arrivalPosLat="0.00" arrivalSpeed="16.36" duration="126.60" routeLength="1997.01" waitingTime="0.00" waitingCount="0" stopTime="0.00" timeLoss="4.53" rerouteNo="1" devices="tripinfo_car_e2w_278 routing_car_e2w_278" vType="Car" speedFactor="1.18" vaporized=""/>
    <tripinfo id="car_e2s_266" depart="266.00" departLane="e2sep_1" departPos="3.60" departPosLat="0.00" departSpeed="13.90" departDelay="0.00" arrival="406.95" arrivalLane="c2s_1" arrivalPos="990.00" arrivalPosLat="0.00" arrivalSpeed="15.21" duration="140.95" routeLength="1996.47" waitingTime="0.80" waitingCount="1" stopTime="0.00" timeLoss="9.57" rerouteNo="1" devices="tripinfo_car_e2s_266 routing_car_e2s_266" vType="Car" speedFactor="1.10" vaporized=""/>
    <tripinfo id="amb_w2e_300" depart="300.55" departLane="w2sep_1" departPos="6.60" departPosLat="0.00" departSpeed="13.90" departDelay="0.55" arrival="406.95" arrivalLane="c2e_1" arrivalPos="990.00" arrivalPosLat="-0.95" arrivalSpeed="20.60" duration="106.40" routeLength="1994.01" waitingTime="0.00" waitingCount="0" stopTime="0.00" timeLoss="10.73" rerouteNo="1" devices="tripinfo_amb_w2e_300 routing_amb_w2e_300 bluelight_amb_w2e_300 fcd_amb_w2e_300" vType="Ambulance" speedFactor="1.50" vaporized="">
        <example_device customValue1="0.00" customValue2="-1.00"/>
    </tripinfo>
    <tripinfo id="car_w2e_266" depart="266.00" departLane="w2sep_1" departPos="3.60" departPosLat="0.00" departSpeed="13.90" departDelay="0.00" arrival="407.65" arrivalLane="c2e_1" arrivalPos="990.00" arrivalPosLat="1.10" arrivalSpeed="14.13" duration="141.65" routeLength="1997.01" waitingTime="0.00" waitingCount="0" stopTime="0.00" timeLoss="0.33" rerouteNo="1" devices="tripinfo_car_w2e_266 routing_car_w2e_266" vType="Car@car_w2e_266" speedFactor="1.02" vaporized=""/>
    <tripinfo id="car_e2n_272" depart="272.00" departLane="e2sep_1" departPos="3.60" departPosLat="0.00" departSpeed="13.90" departDelay="0.00" arrival="408.30" arrivalLane="c2n_1" arrivalPos="990.00" arrivalPosLat="0.00" arrivalSpeed="15.21" duration="136.30" routeLength="1986.69" waitingTime="0.00" waitingCount="0" stopTime="0.00" timeLoss="5.25" rerouteNo="1" devices="tripinfo_car_e2n_272 routing_car_e2n_272" vType="Car" speedFactor="1.10" vaporized=""/>
    <tripinfo id="car_w2n_283" depart="283.00" departLane="w2sep_1" departPos="3.60" departPosLat="0.00" departSpeed="13.90" departDelay="0.00" arrival="430.60" arrivalLane="c2n_1" arrivalPos="990.00" arrivalPosLat="0.00" arrivalSpeed="13.90" duration="147.60" routeLength="1996.47" waitingTime="0.00" waitingCount="0" stopTime="0.00" timeLoss="3.27" rerouteNo="1" devices="tripinfo_car_w2n_283 routing_car_w2n_283" vType="Car" speedFactor="1.00" vaporized=""/>
    <tripinfo id="car_e2w_282" depart="282.00" departLane="e2sep_1" departPos="3.60" departPosLat="0.00" departSpeed="13.90" departDelay="0.00" arrival="433.20" arrivalLane="c2w_1" arrivalPos="990.00" arrivalPosLat="0.00" arrivalSpeed="13.94" duration="151.20" routeLength="1997.01" waitingTime="0.65" waitingCount="1" stopTime="0.00" timeLoss="7.96" rerouteNo="1" devices="tripinfo_car_e2w_282 routing_car_e2w_282" vType="Car" speedFactor="1.00" vaporized=""/>
    <tripinfo id="car_e2w_283" depart="283.45" departLane="e2sep_1" departPos="3.60" departPosLat="0.00" departSpeed="13.90" departDelay="0.45" arrival="435.45" arrivalLane="c2w_1" arrivalPos="990.00" arrivalPosLat="0.00" arrivalSpeed="15.00" duration="152.00" routeLength="1997.01" waitingTime="0.00" waitingCount="0" stopTime="0.00" timeLoss="21.74" rerouteNo="1" devices="tripinfo_car_e2w_283 routing_car_e2w_283" vType="Car" speedFactor="1.10" vaporized=""/>
    <tripinfo id="car_e2w_299" depart="299.00" departLane="e2sep_1" departPos="3.60" departPosLat="0.00" departSpeed="13.90" departDelay="0.00" arrival="437.45" arrivalLane="c2w_1" arrivalPos="990.00" arrivalPosLat="0.00" arrivalSpeed="15.47" duration="138.45" routeLength="1997.01" waitingTime="0.00" waitingCount="0" stopTime="0.00" timeLoss="13.79" rerouteNo="1" devices="tripinfo_car_e2w_299 routing_car_e2w_299" vType="Car" speedFactor="1.15" vaporized=""/>
    <tripinfo id="car_w2n_303" depart="303.00" departLane="w2sep_1" departPos="3.60" departPosLat="0.00" departSpeed="13.90" departDelay="0.00" arrival="438.45" arrivalLane="c2n_1" arrivalPos="990.00" arrivalPosLat="0.00" arrivalSpeed="15.55" duration="135.45" routeLength="1996.47" waitingTime="0.00" waitingCount="0" stopTime="0.00" timeLoss="6.42" rerouteNo="1" devices="tripinfo_car_w2n_303 routing_car_w2n_303" vType="Car" speedFactor="1.12" vaporized=""/>
    <tripinfo id="car_e2s_299" depart="300.25" departLane="e2sep_1" departPos="3.60" departPosLat="0.00" departSpeed="13.90" departDelay="1.25" arrival="444.55" arrivalLane="c2s_1" arrivalPos="990.00" arrivalPosLat="0.00" arrivalSpeed="14.35" duration="144.30" routeLength="1996.47" waitingTime="0.00" waitingCount="0" stopTime="0.00" timeLoss="4.45" rerouteNo="1" devices="tripinfo_car_e2s_299 routing_car_e2s_299" vType="Car" speedFactor="1.03" vaporized=""/>
    <tripinfo id="car_n2w_238" depart="238.00" departLane="n2sep_1" departPos="3.60" departPosLat="0.00" departSpeed="13.90" departDelay="0.00" arrival="446.05" arrivalLane="c2w_1" arrivalPos="990.00" arrivalPosLat="0.00" arrivalSpeed="14.80" duration="208.05" routeLength="1986.69" waitingTime="62.85" waitingCount="1" stopTime="0.00" timeLoss="73.17" rerouteNo="1" devices="tripinfo_car_n2w_238 routing_car_n2w_238" vType="Car" speedFactor="1.07" vaporized=""/>
    <tripinfo id="car_s2e_240" depart="240.00" departLane="s2sep_1" departPos="3.60" departPosLat="0.00" departSpeed="13.90" departDelay="0.00" arrival="450.10" arrivalLane="c2e_1" arrivalPos="990.00" arrivalPosLat="0.00" arrivalSpeed="13.90" duration="210.10" routeLength="1986.69" waitingTime="59.55" waitingCount="1" stopTime="0.00" timeLoss="66.40" rerouteNo="1" devices="tripinfo_car_s2e_240 routing_car_s2e_240" vType="Car" speedFactor="1.00" vaporized=""/>
    <tripinfo id="car_s2e_272" depart="272.00" departLane="s2sep_1" departPos="3.60" departPosLat="0.00" departSpeed="13.90" departDelay="0.00" arrival="452.35" arrivalLane="c2e_1" arrivalPos="990.00" arrivalPosLat="0.00" arrivalSpeed="14.92" duration="180.35" routeLength="1986.69" waitingTime="34.00" waitingCount="1" stopTime="0.00" timeLoss="49.26" rerouteNo="1" devices="tripinfo_car_s2e_272 routing_car_s2e_272" vType="Car" speedFactor="1.10" vaporized=""/>
    <tripinfo id="car_n2s_244" depart="244.00" departLane="n2sep_1" departPos="3.60" departPosLat="0.00" departSpeed="13.90" departDelay="0.00" arrival="452.70" arrivalLane="c2s_1" arrivalPos="990.00" arrivalPosLat="0.00" arrivalSpeed="13.90" duration="208.70" routeLength="1997.01" waitingTime="56.10" waitingCount="1" stopTime="0.00" timeLoss="64.99" rerouteNo="1" devices="tripinfo_car_n2s_244 routing_car_n2s_244" vType="Car" speedFactor="1.00" vaporized=""/>
    <tripinfo id="car_s2n_278" depart="278.00" departLane="s2sep_1" departPos="3.60" departPosLat="0.00" departSpeed="13.90" departDelay="0.00" arrival="454.30" arrivalLane="c2n_1" arrivalPos="990.00" arrivalPosLat="0.00" arrivalSpeed="13.96" duration="176.30" routeLength="1997.01" waitingTime="23.65" waitingCount="1" stopTime="0.00" timeLoss="33.25" rerouteNo="1" devices="tripinfo_car_s2n_278 routing_car_s2n_278" vType="Car" speedFactor="1.00" vaporized=""/>
    <tripinfo id="car_n2s_248" depart="248.00" departLane="n2sep_1" departPos="3.60" departPosLat="0.00" departSpeed="13.90" departDelay="0.00" arrival="455.15" arrivalLane="c2s_1" arrivalPos="990.00" arrivalPosLat="0.00" arrivalSpeed="14.71" duration="207.15" routeLength="1997.01" waitingTime="55.00" waitingCount="1" stopTime="0.00" timeLoss="73.21" rerouteNo="1" devices="tripinfo_car_n2s_248 routing_car_n2s_248" vType="Car" speedFactor="1.07" vaporized=""/>
    <tripinfo id="car_n2w_271" depart="271.00" departLane="n2sep_1" departPos="3.60" departPosLat="0.00" departSpeed="13.90" departDelay="0.00" arrival="456.50" arrivalLane="c2w_1" arrivalPos="990.00" arrivalPosLat="0.00" arrivalSpeed="14.03" duration="185.50" routeLength="1986.69" waitingTime="32.25" waitingCount="1" stopTime="0.00" timeLoss="43.10" rerouteNo="1" devices="tripinfo_car_n2w_271 routing_car_n2w_271" vType="Car" speedFactor="1.01" vaporized=""/>
    <tripinfo id="car_s2n_282" depart="282.00" departLane="s2sep_1" departPos="3.60" departPosLat="0.00" departSpeed="13.90" departDelay="0.00" arrival="456.90" arrivalLane="c2n_1" arrivalPos="990.00" arrivalPosLat="0.00" arrivalSpeed="14.72" duration="174.90" routeLength="1997.01" waitingTime="22.55" waitingCount="1" stopTime="0.00" timeLoss="40.74" rerouteNo="1" devices="tripinfo_car_s2n_282 routing_car_s2n_282" vType="Car" speedFactor="1.07" vaporized=""/>
    <tripinfo id="car_n2e_254" depart="254.00" departLane="n2sep_1" departPos="3.60" departPosLat="0.00" departSpeed="13.90" departDelay="0.00" arrival="457.75" arrivalLane="c2e_1" arrivalPos="990.00" arrivalPosLat="0.00" arrivalSpeed="14.38" duration="203.75" routeLength="1996.47" waitingTime="51.90" waitingCount="2" stopTime="0.00" timeLoss="64.23" rerouteNo="1" devices="tripinfo_car_n2e_254 routing_car_n2e_254" vType="Car" speedFactor="1.03" vaporized=""/>
    <tripinfo id="car_n2e_262" depart="262.00" departLane="n2sep_1" departPos="3.60" departPosLat="0.00" departSpeed="13.90" departDelay="0.00" arrival="459.75" arrivalLane="c2e_1" arrivalPos="990.00" arrivalPosLat="0.00" arrivalSpeed="15.63" duration="197.75" routeLength="1996.47" waitingTime="49.80" waitingCount="2" stopTime="0.00" timeLoss="74.26" rerouteNo="1" devices="tripinfo_car_n2e_262 routing_car_n2e_262" vType="Car" speedFactor="1.17" vaporized=""/>
    <tripinfo id="car_n2w_300" depart="300.00" departLane="n2sep_1" departPos="3.60" departPosLat="0.00" departSpeed="13.90" departDelay="0.00" arrival="461.20" arrivalLane="c2w_1" arrivalPos="990.00" arrivalPosLat="0.00" arrivalSpeed="13.89" duration="161.20" routeLength="1986.69" waitingTime="3.85" waitingCount="1" stopTime="0.00" timeLoss="17.55" rerouteNo="1" devices="tripinfo_car_n2w_300 routing_car_n2w_300" vType="Car" speedFactor="1.00" vaporized=""/>
    <tripinfo id="bus_n2s_307" depart="307.00" departLane="n2sep_1" departPos="12.10" departPosLat="0.00" departSpeed="13.90" departDelay="0.00" arrival="462.90" arrivalLane="c2s_1" arrivalPos="990.00" arrivalPosLat="0.00" arrivalSpeed="13.89" duration="155.90" routeLength="1988.51" waitingTime="0.00" waitingCount="0" stopTime="0.00" timeLoss="12.85" rerouteNo="1" devices="tripinfo_bus_n2s_307 routing_bus_n2s_307" vType="Bus" speedFactor="1.00" vaporized=""/>
    <tripinfo id="car_n2e_291" depart="291.00" departLane="n2sep_1" departPos="3.60" departPosLat="0.00" departSpeed="13.90" departDelay="0.00" arrival="463.95" arrivalLane="c2e_1" arrivalPos="990.00" arrivalPosLat="0.00" arrivalSpeed="14.32" duration="172.95" routeLength="1996.47" waitingTime="13.85" waitingCount="2" stopTime="0.00" timeLoss="33.04" rerouteNo="1" devices="tripinfo_car_n2e_291 routing_car_n2e_291" vType="Car" speedFactor="1.03" vaporized=""/>
    <tripinfo id="car_s2w_256" depart="256.00" departLane="s2sep_1" departPos="3.60" departPosLat="0.00" departSpeed="13.90" departDelay="0.00" arrival="464.45" arrivalLane="c2w_1" arrivalPos="990.00" arrivalPosLat="0.00" arrivalSpeed="14.74" duration="208.45" routeLength="1996.47" waitingTime="60.15" waitingCount="2" stopTime="0.00" timeLoss="72.92" rerouteNo="1" devices="tripinfo_car_s2w_256 routing_car_s2w_256" vType="Car" speedFactor="1.06" vaporized=""/>
    <tripinfo id="car_n2s_325" depart="325.00" departLane="n2sep_1" departPos="3.60" departPosLat="0.00" departSpeed="13.90" departDelay="0.00" arrival="465.15" arrivalLane="c2s_1" arrivalPos="990.00" arrivalPosLat="0.00" arrivalSpeed="16.06" duration="140.15" routeLength="1997.01" waitingTime="0.00" waitingCount="0" stopTime="0.00" timeLoss="22.95" rerouteNo="1" devices="tripinfo_car_n2s_325 routing_car_n2s_325" vType="Car" speedFactor="1.23" vaporized=""/>
    <tripinfo id="car_n2e_330" depart="330.00" departLane="n2sep_1" departPos="3.60" departPosLat="0.00" departSpeed="13.90" departDelay="0.00" arrival="466.30" arrivalLane="c2e_1" arrivalPos="990.00" arrivalPosLat="0.00" arrivalSpeed="15.28" duration="136.30" routeLength="1996.47" waitingTime="0.00" waitingCount="0" stopTime="0.00" timeLoss="7.39" rerouteNo="1" devices="tripinfo_car_n2e_330 routing_car_n2e_330" vType="Car" speedFactor="1.12" vaporized=""/>
</tripinfos>
