<?xml version="1.0" encoding="UTF-8"?>

<!-- generated on Sat Apr 24 18:29:00 2021 by Eclipse SUMO Version 1.4.0
<configuration xmlns:xsi="http://www.w3.org/2001/XMLSchema-instance" xsi:noNamespaceSchemaLocation="http://sumo.dlr.de/xsd/sumoConfiguration.xsd">

    <input>
        <net-file value="sumofiles/junction.net.xml"/>
        <route-files value="sumofiles/junction_preemption_199.rou.xml"/>
        <additional-files value="sumofiles/junction.det.xml"/>
    </input>

    <output>
        <tripinfo-output value="sumofiles/output/tripinfo_preemption_199.xml"/>
    </output>

    <time>
        <begin value="0"/>
        <end value="10000"/>
        <step-length value="0.05"/>
    </time>

    <processing>
        <lateral-resolution value="0.1"/>
    </processing>

    <report>
        <no-warnings value="true"/>
        <error-log value="sumofiles/output/errorlog_preemption_199.log"/>
        <no-step-log value="true"/>
    </report>

    <traci_server>
        <remote-port value="36281"/>
    </traci_server>

    <gui_only>
        <gui-settings-file value="sumofiles/junction-gui.settings.xml"/>
        <tracker-interval value="0.05"/>
    </gui_only>

</configuration>
-->

<tripinfos xmlns:xsi="http://www.w3.org/2001/XMLSchema-instance" xsi:noNamespaceSchemaLocation="http://sumo.dlr.de/xsd/tripinfo_file.xsd">
    <tripinfo id="car_w2s_0" depart="0.00" departLane="w2sep_1" departPos="3.60" departPosLat="0.00" departSpeed="13.90" departDelay="0.00" arrival="139.30" arrivalLane="c2s_1" arrivalPos="990.00" arrivalPosLat="0.00" arrivalSpeed="14.73" duration="139.30" routeLength="1986.69" waitingTime="0.00" waitingCount="0" stopTime="0.00" timeLoss="3.75" rerouteNo="1" devices="tripinfo_car_w2s_0 routing_car_w2s_0" vType="Car" speedFactor="1.06" vaporized=""/>
    <tripinfo id="car_s2n_4" depart="4.00" departLane="s2sep_1" departPos="3.60" departPosLat="0.00" departSpeed="13.90" departDelay="0.00" arrival="161.75" arrivalLane="c2n_1" arrivalPos="990.00" arrivalPosLat="0.00" arrivalSpeed="14.73" duration="157.75" routeLength="1997.01" waitingTime="14.75" waitingCount="1" stopTime="0.00" timeLoss="22.20" rerouteNo="1" devices="tripinfo_car_s2n_4 routing_car_s2n_4" vType="Car" speedFactor="1.06" vaporized=""/>
    <tripinfo id="car_n2w_9" depart="9.00" departLane="n2sep_1" departPos="3.60" departPosLat="0.00" departSpeed="13.90" departDelay="0.00" arrival="163.55" arrivalLane="c2w_1" arrivalPos="990.00" arrivalPosLat="0.00" arrivalSpeed="14.32" duration="154.55" routeLength="1986.69" waitingTime="6.80" waitingCount="1" stopTime="0.00" timeLoss="15.13" rerouteNo="1" devices="tripinfo_car_n2w_9 routing_car_n2w_9" vType="Car" speedFactor="1.03" vaporized=""/>
    <tripinfo id="car_n2w_26" depart="26.00" departLane="n2sep_1" departPos="3.60" departPosLat="0.00" departSpeed="13.90" departDelay="0.00" arrival="166.75" arrivalLane="c2w_1" arrivalPos="990.00" arrivalPosLat="0.00" arrivalSpeed="15.09" duration="140.75" routeLength="1986.69" waitingTime="0.00" waitingCount="0" stopTime="0.00" timeLoss="9.00" rerouteNo="1" devices="tripinfo_car_n2w_26 routing_car_n2w_26" vType="Car" speedFactor="1.09" vaporized=""/>
    <tripinfo id="car_s2e_6" depart="6.00" departLane="s2sep_1" departPos="3.60" departPosLat="0.00" departSpeed="13.90" departDelay="0.00" arrival="167.25" arrivalLane="c2e_1" arrivalPos="990.00" arrivalPosLat="0.00" arrivalSpeed="14.04" duration="161.25" routeLength="1986.69" waitingTime="9.45" waitingCount="1" stopTime="0.00" timeLoss="19.06" rerouteNo="1" devices="tripinfo_car_s2e_6 routing_car_s2e_6" vType="Car" speedFactor="1.01" vaporized=""/>
    <tripinfo id="car_n2s_14" depart="14.00" departLane="n2sep_1" departPos="3.60" departPosLat="0.00" departSpeed="13.90" departDelay="0.00" arrival="167.80" arrivalLane="c2s_1" arrivalPos="990.00" arrivalPosLat="0.00" arrivalSpeed="13.90" duration="153.80" routeLength="1997.01" waitingTime="1.35" waitingCount="1" stopTime="0.00" timeLoss="10.12" rerouteNo="1" devices="tripinfo_car_n2s_14 routing_car_n2s_14" vType="Car" speedFactor="1.00" vaporized=""/>
    <tripinfo id="car_s2n_27" depart="27.00" departLane="s2sep_1" departPos="3.60" departPosLat="0.00" departSpeed="13.90" departDelay="0.00" arrival="169.35" arrivalLane="c2n_1" arrivalPos="990.00" arrivalPosLat="0.00" arrivalSpeed="14.55" duration="142.35" routeLength="1997.01" waitingTime="0.00" waitingCount="0" stopTime="0.00" timeLoss="5.11" rerouteNo="1" devices="tripinfo_car_s2n_27 routing_car_s2n_27" vType="Car" speedFactor="1.05" vaporized=""/>
    <tripinfo id="car_s2e_21" depart="21.00" departLane="s2sep_1" departPos="3.60" departPosLat="0.00" departSpeed="13.90" departDelay="0.00" arrival="169.80" arrivalLane="c2e_1" arrivalPos="990.00" arrivalPosLat="0.00" arrivalSpeed="14.87" duration="148.80" routeLength="1986.69" waitingTime="1.00" waitingCount="1" stopTime="0.00" timeLoss="16.07" rerouteNo="1" devices="tripinfo_car_s2e_21 routing_car_s2e_21" vType="Car" speedFactor="1.08" vaporized=""/>
    <tripinfo id="car_n2e_7" depart="7.00" departLane="n2sep_1" departPos="3.60" departPosLat="0.00" departSpeed="13.90" departDelay="0.00" arrival="172.55" arrivalLane="c2e_1" arrivalPos="990.00" arrivalPosLat="0.00" arrivalSpeed="14.93" duration="165.55" routeLength="1996.47" waitingTime="18.00" waitingCount="2" stopTime="0.00" timeLoss="32.25" rerouteNo="1" devices="tripinfo_car_n2e_7 routing_car_n2e_7" vType="Car" speedFactor="1.08" vaporized=""/>
    <tripinfo id="car_n2w_27" depart="27.35" departLane="n2sep_1" departPos="3.60" departPosLat="0.00" departSpeed="13.90" departDelay="0.35" arrival="173.80" arrivalLane="c2w_1" arrivalPos="990.00" arrivalPosLat="0.00" arrivalSpeed="14.27" duration="146.45" routeLength="1986.69" waitingTime="0.00" waitingCount="0" stopTime="0.00" timeLoss="6.46" rerouteNo="1" devices="tripinfo_car_n2w_27 routing_car_n2w_27" vType="Car" speedFactor="1.03" vaporized=""/>
    <tripinfo id="car_n2e_21" depart="21.00" departLane="n2sep_1" departPos="3.60" departPosLat="0.00" departSpeed="13.90" departDelay="0.00" arrival="177.95" arrivalLane="c2e_1" arrivalPos="990.00" arrivalPosLat="0.00" arrivalSpeed="14.04" duration="156.95" routeLength="1996.47" waitingTime="3.85" waitingCount="1" stopTime="0.00" timeLoss="14.12" rerouteNo="1" devices="tripinfo_car_n2e_21 routing_car_n2e_21" vType="Car" speedFactor="1.01" vaporized=""/>
    <tripinfo id="car_n2s_50" depart="50.30" departLane="n2sep_1" departPos="3.60" departPosLat="0.00" departSpeed="13.90" departDelay="0.30" arrival="186.70" arrivalLane="c2s_1" arrivalPos="990.00" arrivalPosLat="0.00" arrivalSpeed="16.10" duration="136.40" routeLength="1997.01" waitingTime="0.00" waitingCount="0" stopTime="0.00" timeLoss="12.36" rerouteNo="1" devices="tripinfo_car_n2s_50 routing_car_n2s_50" vType="Car" speedFactor="1.16" vaporized=""/>
    <tripinfo id="car_n2w_47" depart="47.00" departLane="n2sep_1" departPos="3.60" departPosLat="0.00" departSpeed="13.90" departDelay="0.00" arrival="194.20" arrivalLane="c2w_1" arrivalPos="990.00" arrivalPosLat="0.00" arrivalSpeed="13.90" duration="147.20" routeLength="1986.69" waitingTime="0.00" waitingCount="0" stopTime="0.00" timeLoss="3.52" rerouteNo="1" devices="tripinfo_car_n2w_47 routing_car_n2w_47" vType="Car" speedFactor="1.00" vaporized=""/>
    <tripinfo id="car_s2w_60" depart="60.00" departLane="s2sep_1" departPos="3.60" departPosLat="0.00" departSpeed="13.90" departDelay="0.00" arrival="197.40" arrivalLane="c2w_1" arrivalPos="990.00" arrivalPosLat="0.00" arrivalSpeed="15.08" duration="137.40" routeLength="1996.47" waitingTime="0.00" waitingCount="0" stopTime="0.00" timeLoss="5.08" rerouteNo="1" devices="tripinfo_car_s2w_60 routing_car_s2w_60" vType="Car" speedFactor="1.09" vaporized=""/>
    <tripinfo id="car_n2e_47" depart="48.45" departLane="n2sep_1" departPos="3.60" departPosLat="0.00" departSpeed="13.90" departDelay="1.45" arrival="198.75" arrivalLane="c2e_1" arrivalPos="990.00" arrivalPosLat="0.00" arrivalSpeed="13.90" duration="150.30" routeLength="1996.47" waitingTime="0.00" waitingCount="0" stopTime="0.00" timeLoss="5.98" rerouteNo="1" devices="tripinfo_car_n2e_47 routing_car_n2e_47" vType="Car" speedFactor="1.00" vaporized=""/>
    <tripinfo id="car_e2n_45" depart="45.00" departLane="e2sep_1" departPos="3.60" departPosLat="0.00" departSpeed="13.90" departDelay="0.00" arrival="207.55" arrivalLane="c2n_1" arrivalPos="990.00" arrivalPosLat="0.00" arrivalSpeed="14.54" duration="162.55" routeLength="1986.69" waitingTime="17.90" waitingCount="1" stopTime="0.00" timeLoss="25.20" rerouteNo="1" devices="tripinfo_car_e2n_45 routing_car_e2n_45" vType="Car" speedFactor="1.05" vaporized=""/>
    <tripinfo id="car_w2s_19" depart="19.00" departLane="w2sep_1" departPos="3.60" departPosLat="0.00" departSpeed="13.90" departDelay="0.00" arrival="207.60" arrivalLane="c2s_1" arrivalPos="990.00" arrivalPosLat="0.00" arrivalSpeed="14.54" duration="188.60" routeLength="1986.69" waitingTime="44.05" waitingCount="1" stopTime="0.00" timeLoss="51.22" rerouteNo="1" devices="tripinfo_car_w2s_19 routing_car_w2s_19" vType="Car" speedFactor="1.05" vaporized=""/>
    <tripinfo id="car_w2e_35" depart="35.00" departLane="w2sep_1" departPos="3.60" departPosLat="0.00" departSpeed="13.90" departDelay="0.00" arrival="207.65" arrivalLane="c2e_1" arrivalPos="990.00" arrivalPosLat="0.00" arrivalSpeed="15.61" duration="172.65" routeLength="1997.01" waitingTime="34.00" waitingCount="1" stopTime="0.00" timeLoss="44.70" rerouteNo="1" devices="tripinfo_car_w2e_35 routing_car_w2e_35" vType="Car" speedFactor="1.12" vaporized=""/>
    <tripinfo id="car_w2s_26" depart="26.00" departLane="w2sep_1" departPos="3.60" departPosLat="0.00" departSpeed="13.90" departDelay="0.00" arrival="212.70" arrivalLane="c2s_1" arrivalPos="990.00" arrivalPosLat="0.00" arrivalSpeed="14.32" duration="186.70" routeLength="1986.69" waitingTime="36.65" waitingCount="1" stopTime="0.00" timeLoss="47.25" rerouteNo="1" devices="tripinfo_car_w2s_26 routing_car_w2s_26" vType="Car" speedFactor="1.03" vaporized=""/>
    <tripinfo id="car_e2n_61" depart="61.00" departLane="e2sep_1" departPos="3.60" departPosLat="0.00" departSpeed="13.90" departDelay="0.00" arrival="212.90" arrivalLane="c2n_1" arrivalPos="990.00" arrivalPosLat="0.00" arrivalSpeed="14.26" duration="151.90" routeLength="1986.69" waitingTime="1.50" waitingCount="1" stopTime="0.00" timeLoss="11.89" rerouteNo="1" devices="tripinfo_car_e2n_61 routing_car_e2n_61" vType="Car" speedFactor="1.03" vaporized=""/>
    <tripinfo id="car_w2e_54" depart="54.00" departLane="w2sep_1" departPos="3.60" departPosLat="0.00" departSpeed="13.90" departDelay="0.00" arrival="218.45" arrivalLane="c2e_1" arrivalPos="990.00" arrivalPosLat="0.00" arrivalSpeed="14.15" duration="164.45" routeLength="1997.01" waitingTime="11.70" waitingCount="1" stopTime="0.00" timeLoss="23.33" rerouteNo="1" devices="tripinfo_car_w2e_54 routing_car_w2e_54" vType="Car" speedFactor="1.02" vaporized=""/>
    <tripinfo id="car_w2s_37" depart="37.00" departLane="w2sep_1" departPos="3.60" departPosLat="0.00" departSpeed="13.90" departDelay="0.00" arrival="218.60" arrivalLane="c2s_1" arrivalPos="990.00" arrivalPosLat="0.00" arrivalSpeed="13.90" duration="181.60" routeLength="1986.69" waitingTime="25.70" waitingCount="1" stopTime="0.00" timeLoss="37.95" rerouteNo="1" devices="tripinfo_car_w2s_37 routing_car_w2s_37" vType="Car" speedFactor="1.00" vaporized=""/>
    <tripinfo id="car_e2n_71" depart="71.00" departLane="e2sep_1" departPos="3.60" departPosLat="0.00" departSpeed="13.90" departDelay="0.00" arrival="219.30" arrivalLane="c2n_1" arrivalPos="990.00" arrivalPosLat="0.00" arrivalSpeed="13.90" duration="148.30" routeLength="1986.69" waitingTime="0.00" waitingCount="0" stopTime="0.00" timeLoss="4.60" rerouteNo="1" devices="tripinfo_car_e2n_71 routing_car_e2n_71" vType="Car" speedFactor="1.00" vaporized=""/>
    <tripinfo id="car_w2s_72" depart="72.00" departLane="w2sep_1" departPos="3.60" departPosLat="0.00" departSpeed="13.90" departDelay="0.00" arrival="220.60" arrivalLane="c2s_1" arrivalPos="990.00" arrivalPosLat="0.00" arrivalSpeed="15.16" duration="148.60" routeLength="1986.69" waitingTime="1.35" waitingCount="1" stopTime="0.00" timeLoss="21.65" rerouteNo="1" devices="tripinfo_car_w2s_72 routing_car_w2s_72" vType="Car" speedFactor="1.13" vaporized=""/>
    <tripinfo id="car_e2n_79" depart="79.00" departLane="e2sep_1" departPos="3.60" departPosLat="0.00" departSpeed="13.90" departDelay="0.00" arrival="221.20" arrivalLane="c2n_1" arrivalPos="990.00" arrivalPosLat="0.00" arrivalSpeed="15.32" duration="142.20" routeLength="1986.69" waitingTime="0.00" waitingCount="0" stopTime="0.00" timeLoss="17.73" rerouteNo="1" devices="tripinfo_car_e2n_79 routing_car_e2n_79" vType="Car" speedFactor="1.15" vaporized=""/>
    <tripinfo id="car_w2e_81" depart="81.00" departLane="w2sep_1" departPos="3.60" departPosLat="0.00" departSpeed="13.90" departDelay="0.00" arrival="225.35" arrivalLane="c2e_1" arrivalPos="990.00" arrivalPosLat="0.00" arrivalSpeed="13.97" duration="144.35" routeLength="1997.01" waitingTime="0.00" waitingCount="0" stopTime="0.00" timeLoss="1.38" rerouteNo="1" devices="tripinfo_car_w2e_81 routing_car_w2e_81" vType="Car" speedFactor="1.01" vaporized=""/>
    <tripinfo id="car_e2s_48" depart="48.00" departLane="e2sep_1" departPos="3.60" departPosLat="0.00" departSpeed="13.90" departDelay="0.00" arrival="228.75" arrivalLane="c2s_1" arrivalPos="990.00" arrivalPosLat="0.00" arrivalSpeed="13.90" duration="180.75" routeLength="1996.47" waitingTime="24.50" waitingCount="2" stopTime="0.00" timeLoss="36.44" rerouteNo="1" devices="tripinfo_car_e2s_48 routing_car_e2s_48" vType="Car" speedFactor="1.00" vaporized=""/>
    <tripinfo id="car_e2s_92" depart="92.00" departLane="e2sep_1" departPos="3.60" departPosLat="0.00" departSpeed="13.90" departDelay="0.00" arrival="230.60" arrivalLane="c2s_1" arrivalPos="990.00" arrivalPosLat="0.00" arrivalSpeed="15.50" duration="138.60" routeLength="1996.47" waitingTime="0.00" waitingCount="0" stopTime="0.00" timeLoss="16.24" rerouteNo="1" devices="tripinfo_car_e2s_92 routing_car_e2s_92" vType="Car" speedFactor="1.18" vaporized=""/>
    <tripinfo id="car_w2e_91" depart="91.00" departLane="w2sep_1" departPos="3.60" departPosLat="0.00" departSpeed="13.90" departDelay="0.00" arrival="232.80" arrivalLane="c2e_1" arrivalPos="990.00" arrivalPosLat="0.00" arrivalSpeed="14.17" duration="141.80" routeLength="1997.01" waitingTime="0.00" waitingCount="0" stopTime="0.00" timeLoss="0.90" rerouteNo="1" devices="tripinfo_car_w2e_91 routing_car_w2e_91" vType="Car" speedFactor="1.02" vaporized=""/>
    <tripinfo id="car_e2n_95" depart="95.00" departLane="e2sep_1" departPos="3.60" departPosLat="0.00" departSpeed="13.90" departDelay="0.00" arrival="238.35" arrivalLane="c2n_1" arrivalPos="990.00" arrivalPosLat="0.00" arrivalSpeed="14.32" duration="143.35" routeLength="1986.69" waitingTime="0.00" waitingCount="0" stopTime="0.00" timeLoss="3.91" rerouteNo="1" devices="tripinfo_car_e2n_95 routing_car_e2n_95" vType="Car" speedFactor="1.03" vaporized=""/>
    <tripinfo id="car_s2e_62" depart="62.00" departLane="s2sep_1" departPos="3.60" departPosLat="0.00" departSpeed="13.90" departDelay="0.00" arrival="248.10" arrivalLane="c2e_1" arrivalPos="990.00" arrivalPosLat="0.00" arrivalSpeed="15.61" duration="186.10" routeLength="1986.69" waitingTime="47.80" waitingCount="1" stopTime="0.00" timeLoss="58.16" rerouteNo="1" devices="tripinfo_car_s2e_62 routing_car_s2e_62" vType="Car" speedFactor="1.12" vaporized=""/>
    <tripinfo id="car_s2e_94" depart="94.00" departLane="s2sep_1" departPos="3.60" departPosLat="0.00" departSpeed="13.90" departDelay="0.00" arrival="253.75" arrivalLane="c2e_1" arrivalPos="990.00" arrivalPosLat="0.00" arrivalSpeed="16.09" duration="159.75" routeLength="1986.69" waitingTime="14.20" waitingCount="1" stopTime="0.00" timeLoss="35.67" rerouteNo="1" devices="tripinfo_car_s2e_94 routing_car_s2e_94" vType="Car" speedFactor="1.16" vaporized=""/>
    <tripinfo id="car_n2w_54" depart="54.00" departLane="n2sep_1" departPos="3.60" departPosLat="0.00" departSpeed="13.90" departDelay="0.00" arrival="254.90" arrivalLane="c2w_1" arrivalPos="990.00" arrivalPosLat="0.00" arrivalSpeed="14.04" duration="200.90" routeLength="1986.69" waitingTime="48.85" waitingCount="1" stopTime="0.00" timeLoss="58.69" rerouteNo="1" devices="tripinfo_car_n2w_54 routing_car_n2w_54" vType="Car" speedFactor="1.01" vaporized=""/>
    <tripinfo id="car_n2w_62" depart="62.00" departLane="n2sep_1" departPos="3.60" departPosLat="0.00" departSpeed="13.90" departDelay="0.00" arrival="258.15" arrivalLane="c2w_1" arrivalPos="990.00" arrivalPosLat="0.00" arrivalSpeed="14.50" duration="196.15" routeLength="1986.69" waitingTime="46.25" waitingCount="1" stopTime="0.00" timeLoss="58.92" rerouteNo="1" devices="tripinfo_car_n2w_62 routing_car_n2w_62" vType="Car" speedFactor="1.05" vaporized=""/>
    <tripinfo id="bus_s2n_90" depart="90.00" departLane="s2sep_1" departPos="12.10" departPosLat="0.00" departSpeed="13.90" departDelay="0.00" arrival="261.00" arrivalLane="c2n_1" arrivalPos="990.00" arrivalPosLat="0.00" arrivalSpeed="13.90" duration="171.00" routeLength="1988.51" waitingTime="16.85" waitingCount="1" stopTime="0.00" timeLoss="27.93" rerouteNo="1" devices="tripinfo_bus_s2n_90 routing_bus_s2n_90" vType="Bus" speedFactor="1.00" vaporized=""/>
    <tripinfo id="car_n2s_101" depart="101.45" departLane="n2sep_1" departPos="3.60" departPosLat="0.00" departSpeed="13.90" departDelay="0.45" arrival="261.30" arrivalLane="c2s_1" arrivalPos="990.00" arrivalPosLat="0.00" arrivalSpeed="15.18" duration="159.85" routeLength="1997.01" waitingTime="9.45" waitingCount="1" stopTime="0.00" timeLoss="28.26" rerouteNo="1" devices="tripinfo_car_n2s_101 routing_car_n2s_101" vType="Car" speedFactor="1.09" vaporized=""/>
    <tripinfo id="car_s2e_108" depart="108.00" departLane="s2sep_1" departPos="3.60" departPosLat="0.00" departSpeed="13.90" departDelay="0.00" arrival="262.75" arrivalLane="c2e_1" arrivalPos="990.00" arrivalPosLat="0.00" arrivalSpeed="14.50" duration="154.75" routeLength="1986.69" waitingTime="3.85" waitingCount="1" stopTime="0.00" timeLoss="17.04" rerouteNo="1" devices="tripinfo_car_s2e_108 routing_car_s2e_108" vType="Car" speedFactor="1.04" vaporized=""/>
    <tripinfo id="car_n2w_90" depart="90.00" departLane="n2sep_1" departPos="3.60" departPosLat="0.00" departSpeed="13.90" departDelay="0.00" arrival="262.80" arrivalLane="c2w_1" arrivalPos="990.00" arrivalPosLat="0.00" arrivalSpeed="13.89" duration="172.80" routeLength="1986.69" waitingTime="17.00" waitingCount="1" stopTime="0.00" timeLoss="29.13" rerouteNo="1" devices="tripinfo_car_n2w_90 routing_car_n2w_90" vType="Car" speedFactor="1.00" vaporized=""/>
    <tripinfo id="car_n2w_92" depart="92.00" departLane="n2sep_1" departPos="3.60" departPosLat="0.00" departSpeed="13.90" departDelay="0.00" arrival="266.40" arrivalLane="c2w_1" arrivalPos="990.00" arrivalPosLat="0.00" arrivalSpeed="13.87" duration="174.40" routeLength="1986.69" waitingTime="14.40" waitingCount="1" stopTime="0.00" timeLoss="30.75" rerouteNo="1" devices="tripinfo_car_n2w_92 routing_car_n2w_92" vType="Car" speedFactor="1.00" vaporized=""/>
    <tripinfo id="car_s2n_109" depart="109.40" departLane="s2sep_1" departPos="3.60" departPosLat="0.00" departSpeed="13.90" departDelay="0.40" arrival="266.95" arrivalLane="c2n_1" arrivalPos="990.00" arrivalPosLat="0.00" arrivalSpeed="14.04" duration="157.55" routeLength="1997.01" waitingTime="0.00" waitingCount="0" stopTime="0.00" timeLoss="15.30" rerouteNo="1" devices="tripinfo_car_s2n_109 routing_car_s2n_109" vType="Car" speedFactor="1.01" vaporized=""/>
    <tripinfo id="car_n2e_109" depart="109.00" departLane="n2sep_1" departPos="3.60" departPosLat="0.00" departSpeed="13.90" departDelay="0.00" arrival="268.35" arrivalLane="c2e_1" arrivalPos="990.00" arrivalPosLat="0.00" arrivalSpeed="15.12" duration="159.35" routeLength="1996.47" waitingTime="13.40" waitingCount="2" stopTime="0.00" timeLoss="26.68" rerouteNo="1" devices="tripinfo_car_n2e_109 routing_car_n2e_109" vType="Car" speedFactor="1.09" vaporized=""/>
    <tripinfo id="car_n2w_100" depart="100.00" departLane="n2sep_1" departPos="3.60" departPosLat="0.00" departSpeed="13.90" departDelay="0.00" arrival="269.25" arrivalLane="c2w_1" arrivalPos="990.00" arrivalPosLat="0.00" arrivalSpeed="14.06" duration="169.25" routeLength="1986.69" waitingTime="10.40" waitingCount="1" stopTime="0.00" timeLoss="28.15" rerouteNo="1" devices="tripinfo_car_n2w_100 routing_car_n2w_100" vType="Car" speedFactor="1.02" vaporized=""/>
    <tripinfo id="bus_n2s_110" depart="110.85" departLane="n2sep_1" departPos="12.10" departPosLat="0.00" departSpeed="13.90" departDelay="0.85" arrival="270.50" arrivalLane="c2s_1" arrivalPos="990.00" arrivalPosLat="0.00" arrivalSpeed="13.90" duration="159.65" routeLength="1988.51" waitingTime="1.75" waitingCount="1" stopTime="0.00" timeLoss="16.60" rerouteNo="1" devices="tripinfo_bus_n2s_110 routing_bus_n2s_110" vType="Bus" speedFactor="1.00" vaporized=""/>
    <tripinfo id="car_s2n_111" depart="111.20" departLane="s2sep_1" departPos="3.60" departPosLat="0.00" departSpeed="13.90" departDelay="0.20" arrival="271.20" arrivalLane="c2n_1" arrivalPos="990.00" arrivalPosLat="0.00" arrivalSpeed="13.89" duration="160.00" routeLength="1997.01" waitingTime="0.00" waitingCount="0" stopTime="0.00" timeLoss="16.33" rerouteNo="1" devices="tripinfo_car_s2n_111 routing_car_s2n_111" vType="Car" speedFactor="1.00" vaporized=""/>
    <tripinfo id="car_n2w_130" depart="130.00" departLane="n2sep_1" departPos="3.60" departPosLat="0.00" departSpeed="13.90" departDelay="0.00" arrival="271.20" arrivalLane="c2w_1" arrivalPos="990.00" arrivalPosLat="0.00" arrivalSpeed="15.23" duration="141.20" routeLength="1986.69" waitingTime="0.00" waitingCount="0" stopTime="0.00" timeLoss="15.47" rerouteNo="1" devices="tripinfo_car_n2w_130 routing_car_n2w_130" vType="Car" speedFactor="1.14" vaporized=""/>
    <tripinfo id="car_s2n_123" depart="123.00" departLane="s2sep_1" departPos="3.60" departPosLat="0.00" departSpeed="13.90" departDelay="0.00" arrival="274.70" arrivalLane="c2n_1" arrivalPos="990.00" arrivalPosLat="0.00" arrivalSpeed="13.87" duration="151.70" routeLength="1997.01" waitingTime="0.00" waitingCount="0" stopTime="0.00" timeLoss="8.01" rerouteNo="1" devices="tripinfo_car_s2n_123 routing_car_s2n_123" vType="Car" speedFactor="1.00" vaporized=""/>
    <tripinfo id="car_n2s_111" depart="112.50" departLane="n2sep_1" departPos="3.60" departPosLat="0.00" departSpeed="13.90" departDelay="1.50" arrival="275.30" arrivalLane="c2s_1" arrivalPos="990.00" arrivalPosLat="0.00" arrivalSpeed="13.89" duration="162.80" routeLength="1997.01" waitingTime="0.00" waitingCount="0" stopTime="0.00" timeLoss="19.09" rerouteNo="1" devices="tripinfo_car_n2s_111 routing_car_n2s_111" vType="Car" speedFactor="1.00" vaporized=""/>
    <tripinfo id="car_n2s_114" depart="114.35" departLane="n2sep_1" departPos="3.60" departPosLat="0.00" departSpeed="13.90" departDelay="0.35" arrival="277.10" arrivalLane="c2s_1" arrivalPos="990.00" arrivalPosLat="0.00" arrivalSpeed="15.34" duration="162.75" routeLength="1997.01" waitingTime="0.00" waitingCount="0" stopTime="0.00" timeLoss="39.82" rerouteNo="1" devices="tripinfo_car_n2s_114 routing_car_n2s_114" vType="Car" speedFactor="1.17" vaporized=""/>
    <tripinfo id="car_s2w_69" depart="69.00" departLane="s2sep_1" departPos="3.60" departPosLat="0.00" departSpeed="13.90" departDelay="0.00" arrival="279.40" arrivalLane="c2w_1" arrivalPos="990.00" arrivalPosLat="0.00" arrivalSpeed="13.90" duration="210.40" routeLength="1996.47" waitingTime="53.75" waitingCount="2" stopTime="0.00" timeLoss="66.09" rerouteNo="1" devices="tripinfo_car_s2w_69 routing_car_s2w_69" vType="Car" speedFactor="1.00" vaporized=""/>
    <tripinfo id="car_s2e_147" depart="147.00" departLane="s2sep_1" departPos="3.60" departPosLat="0.00" departSpeed="13.90" departDelay="0.00" arrival="279.60" arrivalLane="c2e_1" arrivalPos="990.00" arrivalPosLat="0.00" arrivalSpeed="15.56" duration="132.60" routeLength="1986.69" waitingTime="0.00" waitingCount="0" stopTime="0.00" timeLoss="4.24" rerouteNo="1" devices="tripinfo_car_s2e_147 routing_car_s2e_147" vType="Car" speedFactor="1.12" vaporized=""/>
    <tripinfo id="car_n2e_143" depart="143.00" departLane="n2sep_1" departPos="3.60" departPosLat="0.00" departSpeed="13.90" departDelay="0.00" arrival="283.40" arrivalLane="c2e_1" arrivalPos="990.00" arrivalPosLat="0.00" arrivalSpeed="15.70" duration="140.40" routeLength="1996.47" waitingTime="2.30" waitingCount="1" stopTime="0.00" timeLoss="12.87" rerouteNo="1" devices="tripinfo_car_n2e_143 routing_car_n2e_143" vType="Car" speedFactor="1.13" vaporized=""/>
    <tripinfo id="car_s2w_77" depart="77.00" departLane="s2sep_1" departPos="3.60" departPosLat="0.00" departSpeed="13.90" departDelay="0.00" arrival="283.60" arrivalLane="c2w_1" arrivalPos="990.00" arrivalPosLat="0.00" arrivalSpeed="13.89" duration="206.60" routeLength="1996.47" waitingTime="45.50" waitingCount="2" stopTime="0.00" timeLoss="62.27" rerouteNo="1" devices="tripinfo_car_s2w_77 routing_car_s2w_77" vType="Car" speedFactor="1.00" vaporized=""/>
    <tripinfo id="car_s2w_78" depart="78.45" departLane="s2sep_1" departPos="3.60" departPosLat="0.00" departSpeed="13.90" departDelay="0.45" arrival="285.40" arrivalLane="c2w_1" arrivalPos="990.00" arrivalPosLat="0.00" arrivalSpeed="15.40" duration="206.95" routeLength="1996.47" waitingTime="43.15" waitingCount="2" stopTime="0.00" timeLoss="84.47" rerouteNo="1" devices="tripinfo_car_s2w_78 routing_car_s2w_78" vType="Car" speedFactor="1.18" vaporized=""/>
    <tripinfo id="car_s2w_87" depart="87.00" departLane="s2sep_1" departPos="3.60" departPosLat="0.00" departSpeed="13.90" departDelay="0.00" arrival="287.25" arrivalLane="c2w_1" arrivalPos="990.00" arrivalPosLat="0.00" arrivalSpeed="15.51" duration="200.25" routeLength="1996.47" waitingTime="41.80" waitingCount="2" stopTime="0.00" timeLoss="77.07" rerouteNo="1" devices="tripinfo_car_s2w_87 routing_car_s2w_87" vType="Car" speedFactor="1.17" vaporized=""/>
    <tripinfo id="car_s2w_92" depart="92.00" departLane="s2sep_1" departPos="3.60" departPosLat="0.00" departSpeed="13.90" departDelay="0.00" arrival="289.40" arrivalLane="c2w_1" arrivalPos="990.00" arrivalPosLat="0.00" arrivalSpeed="14.98" duration="197.40" routeLength="1996.47" waitingTime="31.25" waitingCount="2" stopTime="0.00" timeLoss="66.47" rerouteNo="1" devices="tripinfo_car_s2w_92 routing_car_s2w_92" vType="Car" speedFactor="1.10" vaporized=""/>
    <tripinfo id="car_s2w_113" depart="113.05" departLane="s2sep_1" departPos="3.60" departPosLat="0.00" departSpeed="13.90" departDelay="0.05" arrival="293.15" arrivalLane="c2w_1" arrivalPos="990.00" arrivalPosLat="0.00" arrivalSpeed="13.88" duration="180.10" routeLength="1996.47" waitingTime="13.65" waitingCount="1" stopTime="0.00" timeLoss="35.76" rerouteNo="1" devices="tripinfo_car_s2w_113 routing_car_s2w_113" vType="Car" speedFactor="1.00" vaporized=""/>
    <tripinfo id="car_s2w_116" depart="116.00" departLane="s2sep_1" departPos="3.60" departPosLat="0.00" departSpeed="13.90" departDelay="0.00" arrival="296.10" arrivalLane="c2w_1" arrivalPos="990.00" arrivalPosLat="0.00" arrivalSpeed="14.06" duration="180.10" routeLength="1996.47" waitingTime="13.60" waitingCount="1" stopTime="0.00" timeLoss="38.14" rerouteNo="1" devices="tripinfo_car_s2w_116 routing_car_s2w_116" vType="Car" speedFactor="1.02" vaporized=""/>
    <tripinfo id="car_e2w_105" depart="105.00" departLane="e2sep_1" departPos="3.60" departPosLat="0.00" departSpeed="13.90" departDelay="0.00" arrival="299.55" arrivalLane="c2w_1" arrivalPos="990.00" arrivalPosLat="0.00" arrivalSpeed="14.38" duration="194.55" routeLength="1997.01" waitingTime="47.45" waitingCount="1" stopTime="0.00" timeLoss="56.11" rerouteNo="1" devices="tripinfo_car_e2w_105 routing_car_e2w_105" vType="Car" speedFactor="1.04" vaporized=""/>
    <tripinfo id="car_w2e_122" depart="122.30" departLane="w2sep_1" departPos="3.60" departPosLat="0.00" departSpeed="13.90" departDelay="0.30" arrival="300.55" arrivalLane="c2e_1" arrivalPos="990.00" arrivalPosLat="0.00" arrivalSpeed="13.94" duration="178.25" routeLength="1997.01" waitingTime="26.65" waitingCount="1" stopTime="0.00" timeLoss="35.01" rerouteNo="1" devices="tripinfo_car_w2e_122 routing_car_w2e_122" vType="Car" speedFactor="1.00" vaporized=""/>
    <tripinfo id="car_w2s_139" depart="139.00" departLane="w2sep_1" departPos="3.60" departPosLat="0.00" departSpeed="13.90" departDelay="0.00" arrival="301.35" arrivalLane="c2s_1" arrivalPos="990.00" arrivalPosLat="0.00" arrivalSpeed="14.23" duration="162.35" routeLength="1986.69" waitingTime="13.25" waitingCount="1" stopTime="0.00" timeLoss="21.99" rerouteNo="1" devices="tripinfo_car_w2s_139 routing_car_w2s_139" vType="Car" speedFactor="1.02" vaporized=""/>
    <tripinfo id="car_w2n_111" depart="111.00" departLane="w2sep_1" departPos="3.60" departPosLat="0.00" departSpeed="13.90" departDelay="0.00" arrival="302.80" arrivalLane="c2n_1" arrivalPos="990.00" arrivalPosLat="0.00" arrivalSpeed="13.90" duration="191.80" routeLength="1996.47" waitingTime="39.25" waitingCount="1" stopTime="0.00" timeLoss="47.47" rerouteNo="1" devices="tripinfo_car_w2n_111 routing_car_w2n_111" vType="Car" speedFactor="1.00" vaporized=""/>
    <tripinfo id="car_w2n_121" depart="121.00" departLane="w2sep_1" departPos="3.60" departPosLat="0.00" departSpeed="13.90" departDelay="0.00" arrival="305.05" arrivalLane="c2n_1" arrivalPos="990.00" arrivalPosLat="0.00" arrivalSpeed="14.92" duration="184.05" routeLength="1996.47" waitingTime="35.45" waitingCount="1" stopTime="0.00" timeLoss="52.36" rerouteNo="1" devices="tripinfo_car_w2n_121 routing_car_w2n_121" vType="Car" speedFactor="1.10" vaporized=""/>
    <tripinfo id="car_w2s_148" depart="148.00" departLane="w2sep_1" departPos="3.60" departPosLat="0.00" departSpeed="13.90" departDelay="0.00" arrival="306.15" arrivalLane="c2s_1" arrivalPos="990.00" arrivalPosLat="0.00" arrivalSpeed="14.11" duration="158.15" routeLength="1986.69" waitingTime="4.90" waitingCount="1" stopTime="0.00" timeLoss="16.69" rerouteNo="1" devices="tripinfo_car_w2s_148 routing_car_w2s_148" vType="Car" speedFactor="1.02" vaporized=""/>
    <tripinfo id="car_w2e_149" depart="149.45" departLane="w2sep_1" departPos="3.60" departPosLat="0.00" departSpeed="13.90" departDelay="0.45" arrival="307.75" arrivalLane="c2e_1" arrivalPos="990.00" arrivalPosLat="0.00" arrivalSpeed="13.90" duration="158.30" routeLength="1997.01" waitingTime="1.75" waitingCount="1" stopTime="0.00" timeLoss="14.60" rerouteNo="1" devices="tripinfo_car_w2e_149 routing_car_w2e_149" vType="Car" speedFactor="1.00" vaporized=""/>
    <tripinfo id="car_w2s_153" depart="153.00" departLane="w2sep_1" departPos="3.60" departPosLat="0.00" departSpeed="13.90" departDelay="0.00" arrival="308.10" arrivalLane="c2s_1" arrivalPos="990.00" arrivalPosLat="0.00" arrivalSpeed="15.39" duration="155.10" routeLength="1986.69" waitingTime="1.05" waitingCount="1" stopTime="0.00" timeLoss="30.62" rerouteNo="1" devices="tripinfo_car_w2s_153 routing_car_w2s_153" vType="Car" speedFactor="1.15" vaporized=""/>
    <tripinfo id="car_w2n_128" depart="128.00" departLane="w2sep_1" departPos="3.60" departPosLat="0.00" departSpeed="13.90" departDelay="0.00" arrival="309.50" arrivalLane="c2n_1" arrivalPos="990.00" arrivalPosLat="0.00" arrivalSpeed="13.89" duration="181.50" routeLength="1996.47" waitingTime="23.30" waitingCount="1" stopTime="0.00" timeLoss="37.17" rerouteNo="1" devices="tripinfo_car_w2n_128 routing_car_w2n_128" vType="Car" speedFactor="1.00" vaporized=""/>
    <tripinfo id="car_e2s_145" depart="145.00" departLane="e2sep_1" departPos="3.60" departPosLat="0.00" departSpeed="13.90" departDelay="0.00" arrival="310.70" arrivalLane="c2s_1" arrivalPos="990.00" arrivalPosLat="0.00" arrivalSpeed="14.90" duration="165.70" routeLength="1996.47" waitingTime="17.85" waitingCount="2" stopTime="0.00" timeLoss="32.39" rerouteNo="1" devices="tripinfo_car_e2s_145 routing_car_e2s_145" vType="Car" speedFactor="1.08" vaporized=""/>
    <tripinfo id="car_w2n_162" depart="162.00" departLane="w2sep_1" departPos="3.60" departPosLat="0.00" departSpeed="13.90" departDelay="0.00" arrival="312.20" arrivalLane="c2n_1" arrivalPos="990.00" arrivalPosLat="0.00" arrivalSpeed="14.33" duration="150.20" routeLength="1996.47" waitingTime="0.00" waitingCount="0" stopTime="0.00" timeLoss="11.42" rerouteNo="1" devices="tripinfo_car_w2n_162 routing_car_w2n_162" vType="Car" speedFactor="1.04" vaporized=""/>
    <tripinfo id="car_w2n_165" depart="165.00" departLane="w2sep_1" departPos="3.60" departPosLat="0.00" departSpeed="13.90" departDelay="0.00" arrival="315.15" arrivalLane="c2n_1" arrivalPos="990.00" arrivalPosLat="0.00" arrivalSpeed="14.13" duration="150.15" routeLength="1996.47" waitingTime="0.00" waitingCount="0" stopTime="0.00" timeLoss="8.97" rerouteNo="1" devices="tripinfo_car_w2n_165 routing_car_w2n_165" vType="Car" speedFactor="1.02" vaporized=""/>
    <tripinfo id="car_w2n_168" depart="168.00" departLane="w2sep_1" departPos="3.60" departPosLat="0.00" departSpeed="13.90" departDelay="0.00" arrival="318.10" arrivalLane="c2n_1" arrivalPos="990.00" arrivalPosLat="0.00" arrivalSpeed="14.14" duration="150.10" routeLength="1996.47" waitingTime="0.00" waitingCount="0" stopTime="0.00" timeLoss="9.01" rerouteNo="1" devices="tripinfo_car_w2n_168 routing_car_w2n_168" vType="Car" speedFactor="1.02" vaporized=""/>
    <tripinfo id="car_w2s_180" depart="180.00" departLane="w2sep_1" departPos="3.60" departPosLat="0.00" departSpeed="13.90" departDelay="0.00" arrival="324.70" arrivalLane="c2s_1" arrivalPos="990.00" arrivalPosLat="0.00" arrivalSpeed="14.17" duration="144.70" routeLength="1986.69" waitingTime="0.00" waitingCount="0" stopTime="0.00" timeLoss="3.80" rerouteNo="1" devices="tripinfo_car_w2s_180 routing_car_w2s_180" vType="Car" speedFactor="1.02" vaporized=""/>
    <tripinfo id="car_w2n_187" depart="187.00" departLane="w2sep_1" departPos="3.60" departPosLat="0.00" departSpeed="13.90" departDelay="0.00" arrival="328.00" arrivalLane="c2n_1" arrivalPos="990.00" arrivalPosLat="0.00" arrivalSpeed="14.67" duration="141.00" routeLength="1996.47" waitingTime="0.00" waitingCount="0" stopTime="0.00" timeLoss="4.29" rerouteNo="1" devices="tripinfo_car_w2n_187 routing_car_w2n_187" vType="Car" speedFactor="1.06" vaporized=""/>
    <tripinfo id="car_s2e_151" depart="151.00" departLane="s2sep_1" departPos="3.60" departPosLat="0.00" departSpeed="13.90" departDelay="0.00" arrival="335.15" arrivalLane="c2e_1" arrivalPos="990.00" arrivalPosLat="0.00" arrivalSpeed="16.38" duration="184.15" routeLength="1986.69" waitingTime="52.45" waitingCount="1" stopTime="0.00" timeLoss="62.25" rerouteNo="1" devices="tripinfo_car_s2e_151 routing_car_s2e_151" vType="Car" speedFactor="1.18" vaporized=""/>
    <tripinfo id="car_n2w_201" depart="201.00" departLane="n2sep_1" departPos="3.60" departPosLat="0.00" departSpeed="13.90" departDelay="0.00" arrival="344.15" arrivalLane="c2w_1" arrivalPos="990.00" arrivalPosLat="0.00" arrivalSpeed="14.35" duration="143.15" routeLength="1986.69" waitingTime="0.00" waitingCount="0" stopTime="0.00" timeLoss="4.00" rerouteNo="1" devices="tripinfo_car_n2w_201 routing_car_n2w_201" vType="Car" speedFactor="1.03" vaporized=""/>
    <tripinfo id="car_s2w_201" depart="201.00" departLane="s2sep_1" departPos="3.60" departPosLat="0.00" departSpeed="13.90" departDelay="0.00" arrival="347.30" arrivalLane="c2w_1" arrivalPos="990.00" arrivalPosLat="0.00" arrivalSpeed="15.24" duration="146.30" routeLength="1996.47" waitingTime="2.35" waitingCount="1" stopTime="0.00" timeLoss="15.35" rerouteNo="1" devices="tripinfo_car_s2w_201 routing_car_s2w_201" vType="Car" speedFactor="1.10" vaporized=""/>
    <tripinfo id="car_s2n_169" depart="169.00" departLane="s2sep_1" departPos="3.60" departPosLat="0.00" departSpeed="13.90" departDelay="0.00" arrival="347.80" arrivalLane="c2n_1" arrivalPos="990.00" arrivalPosLat="0.00" arrivalSpeed="13.90" duration="178.80" routeLength="1997.01" waitingTime="26.90" waitingCount="1" stopTime="0.00" timeLoss="35.12" rerouteNo="1" devices="tripinfo_car_s2n_169 routing_car_s2n_169" vType="Car" speedFactor="1.00" vaporized=""/>
    <tripinfo id="car_n2s_203" depart="203.00" departLane="n2sep_1" departPos="3.60" departPosLat="0.00" departSpeed="13.90" departDelay="0.00" arrival="348.10" arrivalLane="c2s_1" arrivalPos="990.00" arrivalPosLat="0.00" arrivalSpeed="14.00" duration="145.10" routeLength="1997.01" waitingTime="0.00" waitingCount="0" stopTime="0.00" timeLoss="2.47" rerouteNo="1" devices="tripinfo_car_n2s_203 routing_car_n2s_203" vType="Car" speedFactor="1.01" vaporized=""/>
    <tripinfo id="car_s2e_193" depart="193.00" departLane="s2sep_1" departPos="3.60" departPosLat="0.00" departSpeed="13.90" departDelay="0.00" arrival="350.45" arrivalLane="c2e_1" arrivalPos="990.00" arrivalPosLat="0.00" arrivalSpeed="13.90" duration="157.45" routeLength="1986.69" waitingTime="4.00" waitingCount="1" stopTime="0.00" timeLoss="13.81" rerouteNo="1" devices="tripinfo_car_s2e_193 routing_car_s2e_193" vType="Car" speedFactor="1.00" vaporized=""/>
    <tripinfo id="car_s2e_195" depart="195.00" departLane="s2sep_1" departPos="3.60" departPosLat="0.00" departSpeed="13.90" departDelay="0.00" arrival="352.30" arrivalLane="c2e_1" arrivalPos="990.00" arrivalPosLat="0.00" arrivalSpeed="15.50" duration="157.30" routeLength="1986.69" waitingTime="3.40" waitingCount="1" stopTime="0.00" timeLoss="35.49" rerouteNo="1" devices="tripinfo_car_s2e_195 routing_car_s2e_195" vType="Car" speedFactor="1.18" vaporized=""/>
    <tripinfo id="car_s2e_204" depart="204.00" departLane="s2sep_1" departPos="3.60" departPosLat="0.00" departSpeed="13.90" departDelay="0.00" arrival="354.75" arrivalLane="c2e_1" arrivalPos="990.00" arrivalPosLat="0.00" arrivalSpeed="14.91" duration="150.75" routeLength="1986.69" waitingTime="0.00" waitingCount="0" stopTime="0.00" timeLoss="18.57" rerouteNo="1" devices="tripinfo_car_s2e_204 routing_car_s2e_204" vType="Car" speedFactor="1.09" vaporized=""/>
    <tripinfo id="car_s2w_211" depart="211.00" departLane="s2sep_1" departPos="3.60" departPosLat="0.00" departSpeed="13.90" departDelay="0.00" arrival="358.80" arrivalLane="c2w_1" arrivalPos="990.00" arrivalPosLat="0.00" arrivalSpeed="13.92" duration="147.80" routeLength="1996.47" waitingTime="0.00" waitingCount="0" stopTime="0.00" timeLoss="3.70" rerouteNo="1" devices="tripinfo_car_s2w_211 routing_car_s2w_211" vType="Car" speedFactor="1.00" vaporized=""/>
    <tripinfo id="car_n2e_158" depart="158.00" departLane="n2sep_1" departPos="3.60" departPosLat="0.00" departSpeed="13.90" departDelay="0.00" arrival="359.45" arrivalLane="c2e_1" arrivalPos="990.00" arrivalPosLat="0.00" arrivalSpeed="13.97" duration="201.45" routeLength="1996.47" waitingTime="45.65" waitingCount="2" stopTime="0.00" timeLoss="57.88" rerouteNo="1" devices="tripinfo_car_n2e_158 routing_car_n2e_158" vType="Car" speedFactor="1.01" vaporized=""/>
    <tripinfo id="car_n2e_161" depart="161.00" departLane="n2sep_1" departPos="3.60" departPosLat="0.00" departSpeed="13.90" departDelay="0.00" arrival="361.30" arrivalLane="c2e_1" arrivalPos="990.00" arrivalPosLat="0.00" arrivalSpeed="15.43" duration="200.30" routeLength="1996.47" waitingTime="43.75" waitingCount="2" stopTime="0.00" timeLoss="77.14" rerouteNo="1" devices="tripinfo_car_n2e_161 routing_car_n2e_161" vType="Car" speedFactor="1.17" vaporized=""/>
    <tripinfo id="car_s2n_227" depart="227.00" departLane="s2sep_1" departPos="3.60" departPosLat="0.00" departSpeed="13.90" departDelay="0.00" arrival="363.15" arrivalLane="c2n_1" arrivalPos="990.00" arrivalPosLat="0.00" arrivalSpeed="15.18" duration="136.15" routeLength="1997.01" waitingTime="0.00" waitingCount="0" stopTime="0.00" timeLoss="4.56" rerouteNo="1" devices="tripinfo_car_s2n_227 routing_car_s2n_227" vType="Car" speedFactor="1.09" vaporized=""/>
    <tripinfo id="car_s2w_218" depart="218.00" departLane="s2sep_1" departPos="3.60" departPosLat="0.00" departSpeed="13.90" departDelay="0.00" arrival="364.00" arrivalLane="c2w_1" arrivalPos="990.00" arrivalPosLat="0.00" arrivalSpeed="14.20" duration="146.00" routeLength="1996.47" waitingTime="0.00" waitingCount="0" stopTime="0.00" timeLoss="4.78" rerouteNo="1" devices="tripinfo_car_s2w_218 routing_car_s2w_218" vType="Car" speedFactor="1.02" vaporized=""/>
    <tripinfo id="car_n2e_205" depart="205.00" departLane="n2sep_1" departPos="3.60" departPosLat="0.00" departSpeed="13.90" departDelay="0.00" arrival="364.35" arrivalLane="c2e_1" arrivalPos="990.00" arrivalPosLat="0.00" arrivalSpeed="14.32" duration="159.35" routeLength="1996.47" waitingTime="0.90" waitingCount="1" stopTime="0.00" timeLoss="19.86" rerouteNo="1" devices="tripinfo_car_n2e_205 routing_car_n2e_205" vType="Car" speedFactor="1.03" vaporized=""/>
    <tripinfo id="car_s2w_224" depart="224.00" departLane="s2sep_1" departPos="3.60" departPosLat="0.00" departSpeed="13.90" departDelay="0.00" arrival="370.50" arrivalLane="c2w_1" arrivalPos="990.00" arrivalPosLat="0.00" arrivalSpeed="14.13" duration="146.50" routeLength="1996.47" waitingTime="0.00" waitingCount="0" stopTime="0.00" timeLoss="4.52" rerouteNo="1" devices="tripinfo_car_s2w_224 routing_car_s2w_224" vType="Car" speedFactor="1.02" vaporized=""/>
    <tripinfo id="car_s2e_233" depart="233.00" departLane="s2sep_1" departPos="3.60" departPosLat="0.00" departSpeed="13.90" departDelay="0.00" arrival="370.55" arrivalLane="c2e_1" arrivalPos="990.00" arrivalPosLat="0.00" arrivalSpeed="15.16" duration="137.55" routeLength="1986.69" waitingTime="0.00" waitingCount="0" stopTime="0.00" timeLoss="5.83" rerouteNo="1" devices="tripinfo_car_s2e_233 routing_car_s2e_233" vType="Car" speedFactor="1.09" vaporized=""/>
    <tripinfo id="car_e2w_209" depart="209.00" departLane="e2sep_1" departPos="3.60" departPosLat="0.00" departSpeed="13.90" departDelay="0.00" arrival="383.95" arrivalLane="c2w_1" arrivalPos="990.00" arrivalPosLat="0.00" arrivalSpeed="15.95" duration="174.95" routeLength="1997.01" waitingTime="33.15" waitingCount="1" stopTime="0.00" timeLoss="49.74" rerouteNo="1" devices="tripinfo_car_e2w_209 routing_car_e2w_209" vType="Car" speedFactor="1.15" vaporized=""/>
    <tripinfo id="car_e2n_207" depart="207.00" departLane="e2sep_1" departPos="3.60" departPosLat="0.00" departSpeed="13.90" departDelay="0.00" arrival="389.45" arrivalLane="c2n_1" arrivalPos="990.00" arrivalPosLat="0.00" arrivalSpeed="14.13" duration="182.45" routeLength="1986.69" waitingTime="34.15" waitingCount="1" stopTime="0.00" timeLoss="41.20" rerouteNo="1" devices="tripinfo_car_e2n_207 routing_car_e2n_207" vType="Car" speedFactor="1.02" vaporized=""/>
    <tripinfo id="car_w2e_206" depart="206.00" departLane="w2sep_1" departPos="3.60" departPosLat="0.00" departSpeed="13.90" departDelay="0.00" arrival="390.75" arrivalLane="c2e_1" arrivalPos="990.00" arrivalPosLat="0.00" arrivalSpeed="13.90" duration="184.75" routeLength="1997.01" waitingTime="34.00" waitingCount="1" stopTime="0.00" timeLoss="41.05" rerouteNo="1" devices="tripinfo_car_w2e_206 routing_car_w2e_206" vType="Car" speedFactor="1.00" vaporized=""/>
    <tripinfo id="car_w2s_231" depart="231.00" departLane="w2sep_1" departPos="3.60" departPosLat="0.00" departSpeed="13.90" departDelay="0.00" arrival="392.60" arrivalLane="c2s_1" arrivalPos="990.00" arrivalPosLat="0.00" arrivalSpeed="14.42" duration="161.60" routeLength="1986.69" waitingTime="13.35" waitingCount="1" stopTime="0.00" timeLoss="23.17" rerouteNo="1" devices="tripinfo_car_w2s_231 routing_car_w2s_231" vType="Car" speedFactor="1.04" vaporized=""/>
    <tripinfo id="car_w2e_208" depart="208.00" departLane="w2sep_1" departPos="3.60" departPosLat="0.00" departSpeed="13.90" departDelay="0.00" arrival="394.10" arrivalLane="c2e_1" arrivalPos="990.00" arrivalPosLat="0.00" arrivalSpeed="14.28" duration="186.10" routeLength="1997.01" waitingTime="32.00" waitingCount="1" stopTime="0.00" timeLoss="46.63" rerouteNo="1" devices="tripinfo_car_w2e_208 routing_car_w2e_208" vType="Car" speedFactor="1.03" vaporized=""/>
    <tripinfo id="car_e2w_211" depart="211.00" departLane="e2sep_1" departPos="3.60" departPosLat="0.00" departSpeed="13.90" departDelay="0.00" arrival="395.30" arrivalLane="c2w_1" arrivalPos="990.00" arrivalPosLat="0.00" arrivalSpeed="13.90" duration="184.30" routeLength="1997.01" waitingTime="29.40" waitingCount="1" stopTime="0.00" timeLoss="40.59" rerouteNo="1" devices="tripinfo_car_e2w_211 routing_car_e2w_211" vType="Car" speedFactor="1.00" vaporized=""/>
    <tripinfo id="car_w2s_250" depart="250.00" departLane="w2sep_1" departPos="3.60" departPosLat="0.00" departSpeed="13.90" departDelay="0.00" arrival="399.00" arrivalLane="c2s_1" arrivalPos="990.00" arrivalPosLat="0.00" arrivalSpeed="13.90" duration="149.00" routeLength="1986.69" waitingTime="0.00" waitingCount="0" stopTime="0.00" timeLoss="5.34" rerouteNo="1" devices="tripinfo_car_w2s_250 routing_car_w2s_250" vType="Car" speedFactor="1.00" vaporized=""/>
    <tripinfo id="car_e2w_244" depart="244.00" departLane="e2sep_1" departPos="3.60" departPosLat="0.00" departSpeed="13.90" departDelay="0.00" arrival="399.15" arrivalLane="c2w_1" arrivalPos="990.00" arrivalPosLat="0.00" arrivalSpeed="15.22" duration="155.15" routeLength="1997.01" waitingTime="6.60" waitingCount="1" stopTime="0.00" timeLoss="24.20" rerouteNo="1" devices="tripinfo_car_e2w_244 routing_car_e2w_244" vType="Car" speedFactor="1.10" vaporized=""/>
    <tripinfo id="bus_e2n_223" depart="223.00" departLane="e2sep_1" departPos="12.10" departPosLat="0.00" departSpeed="13.90" departDelay="0.00" arrival="400.75" arrivalLane="c2n_1" arrivalPos="990.00" arrivalPosLat="0.00" arrivalSpeed="13.90" duration="177.75" routeLength="1978.19" waitingTime="21.40" waitingCount="1" stopTime="0.00" timeLoss="34.69" rerouteNo="1" devices="tripinfo_bus_e2n_223 routing_bus_e2n_223" vType="Bus" speedFactor="1.00" vaporized=""/>
    <tripinfo id="car_e2s_213" depart="213.00" departLane="e2sep_1" departPos="3.60" departPosLat="0.00" departSpeed="13.90" departDelay="0.00" arrival="402.95" arrivalLane="c2s_1" arrivalPos="990.00" arrivalPosLat="0.00" arrivalSpeed="13.98" duration="189.95" routeLength="1996.47" waitingTime="29.80" waitingCount="2" stopTime="0.00" timeLoss="46.62" rerouteNo="1" devices="tripinfo_car_e2s_213 routing_car_e2s_213" vType="Car" speedFactor="1.01" vaporized=""/>
    <tripinfo id="car_e2n_242" depart="242.00" departLane="e2sep_1" departPos="3.60" departPosLat="0.00" departSpeed="13.90" departDelay="0.00" arrival="403.65" arrivalLane="c2n_1" arrivalPos="990.00" arrivalPosLat="0.00" arrivalSpeed="14.94" duration="161.65" routeLength="1986.69" waitingTime="8.60" waitingCount="1" stopTime="0.00" timeLoss="29.63" rerouteNo="1" devices="tripinfo_car_e2n_242 routing_car_e2n_242" vType="Car" speedFactor="1.09" vaporized=""/>
    <tripinfo id="car_e2s_232" depart="232.00" departLane="e2sep_1" departPos="3.60" departPosLat="0.00" departSpeed="13.90" departDelay="0.00" arrival="405.60" arrivalLane="c2s_1" arrivalPos="990.00" arrivalPosLat="0.00" arrivalSpeed="14.37" duration="173.60" routeLength="1996.47" waitingTime="16.40" waitingCount="2" stopTime="0.00" timeLoss="35.30" rerouteNo="1" devices="tripinfo_car_e2s_232 routing_car_e2s_232" vType="Car" speedFactor="1.04" vaporized=""/>
    <tripinfo id="amb_w2e_300" depart="300.00" departLane="w2sep_1" departPos="6.60" departPosLat="0.00" departSpeed="13.90" departDelay="0.00" arrival="407.15" arrivalLane="c2e_1" arrivalPos="990.00" arrivalPosLat="-0.95" arrivalSpeed="20.85" duration="107.15" routeLength="1994.01" waitingTime="0.00" waitingCount="0" stopTime="0.00" timeLoss="11.49" rerouteNo="1" devices="tripinfo_amb_w2e_300 routing_amb_w2e_300 bluelight_amb_w2e_300 fcd_amb_w2e_300" vType="Ambulance" speedFactor="1.50" vaporized="">
        <example_device customValue1="0.00" customValue2="-1.00"/>
    </tripinfo>
    <tripinfo id="car_e2w_254" depart="254.00" departLane="e2sep_1" departPos="3.60" departPosLat="0.00" departSpeed="13.90" departDelay="0.00" arrival="407.20" arrivalLane="c2w_1" arrivalPos="990.00" arrivalPosLat="0.00" arrivalSpeed="13.90" duration="153.20" routeLength="1997.01" waitingTime="0.00" waitingCount="0" stopTime="0.00" timeLoss="9.51" rerouteNo="1" devices="tripinfo_car_e2w_254 routing_car_e2w_254" vType="Car" speedFactor="1.00" vaporized=""/>
    <tripinfo id="car_e2w_266" depart="266.00" departLane="e2sep_1" departPos="3.60" departPosLat="0.00" departSpeed="13.90" departDelay="0.00" arrival="411.25" arrivalLane="c2w_1" arrivalPos="990.00" arrivalPosLat="0.00" arrivalSpeed="14.01" duration="145.25" routeLength="1997.01" waitingTime="0.00" waitingCount="0" stopTime="0.00" timeLoss="2.87" rerouteNo="1" devices="tripinfo_car_e2w_266 routing_car_e2w_266" vType="Car" speedFactor="1.01" vaporized=""/>
    <tripinfo id="car_e2w_279" depart="279.00" departLane="e2sep_1" departPos="3.60" departPosLat="0.00" departSpeed="13.90" departDelay="0.00" arrival="413.10" arrivalLane="c2w_1" arrivalPos="990.00" arrivalPosLat="0.00" arrivalSpeed="15.46" duration="134.10" routeLength="1997.01" waitingTime="0.00" waitingCount="0" stopTime="0.00" timeLoss="12.02" rerouteNo="1" devices="tripinfo_car_e2w_279 routing_car_e2w_279" vType="Car" speedFactor="1.18" vaporized=""/>
    <tripinfo id="car_w2n_212" depart="212.00" departLane="w2sep_1" departPos="3.60" departPosLat="0.00" departSpeed="13.90" departDelay="0.00" arrival="413.95" arrivalLane="c2n_1" arrivalPos="990.00" arrivalPosLat="0.00" arrivalSpeed="14.49" duration="201.95" routeLength="1996.47" waitingTime="49.45" waitingCount="2" stopTime="0.00" timeLoss="63.52" rerouteNo="1" devices="tripinfo_car_w2n_212 routing_car_w2n_212" vType="Car" speedFactor="1.04" vaporized=""/>
    <tripinfo id="car_w2n_266" depart="266.00" departLane="w2sep_1" departPos="3.60" departPosLat="0.00" departSpeed="13.90" departDelay="0.00" arrival="416.70" arrivalLane="c2n_1" arrivalPos="990.00" arrivalPosLat="0.00" arrivalSpeed="15.14" duration="150.70" routeLength="1996.47" waitingTime="6.75" waitingCount="1" stopTime="0.00" timeLoss="19.30" rerouteNo="1" devices="tripinfo_car_w2n_266 routing_car_w2n_266" vType="Car" speedFactor="1.10" vaporized=""/>
    <tripinfo id="car_w2s_281" depart="281.00" departLane="w2sep_1" departPos="3.60" departPosLat="0.00" departSpeed="13.90" departDelay="0.00" arrival="427.75" arrivalLane="c2s_1" arrivalPos="990.00" arrivalPosLat="0.00" arrivalSpeed="13.94" duration="146.75" routeLength="1986.69" waitingTime="0.00" waitingCount="0" stopTime="0.00" timeLoss="3.50" rerouteNo="1" devices="tripinfo_car_w2s_281 routing_car_w2s_281" vType="Car" speedFactor="1.00" vaporized=""/>
    <tripinfo id="car_e2w_295" depart="295.00" departLane="e2sep_1" departPos="3.60" departPosLat="0.00" departSpeed="13.90" departDelay="0.00" arrival="432.10" arrivalLane="c2w_1" arrivalPos="990.00" arrivalPosLat="0.00" arrivalSpeed="14.75" duration="137.10" routeLength="1997.01" waitingTime="0.00" waitingCount="0" stopTime="0.00" timeLoss="1.63" rerouteNo="1" devices="tripinfo_car_e2w_295 routing_car_e2w_295" vType="Car" speedFactor="1.06" vaporized=""/>
    <tripinfo id="car_w2e_288" depart="288.00" departLane="w2sep_1" departPos="3.60" departPosLat="0.00" departSpeed="13.90" departDelay="0.00" arrival="432.30" arrivalLane="c2e_1" arrivalPos="990.00" arrivalPosLat="0.00" arrivalSpeed="13.90" duration="144.30" routeLength="1997.01" waitingTime="0.00" waitingCount="0" stopTime="0.00" timeLoss="0.64" rerouteNo="1" devices="tripinfo_car_w2e_288 routing_car_w2e_288" vType="Car" speedFactor="1.00" vaporized=""/>
    <tripinfo id="car_w2n_297" depart="297.00" departLane="w2sep_1" departPos="3.60" departPosLat="0.00" departSpeed="13.90" departDelay="0.00" arrival="440.55" arrivalLane="c2n_1" arrivalPos="990.00" arrivalPosLat="0.00" arrivalSpeed="14.35" duration="143.55" routeLength="1996.47" waitingTime="0.00" waitingCount="0" stopTime="0.00" timeLoss="3.72" rerouteNo="1" devices="tripinfo_car_w2n_297 routing_car_w2n_297" vType="Car" speedFactor="1.03" vaporized=""/>
    <tripinfo id="car_e2s_298" depart="299.50" departLane="e2sep_1" departPos="3.60" departPosLat="0.00" departSpeed="13.90" departDelay="1.50" arrival="440.55" arrivalLane="c2s_1" arrivalPos="990.00" arrivalPosLat="0.00" arrivalSpeed="15.55" duration="141.05" routeLength="1996.47" waitingTime="0.00" waitingCount="0" stopTime="0.00" timeLoss="12.02" rerouteNo="1" devices="tripinfo_car_e2s_298 routing_car_e2s_298" vType="Car" speedFactor="1.12" vaporized=""/>
    <tripinfo id="car_n2s_243" depart="243.45" departLane="n2sep_1" departPos="3.60" departPosLat="0.00" departSpeed="13.90" departDelay="0.45" arrival="447.25" arrivalLane="c2s_1" arrivalPos="990.00" arrivalPosLat="0.00" arrivalSpeed="15.59" duration="203.80" routeLength="1997.01" waitingTime="60.65" waitingCount="1" stopTime="0.00" timeLoss="75.68" rerouteNo="1" devices="tripinfo_car_n2s_243 routing_car_n2s_243" vType="Car" speedFactor="1.12" vaporized=""/>
    <tripinfo id="car_s2e_234" depart="234.35" departLane="s2sep_1" departPos="3.60" departPosLat="0.00" departSpeed="13.90" departDelay="0.35" arrival="450.50" arrivalLane="c2e_1" arrivalPos="990.00" arrivalPosLat="0.00" arrivalSpeed="14.69" duration="216.15" routeLength="1986.69" waitingTime="70.70" waitingCount="1" stopTime="0.00" timeLoss="80.24" rerouteNo="1" devices="tripinfo_car_s2e_234 routing_car_s2e_234" vType="Car" speedFactor="1.06" vaporized=""/>
    <tripinfo id="car_n2w_245" depart="245.15" departLane="n2sep_1" departPos="3.60" departPosLat="0.00" departSpeed="13.90" departDelay="0.15" arrival="452.35" arrivalLane="c2w_1" arrivalPos="990.00" arrivalPosLat="0.00" arrivalSpeed="14.80" duration="207.20" routeLength="1986.69" waitingTime="58.70" waitingCount="1" stopTime="0.00" timeLoss="72.30" rerouteNo="1" devices="tripinfo_car_n2w_245 routing_car_n2w_245" vType="Car" speedFactor="1.07" vaporized=""/>
    <tripinfo id="car_s2n_251" depart="251.00" departLane="s2sep_1" departPos="3.60" departPosLat="0.00" departSpeed="13.90" departDelay="0.00" arrival="456.45" arrivalLane="c2n_1" arrivalPos="990.00" arrivalPosLat="0.00" arrivalSpeed="13.90" duration="205.45" routeLength="1997.01" waitingTime="53.50" waitingCount="1" stopTime="0.00" timeLoss="61.78" rerouteNo="1" devices="tripinfo_car_s2n_251 routing_car_s2n_251" vType="Car" speedFactor="1.00" vaporized=""/>
    <tripinfo id="car_n2w_252" depart="252.00" departLane="n2sep_1" departPos="3.60" departPosLat="0.00" departSpeed="13.90" departDelay="0.00" arrival="459.95" arrivalLane="c2w_1" arrivalPos="990.00" arrivalPosLat="0.00" arrivalSpeed="13.90" duration="207.95" routeLength="1986.69" waitingTime="53.20" waitingCount="1" stopTime="0.00" timeLoss="64.28" rerouteNo="1" devices="tripinfo_car_n2w_252 routing_car_n2w_252" vType="Car" speedFactor="1.00" vaporized=""/>
    <tripinfo id="car_n2s_261" depart="264.10" departLane="n2sep_1" departPos="3.60" departPosLat="0.00" departSpeed="13.90" departDelay="3.10" arrival="460.95" arrivalLane="c2s_1" arrivalPos="990.00" arrivalPosLat="0.00" arrivalSpeed="14.38" duration="196.85" routeLength="1997.01" waitingTime="42.00" waitingCount="1" stopTime="0.00" timeLoss="57.95" rerouteNo="1" devices="tripinfo_car_n2s_261 routing_car_n2s_261" vType="Car" speedFactor="1.03" vaporized=""/>
    <tripinfo id="bus_s2e_260" depart="260.00" departLane="s2sep_1" departPos="12.10" departPosLat="0.00" departSpeed="13.90" departDelay="0.00" arrival="462.30" arrivalLane="c2e_1" arrivalPos="990.00" arrivalPosLat="0.00" arrivalSpeed="13.90" duration="202.30" routeLength="1978.19" waitingTime="46.85" waitingCount="1" stopTime="0.00" timeLoss="59.23" rerouteNo="1" devices="tripinfo_bus_s2e_260 routing_bus_s2e_260" vType="Bus" speedFactor="1.00" vaporized=""/>
    <tripinfo id="car_n2w_261" depart="261.00" departLane="n2sep_1" departPos="3.60" departPosLat="0.00" departSpeed="13.90" departDelay="0.00" arrival="462.40" arrivalLane="c2w_1" arrivalPos="990.00" arrivalPosLat="0.00" arrivalSpeed="14.70" duration="201.40" routeLength="1986.69" waitingTime="50.05" waitingCount="1" stopTime="0.00" timeLoss="67.48" rerouteNo="1" devices="tripinfo_car_n2w_261 routing_car_n2w_261" vType="Car" speedFactor="1.07" vaporized=""/>
    <tripinfo id="car_s2e_261" depart="261.45" departLane="s2sep_1" departPos="3.60" departPosLat="0.00" departSpeed="13.90" departDelay="0.45" arrival="465.50" arrivalLane="c2e_1" arrivalPos="990.00" arrivalPosLat="0.00" arrivalSpeed="14.70" duration="204.05" routeLength="1986.69" waitingTime="45.35" waitingCount="1" stopTime="0.00" timeLoss="69.11" rerouteNo="1" devices="tripinfo_car_s2e_261 routing_car_s2e_261" vType="Car" speedFactor="1.06" vaporized=""/>
    <tripinfo id="car_s2n_279" depart="279.00" departLane="s2sep_1" departPos="3.60" departPosLat="0.00" departSpeed="13.90" departDelay="0.00" arrival="465.85" arrivalLane="c2n_1" arrivalPos="990.00" arrivalPosLat="0.00" arrivalSpeed="13.96" duration="186.85" routeLength="1997.01" waitingTime="30.30" waitingCount="1" stopTime="0.00" timeLoss="43.81" rerouteNo="1" devices="tripinfo_car_s2n_279 routing_car_s2n_279" vType="Car" speedFactor="1.00" vaporized=""/>
    <tripinfo id="car_n2w_262" depart="265.95" departLane="n2sep_1" departPos="3.60" departPosLat="0.00" departSpeed="13.90" departDelay="3.95" arrival="467.10" arrivalLane="c2w_1" arrivalPos="990.00" arrivalPosLat="0.00" arrivalSpeed="13.89" duration="201.15" routeLength="1986.69" waitingTime="39.75" waitingCount="1" stopTime="0.00" timeLoss="57.47" rerouteNo="1" devices="tripinfo_car_n2w_262 routing_car_n2w_262" vType="Car" speedFactor="1.00" vaporized=""/>
    <tripinfo id="car_n2s_262" depart="269.60" departLane="n2sep_1" departPos="3.60" departPosLat="0.00" departSpeed="13.90" departDelay="7.60" arrival="467.10" arrivalLane="c2s_1" arrivalPos="990.00" arrivalPosLat="0.00" arrivalSpeed="14.13" duration="197.50" routeLength="1997.01" waitingTime="36.40" waitingCount="1" stopTime="0.00" timeLoss="56.17" rerouteNo="1" devices="tripinfo_car_n2s_262 routing_car_n2s_262" vType="Car" speedFactor="1.02" vaporized=""/>
    <tripinfo id="car_s2e_287" depart="287.00" departLane="s2sep_1" departPos="3.60" departPosLat="0.00" departSpeed="13.90" departDelay="0.00" arrival="468.10" arrivalLane="c2e_1" arrivalPos="990.00" arrivalPosLat="0.00" arrivalSpeed="14.74" duration="181.10" routeLength="1986.69" waitingTime="27.40" waitingCount="1" stopTime="0.00" timeLoss="46.94" rerouteNo="1" devices="tripinfo_car_s2e_287 routing_car_s2e_287" vType="Car" speedFactor="1.07" vaporized=""/>
    <tripinfo id="car_n2w_271" depart="271.50" departLane="n2sep_1" departPos="3.60" departPosLat="0.00" departSpeed="13.90" departDelay="0.50" arrival="469.25" arrivalLane="c2w_1" arrivalPos="990.00" arrivalPosLat="0.00" arrivalSpeed="14.86" duration="197.75" routeLength="1986.69" waitingTime="35.70" waitingCount="1" stopTime="0.00" timeLoss="66.72" rerouteNo="1" devices="tripinfo_car_n2w_271 routing_car_n2w_271" vType="Car" speedFactor="1.10" vaporized=""/>
    <tripinfo id="car_n2s_289" depart="289.00" departLane="n2sep_1" departPos="3.60" departPosLat="0.00" departSpeed="13.90" departDelay="0.00" arrival="469.40" arrivalLane="c2s_1" arrivalPos="990.00" arrivalPosLat="0.00" arrivalSpeed="15.05" duration="180.40" routeLength="1997.01" waitingTime="30.15" waitingCount="1" stopTime="0.00" timeLoss="50.17" rerouteNo="1" devices="tripinfo_car_n2s_289 routing_car_n2s_289" vType="Car" speedFactor="1.10" vaporized=""/>
</tripinfos>
