<?xml version="1.0" encoding="UTF-8"?>

<!-- generated on 2021-05-21 17:28:16 by Eclipse SUMO GUI Version 1.9.2
<configuration xmlns:xsi="http://www.w3.org/2001/XMLSchema-instance" xsi:noNamespaceSchemaLocation="http://sumo.dlr.de/xsd/sumoConfiguration.xsd">

    <input>
        <net-file value="sumofiles/junction.net.xml"/>
        <route-files value="sumofiles/junction_prune_0.rou.xml"/>
        <additional-files value="sumofiles/junction.det.xml"/>
    </input>

    <output>
        <tripinfo-output value="sumofiles/output/tripinfo_prune_0.xml"/>
    </output>

    <time>
        <begin value="0"/>
        <end value="10000"/>
        <step-length value="1.0"/>
    </time>

    <processing>
        <lateral-resolution value="0.1"/>
    </processing>

    <report>
        <no-warnings value="true"/>
        <error-log value="sumofiles/output/errorlog_prune_0.log"/>
        <no-step-log value="true"/>
    </report>

    <traci_server>
        <remote-port value="34675"/>
    </traci_server>

    <gui_only>
        <gui-settings-file value="sumofiles/junction-gui.settings.xml"/>
        <start value="true"/>
        <tracker-interval value="1"/>
    </gui_only>

</configuration>
-->

<detector xmlns:xsi="http://www.w3.org/2001/XMLSchema-instance" xsi:noNamespaceSchemaLocation="http://sumo.dlr.de/xsd/det_e2_file.xsd">
   <interval begin="0.00" end="347.00" id="det_s2c_l" sampledSeconds="1501.43" nVehEntered="22" nVehLeft="12" nVehSeen="22" meanSpeed="10.94" meanTimeLoss="16.89" meanOccupancy="2.15" maxOccupancy="5.44" meanMaxJamLengthInVehicles="0.69" meanMaxJamLengthInMeters="3.72" maxJamLengthInVehicles="4" maxJamLengthInMeters="30.67" jamLengthInVehiclesSum="241" jamLengthInMetersSum="1291.28" meanHaltingDuration="14.29" maxHaltingDuration="31.00" haltingDurationSum="243.00" meanIntervalHaltingDuration="14.29" maxIntervalHaltingDuration="31.00" intervalHaltingDurationSum="243.00" startedHalts="20.00" meanVehicleNumber="4.38" maxVehicleNumber="10" />
</detector>
