<?xml version="1.0" encoding="UTF-8"?>

<!-- generated on Sat Apr 24 18:31:57 2021 by Eclipse SUMO Version 1.4.0
<configuration xmlns:xsi="http://www.w3.org/2001/XMLSchema-instance" xsi:noNamespaceSchemaLocation="http://sumo.dlr.de/xsd/sumoConfiguration.xsd">

    <input>
        <net-file value="sumofiles/junction.net.xml"/>
        <route-files value="sumofiles/junction_preemption_160.rou.xml"/>
        <additional-files value="sumofiles/junction.det.xml"/>
    </input>

    <output>
        <tripinfo-output value="sumofiles/output/tripinfo_preemption_160.xml"/>
    </output>

    <time>
        <begin value="0"/>
        <end value="10000"/>
        <step-length value="0.05"/>
    </time>

    <processing>
        <lateral-resolution value="0.1"/>
    </processing>

    <report>
        <no-warnings value="true"/>
        <error-log value="sumofiles/output/errorlog_preemption_160.log"/>
        <no-step-log value="true"/>
    </report>

    <traci_server>
        <remote-port value="38181"/>
    </traci_server>

    <gui_only>
        <gui-settings-file value="sumofiles/junction-gui.settings.xml"/>
        <tracker-interval value="0.05"/>
    </gui_only>

</configuration>
-->

<tripinfos xmlns:xsi="http://www.w3.org/2001/XMLSchema-instance" xsi:noNamespaceSchemaLocation="http://sumo.dlr.de/xsd/tripinfo_file.xsd">
    <tripinfo id="car_e2n_2" depart="2.00" departLane="e2sep_1" departPos="3.60" departPosLat="0.00" departSpeed="13.90" departDelay="0.00" arrival="141.30" arrivalLane="c2n_1" arrivalPos="990.00" arrivalPosLat="0.00" arrivalSpeed="14.73" duration="139.30" routeLength="1986.69" waitingTime="0.00" waitingCount="0" stopTime="0.00" timeLoss="3.74" rerouteNo="1" devices="tripinfo_car_e2n_2 routing_car_e2n_2" vType="Car" speedFactor="1.06" vaporized=""/>
    <tripinfo id="car_e2s_10" depart="10.00" departLane="e2sep_1" departPos="3.60" departPosLat="0.00" departSpeed="13.90" departDelay="0.00" arrival="147.25" arrivalLane="c2s_1" arrivalPos="990.00" arrivalPosLat="0.00" arrivalSpeed="15.05" duration="137.25" routeLength="1996.47" waitingTime="0.00" waitingCount="0" stopTime="0.00" timeLoss="3.96" rerouteNo="1" devices="tripinfo_car_e2s_10 routing_car_e2s_10" vType="Car" speedFactor="1.08" vaporized=""/>
    <tripinfo id="car_s2e_0" depart="0.00" departLane="s2sep_1" departPos="3.60" departPosLat="0.00" departSpeed="13.90" departDelay="0.00" arrival="161.70" arrivalLane="c2e_1" arrivalPos="990.00" arrivalPosLat="0.00" arrivalSpeed="14.73" duration="161.70" routeLength="1986.69" waitingTime="18.75" waitingCount="1" stopTime="0.00" timeLoss="26.14" rerouteNo="1" devices="tripinfo_car_s2e_0 routing_car_s2e_0" vType="Car" speedFactor="1.06" vaporized=""/>
    <tripinfo id="car_n2s_18" depart="18.00" departLane="n2sep_1" departPos="3.60" departPosLat="0.00" departSpeed="13.90" departDelay="0.00" arrival="163.95" arrivalLane="c2s_1" arrivalPos="990.00" arrivalPosLat="0.00" arrivalSpeed="14.04" duration="145.95" routeLength="1997.01" waitingTime="0.00" waitingCount="0" stopTime="0.00" timeLoss="3.74" rerouteNo="1" devices="tripinfo_car_n2s_18 routing_car_n2s_18" vType="Car" speedFactor="1.01" vaporized=""/>
    <tripinfo id="car_n2s_33" depart="33.00" departLane="n2sep_1" departPos="3.60" departPosLat="0.00" departSpeed="13.90" departDelay="0.00" arrival="166.25" arrivalLane="c2s_1" arrivalPos="990.00" arrivalPosLat="0.00" arrivalSpeed="15.28" duration="133.25" routeLength="1997.01" waitingTime="0.00" waitingCount="0" stopTime="0.00" timeLoss="5.27" rerouteNo="1" devices="tripinfo_car_n2s_33 routing_car_n2s_33" vType="Car" speedFactor="1.12" vaporized=""/>
    <tripinfo id="car_s2e_14" depart="14.00" departLane="s2sep_1" departPos="3.60" departPosLat="0.00" departSpeed="13.90" departDelay="0.00" arrival="166.70" arrivalLane="c2e_1" arrivalPos="990.00" arrivalPosLat="0.00" arrivalSpeed="14.53" duration="152.70" routeLength="1986.69" waitingTime="3.55" waitingCount="1" stopTime="0.00" timeLoss="15.31" rerouteNo="1" devices="tripinfo_car_s2e_14 routing_car_s2e_14" vType="Car" speedFactor="1.05" vaporized=""/>
    <tripinfo id="car_n2w_23" depart="23.00" departLane="n2sep_1" departPos="3.60" departPosLat="0.00" departSpeed="13.90" departDelay="0.00" arrival="167.20" arrivalLane="c2w_1" arrivalPos="990.00" arrivalPosLat="0.00" arrivalSpeed="14.32" duration="144.20" routeLength="1986.69" waitingTime="0.00" waitingCount="0" stopTime="0.00" timeLoss="4.74" rerouteNo="1" devices="tripinfo_car_n2w_23 routing_car_n2w_23" vType="Car" speedFactor="1.03" vaporized=""/>
    <tripinfo id="car_s2w_2" depart="2.00" departLane="s2sep_1" departPos="3.60" departPosLat="0.00" departSpeed="13.90" departDelay="0.00" arrival="174.05" arrivalLane="c2w_1" arrivalPos="990.00" arrivalPosLat="0.00" arrivalSpeed="14.04" duration="172.05" routeLength="1996.47" waitingTime="16.50" waitingCount="2" stopTime="0.00" timeLoss="29.20" rerouteNo="1" devices="tripinfo_car_s2w_2 routing_car_s2w_2" vType="Car" speedFactor="1.01" vaporized=""/>
    <tripinfo id="car_s2w_10" depart="10.00" departLane="s2sep_1" departPos="3.60" departPosLat="0.00" departSpeed="13.90" departDelay="0.00" arrival="177.50" arrivalLane="c2w_1" arrivalPos="990.00" arrivalPosLat="0.00" arrivalSpeed="14.28" duration="167.50" routeLength="1996.47" waitingTime="10.50" waitingCount="2" stopTime="0.00" timeLoss="27.40" rerouteNo="1" devices="tripinfo_car_s2w_10 routing_car_s2w_10" vType="Car" speedFactor="1.03" vaporized=""/>
    <tripinfo id="car_s2e_50" depart="50.00" departLane="s2sep_1" departPos="3.60" departPosLat="0.00" departSpeed="13.90" departDelay="0.00" arrival="178.45" arrivalLane="c2e_1" arrivalPos="990.00" arrivalPosLat="0.00" arrivalSpeed="16.10" duration="128.45" routeLength="1986.69" waitingTime="0.00" waitingCount="0" stopTime="0.00" timeLoss="4.39" rerouteNo="1" devices="tripinfo_car_s2e_50 routing_car_s2e_50" vType="Car" speedFactor="1.16" vaporized=""/>
    <tripinfo id="car_s2w_56" depart="56.00" departLane="s2sep_1" departPos="3.60" departPosLat="0.00" departSpeed="13.90" departDelay="0.00" arrival="192.25" arrivalLane="c2w_1" arrivalPos="990.00" arrivalPosLat="0.00" arrivalSpeed="15.16" duration="136.25" routeLength="1996.47" waitingTime="0.00" waitingCount="0" stopTime="0.00" timeLoss="3.95" rerouteNo="1" devices="tripinfo_car_s2w_56 routing_car_s2w_56" vType="Car" speedFactor="1.09" vaporized=""/>
    <tripinfo id="car_s2w_59" depart="59.55" departLane="s2sep_1" departPos="3.60" departPosLat="0.00" departSpeed="13.90" departDelay="0.55" arrival="205.05" arrivalLane="c2w_1" arrivalPos="990.00" arrivalPosLat="0.00" arrivalSpeed="14.55" duration="145.50" routeLength="1996.47" waitingTime="0.00" waitingCount="0" stopTime="0.00" timeLoss="7.65" rerouteNo="1" devices="tripinfo_car_s2w_59 routing_car_s2w_59" vType="Car" speedFactor="1.05" vaporized=""/>
    <tripinfo id="car_e2w_32" depart="32.00" departLane="e2sep_1" departPos="3.60" departPosLat="0.00" departSpeed="13.90" departDelay="0.00" arrival="209.55" arrivalLane="c2w_1" arrivalPos="990.00" arrivalPosLat="0.00" arrivalSpeed="14.54" duration="177.55" routeLength="1997.01" waitingTime="31.00" waitingCount="1" stopTime="0.00" timeLoss="40.31" rerouteNo="1" devices="tripinfo_car_e2w_32 routing_car_e2w_32" vType="Car" speedFactor="1.05" vaporized=""/>
    <tripinfo id="car_e2w_37" depart="37.00" departLane="e2sep_1" departPos="3.60" departPosLat="0.00" departSpeed="13.90" departDelay="0.00" arrival="213.15" arrivalLane="c2w_1" arrivalPos="990.00" arrivalPosLat="0.00" arrivalSpeed="14.51" duration="176.15" routeLength="1997.01" waitingTime="26.50" waitingCount="1" stopTime="0.00" timeLoss="38.77" rerouteNo="1" devices="tripinfo_car_e2w_37 routing_car_e2w_37" vType="Car" speedFactor="1.05" vaporized=""/>
    <tripinfo id="bus_w2e_13" depart="13.00" departLane="w2sep_1" departPos="12.10" departPosLat="0.00" departSpeed="13.90" departDelay="0.00" arrival="214.25" arrivalLane="c2e_1" arrivalPos="990.00" arrivalPosLat="0.00" arrivalSpeed="13.90" duration="201.25" routeLength="1988.51" waitingTime="47.90" waitingCount="1" stopTime="0.00" timeLoss="58.16" rerouteNo="1" devices="tripinfo_bus_w2e_13 routing_bus_w2e_13" vType="Bus" speedFactor="1.00" vaporized=""/>
    <tripinfo id="car_w2s_14" depart="14.45" departLane="w2sep_1" departPos="3.60" departPosLat="0.00" departSpeed="13.90" departDelay="0.45" arrival="215.40" arrivalLane="c2s_1" arrivalPos="990.00" arrivalPosLat="0.00" arrivalSpeed="13.90" duration="200.95" routeLength="1986.69" waitingTime="44.85" waitingCount="1" stopTime="0.00" timeLoss="57.29" rerouteNo="1" devices="tripinfo_car_w2s_14 routing_car_w2s_14" vType="Car" speedFactor="1.00" vaporized=""/>
    <tripinfo id="car_e2n_45" depart="45.00" departLane="e2sep_1" departPos="3.60" departPosLat="0.00" departSpeed="13.90" departDelay="0.00" arrival="217.50" arrivalLane="c2n_1" arrivalPos="990.00" arrivalPosLat="0.00" arrivalSpeed="13.90" duration="172.50" routeLength="1986.69" waitingTime="16.40" waitingCount="1" stopTime="0.00" timeLoss="28.80" rerouteNo="1" devices="tripinfo_car_e2n_45 routing_car_e2n_45" vType="Car" speedFactor="1.00" vaporized=""/>
    <tripinfo id="car_w2s_29" depart="29.00" departLane="w2sep_1" departPos="3.60" departPosLat="0.00" departSpeed="13.90" departDelay="0.00" arrival="217.75" arrivalLane="c2s_1" arrivalPos="990.00" arrivalPosLat="0.00" arrivalSpeed="14.89" duration="188.75" routeLength="1986.69" waitingTime="39.25" waitingCount="1" stopTime="0.00" timeLoss="57.03" rerouteNo="1" devices="tripinfo_car_w2s_29 routing_car_w2s_29" vType="Car" speedFactor="1.09" vaporized=""/>
    <tripinfo id="car_e2w_43" depart="43.00" departLane="e2sep_1" departPos="3.60" departPosLat="0.00" departSpeed="13.90" departDelay="0.00" arrival="217.75" arrivalLane="c2w_1" arrivalPos="990.00" arrivalPosLat="0.00" arrivalSpeed="13.89" duration="174.75" routeLength="1997.01" waitingTime="18.95" waitingCount="1" stopTime="0.00" timeLoss="31.08" rerouteNo="1" devices="tripinfo_car_e2w_43 routing_car_e2w_43" vType="Car" speedFactor="1.00" vaporized=""/>
    <tripinfo id="car_w2e_30" depart="30.30" departLane="w2sep_1" departPos="3.60" departPosLat="0.00" departSpeed="13.90" departDelay="0.30" arrival="219.10" arrivalLane="c2e_1" arrivalPos="990.00" arrivalPosLat="0.00" arrivalSpeed="14.26" duration="188.80" routeLength="1997.01" waitingTime="34.15" waitingCount="1" stopTime="0.00" timeLoss="48.77" rerouteNo="1" devices="tripinfo_car_w2e_30 routing_car_w2e_30" vType="Car" speedFactor="1.03" vaporized=""/>
    <tripinfo id="car_e2w_51" depart="51.00" departLane="e2sep_1" departPos="3.60" departPosLat="0.00" departSpeed="13.90" departDelay="0.00" arrival="221.00" arrivalLane="c2w_1" arrivalPos="990.00" arrivalPosLat="0.00" arrivalSpeed="14.10" duration="170.00" routeLength="1997.01" waitingTime="13.90" waitingCount="1" stopTime="0.00" timeLoss="28.86" rerouteNo="1" devices="tripinfo_car_e2w_51 routing_car_e2w_51" vType="Car" speedFactor="1.02" vaporized=""/>
    <tripinfo id="car_w2n_67" depart="67.50" departLane="w2sep_1" departPos="3.60" departPosLat="0.00" departSpeed="13.90" departDelay="0.50" arrival="222.95" arrivalLane="c2n_1" arrivalPos="990.00" arrivalPosLat="0.00" arrivalSpeed="13.90" duration="155.45" routeLength="1996.47" waitingTime="0.00" waitingCount="0" stopTime="0.00" timeLoss="11.13" rerouteNo="1" devices="tripinfo_car_w2n_67 routing_car_w2n_67" vType="Car" speedFactor="1.00" vaporized=""/>
    <tripinfo id="car_w2s_37" depart="37.00" departLane="w2sep_1" departPos="3.60" departPosLat="0.00" departSpeed="13.90" departDelay="0.00" arrival="223.10" arrivalLane="c2s_1" arrivalPos="990.00" arrivalPosLat="0.00" arrivalSpeed="13.90" duration="186.10" routeLength="1986.69" waitingTime="28.15" waitingCount="1" stopTime="0.00" timeLoss="42.43" rerouteNo="1" devices="tripinfo_car_w2s_37 routing_car_w2s_37" vType="Car" speedFactor="1.00" vaporized=""/>
    <tripinfo id="car_e2n_89" depart="89.00" departLane="e2sep_1" departPos="3.60" departPosLat="0.00" departSpeed="13.90" departDelay="0.00" arrival="224.90" arrivalLane="c2n_1" arrivalPos="990.00" arrivalPosLat="0.00" arrivalSpeed="15.42" duration="135.90" routeLength="1986.69" waitingTime="0.00" waitingCount="0" stopTime="0.00" timeLoss="11.85" rerouteNo="1" devices="tripinfo_car_e2n_89 routing_car_e2n_89" vType="Car" speedFactor="1.16" vaporized=""/>
    <tripinfo id="car_e2w_83" depart="83.00" departLane="e2sep_1" departPos="3.60" departPosLat="0.00" departSpeed="13.90" departDelay="0.00" arrival="225.50" arrivalLane="c2w_1" arrivalPos="990.00" arrivalPosLat="0.00" arrivalSpeed="14.16" duration="142.50" routeLength="1997.01" waitingTime="0.00" waitingCount="0" stopTime="0.00" timeLoss="1.58" rerouteNo="1" devices="tripinfo_car_e2w_83 routing_car_e2w_83" vType="Car" speedFactor="1.02" vaporized=""/>
    <tripinfo id="car_w2n_71" depart="71.00" departLane="w2sep_1" departPos="3.60" departPosLat="0.00" departSpeed="13.90" departDelay="0.00" arrival="227.00" arrivalLane="c2n_1" arrivalPos="990.00" arrivalPosLat="0.00" arrivalSpeed="15.88" duration="156.00" routeLength="1996.47" waitingTime="6.95" waitingCount="1" stopTime="0.00" timeLoss="33.53" rerouteNo="1" devices="tripinfo_car_w2n_71 routing_car_w2n_71" vType="Car" speedFactor="1.18" vaporized=""/>
    <tripinfo id="car_w2s_47" depart="47.00" departLane="w2sep_1" departPos="3.60" departPosLat="0.00" departSpeed="13.90" departDelay="0.00" arrival="227.05" arrivalLane="c2s_1" arrivalPos="990.00" arrivalPosLat="0.00" arrivalSpeed="13.88" duration="180.05" routeLength="1986.69" waitingTime="19.65" waitingCount="1" stopTime="0.00" timeLoss="36.36" rerouteNo="1" devices="tripinfo_car_w2s_47 routing_car_w2s_47" vType="Car" speedFactor="1.00" vaporized=""/>
    <tripinfo id="car_w2e_62" depart="62.00" departLane="w2sep_1" departPos="3.60" departPosLat="0.00" departSpeed="13.90" departDelay="0.00" arrival="228.70" arrivalLane="c2e_1" arrivalPos="990.00" arrivalPosLat="0.00" arrivalSpeed="13.90" duration="166.70" routeLength="1997.01" waitingTime="7.35" waitingCount="1" stopTime="0.00" timeLoss="23.00" rerouteNo="1" devices="tripinfo_car_w2e_62 routing_car_w2e_62" vType="Car" speedFactor="1.00" vaporized=""/>
    <tripinfo id="car_w2s_52" depart="52.00" departLane="w2sep_1" departPos="3.60" departPosLat="0.00" departSpeed="13.90" departDelay="0.00" arrival="230.20" arrivalLane="c2s_1" arrivalPos="990.00" arrivalPosLat="0.00" arrivalSpeed="13.99" duration="178.20" routeLength="1986.69" waitingTime="16.15" waitingCount="1" stopTime="0.00" timeLoss="35.96" rerouteNo="1" devices="tripinfo_car_w2s_52 routing_car_w2s_52" vType="Car" speedFactor="1.01" vaporized=""/>
    <tripinfo id="car_w2e_63" depart="63.45" departLane="w2sep_1" departPos="3.60" departPosLat="0.00" departSpeed="13.90" departDelay="0.45" arrival="232.95" arrivalLane="c2e_1" arrivalPos="990.00" arrivalPosLat="0.00" arrivalSpeed="13.89" duration="169.50" routeLength="1997.01" waitingTime="4.95" waitingCount="1" stopTime="0.00" timeLoss="25.79" rerouteNo="1" devices="tripinfo_car_w2e_63 routing_car_w2e_63" vType="Car" speedFactor="1.00" vaporized=""/>
    <tripinfo id="car_e2w_102" depart="102.00" departLane="e2sep_1" departPos="3.60" departPosLat="0.00" departSpeed="13.90" departDelay="0.00" arrival="234.75" arrivalLane="c2w_1" arrivalPos="990.00" arrivalPosLat="0.00" arrivalSpeed="15.12" duration="132.75" routeLength="1997.01" waitingTime="0.00" waitingCount="0" stopTime="0.00" timeLoss="0.71" rerouteNo="1" devices="tripinfo_car_e2w_102 routing_car_e2w_102" vType="Car" speedFactor="1.09" vaporized=""/>
    <tripinfo id="car_w2e_66" depart="66.00" departLane="w2sep_1" departPos="3.60" departPosLat="0.00" departSpeed="13.90" departDelay="0.00" arrival="234.90" arrivalLane="c2e_1" arrivalPos="990.00" arrivalPosLat="0.00" arrivalSpeed="15.11" duration="168.90" routeLength="1997.01" waitingTime="4.30" waitingCount="1" stopTime="0.00" timeLoss="41.93" rerouteNo="1" devices="tripinfo_car_w2e_66 routing_car_w2e_66" vType="Car" speedFactor="1.13" vaporized=""/>
    <tripinfo id="car_w2n_92" depart="92.00" departLane="w2sep_1" departPos="3.60" departPosLat="0.00" departSpeed="13.90" departDelay="0.00" arrival="236.05" arrivalLane="c2n_1" arrivalPos="990.00" arrivalPosLat="0.00" arrivalSpeed="14.32" duration="144.05" routeLength="1996.47" waitingTime="0.00" waitingCount="0" stopTime="0.00" timeLoss="4.00" rerouteNo="1" devices="tripinfo_car_w2n_92 routing_car_w2n_92" vType="Car" speedFactor="1.03" vaporized=""/>
    <tripinfo id="car_w2s_81" depart="81.00" departLane="w2sep_1" departPos="3.60" departPosLat="0.00" departSpeed="13.90" departDelay="0.00" arrival="236.85" arrivalLane="c2s_1" arrivalPos="990.00" arrivalPosLat="0.00" arrivalSpeed="13.90" duration="155.85" routeLength="1986.69" waitingTime="0.00" waitingCount="0" stopTime="0.00" timeLoss="12.16" rerouteNo="1" devices="tripinfo_car_w2s_81 routing_car_w2s_81" vType="Car" speedFactor="1.00" vaporized=""/>
    <tripinfo id="car_w2e_77" depart="77.00" departLane="w2sep_1" departPos="3.60" departPosLat="0.00" departSpeed="13.90" departDelay="0.00" arrival="238.25" arrivalLane="c2e_1" arrivalPos="990.00" arrivalPosLat="0.00" arrivalSpeed="13.94" duration="161.25" routeLength="1997.01" waitingTime="0.00" waitingCount="0" stopTime="0.00" timeLoss="18.30" rerouteNo="1" devices="tripinfo_car_w2e_77 routing_car_w2e_77" vType="Car" speedFactor="1.01" vaporized=""/>
    <tripinfo id="car_e2s_21" depart="21.00" departLane="e2sep_1" departPos="3.60" departPosLat="0.00" departSpeed="13.90" departDelay="0.00" arrival="239.20" arrivalLane="c2s_1" arrivalPos="990.00" arrivalPosLat="0.00" arrivalSpeed="14.79" duration="218.20" routeLength="1996.47" waitingTime="68.95" waitingCount="2" stopTime="0.00" timeLoss="84.90" rerouteNo="1" devices="tripinfo_car_e2s_21 routing_car_e2s_21" vType="Car" speedFactor="1.08" vaporized=""/>
    <tripinfo id="car_w2n_93" depart="93.40" departLane="w2sep_1" departPos="3.60" departPosLat="0.00" departSpeed="13.90" departDelay="0.40" arrival="242.35" arrivalLane="c2n_1" arrivalPos="990.00" arrivalPosLat="0.00" arrivalSpeed="14.15" duration="148.95" routeLength="1996.47" waitingTime="0.00" waitingCount="0" stopTime="0.00" timeLoss="7.19" rerouteNo="1" devices="tripinfo_car_w2n_93 routing_car_w2n_93" vType="Car" speedFactor="1.02" vaporized=""/>
    <tripinfo id="car_n2w_61" depart="61.00" departLane="n2sep_1" departPos="3.60" departPosLat="0.00" departSpeed="13.90" departDelay="0.00" arrival="248.10" arrivalLane="c2w_1" arrivalPos="990.00" arrivalPosLat="0.00" arrivalSpeed="15.61" duration="187.10" routeLength="1986.69" waitingTime="51.70" waitingCount="1" stopTime="0.00" timeLoss="59.18" rerouteNo="1" devices="tripinfo_car_n2w_61 routing_car_n2w_61" vType="Car" speedFactor="1.12" vaporized=""/>
    <tripinfo id="car_s2n_74" depart="74.00" departLane="s2sep_1" departPos="3.60" departPosLat="0.00" departSpeed="13.90" departDelay="0.00" arrival="248.85" arrivalLane="c2n_1" arrivalPos="990.00" arrivalPosLat="0.00" arrivalSpeed="16.04" duration="174.85" routeLength="1997.01" waitingTime="40.55" waitingCount="1" stopTime="0.00" timeLoss="50.37" rerouteNo="1" devices="tripinfo_car_s2n_74 routing_car_s2n_74" vType="Car" speedFactor="1.15" vaporized=""/>
    <tripinfo id="car_s2e_58" depart="58.00" departLane="s2sep_1" departPos="3.60" departPosLat="0.00" departSpeed="13.90" departDelay="0.00" arrival="253.90" arrivalLane="c2e_1" arrivalPos="990.00" arrivalPosLat="0.00" arrivalSpeed="14.27" duration="195.90" routeLength="1986.69" waitingTime="47.90" waitingCount="1" stopTime="0.00" timeLoss="55.92" rerouteNo="1" devices="tripinfo_car_s2e_58 routing_car_s2e_58" vType="Car" speedFactor="1.03" vaporized=""/>
    <tripinfo id="car_s2e_93" depart="93.00" departLane="s2sep_1" departPos="3.60" departPosLat="0.00" departSpeed="13.90" departDelay="0.00" arrival="256.80" arrivalLane="c2e_1" arrivalPos="990.00" arrivalPosLat="0.00" arrivalSpeed="15.07" duration="163.80" routeLength="1986.69" waitingTime="19.30" waitingCount="1" stopTime="0.00" timeLoss="32.23" rerouteNo="1" devices="tripinfo_car_s2e_93 routing_car_s2e_93" vType="Car" speedFactor="1.09" vaporized=""/>
    <tripinfo id="car_n2s_96" depart="96.00" departLane="n2sep_1" departPos="3.60" departPosLat="0.00" departSpeed="13.90" departDelay="0.00" arrival="257.25" arrivalLane="c2s_1" arrivalPos="990.00" arrivalPosLat="0.00" arrivalSpeed="14.50" duration="161.25" routeLength="1997.01" waitingTime="13.35" waitingCount="1" stopTime="0.00" timeLoss="23.53" rerouteNo="1" devices="tripinfo_car_n2s_96 routing_car_n2s_96" vType="Car" speedFactor="1.04" vaporized=""/>
    <tripinfo id="car_n2w_87" depart="87.00" departLane="n2sep_1" departPos="3.60" departPosLat="0.00" departSpeed="13.90" departDelay="0.00" arrival="258.70" arrivalLane="c2w_1" arrivalPos="990.00" arrivalPosLat="0.00" arrivalSpeed="13.90" duration="171.70" routeLength="1986.69" waitingTime="18.90" waitingCount="1" stopTime="0.00" timeLoss="28.01" rerouteNo="1" devices="tripinfo_car_n2w_87 routing_car_n2w_87" vType="Car" speedFactor="1.00" vaporized=""/>
    <tripinfo id="car_n2e_87" depart="88.45" departLane="n2sep_1" departPos="3.60" departPosLat="0.00" departSpeed="13.90" departDelay="1.45" arrival="258.85" arrivalLane="c2e_1" arrivalPos="990.00" arrivalPosLat="0.00" arrivalSpeed="15.87" duration="170.40" routeLength="1996.47" waitingTime="20.05" waitingCount="2" stopTime="0.00" timeLoss="48.06" rerouteNo="1" devices="tripinfo_car_n2e_87 routing_car_n2e_87" vType="Car" speedFactor="1.18" vaporized=""/>
    <tripinfo id="car_n2w_114" depart="114.00" departLane="n2sep_1" departPos="3.60" departPosLat="0.00" departSpeed="13.90" departDelay="0.00" arrival="263.70" arrivalLane="c2w_1" arrivalPos="990.00" arrivalPosLat="0.00" arrivalSpeed="13.90" duration="149.70" routeLength="1986.69" waitingTime="0.00" waitingCount="0" stopTime="0.00" timeLoss="6.04" rerouteNo="1" devices="tripinfo_car_n2w_114 routing_car_n2w_114" vType="Car" speedFactor="1.00" vaporized=""/>
    <tripinfo id="car_n2s_114" depart="115.45" departLane="n2sep_1" departPos="3.60" departPosLat="0.00" departSpeed="13.90" departDelay="1.45" arrival="264.65" arrivalLane="c2s_1" arrivalPos="990.00" arrivalPosLat="0.00" arrivalSpeed="13.90" duration="149.20" routeLength="1997.01" waitingTime="0.00" waitingCount="0" stopTime="0.00" timeLoss="5.51" rerouteNo="1" devices="tripinfo_car_n2s_114 routing_car_n2s_114" vType="Car" speedFactor="1.00" vaporized=""/>
    <tripinfo id="car_s2w_78" depart="78.00" departLane="s2sep_1" departPos="3.60" departPosLat="0.00" departSpeed="13.90" departDelay="0.00" arrival="265.55" arrivalLane="c2w_1" arrivalPos="990.00" arrivalPosLat="0.00" arrivalSpeed="15.43" duration="187.55" routeLength="1996.47" waitingTime="46.65" waitingCount="2" stopTime="0.00" timeLoss="64.39" rerouteNo="1" devices="tripinfo_car_s2w_78 routing_car_s2w_78" vType="Car" speedFactor="1.17" vaporized=""/>
    <tripinfo id="car_s2n_122" depart="122.00" departLane="s2sep_1" departPos="3.60" departPosLat="0.00" departSpeed="13.90" departDelay="0.00" arrival="266.05" arrivalLane="c2n_1" arrivalPos="990.00" arrivalPosLat="0.00" arrivalSpeed="13.94" duration="144.05" routeLength="1997.01" waitingTime="0.00" waitingCount="0" stopTime="0.00" timeLoss="0.79" rerouteNo="1" devices="tripinfo_car_s2n_122 routing_car_s2n_122" vType="Car" speedFactor="1.00" vaporized=""/>
    <tripinfo id="car_n2s_116" depart="117.30" departLane="n2sep_1" departPos="3.60" departPosLat="0.00" departSpeed="13.90" departDelay="1.30" arrival="266.50" arrivalLane="c2s_1" arrivalPos="990.00" arrivalPosLat="0.00" arrivalSpeed="15.41" duration="149.20" routeLength="1997.01" waitingTime="0.00" waitingCount="0" stopTime="0.00" timeLoss="26.27" rerouteNo="1" devices="tripinfo_car_n2s_116 routing_car_n2s_116" vType="Car" speedFactor="1.17" vaporized=""/>
    <tripinfo id="car_s2n_126" depart="126.00" departLane="s2sep_1" departPos="3.60" departPosLat="0.00" departSpeed="13.90" departDelay="0.00" arrival="268.40" arrivalLane="c2n_1" arrivalPos="990.00" arrivalPosLat="0.00" arrivalSpeed="15.56" duration="142.40" routeLength="1997.01" waitingTime="0.00" waitingCount="0" stopTime="0.00" timeLoss="16.62" rerouteNo="1" devices="tripinfo_car_s2n_126 routing_car_s2n_126" vType="Car" speedFactor="1.14" vaporized=""/>
    <tripinfo id="car_s2w_87" depart="87.00" departLane="s2sep_1" departPos="3.60" departPosLat="0.00" departSpeed="13.90" departDelay="0.00" arrival="268.70" arrivalLane="c2w_1" arrivalPos="990.00" arrivalPosLat="0.00" arrivalSpeed="15.25" duration="181.70" routeLength="1996.47" waitingTime="34.90" waitingCount="2" stopTime="0.00" timeLoss="50.78" rerouteNo="1" devices="tripinfo_car_s2w_87 routing_car_s2w_87" vType="Car" speedFactor="1.10" vaporized=""/>
    <tripinfo id="car_n2s_118" depart="119.00" departLane="n2sep_1" departPos="3.60" departPosLat="0.00" departSpeed="13.90" departDelay="1.00" arrival="270.10" arrivalLane="c2s_1" arrivalPos="990.00" arrivalPosLat="0.00" arrivalSpeed="14.11" duration="151.10" routeLength="1997.01" waitingTime="0.00" waitingCount="0" stopTime="0.00" timeLoss="9.80" rerouteNo="1" devices="tripinfo_car_n2s_118 routing_car_n2s_118" vType="Car" speedFactor="1.02" vaporized=""/>
    <tripinfo id="car_s2e_123" depart="123.45" departLane="s2sep_1" departPos="3.60" departPosLat="0.00" departSpeed="13.90" departDelay="0.45" arrival="273.45" arrivalLane="c2e_1" arrivalPos="990.00" arrivalPosLat="0.00" arrivalSpeed="13.90" duration="150.00" routeLength="1986.69" waitingTime="0.00" waitingCount="0" stopTime="0.00" timeLoss="6.33" rerouteNo="1" devices="tripinfo_car_s2e_123 routing_car_s2e_123" vType="Car" speedFactor="1.00" vaporized=""/>
    <tripinfo id="car_s2e_129" depart="129.00" departLane="s2sep_1" departPos="3.60" departPosLat="0.00" departSpeed="13.90" departDelay="0.00" arrival="275.50" arrivalLane="c2e_1" arrivalPos="990.00" arrivalPosLat="0.00" arrivalSpeed="15.20" duration="146.50" routeLength="1986.69" waitingTime="0.00" waitingCount="0" stopTime="0.00" timeLoss="19.55" rerouteNo="1" devices="tripinfo_car_s2e_129 routing_car_s2e_129" vType="Car" speedFactor="1.13" vaporized=""/>
    <tripinfo id="car_n2e_122" depart="122.00" departLane="n2sep_1" departPos="3.60" departPosLat="0.00" departSpeed="13.90" departDelay="0.00" arrival="277.95" arrivalLane="c2e_1" arrivalPos="990.00" arrivalPosLat="0.00" arrivalSpeed="15.03" duration="155.95" routeLength="1996.47" waitingTime="4.90" waitingCount="1" stopTime="0.00" timeLoss="24.26" rerouteNo="1" devices="tripinfo_car_n2e_122 routing_car_n2e_122" vType="Car" speedFactor="1.10" vaporized=""/>
    <tripinfo id="car_w2s_94" depart="95.20" departLane="w2sep_1" departPos="3.60" departPosLat="0.00" departSpeed="13.90" departDelay="1.20" arrival="298.10" arrivalLane="c2s_1" arrivalPos="990.00" arrivalPosLat="0.00" arrivalSpeed="14.42" duration="202.90" routeLength="1986.69" waitingTime="52.60" waitingCount="1" stopTime="0.00" timeLoss="64.46" rerouteNo="1" devices="tripinfo_car_w2s_94 routing_car_w2s_94" vType="Car" speedFactor="1.04" vaporized=""/>
    <tripinfo id="car_e2w_104" depart="104.00" departLane="e2sep_1" departPos="3.60" departPosLat="0.00" departSpeed="13.90" departDelay="0.00" arrival="300.00" arrivalLane="c2w_1" arrivalPos="990.00" arrivalPosLat="0.00" arrivalSpeed="14.04" duration="196.00" routeLength="1997.01" waitingTime="45.90" waitingCount="1" stopTime="0.00" timeLoss="53.76" rerouteNo="1" devices="tripinfo_car_e2w_104 routing_car_e2w_104" vType="Car" speedFactor="1.01" vaporized=""/>
    <tripinfo id="car_w2e_127" depart="127.00" departLane="w2sep_1" departPos="3.60" departPosLat="0.00" departSpeed="13.90" departDelay="0.00" arrival="303.55" arrivalLane="c2e_1" arrivalPos="990.00" arrivalPosLat="0.00" arrivalSpeed="14.23" duration="176.55" routeLength="1997.01" waitingTime="26.55" waitingCount="1" stopTime="0.00" timeLoss="36.15" rerouteNo="1" devices="tripinfo_car_w2e_127 routing_car_w2e_127" vType="Car" speedFactor="1.02" vaporized=""/>
    <tripinfo id="car_e2w_136" depart="136.00" departLane="e2sep_1" departPos="3.60" departPosLat="0.00" departSpeed="13.90" departDelay="0.00" arrival="303.55" arrivalLane="c2w_1" arrivalPos="990.00" arrivalPosLat="0.00" arrivalSpeed="15.00" duration="167.55" routeLength="1997.01" waitingTime="21.75" waitingCount="1" stopTime="0.00" timeLoss="34.81" rerouteNo="1" devices="tripinfo_car_e2w_136 routing_car_e2w_136" vType="Car" speedFactor="1.08" vaporized=""/>
    <tripinfo id="car_w2s_108" depart="108.00" departLane="w2sep_1" departPos="3.60" departPosLat="0.00" departSpeed="13.90" departDelay="0.00" arrival="304.40" arrivalLane="c2s_1" arrivalPos="990.00" arrivalPosLat="0.00" arrivalSpeed="13.90" duration="196.40" routeLength="1986.69" waitingTime="42.85" waitingCount="1" stopTime="0.00" timeLoss="52.72" rerouteNo="1" devices="tripinfo_car_w2s_108 routing_car_w2s_108" vType="Car" speedFactor="1.00" vaporized=""/>
    <tripinfo id="car_e2w_142" depart="143.10" departLane="e2sep_1" departPos="3.60" departPosLat="0.00" departSpeed="13.90" departDelay="1.10" arrival="305.70" arrivalLane="c2w_1" arrivalPos="990.00" arrivalPosLat="0.00" arrivalSpeed="15.93" duration="162.60" routeLength="1997.01" waitingTime="9.70" waitingCount="1" stopTime="0.00" timeLoss="40.67" rerouteNo="1" devices="tripinfo_car_e2w_142 routing_car_e2w_142" vType="Car" speedFactor="1.18" vaporized=""/>
    <tripinfo id="bus_e2n_119" depart="119.00" departLane="e2sep_1" departPos="12.10" departPosLat="0.00" departSpeed="13.90" departDelay="0.00" arrival="306.30" arrivalLane="c2n_1" arrivalPos="990.00" arrivalPosLat="0.00" arrivalSpeed="13.90" duration="187.30" routeLength="1978.19" waitingTime="32.60" waitingCount="1" stopTime="0.00" timeLoss="44.24" rerouteNo="1" devices="tripinfo_bus_e2n_119 routing_bus_e2n_119" vType="Bus" speedFactor="1.00" vaporized=""/>
    <tripinfo id="car_w2e_162" depart="162.00" departLane="w2sep_1" departPos="3.60" departPosLat="0.00" departSpeed="13.90" departDelay="0.00" arrival="308.00" arrivalLane="c2e_1" arrivalPos="990.00" arrivalPosLat="0.00" arrivalSpeed="14.16" duration="146.00" routeLength="1997.01" waitingTime="0.00" waitingCount="0" stopTime="0.00" timeLoss="5.10" rerouteNo="1" devices="tripinfo_car_w2e_162 routing_car_w2e_162" vType="Car" speedFactor="1.02" vaporized=""/>
    <tripinfo id="car_e2n_139" depart="139.45" departLane="e2sep_1" departPos="3.60" departPosLat="0.00" departSpeed="13.90" departDelay="0.45" arrival="311.00" arrivalLane="c2n_1" arrivalPos="990.00" arrivalPosLat="0.00" arrivalSpeed="14.11" duration="171.55" routeLength="1986.69" waitingTime="13.95" waitingCount="1" stopTime="0.00" timeLoss="30.09" rerouteNo="1" devices="tripinfo_car_e2n_139 routing_car_e2n_139" vType="Car" speedFactor="1.02" vaporized=""/>
    <tripinfo id="car_w2e_164" depart="164.00" departLane="w2sep_1" departPos="3.60" departPosLat="0.00" departSpeed="13.90" departDelay="0.00" arrival="312.45" arrivalLane="c2e_1" arrivalPos="990.00" arrivalPosLat="0.00" arrivalSpeed="13.89" duration="148.45" routeLength="1997.01" waitingTime="0.00" waitingCount="0" stopTime="0.00" timeLoss="4.77" rerouteNo="1" devices="tripinfo_car_w2e_164 routing_car_w2e_164" vType="Car" speedFactor="1.00" vaporized=""/>
    <tripinfo id="car_e2s_113" depart="113.00" departLane="e2sep_1" departPos="3.60" departPosLat="0.00" departSpeed="13.90" departDelay="0.00" arrival="313.95" arrivalLane="c2s_1" arrivalPos="990.00" arrivalPosLat="0.00" arrivalSpeed="13.90" duration="200.95" routeLength="1996.47" waitingTime="45.55" waitingCount="2" stopTime="0.00" timeLoss="56.64" rerouteNo="1" devices="tripinfo_car_e2s_113 routing_car_e2s_113" vType="Car" speedFactor="1.00" vaporized=""/>
    <tripinfo id="car_e2n_153" depart="153.00" departLane="e2sep_1" departPos="3.60" departPosLat="0.00" departSpeed="13.90" departDelay="0.00" arrival="315.50" arrivalLane="c2n_1" arrivalPos="990.00" arrivalPosLat="0.00" arrivalSpeed="13.96" duration="162.50" routeLength="1986.69" waitingTime="3.90" waitingCount="1" stopTime="0.00" timeLoss="19.57" rerouteNo="1" devices="tripinfo_car_e2n_153 routing_car_e2n_153" vType="Car" speedFactor="1.01" vaporized=""/>
    <tripinfo id="car_e2s_123" depart="123.00" departLane="e2sep_1" departPos="3.60" departPosLat="0.00" departSpeed="13.90" departDelay="0.00" arrival="318.25" arrivalLane="c2s_1" arrivalPos="990.00" arrivalPosLat="0.00" arrivalSpeed="13.89" duration="195.25" routeLength="1996.47" waitingTime="34.35" waitingCount="2" stopTime="0.00" timeLoss="50.93" rerouteNo="1" devices="tripinfo_car_e2s_123 routing_car_e2s_123" vType="Car" speedFactor="1.00" vaporized=""/>
    <tripinfo id="car_e2s_138" depart="138.00" departLane="e2sep_1" departPos="3.60" departPosLat="0.00" departSpeed="13.90" departDelay="0.00" arrival="320.25" arrivalLane="c2s_1" arrivalPos="990.00" arrivalPosLat="0.00" arrivalSpeed="15.02" duration="182.25" routeLength="1996.47" waitingTime="23.30" waitingCount="2" stopTime="0.00" timeLoss="53.32" rerouteNo="1" devices="tripinfo_car_e2s_138 routing_car_e2s_138" vType="Car" speedFactor="1.12" vaporized=""/>
    <tripinfo id="car_e2n_175" depart="175.00" departLane="e2sep_1" departPos="3.60" departPosLat="0.00" departSpeed="13.90" departDelay="0.00" arrival="322.95" arrivalLane="c2n_1" arrivalPos="990.00" arrivalPosLat="0.00" arrivalSpeed="13.90" duration="147.95" routeLength="1986.69" waitingTime="0.00" waitingCount="0" stopTime="0.00" timeLoss="4.25" rerouteNo="1" devices="tripinfo_car_e2n_175 routing_car_e2n_175" vType="Car" speedFactor="1.00" vaporized=""/>
    <tripinfo id="car_e2s_139" depart="141.25" departLane="e2sep_1" departPos="3.60" departPosLat="0.00" departSpeed="13.90" departDelay="2.25" arrival="323.90" arrivalLane="c2s_1" arrivalPos="990.00" arrivalPosLat="0.00" arrivalSpeed="13.88" duration="182.65" routeLength="1996.47" waitingTime="13.45" waitingCount="2" stopTime="0.00" timeLoss="38.33" rerouteNo="1" devices="tripinfo_car_e2s_139 routing_car_e2s_139" vType="Car" speedFactor="1.00" vaporized=""/>
    <tripinfo id="car_e2s_156" depart="156.00" departLane="e2sep_1" departPos="3.60" departPosLat="0.00" departSpeed="13.90" departDelay="0.00" arrival="325.70" arrivalLane="c2s_1" arrivalPos="990.00" arrivalPosLat="0.00" arrivalSpeed="15.32" duration="169.70" routeLength="1996.47" waitingTime="4.05" waitingCount="1" stopTime="0.00" timeLoss="46.52" rerouteNo="1" devices="tripinfo_car_e2s_156 routing_car_e2s_156" vType="Car" speedFactor="1.17" vaporized=""/>
    <tripinfo id="car_e2n_177" depart="177.00" departLane="e2sep_1" departPos="3.60" departPosLat="0.00" departSpeed="13.90" departDelay="0.00" arrival="326.80" arrivalLane="c2n_1" arrivalPos="990.00" arrivalPosLat="0.00" arrivalSpeed="14.11" duration="149.80" routeLength="1986.69" waitingTime="0.00" waitingCount="0" stopTime="0.00" timeLoss="8.50" rerouteNo="1" devices="tripinfo_car_e2n_177 routing_car_e2n_177" vType="Car" speedFactor="1.02" vaporized=""/>
    <tripinfo id="car_e2n_180" depart="180.45" departLane="e2sep_1" departPos="3.60" departPosLat="0.00" departSpeed="13.90" departDelay="0.45" arrival="328.75" arrivalLane="c2n_1" arrivalPos="990.00" arrivalPosLat="0.00" arrivalSpeed="15.31" duration="148.30" routeLength="1986.69" waitingTime="0.00" waitingCount="0" stopTime="0.00" timeLoss="23.11" rerouteNo="1" devices="tripinfo_car_e2n_180 routing_car_e2n_180" vType="Car" speedFactor="1.15" vaporized=""/>
    <tripinfo id="car_e2s_160" depart="160.00" departLane="e2sep_1" departPos="3.60" departPosLat="0.00" departSpeed="13.90" departDelay="0.00" arrival="329.05" arrivalLane="c2s_1" arrivalPos="990.00" arrivalPosLat="0.00" arrivalSpeed="13.87" duration="169.05" routeLength="1996.47" waitingTime="3.80" waitingCount="1" stopTime="0.00" timeLoss="24.71" rerouteNo="1" devices="tripinfo_car_e2s_160 routing_car_e2s_160" vType="Car" speedFactor="1.00" vaporized=""/>
    <tripinfo id="car_w2n_150" depart="150.00" departLane="w2sep_1" departPos="3.60" departPosLat="0.00" departSpeed="13.90" departDelay="0.00" arrival="330.70" arrivalLane="c2n_1" arrivalPos="990.00" arrivalPosLat="0.00" arrivalSpeed="15.46" duration="180.70" routeLength="1996.47" waitingTime="38.75" waitingCount="3" stopTime="0.00" timeLoss="55.69" rerouteNo="1" devices="tripinfo_car_w2n_150 routing_car_w2n_150" vType="Car" speedFactor="1.15" vaporized=""/>
    <tripinfo id="car_e2s_162" depart="162.00" departLane="e2sep_1" departPos="3.60" departPosLat="0.00" departSpeed="13.90" departDelay="0.00" arrival="331.35" arrivalLane="c2s_1" arrivalPos="990.00" arrivalPosLat="0.00" arrivalSpeed="14.42" duration="169.35" routeLength="1996.47" waitingTime="3.50" waitingCount="1" stopTime="0.00" timeLoss="32.64" rerouteNo="1" devices="tripinfo_car_e2s_162 routing_car_e2s_162" vType="Car" speedFactor="1.06" vaporized=""/>
    <tripinfo id="car_e2w_182" depart="182.20" departLane="e2sep_1" departPos="3.60" departPosLat="0.00" departSpeed="13.90" departDelay="0.20" arrival="331.85" arrivalLane="c2w_1" arrivalPos="990.00" arrivalPosLat="0.00" arrivalSpeed="13.90" duration="149.65" routeLength="1997.01" waitingTime="0.00" waitingCount="0" stopTime="0.00" timeLoss="5.94" rerouteNo="1" devices="tripinfo_car_e2w_182 routing_car_e2w_182" vType="Car" speedFactor="1.00" vaporized=""/>
    <tripinfo id="car_e2s_177" depart="178.65" departLane="e2sep_1" departPos="3.60" departPosLat="0.00" departSpeed="13.90" departDelay="1.65" arrival="333.95" arrivalLane="c2s_1" arrivalPos="990.00" arrivalPosLat="0.00" arrivalSpeed="14.19" duration="155.30" routeLength="1996.47" waitingTime="0.00" waitingCount="0" stopTime="0.00" timeLoss="15.22" rerouteNo="1" devices="tripinfo_car_e2s_177 routing_car_e2s_177" vType="Car" speedFactor="1.03" vaporized=""/>
    <tripinfo id="car_w2n_158" depart="158.00" departLane="w2sep_1" departPos="3.60" departPosLat="0.00" departSpeed="13.90" departDelay="0.00" arrival="336.60" arrivalLane="c2n_1" arrivalPos="990.00" arrivalPosLat="0.00" arrivalSpeed="14.22" duration="178.60" routeLength="1996.47" waitingTime="28.35" waitingCount="1" stopTime="0.00" timeLoss="37.52" rerouteNo="1" devices="tripinfo_car_w2n_158 routing_car_w2n_158" vType="Car" speedFactor="1.02" vaporized=""/>
    <tripinfo id="car_w2n_165" depart="165.65" departLane="w2sep_1" departPos="3.60" departPosLat="0.00" departSpeed="13.90" departDelay="0.65" arrival="338.50" arrivalLane="c2n_1" arrivalPos="990.00" arrivalPosLat="0.00" arrivalSpeed="15.63" duration="172.85" routeLength="1996.47" waitingTime="17.35" waitingCount="1" stopTime="0.00" timeLoss="50.49" rerouteNo="1" devices="tripinfo_car_w2n_165 routing_car_w2n_165" vType="Car" speedFactor="1.18" vaporized=""/>
    <tripinfo id="bus_e2s_184" depart="185.05" departLane="e2sep_1" departPos="12.10" departPosLat="0.00" departSpeed="13.90" departDelay="1.05" arrival="340.10" arrivalLane="c2s_1" arrivalPos="990.00" arrivalPosLat="0.00" arrivalSpeed="13.88" duration="155.05" routeLength="1987.97" waitingTime="0.00" waitingCount="0" stopTime="0.00" timeLoss="11.34" rerouteNo="1" devices="tripinfo_bus_e2s_184 routing_bus_e2s_184" vType="Bus" speedFactor="1.00" vaporized=""/>
    <tripinfo id="car_s2n_157" depart="158.40" departLane="s2sep_1" departPos="3.60" departPosLat="0.00" departSpeed="13.90" departDelay="1.40" arrival="344.80" arrivalLane="c2n_1" arrivalPos="990.00" arrivalPosLat="0.00" arrivalSpeed="14.21" duration="186.40" routeLength="1997.01" waitingTime="35.90" waitingCount="1" stopTime="0.00" timeLoss="45.83" rerouteNo="1" devices="tripinfo_car_s2n_157 routing_car_s2n_157" vType="Car" speedFactor="1.02" vaporized=""/>
    <tripinfo id="car_n2s_184" depart="184.00" departLane="n2sep_1" departPos="3.60" departPosLat="0.00" departSpeed="13.90" departDelay="0.00" arrival="346.35" arrivalLane="c2s_1" arrivalPos="990.00" arrivalPosLat="0.00" arrivalSpeed="13.92" duration="162.35" routeLength="1997.01" waitingTime="11.00" waitingCount="1" stopTime="0.00" timeLoss="18.93" rerouteNo="1" devices="tripinfo_car_n2s_184 routing_car_n2s_184" vType="Car" speedFactor="1.00" vaporized=""/>
    <tripinfo id="car_s2n_169" depart="169.00" departLane="s2sep_1" departPos="3.60" departPosLat="0.00" departSpeed="13.90" departDelay="0.00" arrival="347.20" arrivalLane="c2n_1" arrivalPos="990.00" arrivalPosLat="0.00" arrivalSpeed="15.07" duration="178.20" routeLength="1997.01" waitingTime="32.70" waitingCount="1" stopTime="0.00" timeLoss="47.82" rerouteNo="1" devices="tripinfo_car_s2n_169 routing_car_s2n_169" vType="Car" speedFactor="1.10" vaporized=""/>
    <tripinfo id="car_n2s_185" depart="185.45" departLane="n2sep_1" departPos="3.60" departPosLat="0.00" departSpeed="13.90" departDelay="0.45" arrival="349.25" arrivalLane="c2s_1" arrivalPos="990.00" arrivalPosLat="0.00" arrivalSpeed="14.40" duration="163.80" routeLength="1997.01" waitingTime="9.30" waitingCount="1" stopTime="0.00" timeLoss="26.01" rerouteNo="1" devices="tripinfo_car_n2s_185 routing_car_n2s_185" vType="Car" speedFactor="1.04" vaporized=""/>
    <tripinfo id="car_s2e_170" depart="170.30" departLane="s2sep_1" departPos="3.60" departPosLat="0.00" departSpeed="13.90" departDelay="0.30" arrival="349.65" arrivalLane="c2e_1" arrivalPos="990.00" arrivalPosLat="0.00" arrivalSpeed="14.00" duration="179.35" routeLength="1986.69" waitingTime="26.05" waitingCount="1" stopTime="0.00" timeLoss="36.73" rerouteNo="1" devices="tripinfo_car_s2e_170 routing_car_s2e_170" vType="Car" speedFactor="1.01" vaporized=""/>
    <tripinfo id="car_s2w_157" depart="157.00" departLane="s2sep_1" departPos="3.60" departPosLat="0.00" departSpeed="13.90" departDelay="0.00" arrival="349.90" arrivalLane="c2w_1" arrivalPos="990.00" arrivalPosLat="0.00" arrivalSpeed="14.46" duration="192.90" routeLength="1996.47" waitingTime="43.25" waitingCount="2" stopTime="0.00" timeLoss="54.09" rerouteNo="1" devices="tripinfo_car_s2w_157 routing_car_s2w_157" vType="Car" speedFactor="1.04" vaporized=""/>
    <tripinfo id="car_s2n_174" depart="174.00" departLane="s2sep_1" departPos="3.60" departPosLat="0.00" departSpeed="13.90" departDelay="0.00" arrival="351.30" arrivalLane="c2n_1" arrivalPos="990.00" arrivalPosLat="0.00" arrivalSpeed="14.36" duration="177.30" routeLength="1997.01" waitingTime="24.30" waitingCount="1" stopTime="0.00" timeLoss="38.39" rerouteNo="1" devices="tripinfo_car_s2n_174 routing_car_s2n_174" vType="Car" speedFactor="1.03" vaporized=""/>
    <tripinfo id="car_s2e_204" depart="204.00" departLane="s2sep_1" departPos="3.60" departPosLat="0.00" departSpeed="13.90" departDelay="0.00" arrival="352.15" arrivalLane="c2e_1" arrivalPos="990.00" arrivalPosLat="0.00" arrivalSpeed="14.96" duration="148.15" routeLength="1986.69" waitingTime="0.65" waitingCount="1" stopTime="0.00" timeLoss="16.45" rerouteNo="1" devices="tripinfo_car_s2e_204 routing_car_s2e_204" vType="Car" speedFactor="1.09" vaporized=""/>
    <tripinfo id="car_n2s_188" depart="188.00" departLane="n2sep_1" departPos="3.60" departPosLat="0.00" departSpeed="13.90" departDelay="0.00" arrival="352.90" arrivalLane="c2s_1" arrivalPos="990.00" arrivalPosLat="0.00" arrivalSpeed="13.97" duration="164.90" routeLength="1997.01" waitingTime="6.75" waitingCount="1" stopTime="0.00" timeLoss="22.21" rerouteNo="1" devices="tripinfo_car_n2s_188 routing_car_n2s_188" vType="Car" speedFactor="1.01" vaporized=""/>
    <tripinfo id="car_n2e_166" depart="166.00" departLane="n2sep_1" departPos="3.60" departPosLat="0.00" departSpeed="13.90" departDelay="0.00" arrival="356.90" arrivalLane="c2e_1" arrivalPos="990.00" arrivalPosLat="0.00" arrivalSpeed="14.34" duration="190.90" routeLength="1996.47" waitingTime="38.80" waitingCount="2" stopTime="0.00" timeLoss="51.08" rerouteNo="1" devices="tripinfo_car_n2e_166 routing_car_n2e_166" vType="Car" speedFactor="1.03" vaporized=""/>
    <tripinfo id="car_n2e_174" depart="174.00" departLane="n2sep_1" departPos="3.60" departPosLat="0.00" departSpeed="13.90" departDelay="0.00" arrival="359.45" arrivalLane="c2e_1" arrivalPos="990.00" arrivalPosLat="0.00" arrivalSpeed="14.93" duration="185.45" routeLength="1996.47" waitingTime="33.55" waitingCount="2" stopTime="0.00" timeLoss="52.68" rerouteNo="1" devices="tripinfo_car_n2e_174 routing_car_n2e_174" vType="Car" speedFactor="1.09" vaporized=""/>
    <tripinfo id="car_n2s_220" depart="220.00" departLane="n2sep_1" departPos="3.60" departPosLat="0.00" departSpeed="13.90" departDelay="0.00" arrival="364.00" arrivalLane="c2s_1" arrivalPos="990.00" arrivalPosLat="0.00" arrivalSpeed="13.90" duration="144.00" routeLength="1997.01" waitingTime="0.00" waitingCount="0" stopTime="0.00" timeLoss="0.32" rerouteNo="1" devices="tripinfo_car_n2s_220 routing_car_n2s_220" vType="Car" speedFactor="1.00" vaporized=""/>
    <tripinfo id="car_s2e_225" depart="225.00" departLane="s2sep_1" departPos="3.60" departPosLat="0.00" departSpeed="13.90" departDelay="0.00" arrival="372.35" arrivalLane="c2e_1" arrivalPos="990.00" arrivalPosLat="0.00" arrivalSpeed="13.90" duration="147.35" routeLength="1986.69" waitingTime="0.00" waitingCount="0" stopTime="0.00" timeLoss="3.66" rerouteNo="1" devices="tripinfo_car_s2e_225 routing_car_s2e_225" vType="Car" speedFactor="1.00" vaporized=""/>
    <tripinfo id="car_n2e_230" depart="230.00" departLane="n2sep_1" departPos="3.60" departPosLat="0.00" departSpeed="13.90" departDelay="0.00" arrival="377.00" arrivalLane="c2e_1" arrivalPos="990.00" arrivalPosLat="0.00" arrivalSpeed="14.09" duration="147.00" routeLength="1996.47" waitingTime="0.00" waitingCount="0" stopTime="0.00" timeLoss="4.68" rerouteNo="1" devices="tripinfo_car_n2e_230 routing_car_n2e_230" vType="Car" speedFactor="1.01" vaporized=""/>
    <tripinfo id="car_s2w_242" depart="242.00" departLane="s2sep_1" departPos="3.60" departPosLat="0.00" departSpeed="13.90" departDelay="0.00" arrival="377.20" arrivalLane="c2w_1" arrivalPos="990.00" arrivalPosLat="0.00" arrivalSpeed="15.27" duration="135.20" routeLength="1996.47" waitingTime="0.00" waitingCount="0" stopTime="0.00" timeLoss="3.82" rerouteNo="1" devices="tripinfo_car_s2w_242 routing_car_s2w_242" vType="Car" speedFactor="1.10" vaporized=""/>
    <tripinfo id="car_e2n_196" depart="196.00" departLane="e2sep_1" departPos="3.60" departPosLat="0.00" departSpeed="13.90" departDelay="0.00" arrival="387.10" arrivalLane="c2n_1" arrivalPos="990.00" arrivalPosLat="0.00" arrivalSpeed="15.18" duration="191.10" routeLength="1986.69" waitingTime="45.70" waitingCount="1" stopTime="0.00" timeLoss="59.54" rerouteNo="1" devices="tripinfo_car_e2n_196 routing_car_e2n_196" vType="Car" speedFactor="1.09" vaporized=""/>
    <tripinfo id="car_w2s_191" depart="191.00" departLane="w2sep_1" departPos="3.60" departPosLat="0.00" departSpeed="13.90" departDelay="0.00" arrival="389.15" arrivalLane="c2s_1" arrivalPos="990.00" arrivalPosLat="0.00" arrivalSpeed="14.21" duration="198.15" routeLength="1986.69" waitingTime="50.75" waitingCount="1" stopTime="0.00" timeLoss="57.57" rerouteNo="1" devices="tripinfo_car_w2s_191 routing_car_w2s_191" vType="Car" speedFactor="1.02" vaporized=""/>
    <tripinfo id="car_e2w_192" depart="192.00" departLane="e2sep_1" departPos="3.60" departPosLat="0.00" departSpeed="13.90" departDelay="0.00" arrival="389.70" arrivalLane="c2w_1" arrivalPos="990.00" arrivalPosLat="0.00" arrivalSpeed="14.13" duration="197.70" routeLength="1997.01" waitingTime="46.85" waitingCount="1" stopTime="0.00" timeLoss="56.38" rerouteNo="1" devices="tripinfo_car_e2w_192 routing_car_e2w_192" vType="Car" speedFactor="1.02" vaporized=""/>
    <tripinfo id="car_w2e_202" depart="202.00" departLane="w2sep_1" departPos="3.60" departPosLat="0.00" departSpeed="13.90" departDelay="0.00" arrival="390.35" arrivalLane="c2e_1" arrivalPos="990.00" arrivalPosLat="0.00" arrivalSpeed="14.42" duration="188.35" routeLength="1997.01" waitingTime="41.30" waitingCount="1" stopTime="0.00" timeLoss="49.90" rerouteNo="1" devices="tripinfo_car_w2e_202 routing_car_w2e_202" vType="Car" speedFactor="1.04" vaporized=""/>
    <tripinfo id="car_w2e_214" depart="214.00" departLane="w2sep_1" departPos="3.60" departPosLat="0.00" departSpeed="13.90" departDelay="0.00" arrival="393.05" arrivalLane="c2e_1" arrivalPos="990.00" arrivalPosLat="0.00" arrivalSpeed="15.11" duration="179.05" routeLength="1997.01" waitingTime="33.55" waitingCount="1" stopTime="0.00" timeLoss="48.11" rerouteNo="1" devices="tripinfo_car_w2e_214 routing_car_w2e_214" vType="Car" speedFactor="1.10" vaporized=""/>
    <tripinfo id="car_e2n_202" depart="202.00" departLane="e2sep_1" departPos="3.60" departPosLat="0.00" departSpeed="13.90" departDelay="0.00" arrival="393.60" arrivalLane="c2n_1" arrivalPos="990.00" arrivalPosLat="0.00" arrivalSpeed="14.50" duration="191.60" routeLength="1986.69" waitingTime="42.35" waitingCount="1" stopTime="0.00" timeLoss="53.91" rerouteNo="1" devices="tripinfo_car_e2n_202 routing_car_e2n_202" vType="Car" speedFactor="1.04" vaporized=""/>
    <tripinfo id="car_w2s_219" depart="219.00" departLane="w2sep_1" departPos="3.60" departPosLat="0.00" departSpeed="13.90" departDelay="0.00" arrival="393.95" arrivalLane="c2s_1" arrivalPos="990.00" arrivalPosLat="0.00" arrivalSpeed="14.80" duration="174.95" routeLength="1986.69" waitingTime="28.00" waitingCount="1" stopTime="0.00" timeLoss="40.07" rerouteNo="1" devices="tripinfo_car_w2s_219 routing_car_w2s_219" vType="Car" speedFactor="1.07" vaporized=""/>
    <tripinfo id="car_w2e_248" depart="248.00" departLane="w2sep_1" departPos="3.60" departPosLat="0.00" departSpeed="13.90" departDelay="0.00" arrival="395.95" arrivalLane="c2e_1" arrivalPos="990.00" arrivalPosLat="0.00" arrivalSpeed="15.14" duration="147.95" routeLength="1997.01" waitingTime="2.25" waitingCount="1" stopTime="0.00" timeLoss="16.87" rerouteNo="1" devices="tripinfo_car_w2e_248 routing_car_w2e_248" vType="Car" speedFactor="1.10" vaporized=""/>
    <tripinfo id="car_e2n_212" depart="212.15" departLane="e2sep_1" departPos="3.60" departPosLat="0.00" departSpeed="13.90" departDelay="0.15" arrival="396.00" arrivalLane="c2n_1" arrivalPos="990.00" arrivalPosLat="0.00" arrivalSpeed="15.34" duration="183.85" routeLength="1986.69" waitingTime="30.45" waitingCount="1" stopTime="0.00" timeLoss="55.75" rerouteNo="1" devices="tripinfo_car_e2n_212 routing_car_e2n_212" vType="Car" speedFactor="1.12" vaporized=""/>
    <tripinfo id="car_w2e_250" depart="250.00" departLane="w2sep_1" departPos="3.60" departPosLat="0.00" departSpeed="13.90" departDelay="0.00" arrival="398.00" arrivalLane="c2e_1" arrivalPos="990.00" arrivalPosLat="0.00" arrivalSpeed="15.85" duration="148.00" routeLength="1997.01" waitingTime="1.45" waitingCount="1" stopTime="0.00" timeLoss="25.91" rerouteNo="1" devices="tripinfo_car_w2e_250 routing_car_w2e_250" vType="Car" speedFactor="1.18" vaporized=""/>
    <tripinfo id="car_e2w_224" depart="224.00" departLane="e2sep_1" departPos="3.60" departPosLat="0.00" departSpeed="13.90" departDelay="0.00" arrival="399.80" arrivalLane="c2w_1" arrivalPos="990.00" arrivalPosLat="0.00" arrivalSpeed="13.90" duration="175.80" routeLength="1997.01" waitingTime="20.40" waitingCount="1" stopTime="0.00" timeLoss="32.11" rerouteNo="1" devices="tripinfo_car_e2w_224 routing_car_e2w_224" vType="Car" speedFactor="1.00" vaporized=""/>
    <tripinfo id="car_e2w_226" depart="227.30" departLane="e2sep_1" departPos="3.60" departPosLat="0.00" departSpeed="13.90" departDelay="1.30" arrival="402.40" arrivalLane="c2w_1" arrivalPos="990.00" arrivalPosLat="0.00" arrivalSpeed="14.74" duration="175.10" routeLength="1997.01" waitingTime="17.05" waitingCount="1" stopTime="0.00" timeLoss="41.14" rerouteNo="1" devices="tripinfo_car_e2w_226 routing_car_e2w_226" vType="Car" speedFactor="1.07" vaporized=""/>
    <tripinfo id="car_e2n_225" depart="225.45" departLane="e2sep_1" departPos="3.60" departPosLat="0.00" departSpeed="13.90" departDelay="0.45" arrival="402.85" arrivalLane="c2n_1" arrivalPos="990.00" arrivalPosLat="0.00" arrivalSpeed="13.90" duration="177.40" routeLength="1986.69" waitingTime="17.95" waitingCount="1" stopTime="0.00" timeLoss="33.71" rerouteNo="1" devices="tripinfo_car_e2n_225 routing_car_e2n_225" vType="Car" speedFactor="1.00" vaporized=""/>
    <tripinfo id="car_w2e_254" depart="254.00" departLane="w2sep_1" departPos="3.60" departPosLat="0.00" departSpeed="13.90" departDelay="0.00" arrival="404.10" arrivalLane="c2e_1" arrivalPos="990.00" arrivalPosLat="0.00" arrivalSpeed="13.94" duration="150.10" routeLength="1997.01" waitingTime="0.00" waitingCount="0" stopTime="0.00" timeLoss="6.87" rerouteNo="1" devices="tripinfo_car_w2e_254 routing_car_w2e_254" vType="Car" speedFactor="1.00" vaporized=""/>
    <tripinfo id="car_w2e_265" depart="265.00" departLane="w2sep_1" departPos="3.60" departPosLat="0.00" departSpeed="13.90" departDelay="0.00" arrival="406.70" arrivalLane="c2e_1" arrivalPos="990.00" arrivalPosLat="0.00" arrivalSpeed="14.59" duration="141.70" routeLength="1997.01" waitingTime="0.00" waitingCount="0" stopTime="0.00" timeLoss="6.28" rerouteNo="1" devices="tripinfo_car_w2e_265 routing_car_w2e_265" vType="Car" speedFactor="1.06" vaporized=""/>
    <tripinfo id="car_e2n_240" depart="240.00" departLane="e2sep_1" departPos="3.60" departPosLat="0.00" departSpeed="13.90" departDelay="0.00" arrival="406.80" arrivalLane="c2n_1" arrivalPos="990.00" arrivalPosLat="0.00" arrivalSpeed="14.11" duration="166.80" routeLength="1986.69" waitingTime="9.20" waitingCount="1" stopTime="0.00" timeLoss="25.52" rerouteNo="1" devices="tripinfo_car_e2n_240 routing_car_e2n_240" vType="Car" speedFactor="1.02" vaporized=""/>
    <tripinfo id="car_e2w_262" depart="262.00" departLane="e2sep_1" departPos="3.60" departPosLat="0.00" departSpeed="13.90" departDelay="0.00" arrival="406.95" arrivalLane="c2w_1" arrivalPos="990.00" arrivalPosLat="0.00" arrivalSpeed="14.33" duration="144.95" routeLength="1997.01" waitingTime="0.00" waitingCount="0" stopTime="0.00" timeLoss="5.63" rerouteNo="1" devices="tripinfo_car_e2w_262 routing_car_e2w_262" vType="Car" speedFactor="1.03" vaporized=""/>
    <tripinfo id="car_w2e_266" depart="266.40" departLane="w2sep_1" departPos="3.60" departPosLat="0.00" departSpeed="13.90" departDelay="0.40" arrival="408.65" arrivalLane="c2e_1" arrivalPos="990.00" arrivalPosLat="1.10" arrivalSpeed="15.39" duration="142.25" routeLength="1997.01" waitingTime="0.00" waitingCount="0" stopTime="0.00" timeLoss="17.62" rerouteNo="1" devices="tripinfo_car_w2e_266 routing_car_w2e_266" vType="Car@car_w2e_266" speedFactor="1.15" vaporized=""/>
    <tripinfo id="car_e2n_269" depart="269.00" departLane="e2sep_1" departPos="3.60" departPosLat="0.00" departSpeed="13.90" departDelay="0.00" arrival="408.90" arrivalLane="c2n_1" arrivalPos="990.00" arrivalPosLat="0.00" arrivalSpeed="15.10" duration="139.90" routeLength="1986.69" waitingTime="0.00" waitingCount="0" stopTime="0.00" timeLoss="11.46" rerouteNo="1" devices="tripinfo_car_e2n_269 routing_car_e2n_269" vType="Car" speedFactor="1.12" vaporized=""/>
    <tripinfo id="amb_w2e_300" depart="300.00" departLane="w2sep_1" departPos="6.60" departPosLat="0.00" departSpeed="13.90" departDelay="0.00" arrival="410.15" arrivalLane="c2e_1" arrivalPos="990.00" arrivalPosLat="0.00" arrivalSpeed="17.35" duration="110.15" routeLength="1994.01" waitingTime="0.00" waitingCount="0" stopTime="0.00" timeLoss="14.50" rerouteNo="1" devices="tripinfo_amb_w2e_300 routing_amb_w2e_300 bluelight_amb_w2e_300 fcd_amb_w2e_300" vType="Ambulance" speedFactor="1.50" vaporized="">
        <example_device customValue1="0.00" customValue2="-1.00"/>
    </tripinfo>
    <tripinfo id="car_e2s_209" depart="209.00" departLane="e2sep_1" departPos="3.60" departPosLat="0.00" departSpeed="13.90" departDelay="0.00" arrival="411.15" arrivalLane="c2s_1" arrivalPos="990.00" arrivalPosLat="0.00" arrivalSpeed="14.04" duration="202.15" routeLength="1996.47" waitingTime="48.10" waitingCount="2" stopTime="0.00" timeLoss="59.24" rerouteNo="1" devices="tripinfo_car_e2s_209 routing_car_e2s_209" vType="Car" speedFactor="1.01" vaporized=""/>
    <tripinfo id="car_e2n_272" depart="272.00" departLane="e2sep_1" departPos="3.60" departPosLat="0.00" departSpeed="13.90" departDelay="0.00" arrival="415.95" arrivalLane="c2n_1" arrivalPos="990.00" arrivalPosLat="0.00" arrivalSpeed="14.35" duration="143.95" routeLength="1986.69" waitingTime="0.00" waitingCount="0" stopTime="0.00" timeLoss="4.79" rerouteNo="1" devices="tripinfo_car_e2n_272 routing_car_e2n_272" vType="Car" speedFactor="1.03" vaporized=""/>
    <tripinfo id="car_w2s_268" depart="268.05" departLane="w2sep_1" departPos="3.60" departPosLat="0.00" departSpeed="13.90" departDelay="0.05" arrival="418.10" arrivalLane="c2s_1" arrivalPos="990.00" arrivalPosLat="0.00" arrivalSpeed="13.90" duration="150.05" routeLength="1986.69" waitingTime="0.00" waitingCount="0" stopTime="0.00" timeLoss="6.34" rerouteNo="1" devices="tripinfo_car_w2s_268 routing_car_w2s_268" vType="Car" speedFactor="1.00" vaporized=""/>
    <tripinfo id="car_w2n_205" depart="205.00" departLane="w2sep_1" departPos="3.60" departPosLat="0.00" departSpeed="13.90" departDelay="0.00" arrival="419.50" arrivalLane="c2n_1" arrivalPos="990.00" arrivalPosLat="0.00" arrivalSpeed="14.65" duration="214.50" routeLength="1996.47" waitingTime="62.50" waitingCount="3" stopTime="0.00" timeLoss="77.91" rerouteNo="1" devices="tripinfo_car_w2n_205 routing_car_w2n_205" vType="Car" speedFactor="1.06" vaporized=""/>
    <tripinfo id="car_w2n_231" depart="231.00" departLane="w2sep_1" departPos="3.60" departPosLat="0.00" departSpeed="13.90" departDelay="0.00" arrival="422.55" arrivalLane="c2n_1" arrivalPos="990.00" arrivalPosLat="0.00" arrivalSpeed="14.73" duration="191.55" routeLength="1996.47" waitingTime="38.55" waitingCount="2" stopTime="0.00" timeLoss="56.03" rerouteNo="1" devices="tripinfo_car_w2n_231 routing_car_w2n_231" vType="Car" speedFactor="1.06" vaporized=""/>
    <tripinfo id="car_w2n_262" depart="262.00" departLane="w2sep_1" departPos="3.60" departPosLat="0.00" departSpeed="13.90" departDelay="0.00" arrival="425.00" arrivalLane="c2n_1" arrivalPos="990.00" arrivalPosLat="0.00" arrivalSpeed="15.11" duration="163.00" routeLength="1996.47" waitingTime="13.60" waitingCount="1" stopTime="0.00" timeLoss="32.16" rerouteNo="1" devices="tripinfo_car_w2n_262 routing_car_w2n_262" vType="Car" speedFactor="1.10" vaporized=""/>
    <tripinfo id="car_w2n_290" depart="290.00" departLane="w2sep_1" departPos="3.60" departPosLat="0.00" departSpeed="13.90" departDelay="0.00" arrival="427.00" arrivalLane="c2n_1" arrivalPos="990.00" arrivalPosLat="0.00" arrivalSpeed="15.63" duration="137.00" routeLength="1996.47" waitingTime="0.00" waitingCount="0" stopTime="0.00" timeLoss="13.03" rerouteNo="1" devices="tripinfo_car_w2n_290 routing_car_w2n_290" vType="Car" speedFactor="1.16" vaporized=""/>
    <tripinfo id="bus_w2s_279" depart="279.00" departLane="w2sep_1" departPos="12.10" departPosLat="0.00" departSpeed="13.90" departDelay="0.00" arrival="428.10" arrivalLane="c2s_1" arrivalPos="990.00" arrivalPosLat="0.00" arrivalSpeed="13.90" duration="149.10" routeLength="1978.19" waitingTime="0.00" waitingCount="0" stopTime="0.00" timeLoss="6.06" rerouteNo="1" devices="tripinfo_bus_w2s_279 routing_bus_w2s_279" vType="Bus" speedFactor="1.00" vaporized=""/>
    <tripinfo id="car_e2s_210" depart="210.45" departLane="e2sep_1" departPos="3.60" departPosLat="0.00" departSpeed="13.90" departDelay="0.45" arrival="431.05" arrivalLane="c2s_1" arrivalPos="990.00" arrivalPosLat="0.00" arrivalSpeed="14.95" duration="220.60" routeLength="1996.47" waitingTime="61.05" waitingCount="4" stopTime="0.00" timeLoss="87.94" rerouteNo="1" devices="tripinfo_car_e2s_210 routing_car_e2s_210" vType="Car" speedFactor="1.09" vaporized=""/>
    <tripinfo id="car_e2n_278" depart="278.00" departLane="e2sep_1" departPos="3.60" departPosLat="0.00" departSpeed="13.90" departDelay="0.00" arrival="434.15" arrivalLane="c2n_1" arrivalPos="990.00" arrivalPosLat="0.00" arrivalSpeed="14.06" duration="156.15" routeLength="1986.69" waitingTime="5.90" waitingCount="1" stopTime="0.00" timeLoss="14.13" rerouteNo="1" devices="tripinfo_car_e2n_278 routing_car_e2n_278" vType="Car" speedFactor="1.01" vaporized=""/>
    <tripinfo id="car_e2s_230" depart="230.00" departLane="e2sep_1" departPos="3.60" departPosLat="0.00" departSpeed="13.90" departDelay="0.00" arrival="434.70" arrivalLane="c2s_1" arrivalPos="990.00" arrivalPosLat="0.00" arrivalSpeed="14.35" duration="204.70" routeLength="1996.47" waitingTime="36.60" waitingCount="3" stopTime="0.00" timeLoss="65.16" rerouteNo="1" devices="tripinfo_car_e2s_230 routing_car_e2s_230" vType="Car" speedFactor="1.03" vaporized=""/>
    <tripinfo id="car_e2s_274" depart="274.00" departLane="e2sep_1" departPos="3.60" departPosLat="0.00" departSpeed="13.90" departDelay="0.00" arrival="436.40" arrivalLane="c2s_1" arrivalPos="990.00" arrivalPosLat="0.00" arrivalSpeed="15.85" duration="162.40" routeLength="1996.47" waitingTime="10.50" waitingCount="1" stopTime="0.00" timeLoss="44.70" rerouteNo="1" devices="tripinfo_car_e2s_274 routing_car_e2s_274" vType="Car" speedFactor="1.23" vaporized=""/>
    <tripinfo id="car_e2n_280" depart="280.00" departLane="e2sep_1" departPos="3.60" departPosLat="0.00" departSpeed="13.90" departDelay="0.00" arrival="438.25" arrivalLane="c2n_1" arrivalPos="990.00" arrivalPosLat="0.00" arrivalSpeed="14.10" duration="158.25" routeLength="1986.69" waitingTime="3.25" waitingCount="1" stopTime="0.00" timeLoss="16.74" rerouteNo="1" devices="tripinfo_car_e2n_280 routing_car_e2n_280" vType="Car" speedFactor="1.02" vaporized=""/>
    <tripinfo id="car_e2s_281" depart="281.65" departLane="e2sep_1" departPos="3.60" departPosLat="0.00" departSpeed="13.90" departDelay="0.65" arrival="440.20" arrivalLane="c2s_1" arrivalPos="990.00" arrivalPosLat="0.00" arrivalSpeed="14.21" duration="158.55" routeLength="1996.47" waitingTime="0.00" waitingCount="0" stopTime="0.00" timeLoss="17.56" rerouteNo="1" devices="tripinfo_car_e2s_281 routing_car_e2s_281" vType="Car" speedFactor="1.02" vaporized=""/>
    <tripinfo id="car_e2s_291" depart="291.00" departLane="e2sep_1" departPos="3.60" departPosLat="0.00" departSpeed="13.90" departDelay="0.00" arrival="442.25" arrivalLane="c2s_1" arrivalPos="990.00" arrivalPosLat="0.00" arrivalSpeed="15.20" duration="151.25" routeLength="1996.47" waitingTime="0.00" waitingCount="0" stopTime="0.00" timeLoss="23.41" rerouteNo="1" devices="tripinfo_car_e2s_291 routing_car_e2s_291" vType="Car" speedFactor="1.13" vaporized=""/>
    <tripinfo id="car_s2e_248" depart="248.00" departLane="s2sep_1" departPos="3.60" departPosLat="0.00" departSpeed="13.90" departDelay="0.00" arrival="447.70" arrivalLane="c2e_1" arrivalPos="990.00" arrivalPosLat="0.00" arrivalSpeed="15.23" duration="199.70" routeLength="1986.69" waitingTime="55.80" waitingCount="1" stopTime="0.00" timeLoss="68.58" rerouteNo="1" devices="tripinfo_car_s2e_248 routing_car_s2e_248" vType="Car" speedFactor="1.10" vaporized=""/>
    <tripinfo id="car_s2n_242" depart="243.30" departLane="s2sep_1" departPos="3.60" departPosLat="0.00" departSpeed="13.90" departDelay="1.30" arrival="451.05" arrivalLane="c2n_1" arrivalPos="990.00" arrivalPosLat="0.00" arrivalSpeed="14.03" duration="207.75" routeLength="1997.01" waitingTime="57.00" waitingCount="1" stopTime="0.00" timeLoss="65.34" rerouteNo="1" devices="tripinfo_car_s2n_242 routing_car_s2n_242" vType="Car" speedFactor="1.01" vaporized=""/>
    <tripinfo id="car_n2w_235" depart="235.00" departLane="n2sep_1" departPos="3.60" departPosLat="0.00" departSpeed="13.90" departDelay="0.00" arrival="451.50" arrivalLane="c2w_1" arrivalPos="990.00" arrivalPosLat="0.00" arrivalSpeed="13.90" duration="216.50" routeLength="1986.69" waitingTime="65.50" waitingCount="1" stopTime="0.00" timeLoss="72.80" rerouteNo="1" devices="tripinfo_car_n2w_235 routing_car_n2w_235" vType="Car" speedFactor="1.00" vaporized=""/>
    <tripinfo id="car_n2w_238" depart="238.00" departLane="n2sep_1" departPos="3.60" departPosLat="0.00" departSpeed="13.90" departDelay="0.00" arrival="453.35" arrivalLane="c2w_1" arrivalPos="990.00" arrivalPosLat="0.00" arrivalSpeed="15.42" duration="215.35" routeLength="1986.69" waitingTime="64.60" waitingCount="1" stopTime="0.00" timeLoss="92.43" rerouteNo="1" devices="tripinfo_car_n2w_238 routing_car_n2w_238" vType="Car" speedFactor="1.17" vaporized=""/>
    <tripinfo id="car_n2s_254" depart="254.00" departLane="n2sep_1" departPos="3.60" departPosLat="0.00" departSpeed="13.90" departDelay="0.00" arrival="453.80" arrivalLane="c2s_1" arrivalPos="990.00" arrivalPosLat="0.00" arrivalSpeed="14.89" duration="199.80" routeLength="1997.01" waitingTime="51.10" waitingCount="1" stopTime="0.00" timeLoss="65.64" rerouteNo="1" devices="tripinfo_car_n2s_254 routing_car_n2s_254" vType="Car" speedFactor="1.07" vaporized=""/>
    <tripinfo id="car_s2n_278" depart="278.00" departLane="s2sep_1" departPos="3.60" departPosLat="0.00" departSpeed="13.90" departDelay="0.00" arrival="454.40" arrivalLane="c2n_1" arrivalPos="990.00" arrivalPosLat="0.00" arrivalSpeed="15.49" duration="176.40" routeLength="1997.01" waitingTime="31.75" waitingCount="1" stopTime="0.00" timeLoss="48.05" rerouteNo="1" devices="tripinfo_car_s2n_278 routing_car_s2n_278" vType="Car" speedFactor="1.12" vaporized=""/>
    <tripinfo id="car_n2w_251" depart="251.00" departLane="n2sep_1" departPos="3.60" departPosLat="0.00" departSpeed="13.90" departDelay="0.00" arrival="457.95" arrivalLane="c2w_1" arrivalPos="990.00" arrivalPosLat="0.00" arrivalSpeed="13.95" duration="206.95" routeLength="1986.69" waitingTime="52.15" waitingCount="1" stopTime="0.00" timeLoss="63.91" rerouteNo="1" devices="tripinfo_car_n2w_251 routing_car_n2w_251" vType="Car" speedFactor="1.00" vaporized=""/>
    <tripinfo id="car_s2n_294" depart="294.00" departLane="s2sep_1" departPos="3.60" departPosLat="0.00" departSpeed="13.90" departDelay="0.00" arrival="459.05" arrivalLane="c2n_1" arrivalPos="990.00" arrivalPosLat="0.00" arrivalSpeed="15.04" duration="165.05" routeLength="1997.01" waitingTime="17.10" waitingCount="1" stopTime="0.00" timeLoss="32.31" rerouteNo="1" devices="tripinfo_car_s2n_294 routing_car_s2n_294" vType="Car" speedFactor="1.08" vaporized=""/>
    <tripinfo id="bus_s2e_250" depart="250.00" departLane="s2sep_1" departPos="12.10" departPosLat="0.00" departSpeed="13.90" departDelay="0.00" arrival="459.50" arrivalLane="c2e_1" arrivalPos="990.00" arrivalPosLat="0.00" arrivalSpeed="13.90" duration="209.50" routeLength="1978.19" waitingTime="52.80" waitingCount="1" stopTime="0.00" timeLoss="66.45" rerouteNo="1" devices="tripinfo_bus_s2e_250 routing_bus_s2e_250" vType="Bus" speedFactor="1.00" vaporized=""/>
    <tripinfo id="car_n2s_255" depart="255.45" departLane="n2sep_1" departPos="3.60" departPosLat="0.00" departSpeed="13.90" departDelay="0.45" arrival="461.30" arrivalLane="c2s_1" arrivalPos="990.00" arrivalPosLat="0.00" arrivalSpeed="13.90" duration="205.85" routeLength="1997.01" waitingTime="47.85" waitingCount="1" stopTime="0.00" timeLoss="62.16" rerouteNo="1" devices="tripinfo_car_n2s_255 routing_car_n2s_255" vType="Car" speedFactor="1.00" vaporized=""/>
    <tripinfo id="car_s2e_319" depart="319.00" departLane="s2sep_1" departPos="3.60" departPosLat="0.00" departSpeed="13.90" departDelay="0.00" arrival="463.95" arrivalLane="c2e_1" arrivalPos="990.00" arrivalPosLat="0.00" arrivalSpeed="14.44" duration="144.95" routeLength="1986.69" waitingTime="0.00" waitingCount="0" stopTime="0.00" timeLoss="6.80" rerouteNo="1" devices="tripinfo_car_s2e_319 routing_car_s2e_319" vType="Car" speedFactor="1.04" vaporized=""/>
    <tripinfo id="car_n2s_263" depart="263.00" departLane="n2sep_1" departPos="3.60" departPosLat="0.00" departSpeed="13.90" departDelay="0.00" arrival="464.60" arrivalLane="c2s_1" arrivalPos="990.00" arrivalPosLat="0.00" arrivalSpeed="14.18" duration="201.60" routeLength="1997.01" waitingTime="44.75" waitingCount="1" stopTime="0.00" timeLoss="61.21" rerouteNo="1" devices="tripinfo_car_n2s_263 routing_car_n2s_263" vType="Car" speedFactor="1.02" vaporized=""/>
    <tripinfo id="car_n2s_266" depart="266.00" departLane="n2sep_1" departPos="3.60" departPosLat="0.00" departSpeed="13.90" departDelay="0.00" arrival="467.50" arrivalLane="c2s_1" arrivalPos="990.00" arrivalPosLat="0.00" arrivalSpeed="14.26" duration="201.50" routeLength="1997.01" waitingTime="42.45" waitingCount="1" stopTime="0.00" timeLoss="62.29" rerouteNo="1" devices="tripinfo_car_n2s_266 routing_car_n2s_266" vType="Car" speedFactor="1.03" vaporized=""/>
    <tripinfo id="car_n2s_273" depart="273.00" departLane="n2sep_1" departPos="3.60" departPosLat="0.00" departSpeed="13.90" departDelay="0.00" arrival="469.40" arrivalLane="c2s_1" arrivalPos="990.00" arrivalPosLat="0.00" arrivalSpeed="15.21" duration="196.40" routeLength="1997.01" waitingTime="41.70" waitingCount="1" stopTime="0.00" timeLoss="70.65" rerouteNo="1" devices="tripinfo_car_n2s_273 routing_car_n2s_273" vType="Car" speedFactor="1.14" vaporized=""/>
    <tripinfo id="car_n2e_291" depart="291.00" departLane="n2sep_1" departPos="3.60" departPosLat="0.00" departSpeed="13.90" departDelay="0.00" arrival="469.60" arrivalLane="c2e_1" arrivalPos="990.00" arrivalPosLat="0.00" arrivalSpeed="13.90" duration="178.60" routeLength="1996.47" waitingTime="21.95" waitingCount="2" stopTime="0.00" timeLoss="34.25" rerouteNo="1" devices="tripinfo_car_n2e_291 routing_car_n2e_291" vType="Car" speedFactor="1.00" vaporized=""/>
</tripinfos>
