%!PS-Adobe-3.0 EPSF-3.0
%%Creator: (MATLAB, The Mathworks, Inc. Version 9.9.0.1524771 \(R2020b\) Update 2. Operating System: Linux)
%%Title: ../pictures/evaluate_models/SEPLAST_VEH_V_RMSE.eps
%%CreationDate: 2021-05-13T10:48:17
%%Pages: (atend)
%%BoundingBox:     0     2   428   428
%%LanguageLevel: 3
%%EndComments
%%BeginProlog
%%BeginResource: procset (Apache XML Graphics Std ProcSet) 1.2 0
%%Version: 1.2 0
%%Copyright: (Copyright 2001-2003,2010 The Apache Software Foundation. License terms: http://www.apache.org/licenses/LICENSE-2.0)
/bd{bind def}bind def
/ld{load def}bd
/GR/grestore ld
/GS/gsave ld
/RM/rmoveto ld
/C/curveto ld
/t/show ld
/L/lineto ld
/ML/setmiterlimit ld
/CT/concat ld
/f/fill ld
/N/newpath ld
/S/stroke ld
/CC/setcmykcolor ld
/A/ashow ld
/cp/closepath ld
/RC/setrgbcolor ld
/LJ/setlinejoin ld
/GC/setgray ld
/LW/setlinewidth ld
/M/moveto ld
/re {4 2 roll M
1 index 0 rlineto
0 exch rlineto
neg 0 rlineto
cp } bd
/_ctm matrix def
/_tm matrix def
/BT { _ctm currentmatrix pop matrix _tm copy pop 0 0 moveto } bd
/ET { _ctm setmatrix } bd
/iTm { _ctm setmatrix _tm concat } bd
/Tm { _tm astore pop iTm 0 0 moveto } bd
/ux 0.0 def
/uy 0.0 def
/F {
  /Tp exch def
  /Tf exch def
  Tf findfont Tp scalefont setfont
  /cf Tf def  /cs Tp def
} bd
/ULS {currentpoint /uy exch def /ux exch def} bd
/ULE {
  /Tcx currentpoint pop def
  gsave
  newpath
  cf findfont cs scalefont dup
  /FontMatrix get 0 get /Ts exch def /FontInfo get dup
  /UnderlinePosition get Ts mul /To exch def
  /UnderlineThickness get Ts mul /Tt exch def
  ux uy To add moveto  Tcx uy To add lineto
  Tt setlinewidth stroke
  grestore
} bd
/OLE {
  /Tcx currentpoint pop def
  gsave
  newpath
  cf findfont cs scalefont dup
  /FontMatrix get 0 get /Ts exch def /FontInfo get dup
  /UnderlinePosition get Ts mul /To exch def
  /UnderlineThickness get Ts mul /Tt exch def
  ux uy To add cs add moveto Tcx uy To add cs add lineto
  Tt setlinewidth stroke
  grestore
} bd
/SOE {
  /Tcx currentpoint pop def
  gsave
  newpath
  cf findfont cs scalefont dup
  /FontMatrix get 0 get /Ts exch def /FontInfo get dup
  /UnderlinePosition get Ts mul /To exch def
  /UnderlineThickness get Ts mul /Tt exch def
  ux uy To add cs 10 mul 26 idiv add moveto Tcx uy To add cs 10 mul 26 idiv add lineto
  Tt setlinewidth stroke
  grestore
} bd
/QT {
/Y22 exch store
/X22 exch store
/Y21 exch store
/X21 exch store
currentpoint
/Y21 load 2 mul add 3 div exch
/X21 load 2 mul add 3 div exch
/X21 load 2 mul /X22 load add 3 div
/Y21 load 2 mul /Y22 load add 3 div
/X22 load /Y22 load curveto
} bd
/SSPD {
dup length /d exch dict def
{
/v exch def
/k exch def
currentpagedevice k known {
/cpdv currentpagedevice k get def
v cpdv ne {
/upd false def
/nullv v type /nulltype eq def
/nullcpdv cpdv type /nulltype eq def
nullv nullcpdv or
{
/upd true def
} {
/sametype v type cpdv type eq def
sametype {
v type /arraytype eq {
/vlen v length def
/cpdvlen cpdv length def
vlen cpdvlen eq {
0 1 vlen 1 sub {
/i exch def
/obj v i get def
/cpdobj cpdv i get def
obj cpdobj ne {
/upd true def
exit
} if
} for
} {
/upd true def
} ifelse
} {
v type /dicttype eq {
v {
/dv exch def
/dk exch def
/cpddv cpdv dk get def
dv cpddv ne {
/upd true def
exit
} if
} forall
} {
/upd true def
} ifelse
} ifelse
} if
} ifelse
upd true eq {
d k v put
} if
} if
} if
} forall
d length 0 gt {
d setpagedevice
} if
} bd
/RE { % /NewFontName [NewEncodingArray] /FontName RE -
  findfont dup length dict begin
  {
    1 index /FID ne
    {def} {pop pop} ifelse
  } forall
  /Encoding exch def
  /FontName 1 index def
  currentdict definefont pop
  end
} bind def
%%EndResource
%%BeginResource: procset (Apache XML Graphics EPS ProcSet) 1.0 0
%%Version: 1.0 0
%%Copyright: (Copyright 2002-2003 The Apache Software Foundation. License terms: http://www.apache.org/licenses/LICENSE-2.0)
/BeginEPSF { %def
/b4_Inc_state save def         % Save state for cleanup
/dict_count countdictstack def % Count objects on dict stack
/op_count count 1 sub def      % Count objects on operand stack
userdict begin                 % Push userdict on dict stack
/showpage { } def              % Redefine showpage, { } = null proc
0 setgray 0 setlinecap         % Prepare graphics state
1 setlinewidth 0 setlinejoin
10 setmiterlimit [ ] 0 setdash newpath
/languagelevel where           % If level not equal to 1 then
{pop languagelevel             % set strokeadjust and
1 ne                           % overprint to their defaults.
{false setstrokeadjust false setoverprint
} if
} if
} bd
/EndEPSF { %def
count op_count sub {pop} repeat            % Clean up stacks
countdictstack dict_count sub {end} repeat
b4_Inc_state restore
} bd
%%EndResource
%FOPBeginFontDict
%%IncludeResource: font Courier-Oblique
%%IncludeResource: font Courier-BoldOblique
%%IncludeResource: font Courier-Bold
%%IncludeResource: font ZapfDingbats
%%IncludeResource: font Symbol
%%IncludeResource: font Helvetica
%%IncludeResource: font Helvetica-Oblique
%%IncludeResource: font Helvetica-Bold
%%IncludeResource: font Helvetica-BoldOblique
%%IncludeResource: font Times-Roman
%%IncludeResource: font Times-Italic
%%IncludeResource: font Times-Bold
%%IncludeResource: font Times-BoldItalic
%%IncludeResource: font Courier
%FOPEndFontDict
%%BeginResource: encoding WinAnsiEncoding
/WinAnsiEncoding [
/.notdef /.notdef /.notdef /.notdef /.notdef
/.notdef /.notdef /.notdef /.notdef /.notdef
/.notdef /.notdef /.notdef /.notdef /.notdef
/.notdef /.notdef /.notdef /.notdef /.notdef
/.notdef /.notdef /.notdef /.notdef /.notdef
/.notdef /.notdef /.notdef /.notdef /.notdef
/.notdef /.notdef /space /exclam /quotedbl
/numbersign /dollar /percent /ampersand /quotesingle
/parenleft /parenright /asterisk /plus /comma
/hyphen /period /slash /zero /one
/two /three /four /five /six
/seven /eight /nine /colon /semicolon
/less /equal /greater /question /at
/A /B /C /D /E
/F /G /H /I /J
/K /L /M /N /O
/P /Q /R /S /T
/U /V /W /X /Y
/Z /bracketleft /backslash /bracketright /asciicircum
/underscore /quoteleft /a /b /c
/d /e /f /g /h
/i /j /k /l /m
/n /o /p /q /r
/s /t /u /v /w
/x /y /z /braceleft /bar
/braceright /asciitilde /bullet /Euro /bullet
/quotesinglbase /florin /quotedblbase /ellipsis /dagger
/daggerdbl /circumflex /perthousand /Scaron /guilsinglleft
/OE /bullet /Zcaron /bullet /bullet
/quoteleft /quoteright /quotedblleft /quotedblright /bullet
/endash /emdash /asciitilde /trademark /scaron
/guilsinglright /oe /bullet /zcaron /Ydieresis
/space /exclamdown /cent /sterling /currency
/yen /brokenbar /section /dieresis /copyright
/ordfeminine /guillemotleft /logicalnot /sfthyphen /registered
/macron /degree /plusminus /twosuperior /threesuperior
/acute /mu /paragraph /middot /cedilla
/onesuperior /ordmasculine /guillemotright /onequarter /onehalf
/threequarters /questiondown /Agrave /Aacute /Acircumflex
/Atilde /Adieresis /Aring /AE /Ccedilla
/Egrave /Eacute /Ecircumflex /Edieresis /Igrave
/Iacute /Icircumflex /Idieresis /Eth /Ntilde
/Ograve /Oacute /Ocircumflex /Otilde /Odieresis
/multiply /Oslash /Ugrave /Uacute /Ucircumflex
/Udieresis /Yacute /Thorn /germandbls /agrave
/aacute /acircumflex /atilde /adieresis /aring
/ae /ccedilla /egrave /eacute /ecircumflex
/edieresis /igrave /iacute /icircumflex /idieresis
/eth /ntilde /ograve /oacute /ocircumflex
/otilde /odieresis /divide /oslash /ugrave
/uacute /ucircumflex /udieresis /yacute /thorn
/ydieresis
] def
%%EndResource
%FOPBeginFontReencode
/Courier-Oblique findfont
dup length dict begin
  {1 index /FID ne {def} {pop pop} ifelse} forall
  /Encoding WinAnsiEncoding def
  currentdict
end
/Courier-Oblique exch definefont pop
/Courier-BoldOblique findfont
dup length dict begin
  {1 index /FID ne {def} {pop pop} ifelse} forall
  /Encoding WinAnsiEncoding def
  currentdict
end
/Courier-BoldOblique exch definefont pop
/Courier-Bold findfont
dup length dict begin
  {1 index /FID ne {def} {pop pop} ifelse} forall
  /Encoding WinAnsiEncoding def
  currentdict
end
/Courier-Bold exch definefont pop
/Helvetica findfont
dup length dict begin
  {1 index /FID ne {def} {pop pop} ifelse} forall
  /Encoding WinAnsiEncoding def
  currentdict
end
/Helvetica exch definefont pop
/Helvetica-Oblique findfont
dup length dict begin
  {1 index /FID ne {def} {pop pop} ifelse} forall
  /Encoding WinAnsiEncoding def
  currentdict
end
/Helvetica-Oblique exch definefont pop
/Helvetica-Bold findfont
dup length dict begin
  {1 index /FID ne {def} {pop pop} ifelse} forall
  /Encoding WinAnsiEncoding def
  currentdict
end
/Helvetica-Bold exch definefont pop
/Helvetica-BoldOblique findfont
dup length dict begin
  {1 index /FID ne {def} {pop pop} ifelse} forall
  /Encoding WinAnsiEncoding def
  currentdict
end
/Helvetica-BoldOblique exch definefont pop
/Times-Roman findfont
dup length dict begin
  {1 index /FID ne {def} {pop pop} ifelse} forall
  /Encoding WinAnsiEncoding def
  currentdict
end
/Times-Roman exch definefont pop
/Times-Italic findfont
dup length dict begin
  {1 index /FID ne {def} {pop pop} ifelse} forall
  /Encoding WinAnsiEncoding def
  currentdict
end
/Times-Italic exch definefont pop
/Times-Bold findfont
dup length dict begin
  {1 index /FID ne {def} {pop pop} ifelse} forall
  /Encoding WinAnsiEncoding def
  currentdict
end
/Times-Bold exch definefont pop
/Times-BoldItalic findfont
dup length dict begin
  {1 index /FID ne {def} {pop pop} ifelse} forall
  /Encoding WinAnsiEncoding def
  currentdict
end
/Times-BoldItalic exch definefont pop
/Courier findfont
dup length dict begin
  {1 index /FID ne {def} {pop pop} ifelse} forall
  /Encoding WinAnsiEncoding def
  currentdict
end
/Courier exch definefont pop
%FOPEndFontReencode
%%EndProlog
%%Page: 1 1
%%PageBoundingBox: 0 0 428 428
%%BeginPageSetup
[1 0 0 -1 0 428] CT
%%EndPageSetup
GS
[0.71287 0 0 0.71287 0 0.27722] CT
1 GC
N
0 0 600 600 re
f
GR
GS
[0.71287 0 0 0.71287 0 0.27722] CT
1 GC
N
0 0 600 600 re
f
GR
GS
[0.71287 0 0 0.71287 0 0.27722] CT
1 GC
N
78 562 M
600 562 L
600 0 L
78 0 L
cp
f
GR
GS
[0.71287 0 0 0.71287 0 0.27722] CT
0.873 GC
1 LJ
0.701 LW
N
165 562 M
165 0 L
S
GR
GS
[0.71287 0 0 0.71287 0 0.27722] CT
0.873 GC
1 LJ
0.701 LW
N
339 562 M
339 0 L
S
GR
GS
[0.71287 0 0 0.71287 0 0.27722] CT
0.873 GC
1 LJ
0.701 LW
N
513 562 M
513 0 L
S
GR
GS
[0.71287 0 0 0.71287 0 0.27722] CT
0.873 GC
1 LJ
0.701 LW
N
600 536.455 M
78 536.455 L
S
GR
GS
[0.71287 0 0 0.71287 0 0.27722] CT
0.873 GC
1 LJ
0.701 LW
N
600 472.466 M
78 472.466 L
S
GR
GS
[0.71287 0 0 0.71287 0 0.27722] CT
0.873 GC
1 LJ
0.701 LW
N
600 408.478 M
78 408.478 L
S
GR
GS
[0.71287 0 0 0.71287 0 0.27722] CT
0.873 GC
1 LJ
0.701 LW
N
600 344.49 M
78 344.49 L
S
GR
GS
[0.71287 0 0 0.71287 0 0.27722] CT
0.873 GC
1 LJ
0.701 LW
N
600 280.502 M
78 280.502 L
S
GR
GS
[0.71287 0 0 0.71287 0 0.27722] CT
0.873 GC
1 LJ
0.701 LW
N
600 216.514 M
78 216.514 L
S
GR
GS
[0.71287 0 0 0.71287 0 0.27722] CT
0.873 GC
1 LJ
0.701 LW
N
600 152.526 M
78 152.526 L
S
GR
GS
[0.71287 0 0 0.71287 0 0.27722] CT
0.873 GC
1 LJ
0.701 LW
N
600 88.538 M
78 88.538 L
S
GR
GS
[0.71287 0 0 0.71287 0 0.27722] CT
0.873 GC
1 LJ
0.701 LW
N
600 24.55 M
78 24.55 L
S
GR
GS
[0.71287 0 0 0.71287 0 0.27722] CT
0.149 GC
2 setlinecap
1 LJ
0.701 LW
N
78 562 M
600 562 L
S
GR
GS
[0.71287 0 0 0.71287 0 0.27722] CT
0.149 GC
2 setlinecap
1 LJ
0.701 LW
N
78 0 M
600 0 L
S
GR
GS
[0.71287 0 0 0.71287 0 0.27722] CT
0.149 GC
2 setlinecap
1 LJ
0.701 LW
N
165 562 M
165 556.38 L
S
GR
GS
[0.71287 0 0 0.71287 0 0.27722] CT
0.149 GC
2 setlinecap
1 LJ
0.701 LW
N
339 562 M
339 556.38 L
S
GR
GS
[0.71287 0 0 0.71287 0 0.27722] CT
0.149 GC
2 setlinecap
1 LJ
0.701 LW
N
513 562 M
513 556.38 L
S
GR
GS
[0.71287 0 0 0.71287 0 0.27722] CT
0.149 GC
2 setlinecap
1 LJ
0.701 LW
N
165 0 M
165 5.62 L
S
GR
GS
[0.71287 0 0 0.71287 0 0.27722] CT
0.149 GC
2 setlinecap
1 LJ
0.701 LW
N
339 0 M
339 5.62 L
S
GR
GS
[0.71287 0 0 0.71287 0 0.27722] CT
0.149 GC
2 setlinecap
1 LJ
0.701 LW
N
513 0 M
513 5.62 L
S
GR
GS
[0.71287 0 0 0.71287 117.62376 406.51087] CT
0.149 GC
N
-25.135 21.21 M
-25.135 20.335 L
-22.432 20.335 -22.432 19.538 QT
-22.432 5.804 L
-22.432 5.007 -25.135 5.007 QT
-25.135 4.132 L
-17.401 4.132 L
-17.401 5.007 L
-20.104 5.007 -20.104 5.804 QT
-20.104 19.538 L
-20.104 20.335 -17.401 20.335 QT
-17.401 21.21 L
-25.135 21.21 L
cp
f
GR
GS
[0.71287 0 0 0.71287 117.62376 406.51087] CT
0.149 GC
N
-15.83 21.21 M
-15.83 20.335 L
-13.252 20.335 -13.252 19.538 QT
-13.252 5.804 L
-13.252 5.007 -15.83 5.007 QT
-15.83 4.132 L
-6.611 4.132 L
-4.908 4.132 -3.486 4.874 QT
-2.064 5.616 -1.064 6.843 QT
-0.064 8.069 0.475 9.632 QT
1.014 11.194 1.014 12.835 QT
1.014 14.429 0.467 15.921 QT
-0.08 17.413 -1.111 18.616 QT
-2.142 19.819 -3.556 20.515 QT
-4.971 21.21 -6.611 21.21 QT
-15.83 21.21 L
cp
-11.002 19.538 M
-11.002 20.069 -10.697 20.202 QT
-10.392 20.335 -9.736 20.335 QT
-7.252 20.335 L
-5.971 20.335 -4.822 19.78 QT
-3.674 19.226 -2.908 18.226 QT
-2.127 17.179 -1.853 15.882 QT
-1.58 14.585 -1.58 12.835 QT
-1.58 11.022 -1.853 9.655 QT
-2.127 8.288 -2.908 7.21 QT
-3.658 6.147 -4.806 5.577 QT
-5.955 5.007 -7.252 5.007 QT
-9.736 5.007 L
-10.189 5.007 -10.439 5.046 QT
-10.689 5.085 -10.846 5.265 QT
-11.002 5.444 -11.002 5.804 QT
-11.002 19.538 L
cp
f
GR
GS
[0.71287 0 0 0.71287 117.62376 406.51087] CT
0.149 GC
N
3.505 21.21 M
3.505 20.335 L
6.083 20.335 6.083 18.851 QT
6.083 5.804 L
6.083 5.007 3.505 5.007 QT
3.505 4.132 L
8.24 4.132 L
8.536 4.132 8.63 4.413 QT
14.083 18.554 L
19.521 4.413 L
19.63 4.132 19.927 4.132 QT
24.646 4.132 L
24.646 5.007 L
22.083 5.007 22.083 5.804 QT
22.083 19.538 L
22.083 20.335 24.646 20.335 QT
24.646 21.21 L
17.38 21.21 L
17.38 20.335 L
19.958 20.335 19.958 19.538 QT
19.958 4.991 L
13.802 20.929 L
13.693 21.21 13.38 21.21 QT
13.068 21.21 12.958 20.929 QT
6.88 5.179 L
6.88 18.851 L
6.88 20.335 9.458 20.335 QT
9.458 21.21 L
3.505 21.21 L
cp
f
GR
GS
[0.71287 0 0 0.71287 241.66337 406.51087] CT
0.149 GC
N
-30.045 21.21 M
-30.045 20.335 L
-27.342 20.335 -27.342 19.538 QT
-27.342 5.804 L
-27.342 5.007 -30.045 5.007 QT
-30.045 4.132 L
-22.311 4.132 L
-22.311 5.007 L
-25.014 5.007 -25.014 5.804 QT
-25.014 19.538 L
-25.014 20.335 -22.311 20.335 QT
-22.311 21.21 L
-30.045 21.21 L
cp
f
GR
GS
[0.71287 0 0 0.71287 241.66337 406.51087] CT
0.149 GC
N
-20.226 21.21 M
-20.226 20.335 L
-17.523 20.335 -17.523 19.538 QT
-17.523 5.804 L
-17.523 5.007 -20.226 5.007 QT
-20.226 4.132 L
-12.491 4.132 L
-12.491 5.007 L
-15.194 5.007 -15.194 5.804 QT
-15.194 19.538 L
-15.194 20.335 -12.491 20.335 QT
-12.491 21.21 L
-20.226 21.21 L
cp
f
GR
GS
[0.71287 0 0 0.71287 241.66337 406.51087] CT
0.149 GC
N
-10.92 21.21 M
-10.92 20.335 L
-8.342 20.335 -8.342 19.538 QT
-8.342 5.804 L
-8.342 5.007 -10.92 5.007 QT
-10.92 4.132 L
-1.701 4.132 L
0.002 4.132 1.424 4.874 QT
2.845 5.616 3.845 6.843 QT
4.845 8.069 5.385 9.632 QT
5.924 11.194 5.924 12.835 QT
5.924 14.429 5.377 15.921 QT
4.83 17.413 3.799 18.616 QT
2.767 19.819 1.353 20.515 QT
-0.061 21.21 -1.701 21.21 QT
-10.92 21.21 L
cp
-6.092 19.538 M
-6.092 20.069 -5.787 20.202 QT
-5.483 20.335 -4.826 20.335 QT
-2.342 20.335 L
-1.061 20.335 0.088 19.78 QT
1.236 19.226 2.002 18.226 QT
2.783 17.179 3.056 15.882 QT
3.33 14.585 3.33 12.835 QT
3.33 11.022 3.056 9.655 QT
2.783 8.288 2.002 7.21 QT
1.252 6.147 0.103 5.577 QT
-1.045 5.007 -2.342 5.007 QT
-4.826 5.007 L
-5.28 5.007 -5.53 5.046 QT
-5.78 5.085 -5.936 5.265 QT
-6.092 5.444 -6.092 5.804 QT
-6.092 19.538 L
cp
f
GR
GS
[0.71287 0 0 0.71287 241.66337 406.51087] CT
0.149 GC
N
8.415 21.21 M
8.415 20.335 L
10.993 20.335 10.993 18.851 QT
10.993 5.804 L
10.993 5.007 8.415 5.007 QT
8.415 4.132 L
13.149 4.132 L
13.446 4.132 13.54 4.413 QT
18.993 18.554 L
24.431 4.413 L
24.54 4.132 24.837 4.132 QT
29.556 4.132 L
29.556 5.007 L
26.993 5.007 26.993 5.804 QT
26.993 19.538 L
26.993 20.335 29.556 20.335 QT
29.556 21.21 L
22.29 21.21 L
22.29 20.335 L
24.868 20.335 24.868 19.538 QT
24.868 4.991 L
18.712 20.929 L
18.602 21.21 18.29 21.21 QT
17.977 21.21 17.868 20.929 QT
11.79 5.179 L
11.79 18.851 L
11.79 20.335 14.368 20.335 QT
14.368 21.21 L
8.415 21.21 L
cp
f
GR
GS
[0.71287 0 0 0.71287 365.70298 406.51087] CT
0.149 GC
N
-38.162 21.21 M
-38.162 20.335 L
-35.583 20.335 -35.583 19.538 QT
-35.583 5.804 L
-35.583 5.007 -38.162 5.007 QT
-38.162 4.132 L
-30.052 4.132 L
-30.052 5.007 L
-33.255 5.007 -33.255 5.804 QT
-33.255 19.538 L
-33.255 20.069 -32.951 20.202 QT
-32.646 20.335 -31.974 20.335 QT
-30.052 20.335 L
-28.177 20.335 -27.169 19.647 QT
-26.162 18.96 -25.74 17.78 QT
-25.318 16.601 -25.099 14.647 QT
-24.38 14.647 L
-25.068 21.21 L
-38.162 21.21 L
cp
f
GR
GS
[0.71287 0 0 0.71287 365.70298 406.51087] CT
0.149 GC
N
-13.412 21.757 M
-15.802 21.757 -17.701 20.491 QT
-19.599 19.226 -20.669 17.132 QT
-21.74 15.038 -21.74 12.741 QT
-21.74 11.022 -21.122 9.351 QT
-20.505 7.679 -19.404 6.39 QT
-18.302 5.101 -16.747 4.343 QT
-15.193 3.585 -13.412 3.585 QT
-11.646 3.585 -10.091 4.351 QT
-8.537 5.116 -7.427 6.421 QT
-6.318 7.726 -5.716 9.351 QT
-5.115 10.976 -5.115 12.741 QT
-5.115 14.46 -5.716 16.093 QT
-6.318 17.726 -7.474 19.022 QT
-8.63 20.319 -10.177 21.038 QT
-9.693 22.147 -9.193 22.765 QT
-8.693 23.382 -7.802 23.382 QT
-6.865 23.382 -6.193 22.733 QT
-5.521 22.085 -5.521 21.163 QT
-5.521 21.069 -5.427 20.999 QT
-5.333 20.929 -5.255 20.929 QT
-4.974 20.929 -4.974 21.257 QT
-4.974 23.054 -5.677 24.554 QT
-6.38 26.054 -7.974 26.054 QT
-8.849 26.054 -9.427 25.624 QT
-10.005 25.194 -10.302 24.53 QT
-10.599 23.866 -10.771 22.983 QT
-10.943 22.101 -11.068 21.382 QT
-12.177 21.757 -13.412 21.757 QT
cp
-13.412 21.038 M
-12.287 21.038 -11.24 20.46 QT
-11.474 19.397 -11.958 18.757 QT
-12.443 18.116 -13.412 18.116 QT
-14.021 18.116 -14.435 18.561 QT
-14.849 19.007 -14.849 19.585 QT
-14.849 20.226 -14.451 20.632 QT
-14.052 21.038 -13.412 21.038 QT
cp
-15.49 19.585 M
-15.49 19.038 -15.224 18.546 QT
-14.958 18.054 -14.474 17.757 QT
-13.99 17.46 -13.412 17.46 QT
-12.333 17.46 -11.701 18.163 QT
-11.068 18.866 -10.568 20.069 QT
-9.74 19.444 -9.177 18.593 QT
-8.615 17.741 -8.302 16.811 QT
-7.99 15.882 -7.849 14.835 QT
-7.708 13.788 -7.708 12.741 QT
-7.708 11.007 -8.06 9.483 QT
-8.412 7.96 -9.24 6.726 QT
-9.958 5.647 -11.068 4.983 QT
-12.177 4.319 -13.412 4.319 QT
-14.677 4.319 -15.779 4.968 QT
-16.88 5.616 -17.615 6.726 QT
-18.474 7.976 -18.81 9.499 QT
-19.146 11.022 -19.146 12.741 QT
-19.146 15.397 -18.24 17.577 QT
-17.333 19.757 -15.224 20.663 QT
-15.49 20.147 -15.49 19.585 QT
cp
f
GR
GS
[0.71287 0 0 0.71287 365.70298 406.51087] CT
0.149 GC
N
-2.679 21.21 M
-2.679 20.335 L
-0.101 20.335 -0.101 19.538 QT
-0.101 5.804 L
-0.101 5.007 -2.679 5.007 QT
-2.679 4.132 L
6.54 4.132 L
8.243 4.132 9.665 4.874 QT
11.087 5.616 12.087 6.843 QT
13.087 8.069 13.626 9.632 QT
14.165 11.194 14.165 12.835 QT
14.165 14.429 13.618 15.921 QT
13.071 17.413 12.04 18.616 QT
11.009 19.819 9.595 20.515 QT
8.181 21.21 6.54 21.21 QT
-2.679 21.21 L
cp
2.149 19.538 M
2.149 20.069 2.454 20.202 QT
2.759 20.335 3.415 20.335 QT
5.899 20.335 L
7.181 20.335 8.329 19.78 QT
9.477 19.226 10.243 18.226 QT
11.024 17.179 11.298 15.882 QT
11.571 14.585 11.571 12.835 QT
11.571 11.022 11.298 9.655 QT
11.024 8.288 10.243 7.21 QT
9.493 6.147 8.345 5.577 QT
7.196 5.007 5.899 5.007 QT
3.415 5.007 L
2.962 5.007 2.712 5.046 QT
2.462 5.085 2.306 5.265 QT
2.149 5.444 2.149 5.804 QT
2.149 19.538 L
cp
f
GR
GS
[0.71287 0 0 0.71287 365.70298 406.51087] CT
0.149 GC
N
16.656 21.21 M
16.656 20.335 L
19.234 20.335 19.234 18.851 QT
19.234 5.804 L
19.234 5.007 16.656 5.007 QT
16.656 4.132 L
21.391 4.132 L
21.688 4.132 21.781 4.413 QT
27.234 18.554 L
32.672 4.413 L
32.781 4.132 33.078 4.132 QT
37.797 4.132 L
37.797 5.007 L
35.234 5.007 35.234 5.804 QT
35.234 19.538 L
35.234 20.335 37.797 20.335 QT
37.797 21.21 L
30.531 21.21 L
30.531 20.335 L
33.109 20.335 33.109 19.538 QT
33.109 4.991 L
26.953 20.929 L
26.844 21.21 26.531 21.21 QT
26.219 21.21 26.109 20.929 QT
20.031 5.179 L
20.031 18.851 L
20.031 20.335 22.609 20.335 QT
22.609 21.21 L
16.656 21.21 L
cp
f
GR
GS
[0.71287 0 0 0.71287 0 0.27722] CT
0.149 GC
2 setlinecap
1 LJ
0.701 LW
N
78 562 M
78 0 L
S
GR
GS
[0.71287 0 0 0.71287 0 0.27722] CT
0.149 GC
2 setlinecap
1 LJ
0.701 LW
N
600 562 M
600 0 L
S
GR
GS
[0.71287 0 0 0.71287 0 0.27722] CT
0.149 GC
2 setlinecap
1 LJ
0.701 LW
N
78 536.455 M
83.62 536.455 L
S
GR
GS
[0.71287 0 0 0.71287 0 0.27722] CT
0.149 GC
2 setlinecap
1 LJ
0.701 LW
N
78 472.466 M
83.62 472.466 L
S
GR
GS
[0.71287 0 0 0.71287 0 0.27722] CT
0.149 GC
2 setlinecap
1 LJ
0.701 LW
N
78 408.478 M
83.62 408.478 L
S
GR
GS
[0.71287 0 0 0.71287 0 0.27722] CT
0.149 GC
2 setlinecap
1 LJ
0.701 LW
N
78 344.49 M
83.62 344.49 L
S
GR
GS
[0.71287 0 0 0.71287 0 0.27722] CT
0.149 GC
2 setlinecap
1 LJ
0.701 LW
N
78 280.502 M
83.62 280.502 L
S
GR
GS
[0.71287 0 0 0.71287 0 0.27722] CT
0.149 GC
2 setlinecap
1 LJ
0.701 LW
N
78 216.514 M
83.62 216.514 L
S
GR
GS
[0.71287 0 0 0.71287 0 0.27722] CT
0.149 GC
2 setlinecap
1 LJ
0.701 LW
N
78 152.526 M
83.62 152.526 L
S
GR
GS
[0.71287 0 0 0.71287 0 0.27722] CT
0.149 GC
2 setlinecap
1 LJ
0.701 LW
N
78 88.538 M
83.62 88.538 L
S
GR
GS
[0.71287 0 0 0.71287 0 0.27722] CT
0.149 GC
2 setlinecap
1 LJ
0.701 LW
N
78 24.55 M
83.62 24.55 L
S
GR
GS
[0.71287 0 0 0.71287 0 0.27722] CT
0.149 GC
2 setlinecap
1 LJ
0.701 LW
N
600 536.455 M
594.38 536.455 L
S
GR
GS
[0.71287 0 0 0.71287 0 0.27722] CT
0.149 GC
2 setlinecap
1 LJ
0.701 LW
N
600 472.466 M
594.38 472.466 L
S
GR
GS
[0.71287 0 0 0.71287 0 0.27722] CT
0.149 GC
2 setlinecap
1 LJ
0.701 LW
N
600 408.478 M
594.38 408.478 L
S
GR
GS
[0.71287 0 0 0.71287 0 0.27722] CT
0.149 GC
2 setlinecap
1 LJ
0.701 LW
N
600 344.49 M
594.38 344.49 L
S
GR
GS
[0.71287 0 0 0.71287 0 0.27722] CT
0.149 GC
2 setlinecap
1 LJ
0.701 LW
N
600 280.502 M
594.38 280.502 L
S
GR
GS
[0.71287 0 0 0.71287 0 0.27722] CT
0.149 GC
2 setlinecap
1 LJ
0.701 LW
N
600 216.514 M
594.38 216.514 L
S
GR
GS
[0.71287 0 0 0.71287 0 0.27722] CT
0.149 GC
2 setlinecap
1 LJ
0.701 LW
N
600 152.526 M
594.38 152.526 L
S
GR
GS
[0.71287 0 0 0.71287 0 0.27722] CT
0.149 GC
2 setlinecap
1 LJ
0.701 LW
N
600 88.538 M
594.38 88.538 L
S
GR
GS
[0.71287 0 0 0.71287 0 0.27722] CT
0.149 GC
2 setlinecap
1 LJ
0.701 LW
N
600 24.55 M
594.38 24.55 L
S
GR
GS
[0.71287 0 0 0.71287 50.00396 382.70026] CT
0.149 GC
N
-6.375 6.607 M
-9.438 6.607 -10.539 4.083 QT
-11.641 1.56 -11.641 -1.909 QT
-11.641 -4.081 -11.25 -6.003 QT
-10.859 -7.924 -9.68 -9.26 QT
-8.5 -10.596 -6.375 -10.596 QT
-4.734 -10.596 -3.68 -9.792 QT
-2.625 -8.987 -2.078 -7.706 QT
-1.531 -6.424 -1.328 -4.971 QT
-1.125 -3.518 -1.125 -1.909 QT
-1.125 0.232 -1.523 2.107 QT
-1.922 3.982 -3.078 5.294 QT
-4.234 6.607 -6.375 6.607 QT
cp
-6.375 5.966 M
-4.984 5.966 -4.297 4.536 QT
-3.609 3.107 -3.453 1.372 QT
-3.297 -0.362 -3.297 -2.315 QT
-3.297 -4.19 -3.453 -5.776 QT
-3.609 -7.362 -4.289 -8.651 QT
-4.969 -9.94 -6.375 -9.94 QT
-7.797 -9.94 -8.477 -8.651 QT
-9.156 -7.362 -9.313 -5.776 QT
-9.469 -4.19 -9.469 -2.315 QT
-9.469 -0.924 -9.406 0.31 QT
-9.344 1.544 -9.047 2.857 QT
-8.75 4.169 -8.102 5.068 QT
-7.453 5.966 -6.375 5.966 QT
cp
f
GR
GS
[0.71287 0 0 0.71287 50.00396 337.085] CT
0.149 GC
N
-26.014 6.607 M
-29.076 6.607 -30.178 4.083 QT
-31.28 1.56 -31.28 -1.909 QT
-31.28 -4.081 -30.889 -6.003 QT
-30.498 -7.924 -29.319 -9.26 QT
-28.139 -10.596 -26.014 -10.596 QT
-24.373 -10.596 -23.319 -9.792 QT
-22.264 -8.987 -21.717 -7.706 QT
-21.17 -6.424 -20.967 -4.971 QT
-20.764 -3.518 -20.764 -1.909 QT
-20.764 0.232 -21.162 2.107 QT
-21.561 3.982 -22.717 5.294 QT
-23.873 6.607 -26.014 6.607 QT
cp
-26.014 5.966 M
-24.623 5.966 -23.936 4.536 QT
-23.248 3.107 -23.092 1.372 QT
-22.936 -0.362 -22.936 -2.315 QT
-22.936 -4.19 -23.092 -5.776 QT
-23.248 -7.362 -23.928 -8.651 QT
-24.608 -9.94 -26.014 -9.94 QT
-27.436 -9.94 -28.116 -8.651 QT
-28.795 -7.362 -28.951 -5.776 QT
-29.108 -4.19 -29.108 -2.315 QT
-29.108 -0.924 -29.045 0.31 QT
-28.983 1.544 -28.686 2.857 QT
-28.389 4.169 -27.741 5.068 QT
-27.092 5.966 -26.014 5.966 QT
cp
f
GR
GS
[0.71287 0 0 0.71287 50.00396 337.085] CT
0.149 GC
N
-17.545 4.685 M
-17.545 4.122 -17.123 3.716 QT
-16.701 3.31 -16.155 3.31 QT
-15.811 3.31 -15.483 3.497 QT
-15.155 3.685 -14.975 4.013 QT
-14.795 4.341 -14.795 4.685 QT
-14.795 5.232 -15.194 5.646 QT
-15.592 6.06 -16.155 6.06 QT
-16.701 6.06 -17.123 5.646 QT
-17.545 5.232 -17.545 4.685 QT
cp
f
GR
GS
[0.71287 0 0 0.71287 50.00396 337.085] CT
0.149 GC
N
-10.453 3.216 M
-10.203 3.951 -9.672 4.544 QT
-9.141 5.138 -8.414 5.474 QT
-7.688 5.81 -6.906 5.81 QT
-5.094 5.81 -4.406 4.411 QT
-3.719 3.013 -3.719 1.013 QT
-3.719 0.138 -3.75 -0.456 QT
-3.781 -1.049 -3.922 -1.596 QT
-4.156 -2.471 -4.734 -3.128 QT
-5.313 -3.784 -6.156 -3.784 QT
-7 -3.784 -7.602 -3.534 QT
-8.203 -3.284 -8.586 -2.94 QT
-8.969 -2.596 -9.258 -2.214 QT
-9.547 -1.831 -9.625 -1.815 QT
-9.906 -1.815 L
-9.969 -1.815 -10.055 -1.893 QT
-10.141 -1.971 -10.141 -2.049 QT
-10.141 -10.393 L
-10.141 -10.456 -10.063 -10.526 QT
-9.984 -10.596 -9.906 -10.596 QT
-9.828 -10.596 L
-8.141 -9.784 -6.25 -9.784 QT
-4.391 -9.784 -2.672 -10.596 QT
-2.609 -10.596 L
-2.516 -10.596 -2.445 -10.534 QT
-2.375 -10.471 -2.375 -10.393 QT
-2.375 -10.159 L
-2.375 -10.034 -2.422 -10.034 QT
-3.281 -8.909 -4.563 -8.276 QT
-5.844 -7.643 -7.234 -7.643 QT
-8.234 -7.643 -9.281 -7.924 QT
-9.281 -3.19 L
-8.453 -3.862 -7.797 -4.151 QT
-7.141 -4.44 -6.125 -4.44 QT
-4.75 -4.44 -3.656 -3.643 QT
-2.563 -2.846 -1.977 -1.573 QT
-1.391 -0.299 -1.391 1.029 QT
-1.391 2.529 -2.133 3.81 QT
-2.875 5.091 -4.141 5.849 QT
-5.406 6.607 -6.906 6.607 QT
-8.125 6.607 -9.164 5.974 QT
-10.203 5.341 -10.789 4.263 QT
-11.375 3.185 -11.375 1.982 QT
-11.375 1.419 -11.008 1.068 QT
-10.641 0.716 -10.094 0.716 QT
-9.547 0.716 -9.172 1.076 QT
-8.797 1.435 -8.797 1.982 QT
-8.797 2.513 -9.172 2.888 QT
-9.547 3.263 -10.094 3.263 QT
-10.188 3.263 -10.297 3.247 QT
-10.406 3.232 -10.453 3.216 QT
cp
f
GR
GS
[0.71287 0 0 0.71287 50.00396 291.46972] CT
0.149 GC
N
-10.313 6.06 M
-10.313 5.185 L
-7.188 5.185 -7.188 4.388 QT
-7.188 -8.737 L
-8.469 -8.112 -10.453 -8.112 QT
-10.453 -8.987 L
-7.391 -8.987 -5.828 -10.596 QT
-5.469 -10.596 L
-5.391 -10.596 -5.313 -10.526 QT
-5.234 -10.456 -5.234 -10.378 QT
-5.234 4.388 L
-5.234 5.185 -2.109 5.185 QT
-2.109 6.06 L
-10.313 6.06 L
cp
f
GR
GS
[0.71287 0 0 0.71287 50.00396 245.85447] CT
0.149 GC
N
-29.951 6.06 M
-29.951 5.185 L
-26.826 5.185 -26.826 4.388 QT
-26.826 -8.737 L
-28.108 -8.112 -30.092 -8.112 QT
-30.092 -8.987 L
-27.03 -8.987 -25.467 -10.596 QT
-25.108 -10.596 L
-25.03 -10.596 -24.951 -10.526 QT
-24.873 -10.456 -24.873 -10.378 QT
-24.873 4.388 L
-24.873 5.185 -21.748 5.185 QT
-21.748 6.06 L
-29.951 6.06 L
cp
f
GR
GS
[0.71287 0 0 0.71287 50.00396 245.85447] CT
0.149 GC
N
/f2068087083{-17.545 4.685 M
-17.545 4.122 -17.123 3.716 QT
-16.701 3.31 -16.155 3.31 QT
-15.811 3.31 -15.483 3.497 QT
-15.155 3.685 -14.975 4.013 QT
-14.795 4.341 -14.795 4.685 QT
-14.795 5.232 -15.194 5.646 QT
-15.592 6.06 -16.155 6.06 QT
-16.701 6.06 -17.123 5.646 QT
-17.545 5.232 -17.545 4.685 QT
cp}def
f2068087083
f
GR
GS
[0.71287 0 0 0.71287 50.00396 245.85447] CT
0.149 GC
N
/f1480815407{-10.453 3.216 M
-10.203 3.951 -9.672 4.544 QT
-9.141 5.138 -8.414 5.474 QT
-7.688 5.81 -6.906 5.81 QT
-5.094 5.81 -4.406 4.411 QT
-3.719 3.013 -3.719 1.013 QT
-3.719 0.138 -3.75 -0.456 QT
-3.781 -1.049 -3.922 -1.596 QT
-4.156 -2.471 -4.734 -3.128 QT
-5.313 -3.784 -6.156 -3.784 QT
-7 -3.784 -7.602 -3.534 QT
-8.203 -3.284 -8.586 -2.94 QT
-8.969 -2.596 -9.258 -2.214 QT
-9.547 -1.831 -9.625 -1.815 QT
-9.906 -1.815 L
-9.969 -1.815 -10.055 -1.893 QT
-10.141 -1.971 -10.141 -2.049 QT
-10.141 -10.393 L
-10.141 -10.456 -10.063 -10.526 QT
-9.984 -10.596 -9.906 -10.596 QT
-9.828 -10.596 L
-8.141 -9.784 -6.25 -9.784 QT
-4.391 -9.784 -2.672 -10.596 QT
-2.609 -10.596 L
-2.516 -10.596 -2.445 -10.534 QT
-2.375 -10.471 -2.375 -10.393 QT
-2.375 -10.159 L
-2.375 -10.034 -2.422 -10.034 QT
-3.281 -8.909 -4.563 -8.276 QT
-5.844 -7.643 -7.234 -7.643 QT
-8.234 -7.643 -9.281 -7.924 QT
-9.281 -3.19 L
-8.453 -3.862 -7.797 -4.151 QT
-7.141 -4.44 -6.125 -4.44 QT
-4.75 -4.44 -3.656 -3.643 QT
-2.563 -2.846 -1.977 -1.573 QT
-1.391 -0.299 -1.391 1.029 QT
-1.391 2.529 -2.133 3.81 QT
-2.875 5.091 -4.141 5.849 QT
-5.406 6.607 -6.906 6.607 QT
-8.125 6.607 -9.164 5.974 QT
-10.203 5.341 -10.789 4.263 QT
-11.375 3.185 -11.375 1.982 QT
-11.375 1.419 -11.008 1.068 QT
-10.641 0.716 -10.094 0.716 QT
-9.547 0.716 -9.172 1.076 QT
-8.797 1.435 -8.797 1.982 QT
-8.797 2.513 -9.172 2.888 QT
-9.547 3.263 -10.094 3.263 QT
-10.188 3.263 -10.297 3.247 QT
-10.406 3.232 -10.453 3.216 QT
cp}def
f1480815407
f
GR
GS
[0.71287 0 0 0.71287 50.00396 200.23919] CT
0.149 GC
N
/f763923613{-11.375 6.06 M
-11.375 5.388 L
-11.375 5.326 -11.328 5.247 QT
-7.453 0.951 L
-6.563 -0.003 -6.016 -0.643 QT
-5.469 -1.284 -4.93 -2.128 QT
-4.391 -2.971 -4.086 -3.846 QT
-3.781 -4.721 -3.781 -5.69 QT
-3.781 -6.721 -4.156 -7.659 QT
-4.531 -8.596 -5.281 -9.151 QT
-6.031 -9.706 -7.094 -9.706 QT
-8.188 -9.706 -9.055 -9.057 QT
-9.922 -8.409 -10.266 -7.362 QT
-10.172 -7.393 -10 -7.393 QT
-9.438 -7.393 -9.039 -7.018 QT
-8.641 -6.643 -8.641 -6.034 QT
-8.641 -5.471 -9.039 -5.073 QT
-9.438 -4.674 -10 -4.674 QT
-10.594 -4.674 -10.984 -5.081 QT
-11.375 -5.487 -11.375 -6.034 QT
-11.375 -6.971 -11.023 -7.799 QT
-10.672 -8.628 -10.008 -9.268 QT
-9.344 -9.909 -8.508 -10.253 QT
-7.672 -10.596 -6.734 -10.596 QT
-5.297 -10.596 -4.063 -9.987 QT
-2.828 -9.378 -2.109 -8.276 QT
-1.391 -7.174 -1.391 -5.69 QT
-1.391 -4.612 -1.867 -3.635 QT
-2.344 -2.659 -3.086 -1.854 QT
-3.828 -1.049 -4.992 -0.042 QT
-6.156 0.966 -6.516 1.31 QT
-9.359 4.029 L
-6.953 4.029 L
-5.172 4.029 -3.984 3.997 QT
-2.797 3.966 -2.719 3.904 QT
-2.438 3.591 -2.125 1.607 QT
-1.391 1.607 L
-2.109 6.06 L
-11.375 6.06 L
cp}def
f763923613
f
GR
GS
[0.71287 0 0 0.71287 50.00396 154.62391] CT
0.149 GC
N
/f-669914004{-31.014 6.06 M
-31.014 5.388 L
-31.014 5.326 -30.967 5.247 QT
-27.092 0.951 L
-26.201 -0.003 -25.655 -0.643 QT
-25.108 -1.284 -24.569 -2.128 QT
-24.03 -2.971 -23.725 -3.846 QT
-23.42 -4.721 -23.42 -5.69 QT
-23.42 -6.721 -23.795 -7.659 QT
-24.17 -8.596 -24.92 -9.151 QT
-25.67 -9.706 -26.733 -9.706 QT
-27.826 -9.706 -28.694 -9.057 QT
-29.561 -8.409 -29.905 -7.362 QT
-29.811 -7.393 -29.639 -7.393 QT
-29.076 -7.393 -28.678 -7.018 QT
-28.28 -6.643 -28.28 -6.034 QT
-28.28 -5.471 -28.678 -5.073 QT
-29.076 -4.674 -29.639 -4.674 QT
-30.233 -4.674 -30.623 -5.081 QT
-31.014 -5.487 -31.014 -6.034 QT
-31.014 -6.971 -30.662 -7.799 QT
-30.311 -8.628 -29.647 -9.268 QT
-28.983 -9.909 -28.147 -10.253 QT
-27.311 -10.596 -26.373 -10.596 QT
-24.936 -10.596 -23.701 -9.987 QT
-22.467 -9.378 -21.748 -8.276 QT
-21.03 -7.174 -21.03 -5.69 QT
-21.03 -4.612 -21.506 -3.635 QT
-21.983 -2.659 -22.725 -1.854 QT
-23.467 -1.049 -24.631 -0.042 QT
-25.795 0.966 -26.155 1.31 QT
-28.998 4.029 L
-26.592 4.029 L
-24.811 4.029 -23.623 3.997 QT
-22.436 3.966 -22.358 3.904 QT
-22.076 3.591 -21.764 1.607 QT
-21.03 1.607 L
-21.748 6.06 L
-31.014 6.06 L
cp}def
f-669914004
f
GR
GS
[0.71287 0 0 0.71287 50.00396 154.62391] CT
0.149 GC
N
f2068087083
f
GR
GS
[0.71287 0 0 0.71287 50.00396 154.62391] CT
0.149 GC
N
f1480815407
f
GR
GS
[0.71287 0 0 0.71287 50.00396 109.00864] CT
0.149 GC
N
/f-875328359{-10.25 4.138 M
-9.656 4.982 -8.672 5.396 QT
-7.688 5.81 -6.547 5.81 QT
-5.094 5.81 -4.484 4.576 QT
-3.875 3.341 -3.875 1.763 QT
-3.875 1.06 -4 0.349 QT
-4.125 -0.362 -4.43 -0.971 QT
-4.734 -1.581 -5.266 -1.948 QT
-5.797 -2.315 -6.563 -2.315 QT
-8.234 -2.315 L
-8.453 -2.315 -8.453 -2.549 QT
-8.453 -2.768 L
-8.453 -2.956 -8.234 -2.956 QT
-6.844 -3.065 L
-5.969 -3.065 -5.391 -3.729 QT
-4.813 -4.393 -4.547 -5.339 QT
-4.281 -6.284 -4.281 -7.143 QT
-4.281 -8.331 -4.836 -9.104 QT
-5.391 -9.878 -6.547 -9.878 QT
-7.5 -9.878 -8.367 -9.51 QT
-9.234 -9.143 -9.75 -8.424 QT
-9.688 -8.424 -9.656 -8.432 QT
-9.625 -8.44 -9.578 -8.44 QT
-9.016 -8.44 -8.633 -8.049 QT
-8.25 -7.659 -8.25 -7.112 QT
-8.25 -6.581 -8.633 -6.19 QT
-9.016 -5.799 -9.578 -5.799 QT
-10.125 -5.799 -10.516 -6.19 QT
-10.906 -6.581 -10.906 -7.112 QT
-10.906 -8.19 -10.258 -8.979 QT
-9.609 -9.768 -8.594 -10.182 QT
-7.578 -10.596 -6.547 -10.596 QT
-5.781 -10.596 -4.945 -10.37 QT
-4.109 -10.143 -3.422 -9.721 QT
-2.734 -9.299 -2.305 -8.635 QT
-1.875 -7.971 -1.875 -7.143 QT
-1.875 -6.081 -2.344 -5.19 QT
-2.813 -4.299 -3.633 -3.651 QT
-4.453 -3.003 -5.422 -2.69 QT
-4.344 -2.487 -3.367 -1.878 QT
-2.391 -1.268 -1.797 -0.315 QT
-1.203 0.638 -1.203 1.732 QT
-1.203 3.122 -1.961 4.24 QT
-2.719 5.357 -3.945 5.982 QT
-5.172 6.607 -6.547 6.607 QT
-7.719 6.607 -8.898 6.161 QT
-10.078 5.716 -10.828 4.826 QT
-11.578 3.935 -11.578 2.685 QT
-11.578 2.076 -11.164 1.654 QT
-10.75 1.232 -10.125 1.232 QT
-9.719 1.232 -9.383 1.427 QT
-9.047 1.622 -8.859 1.958 QT
-8.672 2.294 -8.672 2.685 QT
-8.672 3.294 -9.102 3.716 QT
-9.531 4.138 -10.125 4.138 QT
-10.25 4.138 L
cp}def
f-875328359
f
GR
GS
[0.71287 0 0 0.71287 50.00396 63.39337] CT
0.149 GC
N
/f-1620294614{-29.889 4.138 M
-29.295 4.982 -28.311 5.396 QT
-27.326 5.81 -26.186 5.81 QT
-24.733 5.81 -24.123 4.576 QT
-23.514 3.341 -23.514 1.763 QT
-23.514 1.06 -23.639 0.349 QT
-23.764 -0.362 -24.069 -0.971 QT
-24.373 -1.581 -24.905 -1.948 QT
-25.436 -2.315 -26.201 -2.315 QT
-27.873 -2.315 L
-28.092 -2.315 -28.092 -2.549 QT
-28.092 -2.768 L
-28.092 -2.956 -27.873 -2.956 QT
-26.483 -3.065 L
-25.608 -3.065 -25.03 -3.729 QT
-24.451 -4.393 -24.186 -5.339 QT
-23.92 -6.284 -23.92 -7.143 QT
-23.92 -8.331 -24.475 -9.104 QT
-25.03 -9.878 -26.186 -9.878 QT
-27.139 -9.878 -28.006 -9.51 QT
-28.873 -9.143 -29.389 -8.424 QT
-29.326 -8.424 -29.295 -8.432 QT
-29.264 -8.44 -29.217 -8.44 QT
-28.655 -8.44 -28.272 -8.049 QT
-27.889 -7.659 -27.889 -7.112 QT
-27.889 -6.581 -28.272 -6.19 QT
-28.655 -5.799 -29.217 -5.799 QT
-29.764 -5.799 -30.155 -6.19 QT
-30.545 -6.581 -30.545 -7.112 QT
-30.545 -8.19 -29.897 -8.979 QT
-29.248 -9.768 -28.233 -10.182 QT
-27.217 -10.596 -26.186 -10.596 QT
-25.42 -10.596 -24.584 -10.37 QT
-23.748 -10.143 -23.061 -9.721 QT
-22.373 -9.299 -21.944 -8.635 QT
-21.514 -7.971 -21.514 -7.143 QT
-21.514 -6.081 -21.983 -5.19 QT
-22.451 -4.299 -23.272 -3.651 QT
-24.092 -3.003 -25.061 -2.69 QT
-23.983 -2.487 -23.006 -1.878 QT
-22.03 -1.268 -21.436 -0.315 QT
-20.842 0.638 -20.842 1.732 QT
-20.842 3.122 -21.6 4.24 QT
-22.358 5.357 -23.584 5.982 QT
-24.811 6.607 -26.186 6.607 QT
-27.358 6.607 -28.537 6.161 QT
-29.717 5.716 -30.467 4.826 QT
-31.217 3.935 -31.217 2.685 QT
-31.217 2.076 -30.803 1.654 QT
-30.389 1.232 -29.764 1.232 QT
-29.358 1.232 -29.022 1.427 QT
-28.686 1.622 -28.498 1.958 QT
-28.311 2.294 -28.311 2.685 QT
-28.311 3.294 -28.741 3.716 QT
-29.17 4.138 -29.764 4.138 QT
-29.889 4.138 L
cp}def
f-1620294614
f
GR
GS
[0.71287 0 0 0.71287 50.00396 63.39337] CT
0.149 GC
N
f2068087083
f
GR
GS
[0.71287 0 0 0.71287 50.00396 63.39337] CT
0.149 GC
N
f1480815407
f
GR
GS
[0.71287 0 0 0.71287 50.00396 17.7781] CT
0.149 GC
N
/f-50786714{-11.922 1.935 M
-11.922 1.06 L
-4.203 -10.471 L
-4.109 -10.596 -3.953 -10.596 QT
-3.578 -10.596 L
-3.297 -10.596 -3.297 -10.315 QT
-3.297 1.06 L
-0.844 1.06 L
-0.844 1.935 L
-3.297 1.935 L
-3.297 4.388 L
-3.297 4.904 -2.563 5.044 QT
-1.828 5.185 -0.875 5.185 QT
-0.875 6.06 L
-7.75 6.06 L
-7.75 5.185 L
-6.797 5.185 -6.063 5.044 QT
-5.328 4.904 -5.328 4.388 QT
-5.328 1.935 L
-11.922 1.935 L
cp
-11.094 1.06 M
-5.172 1.06 L
-5.172 -7.799 L
-11.094 1.06 L
cp}def
f-50786714
f
GR
GS
[0 -0.71287 0.71287 0 24.00389 200.59388] CT
0.149 GC
N
/f-1303605705{-106.903 -9.999 M
-106.903 -10.983 L
-104.028 -10.983 -104.028 -11.874 QT
-104.028 -27.249 L
-104.028 -28.14 -106.903 -28.14 QT
-106.903 -29.124 L
-98.122 -29.124 L
-96.543 -29.124 -94.817 -28.562 QT
-93.09 -27.999 -91.926 -26.835 QT
-90.762 -25.671 -90.762 -24.062 QT
-90.762 -22.874 -91.465 -21.952 QT
-92.168 -21.03 -93.27 -20.413 QT
-94.372 -19.796 -95.528 -19.515 QT
-94.262 -19.077 -93.317 -18.124 QT
-92.372 -17.171 -92.184 -15.937 QT
-91.793 -13.452 L
-91.512 -11.765 -91.215 -10.937 QT
-90.918 -10.108 -89.887 -10.108 QT
-89.012 -10.108 -88.583 -10.921 QT
-88.153 -11.733 -88.153 -12.687 QT
-88.153 -12.796 -88.067 -12.866 QT
-87.981 -12.937 -87.872 -12.937 QT
-87.622 -12.937 L
-87.34 -12.937 -87.34 -12.577 QT
-87.34 -11.812 -87.645 -11.077 QT
-87.95 -10.343 -88.512 -9.866 QT
-89.075 -9.39 -89.856 -9.39 QT
-91.887 -9.39 -93.34 -10.39 QT
-94.793 -11.39 -94.793 -13.343 QT
-94.793 -15.827 L
-94.793 -17.218 -95.762 -18.218 QT
-96.731 -19.218 -98.153 -19.218 QT
-101.512 -19.218 L
-101.512 -11.874 L
-101.512 -10.983 -98.622 -10.983 QT
-98.622 -9.999 L
-106.903 -9.999 L
cp
-101.512 -19.937 M
-98.512 -19.937 L
-96.184 -19.937 -94.973 -20.874 QT
-93.762 -21.812 -93.762 -24.062 QT
-93.762 -26.28 -94.965 -27.21 QT
-96.168 -28.14 -98.512 -28.14 QT
-100.09 -28.14 L
-100.59 -28.14 -100.872 -28.101 QT
-101.153 -28.062 -101.333 -27.866 QT
-101.512 -27.671 -101.512 -27.249 QT
-101.512 -19.937 L
cp}def
f-1303605705
f
GR
GS
[0 -0.71287 0.71287 0 24.00389 200.59388] CT
0.149 GC
N
/f-973878619{-86.41 -9.999 M
-86.41 -10.983 L
-83.52 -10.983 -83.52 -12.64 QT
-83.52 -27.249 L
-83.52 -28.14 -86.41 -28.14 QT
-86.41 -29.124 L
-81.114 -29.124 L
-80.77 -29.124 -80.66 -28.812 QT
-74.567 -12.968 L
-68.473 -28.812 L
-68.364 -29.124 -68.02 -29.124 QT
-62.723 -29.124 L
-62.723 -28.14 L
-65.614 -28.14 -65.614 -27.249 QT
-65.614 -11.874 L
-65.614 -10.983 -62.723 -10.983 QT
-62.723 -9.999 L
-70.879 -9.999 L
-70.879 -10.983 L
-67.989 -10.983 -67.989 -11.874 QT
-67.989 -28.171 L
-74.879 -10.312 L
-75.004 -9.999 -75.348 -9.999 QT
-75.707 -9.999 -75.832 -10.312 QT
-82.629 -27.952 L
-82.629 -12.64 L
-82.629 -10.983 -79.754 -10.983 QT
-79.754 -9.999 L
-86.41 -9.999 L
cp}def
f-973878619
f
GR
GS
[0 -0.71287 0.71287 0 24.00389 200.59388] CT
0.149 GC
N
/f1049888002{-60.356 -9.608 M
-60.356 -16.14 L
-60.356 -16.358 -60.122 -16.358 QT
-59.778 -16.358 L
-59.684 -16.358 -59.622 -16.288 QT
-59.559 -16.218 -59.559 -16.14 QT
-59.559 -13.39 -57.856 -11.882 QT
-56.153 -10.374 -53.388 -10.374 QT
-52.419 -10.374 -51.598 -10.929 QT
-50.778 -11.483 -50.317 -12.398 QT
-49.856 -13.312 -49.856 -14.28 QT
-49.856 -15.124 -50.2 -15.929 QT
-50.544 -16.733 -51.184 -17.319 QT
-51.825 -17.905 -52.638 -18.093 QT
-56.278 -18.983 L
-58.075 -19.468 -59.216 -20.944 QT
-60.356 -22.421 -60.356 -24.28 QT
-60.356 -25.718 -59.622 -26.991 QT
-58.888 -28.265 -57.638 -29.007 QT
-56.388 -29.749 -54.934 -29.749 QT
-52.138 -29.749 -50.481 -27.843 QT
-49.325 -29.655 L
-49.247 -29.749 -49.138 -29.749 QT
-48.95 -29.749 L
-48.856 -29.749 -48.786 -29.687 QT
-48.716 -29.624 -48.716 -29.515 QT
-48.716 -23.015 L
-48.716 -22.765 -48.95 -22.765 QT
-49.278 -22.765 L
-49.528 -22.765 -49.528 -23.015 QT
-49.528 -23.733 -49.77 -24.577 QT
-50.013 -25.421 -50.434 -26.202 QT
-50.856 -26.983 -51.356 -27.468 QT
-52.7 -28.843 -54.934 -28.843 QT
-55.888 -28.843 -56.692 -28.358 QT
-57.497 -27.874 -57.981 -27.038 QT
-58.466 -26.202 -58.466 -25.28 QT
-58.466 -24.077 -57.716 -23.101 QT
-56.966 -22.124 -55.763 -21.812 QT
-52.138 -20.921 L
-51.231 -20.702 -50.427 -20.14 QT
-49.622 -19.577 -49.091 -18.819 QT
-48.559 -18.062 -48.263 -17.14 QT
-47.966 -16.218 -47.966 -15.233 QT
-47.966 -13.718 -48.661 -12.374 QT
-49.356 -11.03 -50.622 -10.21 QT
-51.888 -9.39 -53.388 -9.39 QT
-54.325 -9.39 -55.294 -9.593 QT
-56.263 -9.796 -57.083 -10.218 QT
-57.903 -10.64 -58.575 -11.312 QT
-59.747 -9.468 L
-59.825 -9.39 -59.95 -9.39 QT
-60.122 -9.39 L
-60.356 -9.39 -60.356 -9.608 QT
cp}def
f1049888002
f
GR
GS
[0 -0.71287 0.71287 0 24.00389 200.59388] CT
0.149 GC
N
/f1002492210{-33.187 -3.046 M
-34.75 -4.28 -35.875 -5.874 QT
-37 -7.468 -37.718 -9.273 QT
-38.437 -11.077 -38.797 -13.046 QT
-39.156 -15.015 -39.156 -16.999 QT
-39.156 -19.015 -38.797 -20.983 QT
-38.437 -22.952 -37.711 -24.765 QT
-36.984 -26.577 -35.843 -28.163 QT
-34.703 -29.749 -33.187 -30.952 QT
-33.187 -30.999 -33.062 -30.999 QT
-32.797 -30.999 L
-32.718 -30.999 -32.648 -30.921 QT
-32.578 -30.843 -32.578 -30.749 QT
-32.578 -30.624 -32.625 -30.577 QT
-34 -29.233 -34.906 -27.702 QT
-35.812 -26.171 -36.367 -24.444 QT
-36.922 -22.718 -37.172 -20.866 QT
-37.422 -19.015 -37.422 -16.999 QT
-37.422 -8.093 -32.656 -3.483 QT
-32.578 -3.39 -32.578 -3.249 QT
-32.578 -3.171 -32.656 -3.085 QT
-32.734 -2.999 -32.797 -2.999 QT
-33.062 -2.999 L
-33.187 -2.999 -33.187 -3.046 QT
cp}def
f1002492210
f
GR
GS
[0 -0.71287 0.71287 0 24.00389 200.59388] CT
0.149 GC
N
/f-1856226933{-29.558 -9.999 M
-29.792 -9.999 -29.792 -10.218 QT
-29.776 -10.249 -29.769 -10.265 QT
-29.761 -10.28 -29.761 -10.312 QT
-20.12 -29.749 L
-19.995 -30.046 -19.62 -30.046 QT
-19.23 -30.046 L
-18.855 -30.046 -18.73 -29.749 QT
-9.089 -10.312 L
-9.073 -10.28 -9.066 -10.265 QT
-9.058 -10.249 -9.058 -10.218 QT
-9.058 -9.999 -9.292 -9.999 QT
-29.558 -9.999 L
cp
-27.714 -12.249 M
-12.964 -12.249 L
-20.323 -27.108 L
-27.714 -12.249 L
cp}def
f-1856226933
f
GR
GS
[0 -0.71287 0.71287 0 24.00389 200.59388] CT
0.149 GC
N
/f-1333637068{-0.443 -10.39 M
-5.349 -20.999 L
-7.209 -20.999 L
-7.209 -22.421 L
-0.427 -22.421 L
-0.427 -20.999 L
-1.912 -20.999 L
1.51 -13.64 L
4.791 -20.78 L
4.791 -20.905 4.323 -20.952 QT
3.854 -20.999 3.432 -20.999 QT
3.432 -22.421 L
8.323 -22.421 L
8.323 -20.999 L
6.557 -20.999 6.385 -20.78 QT
1.557 -10.39 L
1.338 -9.89 0.776 -9.89 QT
0.338 -9.89 L
-0.224 -9.89 -0.443 -10.39 QT
cp}def
f-1333637068
f
GR
GS
[0 -0.71287 0.71287 0 24.00389 200.59388] CT
0.149 GC
N
/f-1701734744{10.743 -2.999 M
10.508 -2.999 10.508 -3.249 QT
10.508 -3.374 10.555 -3.421 QT
15.337 -8.093 15.337 -16.999 QT
15.337 -25.905 10.618 -30.515 QT
10.508 -30.593 10.508 -30.749 QT
10.508 -30.843 10.579 -30.921 QT
10.649 -30.999 10.743 -30.999 QT
11.008 -30.999 L
11.087 -30.999 11.149 -30.952 QT
13.149 -29.358 14.493 -27.093 QT
15.837 -24.827 16.462 -22.257 QT
17.087 -19.687 17.087 -16.999 QT
17.087 -15.015 16.751 -13.093 QT
16.415 -11.171 15.68 -9.304 QT
14.946 -7.437 13.829 -5.858 QT
12.712 -4.28 11.149 -3.046 QT
11.087 -2.999 11.008 -2.999 QT
10.743 -2.999 L
cp}def
f-1701734744
f
GR
GS
[0 -0.71287 0.71287 0 24.00389 200.59388] CT
0.149 GC
N
/f-294662152{30.017 -0.044 M
30.017 -33.622 L
35.392 -33.622 L
35.392 -32.497 L
31.142 -32.497 L
31.142 -1.153 L
35.392 -1.153 L
35.392 -0.044 L
30.017 -0.044 L
cp}def
f-294662152
f
GR
GS
[0 -0.71287 0.71287 0 24.00389 200.59388] CT
0.149 GC
N
/f-1655596286{36.762 -9.999 M
36.762 -10.983 L
37.731 -10.983 38.34 -11.132 QT
38.949 -11.28 38.949 -11.874 QT
38.949 -19.515 L
38.949 -20.265 38.731 -20.601 QT
38.512 -20.937 38.082 -21.015 QT
37.653 -21.093 36.762 -21.093 QT
36.762 -22.077 L
40.824 -22.374 L
40.824 -19.64 L
41.387 -20.843 42.489 -21.608 QT
43.59 -22.374 44.887 -22.374 QT
48.121 -22.374 48.684 -19.749 QT
49.231 -20.921 50.317 -21.648 QT
51.403 -22.374 52.684 -22.374 QT
53.949 -22.374 54.817 -21.96 QT
55.684 -21.546 56.121 -20.71 QT
56.559 -19.874 56.559 -18.593 QT
56.559 -11.874 L
56.559 -11.28 57.184 -11.132 QT
57.809 -10.983 58.746 -10.983 QT
58.746 -9.999 L
52.34 -9.999 L
52.34 -10.983 L
53.293 -10.983 53.91 -11.132 QT
54.528 -11.28 54.528 -11.874 QT
54.528 -18.515 L
54.528 -19.921 54.129 -20.788 QT
53.731 -21.655 52.512 -21.655 QT
50.887 -21.655 49.84 -20.351 QT
48.793 -19.046 48.793 -17.39 QT
48.793 -11.874 L
48.793 -11.28 49.403 -11.132 QT
50.012 -10.983 50.981 -10.983 QT
50.981 -9.999 L
44.559 -9.999 L
44.559 -10.983 L
45.512 -10.983 46.129 -11.132 QT
46.746 -11.28 46.746 -11.874 QT
46.746 -18.515 L
46.746 -19.89 46.348 -20.773 QT
45.949 -21.655 44.731 -21.655 QT
43.106 -21.655 42.059 -20.351 QT
41.012 -19.046 41.012 -17.39 QT
41.012 -11.874 L
41.012 -11.28 41.621 -11.132 QT
42.231 -10.983 43.184 -10.983 QT
43.184 -9.999 L
36.762 -9.999 L
cp}def
f-1655596286
f
GR
GS
[0 -0.71287 0.71287 0 24.00389 200.59388] CT
0.149 GC
N
/f-1893365833{60.017 -9.921 M
60.017 -14.483 L
60.017 -14.702 60.252 -14.702 QT
60.595 -14.702 L
60.767 -14.702 60.814 -14.483 QT
61.595 -10.421 64.595 -10.421 QT
65.923 -10.421 66.814 -11.023 QT
67.705 -11.624 67.705 -12.89 QT
67.705 -13.78 67.009 -14.421 QT
66.314 -15.062 65.361 -15.296 QT
63.486 -15.655 L
62.533 -15.858 61.767 -16.288 QT
61.002 -16.718 60.509 -17.421 QT
60.017 -18.124 60.017 -19.046 QT
60.017 -20.28 60.666 -21.069 QT
61.314 -21.858 62.353 -22.202 QT
63.392 -22.546 64.595 -22.546 QT
66.033 -22.546 67.095 -21.78 QT
67.892 -22.483 L
67.892 -22.546 68.033 -22.546 QT
68.236 -22.546 L
68.33 -22.546 68.392 -22.476 QT
68.455 -22.405 68.455 -22.312 QT
68.455 -18.655 L
68.455 -18.39 68.236 -18.39 QT
67.892 -18.39 L
67.658 -18.39 67.658 -18.655 QT
67.658 -20.124 66.845 -21.007 QT
66.033 -21.89 64.564 -21.89 QT
63.298 -21.89 62.377 -21.429 QT
61.455 -20.968 61.455 -19.827 QT
61.455 -19.046 62.119 -18.546 QT
62.783 -18.046 63.673 -17.827 QT
65.58 -17.483 L
66.533 -17.265 67.361 -16.741 QT
68.189 -16.218 68.673 -15.429 QT
69.158 -14.64 69.158 -13.64 QT
69.158 -12.624 68.806 -11.882 QT
68.455 -11.14 67.838 -10.648 QT
67.22 -10.155 66.369 -9.921 QT
65.517 -9.687 64.595 -9.687 QT
62.845 -9.687 61.595 -10.858 QT
60.564 -9.749 L
60.564 -9.687 60.423 -9.687 QT
60.252 -9.687 L
60.017 -9.687 60.017 -9.921 QT
cp}def
f-1893365833
f
GR
GS
[0 -0.71287 0.71287 0 24.00389 200.59388] CT
0.149 GC
N
/f1225645435{71.973 -24.453 M
71.817 -24.453 71.715 -24.571 QT
71.614 -24.688 71.614 -24.828 QT
71.614 -24.969 71.715 -25.086 QT
71.817 -25.203 71.973 -25.203 QT
82.879 -25.203 L
83.02 -25.203 83.121 -25.086 QT
83.223 -24.969 83.223 -24.828 QT
83.223 -24.688 83.121 -24.571 QT
83.02 -24.453 82.879 -24.453 QT
71.973 -24.453 L
cp}def
f1225645435
f
GR
GS
[0 -0.71287 0.71287 0 24.00389 200.59388] CT
0.149 GC
N
/f2096208686{86.923 -20.078 M
86.923 -20.75 L
89.298 -20.75 89.298 -21.344 QT
89.298 -31.328 L
88.314 -30.844 86.814 -30.844 QT
86.814 -31.516 L
89.142 -31.516 90.329 -32.735 QT
90.595 -32.735 L
90.657 -32.735 90.72 -32.68 QT
90.782 -32.625 90.782 -32.563 QT
90.782 -21.344 L
90.782 -20.75 93.157 -20.75 QT
93.157 -20.078 L
86.923 -20.078 L
cp}def
f2096208686
f
GR
GS
[0 -0.71287 0.71287 0 24.00389 200.59388] CT
0.149 GC
N
/f902559490{96.877 -0.044 M
96.877 -1.153 L
101.142 -1.153 L
101.142 -32.497 L
96.877 -32.497 L
96.877 -33.622 L
102.252 -33.622 L
102.252 -0.044 L
96.877 -0.044 L
cp}def
f902559490
f
GR
GS
[0.71287 0 0 0.71287 0 0.27722] CT
[10 6] 0 setdash
2 LJ
0.701 LW
N
165 236.566 M
165 25.545 L
S
GR
GS
[0.71287 0 0 0.71287 0 0.27722] CT
[10 6] 0 setdash
2 LJ
0.701 LW
N
339 319.527 M
339 184.972 L
S
GR
GS
[0.71287 0 0 0.71287 0 0.27722] CT
[10 6] 0 setdash
2 LJ
0.701 LW
N
513 421.44 M
513 296.541 L
S
GR
GS
[0.71287 0 0 0.71287 0 0.27722] CT
[10 6] 0 setdash
2 LJ
0.701 LW
N
165 536.455 M
165 512.489 L
S
GR
GS
[0.71287 0 0 0.71287 0 0.27722] CT
[10 6] 0 setdash
2 LJ
0.701 LW
N
339 536.455 M
339 514.108 L
S
GR
GS
[0.71287 0 0 0.71287 0 0.27722] CT
[10 6] 0 setdash
2 LJ
0.701 LW
N
513 536.455 M
513 532.695 L
S
GR
GS
[0.71287 0 0 0.71287 0 0.27722] CT
1 LJ
0.701 LW
N
145.425 25.545 M
184.575 25.545 L
S
GR
GS
[0.71287 0 0 0.71287 0 0.27722] CT
1 LJ
0.701 LW
N
319.425 184.972 M
358.575 184.972 L
S
GR
GS
[0.71287 0 0 0.71287 0 0.27722] CT
1 LJ
0.701 LW
N
493.425 296.541 M
532.575 296.541 L
S
GR
GS
[0.71287 0 0 0.71287 0 0.27722] CT
1 LJ
0.701 LW
N
145.425 536.455 M
184.575 536.455 L
S
GR
GS
[0.71287 0 0 0.71287 0 0.27722] CT
1 LJ
0.701 LW
N
319.425 536.455 M
358.575 536.455 L
S
GR
GS
[0.71287 0 0 0.71287 0 0.27722] CT
1 LJ
0.701 LW
N
493.425 536.455 M
532.575 536.455 L
S
GR
GS
[0.71287 0 0 0.71287 0 0.27722] CT
0 0 1 RC
1 LJ
0.701 LW
N
145.425 345.446 M
125.85 272.221 L
125.85 236.566 L
204.15 236.566 L
204.15 272.221 L
184.575 345.446 L
204.15 418.67 L
204.15 512.489 L
125.85 512.489 L
125.85 418.67 L
145.425 345.446 L
S
GR
GS
[0.71287 0 0 0.71287 0 0.27722] CT
0 0 1 RC
1 LJ
0.701 LW
N
319.425 376.415 M
299.85 324.777 L
299.85 319.527 L
378.15 319.527 L
378.15 324.777 L
358.575 376.415 L
378.15 428.053 L
378.15 514.108 L
299.85 514.108 L
299.85 428.053 L
319.425 376.415 L
S
GR
GS
[0.71287 0 0 0.71287 0 0.27722] CT
0 0 1 RC
1 LJ
0.701 LW
N
493.425 448.253 M
473.85 418.729 L
473.85 421.44 L
552.15 421.44 L
552.15 418.729 L
532.575 448.253 L
552.15 477.778 L
552.15 532.695 L
473.85 532.695 L
473.85 477.778 L
493.425 448.253 L
S
GR
GS
[0.71287 0 0 0.71287 0 0.27722] CT
1 0 0 RC
1 LJ
0.701 LW
N
145.425 345.446 M
184.575 345.446 L
S
GR
GS
[0.71287 0 0 0.71287 0 0.27722] CT
1 0 0 RC
1 LJ
0.701 LW
N
319.425 376.415 M
358.575 376.415 L
S
GR
GS
[0.71287 0 0 0.71287 0 0.27722] CT
1 0 0 RC
1 LJ
0.701 LW
N
493.425 448.253 M
532.575 448.253 L
S
GR
%%Trailer
%%Pages: 1
%%EOF
