<?xml version="1.0" encoding="UTF-8"?>

<!-- generated on Sat Apr 24 18:07:26 2021 by Eclipse SUMO Version 1.4.0
<configuration xmlns:xsi="http://www.w3.org/2001/XMLSchema-instance" xsi:noNamespaceSchemaLocation="http://sumo.dlr.de/xsd/sumoConfiguration.xsd">

    <input>
        <net-file value="sumofiles/junction.net.xml"/>
        <route-files value="sumofiles/junction_preemption_89.rou.xml"/>
        <additional-files value="sumofiles/junction.det.xml"/>
    </input>

    <output>
        <tripinfo-output value="sumofiles/output/tripinfo_preemption_89.xml"/>
    </output>

    <time>
        <begin value="0"/>
        <end value="10000"/>
        <step-length value="0.05"/>
    </time>

    <processing>
        <lateral-resolution value="0.1"/>
    </processing>

    <report>
        <no-warnings value="true"/>
        <error-log value="sumofiles/output/errorlog_preemption_89.log"/>
        <no-step-log value="true"/>
    </report>

    <traci_server>
        <remote-port value="45433"/>
    </traci_server>

    <gui_only>
        <gui-settings-file value="sumofiles/junction-gui.settings.xml"/>
        <tracker-interval value="0.05"/>
    </gui_only>

</configuration>
-->

<tripinfos xmlns:xsi="http://www.w3.org/2001/XMLSchema-instance" xsi:noNamespaceSchemaLocation="http://sumo.dlr.de/xsd/tripinfo_file.xsd">
    <tripinfo id="car_e2w_4" depart="4.00" departLane="e2sep_1" departPos="3.60" departPosLat="0.00" departSpeed="13.90" departDelay="0.00" arrival="139.70" arrivalLane="c2w_1" arrivalPos="990.00" arrivalPosLat="0.00" arrivalSpeed="14.73" duration="135.70" routeLength="1997.01" waitingTime="0.00" waitingCount="0" stopTime="0.00" timeLoss="0.15" rerouteNo="1" devices="tripinfo_car_e2w_4 routing_car_e2w_4" vType="Car" speedFactor="1.06" vaporized=""/>
    <tripinfo id="car_s2n_22" depart="22.00" departLane="s2sep_1" departPos="3.60" departPosLat="0.00" departSpeed="13.90" departDelay="0.00" arrival="161.30" arrivalLane="c2n_1" arrivalPos="990.00" arrivalPosLat="0.00" arrivalSpeed="14.54" duration="139.30" routeLength="1997.01" waitingTime="0.00" waitingCount="0" stopTime="0.00" timeLoss="1.89" rerouteNo="1" devices="tripinfo_car_s2n_22 routing_car_s2n_22" vType="Car" speedFactor="1.05" vaporized=""/>
    <tripinfo id="car_s2w_11" depart="11.00" departLane="s2sep_1" departPos="3.60" departPosLat="0.00" departSpeed="13.90" departDelay="0.00" arrival="162.85" arrivalLane="c2w_1" arrivalPos="990.00" arrivalPosLat="0.00" arrivalSpeed="14.73" duration="151.85" routeLength="1996.47" waitingTime="7.75" waitingCount="1" stopTime="0.00" timeLoss="15.68" rerouteNo="1" devices="tripinfo_car_s2w_11 routing_car_s2w_11" vType="Car" speedFactor="1.06" vaporized=""/>
    <tripinfo id="car_n2e_21" depart="21.00" departLane="n2sep_1" departPos="3.60" departPosLat="0.00" departSpeed="13.90" departDelay="0.00" arrival="164.85" arrivalLane="c2e_1" arrivalPos="990.00" arrivalPosLat="0.00" arrivalSpeed="14.32" duration="143.85" routeLength="1996.47" waitingTime="0.00" waitingCount="0" stopTime="0.00" timeLoss="3.76" rerouteNo="1" devices="tripinfo_car_n2e_21 routing_car_n2e_21" vType="Car" speedFactor="1.03" vaporized=""/>
    <tripinfo id="car_n2s_30" depart="30.00" departLane="n2sep_1" departPos="3.60" departPosLat="0.00" departSpeed="13.90" departDelay="0.00" arrival="169.90" arrivalLane="c2s_1" arrivalPos="990.00" arrivalPosLat="0.00" arrivalSpeed="14.32" duration="139.90" routeLength="1997.01" waitingTime="0.00" waitingCount="0" stopTime="0.00" timeLoss="0.46" rerouteNo="1" devices="tripinfo_car_n2s_30 routing_car_n2s_30" vType="Car" speedFactor="1.03" vaporized=""/>
    <tripinfo id="car_n2s_37" depart="38.40" departLane="n2sep_1" departPos="3.60" departPosLat="0.00" departSpeed="13.90" departDelay="1.40" arrival="173.40" arrivalLane="c2s_1" arrivalPos="990.00" arrivalPosLat="0.00" arrivalSpeed="15.55" duration="135.00" routeLength="1997.01" waitingTime="0.00" waitingCount="0" stopTime="0.00" timeLoss="7.04" rerouteNo="1" devices="tripinfo_car_n2s_37 routing_car_n2s_37" vType="Car" speedFactor="1.12" vaporized=""/>
    <tripinfo id="car_n2e_37" depart="37.00" departLane="n2sep_1" departPos="3.60" departPosLat="0.00" departSpeed="13.90" departDelay="0.00" arrival="178.85" arrivalLane="c2e_1" arrivalPos="990.00" arrivalPosLat="0.00" arrivalSpeed="14.55" duration="141.85" routeLength="1996.47" waitingTime="0.00" waitingCount="0" stopTime="0.00" timeLoss="4.02" rerouteNo="1" devices="tripinfo_car_n2e_37 routing_car_n2e_37" vType="Car" speedFactor="1.05" vaporized=""/>
    <tripinfo id="car_s2e_42" depart="42.00" departLane="s2sep_1" departPos="3.60" departPosLat="0.00" departSpeed="13.90" departDelay="0.00" arrival="189.40" arrivalLane="c2e_1" arrivalPos="990.00" arrivalPosLat="0.00" arrivalSpeed="13.90" duration="147.40" routeLength="1986.69" waitingTime="0.00" waitingCount="0" stopTime="0.00" timeLoss="3.71" rerouteNo="1" devices="tripinfo_car_s2e_42 routing_car_s2e_42" vType="Car" speedFactor="1.00" vaporized=""/>
    <tripinfo id="car_n2w_47" depart="47.00" departLane="n2sep_1" departPos="3.60" departPosLat="0.00" departSpeed="13.90" departDelay="0.00" arrival="194.30" arrivalLane="c2w_1" arrivalPos="990.00" arrivalPosLat="0.00" arrivalSpeed="13.90" duration="147.30" routeLength="1986.69" waitingTime="0.00" waitingCount="0" stopTime="0.00" timeLoss="3.64" rerouteNo="1" devices="tripinfo_car_n2w_47 routing_car_n2w_47" vType="Car" speedFactor="1.00" vaporized=""/>
    <tripinfo id="car_n2s_51" depart="51.00" departLane="n2sep_1" departPos="3.60" departPosLat="0.00" departSpeed="13.90" departDelay="0.00" arrival="196.50" arrivalLane="c2s_1" arrivalPos="990.00" arrivalPosLat="0.00" arrivalSpeed="13.90" duration="145.50" routeLength="1997.01" waitingTime="0.00" waitingCount="0" stopTime="0.00" timeLoss="1.84" rerouteNo="1" devices="tripinfo_car_n2s_51 routing_car_n2s_51" vType="Car" speedFactor="1.00" vaporized=""/>
    <tripinfo id="car_s2w_43" depart="43.45" departLane="s2sep_1" departPos="3.60" departPosLat="0.00" departSpeed="13.90" departDelay="0.45" arrival="198.15" arrivalLane="c2w_1" arrivalPos="990.00" arrivalPosLat="0.00" arrivalSpeed="14.51" duration="154.70" routeLength="1996.47" waitingTime="4.20" waitingCount="1" stopTime="0.00" timeLoss="16.71" rerouteNo="1" devices="tripinfo_car_s2w_43 routing_car_s2w_43" vType="Car" speedFactor="1.05" vaporized=""/>
    <tripinfo id="car_e2n_15" depart="15.00" departLane="e2sep_1" departPos="3.60" departPosLat="0.00" departSpeed="13.90" departDelay="0.00" arrival="205.30" arrivalLane="c2n_1" arrivalPos="990.00" arrivalPosLat="0.00" arrivalSpeed="15.05" duration="190.30" routeLength="1986.69" waitingTime="50.30" waitingCount="1" stopTime="0.00" timeLoss="57.61" rerouteNo="1" devices="tripinfo_car_e2n_15 routing_car_e2n_15" vType="Car" speedFactor="1.08" vaporized=""/>
    <tripinfo id="car_w2s_14" depart="14.00" departLane="w2sep_1" departPos="3.60" departPosLat="0.00" departSpeed="13.90" departDelay="0.00" arrival="210.00" arrivalLane="c2s_1" arrivalPos="990.00" arrivalPosLat="0.00" arrivalSpeed="14.04" duration="196.00" routeLength="1986.69" waitingTime="46.95" waitingCount="1" stopTime="0.00" timeLoss="53.82" rerouteNo="1" devices="tripinfo_car_w2s_14 routing_car_w2s_14" vType="Car" speedFactor="1.01" vaporized=""/>
    <tripinfo id="car_e2n_25" depart="25.00" departLane="e2sep_1" departPos="3.60" departPosLat="0.00" departSpeed="13.90" departDelay="0.00" arrival="210.85" arrivalLane="c2n_1" arrivalPos="990.00" arrivalPosLat="0.00" arrivalSpeed="15.05" duration="185.85" routeLength="1986.69" waitingTime="38.80" waitingCount="1" stopTime="0.00" timeLoss="53.13" rerouteNo="1" devices="tripinfo_car_e2n_25 routing_car_e2n_25" vType="Car" speedFactor="1.08" vaporized=""/>
    <tripinfo id="car_e2w_21" depart="21.00" departLane="e2sep_1" departPos="3.60" departPosLat="0.00" departSpeed="13.90" departDelay="0.00" arrival="212.90" arrivalLane="c2w_1" arrivalPos="990.00" arrivalPosLat="0.00" arrivalSpeed="13.90" duration="191.90" routeLength="1997.01" waitingTime="39.80" waitingCount="1" stopTime="0.00" timeLoss="48.19" rerouteNo="1" devices="tripinfo_car_e2w_21 routing_car_e2w_21" vType="Car" speedFactor="1.00" vaporized=""/>
    <tripinfo id="car_w2s_24" depart="24.00" departLane="w2sep_1" departPos="3.60" departPosLat="0.00" departSpeed="13.90" departDelay="0.00" arrival="214.45" arrivalLane="c2s_1" arrivalPos="990.00" arrivalPosLat="0.00" arrivalSpeed="14.04" duration="190.45" routeLength="1986.69" waitingTime="37.50" waitingCount="1" stopTime="0.00" timeLoss="48.26" rerouteNo="1" devices="tripinfo_car_w2s_24 routing_car_w2s_24" vType="Car" speedFactor="1.01" vaporized=""/>
    <tripinfo id="car_e2w_76" depart="76.00" departLane="e2sep_1" departPos="3.60" departPosLat="0.00" departSpeed="13.90" departDelay="0.00" arrival="214.70" arrivalLane="c2w_1" arrivalPos="990.00" arrivalPosLat="0.00" arrivalSpeed="15.48" duration="138.70" routeLength="1997.01" waitingTime="0.00" waitingCount="0" stopTime="0.00" timeLoss="16.80" rerouteNo="1" devices="tripinfo_car_e2w_76 routing_car_e2w_76" vType="Car" speedFactor="1.18" vaporized=""/>
    <tripinfo id="car_w2e_49" depart="49.00" departLane="w2sep_1" departPos="3.60" departPosLat="0.00" departSpeed="13.90" departDelay="0.00" arrival="217.50" arrivalLane="c2e_1" arrivalPos="990.00" arrivalPosLat="0.00" arrivalSpeed="13.90" duration="168.50" routeLength="1997.01" waitingTime="14.20" waitingCount="1" stopTime="0.00" timeLoss="24.79" rerouteNo="1" devices="tripinfo_car_w2e_49 routing_car_w2e_49" vType="Car" speedFactor="1.00" vaporized=""/>
    <tripinfo id="car_w2s_36" depart="36.00" departLane="w2sep_1" departPos="3.60" departPosLat="0.00" departSpeed="13.90" departDelay="0.00" arrival="217.65" arrivalLane="c2s_1" arrivalPos="990.00" arrivalPosLat="0.00" arrivalSpeed="14.21" duration="181.65" routeLength="1986.69" waitingTime="27.10" waitingCount="1" stopTime="0.00" timeLoss="41.67" rerouteNo="1" devices="tripinfo_car_w2s_36 routing_car_w2s_36" vType="Car" speedFactor="1.03" vaporized=""/>
    <tripinfo id="car_e2n_69" depart="69.00" departLane="e2sep_1" departPos="3.60" departPosLat="0.00" departSpeed="13.90" departDelay="0.00" arrival="218.60" arrivalLane="c2n_1" arrivalPos="990.00" arrivalPosLat="0.00" arrivalSpeed="13.90" duration="149.60" routeLength="1986.69" waitingTime="0.00" waitingCount="0" stopTime="0.00" timeLoss="5.92" rerouteNo="1" devices="tripinfo_car_e2n_69 routing_car_e2n_69" vType="Car" speedFactor="1.00" vaporized=""/>
    <tripinfo id="car_w2s_55" depart="55.00" departLane="w2sep_1" departPos="3.60" departPosLat="0.00" departSpeed="13.90" departDelay="0.00" arrival="219.90" arrivalLane="c2s_1" arrivalPos="990.00" arrivalPosLat="0.00" arrivalSpeed="14.85" duration="164.90" routeLength="1986.69" waitingTime="11.70" waitingCount="1" stopTime="0.00" timeLoss="33.14" rerouteNo="1" devices="tripinfo_car_w2s_55 routing_car_w2s_55" vType="Car" speedFactor="1.09" vaporized=""/>
    <tripinfo id="car_w2n_33" depart="33.00" departLane="w2sep_1" departPos="3.60" departPosLat="0.00" departSpeed="13.90" departDelay="0.00" arrival="220.95" arrivalLane="c2n_1" arrivalPos="990.00" arrivalPosLat="0.00" arrivalSpeed="14.89" duration="187.95" routeLength="1996.47" waitingTime="39.25" waitingCount="2" stopTime="0.00" timeLoss="55.59" rerouteNo="1" devices="tripinfo_car_w2n_33 routing_car_w2n_33" vType="Car" speedFactor="1.09" vaporized=""/>
    <tripinfo id="car_e2s_93" depart="93.00" departLane="e2sep_1" departPos="3.60" departPosLat="0.00" departSpeed="13.90" departDelay="0.00" arrival="221.95" arrivalLane="c2s_1" arrivalPos="990.00" arrivalPosLat="0.00" arrivalSpeed="15.85" duration="128.95" routeLength="1996.47" waitingTime="0.00" waitingCount="0" stopTime="0.00" timeLoss="6.61" rerouteNo="1" devices="tripinfo_car_e2s_93 routing_car_e2s_93" vType="Car" speedFactor="1.18" vaporized=""/>
    <tripinfo id="car_w2n_52" depart="52.00" departLane="w2sep_1" departPos="3.60" departPosLat="0.00" departSpeed="13.90" departDelay="0.00" arrival="222.90" arrivalLane="c2n_1" arrivalPos="990.00" arrivalPosLat="0.00" arrivalSpeed="15.48" duration="170.90" routeLength="1996.47" waitingTime="16.55" waitingCount="2" stopTime="0.00" timeLoss="46.28" rerouteNo="1" devices="tripinfo_car_w2n_52 routing_car_w2n_52" vType="Car" speedFactor="1.16" vaporized=""/>
    <tripinfo id="car_w2n_80" depart="80.00" departLane="w2sep_1" departPos="3.60" departPosLat="0.00" departSpeed="13.90" departDelay="0.00" arrival="224.90" arrivalLane="c2n_1" arrivalPos="990.00" arrivalPosLat="0.00" arrivalSpeed="15.52" duration="144.90" routeLength="1996.47" waitingTime="0.65" waitingCount="1" stopTime="0.00" timeLoss="19.88" rerouteNo="1" devices="tripinfo_car_w2n_80 routing_car_w2n_80" vType="Car" speedFactor="1.15" vaporized=""/>
    <tripinfo id="car_e2n_95" depart="95.85" departLane="e2sep_1" departPos="3.60" departPosLat="0.00" departSpeed="13.90" departDelay="0.85" arrival="229.85" arrivalLane="c2n_1" arrivalPos="990.00" arrivalPosLat="0.00" arrivalSpeed="16.09" duration="134.00" routeLength="1986.69" waitingTime="0.00" waitingCount="0" stopTime="0.00" timeLoss="9.97" rerouteNo="1" devices="tripinfo_car_e2n_95 routing_car_e2n_95" vType="Car" speedFactor="1.16" vaporized=""/>
    <tripinfo id="car_e2s_94" depart="94.25" departLane="e2sep_1" departPos="3.60" departPosLat="0.00" departSpeed="13.90" departDelay="0.25" arrival="230.65" arrivalLane="c2s_1" arrivalPos="990.00" arrivalPosLat="0.00" arrivalSpeed="15.32" duration="136.40" routeLength="1996.47" waitingTime="0.00" waitingCount="0" stopTime="0.00" timeLoss="5.49" rerouteNo="1" devices="tripinfo_car_e2s_94 routing_car_e2s_94" vType="Car" speedFactor="1.10" vaporized=""/>
    <tripinfo id="car_e2w_97" depart="97.50" departLane="e2sep_1" departPos="3.60" departPosLat="0.00" departSpeed="13.90" departDelay="0.50" arrival="239.80" arrivalLane="c2w_1" arrivalPos="990.00" arrivalPosLat="0.00" arrivalSpeed="14.32" duration="142.30" routeLength="1997.01" waitingTime="0.00" waitingCount="0" stopTime="0.00" timeLoss="2.87" rerouteNo="1" devices="tripinfo_car_e2w_97 routing_car_e2w_97" vType="Car" speedFactor="1.03" vaporized=""/>
    <tripinfo id="bus_w2s_95" depart="95.00" departLane="w2sep_1" departPos="12.10" departPosLat="0.00" departSpeed="13.90" departDelay="0.00" arrival="243.80" arrivalLane="c2s_1" arrivalPos="990.00" arrivalPosLat="0.00" arrivalSpeed="13.90" duration="148.80" routeLength="1978.19" waitingTime="0.00" waitingCount="0" stopTime="0.00" timeLoss="5.74" rerouteNo="1" devices="tripinfo_bus_w2s_95 routing_bus_w2s_95" vType="Bus" speedFactor="1.00" vaporized=""/>
    <tripinfo id="car_n2s_66" depart="66.00" departLane="n2sep_1" departPos="3.60" departPosLat="0.00" departSpeed="13.90" departDelay="0.00" arrival="252.85" arrivalLane="c2s_1" arrivalPos="990.00" arrivalPosLat="0.00" arrivalSpeed="14.55" duration="186.85" routeLength="1997.01" waitingTime="42.00" waitingCount="1" stopTime="0.00" timeLoss="49.61" rerouteNo="1" devices="tripinfo_car_n2s_66 routing_car_n2s_66" vType="Car" speedFactor="1.05" vaporized=""/>
    <tripinfo id="car_s2e_52" depart="52.00" departLane="s2sep_1" departPos="3.60" departPosLat="0.00" departSpeed="13.90" departDelay="0.00" arrival="254.35" arrivalLane="c2e_1" arrivalPos="990.00" arrivalPosLat="0.00" arrivalSpeed="14.15" duration="202.35" routeLength="1986.69" waitingTime="54.05" waitingCount="1" stopTime="0.00" timeLoss="61.27" rerouteNo="1" devices="tripinfo_car_s2e_52 routing_car_s2e_52" vType="Car" speedFactor="1.02" vaporized=""/>
    <tripinfo id="car_s2n_64" depart="64.00" departLane="s2sep_1" departPos="3.60" departPosLat="0.00" departSpeed="13.90" departDelay="0.00" arrival="258.35" arrivalLane="c2n_1" arrivalPos="990.00" arrivalPosLat="0.00" arrivalSpeed="14.27" duration="194.35" routeLength="1997.01" waitingTime="44.60" waitingCount="1" stopTime="0.00" timeLoss="54.33" rerouteNo="1" devices="tripinfo_car_s2n_64 routing_car_s2n_64" vType="Car" speedFactor="1.03" vaporized=""/>
    <tripinfo id="car_n2s_93" depart="93.00" departLane="n2sep_1" departPos="3.60" departPosLat="0.00" departSpeed="13.90" departDelay="0.00" arrival="259.15" arrivalLane="c2s_1" arrivalPos="990.00" arrivalPosLat="0.00" arrivalSpeed="13.90" duration="166.15" routeLength="1997.01" waitingTime="11.75" waitingCount="1" stopTime="0.00" timeLoss="22.46" rerouteNo="1" devices="tripinfo_car_n2s_93 routing_car_n2s_93" vType="Car" speedFactor="1.00" vaporized=""/>
    <tripinfo id="car_s2e_54" depart="54.00" departLane="s2sep_1" departPos="3.60" departPosLat="0.00" departSpeed="13.90" departDelay="0.00" arrival="259.25" arrivalLane="c2e_1" arrivalPos="990.00" arrivalPosLat="0.00" arrivalSpeed="14.04" duration="205.25" routeLength="1986.69" waitingTime="50.70" waitingCount="1" stopTime="0.00" timeLoss="63.00" rerouteNo="1" devices="tripinfo_car_s2e_54 routing_car_s2e_54" vType="Car" speedFactor="1.01" vaporized=""/>
    <tripinfo id="car_s2n_67" depart="67.00" departLane="s2sep_1" departPos="3.60" departPosLat="0.00" departSpeed="13.90" departDelay="0.00" arrival="260.60" arrivalLane="c2n_1" arrivalPos="990.00" arrivalPosLat="0.00" arrivalSpeed="15.28" duration="193.60" routeLength="1997.01" waitingTime="43.75" waitingCount="1" stopTime="0.00" timeLoss="65.65" rerouteNo="1" devices="tripinfo_car_s2n_67 routing_car_s2n_67" vType="Car" speedFactor="1.12" vaporized=""/>
    <tripinfo id="car_n2s_104" depart="104.00" departLane="n2sep_1" departPos="3.60" departPosLat="0.00" departSpeed="13.90" departDelay="0.00" arrival="262.00" arrivalLane="c2s_1" arrivalPos="990.00" arrivalPosLat="0.00" arrivalSpeed="14.40" duration="158.00" routeLength="1997.01" waitingTime="5.65" waitingCount="1" stopTime="0.00" timeLoss="20.27" rerouteNo="1" devices="tripinfo_car_n2s_104 routing_car_n2s_104" vType="Car" speedFactor="1.04" vaporized=""/>
    <tripinfo id="car_n2s_106" depart="106.00" departLane="n2sep_1" departPos="3.60" departPosLat="0.00" departSpeed="13.90" departDelay="0.00" arrival="265.65" arrivalLane="c2s_1" arrivalPos="990.00" arrivalPosLat="0.00" arrivalSpeed="13.88" duration="159.65" routeLength="1997.01" waitingTime="1.05" waitingCount="1" stopTime="0.00" timeLoss="15.98" rerouteNo="1" devices="tripinfo_car_n2s_106 routing_car_n2s_106" vType="Car" speedFactor="1.00" vaporized=""/>
    <tripinfo id="car_s2n_68" depart="68.35" departLane="s2sep_1" departPos="3.60" departPosLat="0.00" departSpeed="13.90" departDelay="0.35" arrival="266.00" arrivalLane="c2n_1" arrivalPos="990.00" arrivalPosLat="0.00" arrivalSpeed="13.90" duration="197.65" routeLength="1997.01" waitingTime="39.60" waitingCount="1" stopTime="0.00" timeLoss="53.95" rerouteNo="1" devices="tripinfo_car_s2n_68 routing_car_s2n_68" vType="Car" speedFactor="1.00" vaporized=""/>
    <tripinfo id="car_s2n_74" depart="74.00" departLane="s2sep_1" departPos="3.60" departPosLat="0.00" departSpeed="13.90" departDelay="0.00" arrival="267.95" arrivalLane="c2n_1" arrivalPos="990.00" arrivalPosLat="0.00" arrivalSpeed="15.14" duration="193.95" routeLength="1997.01" waitingTime="39.00" waitingCount="1" stopTime="0.00" timeLoss="67.02" rerouteNo="1" devices="tripinfo_car_s2n_74 routing_car_s2n_74" vType="Car" speedFactor="1.13" vaporized=""/>
    <tripinfo id="car_s2e_74" depart="75.30" departLane="s2sep_1" departPos="3.60" departPosLat="0.00" departSpeed="13.90" departDelay="1.30" arrival="268.90" arrivalLane="c2e_1" arrivalPos="990.00" arrivalPosLat="0.00" arrivalSpeed="13.90" duration="193.60" routeLength="1986.69" waitingTime="35.60" waitingCount="1" stopTime="0.00" timeLoss="49.92" rerouteNo="1" devices="tripinfo_car_s2e_74 routing_car_s2e_74" vType="Car" speedFactor="1.00" vaporized=""/>
    <tripinfo id="car_s2n_82" depart="82.00" departLane="s2sep_1" departPos="3.60" departPosLat="0.00" departSpeed="13.90" departDelay="0.00" arrival="269.85" arrivalLane="c2n_1" arrivalPos="990.00" arrivalPosLat="0.00" arrivalSpeed="15.55" duration="187.85" routeLength="1997.01" waitingTime="32.30" waitingCount="1" stopTime="0.00" timeLoss="65.22" rerouteNo="1" devices="tripinfo_car_s2n_82 routing_car_s2n_82" vType="Car" speedFactor="1.17" vaporized=""/>
    <tripinfo id="car_s2e_80" depart="80.00" departLane="s2sep_1" departPos="3.60" departPosLat="0.00" departSpeed="13.90" departDelay="0.00" arrival="273.00" arrivalLane="c2e_1" arrivalPos="990.00" arrivalPosLat="0.00" arrivalSpeed="13.96" duration="193.00" routeLength="1986.69" waitingTime="32.85" waitingCount="1" stopTime="0.00" timeLoss="50.09" rerouteNo="1" devices="tripinfo_car_s2e_80 routing_car_s2e_80" vType="Car" speedFactor="1.01" vaporized=""/>
    <tripinfo id="car_s2e_99" depart="99.00" departLane="s2sep_1" departPos="3.60" departPosLat="0.00" departSpeed="13.90" departDelay="0.00" arrival="275.25" arrivalLane="c2e_1" arrivalPos="990.00" arrivalPosLat="0.00" arrivalSpeed="14.86" duration="176.25" routeLength="1986.69" waitingTime="23.85" waitingCount="1" stopTime="0.00" timeLoss="44.67" rerouteNo="1" devices="tripinfo_car_s2e_99 routing_car_s2e_99" vType="Car" speedFactor="1.09" vaporized=""/>
    <tripinfo id="car_s2n_87" depart="87.00" departLane="s2sep_1" departPos="3.60" departPosLat="0.00" departSpeed="13.90" departDelay="0.00" arrival="275.50" arrivalLane="c2n_1" arrivalPos="990.00" arrivalPosLat="0.00" arrivalSpeed="13.90" duration="188.50" routeLength="1997.01" waitingTime="28.65" waitingCount="1" stopTime="0.00" timeLoss="44.81" rerouteNo="1" devices="tripinfo_car_s2n_87 routing_car_s2n_87" vType="Car" speedFactor="1.00" vaporized=""/>
    <tripinfo id="car_n2s_142" depart="142.00" departLane="n2sep_1" departPos="3.60" departPosLat="0.00" departSpeed="13.90" departDelay="0.00" arrival="278.10" arrivalLane="c2s_1" arrivalPos="990.00" arrivalPosLat="0.00" arrivalSpeed="15.73" duration="136.10" routeLength="1997.01" waitingTime="0.00" waitingCount="0" stopTime="0.00" timeLoss="9.14" rerouteNo="1" devices="tripinfo_car_n2s_142 routing_car_n2s_142" vType="Car" speedFactor="1.13" vaporized=""/>
    <tripinfo id="car_s2e_116" depart="116.00" departLane="s2sep_1" departPos="3.60" departPosLat="0.00" departSpeed="13.90" departDelay="0.00" arrival="280.50" arrivalLane="c2e_1" arrivalPos="990.00" arrivalPosLat="0.00" arrivalSpeed="13.90" duration="164.50" routeLength="1986.69" waitingTime="2.90" waitingCount="1" stopTime="0.00" timeLoss="20.81" rerouteNo="1" devices="tripinfo_car_s2e_116 routing_car_s2e_116" vType="Car" speedFactor="1.00" vaporized=""/>
    <tripinfo id="car_s2e_142" depart="142.00" departLane="s2sep_1" departPos="3.60" departPosLat="0.00" departSpeed="13.90" departDelay="0.00" arrival="282.85" arrivalLane="c2e_1" arrivalPos="990.00" arrivalPosLat="0.00" arrivalSpeed="14.79" duration="140.85" routeLength="1986.69" waitingTime="0.00" waitingCount="0" stopTime="0.00" timeLoss="8.10" rerouteNo="1" devices="tripinfo_car_s2e_142 routing_car_s2e_142" vType="Car" speedFactor="1.08" vaporized=""/>
    <tripinfo id="car_n2w_139" depart="139.00" departLane="n2sep_1" departPos="3.60" departPosLat="0.00" departSpeed="13.90" departDelay="0.00" arrival="283.00" arrivalLane="c2w_1" arrivalPos="990.00" arrivalPosLat="0.00" arrivalSpeed="14.23" duration="144.00" routeLength="1986.69" waitingTime="0.00" waitingCount="0" stopTime="0.00" timeLoss="3.62" rerouteNo="1" devices="tripinfo_car_n2w_139 routing_car_n2w_139" vType="Car" speedFactor="1.02" vaporized=""/>
    <tripinfo id="car_n2e_90" depart="90.00" departLane="n2sep_1" departPos="3.60" departPosLat="0.00" departSpeed="13.90" departDelay="0.00" arrival="287.50" arrivalLane="c2e_1" arrivalPos="990.00" arrivalPosLat="0.00" arrivalSpeed="14.17" duration="197.50" routeLength="1996.47" waitingTime="43.60" waitingCount="2" stopTime="0.00" timeLoss="55.93" rerouteNo="1" devices="tripinfo_car_n2e_90 routing_car_n2e_90" vType="Car" speedFactor="1.02" vaporized=""/>
    <tripinfo id="car_e2w_104" depart="104.00" departLane="e2sep_1" departPos="3.60" departPosLat="0.00" departSpeed="13.90" departDelay="0.00" arrival="295.20" arrivalLane="c2w_1" arrivalPos="990.00" arrivalPosLat="0.00" arrivalSpeed="15.12" duration="191.20" routeLength="1997.01" waitingTime="49.55" waitingCount="1" stopTime="0.00" timeLoss="59.14" rerouteNo="1" devices="tripinfo_car_e2w_104 routing_car_e2w_104" vType="Car" speedFactor="1.09" vaporized=""/>
    <tripinfo id="car_w2s_99" depart="99.00" departLane="w2sep_1" departPos="3.60" departPosLat="0.00" departSpeed="13.90" departDelay="0.00" arrival="299.40" arrivalLane="c2s_1" arrivalPos="990.00" arrivalPosLat="0.00" arrivalSpeed="14.15" duration="200.40" routeLength="1986.69" waitingTime="50.80" waitingCount="1" stopTime="0.00" timeLoss="59.30" rerouteNo="1" devices="tripinfo_car_w2s_99 routing_car_w2s_99" vType="Car" speedFactor="1.02" vaporized=""/>
    <tripinfo id="car_e2w_105" depart="105.35" departLane="e2sep_1" departPos="3.60" departPosLat="0.00" departSpeed="13.90" departDelay="0.35" arrival="303.05" arrivalLane="c2w_1" arrivalPos="990.00" arrivalPosLat="0.00" arrivalSpeed="14.04" duration="197.70" routeLength="1997.01" waitingTime="44.65" waitingCount="1" stopTime="0.00" timeLoss="55.43" rerouteNo="1" devices="tripinfo_car_e2w_105 routing_car_e2w_105" vType="Car" speedFactor="1.01" vaporized=""/>
    <tripinfo id="car_w2s_100" depart="100.45" departLane="w2sep_1" departPos="3.60" departPosLat="0.00" departSpeed="13.90" departDelay="0.45" arrival="303.15" arrivalLane="c2s_1" arrivalPos="990.00" arrivalPosLat="0.00" arrivalSpeed="14.40" duration="202.70" routeLength="1986.69" waitingTime="49.05" waitingCount="1" stopTime="0.00" timeLoss="64.24" rerouteNo="1" devices="tripinfo_car_w2s_100 routing_car_w2s_100" vType="Car" speedFactor="1.04" vaporized=""/>
    <tripinfo id="car_w2e_127" depart="127.00" departLane="w2sep_1" departPos="3.60" departPosLat="0.00" departSpeed="13.90" departDelay="0.00" arrival="304.00" arrivalLane="c2e_1" arrivalPos="990.00" arrivalPosLat="0.00" arrivalSpeed="14.13" duration="177.00" routeLength="1997.01" waitingTime="26.10" waitingCount="1" stopTime="0.00" timeLoss="35.69" rerouteNo="1" devices="tripinfo_car_w2e_127 routing_car_w2e_127" vType="Car" speedFactor="1.02" vaporized=""/>
    <tripinfo id="car_e2n_106" depart="107.10" departLane="e2sep_1" departPos="3.60" departPosLat="0.00" departSpeed="13.90" departDelay="1.10" arrival="305.20" arrivalLane="c2n_1" arrivalPos="990.00" arrivalPosLat="0.00" arrivalSpeed="13.90" duration="198.10" routeLength="1986.69" waitingTime="41.90" waitingCount="1" stopTime="0.00" timeLoss="54.40" rerouteNo="1" devices="tripinfo_car_e2n_106 routing_car_e2n_106" vType="Car" speedFactor="1.00" vaporized=""/>
    <tripinfo id="car_w2e_139" depart="139.00" departLane="w2sep_1" departPos="3.60" departPosLat="0.00" departSpeed="13.90" departDelay="0.00" arrival="306.05" arrivalLane="c2e_1" arrivalPos="990.00" arrivalPosLat="0.00" arrivalSpeed="15.37" duration="167.05" routeLength="1997.01" waitingTime="22.40" waitingCount="1" stopTime="0.00" timeLoss="41.30" rerouteNo="1" devices="tripinfo_car_w2e_139 routing_car_w2e_139" vType="Car" speedFactor="1.14" vaporized=""/>
    <tripinfo id="car_e2s_122" depart="122.00" departLane="e2sep_1" departPos="3.60" departPosLat="0.00" departSpeed="13.90" departDelay="0.00" arrival="306.20" arrivalLane="c2s_1" arrivalPos="990.00" arrivalPosLat="0.00" arrivalSpeed="16.12" duration="184.20" routeLength="1996.47" waitingTime="42.05" waitingCount="2" stopTime="0.00" timeLoss="60.71" rerouteNo="1" devices="tripinfo_car_e2s_122 routing_car_e2s_122" vType="Car" speedFactor="1.17" vaporized=""/>
    <tripinfo id="car_e2w_116" depart="116.00" departLane="e2sep_1" departPos="3.60" departPosLat="0.00" departSpeed="13.90" departDelay="0.00" arrival="308.20" arrivalLane="c2w_1" arrivalPos="990.00" arrivalPosLat="0.00" arrivalSpeed="13.90" duration="192.20" routeLength="1997.01" waitingTime="36.90" waitingCount="1" stopTime="0.00" timeLoss="48.51" rerouteNo="1" devices="tripinfo_car_e2w_116 routing_car_e2w_116" vType="Car" speedFactor="1.00" vaporized=""/>
    <tripinfo id="car_w2e_170" depart="170.00" departLane="w2sep_1" departPos="3.60" departPosLat="0.00" departSpeed="13.90" departDelay="0.00" arrival="310.35" arrivalLane="c2e_1" arrivalPos="990.00" arrivalPosLat="0.00" arrivalSpeed="14.44" duration="140.35" routeLength="1997.01" waitingTime="0.00" waitingCount="0" stopTime="0.00" timeLoss="2.17" rerouteNo="1" devices="tripinfo_car_w2e_170 routing_car_w2e_170" vType="Car" speedFactor="1.04" vaporized=""/>
    <tripinfo id="car_e2w_127" depart="127.00" departLane="e2sep_1" departPos="3.60" departPosLat="0.00" departSpeed="13.90" departDelay="0.00" arrival="310.40" arrivalLane="c2w_1" arrivalPos="990.00" arrivalPosLat="0.00" arrivalSpeed="14.88" duration="183.40" routeLength="1997.01" waitingTime="32.70" waitingCount="1" stopTime="0.00" timeLoss="52.26" rerouteNo="1" devices="tripinfo_car_e2w_127 routing_car_e2w_127" vType="Car" speedFactor="1.10" vaporized=""/>
    <tripinfo id="car_e2n_133" depart="133.45" departLane="e2sep_1" departPos="3.60" departPosLat="0.00" departSpeed="13.90" departDelay="0.45" arrival="313.80" arrivalLane="c2n_1" arrivalPos="990.00" arrivalPosLat="0.00" arrivalSpeed="13.90" duration="180.35" routeLength="1986.69" waitingTime="21.30" waitingCount="1" stopTime="0.00" timeLoss="36.70" rerouteNo="1" devices="tripinfo_car_e2n_133 routing_car_e2n_133" vType="Car" speedFactor="1.00" vaporized=""/>
    <tripinfo id="car_e2w_132" depart="132.00" departLane="e2sep_1" departPos="3.60" departPosLat="0.00" departSpeed="13.90" departDelay="0.00" arrival="314.10" arrivalLane="c2w_1" arrivalPos="990.00" arrivalPosLat="0.00" arrivalSpeed="13.92" duration="182.10" routeLength="1997.01" waitingTime="23.80" waitingCount="1" stopTime="0.00" timeLoss="38.86" rerouteNo="1" devices="tripinfo_car_e2w_132 routing_car_e2w_132" vType="Car" speedFactor="1.00" vaporized=""/>
    <tripinfo id="car_e2n_136" depart="136.00" departLane="e2sep_1" departPos="3.60" departPosLat="0.00" departSpeed="13.90" departDelay="0.00" arrival="318.10" arrivalLane="c2n_1" arrivalPos="990.00" arrivalPosLat="0.00" arrivalSpeed="13.89" duration="182.10" routeLength="1986.69" waitingTime="19.25" waitingCount="1" stopTime="0.00" timeLoss="38.44" rerouteNo="1" devices="tripinfo_car_e2n_136 routing_car_e2n_136" vType="Car" speedFactor="1.00" vaporized=""/>
    <tripinfo id="car_e2w_173" depart="173.00" departLane="e2sep_1" departPos="3.60" departPosLat="0.00" departSpeed="13.90" departDelay="0.00" arrival="319.05" arrivalLane="c2w_1" arrivalPos="990.00" arrivalPosLat="0.00" arrivalSpeed="14.20" duration="146.05" routeLength="1997.01" waitingTime="0.00" waitingCount="0" stopTime="0.00" timeLoss="5.46" rerouteNo="1" devices="tripinfo_car_e2w_173 routing_car_e2w_173" vType="Car" speedFactor="1.02" vaporized=""/>
    <tripinfo id="car_e2n_150" depart="150.00" departLane="e2sep_1" departPos="3.60" departPosLat="0.00" departSpeed="13.90" departDelay="0.00" arrival="321.25" arrivalLane="c2n_1" arrivalPos="990.00" arrivalPosLat="0.00" arrivalSpeed="14.06" duration="171.25" routeLength="1986.69" waitingTime="10.70" waitingCount="1" stopTime="0.00" timeLoss="29.82" rerouteNo="1" devices="tripinfo_car_e2n_150 routing_car_e2n_150" vType="Car" speedFactor="1.02" vaporized=""/>
    <tripinfo id="car_w2n_179" depart="179.00" departLane="w2sep_1" departPos="3.60" departPosLat="0.00" departSpeed="13.90" departDelay="0.00" arrival="325.00" arrivalLane="c2n_1" arrivalPos="990.00" arrivalPosLat="0.00" arrivalSpeed="14.19" duration="146.00" routeLength="1996.47" waitingTime="0.00" waitingCount="0" stopTime="0.00" timeLoss="4.91" rerouteNo="1" devices="tripinfo_car_w2n_179 routing_car_w2n_179" vType="Car" speedFactor="1.02" vaporized=""/>
    <tripinfo id="bus_w2s_180" depart="181.00" departLane="w2sep_1" departPos="12.10" departPosLat="0.00" departSpeed="13.90" departDelay="1.00" arrival="331.70" arrivalLane="c2s_1" arrivalPos="990.00" arrivalPosLat="0.00" arrivalSpeed="13.90" duration="150.70" routeLength="1978.19" waitingTime="0.00" waitingCount="0" stopTime="0.00" timeLoss="7.63" rerouteNo="1" devices="tripinfo_bus_w2s_180 routing_bus_w2s_180" vType="Bus" speedFactor="1.00" vaporized=""/>
    <tripinfo id="car_w2n_190" depart="190.00" departLane="w2sep_1" departPos="3.60" departPosLat="0.00" departSpeed="13.90" departDelay="0.00" arrival="333.70" arrivalLane="c2n_1" arrivalPos="990.00" arrivalPosLat="0.00" arrivalSpeed="14.67" duration="143.70" routeLength="1996.47" waitingTime="0.00" waitingCount="0" stopTime="0.00" timeLoss="6.98" rerouteNo="1" devices="tripinfo_car_w2n_190 routing_car_w2n_190" vType="Car" speedFactor="1.06" vaporized=""/>
    <tripinfo id="car_e2s_186" depart="186.00" departLane="e2sep_1" departPos="3.60" departPosLat="0.00" departSpeed="13.90" departDelay="0.00" arrival="336.60" arrivalLane="c2s_1" arrivalPos="990.00" arrivalPosLat="0.00" arrivalSpeed="13.89" duration="150.60" routeLength="1996.47" waitingTime="0.00" waitingCount="0" stopTime="0.00" timeLoss="6.25" rerouteNo="1" devices="tripinfo_car_e2s_186 routing_car_e2s_186" vType="Car" speedFactor="1.00" vaporized=""/>
    <tripinfo id="car_s2n_169" depart="169.00" departLane="s2sep_1" departPos="3.60" departPosLat="0.00" departSpeed="13.90" departDelay="0.00" arrival="336.85" arrivalLane="c2n_1" arrivalPos="990.00" arrivalPosLat="0.00" arrivalSpeed="16.18" duration="167.85" routeLength="1997.01" waitingTime="35.75" waitingCount="1" stopTime="0.00" timeLoss="45.21" rerouteNo="1" devices="tripinfo_car_s2n_169 routing_car_s2n_169" vType="Car" speedFactor="1.17" vaporized=""/>
    <tripinfo id="car_n2w_144" depart="144.00" departLane="n2sep_1" departPos="3.60" departPosLat="0.00" departSpeed="13.90" departDelay="0.00" arrival="338.25" arrivalLane="c2w_1" arrivalPos="990.00" arrivalPosLat="0.00" arrivalSpeed="15.56" duration="194.25" routeLength="1986.69" waitingTime="53.10" waitingCount="1" stopTime="0.00" timeLoss="65.91" rerouteNo="1" devices="tripinfo_car_n2w_144 routing_car_n2w_144" vType="Car" speedFactor="1.12" vaporized=""/>
    <tripinfo id="car_n2s_161" depart="161.00" departLane="n2sep_1" departPos="3.60" departPosLat="0.00" departSpeed="13.90" departDelay="0.00" arrival="341.35" arrivalLane="c2s_1" arrivalPos="990.00" arrivalPosLat="0.00" arrivalSpeed="16.03" duration="180.35" routeLength="1997.01" waitingTime="41.80" waitingCount="1" stopTime="0.00" timeLoss="55.87" rerouteNo="1" devices="tripinfo_car_n2s_161 routing_car_n2s_161" vType="Car" speedFactor="1.15" vaporized=""/>
    <tripinfo id="car_s2e_202" depart="202.00" departLane="s2sep_1" departPos="3.60" departPosLat="0.00" departSpeed="13.90" departDelay="0.00" arrival="341.50" arrivalLane="c2e_1" arrivalPos="990.00" arrivalPosLat="0.00" arrivalSpeed="15.32" duration="139.50" routeLength="1986.69" waitingTime="0.00" waitingCount="0" stopTime="0.00" timeLoss="9.13" rerouteNo="1" devices="tripinfo_car_s2e_202 routing_car_s2e_202" vType="Car" speedFactor="1.10" vaporized=""/>
    <tripinfo id="car_n2e_158" depart="158.00" departLane="n2sep_1" departPos="3.60" departPosLat="0.00" departSpeed="13.90" departDelay="0.00" arrival="344.05" arrivalLane="c2e_1" arrivalPos="990.00" arrivalPosLat="0.00" arrivalSpeed="16.17" duration="186.05" routeLength="1996.47" waitingTime="42.65" waitingCount="2" stopTime="0.00" timeLoss="63.60" rerouteNo="1" devices="tripinfo_car_n2e_158 routing_car_n2e_158" vType="Car" speedFactor="1.18" vaporized=""/>
    <tripinfo id="car_n2w_152" depart="152.00" departLane="n2sep_1" departPos="3.60" departPosLat="0.00" departSpeed="13.90" departDelay="0.00" arrival="348.70" arrivalLane="c2w_1" arrivalPos="990.00" arrivalPosLat="0.00" arrivalSpeed="13.90" duration="196.70" routeLength="1986.69" waitingTime="43.85" waitingCount="1" stopTime="0.00" timeLoss="53.02" rerouteNo="1" devices="tripinfo_car_n2w_152 routing_car_n2w_152" vType="Car" speedFactor="1.00" vaporized=""/>
    <tripinfo id="car_n2s_199" depart="199.00" departLane="n2sep_1" departPos="3.60" departPosLat="0.00" departSpeed="13.90" departDelay="0.00" arrival="350.50" arrivalLane="c2s_1" arrivalPos="990.00" arrivalPosLat="0.00" arrivalSpeed="14.35" duration="151.50" routeLength="1997.01" waitingTime="0.70" waitingCount="1" stopTime="0.00" timeLoss="12.32" rerouteNo="1" devices="tripinfo_car_n2s_199 routing_car_n2s_199" vType="Car" speedFactor="1.03" vaporized=""/>
    <tripinfo id="car_n2w_208" depart="208.45" departLane="n2sep_1" departPos="3.60" departPosLat="0.00" departSpeed="13.90" departDelay="0.45" arrival="352.05" arrivalLane="c2w_1" arrivalPos="990.00" arrivalPosLat="0.00" arrivalSpeed="15.05" duration="143.60" routeLength="1986.69" waitingTime="0.00" waitingCount="0" stopTime="0.00" timeLoss="11.39" rerouteNo="1" devices="tripinfo_car_n2w_208 routing_car_n2w_208" vType="Car" speedFactor="1.09" vaporized=""/>
    <tripinfo id="car_s2n_215" depart="215.00" departLane="s2sep_1" departPos="3.60" departPosLat="0.00" departSpeed="13.90" departDelay="0.00" arrival="357.80" arrivalLane="c2n_1" arrivalPos="990.00" arrivalPosLat="0.00" arrivalSpeed="14.32" duration="142.80" routeLength="1997.01" waitingTime="0.00" waitingCount="0" stopTime="0.00" timeLoss="3.36" rerouteNo="1" devices="tripinfo_car_s2n_215 routing_car_s2n_215" vType="Car" speedFactor="1.03" vaporized=""/>
    <tripinfo id="car_s2e_211" depart="211.00" departLane="s2sep_1" departPos="3.60" departPosLat="0.00" departSpeed="13.90" departDelay="0.00" arrival="358.50" arrivalLane="c2e_1" arrivalPos="990.00" arrivalPosLat="0.00" arrivalSpeed="13.90" duration="147.50" routeLength="1986.69" waitingTime="0.00" waitingCount="0" stopTime="0.00" timeLoss="3.83" rerouteNo="1" devices="tripinfo_car_s2e_211 routing_car_s2e_211" vType="Car" speedFactor="1.00" vaporized=""/>
    <tripinfo id="car_s2n_216" depart="216.45" departLane="s2sep_1" departPos="3.60" departPosLat="0.00" departSpeed="13.90" departDelay="0.45" arrival="359.95" arrivalLane="c2n_1" arrivalPos="990.00" arrivalPosLat="0.00" arrivalSpeed="15.51" duration="143.50" routeLength="1997.01" waitingTime="0.00" waitingCount="0" stopTime="0.00" timeLoss="18.30" rerouteNo="1" devices="tripinfo_car_s2n_216 routing_car_s2n_216" vType="Car" speedFactor="1.15" vaporized=""/>
    <tripinfo id="car_n2e_168" depart="168.00" departLane="n2sep_1" departPos="3.60" departPosLat="0.00" departSpeed="13.90" departDelay="0.00" arrival="365.05" arrivalLane="c2e_1" arrivalPos="990.00" arrivalPosLat="0.00" arrivalSpeed="13.97" duration="197.05" routeLength="1996.47" waitingTime="36.80" waitingCount="2" stopTime="0.00" timeLoss="53.46" rerouteNo="1" devices="tripinfo_car_n2e_168 routing_car_n2e_168" vType="Car" speedFactor="1.01" vaporized=""/>
    <tripinfo id="car_n2s_222" depart="222.00" departLane="n2sep_1" departPos="3.60" departPosLat="0.00" departSpeed="13.90" departDelay="0.00" arrival="365.80" arrivalLane="c2s_1" arrivalPos="990.00" arrivalPosLat="0.00" arrivalSpeed="13.92" duration="143.80" routeLength="1997.01" waitingTime="0.00" waitingCount="0" stopTime="0.00" timeLoss="0.38" rerouteNo="1" devices="tripinfo_car_n2s_222 routing_car_n2s_222" vType="Car" speedFactor="1.00" vaporized=""/>
    <tripinfo id="car_n2s_224" depart="224.00" departLane="n2sep_1" departPos="3.60" departPosLat="0.00" departSpeed="13.90" departDelay="0.00" arrival="369.00" arrivalLane="c2s_1" arrivalPos="990.00" arrivalPosLat="0.00" arrivalSpeed="14.43" duration="145.00" routeLength="1997.01" waitingTime="0.00" waitingCount="0" stopTime="0.00" timeLoss="7.19" rerouteNo="1" devices="tripinfo_car_n2s_224 routing_car_n2s_224" vType="Car" speedFactor="1.04" vaporized=""/>
    <tripinfo id="car_n2e_190" depart="190.00" departLane="n2sep_1" departPos="3.60" departPosLat="0.00" departSpeed="13.90" departDelay="0.00" arrival="369.35" arrivalLane="c2e_1" arrivalPos="990.00" arrivalPosLat="0.00" arrivalSpeed="13.89" duration="179.35" routeLength="1996.47" waitingTime="14.70" waitingCount="2" stopTime="0.00" timeLoss="35.03" rerouteNo="1" devices="tripinfo_car_n2e_190 routing_car_n2e_190" vType="Car" speedFactor="1.00" vaporized=""/>
    <tripinfo id="car_n2e_193" depart="193.00" departLane="n2sep_1" departPos="3.60" departPosLat="0.00" departSpeed="13.90" departDelay="0.00" arrival="371.15" arrivalLane="c2e_1" arrivalPos="990.00" arrivalPosLat="0.00" arrivalSpeed="15.42" duration="178.15" routeLength="1996.47" waitingTime="11.80" waitingCount="2" stopTime="0.00" timeLoss="55.80" rerouteNo="1" devices="tripinfo_car_n2e_193 routing_car_n2e_193" vType="Car" speedFactor="1.18" vaporized=""/>
    <tripinfo id="car_n2w_226" depart="226.00" departLane="n2sep_1" departPos="3.60" departPosLat="0.00" departSpeed="13.90" departDelay="0.00" arrival="374.00" arrivalLane="c2w_1" arrivalPos="990.00" arrivalPosLat="0.00" arrivalSpeed="14.21" duration="148.00" routeLength="1986.69" waitingTime="0.00" waitingCount="0" stopTime="0.00" timeLoss="7.44" rerouteNo="1" devices="tripinfo_car_n2w_226 routing_car_n2w_226" vType="Car" speedFactor="1.02" vaporized=""/>
    <tripinfo id="car_s2e_229" depart="229.00" departLane="s2sep_1" departPos="3.60" departPosLat="0.00" departSpeed="13.90" departDelay="0.00" arrival="375.30" arrivalLane="c2e_1" arrivalPos="990.00" arrivalPosLat="0.00" arrivalSpeed="14.12" duration="146.30" routeLength="1986.69" waitingTime="0.00" waitingCount="0" stopTime="0.00" timeLoss="5.00" rerouteNo="1" devices="tripinfo_car_s2e_229 routing_car_s2e_229" vType="Car" speedFactor="1.02" vaporized=""/>
    <tripinfo id="car_n2e_207" depart="207.00" departLane="n2sep_1" departPos="3.60" departPosLat="0.00" departSpeed="13.90" departDelay="0.00" arrival="379.50" arrivalLane="c2e_1" arrivalPos="990.00" arrivalPosLat="0.00" arrivalSpeed="13.99" duration="172.50" routeLength="1996.47" waitingTime="7.25" waitingCount="2" stopTime="0.00" timeLoss="29.21" rerouteNo="1" devices="tripinfo_car_n2e_207 routing_car_n2e_207" vType="Car" speedFactor="1.01" vaporized=""/>
    <tripinfo id="car_n2e_209" depart="210.15" departLane="n2sep_1" departPos="3.60" departPosLat="0.00" departSpeed="13.90" departDelay="1.15" arrival="382.40" arrivalLane="c2e_1" arrivalPos="990.00" arrivalPosLat="0.00" arrivalSpeed="14.29" duration="172.25" routeLength="1996.47" waitingTime="5.95" waitingCount="2" stopTime="0.00" timeLoss="32.73" rerouteNo="1" devices="tripinfo_car_n2e_209 routing_car_n2e_209" vType="Car" speedFactor="1.03" vaporized=""/>
    <tripinfo id="bus_s2w_233" depart="233.00" departLane="s2sep_1" departPos="12.10" departPosLat="0.00" departSpeed="13.90" departDelay="0.00" arrival="383.10" arrivalLane="c2w_1" arrivalPos="990.00" arrivalPosLat="0.00" arrivalSpeed="13.90" duration="150.10" routeLength="1987.97" waitingTime="0.00" waitingCount="0" stopTime="0.00" timeLoss="6.40" rerouteNo="1" devices="tripinfo_bus_s2w_233 routing_bus_s2w_233" vType="Bus" speedFactor="1.00" vaporized=""/>
    <tripinfo id="car_n2e_235" depart="235.00" departLane="n2sep_1" departPos="3.60" departPosLat="0.00" departSpeed="13.90" departDelay="0.00" arrival="384.60" arrivalLane="c2e_1" arrivalPos="990.00" arrivalPosLat="0.00" arrivalSpeed="14.84" duration="149.60" routeLength="1996.47" waitingTime="0.00" waitingCount="0" stopTime="0.00" timeLoss="17.42" rerouteNo="1" devices="tripinfo_car_n2e_235 routing_car_n2e_235" vType="Car" speedFactor="1.09" vaporized=""/>
    <tripinfo id="car_w2s_187" depart="187.00" departLane="w2sep_1" departPos="3.60" departPosLat="0.00" departSpeed="13.90" departDelay="0.00" arrival="389.30" arrivalLane="c2s_1" arrivalPos="990.00" arrivalPosLat="0.00" arrivalSpeed="14.17" duration="202.30" routeLength="1986.69" waitingTime="53.00" waitingCount="1" stopTime="0.00" timeLoss="61.42" rerouteNo="1" devices="tripinfo_car_w2s_187 routing_car_w2s_187" vType="Car" speedFactor="1.02" vaporized=""/>
    <tripinfo id="car_e2n_218" depart="218.00" departLane="e2sep_1" departPos="3.60" departPosLat="0.00" departSpeed="13.90" departDelay="0.00" arrival="390.65" arrivalLane="c2n_1" arrivalPos="990.00" arrivalPosLat="0.00" arrivalSpeed="13.90" duration="172.65" routeLength="1986.69" waitingTime="21.95" waitingCount="1" stopTime="0.00" timeLoss="28.96" rerouteNo="1" devices="tripinfo_car_e2n_218 routing_car_e2n_218" vType="Car" speedFactor="1.00" vaporized=""/>
    <tripinfo id="car_w2s_215" depart="215.00" departLane="w2sep_1" departPos="3.60" departPosLat="0.00" departSpeed="13.90" departDelay="0.00" arrival="393.90" arrivalLane="c2s_1" arrivalPos="990.00" arrivalPosLat="0.00" arrivalSpeed="14.13" duration="178.90" routeLength="1986.69" waitingTime="27.00" waitingCount="1" stopTime="0.00" timeLoss="37.62" rerouteNo="1" devices="tripinfo_car_w2s_215 routing_car_w2s_215" vType="Car" speedFactor="1.02" vaporized=""/>
    <tripinfo id="car_w2e_226" depart="226.00" departLane="w2sep_1" departPos="3.60" departPosLat="0.00" departSpeed="13.90" departDelay="0.00" arrival="394.85" arrivalLane="c2e_1" arrivalPos="990.00" arrivalPosLat="0.00" arrivalSpeed="14.00" duration="168.85" routeLength="1997.01" waitingTime="16.40" waitingCount="1" stopTime="0.00" timeLoss="26.15" rerouteNo="1" devices="tripinfo_car_w2e_226 routing_car_w2e_226" vType="Car" speedFactor="1.01" vaporized=""/>
    <tripinfo id="car_w2s_241" depart="241.00" departLane="w2sep_1" departPos="3.60" departPosLat="0.00" departSpeed="13.90" departDelay="0.00" arrival="396.25" arrivalLane="c2s_1" arrivalPos="990.00" arrivalPosLat="0.00" arrivalSpeed="14.91" duration="155.25" routeLength="1986.69" waitingTime="7.75" waitingCount="1" stopTime="0.00" timeLoss="23.57" rerouteNo="1" devices="tripinfo_car_w2s_241 routing_car_w2s_241" vType="Car" speedFactor="1.09" vaporized=""/>
    <tripinfo id="car_w2s_242" depart="242.30" departLane="w2sep_1" departPos="3.60" departPosLat="0.00" departSpeed="13.90" departDelay="0.30" arrival="399.30" arrivalLane="c2s_1" arrivalPos="990.00" arrivalPosLat="0.00" arrivalSpeed="14.62" duration="157.00" routeLength="1986.69" waitingTime="4.10" waitingCount="1" stopTime="0.00" timeLoss="21.09" rerouteNo="1" devices="tripinfo_car_w2s_242 routing_car_w2s_242" vType="Car" speedFactor="1.06" vaporized=""/>
    <tripinfo id="amb_w2e_300" depart="300.00" departLane="w2sep_1" departPos="6.60" departPosLat="0.00" departSpeed="13.90" departDelay="0.00" arrival="400.55" arrivalLane="c2e_1" arrivalPos="990.00" arrivalPosLat="0.00" arrivalSpeed="20.82" duration="100.55" routeLength="1994.01" waitingTime="0.00" waitingCount="0" stopTime="0.00" timeLoss="4.87" rerouteNo="1" devices="tripinfo_amb_w2e_300 routing_amb_w2e_300 bluelight_amb_w2e_300 fcd_amb_w2e_300" vType="Ambulance" speedFactor="1.50" vaporized="">
        <example_device customValue1="0.00" customValue2="-1.00"/>
    </tripinfo>
    <tripinfo id="car_e2s_238" depart="238.00" departLane="e2sep_1" departPos="3.60" departPosLat="0.00" departSpeed="13.90" departDelay="0.00" arrival="402.80" arrivalLane="c2s_1" arrivalPos="990.00" arrivalPosLat="0.00" arrivalSpeed="14.47" duration="164.80" routeLength="1996.47" waitingTime="12.80" waitingCount="2" stopTime="0.00" timeLoss="26.49" rerouteNo="1" devices="tripinfo_car_e2s_238 routing_car_e2s_238" vType="Car" speedFactor="1.04" vaporized=""/>
    <tripinfo id="car_w2s_269" depart="269.00" departLane="w2sep_1" departPos="3.60" departPosLat="0.00" departSpeed="13.90" departDelay="0.00" arrival="405.10" arrivalLane="c2s_1" arrivalPos="990.00" arrivalPosLat="0.00" arrivalSpeed="15.28" duration="136.10" routeLength="1986.69" waitingTime="0.00" waitingCount="0" stopTime="0.00" timeLoss="8.00" rerouteNo="1" devices="tripinfo_car_w2s_269 routing_car_w2s_269" vType="Car" speedFactor="1.12" vaporized=""/>
    <tripinfo id="car_w2s_272" depart="272.00" departLane="w2sep_1" departPos="3.60" departPosLat="0.00" departSpeed="13.90" departDelay="0.00" arrival="409.10" arrivalLane="c2s_1" arrivalPos="990.00" arrivalPosLat="0.00" arrivalSpeed="15.23" duration="137.10" routeLength="1986.69" waitingTime="0.00" waitingCount="0" stopTime="0.00" timeLoss="6.11" rerouteNo="1" devices="tripinfo_car_w2s_272 routing_car_w2s_272" vType="Car" speedFactor="1.10" vaporized=""/>
    <tripinfo id="car_w2n_282" depart="282.00" departLane="w2sep_1" departPos="3.60" departPosLat="0.00" departSpeed="13.90" departDelay="0.00" arrival="420.30" arrivalLane="c2n_1" arrivalPos="990.00" arrivalPosLat="0.00" arrivalSpeed="14.91" duration="138.30" routeLength="1996.47" waitingTime="0.00" waitingCount="0" stopTime="0.00" timeLoss="3.74" rerouteNo="1" devices="tripinfo_car_w2n_282 routing_car_w2n_282" vType="Car" speedFactor="1.07" vaporized=""/>
    <tripinfo id="car_w2n_288" depart="288.00" departLane="w2sep_1" departPos="3.60" departPosLat="0.00" departSpeed="13.90" departDelay="0.00" arrival="422.60" arrivalLane="c2n_1" arrivalPos="990.00" arrivalPosLat="0.00" arrivalSpeed="15.92" duration="134.60" routeLength="1996.47" waitingTime="0.00" waitingCount="0" stopTime="0.00" timeLoss="11.13" rerouteNo="1" devices="tripinfo_car_w2n_288 routing_car_w2n_288" vType="Car" speedFactor="1.17" vaporized=""/>
    <tripinfo id="car_e2w_281" depart="281.45" departLane="e2sep_1" departPos="3.60" departPosLat="0.00" departSpeed="13.90" departDelay="0.45" arrival="429.50" arrivalLane="c2w_1" arrivalPos="990.00" arrivalPosLat="0.00" arrivalSpeed="13.90" duration="148.05" routeLength="1997.01" waitingTime="0.00" waitingCount="0" stopTime="0.00" timeLoss="4.36" rerouteNo="1" devices="tripinfo_car_e2w_281 routing_car_e2w_281" vType="Car" speedFactor="1.00" vaporized=""/>
    <tripinfo id="car_e2s_280" depart="280.00" departLane="e2sep_1" departPos="3.60" departPosLat="0.00" departSpeed="13.90" departDelay="0.00" arrival="431.40" arrivalLane="c2s_1" arrivalPos="990.00" arrivalPosLat="0.00" arrivalSpeed="13.90" duration="151.40" routeLength="1996.47" waitingTime="0.00" waitingCount="0" stopTime="0.00" timeLoss="7.07" rerouteNo="1" devices="tripinfo_car_e2s_280 routing_car_e2s_280" vType="Car" speedFactor="1.00" vaporized=""/>
    <tripinfo id="car_e2s_281" depart="283.30" departLane="e2sep_1" departPos="3.60" departPosLat="0.00" departSpeed="13.90" departDelay="2.30" arrival="436.50" arrivalLane="c2s_1" arrivalPos="990.00" arrivalPosLat="0.00" arrivalSpeed="13.90" duration="153.20" routeLength="1996.47" waitingTime="0.00" waitingCount="0" stopTime="0.00" timeLoss="8.89" rerouteNo="1" devices="tripinfo_car_e2s_281 routing_car_e2s_281" vType="Car" speedFactor="1.00" vaporized=""/>
    <tripinfo id="car_n2s_287" depart="287.00" departLane="n2sep_1" departPos="3.60" departPosLat="0.00" departSpeed="13.90" departDelay="0.00" arrival="443.50" arrivalLane="c2s_1" arrivalPos="990.00" arrivalPosLat="0.00" arrivalSpeed="14.80" duration="156.50" routeLength="1997.01" waitingTime="13.75" waitingCount="1" stopTime="0.00" timeLoss="21.58" rerouteNo="1" devices="tripinfo_car_n2s_287 routing_car_n2s_287" vType="Car" speedFactor="1.06" vaporized=""/>
    <tripinfo id="car_s2e_237" depart="237.00" departLane="s2sep_1" departPos="3.60" departPosLat="0.00" departSpeed="13.90" departDelay="0.00" arrival="444.80" arrivalLane="c2e_1" arrivalPos="990.00" arrivalPosLat="0.00" arrivalSpeed="14.42" duration="207.80" routeLength="1986.69" waitingTime="59.95" waitingCount="1" stopTime="0.00" timeLoss="69.34" rerouteNo="1" devices="tripinfo_car_s2e_237 routing_car_s2e_237" vType="Car" speedFactor="1.04" vaporized=""/>
    <tripinfo id="car_s2n_266" depart="266.00" departLane="s2sep_1" departPos="3.60" departPosLat="0.00" departSpeed="13.90" departDelay="0.00" arrival="446.20" arrivalLane="c2n_1" arrivalPos="990.00" arrivalPosLat="0.00" arrivalSpeed="15.12" duration="180.20" routeLength="1997.01" waitingTime="38.05" waitingCount="1" stopTime="0.00" timeLoss="48.12" rerouteNo="1" devices="tripinfo_car_s2n_266 routing_car_s2n_266" vType="Car" speedFactor="1.09" vaporized=""/>
    <tripinfo id="car_n2s_300" depart="300.00" departLane="n2sep_1" departPos="3.60" departPosLat="0.00" departSpeed="13.90" departDelay="0.00" arrival="450.50" arrivalLane="c2s_1" arrivalPos="990.00" arrivalPosLat="0.00" arrivalSpeed="13.90" duration="150.50" routeLength="1997.01" waitingTime="0.00" waitingCount="0" stopTime="0.00" timeLoss="6.81" rerouteNo="1" devices="tripinfo_car_n2s_300 routing_car_n2s_300" vType="Car" speedFactor="1.00" vaporized=""/>
    <tripinfo id="car_s2e_247" depart="247.00" departLane="s2sep_1" departPos="3.60" departPosLat="0.00" departSpeed="13.90" departDelay="0.00" arrival="450.55" arrivalLane="c2e_1" arrivalPos="990.00" arrivalPosLat="0.00" arrivalSpeed="14.04" duration="203.55" routeLength="1986.69" waitingTime="51.15" waitingCount="1" stopTime="0.00" timeLoss="61.28" rerouteNo="1" devices="tripinfo_car_s2e_247 routing_car_s2e_247" vType="Car" speedFactor="1.01" vaporized=""/>
    <tripinfo id="car_n2s_302" depart="302.00" departLane="n2sep_1" departPos="3.60" departPosLat="0.00" departSpeed="13.90" departDelay="0.00" arrival="453.60" arrivalLane="c2s_1" arrivalPos="990.00" arrivalPosLat="0.00" arrivalSpeed="14.27" duration="151.60" routeLength="1997.01" waitingTime="0.00" waitingCount="0" stopTime="0.00" timeLoss="12.28" rerouteNo="1" devices="tripinfo_car_n2s_302 routing_car_n2s_302" vType="Car" speedFactor="1.03" vaporized=""/>
    <tripinfo id="car_s2e_293" depart="294.60" departLane="s2sep_1" departPos="3.60" departPosLat="0.00" departSpeed="13.90" departDelay="1.60" arrival="454.30" arrivalLane="c2e_1" arrivalPos="990.00" arrivalPosLat="0.00" arrivalSpeed="16.30" duration="159.70" routeLength="1986.69" waitingTime="8.60" waitingCount="1" stopTime="0.00" timeLoss="37.62" rerouteNo="1" devices="tripinfo_car_s2e_293 routing_car_s2e_293" vType="Car" speedFactor="1.18" vaporized=""/>
    <tripinfo id="car_s2w_272" depart="272.00" departLane="s2sep_1" departPos="3.60" departPosLat="0.00" departSpeed="13.90" departDelay="0.00" arrival="454.50" arrivalLane="c2w_1" arrivalPos="990.00" arrivalPosLat="0.00" arrivalSpeed="14.80" duration="182.50" routeLength="1996.47" waitingTime="35.35" waitingCount="2" stopTime="0.00" timeLoss="46.97" rerouteNo="1" devices="tripinfo_car_s2w_272 routing_car_s2w_272" vType="Car" speedFactor="1.07" vaporized=""/>
    <tripinfo id="car_s2n_276" depart="276.00" departLane="s2sep_1" departPos="3.60" departPosLat="0.00" departSpeed="13.90" departDelay="0.00" arrival="454.65" arrivalLane="c2n_1" arrivalPos="990.00" arrivalPosLat="0.00" arrivalSpeed="13.90" duration="178.65" routeLength="1997.01" waitingTime="23.55" waitingCount="1" stopTime="0.00" timeLoss="34.95" rerouteNo="1" devices="tripinfo_car_s2n_276 routing_car_s2n_276" vType="Car" speedFactor="1.00" vaporized=""/>
    <tripinfo id="car_n2s_308" depart="308.00" departLane="n2sep_1" departPos="3.60" departPosLat="0.00" departSpeed="13.90" departDelay="0.00" arrival="455.50" arrivalLane="c2s_1" arrivalPos="990.00" arrivalPosLat="0.00" arrivalSpeed="15.33" duration="147.50" routeLength="1997.01" waitingTime="0.00" waitingCount="0" stopTime="0.00" timeLoss="22.86" rerouteNo="1" devices="tripinfo_car_n2s_308 routing_car_n2s_308" vType="Car" speedFactor="1.15" vaporized=""/>
    <tripinfo id="car_s2n_282" depart="282.00" departLane="s2sep_1" departPos="3.60" departPosLat="0.00" departSpeed="13.90" departDelay="0.00" arrival="458.25" arrivalLane="c2n_1" arrivalPos="990.00" arrivalPosLat="0.00" arrivalSpeed="14.07" duration="176.25" routeLength="1997.01" waitingTime="19.75" waitingCount="1" stopTime="0.00" timeLoss="34.55" rerouteNo="1" devices="tripinfo_car_s2n_282 routing_car_s2n_282" vType="Car" speedFactor="1.01" vaporized=""/>
    <tripinfo id="car_n2s_310" depart="310.00" departLane="n2sep_1" departPos="3.60" departPosLat="0.00" departSpeed="13.90" departDelay="0.00" arrival="459.20" arrivalLane="c2s_1" arrivalPos="990.00" arrivalPosLat="0.00" arrivalSpeed="13.88" duration="149.20" routeLength="1997.01" waitingTime="0.00" waitingCount="0" stopTime="0.00" timeLoss="5.50" rerouteNo="1" devices="tripinfo_car_n2s_310 routing_car_n2s_310" vType="Car" speedFactor="1.00" vaporized=""/>
    <tripinfo id="car_s2n_285" depart="285.00" departLane="s2sep_1" departPos="3.60" departPosLat="0.00" departSpeed="13.90" departDelay="0.00" arrival="461.10" arrivalLane="c2n_1" arrivalPos="990.00" arrivalPosLat="0.00" arrivalSpeed="14.28" duration="176.10" routeLength="1997.01" waitingTime="17.80" waitingCount="1" stopTime="0.00" timeLoss="37.18" rerouteNo="1" devices="tripinfo_car_s2n_285 routing_car_s2n_285" vType="Car" speedFactor="1.03" vaporized=""/>
    <tripinfo id="car_s2e_300" depart="300.00" departLane="s2sep_1" departPos="3.60" departPosLat="0.00" departSpeed="13.90" departDelay="0.00" arrival="461.95" arrivalLane="c2e_1" arrivalPos="990.00" arrivalPosLat="0.00" arrivalSpeed="15.33" duration="161.95" routeLength="1986.69" waitingTime="6.25" waitingCount="1" stopTime="0.00" timeLoss="31.73" rerouteNo="1" devices="tripinfo_car_s2e_300 routing_car_s2e_300" vType="Car" speedFactor="1.10" vaporized=""/>
    <tripinfo id="car_n2w_313" depart="313.55" departLane="n2sep_1" departPos="3.60" departPosLat="0.00" departSpeed="13.90" departDelay="0.55" arrival="463.60" arrivalLane="c2w_1" arrivalPos="990.00" arrivalPosLat="0.00" arrivalSpeed="14.02" duration="150.05" routeLength="1986.69" waitingTime="0.00" waitingCount="0" stopTime="0.00" timeLoss="7.56" rerouteNo="1" devices="tripinfo_car_n2w_313 routing_car_n2w_313" vType="Car" speedFactor="1.01" vaporized=""/>
    <tripinfo id="car_s2n_287" depart="287.00" departLane="s2sep_1" departPos="3.60" departPosLat="0.00" departSpeed="13.90" departDelay="0.00" arrival="464.45" arrivalLane="c2n_1" arrivalPos="990.00" arrivalPosLat="0.00" arrivalSpeed="13.86" duration="177.45" routeLength="1997.01" waitingTime="14.85" waitingCount="1" stopTime="0.00" timeLoss="33.75" rerouteNo="1" devices="tripinfo_car_s2n_287 routing_car_s2n_287" vType="Car" speedFactor="1.00" vaporized=""/>
</tripinfos>
