<?xml version="1.0" encoding="UTF-8"?>

<!-- generated on Sat Apr 24 18:27:29 2021 by Eclipse SUMO Version 1.4.0
<configuration xmlns:xsi="http://www.w3.org/2001/XMLSchema-instance" xsi:noNamespaceSchemaLocation="http://sumo.dlr.de/xsd/sumoConfiguration.xsd">

    <input>
        <net-file value="sumofiles/junction.net.xml"/>
        <route-files value="sumofiles/junction_preemption_155.rou.xml"/>
        <additional-files value="sumofiles/junction.det.xml"/>
    </input>

    <output>
        <tripinfo-output value="sumofiles/output/tripinfo_preemption_155.xml"/>
    </output>

    <time>
        <begin value="0"/>
        <end value="10000"/>
        <step-length value="0.05"/>
    </time>

    <processing>
        <lateral-resolution value="0.1"/>
    </processing>

    <report>
        <no-warnings value="true"/>
        <error-log value="sumofiles/output/errorlog_preemption_155.log"/>
        <no-step-log value="true"/>
    </report>

    <traci_server>
        <remote-port value="34595"/>
    </traci_server>

    <gui_only>
        <gui-settings-file value="sumofiles/junction-gui.settings.xml"/>
        <tracker-interval value="0.05"/>
    </gui_only>

</configuration>
-->

<tripinfos xmlns:xsi="http://www.w3.org/2001/XMLSchema-instance" xsi:noNamespaceSchemaLocation="http://sumo.dlr.de/xsd/tripinfo_file.xsd">
    <tripinfo id="car_e2n_1" depart="1.00" departLane="e2sep_1" departPos="3.60" departPosLat="0.00" departSpeed="13.90" departDelay="0.00" arrival="140.30" arrivalLane="c2n_1" arrivalPos="990.00" arrivalPosLat="0.00" arrivalSpeed="14.73" duration="139.30" routeLength="1986.69" waitingTime="0.00" waitingCount="0" stopTime="0.00" timeLoss="3.74" rerouteNo="1" devices="tripinfo_car_e2n_1 routing_car_e2n_1" vType="Car" speedFactor="1.06" vaporized=""/>
    <tripinfo id="car_w2n_3" depart="3.00" departLane="w2sep_1" departPos="3.60" departPosLat="0.00" departSpeed="13.90" departDelay="0.00" arrival="144.70" arrivalLane="c2n_1" arrivalPos="990.00" arrivalPosLat="0.00" arrivalSpeed="14.72" duration="141.70" routeLength="1996.47" waitingTime="0.00" waitingCount="0" stopTime="0.00" timeLoss="5.50" rerouteNo="1" devices="tripinfo_car_w2n_3 routing_car_w2n_3" vType="Car" speedFactor="1.06" vaporized=""/>
    <tripinfo id="car_e2s_3" depart="3.00" departLane="e2sep_1" departPos="3.60" departPosLat="0.00" departSpeed="13.90" departDelay="0.00" arrival="147.70" arrivalLane="c2s_1" arrivalPos="990.00" arrivalPosLat="0.00" arrivalSpeed="15.05" duration="144.70" routeLength="1996.47" waitingTime="1.60" waitingCount="1" stopTime="0.00" timeLoss="11.40" rerouteNo="1" devices="tripinfo_car_e2s_3 routing_car_e2s_3" vType="Car" speedFactor="1.08" vaporized=""/>
    <tripinfo id="car_w2e_3" depart="4.35" departLane="w2sep_1" departPos="3.60" departPosLat="0.00" departSpeed="13.90" departDelay="1.35" arrival="148.30" arrivalLane="c2e_1" arrivalPos="990.00" arrivalPosLat="0.00" arrivalSpeed="14.04" duration="143.95" routeLength="1997.01" waitingTime="0.00" waitingCount="0" stopTime="0.00" timeLoss="1.74" rerouteNo="1" devices="tripinfo_car_w2e_3 routing_car_w2e_3" vType="Car" speedFactor="1.01" vaporized=""/>
    <tripinfo id="car_e2s_12" depart="12.00" departLane="e2sep_1" departPos="3.60" departPosLat="0.00" departSpeed="13.90" departDelay="0.00" arrival="158.50" arrivalLane="c2s_1" arrivalPos="990.00" arrivalPosLat="0.00" arrivalSpeed="14.04" duration="146.50" routeLength="1996.47" waitingTime="0.00" waitingCount="0" stopTime="0.00" timeLoss="3.68" rerouteNo="1" devices="tripinfo_car_e2s_12 routing_car_e2s_12" vType="Car" speedFactor="1.01" vaporized=""/>
    <tripinfo id="car_s2n_16" depart="16.00" departLane="s2sep_1" departPos="3.60" departPosLat="0.00" departSpeed="13.90" departDelay="0.00" arrival="163.95" arrivalLane="c2n_1" arrivalPos="990.00" arrivalPosLat="0.00" arrivalSpeed="14.27" duration="147.95" routeLength="1997.01" waitingTime="0.25" waitingCount="1" stopTime="0.00" timeLoss="7.95" rerouteNo="1" devices="tripinfo_car_s2n_16 routing_car_s2n_16" vType="Car" speedFactor="1.03" vaporized=""/>
    <tripinfo id="car_n2s_7" depart="7.00" departLane="n2sep_1" departPos="3.60" departPosLat="0.00" departSpeed="13.90" departDelay="0.00" arrival="166.15" arrivalLane="c2s_1" arrivalPos="990.00" arrivalPosLat="0.00" arrivalSpeed="13.90" duration="159.15" routeLength="1997.01" waitingTime="7.95" waitingCount="1" stopTime="0.00" timeLoss="15.45" rerouteNo="1" devices="tripinfo_car_n2s_7 routing_car_n2s_7" vType="Car" speedFactor="1.00" vaporized=""/>
    <tripinfo id="bus_n2w_8" depart="9.05" departLane="n2sep_1" departPos="12.10" departPosLat="0.00" departSpeed="13.90" departDelay="1.05" arrival="171.30" arrivalLane="c2w_1" arrivalPos="990.00" arrivalPosLat="0.00" arrivalSpeed="13.90" duration="162.25" routeLength="1978.19" waitingTime="5.80" waitingCount="1" stopTime="0.00" timeLoss="19.18" rerouteNo="1" devices="tripinfo_bus_n2w_8 routing_bus_n2w_8" vType="Bus" speedFactor="1.00" vaporized=""/>
    <tripinfo id="car_n2w_26" depart="26.00" departLane="n2sep_1" departPos="3.60" departPosLat="0.00" departSpeed="13.90" departDelay="0.00" arrival="174.80" arrivalLane="c2w_1" arrivalPos="990.00" arrivalPosLat="0.00" arrivalSpeed="14.49" duration="148.80" routeLength="1986.69" waitingTime="0.00" waitingCount="0" stopTime="0.00" timeLoss="11.60" rerouteNo="1" devices="tripinfo_car_n2w_26 routing_car_n2w_26" vType="Car" speedFactor="1.05" vaporized=""/>
    <tripinfo id="car_s2w_12" depart="12.00" departLane="s2sep_1" departPos="3.60" departPosLat="0.00" departSpeed="13.90" departDelay="0.00" arrival="177.25" arrivalLane="c2w_1" arrivalPos="990.00" arrivalPosLat="0.00" arrivalSpeed="14.84" duration="165.25" routeLength="1996.47" waitingTime="14.35" waitingCount="2" stopTime="0.00" timeLoss="31.91" rerouteNo="1" devices="tripinfo_car_s2w_12 routing_car_s2w_12" vType="Car" speedFactor="1.08" vaporized=""/>
    <tripinfo id="car_s2e_38" depart="38.00" departLane="s2sep_1" departPos="3.60" departPosLat="0.00" departSpeed="13.90" departDelay="0.00" arrival="182.75" arrivalLane="c2e_1" arrivalPos="990.00" arrivalPosLat="0.00" arrivalSpeed="14.15" duration="144.75" routeLength="1986.69" waitingTime="0.00" waitingCount="0" stopTime="0.00" timeLoss="3.59" rerouteNo="1" devices="tripinfo_car_s2e_38 routing_car_s2e_38" vType="Car" speedFactor="1.02" vaporized=""/>
    <tripinfo id="car_s2e_56" depart="56.00" departLane="s2sep_1" departPos="3.60" departPosLat="0.00" departSpeed="13.90" departDelay="0.00" arrival="186.00" arrivalLane="c2e_1" arrivalPos="990.00" arrivalPosLat="0.00" arrivalSpeed="15.95" duration="130.00" routeLength="1986.69" waitingTime="0.00" waitingCount="0" stopTime="0.00" timeLoss="5.53" rerouteNo="1" devices="tripinfo_car_s2e_56 routing_car_s2e_56" vType="Car" speedFactor="1.15" vaporized=""/>
    <tripinfo id="car_n2s_49" depart="49.00" departLane="n2sep_1" departPos="3.60" departPosLat="0.00" departSpeed="13.90" departDelay="0.00" arrival="186.45" arrivalLane="c2s_1" arrivalPos="990.00" arrivalPosLat="0.00" arrivalSpeed="14.55" duration="137.45" routeLength="1997.01" waitingTime="0.00" waitingCount="0" stopTime="0.00" timeLoss="0.21" rerouteNo="1" devices="tripinfo_car_n2s_49 routing_car_n2s_49" vType="Car" speedFactor="1.05" vaporized=""/>
    <tripinfo id="car_n2e_52" depart="52.00" departLane="n2sep_1" departPos="3.60" departPosLat="0.00" departSpeed="13.90" departDelay="0.00" arrival="200.45" arrivalLane="c2e_1" arrivalPos="990.00" arrivalPosLat="0.00" arrivalSpeed="13.90" duration="148.45" routeLength="1996.47" waitingTime="0.00" waitingCount="0" stopTime="0.00" timeLoss="4.15" rerouteNo="1" devices="tripinfo_car_n2e_52 routing_car_n2e_52" vType="Car" speedFactor="1.00" vaporized=""/>
    <tripinfo id="car_w2s_6" depart="6.10" departLane="w2sep_1" departPos="3.60" departPosLat="0.00" departSpeed="13.90" departDelay="0.10" arrival="208.60" arrivalLane="c2s_1" arrivalPos="990.00" arrivalPosLat="0.00" arrivalSpeed="14.32" duration="202.50" routeLength="1986.69" waitingTime="51.70" waitingCount="1" stopTime="0.00" timeLoss="63.06" rerouteNo="1" devices="tripinfo_car_w2s_6 routing_car_w2s_6" vType="Car" speedFactor="1.03" vaporized=""/>
    <tripinfo id="car_e2w_13" depart="13.45" departLane="e2sep_1" departPos="3.60" departPosLat="0.00" departSpeed="13.90" departDelay="0.45" arrival="208.65" arrivalLane="c2w_1" arrivalPos="990.00" arrivalPosLat="0.00" arrivalSpeed="14.32" duration="195.20" routeLength="1997.01" waitingTime="45.30" waitingCount="1" stopTime="0.00" timeLoss="55.75" rerouteNo="1" devices="tripinfo_car_e2w_13 routing_car_e2w_13" vType="Car" speedFactor="1.03" vaporized=""/>
    <tripinfo id="car_e2w_28" depart="28.00" departLane="e2sep_1" departPos="3.60" departPosLat="0.00" departSpeed="13.90" departDelay="0.00" arrival="211.00" arrivalLane="c2w_1" arrivalPos="990.00" arrivalPosLat="0.00" arrivalSpeed="15.32" duration="183.00" routeLength="1997.01" waitingTime="39.75" waitingCount="1" stopTime="0.00" timeLoss="55.02" rerouteNo="1" devices="tripinfo_car_e2w_28 routing_car_e2w_28" vType="Car" speedFactor="1.12" vaporized=""/>
    <tripinfo id="car_w2s_11" depart="11.00" departLane="w2sep_1" departPos="3.60" departPosLat="0.00" departSpeed="13.90" departDelay="0.00" arrival="212.45" arrivalLane="c2s_1" arrivalPos="990.00" arrivalPosLat="0.00" arrivalSpeed="14.51" duration="201.45" routeLength="1986.69" waitingTime="50.00" waitingCount="1" stopTime="0.00" timeLoss="64.08" rerouteNo="1" devices="tripinfo_car_w2s_11 routing_car_w2s_11" vType="Car" speedFactor="1.05" vaporized=""/>
    <tripinfo id="car_w2e_33" depart="33.00" departLane="w2sep_1" departPos="3.60" departPosLat="0.00" departSpeed="13.90" departDelay="0.00" arrival="214.50" arrivalLane="c2e_1" arrivalPos="990.00" arrivalPosLat="0.00" arrivalSpeed="14.54" duration="181.50" routeLength="1997.01" waitingTime="30.70" waitingCount="1" stopTime="0.00" timeLoss="44.10" rerouteNo="1" devices="tripinfo_car_w2e_33 routing_car_w2e_33" vType="Car" speedFactor="1.05" vaporized=""/>
    <tripinfo id="car_e2n_41" depart="41.00" departLane="e2sep_1" departPos="3.60" departPosLat="0.00" departSpeed="13.90" departDelay="0.00" arrival="216.55" arrivalLane="c2n_1" arrivalPos="990.00" arrivalPosLat="0.00" arrivalSpeed="14.04" duration="175.55" routeLength="1986.69" waitingTime="22.00" waitingCount="1" stopTime="0.00" timeLoss="33.35" rerouteNo="1" devices="tripinfo_car_e2n_41 routing_car_e2n_41" vType="Car" speedFactor="1.01" vaporized=""/>
    <tripinfo id="car_e2w_37" depart="37.00" departLane="e2sep_1" departPos="3.60" departPosLat="0.00" departSpeed="13.90" departDelay="0.00" arrival="216.60" arrivalLane="c2w_1" arrivalPos="990.00" arrivalPosLat="0.00" arrivalSpeed="13.90" duration="179.60" routeLength="1997.01" waitingTime="24.95" waitingCount="1" stopTime="0.00" timeLoss="35.90" rerouteNo="1" devices="tripinfo_car_e2w_37 routing_car_e2w_37" vType="Car" speedFactor="1.00" vaporized=""/>
    <tripinfo id="car_w2s_30" depart="30.00" departLane="w2sep_1" departPos="3.60" departPosLat="0.00" departSpeed="13.90" departDelay="0.00" arrival="217.55" arrivalLane="c2s_1" arrivalPos="990.00" arrivalPosLat="0.00" arrivalSpeed="13.90" duration="187.55" routeLength="1986.69" waitingTime="32.00" waitingCount="1" stopTime="0.00" timeLoss="43.89" rerouteNo="1" devices="tripinfo_car_w2s_30 routing_car_w2s_30" vType="Car" speedFactor="1.00" vaporized=""/>
    <tripinfo id="car_e2n_55" depart="55.45" departLane="e2sep_1" departPos="3.60" departPosLat="0.00" departSpeed="13.90" departDelay="0.45" arrival="218.45" arrivalLane="c2n_1" arrivalPos="990.00" arrivalPosLat="0.00" arrivalSpeed="15.58" duration="163.00" routeLength="1986.69" waitingTime="8.95" waitingCount="1" stopTime="0.00" timeLoss="41.09" rerouteNo="1" devices="tripinfo_car_e2n_55 routing_car_e2n_55" vType="Car" speedFactor="1.18" vaporized=""/>
    <tripinfo id="car_w2s_38" depart="39.40" departLane="w2sep_1" departPos="3.60" departPosLat="0.00" departSpeed="13.90" departDelay="1.40" arrival="219.40" arrivalLane="c2s_1" arrivalPos="990.00" arrivalPosLat="0.00" arrivalSpeed="15.31" duration="180.00" routeLength="1986.69" waitingTime="23.10" waitingCount="1" stopTime="0.00" timeLoss="55.98" rerouteNo="1" devices="tripinfo_car_w2s_38 routing_car_w2s_38" vType="Car" speedFactor="1.16" vaporized=""/>
    <tripinfo id="car_e2n_78" depart="78.00" departLane="e2sep_1" departPos="3.60" departPosLat="0.00" departSpeed="13.90" departDelay="0.00" arrival="220.35" arrivalLane="c2n_1" arrivalPos="990.00" arrivalPosLat="0.00" arrivalSpeed="15.72" duration="142.35" routeLength="1986.69" waitingTime="0.00" waitingCount="0" stopTime="0.00" timeLoss="20.57" rerouteNo="1" devices="tripinfo_car_e2n_78 routing_car_e2n_78" vType="Car" speedFactor="1.18" vaporized=""/>
    <tripinfo id="car_w2e_37" depart="37.55" departLane="w2sep_1" departPos="3.60" departPosLat="0.00" departSpeed="13.90" departDelay="0.55" arrival="220.80" arrivalLane="c2e_1" arrivalPos="990.00" arrivalPosLat="0.00" arrivalSpeed="13.90" duration="183.25" routeLength="1997.01" waitingTime="23.60" waitingCount="1" stopTime="0.00" timeLoss="39.57" rerouteNo="1" devices="tripinfo_car_w2e_37 routing_car_w2e_37" vType="Car" speedFactor="1.00" vaporized=""/>
    <tripinfo id="car_w2e_49" depart="49.00" departLane="w2sep_1" departPos="3.60" departPosLat="0.00" departSpeed="13.90" departDelay="0.00" arrival="224.20" arrivalLane="c2e_1" arrivalPos="990.00" arrivalPosLat="0.00" arrivalSpeed="14.22" duration="175.20" routeLength="1997.01" waitingTime="19.55" waitingCount="1" stopTime="0.00" timeLoss="35.19" rerouteNo="1" devices="tripinfo_car_w2e_49 routing_car_w2e_49" vType="Car" speedFactor="1.03" vaporized=""/>
    <tripinfo id="car_w2n_36" depart="36.00" departLane="w2sep_1" departPos="3.60" departPosLat="0.00" departSpeed="13.90" departDelay="0.00" arrival="226.15" arrivalLane="c2n_1" arrivalPos="990.00" arrivalPosLat="0.00" arrivalSpeed="13.90" duration="190.15" routeLength="1996.47" waitingTime="32.35" waitingCount="2" stopTime="0.00" timeLoss="45.80" rerouteNo="1" devices="tripinfo_car_w2n_36 routing_car_w2n_36" vType="Car" speedFactor="1.00" vaporized=""/>
    <tripinfo id="car_w2s_62" depart="62.00" departLane="w2sep_1" departPos="3.60" departPosLat="0.00" departSpeed="13.90" departDelay="0.00" arrival="226.25" arrivalLane="c2s_1" arrivalPos="990.00" arrivalPosLat="0.00" arrivalSpeed="13.97" duration="164.25" routeLength="1986.69" waitingTime="6.75" waitingCount="1" stopTime="0.00" timeLoss="21.31" rerouteNo="1" devices="tripinfo_car_w2s_62 routing_car_w2s_62" vType="Car" speedFactor="1.01" vaporized=""/>
    <tripinfo id="car_w2s_65" depart="65.00" departLane="w2sep_1" departPos="3.60" departPosLat="0.00" departSpeed="13.90" departDelay="0.00" arrival="228.10" arrivalLane="c2s_1" arrivalPos="990.00" arrivalPosLat="0.00" arrivalSpeed="15.46" duration="163.10" routeLength="1986.69" waitingTime="6.25" waitingCount="1" stopTime="0.00" timeLoss="40.50" rerouteNo="1" devices="tripinfo_car_w2s_65 routing_car_w2s_65" vType="Car" speedFactor="1.17" vaporized=""/>
    <tripinfo id="car_w2n_51" depart="51.00" departLane="w2sep_1" departPos="3.60" departPosLat="0.00" departSpeed="13.90" departDelay="0.00" arrival="228.15" arrivalLane="c2n_1" arrivalPos="990.00" arrivalPosLat="0.00" arrivalSpeed="15.08" duration="177.15" routeLength="1996.47" waitingTime="20.15" waitingCount="2" stopTime="0.00" timeLoss="48.65" rerouteNo="1" devices="tripinfo_car_w2n_51 routing_car_w2n_51" vType="Car" speedFactor="1.12" vaporized=""/>
    <tripinfo id="car_w2e_95" depart="95.00" departLane="w2sep_1" departPos="3.60" departPosLat="0.00" departSpeed="13.90" departDelay="0.00" arrival="229.40" arrivalLane="c2e_1" arrivalPos="990.00" arrivalPosLat="0.00" arrivalSpeed="15.12" duration="134.40" routeLength="1997.01" waitingTime="0.00" waitingCount="0" stopTime="0.00" timeLoss="2.33" rerouteNo="1" devices="tripinfo_car_w2e_95 routing_car_w2e_95" vType="Car" speedFactor="1.09" vaporized=""/>
    <tripinfo id="car_e2w_92" depart="92.00" departLane="e2sep_1" departPos="3.60" departPosLat="0.00" departSpeed="13.90" departDelay="0.00" arrival="230.95" arrivalLane="c2w_1" arrivalPos="990.00" arrivalPosLat="0.00" arrivalSpeed="14.42" duration="138.95" routeLength="1997.01" waitingTime="0.00" waitingCount="0" stopTime="0.00" timeLoss="0.51" rerouteNo="1" devices="tripinfo_car_e2w_92 routing_car_e2w_92" vType="Car" speedFactor="1.04" vaporized=""/>
    <tripinfo id="car_w2s_71" depart="71.00" departLane="w2sep_1" departPos="3.60" departPosLat="0.00" departSpeed="13.90" departDelay="0.00" arrival="232.65" arrivalLane="c2s_1" arrivalPos="990.00" arrivalPosLat="0.00" arrivalSpeed="13.89" duration="161.65" routeLength="1986.69" waitingTime="0.00" waitingCount="0" stopTime="0.00" timeLoss="18.01" rerouteNo="1" devices="tripinfo_car_w2s_71 routing_car_w2s_71" vType="Car" speedFactor="1.00" vaporized=""/>
    <tripinfo id="car_w2s_87" depart="87.00" departLane="w2sep_1" departPos="3.60" departPosLat="0.00" departSpeed="13.90" departDelay="0.00" arrival="234.85" arrivalLane="c2s_1" arrivalPos="990.00" arrivalPosLat="0.00" arrivalSpeed="14.82" duration="147.85" routeLength="1986.69" waitingTime="0.00" waitingCount="0" stopTime="0.00" timeLoss="16.28" rerouteNo="1" devices="tripinfo_car_w2s_87 routing_car_w2s_87" vType="Car" speedFactor="1.09" vaporized=""/>
    <tripinfo id="car_e2s_15" depart="15.25" departLane="e2sep_1" departPos="3.60" departPosLat="0.00" departSpeed="13.90" departDelay="0.25" arrival="237.10" arrivalLane="c2s_1" arrivalPos="990.00" arrivalPosLat="0.00" arrivalSpeed="14.87" duration="221.85" routeLength="1996.47" waitingTime="66.00" waitingCount="2" stopTime="0.00" timeLoss="89.52" rerouteNo="1" devices="tripinfo_car_e2s_15 routing_car_e2s_15" vType="Car" speedFactor="1.09" vaporized=""/>
    <tripinfo id="car_e2s_46" depart="46.00" departLane="e2sep_1" departPos="3.60" departPosLat="0.00" departSpeed="13.90" departDelay="0.00" arrival="239.40" arrivalLane="c2s_1" arrivalPos="990.00" arrivalPosLat="0.00" arrivalSpeed="14.89" duration="193.40" routeLength="1996.47" waitingTime="39.10" waitingCount="2" stopTime="0.00" timeLoss="61.06" rerouteNo="1" devices="tripinfo_car_e2s_46 routing_car_e2s_46" vType="Car" speedFactor="1.09" vaporized=""/>
    <tripinfo id="car_e2s_54" depart="54.00" departLane="e2sep_1" departPos="3.60" departPosLat="0.00" departSpeed="13.90" departDelay="0.00" arrival="244.20" arrivalLane="c2s_1" arrivalPos="990.00" arrivalPosLat="0.00" arrivalSpeed="13.89" duration="190.20" routeLength="1996.47" waitingTime="27.30" waitingCount="2" stopTime="0.00" timeLoss="45.89" rerouteNo="1" devices="tripinfo_car_e2s_54 routing_car_e2s_54" vType="Car" speedFactor="1.00" vaporized=""/>
    <tripinfo id="car_w2n_97" depart="97.00" departLane="w2sep_1" departPos="3.60" departPosLat="0.00" departSpeed="13.90" departDelay="0.00" arrival="244.20" arrivalLane="c2n_1" arrivalPos="990.00" arrivalPosLat="0.00" arrivalSpeed="14.04" duration="147.20" routeLength="1996.47" waitingTime="0.00" waitingCount="0" stopTime="0.00" timeLoss="4.30" rerouteNo="1" devices="tripinfo_car_w2n_97 routing_car_w2n_97" vType="Car" speedFactor="1.01" vaporized=""/>
    <tripinfo id="car_e2s_84" depart="84.00" departLane="e2sep_1" departPos="3.60" departPosLat="0.00" departSpeed="13.90" departDelay="0.00" arrival="247.15" arrivalLane="c2s_1" arrivalPos="990.00" arrivalPosLat="0.00" arrivalSpeed="14.24" duration="163.15" routeLength="1996.47" waitingTime="9.35" waitingCount="1" stopTime="0.00" timeLoss="23.10" rerouteNo="1" devices="tripinfo_car_e2s_84 routing_car_e2s_84" vType="Car" speedFactor="1.03" vaporized=""/>
    <tripinfo id="car_n2w_54" depart="55.35" departLane="n2sep_1" departPos="3.60" departPosLat="0.00" departSpeed="13.90" departDelay="1.35" arrival="249.85" arrivalLane="c2w_1" arrivalPos="990.00" arrivalPosLat="0.00" arrivalSpeed="15.73" duration="194.50" routeLength="1986.69" waitingTime="47.60" waitingCount="1" stopTime="0.00" timeLoss="67.58" rerouteNo="1" devices="tripinfo_car_n2w_54 routing_car_n2w_54" vType="Car" speedFactor="1.13" vaporized=""/>
    <tripinfo id="car_w2n_99" depart="99.00" departLane="w2sep_1" departPos="3.60" departPosLat="0.00" departSpeed="13.90" departDelay="0.00" arrival="250.15" arrivalLane="c2n_1" arrivalPos="990.00" arrivalPosLat="0.00" arrivalSpeed="13.90" duration="151.15" routeLength="1996.47" waitingTime="0.00" waitingCount="0" stopTime="0.00" timeLoss="6.80" rerouteNo="1" devices="tripinfo_car_w2n_99 routing_car_w2n_99" vType="Car" speedFactor="1.00" vaporized=""/>
    <tripinfo id="car_n2w_84" depart="84.00" departLane="n2sep_1" departPos="3.60" departPosLat="0.00" departSpeed="13.90" departDelay="0.00" arrival="254.10" arrivalLane="c2w_1" arrivalPos="990.00" arrivalPosLat="0.00" arrivalSpeed="16.08" duration="170.10" routeLength="1986.69" waitingTime="31.70" waitingCount="1" stopTime="0.00" timeLoss="46.06" rerouteNo="1" devices="tripinfo_car_n2w_84 routing_car_n2w_84" vType="Car" speedFactor="1.16" vaporized=""/>
    <tripinfo id="car_w2n_101" depart="101.00" departLane="w2sep_1" departPos="3.60" departPosLat="0.00" departSpeed="13.90" departDelay="0.00" arrival="254.45" arrivalLane="c2n_1" arrivalPos="990.00" arrivalPosLat="0.00" arrivalSpeed="13.89" duration="153.45" routeLength="1996.47" waitingTime="0.00" waitingCount="0" stopTime="0.00" timeLoss="9.12" rerouteNo="1" devices="tripinfo_car_w2n_101 routing_car_w2n_101" vType="Car" speedFactor="1.00" vaporized=""/>
    <tripinfo id="car_n2s_52" depart="53.50" departLane="n2sep_1" departPos="3.60" departPosLat="0.00" departSpeed="13.90" departDelay="1.50" arrival="256.00" arrivalLane="c2s_1" arrivalPos="990.00" arrivalPosLat="0.00" arrivalSpeed="13.90" duration="202.50" routeLength="1997.01" waitingTime="48.65" waitingCount="1" stopTime="0.00" timeLoss="58.79" rerouteNo="1" devices="tripinfo_car_n2s_52 routing_car_n2s_52" vType="Car" speedFactor="1.00" vaporized=""/>
    <tripinfo id="car_n2s_80" depart="80.00" departLane="n2sep_1" departPos="3.60" departPosLat="0.00" departSpeed="13.90" departDelay="0.00" arrival="258.20" arrivalLane="c2s_1" arrivalPos="990.00" arrivalPosLat="0.00" arrivalSpeed="14.97" duration="178.20" routeLength="1997.01" waitingTime="33.15" waitingCount="1" stopTime="0.00" timeLoss="47.85" rerouteNo="1" devices="tripinfo_car_n2s_80 routing_car_n2s_80" vType="Car" speedFactor="1.10" vaporized=""/>
    <tripinfo id="car_s2n_98" depart="98.00" departLane="s2sep_1" departPos="3.60" departPosLat="0.00" departSpeed="13.90" departDelay="0.00" arrival="258.20" arrivalLane="c2n_1" arrivalPos="990.00" arrivalPosLat="0.00" arrivalSpeed="13.88" duration="160.20" routeLength="1997.01" waitingTime="6.95" waitingCount="1" stopTime="0.00" timeLoss="16.53" rerouteNo="1" devices="tripinfo_car_s2n_98 routing_car_s2n_98" vType="Car" speedFactor="1.00" vaporized=""/>
    <tripinfo id="car_s2e_127" depart="127.00" departLane="s2sep_1" departPos="3.60" departPosLat="0.00" departSpeed="13.90" departDelay="0.00" arrival="260.85" arrivalLane="c2e_1" arrivalPos="990.00" arrivalPosLat="0.00" arrivalSpeed="15.73" duration="133.85" routeLength="1986.69" waitingTime="0.00" waitingCount="0" stopTime="0.00" timeLoss="6.94" rerouteNo="1" devices="tripinfo_car_s2e_127 routing_car_s2e_127" vType="Car" speedFactor="1.13" vaporized=""/>
    <tripinfo id="car_n2s_85" depart="85.25" departLane="n2sep_1" departPos="3.60" departPosLat="0.00" departSpeed="13.90" departDelay="0.25" arrival="263.70" arrivalLane="c2s_1" arrivalPos="990.00" arrivalPosLat="0.00" arrivalSpeed="14.15" duration="178.45" routeLength="1997.01" waitingTime="24.45" waitingCount="1" stopTime="0.00" timeLoss="37.33" rerouteNo="1" devices="tripinfo_car_n2s_85 routing_car_n2s_85" vType="Car" speedFactor="1.02" vaporized=""/>
    <tripinfo id="car_n2w_93" depart="93.00" departLane="n2sep_1" departPos="3.60" departPosLat="0.00" departSpeed="13.90" departDelay="0.00" arrival="264.15" arrivalLane="c2w_1" arrivalPos="990.00" arrivalPosLat="0.00" arrivalSpeed="14.50" duration="171.15" routeLength="1986.69" waitingTime="20.25" waitingCount="1" stopTime="0.00" timeLoss="33.47" rerouteNo="1" devices="tripinfo_car_n2w_93 routing_car_n2w_93" vType="Car" speedFactor="1.04" vaporized=""/>
    <tripinfo id="car_n2s_142" depart="142.00" departLane="n2sep_1" departPos="3.60" departPosLat="0.00" departSpeed="13.90" departDelay="0.00" arrival="266.25" arrivalLane="c2s_1" arrivalPos="990.00" arrivalPosLat="0.00" arrivalSpeed="16.12" duration="124.25" routeLength="1997.01" waitingTime="0.00" waitingCount="0" stopTime="0.00" timeLoss="2.35" rerouteNo="1" devices="tripinfo_car_n2s_142 routing_car_n2s_142" vType="Car" speedFactor="1.18" vaporized=""/>
    <tripinfo id="car_n2e_129" depart="129.00" departLane="n2sep_1" departPos="3.60" departPosLat="0.00" departSpeed="13.90" departDelay="0.00" arrival="267.20" arrivalLane="c2e_1" arrivalPos="990.00" arrivalPosLat="0.00" arrivalSpeed="15.04" duration="138.20" routeLength="1996.47" waitingTime="0.00" waitingCount="0" stopTime="0.00" timeLoss="4.85" rerouteNo="1" devices="tripinfo_car_n2e_129 routing_car_n2e_129" vType="Car" speedFactor="1.08" vaporized=""/>
    <tripinfo id="car_s2w_72" depart="72.00" departLane="s2sep_1" departPos="3.60" departPosLat="0.00" departSpeed="13.90" departDelay="0.00" arrival="269.80" arrivalLane="c2w_1" arrivalPos="990.00" arrivalPosLat="0.00" arrivalSpeed="14.17" duration="197.80" routeLength="1996.47" waitingTime="44.25" waitingCount="2" stopTime="0.00" timeLoss="56.25" rerouteNo="1" devices="tripinfo_car_s2w_72 routing_car_s2w_72" vType="Car" speedFactor="1.02" vaporized=""/>
    <tripinfo id="car_s2w_75" depart="75.00" departLane="s2sep_1" departPos="3.60" departPosLat="0.00" departSpeed="13.90" departDelay="0.00" arrival="274.40" arrivalLane="c2w_1" arrivalPos="990.00" arrivalPosLat="0.00" arrivalSpeed="13.89" duration="199.40" routeLength="1996.47" waitingTime="38.75" waitingCount="2" stopTime="0.00" timeLoss="55.09" rerouteNo="1" devices="tripinfo_car_s2w_75 routing_car_s2w_75" vType="Car" speedFactor="1.00" vaporized=""/>
    <tripinfo id="car_s2w_109" depart="109.00" departLane="s2sep_1" departPos="3.60" departPosLat="0.00" departSpeed="13.90" departDelay="0.00" arrival="278.85" arrivalLane="c2w_1" arrivalPos="990.00" arrivalPosLat="0.00" arrivalSpeed="14.12" duration="169.85" routeLength="1996.47" waitingTime="7.50" waitingCount="2" stopTime="0.00" timeLoss="27.90" rerouteNo="1" devices="tripinfo_car_s2w_109 routing_car_s2w_109" vType="Car" speedFactor="1.02" vaporized=""/>
    <tripinfo id="car_n2w_146" depart="146.00" departLane="n2sep_1" departPos="3.60" departPosLat="0.00" departSpeed="13.90" departDelay="0.00" arrival="280.70" arrivalLane="c2w_1" arrivalPos="990.00" arrivalPosLat="0.00" arrivalSpeed="15.48" duration="134.70" routeLength="1986.69" waitingTime="0.00" waitingCount="0" stopTime="0.00" timeLoss="12.10" rerouteNo="1" devices="tripinfo_car_n2w_146 routing_car_n2w_146" vType="Car" speedFactor="1.17" vaporized=""/>
    <tripinfo id="car_s2w_120" depart="120.00" departLane="s2sep_1" departPos="3.60" departPosLat="0.00" departSpeed="13.90" departDelay="0.00" arrival="287.70" arrivalLane="c2w_1" arrivalPos="990.00" arrivalPosLat="0.00" arrivalSpeed="13.90" duration="167.70" routeLength="1996.47" waitingTime="6.50" waitingCount="2" stopTime="0.00" timeLoss="23.36" rerouteNo="1" devices="tripinfo_car_s2w_120 routing_car_s2w_120" vType="Car" speedFactor="1.00" vaporized=""/>
    <tripinfo id="car_e2n_108" depart="108.00" departLane="e2sep_1" departPos="3.60" departPosLat="0.00" departSpeed="13.90" departDelay="0.00" arrival="292.90" arrivalLane="c2n_1" arrivalPos="990.00" arrivalPosLat="0.00" arrivalSpeed="16.25" duration="184.90" routeLength="1986.69" waitingTime="49.30" waitingCount="1" stopTime="0.00" timeLoss="62.00" rerouteNo="1" devices="tripinfo_car_e2n_108 routing_car_e2n_108" vType="Car" speedFactor="1.17" vaporized=""/>
    <tripinfo id="car_w2s_110" depart="110.00" departLane="w2sep_1" departPos="3.60" departPosLat="0.00" departSpeed="13.90" departDelay="0.00" arrival="294.55" arrivalLane="c2s_1" arrivalPos="990.00" arrivalPosLat="0.00" arrivalSpeed="15.23" duration="184.55" routeLength="1986.69" waitingTime="43.25" waitingCount="1" stopTime="0.00" timeLoss="53.45" rerouteNo="1" devices="tripinfo_car_w2s_110 routing_car_w2s_110" vType="Car" speedFactor="1.10" vaporized=""/>
    <tripinfo id="car_w2e_140" depart="140.00" departLane="w2sep_1" departPos="3.60" departPosLat="0.00" departSpeed="13.90" departDelay="0.00" arrival="297.70" arrivalLane="c2e_1" arrivalPos="990.00" arrivalPosLat="0.00" arrivalSpeed="15.56" duration="157.70" routeLength="1997.01" waitingTime="19.00" waitingCount="1" stopTime="0.00" timeLoss="29.31" rerouteNo="1" devices="tripinfo_car_w2e_140 routing_car_w2e_140" vType="Car" speedFactor="1.12" vaporized=""/>
    <tripinfo id="car_e2w_100" depart="100.00" departLane="e2sep_1" departPos="3.60" departPosLat="0.00" departSpeed="13.90" departDelay="0.00" arrival="300.80" arrivalLane="c2w_1" arrivalPos="990.00" arrivalPosLat="0.00" arrivalSpeed="13.90" duration="200.80" routeLength="1997.01" waitingTime="50.35" waitingCount="1" stopTime="0.00" timeLoss="57.13" rerouteNo="1" devices="tripinfo_car_e2w_100 routing_car_e2w_100" vType="Car" speedFactor="1.00" vaporized=""/>
    <tripinfo id="car_w2s_116" depart="116.00" departLane="w2sep_1" departPos="3.60" departPosLat="0.00" departSpeed="13.90" departDelay="0.00" arrival="303.60" arrivalLane="c2s_1" arrivalPos="990.00" arrivalPosLat="0.00" arrivalSpeed="13.94" duration="187.60" routeLength="1986.69" waitingTime="34.95" waitingCount="1" stopTime="0.00" timeLoss="44.40" rerouteNo="1" devices="tripinfo_car_w2s_116 routing_car_w2s_116" vType="Car" speedFactor="1.00" vaporized=""/>
    <tripinfo id="car_e2n_126" depart="126.00" departLane="e2sep_1" departPos="3.60" departPosLat="0.00" departSpeed="13.90" departDelay="0.00" arrival="304.20" arrivalLane="c2n_1" arrivalPos="990.00" arrivalPosLat="0.00" arrivalSpeed="14.23" duration="178.20" routeLength="1986.69" waitingTime="27.50" waitingCount="1" stopTime="0.00" timeLoss="37.82" rerouteNo="1" devices="tripinfo_car_e2n_126 routing_car_e2n_126" vType="Car" speedFactor="1.02" vaporized=""/>
    <tripinfo id="car_w2s_143" depart="143.55" departLane="w2sep_1" departPos="3.60" departPosLat="0.00" departSpeed="13.90" departDelay="0.55" arrival="305.55" arrivalLane="c2s_1" arrivalPos="990.00" arrivalPosLat="0.00" arrivalSpeed="15.37" duration="162.00" routeLength="1986.69" waitingTime="9.20" waitingCount="1" stopTime="0.00" timeLoss="37.54" rerouteNo="1" devices="tripinfo_car_w2s_143 routing_car_w2s_143" vType="Car" speedFactor="1.15" vaporized=""/>
    <tripinfo id="car_e2w_158" depart="158.00" departLane="e2sep_1" departPos="3.60" departPosLat="0.00" departSpeed="13.90" departDelay="0.00" arrival="308.55" arrivalLane="c2w_1" arrivalPos="990.00" arrivalPosLat="0.00" arrivalSpeed="14.17" duration="150.55" routeLength="1997.01" waitingTime="0.00" waitingCount="0" stopTime="0.00" timeLoss="9.65" rerouteNo="1" devices="tripinfo_car_e2w_158 routing_car_e2w_158" vType="Car" speedFactor="1.02" vaporized=""/>
    <tripinfo id="car_e2n_141" depart="141.00" departLane="e2sep_1" departPos="3.60" departPosLat="0.00" departSpeed="13.90" departDelay="0.00" arrival="308.80" arrivalLane="c2n_1" arrivalPos="990.00" arrivalPosLat="0.00" arrivalSpeed="14.11" duration="167.80" routeLength="1986.69" waitingTime="13.20" waitingCount="1" stopTime="0.00" timeLoss="26.35" rerouteNo="1" devices="tripinfo_car_e2n_141 routing_car_e2n_141" vType="Car" speedFactor="1.02" vaporized=""/>
    <tripinfo id="car_w2s_145" depart="145.25" departLane="w2sep_1" departPos="3.60" departPosLat="0.00" departSpeed="13.90" departDelay="0.25" arrival="310.85" arrivalLane="c2s_1" arrivalPos="990.00" arrivalPosLat="0.00" arrivalSpeed="13.97" duration="165.60" routeLength="1986.69" waitingTime="6.55" waitingCount="1" stopTime="0.00" timeLoss="22.69" rerouteNo="1" devices="tripinfo_car_w2s_145 routing_car_w2s_145" vType="Car" speedFactor="1.01" vaporized=""/>
    <tripinfo id="car_e2w_173" depart="173.00" departLane="e2sep_1" departPos="3.60" departPosLat="0.00" departSpeed="13.90" departDelay="0.00" arrival="311.15" arrivalLane="c2w_1" arrivalPos="990.00" arrivalPosLat="0.00" arrivalSpeed="14.93" duration="138.15" routeLength="1997.01" waitingTime="0.00" waitingCount="0" stopTime="0.00" timeLoss="5.93" rerouteNo="1" devices="tripinfo_car_e2w_173 routing_car_e2w_173" vType="Car" speedFactor="1.09" vaporized=""/>
    <tripinfo id="car_w2s_165" depart="165.00" departLane="w2sep_1" departPos="3.60" departPosLat="0.00" departSpeed="13.90" departDelay="0.00" arrival="312.70" arrivalLane="c2s_1" arrivalPos="990.00" arrivalPosLat="0.00" arrivalSpeed="15.50" duration="147.70" routeLength="1986.69" waitingTime="0.00" waitingCount="0" stopTime="0.00" timeLoss="25.88" rerouteNo="1" devices="tripinfo_car_w2s_165 routing_car_w2s_165" vType="Car" speedFactor="1.18" vaporized=""/>
    <tripinfo id="car_w2s_166" depart="166.25" departLane="w2sep_1" departPos="3.60" departPosLat="0.00" departSpeed="13.90" departDelay="0.25" arrival="315.90" arrivalLane="c2s_1" arrivalPos="990.00" arrivalPosLat="0.00" arrivalSpeed="14.30" duration="149.65" routeLength="1986.69" waitingTime="0.00" waitingCount="0" stopTime="0.00" timeLoss="10.49" rerouteNo="1" devices="tripinfo_car_w2s_166 routing_car_w2s_166" vType="Car" speedFactor="1.03" vaporized=""/>
    <tripinfo id="car_w2n_119" depart="119.00" departLane="w2sep_1" departPos="3.60" departPosLat="0.00" departSpeed="13.90" departDelay="0.00" arrival="316.00" arrivalLane="c2n_1" arrivalPos="990.00" arrivalPosLat="0.00" arrivalSpeed="13.90" duration="197.00" routeLength="1996.47" waitingTime="39.90" waitingCount="2" stopTime="0.00" timeLoss="52.67" rerouteNo="1" devices="tripinfo_car_w2n_119 routing_car_w2n_119" vType="Car" speedFactor="1.00" vaporized=""/>
    <tripinfo id="car_e2n_177" depart="177.00" departLane="e2sep_1" departPos="3.60" departPosLat="0.00" departSpeed="13.90" departDelay="0.00" arrival="320.90" arrivalLane="c2n_1" arrivalPos="990.00" arrivalPosLat="0.00" arrivalSpeed="14.37" duration="143.90" routeLength="1986.69" waitingTime="0.00" waitingCount="0" stopTime="0.00" timeLoss="5.01" rerouteNo="1" devices="tripinfo_car_e2n_177 routing_car_e2n_177" vType="Car" speedFactor="1.03" vaporized=""/>
    <tripinfo id="car_w2n_125" depart="125.00" departLane="w2sep_1" departPos="3.60" departPosLat="0.00" departSpeed="13.90" departDelay="0.00" arrival="323.20" arrivalLane="c2n_1" arrivalPos="990.00" arrivalPosLat="0.00" arrivalSpeed="15.55" duration="198.20" routeLength="1996.47" waitingTime="46.15" waitingCount="3" stopTime="0.00" timeLoss="71.85" rerouteNo="1" devices="tripinfo_car_w2n_125 routing_car_w2n_125" vType="Car" speedFactor="1.14" vaporized=""/>
    <tripinfo id="car_e2w_183" depart="183.00" departLane="e2sep_1" departPos="3.60" departPosLat="0.00" departSpeed="13.90" departDelay="0.00" arrival="323.60" arrivalLane="c2w_1" arrivalPos="990.00" arrivalPosLat="0.00" arrivalSpeed="14.32" duration="140.60" routeLength="1997.01" waitingTime="0.00" waitingCount="0" stopTime="0.00" timeLoss="1.14" rerouteNo="1" devices="tripinfo_car_e2w_183 routing_car_e2w_183" vType="Car" speedFactor="1.03" vaporized=""/>
    <tripinfo id="car_w2e_180" depart="180.00" departLane="w2sep_1" departPos="3.60" departPosLat="0.00" departSpeed="13.90" departDelay="0.00" arrival="323.90" arrivalLane="c2e_1" arrivalPos="990.00" arrivalPosLat="0.00" arrivalSpeed="13.90" duration="143.90" routeLength="1997.01" waitingTime="0.00" waitingCount="0" stopTime="0.00" timeLoss="0.21" rerouteNo="1" devices="tripinfo_car_w2e_180 routing_car_w2e_180" vType="Car" speedFactor="1.00" vaporized=""/>
    <tripinfo id="bus_e2s_142" depart="143.00" departLane="e2sep_1" departPos="12.10" departPosLat="0.00" departSpeed="13.90" departDelay="1.00" arrival="330.80" arrivalLane="c2s_1" arrivalPos="990.00" arrivalPosLat="0.00" arrivalSpeed="13.90" duration="187.80" routeLength="1987.97" waitingTime="26.80" waitingCount="3" stopTime="0.00" timeLoss="44.08" rerouteNo="1" devices="tripinfo_bus_e2s_142 routing_bus_e2s_142" vType="Bus" speedFactor="1.00" vaporized=""/>
    <tripinfo id="car_w2n_142" depart="142.00" departLane="w2sep_1" departPos="3.60" departPosLat="0.00" departSpeed="13.90" departDelay="0.00" arrival="331.75" arrivalLane="c2n_1" arrivalPos="990.00" arrivalPosLat="0.00" arrivalSpeed="13.90" duration="189.75" routeLength="1996.47" waitingTime="23.65" waitingCount="3" stopTime="0.00" timeLoss="45.40" rerouteNo="1" devices="tripinfo_car_w2n_142 routing_car_w2n_142" vType="Car" speedFactor="1.00" vaporized=""/>
    <tripinfo id="car_w2n_148" depart="148.00" departLane="w2sep_1" departPos="3.60" departPosLat="0.00" departSpeed="13.90" departDelay="0.00" arrival="334.75" arrivalLane="c2n_1" arrivalPos="990.00" arrivalPosLat="0.00" arrivalSpeed="14.38" duration="186.75" routeLength="1996.47" waitingTime="13.60" waitingCount="3" stopTime="0.00" timeLoss="47.98" rerouteNo="1" devices="tripinfo_car_w2n_148 routing_car_w2n_148" vType="Car" speedFactor="1.04" vaporized=""/>
    <tripinfo id="car_w2n_189" depart="189.00" departLane="w2sep_1" departPos="3.60" departPosLat="0.00" departSpeed="13.90" departDelay="0.00" arrival="336.70" arrivalLane="c2n_1" arrivalPos="990.00" arrivalPosLat="0.00" arrivalSpeed="15.33" duration="147.70" routeLength="1996.47" waitingTime="0.00" waitingCount="0" stopTime="0.00" timeLoss="21.95" rerouteNo="1" devices="tripinfo_car_w2n_189 routing_car_w2n_189" vType="Car" speedFactor="1.15" vaporized=""/>
    <tripinfo id="car_w2n_193" depart="193.00" departLane="w2sep_1" departPos="3.60" departPosLat="0.00" departSpeed="13.90" departDelay="0.00" arrival="341.85" arrivalLane="c2n_1" arrivalPos="990.00" arrivalPosLat="0.00" arrivalSpeed="13.92" duration="148.85" routeLength="1996.47" waitingTime="0.00" waitingCount="0" stopTime="0.00" timeLoss="4.76" rerouteNo="1" devices="tripinfo_car_w2n_193 routing_car_w2n_193" vType="Car" speedFactor="1.00" vaporized=""/>
    <tripinfo id="car_s2e_153" depart="153.00" departLane="s2sep_1" departPos="3.60" departPosLat="0.00" departSpeed="13.90" departDelay="0.00" arrival="344.10" arrivalLane="c2e_1" arrivalPos="990.00" arrivalPosLat="0.00" arrivalSpeed="14.22" duration="191.10" routeLength="1986.69" waitingTime="43.65" waitingCount="1" stopTime="0.00" timeLoss="50.66" rerouteNo="1" devices="tripinfo_car_s2e_153 routing_car_s2e_153" vType="Car" speedFactor="1.02" vaporized=""/>
    <tripinfo id="car_n2w_148" depart="148.00" departLane="n2sep_1" departPos="3.60" departPosLat="0.00" departSpeed="13.90" departDelay="0.00" arrival="344.15" arrivalLane="c2w_1" arrivalPos="990.00" arrivalPosLat="0.00" arrivalSpeed="14.21" duration="196.15" routeLength="1986.69" waitingTime="48.10" waitingCount="1" stopTime="0.00" timeLoss="55.59" rerouteNo="1" devices="tripinfo_car_n2w_148 routing_car_n2w_148" vType="Car" speedFactor="1.02" vaporized=""/>
    <tripinfo id="car_n2s_159" depart="159.00" departLane="n2sep_1" departPos="3.60" departPosLat="0.00" departSpeed="13.90" departDelay="0.00" arrival="344.20" arrivalLane="c2s_1" arrivalPos="990.00" arrivalPosLat="0.00" arrivalSpeed="14.67" duration="185.20" routeLength="1997.01" waitingTime="40.35" waitingCount="1" stopTime="0.00" timeLoss="49.11" rerouteNo="1" devices="tripinfo_car_n2s_159 routing_car_n2s_159" vType="Car" speedFactor="1.06" vaporized=""/>
    <tripinfo id="car_s2n_215" depart="215.00" departLane="s2sep_1" departPos="3.60" departPosLat="0.00" departSpeed="13.90" departDelay="0.00" arrival="348.15" arrivalLane="c2n_1" arrivalPos="990.00" arrivalPosLat="0.00" arrivalSpeed="15.12" duration="133.15" routeLength="1997.01" waitingTime="0.00" waitingCount="0" stopTime="0.00" timeLoss="1.07" rerouteNo="1" devices="tripinfo_car_s2n_215 routing_car_s2n_215" vType="Car" speedFactor="1.09" vaporized=""/>
    <tripinfo id="car_s2e_156" depart="156.00" departLane="s2sep_1" departPos="3.60" departPosLat="0.00" departSpeed="13.90" departDelay="0.00" arrival="349.65" arrivalLane="c2e_1" arrivalPos="990.00" arrivalPosLat="0.00" arrivalSpeed="13.90" duration="193.65" routeLength="1986.69" waitingTime="38.95" waitingCount="1" stopTime="0.00" timeLoss="49.97" rerouteNo="1" devices="tripinfo_car_s2e_156 routing_car_s2e_156" vType="Car" speedFactor="1.00" vaporized=""/>
    <tripinfo id="car_n2w_172" depart="172.00" departLane="n2sep_1" departPos="3.60" departPosLat="0.00" departSpeed="13.90" departDelay="0.00" arrival="350.55" arrivalLane="c2w_1" arrivalPos="990.00" arrivalPosLat="0.00" arrivalSpeed="14.00" duration="178.55" routeLength="1986.69" waitingTime="24.75" waitingCount="1" stopTime="0.00" timeLoss="35.94" rerouteNo="1" devices="tripinfo_car_n2w_172 routing_car_n2w_172" vType="Car" speedFactor="1.01" vaporized=""/>
    <tripinfo id="car_n2e_170" depart="170.00" departLane="n2sep_1" departPos="3.60" departPosLat="0.00" departSpeed="13.90" departDelay="0.00" arrival="352.35" arrivalLane="c2e_1" arrivalPos="990.00" arrivalPosLat="0.00" arrivalSpeed="15.16" duration="182.35" routeLength="1996.47" waitingTime="37.80" waitingCount="3" stopTime="0.00" timeLoss="51.39" rerouteNo="1" devices="tripinfo_car_n2e_170 routing_car_n2e_170" vType="Car" speedFactor="1.10" vaporized=""/>
    <tripinfo id="car_n2w_182" depart="182.00" departLane="n2sep_1" departPos="3.60" departPosLat="0.00" departSpeed="13.90" departDelay="0.00" arrival="354.30" arrivalLane="c2w_1" arrivalPos="990.00" arrivalPosLat="0.00" arrivalSpeed="14.11" duration="172.30" routeLength="1986.69" waitingTime="17.25" waitingCount="1" stopTime="0.00" timeLoss="31.03" rerouteNo="1" devices="tripinfo_car_n2w_182 routing_car_n2w_182" vType="Car" speedFactor="1.02" vaporized=""/>
    <tripinfo id="car_n2s_192" depart="192.00" departLane="n2sep_1" departPos="3.60" departPosLat="0.00" departSpeed="13.90" departDelay="0.00" arrival="354.75" arrivalLane="c2s_1" arrivalPos="990.00" arrivalPosLat="0.00" arrivalSpeed="13.90" duration="162.75" routeLength="1997.01" waitingTime="7.45" waitingCount="1" stopTime="0.00" timeLoss="19.07" rerouteNo="1" devices="tripinfo_car_n2s_192 routing_car_n2s_192" vType="Car" speedFactor="1.00" vaporized=""/>
    <tripinfo id="car_n2e_218" depart="218.00" departLane="n2sep_1" departPos="3.60" departPosLat="0.00" departSpeed="13.90" departDelay="0.00" arrival="356.30" arrivalLane="c2e_1" arrivalPos="990.00" arrivalPosLat="0.00" arrivalSpeed="15.56" duration="138.30" routeLength="1996.47" waitingTime="0.00" waitingCount="0" stopTime="0.00" timeLoss="9.60" rerouteNo="1" devices="tripinfo_car_n2e_218 routing_car_n2e_218" vType="Car" speedFactor="1.12" vaporized=""/>
    <tripinfo id="car_n2s_197" depart="197.00" departLane="n2sep_1" departPos="3.60" departPosLat="0.00" departSpeed="13.90" departDelay="0.00" arrival="358.40" arrivalLane="c2s_1" arrivalPos="990.00" arrivalPosLat="0.00" arrivalSpeed="14.10" duration="161.40" routeLength="1997.01" waitingTime="4.35" waitingCount="1" stopTime="0.00" timeLoss="20.09" rerouteNo="1" devices="tripinfo_car_n2s_197 routing_car_n2s_197" vType="Car" speedFactor="1.02" vaporized=""/>
    <tripinfo id="car_n2s_214" depart="214.00" departLane="n2sep_1" departPos="3.60" departPosLat="0.00" departSpeed="13.90" departDelay="0.00" arrival="361.85" arrivalLane="c2s_1" arrivalPos="990.00" arrivalPosLat="0.00" arrivalSpeed="14.00" duration="147.85" routeLength="1997.01" waitingTime="0.00" waitingCount="0" stopTime="0.00" timeLoss="5.58" rerouteNo="1" devices="tripinfo_car_n2s_214 routing_car_n2s_214" vType="Car" speedFactor="1.01" vaporized=""/>
    <tripinfo id="car_s2w_162" depart="162.00" departLane="s2sep_1" departPos="3.60" departPosLat="0.00" departSpeed="13.90" departDelay="0.00" arrival="362.10" arrivalLane="c2w_1" arrivalPos="990.00" arrivalPosLat="0.00" arrivalSpeed="13.90" duration="200.10" routeLength="1996.47" waitingTime="43.95" waitingCount="2" stopTime="0.00" timeLoss="55.78" rerouteNo="1" devices="tripinfo_car_s2w_162 routing_car_s2w_162" vType="Car" speedFactor="1.00" vaporized=""/>
    <tripinfo id="car_s2w_195" depart="195.00" departLane="s2sep_1" departPos="3.60" departPosLat="0.00" departSpeed="13.90" departDelay="0.00" arrival="365.05" arrivalLane="c2w_1" arrivalPos="990.00" arrivalPosLat="0.00" arrivalSpeed="14.41" duration="170.05" routeLength="1996.47" waitingTime="14.20" waitingCount="2" stopTime="0.00" timeLoss="31.65" rerouteNo="1" devices="tripinfo_car_s2w_195 routing_car_s2w_195" vType="Car" speedFactor="1.04" vaporized=""/>
    <tripinfo id="car_s2w_196" depart="196.40" departLane="s2sep_1" departPos="3.60" departPosLat="0.00" departSpeed="13.90" departDelay="0.40" arrival="368.40" arrivalLane="c2w_1" arrivalPos="990.00" arrivalPosLat="0.00" arrivalSpeed="14.17" duration="172.00" routeLength="1996.47" waitingTime="8.25" waitingCount="1" stopTime="0.00" timeLoss="30.80" rerouteNo="1" devices="tripinfo_car_s2w_196 routing_car_s2w_196" vType="Car" speedFactor="1.02" vaporized=""/>
    <tripinfo id="car_s2w_202" depart="202.00" departLane="s2sep_1" departPos="3.60" departPosLat="0.00" departSpeed="13.90" departDelay="0.00" arrival="371.20" arrivalLane="c2w_1" arrivalPos="990.00" arrivalPosLat="0.00" arrivalSpeed="14.32" duration="169.20" routeLength="1996.47" waitingTime="7.55" waitingCount="1" stopTime="0.00" timeLoss="30.13" rerouteNo="1" devices="tripinfo_car_s2w_202 routing_car_s2w_202" vType="Car" speedFactor="1.04" vaporized=""/>
    <tripinfo id="car_s2w_222" depart="222.00" departLane="s2sep_1" departPos="3.60" departPosLat="0.00" departSpeed="13.90" departDelay="0.00" arrival="373.35" arrivalLane="c2w_1" arrivalPos="990.00" arrivalPosLat="0.00" arrivalSpeed="14.88" duration="151.35" routeLength="1996.47" waitingTime="0.00" waitingCount="0" stopTime="0.00" timeLoss="19.81" rerouteNo="1" devices="tripinfo_car_s2w_222 routing_car_s2w_222" vType="Car" speedFactor="1.10" vaporized=""/>
    <tripinfo id="car_s2w_223" depart="223.30" departLane="s2sep_1" departPos="3.60" departPosLat="0.00" departSpeed="13.90" departDelay="0.30" arrival="376.90" arrivalLane="c2w_1" arrivalPos="990.00" arrivalPosLat="0.00" arrivalSpeed="13.87" duration="153.60" routeLength="1996.47" waitingTime="0.00" waitingCount="0" stopTime="0.00" timeLoss="9.28" rerouteNo="1" devices="tripinfo_car_s2w_223 routing_car_s2w_223" vType="Car" speedFactor="1.00" vaporized=""/>
    <tripinfo id="car_n2e_244" depart="244.00" departLane="n2sep_1" departPos="3.60" departPosLat="0.00" departSpeed="13.90" departDelay="0.00" arrival="379.10" arrivalLane="c2e_1" arrivalPos="990.00" arrivalPosLat="0.00" arrivalSpeed="15.27" duration="135.10" routeLength="1996.47" waitingTime="0.00" waitingCount="0" stopTime="0.00" timeLoss="3.72" rerouteNo="1" devices="tripinfo_car_n2e_244 routing_car_n2e_244" vType="Car" speedFactor="1.10" vaporized=""/>
    <tripinfo id="car_w2e_223" depart="223.00" departLane="w2sep_1" departPos="3.60" departPosLat="0.00" departSpeed="13.90" departDelay="0.00" arrival="386.90" arrivalLane="c2e_1" arrivalPos="990.00" arrivalPosLat="0.00" arrivalSpeed="14.80" duration="163.90" routeLength="1997.01" waitingTime="20.95" waitingCount="1" stopTime="0.00" timeLoss="28.97" rerouteNo="1" devices="tripinfo_car_w2e_223 routing_car_w2e_223" vType="Car" speedFactor="1.07" vaporized=""/>
    <tripinfo id="car_e2w_203" depart="203.00" departLane="e2sep_1" departPos="3.60" departPosLat="0.00" departSpeed="13.90" departDelay="0.00" arrival="390.00" arrivalLane="c2w_1" arrivalPos="990.00" arrivalPosLat="0.00" arrivalSpeed="14.50" duration="187.00" routeLength="1997.01" waitingTime="39.45" waitingCount="1" stopTime="0.00" timeLoss="49.29" rerouteNo="1" devices="tripinfo_car_e2w_203 routing_car_e2w_203" vType="Car" speedFactor="1.04" vaporized=""/>
    <tripinfo id="car_e2n_196" depart="196.00" departLane="e2sep_1" departPos="3.60" departPosLat="0.00" departSpeed="13.90" departDelay="0.00" arrival="390.15" arrivalLane="c2n_1" arrivalPos="990.00" arrivalPosLat="0.00" arrivalSpeed="14.00" duration="194.15" routeLength="1986.69" waitingTime="44.55" waitingCount="1" stopTime="0.00" timeLoss="51.47" rerouteNo="1" devices="tripinfo_car_e2n_196 routing_car_e2n_196" vType="Car" speedFactor="1.01" vaporized=""/>
    <tripinfo id="car_w2s_226" depart="226.00" departLane="w2sep_1" departPos="3.60" departPosLat="0.00" departSpeed="13.90" departDelay="0.00" arrival="393.00" arrivalLane="c2s_1" arrivalPos="990.00" arrivalPosLat="0.00" arrivalSpeed="13.90" duration="167.00" routeLength="1986.69" waitingTime="14.25" waitingCount="1" stopTime="0.00" timeLoss="23.32" rerouteNo="1" devices="tripinfo_car_w2s_226 routing_car_w2s_226" vType="Car" speedFactor="1.00" vaporized=""/>
    <tripinfo id="car_w2e_238" depart="238.00" departLane="w2sep_1" departPos="3.60" departPosLat="0.00" departSpeed="13.90" departDelay="0.00" arrival="395.25" arrivalLane="c2e_1" arrivalPos="990.00" arrivalPosLat="0.00" arrivalSpeed="14.38" duration="157.25" routeLength="1997.01" waitingTime="6.65" waitingCount="1" stopTime="0.00" timeLoss="18.34" rerouteNo="1" devices="tripinfo_car_w2e_238 routing_car_w2e_238" vType="Car" speedFactor="1.03" vaporized=""/>
    <tripinfo id="car_w2s_232" depart="232.00" departLane="w2sep_1" departPos="3.60" departPosLat="0.00" departSpeed="13.90" departDelay="0.00" arrival="395.50" arrivalLane="c2s_1" arrivalPos="990.00" arrivalPosLat="0.00" arrivalSpeed="14.72" duration="163.50" routeLength="1986.69" waitingTime="9.25" waitingCount="1" stopTime="0.00" timeLoss="29.58" rerouteNo="1" devices="tripinfo_car_w2s_232 routing_car_w2s_232" vType="Car" speedFactor="1.07" vaporized=""/>
    <tripinfo id="car_e2w_232" depart="232.00" departLane="e2sep_1" departPos="3.60" departPosLat="0.00" departSpeed="13.90" departDelay="0.00" arrival="395.50" arrivalLane="c2w_1" arrivalPos="990.00" arrivalPosLat="0.00" arrivalSpeed="14.09" duration="163.50" routeLength="1997.01" waitingTime="10.60" waitingCount="1" stopTime="0.00" timeLoss="21.81" rerouteNo="1" devices="tripinfo_car_e2w_232 routing_car_e2w_232" vType="Car" speedFactor="1.01" vaporized=""/>
    <tripinfo id="car_w2e_241" depart="243.40" departLane="w2sep_1" departPos="3.60" departPosLat="0.00" departSpeed="13.90" departDelay="2.40" arrival="397.25" arrivalLane="c2e_1" arrivalPos="990.00" arrivalPosLat="0.00" arrivalSpeed="15.66" duration="153.85" routeLength="1997.01" waitingTime="0.00" waitingCount="0" stopTime="0.00" timeLoss="30.93" rerouteNo="1" devices="tripinfo_car_w2e_241 routing_car_w2e_241" vType="Car" speedFactor="1.17" vaporized=""/>
    <tripinfo id="car_e2w_254" depart="254.00" departLane="e2sep_1" departPos="3.60" departPosLat="0.00" departSpeed="13.90" departDelay="0.00" arrival="399.90" arrivalLane="c2w_1" arrivalPos="990.00" arrivalPosLat="0.00" arrivalSpeed="13.95" duration="145.90" routeLength="1997.01" waitingTime="0.00" waitingCount="0" stopTime="0.00" timeLoss="2.85" rerouteNo="1" devices="tripinfo_car_e2w_254 routing_car_e2w_254" vType="Car" speedFactor="1.00" vaporized=""/>
    <tripinfo id="car_w2s_240" depart="241.55" departLane="w2sep_1" departPos="3.60" departPosLat="0.00" departSpeed="13.90" departDelay="1.55" arrival="400.85" arrivalLane="c2s_1" arrivalPos="990.00" arrivalPosLat="0.00" arrivalSpeed="13.90" duration="159.30" routeLength="1986.69" waitingTime="0.00" waitingCount="0" stopTime="0.00" timeLoss="15.62" rerouteNo="1" devices="tripinfo_car_w2s_240 routing_car_w2s_240" vType="Car" speedFactor="1.00" vaporized=""/>
    <tripinfo id="car_e2s_198" depart="198.00" departLane="e2sep_1" departPos="3.60" departPosLat="0.00" departSpeed="13.90" departDelay="0.00" arrival="403.10" arrivalLane="c2s_1" arrivalPos="990.00" arrivalPosLat="0.00" arrivalSpeed="14.86" duration="205.10" routeLength="1996.47" waitingTime="51.95" waitingCount="2" stopTime="0.00" timeLoss="72.92" rerouteNo="1" devices="tripinfo_car_e2s_198 routing_car_e2s_198" vType="Car" speedFactor="1.09" vaporized=""/>
    <tripinfo id="car_e2n_260" depart="260.00" departLane="e2sep_1" departPos="3.60" departPosLat="0.00" departSpeed="13.90" departDelay="0.00" arrival="403.85" arrivalLane="c2n_1" arrivalPos="990.00" arrivalPosLat="0.00" arrivalSpeed="14.34" duration="143.85" routeLength="1986.69" waitingTime="0.00" waitingCount="0" stopTime="0.00" timeLoss="4.57" rerouteNo="1" devices="tripinfo_car_e2n_260 routing_car_e2n_260" vType="Car" speedFactor="1.03" vaporized=""/>
    <tripinfo id="car_w2s_273" depart="273.00" departLane="w2sep_1" departPos="3.60" departPosLat="0.00" departSpeed="13.90" departDelay="0.00" arrival="405.25" arrivalLane="c2s_1" arrivalPos="990.00" arrivalPosLat="0.00" arrivalSpeed="15.58" duration="132.25" routeLength="1986.69" waitingTime="0.00" waitingCount="0" stopTime="0.00" timeLoss="7.62" rerouteNo="1" devices="tripinfo_car_w2s_273 routing_car_w2s_273" vType="Car" speedFactor="1.15" vaporized=""/>
    <tripinfo id="car_w2n_205" depart="205.00" departLane="w2sep_1" departPos="3.60" departPosLat="0.00" departSpeed="13.90" departDelay="0.00" arrival="406.65" arrivalLane="c2n_1" arrivalPos="990.00" arrivalPosLat="0.00" arrivalSpeed="15.04" duration="201.65" routeLength="1996.47" waitingTime="54.40" waitingCount="3" stopTime="0.00" timeLoss="69.36" rerouteNo="1" devices="tripinfo_car_w2n_205 routing_car_w2n_205" vType="Car" speedFactor="1.09" vaporized=""/>
    <tripinfo id="car_w2n_213" depart="213.00" departLane="w2sep_1" departPos="3.60" departPosLat="0.00" departSpeed="13.90" departDelay="0.00" arrival="410.30" arrivalLane="c2n_1" arrivalPos="990.00" arrivalPosLat="0.00" arrivalSpeed="14.66" duration="197.30" routeLength="1996.47" waitingTime="44.35" waitingCount="2" stopTime="0.00" timeLoss="60.73" rerouteNo="1" devices="tripinfo_car_w2n_213 routing_car_w2n_213" vType="Car" speedFactor="1.06" vaporized=""/>
    <tripinfo id="car_e2s_225" depart="225.00" departLane="e2sep_1" departPos="3.60" departPosLat="0.00" departSpeed="13.90" departDelay="0.00" arrival="415.15" arrivalLane="c2s_1" arrivalPos="990.00" arrivalPosLat="0.00" arrivalSpeed="13.90" duration="190.15" routeLength="1996.47" waitingTime="29.30" waitingCount="3" stopTime="0.00" timeLoss="45.84" rerouteNo="1" devices="tripinfo_car_e2s_225 routing_car_e2s_225" vType="Car" speedFactor="1.00" vaporized=""/>
    <tripinfo id="car_w2e_282" depart="282.40" departLane="w2sep_1" departPos="3.60" departPosLat="0.00" departSpeed="13.90" departDelay="0.40" arrival="415.45" arrivalLane="c2e_1" arrivalPos="990.00" arrivalPosLat="0.00" arrivalSpeed="15.88" duration="133.05" routeLength="1997.01" waitingTime="0.00" waitingCount="0" stopTime="0.00" timeLoss="7.26" rerouteNo="1" devices="tripinfo_car_w2e_282 routing_car_w2e_282" vType="Car" speedFactor="1.14" vaporized=""/>
    <tripinfo id="car_w2n_229" depart="229.00" departLane="w2sep_1" departPos="3.60" departPosLat="0.00" departSpeed="13.90" departDelay="0.00" arrival="415.60" arrivalLane="c2n_1" arrivalPos="990.00" arrivalPosLat="0.00" arrivalSpeed="13.90" duration="186.60" routeLength="1996.47" waitingTime="21.85" waitingCount="2" stopTime="0.00" timeLoss="42.25" rerouteNo="1" devices="tripinfo_car_w2n_229 routing_car_w2n_229" vType="Car" speedFactor="1.00" vaporized=""/>
    <tripinfo id="amb_w2e_300" depart="300.00" departLane="w2sep_1" departPos="6.60" departPosLat="0.00" departSpeed="13.90" departDelay="0.00" arrival="416.95" arrivalLane="c2e_1" arrivalPos="990.00" arrivalPosLat="0.62" arrivalSpeed="18.06" duration="116.95" routeLength="1994.01" waitingTime="0.00" waitingCount="0" stopTime="0.00" timeLoss="21.31" rerouteNo="1" devices="tripinfo_amb_w2e_300 routing_amb_w2e_300 bluelight_amb_w2e_300 fcd_amb_w2e_300" vType="Ambulance" speedFactor="1.50" vaporized="">
        <example_device customValue1="0.00" customValue2="-1.00"/>
    </tripinfo>
    <tripinfo id="car_w2n_240" depart="240.00" departLane="w2sep_1" departPos="3.60" departPosLat="0.00" departSpeed="13.90" departDelay="0.00" arrival="418.05" arrivalLane="c2n_1" arrivalPos="990.00" arrivalPosLat="0.00" arrivalSpeed="14.60" duration="178.05" routeLength="1996.47" waitingTime="13.65" waitingCount="2" stopTime="0.00" timeLoss="42.50" rerouteNo="1" devices="tripinfo_car_w2n_240 routing_car_w2n_240" vType="Car" speedFactor="1.06" vaporized=""/>
    <tripinfo id="car_e2s_241" depart="241.00" departLane="e2sep_1" departPos="3.60" departPosLat="0.00" departSpeed="13.90" departDelay="0.00" arrival="418.85" arrivalLane="c2s_1" arrivalPos="990.00" arrivalPosLat="0.00" arrivalSpeed="14.11" duration="177.85" routeLength="1996.47" waitingTime="12.00" waitingCount="3" stopTime="0.00" timeLoss="35.89" rerouteNo="1" devices="tripinfo_car_e2s_241 routing_car_e2s_241" vType="Car" speedFactor="1.02" vaporized=""/>
    <tripinfo id="car_w2n_264" depart="264.00" departLane="w2sep_1" departPos="3.60" departPosLat="0.00" departSpeed="13.90" departDelay="0.00" arrival="420.55" arrivalLane="c2n_1" arrivalPos="990.00" arrivalPosLat="0.00" arrivalSpeed="14.58" duration="156.55" routeLength="1996.47" waitingTime="3.65" waitingCount="1" stopTime="0.00" timeLoss="20.52" rerouteNo="1" devices="tripinfo_car_w2n_264 routing_car_w2n_264" vType="Car" speedFactor="1.06" vaporized=""/>
    <tripinfo id="car_e2s_278" depart="278.00" departLane="e2sep_1" departPos="3.60" departPosLat="0.00" departSpeed="13.90" departDelay="0.00" arrival="420.90" arrivalLane="c2s_1" arrivalPos="990.00" arrivalPosLat="0.00" arrivalSpeed="15.07" duration="142.90" routeLength="1996.47" waitingTime="0.00" waitingCount="0" stopTime="0.00" timeLoss="13.85" rerouteNo="1" devices="tripinfo_car_e2s_278 routing_car_e2s_278" vType="Car" speedFactor="1.12" vaporized=""/>
    <tripinfo id="car_w2n_281" depart="281.00" departLane="w2sep_1" departPos="3.60" departPosLat="0.00" departSpeed="13.90" departDelay="0.00" arrival="425.35" arrivalLane="c2n_1" arrivalPos="990.00" arrivalPosLat="0.00" arrivalSpeed="14.34" duration="144.35" routeLength="1996.47" waitingTime="0.00" waitingCount="0" stopTime="0.00" timeLoss="4.53" rerouteNo="1" devices="tripinfo_car_w2n_281 routing_car_w2n_281" vType="Car" speedFactor="1.03" vaporized=""/>
    <tripinfo id="car_e2w_285" depart="285.00" departLane="e2sep_1" departPos="3.60" departPosLat="0.00" departSpeed="13.90" departDelay="0.00" arrival="428.25" arrivalLane="c2w_1" arrivalPos="990.00" arrivalPosLat="0.00" arrivalSpeed="17.04" duration="143.25" routeLength="1997.01" waitingTime="10.10" waitingCount="1" stopTime="0.00" timeLoss="26.02" rerouteNo="1" devices="tripinfo_car_e2w_285 routing_car_e2w_285" vType="Car" speedFactor="1.23" vaporized=""/>
    <tripinfo id="car_w2s_282" depart="284.05" departLane="w2sep_1" departPos="3.60" departPosLat="0.00" departSpeed="13.90" departDelay="2.05" arrival="429.85" arrivalLane="c2s_1" arrivalPos="990.00" arrivalPosLat="0.00" arrivalSpeed="14.42" duration="145.80" routeLength="1986.69" waitingTime="0.00" waitingCount="0" stopTime="0.00" timeLoss="7.33" rerouteNo="1" devices="tripinfo_car_w2s_282 routing_car_w2s_282" vType="Car" speedFactor="1.04" vaporized=""/>
    <tripinfo id="car_e2n_281" depart="281.00" departLane="e2sep_1" departPos="3.60" departPosLat="0.00" departSpeed="13.90" departDelay="0.00" arrival="434.60" arrivalLane="c2n_1" arrivalPos="990.00" arrivalPosLat="0.00" arrivalSpeed="14.85" duration="153.60" routeLength="1986.69" waitingTime="11.05" waitingCount="1" stopTime="0.00" timeLoss="19.11" rerouteNo="1" devices="tripinfo_car_e2n_281 routing_car_e2n_281" vType="Car" speedFactor="1.07" vaporized=""/>
    <tripinfo id="car_w2s_292" depart="292.00" departLane="w2sep_1" departPos="3.60" departPosLat="0.00" departSpeed="13.90" departDelay="0.00" arrival="439.40" arrivalLane="c2s_1" arrivalPos="990.00" arrivalPosLat="0.00" arrivalSpeed="13.95" duration="147.40" routeLength="1986.69" waitingTime="0.00" waitingCount="0" stopTime="0.00" timeLoss="4.30" rerouteNo="1" devices="tripinfo_car_w2s_292 routing_car_w2s_292" vType="Car" speedFactor="1.00" vaporized=""/>
    <tripinfo id="car_e2s_288" depart="288.00" departLane="e2sep_1" departPos="3.60" departPosLat="0.00" departSpeed="13.90" departDelay="0.00" arrival="441.50" arrivalLane="c2s_1" arrivalPos="990.00" arrivalPosLat="0.00" arrivalSpeed="15.12" duration="153.50" routeLength="1996.47" waitingTime="5.80" waitingCount="1" stopTime="0.00" timeLoss="24.58" rerouteNo="1" devices="tripinfo_car_e2s_288 routing_car_e2s_288" vType="Car" speedFactor="1.12" vaporized=""/>
    <tripinfo id="car_n2s_245" depart="245.30" departLane="n2sep_1" departPos="3.60" departPosLat="0.00" departSpeed="13.90" departDelay="0.30" arrival="450.05" arrivalLane="c2s_1" arrivalPos="990.00" arrivalPosLat="0.00" arrivalSpeed="15.24" duration="204.75" routeLength="1997.01" waitingTime="63.30" waitingCount="1" stopTime="0.00" timeLoss="73.68" rerouteNo="1" devices="tripinfo_car_n2s_245 routing_car_n2s_245" vType="Car" speedFactor="1.10" vaporized=""/>
    <tripinfo id="car_s2n_299" depart="299.00" departLane="s2sep_1" departPos="3.60" departPosLat="0.00" departSpeed="13.90" departDelay="0.00" arrival="450.10" arrivalLane="c2n_1" arrivalPos="990.00" arrivalPosLat="0.00" arrivalSpeed="15.69" duration="151.10" routeLength="1997.01" waitingTime="12.05" waitingCount="1" stopTime="0.00" timeLoss="23.83" rerouteNo="1" devices="tripinfo_car_s2n_299 routing_car_s2n_299" vType="Car" speedFactor="1.13" vaporized=""/>
    <tripinfo id="car_n2w_252" depart="252.00" departLane="n2sep_1" departPos="3.60" departPosLat="0.00" departSpeed="13.90" departDelay="0.00" arrival="452.05" arrivalLane="c2w_1" arrivalPos="990.00" arrivalPosLat="0.00" arrivalSpeed="15.23" duration="200.05" routeLength="1986.69" waitingTime="59.35" waitingCount="1" stopTime="0.00" timeLoss="68.94" rerouteNo="1" devices="tripinfo_car_n2w_252 routing_car_n2w_252" vType="Car" speedFactor="1.10" vaporized=""/>
    <tripinfo id="car_n2w_254" depart="254.00" departLane="n2sep_1" departPos="3.60" departPosLat="0.00" departSpeed="13.90" departDelay="0.00" arrival="454.50" arrivalLane="c2w_1" arrivalPos="990.00" arrivalPosLat="0.00" arrivalSpeed="16.11" duration="200.50" routeLength="1986.69" waitingTime="58.35" waitingCount="1" stopTime="0.00" timeLoss="78.46" rerouteNo="1" devices="tripinfo_car_n2w_254 routing_car_n2w_254" vType="Car" speedFactor="1.18" vaporized=""/>
    <tripinfo id="car_s2e_291" depart="291.00" departLane="s2sep_1" departPos="3.60" departPosLat="0.00" departSpeed="13.90" departDelay="0.00" arrival="454.75" arrivalLane="c2e_1" arrivalPos="990.00" arrivalPosLat="0.00" arrivalSpeed="14.11" duration="163.75" routeLength="1986.69" waitingTime="14.70" waitingCount="1" stopTime="0.00" timeLoss="22.26" rerouteNo="1" devices="tripinfo_car_s2e_291 routing_car_s2e_291" vType="Car" speedFactor="1.02" vaporized=""/>
    <tripinfo id="car_s2e_302" depart="302.00" departLane="s2sep_1" departPos="3.60" departPosLat="0.00" departSpeed="13.90" departDelay="0.00" arrival="456.85" arrivalLane="c2e_1" arrivalPos="990.00" arrivalPosLat="0.00" arrivalSpeed="15.38" duration="154.85" routeLength="1986.69" waitingTime="10.80" waitingCount="1" stopTime="0.00" timeLoss="28.93" rerouteNo="1" devices="tripinfo_car_s2e_302 routing_car_s2e_302" vType="Car" speedFactor="1.14" vaporized=""/>
    <tripinfo id="car_n2w_260" depart="260.65" departLane="n2sep_1" departPos="3.60" departPosLat="0.00" departSpeed="13.90" departDelay="0.65" arrival="459.45" arrivalLane="c2w_1" arrivalPos="990.00" arrivalPosLat="0.00" arrivalSpeed="15.33" duration="198.80" routeLength="1986.69" waitingTime="47.40" waitingCount="1" stopTime="0.00" timeLoss="68.54" rerouteNo="1" devices="tripinfo_car_n2w_260 routing_car_n2w_260" vType="Car" speedFactor="1.10" vaporized=""/>
    <tripinfo id="car_n2s_259" depart="259.00" departLane="n2sep_1" departPos="3.60" departPosLat="0.00" departSpeed="13.90" departDelay="0.00" arrival="462.50" arrivalLane="c2s_1" arrivalPos="990.00" arrivalPosLat="0.00" arrivalSpeed="13.90" duration="203.50" routeLength="1997.01" waitingTime="48.10" waitingCount="1" stopTime="0.00" timeLoss="59.82" rerouteNo="1" devices="tripinfo_car_n2s_259 routing_car_n2s_259" vType="Car" speedFactor="1.00" vaporized=""/>
    <tripinfo id="car_s2n_311" depart="311.00" departLane="s2sep_1" departPos="3.60" departPosLat="0.00" departSpeed="13.90" departDelay="0.00" arrival="462.55" arrivalLane="c2n_1" arrivalPos="990.00" arrivalPosLat="0.00" arrivalSpeed="13.90" duration="151.55" routeLength="1997.01" waitingTime="0.00" waitingCount="0" stopTime="0.00" timeLoss="7.84" rerouteNo="1" devices="tripinfo_car_s2n_311 routing_car_s2n_311" vType="Car" speedFactor="1.00" vaporized=""/>
    <tripinfo id="car_s2e_312" depart="312.45" departLane="s2sep_1" departPos="3.60" departPosLat="0.00" departSpeed="13.90" departDelay="0.45" arrival="464.95" arrivalLane="c2e_1" arrivalPos="990.00" arrivalPosLat="0.00" arrivalSpeed="13.96" duration="152.50" routeLength="1986.69" waitingTime="0.00" waitingCount="0" stopTime="0.00" timeLoss="9.45" rerouteNo="1" devices="tripinfo_car_s2e_312 routing_car_s2e_312" vType="Car" speedFactor="1.00" vaporized=""/>
    <tripinfo id="car_n2w_262" depart="262.40" departLane="n2sep_1" departPos="3.60" departPosLat="0.00" departSpeed="13.90" departDelay="0.40" arrival="466.65" arrivalLane="c2w_1" arrivalPos="990.00" arrivalPosLat="0.00" arrivalSpeed="14.22" duration="204.25" routeLength="1986.69" waitingTime="45.75" waitingCount="1" stopTime="0.00" timeLoss="63.87" rerouteNo="1" devices="tripinfo_car_n2w_262 routing_car_n2w_262" vType="Car" speedFactor="1.02" vaporized=""/>
    <tripinfo id="car_n2e_257" depart="257.00" departLane="n2sep_1" departPos="3.60" departPosLat="0.00" departSpeed="13.90" departDelay="0.00" arrival="467.50" arrivalLane="c2e_1" arrivalPos="990.00" arrivalPosLat="0.00" arrivalSpeed="14.71" duration="210.50" routeLength="1996.47" waitingTime="57.15" waitingCount="2" stopTime="0.00" timeLoss="75.73" rerouteNo="1" devices="tripinfo_car_n2e_257 routing_car_n2e_257" vType="Car" speedFactor="1.07" vaporized=""/>
    <tripinfo id="car_n2e_300" depart="300.00" departLane="n2sep_1" departPos="3.60" departPosLat="0.00" departSpeed="13.90" departDelay="0.00" arrival="469.95" arrivalLane="c2e_1" arrivalPos="990.00" arrivalPosLat="0.00" arrivalSpeed="14.85" duration="169.95" routeLength="1996.47" waitingTime="15.40" waitingCount="2" stopTime="0.00" timeLoss="36.62" rerouteNo="1" devices="tripinfo_car_n2e_300 routing_car_n2e_300" vType="Car" speedFactor="1.08" vaporized=""/>
    <tripinfo id="car_n2w_278" depart="278.00" departLane="n2sep_1" departPos="3.60" departPosLat="0.00" departSpeed="13.90" departDelay="0.00" arrival="471.65" arrivalLane="c2w_1" arrivalPos="990.00" arrivalPosLat="0.00" arrivalSpeed="13.90" duration="193.65" routeLength="1986.69" waitingTime="34.25" waitingCount="1" stopTime="0.00" timeLoss="49.96" rerouteNo="1" devices="tripinfo_car_n2w_278 routing_car_n2w_278" vType="Car" speedFactor="1.00" vaporized=""/>
    <tripinfo id="car_n2e_316" depart="316.00" departLane="n2sep_1" departPos="3.60" departPosLat="0.00" departSpeed="13.90" departDelay="0.00" arrival="472.55" arrivalLane="c2e_1" arrivalPos="990.00" arrivalPosLat="0.00" arrivalSpeed="14.74" duration="156.55" routeLength="1996.47" waitingTime="3.25" waitingCount="1" stopTime="0.00" timeLoss="21.83" rerouteNo="1" devices="tripinfo_car_n2e_316 routing_car_n2e_316" vType="Car" speedFactor="1.07" vaporized=""/>
    <tripinfo id="car_n2w_279" depart="279.45" departLane="n2sep_1" departPos="3.60" departPosLat="0.00" departSpeed="13.90" departDelay="0.45" arrival="475.10" arrivalLane="c2w_1" arrivalPos="990.00" arrivalPosLat="0.00" arrivalSpeed="13.98" duration="195.65" routeLength="1986.69" waitingTime="32.15" waitingCount="1" stopTime="0.00" timeLoss="53.14" rerouteNo="1" devices="tripinfo_car_n2w_279 routing_car_n2w_279" vType="Car" speedFactor="1.01" vaporized=""/>
</tripinfos>
