<?xml version="1.0" encoding="UTF-8"?>

<!-- generated on 2021-05-18 05:16:47 by Eclipse SUMO sumo Version 1.9.1
<configuration xmlns:xsi="http://www.w3.org/2001/XMLSchema-instance" xsi:noNamespaceSchemaLocation="http://sumo.dlr.de/xsd/sumoConfiguration.xsd">

    <input>
        <net-file value="sumofiles/junction.net.xml"/>
        <route-files value="sumofiles/junction_radius_9.rou.xml"/>
        <additional-files value="sumofiles/junction.det.xml"/>
    </input>

    <output>
        <tripinfo-output value="sumofiles/output/tripinfo_radius_9.xml"/>
    </output>

    <time>
        <begin value="0"/>
        <end value="10000"/>
        <step-length value="1.0"/>
    </time>

    <processing>
        <lateral-resolution value="0.5"/>
    </processing>

    <report>
        <no-warnings value="true"/>
        <error-log value="sumofiles/output/errorlog_radius_9.log"/>
        <no-step-log value="true"/>
    </report>

    <traci_server>
        <remote-port value="58385"/>
    </traci_server>

    <gui_only>
        <gui-settings-file value="sumofiles/junction-gui.settings.xml"/>
        <tracker-interval value="1"/>
    </gui_only>

</configuration>
-->

<tripinfos xmlns:xsi="http://www.w3.org/2001/XMLSchema-instance" xsi:noNamespaceSchemaLocation="http://sumo.dlr.de/xsd/tripinfo_file.xsd">
    <tripinfo id="car_w2s_0" depart="0.00" departLane="w2sep_1" departPos="3.60" departPosLat="0.00" departSpeed="13.90" departDelay="0.00" arrival="141.00" arrivalLane="c2s_1" arrivalPos="990.00" arrivalPosLat="0.00" arrivalSpeed="14.73" duration="141.00" routeLength="1986.69" waitingTime="0.00" waitingCount="0" stopTime="0.00" timeLoss="5.41" rerouteNo="1" devices="tripinfo_car_w2s_0 routing_car_w2s_0" vType="Car" speedFactor="1.06" vaporized=""/>
    <tripinfo id="car_e2w_6" depart="6.00" departLane="e2sep_1" departPos="3.60" departPosLat="0.00" departSpeed="13.90" departDelay="0.00" arrival="150.00" arrivalLane="c2w_1" arrivalPos="990.00" arrivalPosLat="0.00" arrivalSpeed="13.90" duration="144.00" routeLength="1997.01" waitingTime="0.00" waitingCount="0" stopTime="0.00" timeLoss="0.06" rerouteNo="1" devices="tripinfo_car_e2w_6 routing_car_e2w_6" vType="Car" speedFactor="1.00" vaporized=""/>
    <tripinfo id="car_w2s_2" depart="2.00" departLane="w2sep_1" departPos="3.60" departPosLat="0.00" departSpeed="13.90" departDelay="0.00" arrival="151.00" arrivalLane="c2s_1" arrivalPos="990.00" arrivalPosLat="0.00" arrivalSpeed="14.04" duration="149.00" routeLength="1986.69" waitingTime="0.00" waitingCount="0" stopTime="0.00" timeLoss="6.20" rerouteNo="1" devices="tripinfo_car_w2s_2 routing_car_w2s_2" vType="Car" speedFactor="1.01" vaporized=""/>
    <tripinfo id="car_e2s_1" depart="1.00" departLane="e2sep_1" departPos="3.60" departPosLat="0.00" departSpeed="13.90" departDelay="0.00" arrival="154.00" arrivalLane="c2s_1" arrivalPos="990.00" arrivalPosLat="0.00" arrivalSpeed="14.65" duration="153.00" routeLength="1996.47" waitingTime="1.00" waitingCount="1" stopTime="0.00" timeLoss="16.16" rerouteNo="1" devices="tripinfo_car_e2s_1 routing_car_e2s_1" vType="Car" speedFactor="1.06" vaporized=""/>
    <tripinfo id="car_s2e_6" depart="6.00" departLane="s2sep_1" departPos="3.60" departPosLat="0.00" departSpeed="13.90" departDelay="0.00" arrival="161.00" arrivalLane="c2e_1" arrivalPos="990.00" arrivalPosLat="0.00" arrivalSpeed="14.54" duration="155.00" routeLength="1986.69" waitingTime="8.00" waitingCount="1" stopTime="0.00" timeLoss="17.74" rerouteNo="1" devices="tripinfo_car_s2e_6 routing_car_s2e_6" vType="Car" speedFactor="1.05" vaporized=""/>
    <tripinfo id="car_n2s_18" depart="18.00" departLane="n2sep_1" departPos="3.60" departPosLat="0.00" departSpeed="13.90" departDelay="0.00" arrival="161.00" arrivalLane="c2s_1" arrivalPos="990.00" arrivalPosLat="0.00" arrivalSpeed="14.54" duration="143.00" routeLength="1997.01" waitingTime="0.00" waitingCount="0" stopTime="0.00" timeLoss="5.51" rerouteNo="1" devices="tripinfo_car_n2s_18 routing_car_n2s_18" vType="Car" speedFactor="1.05" vaporized=""/>
    <tripinfo id="car_s2e_9" depart="10.00" departLane="s2sep_1" departPos="3.60" departPosLat="0.00" departSpeed="13.90" departDelay="1.00" arrival="167.00" arrivalLane="c2e_1" arrivalPos="990.00" arrivalPosLat="0.00" arrivalSpeed="14.32" duration="157.00" routeLength="1986.69" waitingTime="3.00" waitingCount="1" stopTime="0.00" timeLoss="16.72" rerouteNo="1" devices="tripinfo_car_s2e_9 routing_car_s2e_9" vType="Car" speedFactor="1.03" vaporized=""/>
    <tripinfo id="car_n2s_19" depart="20.00" departLane="n2sep_1" departPos="3.60" departPosLat="0.00" departSpeed="13.90" departDelay="1.00" arrival="168.00" arrivalLane="c2s_1" arrivalPos="990.00" arrivalPosLat="0.00" arrivalSpeed="13.90" duration="148.00" routeLength="1997.01" waitingTime="0.00" waitingCount="0" stopTime="0.00" timeLoss="3.69" rerouteNo="1" devices="tripinfo_car_n2s_19 routing_car_n2s_19" vType="Car" speedFactor="1.00" vaporized=""/>
    <tripinfo id="car_s2n_20" depart="22.00" departLane="s2sep_1" departPos="3.60" departPosLat="0.00" departSpeed="13.90" departDelay="2.00" arrival="168.00" arrivalLane="c2n_1" arrivalPos="990.00" arrivalPosLat="0.00" arrivalSpeed="14.15" duration="146.00" routeLength="1997.01" waitingTime="0.00" waitingCount="0" stopTime="0.00" timeLoss="4.17" rerouteNo="1" devices="tripinfo_car_s2n_20 routing_car_s2n_20" vType="Car" speedFactor="1.02" vaporized=""/>
    <tripinfo id="car_s2e_22" depart="24.00" departLane="s2sep_1" departPos="3.60" departPosLat="0.00" departSpeed="13.90" departDelay="2.00" arrival="170.00" arrivalLane="c2e_1" arrivalPos="990.00" arrivalPosLat="0.00" arrivalSpeed="15.08" duration="146.00" routeLength="1986.69" waitingTime="0.00" waitingCount="0" stopTime="0.00" timeLoss="13.26" rerouteNo="1" devices="tripinfo_car_s2e_22 routing_car_s2e_22" vType="Car" speedFactor="1.09" vaporized=""/>
    <tripinfo id="car_n2s_20" depart="22.00" departLane="n2sep_1" departPos="3.60" departPosLat="0.00" departSpeed="13.90" departDelay="2.00" arrival="172.00" arrivalLane="c2s_1" arrivalPos="990.00" arrivalPosLat="0.00" arrivalSpeed="13.89" duration="150.00" routeLength="1997.01" waitingTime="0.00" waitingCount="0" stopTime="0.00" timeLoss="5.88" rerouteNo="1" devices="tripinfo_car_n2s_20 routing_car_n2s_20" vType="Car" speedFactor="1.00" vaporized=""/>
    <tripinfo id="car_s2w_8" depart="8.00" departLane="s2sep_1" departPos="3.60" departPosLat="0.00" departSpeed="13.90" departDelay="0.00" arrival="175.00" arrivalLane="c2w_1" arrivalPos="990.00" arrivalPosLat="0.00" arrivalSpeed="15.05" duration="167.00" routeLength="1996.47" waitingTime="16.00" waitingCount="2" stopTime="0.00" timeLoss="33.04" rerouteNo="1" devices="tripinfo_car_s2w_8 routing_car_s2w_8" vType="Car" speedFactor="1.08" vaporized=""/>
    <tripinfo id="car_n2s_28" depart="28.00" departLane="n2sep_1" departPos="3.60" departPosLat="0.00" departSpeed="13.90" departDelay="0.00" arrival="175.00" arrivalLane="c2s_1" arrivalPos="990.00" arrivalPosLat="0.00" arrivalSpeed="14.20" duration="147.00" routeLength="1997.01" waitingTime="0.00" waitingCount="0" stopTime="0.00" timeLoss="6.50" rerouteNo="1" devices="tripinfo_car_n2s_28 routing_car_n2s_28" vType="Car" speedFactor="1.03" vaporized=""/>
    <tripinfo id="car_s2w_20" depart="20.00" departLane="s2sep_1" departPos="3.60" departPosLat="0.00" departSpeed="13.90" departDelay="0.00" arrival="177.00" arrivalLane="c2w_1" arrivalPos="990.00" arrivalPosLat="0.00" arrivalSpeed="15.81" duration="157.00" routeLength="1996.47" waitingTime="9.00" waitingCount="2" stopTime="0.00" timeLoss="32.31" rerouteNo="1" devices="tripinfo_car_s2w_20 routing_car_s2w_20" vType="Car" speedFactor="1.16" vaporized=""/>
    <tripinfo id="car_n2s_36" depart="36.00" departLane="n2sep_1" departPos="3.60" departPosLat="0.00" departSpeed="13.90" departDelay="0.00" arrival="177.00" arrivalLane="c2s_1" arrivalPos="990.00" arrivalPosLat="0.00" arrivalSpeed="15.18" duration="141.00" routeLength="1997.01" waitingTime="0.00" waitingCount="0" stopTime="0.00" timeLoss="13.53" rerouteNo="1" devices="tripinfo_car_n2s_36 routing_car_n2s_36" vType="Car" speedFactor="1.13" vaporized=""/>
    <tripinfo id="car_n2s_38" depart="38.00" departLane="n2sep_1" departPos="3.60" departPosLat="0.00" departSpeed="13.90" departDelay="0.00" arrival="179.00" arrivalLane="c2s_1" arrivalPos="990.00" arrivalPosLat="0.00" arrivalSpeed="15.63" duration="141.00" routeLength="1997.01" waitingTime="0.00" waitingCount="0" stopTime="0.00" timeLoss="18.43" rerouteNo="1" devices="tripinfo_car_n2s_38 routing_car_n2s_38" vType="Car" speedFactor="1.18" vaporized=""/>
    <tripinfo id="car_s2n_50" depart="50.00" departLane="s2sep_1" departPos="3.60" departPosLat="0.00" departSpeed="13.90" departDelay="0.00" arrival="181.00" arrivalLane="c2n_1" arrivalPos="990.00" arrivalPosLat="0.00" arrivalSpeed="15.32" duration="131.00" routeLength="1997.01" waitingTime="0.00" waitingCount="0" stopTime="0.00" timeLoss="0.35" rerouteNo="1" devices="tripinfo_car_s2n_50 routing_car_s2n_50" vType="Car" speedFactor="1.10" vaporized=""/>
    <tripinfo id="car_n2s_43" depart="43.00" departLane="n2sep_1" departPos="3.60" departPosLat="0.00" departSpeed="13.90" departDelay="0.00" arrival="188.00" arrivalLane="c2s_1" arrivalPos="990.00" arrivalPosLat="0.00" arrivalSpeed="13.90" duration="145.00" routeLength="1997.01" waitingTime="0.00" waitingCount="0" stopTime="0.00" timeLoss="0.69" rerouteNo="1" devices="tripinfo_car_n2s_43 routing_car_n2s_43" vType="Car" speedFactor="1.00" vaporized=""/>
    <tripinfo id="car_n2s_49" depart="49.00" departLane="n2sep_1" departPos="3.60" departPosLat="0.00" departSpeed="13.90" departDelay="0.00" arrival="190.00" arrivalLane="c2s_1" arrivalPos="990.00" arrivalPosLat="0.00" arrivalSpeed="15.62" duration="141.00" routeLength="1997.01" waitingTime="0.00" waitingCount="0" stopTime="0.00" timeLoss="18.45" rerouteNo="1" devices="tripinfo_car_n2s_49 routing_car_n2s_49" vType="Car" speedFactor="1.18" vaporized=""/>
    <tripinfo id="car_s2w_42" depart="42.00" departLane="s2sep_1" departPos="3.60" departPosLat="0.00" departSpeed="13.90" departDelay="0.00" arrival="191.00" arrivalLane="c2w_1" arrivalPos="990.00" arrivalPosLat="0.00" arrivalSpeed="14.17" duration="149.00" routeLength="1996.47" waitingTime="0.00" waitingCount="0" stopTime="0.00" timeLoss="6.34" rerouteNo="1" devices="tripinfo_car_s2w_42 routing_car_s2w_42" vType="Car" speedFactor="1.02" vaporized=""/>
    <tripinfo id="car_n2e_64" depart="64.00" departLane="n2sep_1" departPos="3.60" departPosLat="0.00" departSpeed="13.90" departDelay="0.00" arrival="200.00" arrivalLane="c2e_1" arrivalPos="990.00" arrivalPosLat="0.00" arrivalSpeed="15.18" duration="136.00" routeLength="1996.47" waitingTime="0.00" waitingCount="0" stopTime="0.00" timeLoss="2.82" rerouteNo="1" devices="tripinfo_car_n2e_64 routing_car_n2e_64" vType="Car" speedFactor="1.09" vaporized=""/>
    <tripinfo id="car_w2s_4" depart="4.00" departLane="w2sep_1" departPos="3.60" departPosLat="0.00" departSpeed="13.90" departDelay="0.00" arrival="204.00" arrivalLane="c2s_1" arrivalPos="990.00" arrivalPosLat="0.00" arrivalSpeed="15.05" duration="200.00" routeLength="1986.69" waitingTime="51.00" waitingCount="1" stopTime="0.00" timeLoss="67.24" rerouteNo="1" devices="tripinfo_car_w2s_4 routing_car_w2s_4" vType="Car" speedFactor="1.08" vaporized=""/>
    <tripinfo id="car_e2n_8" depart="8.00" departLane="e2sep_1" departPos="3.60" departPosLat="0.00" departSpeed="13.90" departDelay="0.00" arrival="209.00" arrivalLane="c2n_1" arrivalPos="990.00" arrivalPosLat="0.00" arrivalSpeed="14.04" duration="201.00" routeLength="1986.69" waitingTime="46.00" waitingCount="1" stopTime="0.00" timeLoss="58.28" rerouteNo="1" devices="tripinfo_car_e2n_8 routing_car_e2n_8" vType="Car" speedFactor="1.01" vaporized=""/>
    <tripinfo id="car_w2e_12" depart="12.00" departLane="w2sep_1" departPos="3.60" departPosLat="0.00" departSpeed="13.90" departDelay="0.00" arrival="209.00" arrivalLane="c2e_1" arrivalPos="990.00" arrivalPosLat="0.00" arrivalSpeed="15.16" duration="197.00" routeLength="1997.01" waitingTime="49.00" waitingCount="1" stopTime="0.00" timeLoss="64.48" rerouteNo="1" devices="tripinfo_car_w2e_12 routing_car_w2e_12" vType="Car" speedFactor="1.09" vaporized=""/>
    <tripinfo id="car_w2s_5" depart="6.00" departLane="w2sep_1" departPos="3.60" departPosLat="0.00" departSpeed="13.90" departDelay="1.00" arrival="211.00" arrivalLane="c2s_1" arrivalPos="990.00" arrivalPosLat="0.00" arrivalSpeed="14.32" duration="205.00" routeLength="1986.69" waitingTime="49.00" waitingCount="1" stopTime="0.00" timeLoss="65.22" rerouteNo="1" devices="tripinfo_car_w2s_5 routing_car_w2s_5" vType="Car" speedFactor="1.03" vaporized=""/>
    <tripinfo id="car_e2w_13" depart="14.00" departLane="e2sep_1" departPos="3.60" departPosLat="0.00" departSpeed="13.90" departDelay="1.00" arrival="211.00" arrivalLane="c2w_1" arrivalPos="990.00" arrivalPosLat="0.00" arrivalSpeed="14.55" duration="197.00" routeLength="1997.01" waitingTime="43.00" waitingCount="1" stopTime="0.00" timeLoss="59.46" rerouteNo="1" devices="tripinfo_car_e2w_13 routing_car_e2w_13" vType="Car" speedFactor="1.05" vaporized=""/>
    <tripinfo id="car_w2e_33" depart="33.00" departLane="w2sep_1" departPos="3.60" departPosLat="0.00" departSpeed="13.90" departDelay="0.00" arrival="212.00" arrivalLane="c2e_1" arrivalPos="990.00" arrivalPosLat="0.00" arrivalSpeed="15.54" duration="179.00" routeLength="1997.01" waitingTime="34.00" waitingCount="1" stopTime="0.00" timeLoss="50.47" rerouteNo="1" devices="tripinfo_car_w2e_33 routing_car_w2e_33" vType="Car" speedFactor="1.12" vaporized=""/>
    <tripinfo id="car_e2n_12" depart="12.00" departLane="e2sep_1" departPos="3.60" departPosLat="0.00" departSpeed="13.90" departDelay="0.00" arrival="213.00" arrivalLane="c2n_1" arrivalPos="990.00" arrivalPosLat="0.00" arrivalSpeed="14.25" duration="201.00" routeLength="1986.69" waitingTime="45.00" waitingCount="1" stopTime="0.00" timeLoss="60.24" rerouteNo="1" devices="tripinfo_car_e2n_12 routing_car_e2n_12" vType="Car" speedFactor="1.03" vaporized=""/>
    <tripinfo id="car_w2s_51" depart="51.00" departLane="w2sep_1" departPos="3.60" departPosLat="0.00" departSpeed="13.90" departDelay="0.00" arrival="213.00" arrivalLane="c2s_1" arrivalPos="990.00" arrivalPosLat="0.00" arrivalSpeed="15.70" duration="162.00" routeLength="1986.69" waitingTime="19.00" waitingCount="1" stopTime="0.00" timeLoss="37.81" rerouteNo="1" devices="tripinfo_car_w2s_51 routing_car_w2s_51" vType="Car" speedFactor="1.16" vaporized=""/>
    <tripinfo id="car_e2n_13" depart="16.00" departLane="e2sep_1" departPos="3.60" departPosLat="0.00" departSpeed="13.90" departDelay="3.00" arrival="215.00" arrivalLane="c2n_1" arrivalPos="990.00" arrivalPosLat="0.00" arrivalSpeed="15.19" duration="199.00" routeLength="1986.69" waitingTime="43.00" waitingCount="1" stopTime="0.00" timeLoss="70.43" rerouteNo="1" devices="tripinfo_car_e2n_13 routing_car_e2n_13" vType="Car" speedFactor="1.12" vaporized=""/>
    <tripinfo id="car_w2e_93" depart="95.00" departLane="w2sep_1" departPos="3.60" departPosLat="0.00" departSpeed="13.90" departDelay="2.00" arrival="220.00" arrivalLane="c2e_1" arrivalPos="990.00" arrivalPosLat="0.00" arrivalSpeed="16.25" duration="125.00" routeLength="1997.01" waitingTime="0.00" waitingCount="0" stopTime="0.00" timeLoss="2.06" rerouteNo="1" devices="tripinfo_car_w2e_93 routing_car_w2e_93" vType="Car" speedFactor="1.17" vaporized=""/>
    <tripinfo id="car_e2n_17" depart="18.00" departLane="e2sep_1" departPos="3.60" departPosLat="0.00" departSpeed="13.90" departDelay="1.00" arrival="221.00" arrivalLane="c2n_1" arrivalPos="990.00" arrivalPosLat="0.00" arrivalSpeed="13.90" duration="203.00" routeLength="1986.69" waitingTime="41.00" waitingCount="1" stopTime="0.00" timeLoss="59.05" rerouteNo="1" devices="tripinfo_car_e2n_17 routing_car_e2n_17" vType="Car" speedFactor="1.00" vaporized=""/>
    <tripinfo id="car_w2s_70" depart="70.00" departLane="w2sep_1" departPos="3.60" departPosLat="0.00" departSpeed="13.90" departDelay="0.00" arrival="221.00" arrivalLane="c2s_1" arrivalPos="990.00" arrivalPosLat="0.00" arrivalSpeed="14.42" duration="151.00" routeLength="1986.69" waitingTime="0.00" waitingCount="0" stopTime="0.00" timeLoss="12.29" rerouteNo="1" devices="tripinfo_car_w2s_70 routing_car_w2s_70" vType="Car" speedFactor="1.04" vaporized=""/>
    <tripinfo id="car_e2n_18" depart="20.00" departLane="e2sep_1" departPos="3.60" departPosLat="0.00" departSpeed="13.90" departDelay="2.00" arrival="225.00" arrivalLane="c2n_1" arrivalPos="990.00" arrivalPosLat="0.00" arrivalSpeed="13.89" duration="205.00" routeLength="1986.69" waitingTime="39.00" waitingCount="1" stopTime="0.00" timeLoss="61.32" rerouteNo="1" devices="tripinfo_car_e2n_18 routing_car_e2n_18" vType="Car" speedFactor="1.00" vaporized=""/>
    <tripinfo id="car_e2w_28" depart="28.00" departLane="e2sep_1" departPos="3.60" departPosLat="0.00" departSpeed="13.90" departDelay="0.00" arrival="225.00" arrivalLane="c2w_1" arrivalPos="990.00" arrivalPosLat="0.00" arrivalSpeed="14.55" duration="197.00" routeLength="1997.01" waitingTime="37.00" waitingCount="1" stopTime="0.00" timeLoss="59.69" rerouteNo="1" devices="tripinfo_car_e2w_28 routing_car_e2w_28" vType="Car" speedFactor="1.05" vaporized=""/>
    <tripinfo id="car_e2s_33" depart="33.00" departLane="e2sep_1" departPos="3.60" departPosLat="0.00" departSpeed="13.90" departDelay="0.00" arrival="227.00" arrivalLane="c2s_1" arrivalPos="990.00" arrivalPosLat="0.00" arrivalSpeed="13.90" duration="194.00" routeLength="1996.47" waitingTime="31.00" waitingCount="2" stopTime="0.00" timeLoss="49.41" rerouteNo="1" devices="tripinfo_car_e2s_33 routing_car_e2s_33" vType="Car" speedFactor="1.00" vaporized=""/>
    <tripinfo id="car_e2n_22" depart="22.00" departLane="e2sep_1" departPos="3.60" departPosLat="0.00" departSpeed="13.90" departDelay="0.00" arrival="229.00" arrivalLane="c2n_1" arrivalPos="990.00" arrivalPosLat="0.00" arrivalSpeed="14.02" duration="207.00" routeLength="1986.69" waitingTime="38.00" waitingCount="1" stopTime="0.00" timeLoss="63.84" rerouteNo="1" devices="tripinfo_car_e2n_22 routing_car_e2n_22" vType="Car" speedFactor="1.01" vaporized=""/>
    <tripinfo id="car_e2s_38" depart="39.00" departLane="e2sep_1" departPos="3.60" departPosLat="0.00" departSpeed="13.90" departDelay="1.00" arrival="229.00" arrivalLane="c2s_1" arrivalPos="990.00" arrivalPosLat="0.00" arrivalSpeed="15.40" duration="190.00" routeLength="1996.47" waitingTime="29.00" waitingCount="2" stopTime="0.00" timeLoss="64.44" rerouteNo="1" devices="tripinfo_car_e2s_38 routing_car_e2s_38" vType="Car" speedFactor="1.15" vaporized=""/>
    <tripinfo id="car_e2s_39" depart="41.00" departLane="e2sep_1" departPos="3.60" departPosLat="0.00" departSpeed="13.90" departDelay="2.00" arrival="231.00" arrivalLane="c2s_1" arrivalPos="990.00" arrivalPosLat="0.00" arrivalSpeed="15.63" duration="190.00" routeLength="1996.47" waitingTime="29.00" waitingCount="2" stopTime="0.00" timeLoss="66.32" rerouteNo="1" devices="tripinfo_car_e2s_39 routing_car_e2s_39" vType="Car" speedFactor="1.17" vaporized=""/>
    <tripinfo id="car_e2n_35" depart="35.00" departLane="e2sep_1" departPos="3.60" departPosLat="0.00" departSpeed="13.90" departDelay="0.00" arrival="233.00" arrivalLane="c2n_1" arrivalPos="990.00" arrivalPosLat="0.00" arrivalSpeed="13.89" duration="198.00" routeLength="1986.69" waitingTime="32.00" waitingCount="1" stopTime="0.00" timeLoss="53.70" rerouteNo="1" devices="tripinfo_car_e2n_35 routing_car_e2n_35" vType="Car" speedFactor="1.00" vaporized=""/>
    <tripinfo id="car_e2s_58" depart="58.00" departLane="e2sep_1" departPos="3.60" departPosLat="0.00" departSpeed="13.90" departDelay="0.00" arrival="235.00" arrivalLane="c2s_1" arrivalPos="990.00" arrivalPosLat="0.00" arrivalSpeed="14.31" duration="177.00" routeLength="1996.47" waitingTime="11.00" waitingCount="2" stopTime="0.00" timeLoss="36.47" rerouteNo="1" devices="tripinfo_car_e2s_58 routing_car_e2s_58" vType="Car" speedFactor="1.03" vaporized=""/>
    <tripinfo id="car_e2n_36" depart="37.00" departLane="e2sep_1" departPos="3.60" departPosLat="0.00" departSpeed="13.90" departDelay="1.00" arrival="237.00" arrivalLane="c2n_1" arrivalPos="990.00" arrivalPosLat="0.00" arrivalSpeed="13.89" duration="200.00" routeLength="1986.69" waitingTime="29.00" waitingCount="1" stopTime="0.00" timeLoss="55.57" rerouteNo="1" devices="tripinfo_car_e2n_36 routing_car_e2n_36" vType="Car" speedFactor="1.00" vaporized=""/>
    <tripinfo id="car_e2n_40" depart="43.00" departLane="e2sep_1" departPos="3.60" departPosLat="0.00" departSpeed="13.90" departDelay="3.00" arrival="240.00" arrivalLane="c2n_1" arrivalPos="990.00" arrivalPosLat="0.00" arrivalSpeed="13.86" duration="197.00" routeLength="1986.69" waitingTime="26.00" waitingCount="1" stopTime="0.00" timeLoss="52.83" rerouteNo="1" devices="tripinfo_car_e2n_40 routing_car_e2n_40" vType="Car" speedFactor="1.00" vaporized=""/>
    <tripinfo id="bus_e2s_84" depart="84.00" departLane="e2sep_1" departPos="12.10" departPosLat="0.00" departSpeed="13.90" departDelay="0.00" arrival="241.00" arrivalLane="c2s_1" arrivalPos="990.00" arrivalPosLat="0.00" arrivalSpeed="13.89" duration="157.00" routeLength="1987.97" waitingTime="0.00" waitingCount="0" stopTime="0.00" timeLoss="13.30" rerouteNo="1" devices="tripinfo_bus_e2s_84 routing_bus_e2s_84" vType="Bus" speedFactor="1.00" vaporized=""/>
    <tripinfo id="car_e2n_59" depart="60.00" departLane="e2sep_1" departPos="3.60" departPosLat="0.00" departSpeed="13.90" departDelay="1.00" arrival="243.00" arrivalLane="c2n_1" arrivalPos="990.00" arrivalPosLat="0.00" arrivalSpeed="14.09" duration="183.00" routeLength="1986.69" waitingTime="12.00" waitingCount="1" stopTime="0.00" timeLoss="41.29" rerouteNo="1" devices="tripinfo_car_e2n_59 routing_car_e2n_59" vType="Car" speedFactor="1.02" vaporized=""/>
    <tripinfo id="car_e2s_106" depart="107.00" departLane="e2sep_1" departPos="3.60" departPosLat="0.00" departSpeed="13.90" departDelay="1.00" arrival="244.00" arrivalLane="c2s_1" arrivalPos="990.00" arrivalPosLat="0.00" arrivalSpeed="15.47" duration="137.00" routeLength="1996.47" waitingTime="0.00" waitingCount="0" stopTime="0.00" timeLoss="8.89" rerouteNo="1" devices="tripinfo_car_e2s_106 routing_car_e2s_106" vType="Car" speedFactor="1.13" vaporized=""/>
    <tripinfo id="car_w2n_39" depart="39.00" departLane="w2sep_1" departPos="3.60" departPosLat="0.00" departSpeed="13.90" departDelay="0.00" arrival="246.00" arrivalLane="c2n_1" arrivalPos="990.00" arrivalPosLat="0.00" arrivalSpeed="13.92" duration="207.00" routeLength="1996.47" waitingTime="43.00" waitingCount="2" stopTime="0.00" timeLoss="63.18" rerouteNo="1" devices="tripinfo_car_w2n_39 routing_car_w2n_39" vType="Car" speedFactor="1.01" vaporized=""/>
    <tripinfo id="car_w2n_85" depart="85.00" departLane="w2sep_1" departPos="3.60" departPosLat="0.00" departSpeed="13.90" departDelay="0.00" arrival="249.00" arrivalLane="c2n_1" arrivalPos="990.00" arrivalPosLat="0.00" arrivalSpeed="13.85" duration="164.00" routeLength="1996.47" waitingTime="4.00" waitingCount="1" stopTime="0.00" timeLoss="19.45" rerouteNo="1" devices="tripinfo_car_w2n_85 routing_car_w2n_85" vType="Car" speedFactor="1.00" vaporized=""/>
    <tripinfo id="car_w2n_88" depart="88.00" departLane="w2sep_1" departPos="3.60" departPosLat="0.00" departSpeed="13.90" departDelay="0.00" arrival="252.00" arrivalLane="c2n_1" arrivalPos="990.00" arrivalPosLat="0.00" arrivalSpeed="13.84" duration="164.00" routeLength="1996.47" waitingTime="2.00" waitingCount="1" stopTime="0.00" timeLoss="19.41" rerouteNo="1" devices="tripinfo_car_w2n_88 routing_car_w2n_88" vType="Car" speedFactor="1.00" vaporized=""/>
    <tripinfo id="car_s2e_88" depart="88.00" departLane="s2sep_1" departPos="3.60" departPosLat="0.00" departSpeed="13.90" departDelay="0.00" arrival="254.00" arrivalLane="c2e_1" arrivalPos="990.00" arrivalPosLat="0.00" arrivalSpeed="13.90" duration="166.00" routeLength="1986.69" waitingTime="13.00" waitingCount="1" stopTime="0.00" timeLoss="22.51" rerouteNo="1" devices="tripinfo_car_s2e_88 routing_car_s2e_88" vType="Car" speedFactor="1.00" vaporized=""/>
    <tripinfo id="car_w2n_93" depart="93.00" departLane="w2sep_1" departPos="3.60" departPosLat="0.00" departSpeed="13.90" departDelay="0.00" arrival="255.00" arrivalLane="c2n_1" arrivalPos="990.00" arrivalPosLat="0.00" arrivalSpeed="13.84" duration="162.00" routeLength="1996.47" waitingTime="0.00" waitingCount="0" stopTime="0.00" timeLoss="17.23" rerouteNo="1" devices="tripinfo_car_w2n_93 routing_car_w2n_93" vType="Car" speedFactor="1.00" vaporized=""/>
    <tripinfo id="car_s2e_97" depart="97.00" departLane="s2sep_1" departPos="3.60" departPosLat="0.00" departSpeed="13.90" departDelay="0.00" arrival="257.00" arrivalLane="c2e_1" arrivalPos="990.00" arrivalPosLat="0.00" arrivalSpeed="15.07" duration="160.00" routeLength="1986.69" waitingTime="11.00" waitingCount="1" stopTime="0.00" timeLoss="28.14" rerouteNo="1" devices="tripinfo_car_s2e_97 routing_car_s2e_97" vType="Car" speedFactor="1.10" vaporized=""/>
    <tripinfo id="bus_n2w_80" depart="80.00" departLane="n2sep_1" departPos="12.10" departPosLat="0.00" departSpeed="13.90" departDelay="0.00" arrival="258.00" arrivalLane="c2w_1" arrivalPos="990.00" arrivalPosLat="0.00" arrivalSpeed="13.90" duration="178.00" routeLength="1978.19" waitingTime="22.00" waitingCount="1" stopTime="0.00" timeLoss="34.59" rerouteNo="1" devices="tripinfo_bus_n2w_80 routing_bus_n2w_80" vType="Bus" speedFactor="1.00" vaporized=""/>
    <tripinfo id="car_n2e_107" depart="107.00" departLane="n2sep_1" departPos="3.60" departPosLat="0.00" departSpeed="13.90" departDelay="0.00" arrival="259.00" arrivalLane="c2e_1" arrivalPos="990.00" arrivalPosLat="0.00" arrivalSpeed="14.82" duration="152.00" routeLength="1996.47" waitingTime="0.00" waitingCount="0" stopTime="0.00" timeLoss="18.50" rerouteNo="1" devices="tripinfo_car_n2e_107 routing_car_n2e_107" vType="Car" speedFactor="1.08" vaporized=""/>
    <tripinfo id="car_n2w_114" depart="115.00" departLane="n2sep_1" departPos="3.60" departPosLat="0.00" departSpeed="13.90" departDelay="1.00" arrival="261.00" arrivalLane="c2w_1" arrivalPos="990.00" arrivalPosLat="0.00" arrivalSpeed="15.98" duration="146.00" routeLength="1986.69" waitingTime="0.00" waitingCount="0" stopTime="0.00" timeLoss="23.22" rerouteNo="1" devices="tripinfo_car_n2w_114 routing_car_n2w_114" vType="Car" speedFactor="1.18" vaporized=""/>
    <tripinfo id="car_n2e_113" depart="113.00" departLane="n2sep_1" departPos="3.60" departPosLat="0.00" departSpeed="13.90" departDelay="0.00" arrival="264.00" arrivalLane="c2e_1" arrivalPos="990.00" arrivalPosLat="0.00" arrivalSpeed="13.90" duration="151.00" routeLength="1996.47" waitingTime="0.00" waitingCount="0" stopTime="0.00" timeLoss="6.26" rerouteNo="1" devices="tripinfo_car_n2e_113 routing_car_n2e_113" vType="Car" speedFactor="1.00" vaporized=""/>
    <tripinfo id="car_s2n_136" depart="136.00" departLane="s2sep_1" departPos="3.60" departPosLat="0.00" departSpeed="13.90" departDelay="0.00" arrival="277.00" arrivalLane="c2n_1" arrivalPos="990.00" arrivalPosLat="0.00" arrivalSpeed="14.21" duration="141.00" routeLength="1997.01" waitingTime="0.00" waitingCount="0" stopTime="0.00" timeLoss="0.17" rerouteNo="1" devices="tripinfo_car_s2n_136 routing_car_s2n_136" vType="Car" speedFactor="1.02" vaporized=""/>
    <tripinfo id="car_n2w_134" depart="134.00" departLane="n2sep_1" departPos="3.60" departPosLat="0.00" departSpeed="13.90" departDelay="0.00" arrival="278.00" arrivalLane="c2w_1" arrivalPos="990.00" arrivalPosLat="0.00" arrivalSpeed="14.46" duration="144.00" routeLength="1986.69" waitingTime="0.00" waitingCount="0" stopTime="0.00" timeLoss="5.06" rerouteNo="1" devices="tripinfo_car_n2w_134 routing_car_n2w_134" vType="Car" speedFactor="1.04" vaporized=""/>
    <tripinfo id="car_s2w_138" depart="138.00" departLane="s2sep_1" departPos="3.60" departPosLat="0.00" departSpeed="13.90" departDelay="0.00" arrival="286.00" arrivalLane="c2w_1" arrivalPos="990.00" arrivalPosLat="0.00" arrivalSpeed="14.17" duration="148.00" routeLength="1996.47" waitingTime="0.00" waitingCount="0" stopTime="0.00" timeLoss="5.56" rerouteNo="1" devices="tripinfo_car_s2w_138 routing_car_s2w_138" vType="Car" speedFactor="1.02" vaporized=""/>
    <tripinfo id="car_n2e_143" depart="143.00" departLane="n2sep_1" departPos="3.60" departPosLat="0.00" departSpeed="13.90" departDelay="0.00" arrival="290.00" arrivalLane="c2e_1" arrivalPos="990.00" arrivalPosLat="0.00" arrivalSpeed="13.90" duration="147.00" routeLength="1996.47" waitingTime="0.00" waitingCount="0" stopTime="0.00" timeLoss="2.32" rerouteNo="1" devices="tripinfo_car_n2e_143 routing_car_n2e_143" vType="Car" speedFactor="1.00" vaporized=""/>
    <tripinfo id="car_e2w_70" depart="70.00" departLane="e2sep_1" departPos="3.60" departPosLat="0.00" departSpeed="13.90" departDelay="0.00" arrival="297.00" arrivalLane="c2w_1" arrivalPos="990.00" arrivalPosLat="0.00" arrivalSpeed="14.50" duration="227.00" routeLength="1997.01" waitingTime="59.00" waitingCount="2" stopTime="0.00" timeLoss="88.80" rerouteNo="1" devices="tripinfo_car_e2w_70 routing_car_e2w_70" vType="Car" speedFactor="1.04" vaporized=""/>
    <tripinfo id="car_e2w_75" depart="75.00" departLane="e2sep_1" departPos="3.60" departPosLat="0.00" departSpeed="13.90" departDelay="0.00" arrival="300.00" arrivalLane="c2w_1" arrivalPos="990.00" arrivalPosLat="0.00" arrivalSpeed="15.05" duration="225.00" routeLength="1997.01" waitingTime="57.00" waitingCount="2" stopTime="0.00" timeLoss="92.43" rerouteNo="1" devices="tripinfo_car_e2w_75 routing_car_e2w_75" vType="Car" speedFactor="1.09" vaporized=""/>
    <tripinfo id="car_w2e_99" depart="99.00" departLane="w2sep_1" departPos="3.60" departPosLat="0.00" departSpeed="13.90" departDelay="0.00" arrival="300.00" arrivalLane="c2e_1" arrivalPos="990.00" arrivalPosLat="0.00" arrivalSpeed="13.94" duration="201.00" routeLength="1997.01" waitingTime="47.00" waitingCount="1" stopTime="0.00" timeLoss="57.04" rerouteNo="1" devices="tripinfo_car_w2e_99 routing_car_w2e_99" vType="Car" speedFactor="1.00" vaporized=""/>
    <tripinfo id="car_w2s_104" depart="104.00" departLane="w2sep_1" departPos="3.60" departPosLat="0.00" departSpeed="13.90" departDelay="0.00" arrival="302.00" arrivalLane="c2s_1" arrivalPos="990.00" arrivalPosLat="0.00" arrivalSpeed="13.90" duration="198.00" routeLength="1986.69" waitingTime="43.00" waitingCount="1" stopTime="0.00" timeLoss="54.14" rerouteNo="1" devices="tripinfo_car_w2s_104 routing_car_w2s_104" vType="Car" speedFactor="1.00" vaporized=""/>
    <tripinfo id="car_w2s_105" depart="106.00" departLane="w2sep_1" departPos="3.60" departPosLat="0.00" departSpeed="13.90" departDelay="1.00" arrival="304.00" arrivalLane="c2s_1" arrivalPos="990.00" arrivalPosLat="0.00" arrivalSpeed="15.32" duration="198.00" routeLength="1986.69" waitingTime="42.00" waitingCount="1" stopTime="0.00" timeLoss="72.07" rerouteNo="1" devices="tripinfo_car_w2s_105 routing_car_w2s_105" vType="Car" speedFactor="1.14" vaporized=""/>
    <tripinfo id="car_e2n_79" depart="79.00" departLane="e2sep_1" departPos="3.60" departPosLat="0.00" departSpeed="13.90" departDelay="0.00" arrival="305.00" arrivalLane="c2n_1" arrivalPos="990.00" arrivalPosLat="0.00" arrivalSpeed="14.04" duration="226.00" routeLength="1986.69" waitingTime="52.00" waitingCount="1" stopTime="0.00" timeLoss="82.73" rerouteNo="1" devices="tripinfo_car_e2n_79 routing_car_e2n_79" vType="Car" speedFactor="1.01" vaporized=""/>
    <tripinfo id="car_w2s_161" depart="161.00" departLane="w2sep_1" departPos="3.60" departPosLat="0.00" departSpeed="13.90" departDelay="0.00" arrival="306.00" arrivalLane="c2s_1" arrivalPos="990.00" arrivalPosLat="0.00" arrivalSpeed="15.52" duration="145.00" routeLength="1986.69" waitingTime="0.00" waitingCount="0" stopTime="0.00" timeLoss="19.77" rerouteNo="1" devices="tripinfo_car_w2s_161 routing_car_w2s_161" vType="Car" speedFactor="1.15" vaporized=""/>
    <tripinfo id="car_w2e_110" depart="110.00" departLane="w2sep_1" departPos="3.60" departPosLat="0.00" departSpeed="13.90" departDelay="0.00" arrival="307.00" arrivalLane="c2e_1" arrivalPos="990.00" arrivalPosLat="0.00" arrivalSpeed="14.12" duration="197.00" routeLength="1997.01" waitingTime="40.00" waitingCount="1" stopTime="0.00" timeLoss="54.76" rerouteNo="1" devices="tripinfo_car_w2e_110 routing_car_w2e_110" vType="Car" speedFactor="1.02" vaporized=""/>
    <tripinfo id="car_e2n_97" depart="97.00" departLane="e2sep_1" departPos="3.60" departPosLat="0.00" departSpeed="13.90" departDelay="0.00" arrival="309.00" arrivalLane="c2n_1" arrivalPos="990.00" arrivalPosLat="0.00" arrivalSpeed="14.12" duration="212.00" routeLength="1986.69" waitingTime="52.00" waitingCount="1" stopTime="0.00" timeLoss="70.05" rerouteNo="1" devices="tripinfo_car_e2n_97 routing_car_e2n_97" vType="Car" speedFactor="1.02" vaporized=""/>
    <tripinfo id="car_w2e_150" depart="150.00" departLane="w2sep_1" departPos="3.60" departPosLat="0.00" departSpeed="13.90" departDelay="0.00" arrival="310.00" arrivalLane="c2e_1" arrivalPos="990.00" arrivalPosLat="0.00" arrivalSpeed="14.31" duration="160.00" routeLength="1997.01" waitingTime="3.00" waitingCount="1" stopTime="0.00" timeLoss="20.61" rerouteNo="1" devices="tripinfo_car_w2e_150 routing_car_w2e_150" vType="Car" speedFactor="1.03" vaporized=""/>
    <tripinfo id="car_e2w_102" depart="102.00" departLane="e2sep_1" departPos="3.60" departPosLat="0.00" departSpeed="13.90" departDelay="0.00" arrival="311.00" arrivalLane="c2w_1" arrivalPos="990.00" arrivalPosLat="0.00" arrivalSpeed="13.90" duration="209.00" routeLength="1997.01" waitingTime="49.00" waitingCount="1" stopTime="0.00" timeLoss="64.48" rerouteNo="1" devices="tripinfo_car_e2w_102 routing_car_e2w_102" vType="Car" speedFactor="1.00" vaporized=""/>
    <tripinfo id="car_e2s_108" depart="109.00" departLane="e2sep_1" departPos="3.60" departPosLat="0.00" departSpeed="13.90" departDelay="1.00" arrival="312.00" arrivalLane="c2s_1" arrivalPos="990.00" arrivalPosLat="0.00" arrivalSpeed="15.56" duration="203.00" routeLength="1996.47" waitingTime="55.00" waitingCount="2" stopTime="0.00" timeLoss="73.79" rerouteNo="1" devices="tripinfo_car_e2s_108 routing_car_e2s_108" vType="Car" speedFactor="1.12" vaporized=""/>
    <tripinfo id="car_e2w_105" depart="105.00" departLane="e2sep_1" departPos="3.60" departPosLat="0.00" departSpeed="13.90" departDelay="0.00" arrival="314.00" arrivalLane="c2w_1" arrivalPos="990.00" arrivalPosLat="0.00" arrivalSpeed="14.18" duration="209.00" routeLength="1997.01" waitingTime="47.00" waitingCount="1" stopTime="0.00" timeLoss="68.27" rerouteNo="1" devices="tripinfo_car_e2w_105 routing_car_e2w_105" vType="Car" speedFactor="1.02" vaporized=""/>
    <tripinfo id="car_w2e_165" depart="165.00" departLane="w2sep_1" departPos="3.60" departPosLat="0.00" departSpeed="13.90" departDelay="0.00" arrival="315.00" arrivalLane="c2e_1" arrivalPos="990.00" arrivalPosLat="0.00" arrivalSpeed="13.92" duration="150.00" routeLength="1997.01" waitingTime="0.00" waitingCount="0" stopTime="0.00" timeLoss="6.33" rerouteNo="1" devices="tripinfo_car_w2e_165 routing_car_w2e_165" vType="Car" speedFactor="1.00" vaporized=""/>
    <tripinfo id="car_e2w_128" depart="128.00" departLane="e2sep_1" departPos="3.60" departPosLat="0.00" departSpeed="13.90" departDelay="0.00" arrival="316.00" arrivalLane="c2w_1" arrivalPos="990.00" arrivalPosLat="0.00" arrivalSpeed="15.57" duration="188.00" routeLength="1997.01" waitingTime="36.00" waitingCount="1" stopTime="0.00" timeLoss="64.89" rerouteNo="1" devices="tripinfo_car_e2w_128 routing_car_e2w_128" vType="Car" speedFactor="1.17" vaporized=""/>
    <tripinfo id="car_e2w_138" depart="138.00" departLane="e2sep_1" departPos="3.60" departPosLat="0.00" departSpeed="13.90" departDelay="0.00" arrival="319.00" arrivalLane="c2w_1" arrivalPos="990.00" arrivalPosLat="0.00" arrivalSpeed="14.17" duration="181.00" routeLength="1997.01" waitingTime="19.00" waitingCount="1" stopTime="0.00" timeLoss="40.29" rerouteNo="1" devices="tripinfo_car_e2w_138 routing_car_e2w_138" vType="Car" speedFactor="1.02" vaporized=""/>
    <tripinfo id="car_e2n_159" depart="159.00" departLane="e2sep_1" departPos="3.60" departPosLat="0.00" departSpeed="13.90" departDelay="0.00" arrival="319.00" arrivalLane="c2n_1" arrivalPos="990.00" arrivalPosLat="0.00" arrivalSpeed="13.90" duration="160.00" routeLength="1986.69" waitingTime="0.00" waitingCount="0" stopTime="0.00" timeLoss="16.33" rerouteNo="1" devices="tripinfo_car_e2n_159 routing_car_e2n_159" vType="Car" speedFactor="1.00" vaporized=""/>
    <tripinfo id="car_w2e_171" depart="171.00" departLane="w2sep_1" departPos="3.60" departPosLat="0.00" departSpeed="13.90" departDelay="0.00" arrival="319.00" arrivalLane="c2e_1" arrivalPos="990.00" arrivalPosLat="0.00" arrivalSpeed="13.98" duration="148.00" routeLength="1997.01" waitingTime="0.00" waitingCount="0" stopTime="0.00" timeLoss="4.77" rerouteNo="1" devices="tripinfo_car_w2e_171 routing_car_w2e_171" vType="Car" speedFactor="1.01" vaporized=""/>
    <tripinfo id="car_w2n_117" depart="117.00" departLane="w2sep_1" departPos="3.60" departPosLat="0.00" departSpeed="13.90" departDelay="0.00" arrival="321.00" arrivalLane="c2n_1" arrivalPos="990.00" arrivalPosLat="0.00" arrivalSpeed="15.42" duration="204.00" routeLength="1996.47" waitingTime="56.00" waitingCount="2" stopTime="0.00" timeLoss="78.86" rerouteNo="1" devices="tripinfo_car_w2n_117 routing_car_w2n_117" vType="Car" speedFactor="1.15" vaporized=""/>
    <tripinfo id="car_e2s_138" depart="140.00" departLane="e2sep_1" departPos="3.60" departPosLat="0.00" departSpeed="13.90" departDelay="2.00" arrival="322.00" arrivalLane="c2s_1" arrivalPos="990.00" arrivalPosLat="0.00" arrivalSpeed="13.90" duration="182.00" routeLength="1996.47" waitingTime="19.00" waitingCount="2" stopTime="0.00" timeLoss="37.16" rerouteNo="1" devices="tripinfo_car_e2s_138 routing_car_e2s_138" vType="Car" speedFactor="1.00" vaporized=""/>
    <tripinfo id="car_e2w_166" depart="166.00" departLane="e2sep_1" departPos="3.60" departPosLat="0.00" departSpeed="13.90" departDelay="0.00" arrival="322.00" arrivalLane="c2w_1" arrivalPos="990.00" arrivalPosLat="0.00" arrivalSpeed="14.41" duration="156.00" routeLength="1997.01" waitingTime="0.00" waitingCount="0" stopTime="0.00" timeLoss="17.69" rerouteNo="1" devices="tripinfo_car_e2w_166 routing_car_e2w_166" vType="Car" speedFactor="1.04" vaporized=""/>
    <tripinfo id="car_e2s_142" depart="142.00" departLane="e2sep_1" departPos="3.60" departPosLat="0.00" departSpeed="13.90" departDelay="0.00" arrival="325.00" arrivalLane="c2s_1" arrivalPos="990.00" arrivalPosLat="0.00" arrivalSpeed="14.59" duration="183.00" routeLength="1996.47" waitingTime="18.00" waitingCount="2" stopTime="0.00" timeLoss="45.43" rerouteNo="1" devices="tripinfo_car_e2s_142 routing_car_e2s_142" vType="Car" speedFactor="1.06" vaporized=""/>
    <tripinfo id="car_w2n_128" depart="128.00" departLane="w2sep_1" departPos="3.60" departPosLat="0.00" departSpeed="13.90" departDelay="0.00" arrival="327.00" arrivalLane="c2n_1" arrivalPos="990.00" arrivalPosLat="0.00" arrivalSpeed="13.97" duration="199.00" routeLength="1996.47" waitingTime="36.00" waitingCount="2" stopTime="0.00" timeLoss="54.98" rerouteNo="1" devices="tripinfo_car_w2n_128 routing_car_w2n_128" vType="Car" speedFactor="1.01" vaporized=""/>
    <tripinfo id="car_e2s_148" depart="148.00" departLane="e2sep_1" departPos="3.60" departPosLat="0.00" departSpeed="13.90" departDelay="0.00" arrival="327.00" arrivalLane="c2s_1" arrivalPos="990.00" arrivalPosLat="0.00" arrivalSpeed="15.70" duration="179.00" routeLength="1996.47" waitingTime="17.00" waitingCount="2" stopTime="0.00" timeLoss="55.69" rerouteNo="1" devices="tripinfo_car_e2s_148 routing_car_e2s_148" vType="Car" speedFactor="1.18" vaporized=""/>
    <tripinfo id="car_e2s_156" depart="156.00" departLane="e2sep_1" departPos="3.60" departPosLat="0.00" departSpeed="13.90" departDelay="0.00" arrival="329.00" arrivalLane="c2s_1" arrivalPos="990.00" arrivalPosLat="0.00" arrivalSpeed="14.85" duration="173.00" routeLength="1996.47" waitingTime="12.00" waitingCount="2" stopTime="0.00" timeLoss="39.69" rerouteNo="1" devices="tripinfo_car_e2s_156 routing_car_e2s_156" vType="Car" speedFactor="1.09" vaporized=""/>
    <tripinfo id="car_w2n_154" depart="154.00" departLane="w2sep_1" departPos="3.60" departPosLat="0.00" departSpeed="13.90" departDelay="0.00" arrival="331.00" arrivalLane="c2n_1" arrivalPos="990.00" arrivalPosLat="0.00" arrivalSpeed="13.99" duration="177.00" routeLength="1996.47" waitingTime="17.00" waitingCount="1" stopTime="0.00" timeLoss="33.10" rerouteNo="1" devices="tripinfo_car_w2n_154 routing_car_w2n_154" vType="Car" speedFactor="1.01" vaporized=""/>
    <tripinfo id="car_e2s_159" depart="161.00" departLane="e2sep_1" departPos="3.60" departPosLat="0.00" departSpeed="13.90" departDelay="2.00" arrival="333.00" arrivalLane="c2s_1" arrivalPos="990.00" arrivalPosLat="0.00" arrivalSpeed="14.12" duration="172.00" routeLength="1996.47" waitingTime="11.00" waitingCount="1" stopTime="0.00" timeLoss="29.69" rerouteNo="1" devices="tripinfo_car_e2s_159 routing_car_e2s_159" vType="Car" speedFactor="1.02" vaporized=""/>
    <tripinfo id="car_w2n_159" depart="159.00" departLane="w2sep_1" departPos="3.60" departPosLat="0.00" departSpeed="13.90" departDelay="0.00" arrival="334.00" arrivalLane="c2n_1" arrivalPos="990.00" arrivalPosLat="0.00" arrivalSpeed="14.31" duration="175.00" routeLength="1996.47" waitingTime="16.00" waitingCount="1" stopTime="0.00" timeLoss="34.67" rerouteNo="1" devices="tripinfo_car_w2n_159 routing_car_w2n_159" vType="Car" speedFactor="1.03" vaporized=""/>
    <tripinfo id="car_e2s_164" depart="164.00" departLane="e2sep_1" departPos="3.60" departPosLat="0.00" departSpeed="13.90" departDelay="0.00" arrival="337.00" arrivalLane="c2s_1" arrivalPos="990.00" arrivalPosLat="0.00" arrivalSpeed="13.89" duration="173.00" routeLength="1996.47" waitingTime="8.00" waitingCount="1" stopTime="0.00" timeLoss="28.56" rerouteNo="1" devices="tripinfo_car_e2s_164 routing_car_e2s_164" vType="Car" speedFactor="1.00" vaporized=""/>
    <tripinfo id="car_w2n_179" depart="179.00" departLane="w2sep_1" departPos="3.60" departPosLat="0.00" departSpeed="13.90" departDelay="0.00" arrival="337.00" arrivalLane="c2n_1" arrivalPos="990.00" arrivalPosLat="0.00" arrivalSpeed="14.15" duration="158.00" routeLength="1996.47" waitingTime="0.00" waitingCount="0" stopTime="0.00" timeLoss="16.06" rerouteNo="1" devices="tripinfo_car_w2n_179 routing_car_w2n_179" vType="Car" speedFactor="1.02" vaporized=""/>
    <tripinfo id="car_w2n_182" depart="182.00" departLane="w2sep_1" departPos="3.60" departPosLat="0.00" departSpeed="13.90" departDelay="0.00" arrival="339.00" arrivalLane="c2n_1" arrivalPos="990.00" arrivalPosLat="0.00" arrivalSpeed="14.24" duration="157.00" routeLength="1996.47" waitingTime="0.00" waitingCount="0" stopTime="0.00" timeLoss="17.85" rerouteNo="1" devices="tripinfo_car_w2n_182 routing_car_w2n_182" vType="Car" speedFactor="1.04" vaporized=""/>
    <tripinfo id="car_n2w_180" depart="181.00" departLane="n2sep_1" departPos="3.60" departPosLat="0.00" departSpeed="13.90" departDelay="1.00" arrival="341.00" arrivalLane="c2w_1" arrivalPos="990.00" arrivalPosLat="0.00" arrivalSpeed="15.18" duration="160.00" routeLength="1986.69" waitingTime="12.00" waitingCount="1" stopTime="0.00" timeLoss="28.39" rerouteNo="1" devices="tripinfo_car_n2w_180 routing_car_n2w_180" vType="Car" speedFactor="1.09" vaporized=""/>
    <tripinfo id="car_s2n_152" depart="152.00" departLane="s2sep_1" departPos="3.60" departPosLat="0.00" departSpeed="13.90" departDelay="0.00" arrival="342.00" arrivalLane="c2n_1" arrivalPos="990.00" arrivalPosLat="0.00" arrivalSpeed="15.13" duration="190.00" routeLength="1997.01" waitingTime="45.00" waitingCount="1" stopTime="0.00" timeLoss="58.77" rerouteNo="1" devices="tripinfo_car_s2n_152 routing_car_s2n_152" vType="Car" speedFactor="1.10" vaporized=""/>
    <tripinfo id="car_n2s_179" depart="179.00" departLane="n2sep_1" departPos="3.60" departPosLat="0.00" departSpeed="13.90" departDelay="0.00" arrival="344.00" arrivalLane="c2s_1" arrivalPos="990.00" arrivalPosLat="0.00" arrivalSpeed="14.13" duration="165.00" routeLength="1997.01" waitingTime="13.00" waitingCount="1" stopTime="0.00" timeLoss="23.23" rerouteNo="1" devices="tripinfo_car_n2s_179 routing_car_n2s_179" vType="Car" speedFactor="1.02" vaporized=""/>
    <tripinfo id="car_s2e_160" depart="160.00" departLane="s2sep_1" departPos="3.60" departPosLat="0.00" departSpeed="13.90" departDelay="0.00" arrival="345.00" arrivalLane="c2e_1" arrivalPos="990.00" arrivalPosLat="0.00" arrivalSpeed="14.32" duration="185.00" routeLength="1986.69" waitingTime="34.00" waitingCount="1" stopTime="0.00" timeLoss="45.33" rerouteNo="1" devices="tripinfo_car_s2e_160 routing_car_s2e_160" vType="Car" speedFactor="1.03" vaporized=""/>
    <tripinfo id="car_n2w_206" depart="206.00" departLane="n2sep_1" departPos="3.60" departPosLat="0.00" departSpeed="13.90" departDelay="0.00" arrival="346.00" arrivalLane="c2w_1" arrivalPos="990.00" arrivalPosLat="0.00" arrivalSpeed="15.12" duration="140.00" routeLength="1986.69" waitingTime="0.00" waitingCount="0" stopTime="0.00" timeLoss="7.57" rerouteNo="1" devices="tripinfo_car_n2w_206 routing_car_n2w_206" vType="Car" speedFactor="1.09" vaporized=""/>
    <tripinfo id="car_n2s_207" depart="208.00" departLane="n2sep_1" departPos="3.60" departPosLat="0.00" departSpeed="13.90" departDelay="1.00" arrival="347.00" arrivalLane="c2s_1" arrivalPos="990.00" arrivalPosLat="0.00" arrivalSpeed="15.18" duration="139.00" routeLength="1997.01" waitingTime="0.00" waitingCount="0" stopTime="0.00" timeLoss="7.85" rerouteNo="1" devices="tripinfo_car_n2s_207 routing_car_n2s_207" vType="Car" speedFactor="1.10" vaporized=""/>
    <tripinfo id="car_n2e_196" depart="196.00" departLane="n2sep_1" departPos="3.60" departPosLat="0.00" departSpeed="13.90" departDelay="0.00" arrival="348.00" arrivalLane="c2e_1" arrivalPos="990.00" arrivalPosLat="0.00" arrivalSpeed="15.07" duration="152.00" routeLength="1996.47" waitingTime="0.00" waitingCount="0" stopTime="0.00" timeLoss="19.21" rerouteNo="1" devices="tripinfo_car_n2e_196 routing_car_n2e_196" vType="Car" speedFactor="1.09" vaporized=""/>
    <tripinfo id="car_s2w_190" depart="190.00" departLane="s2sep_1" departPos="3.60" departPosLat="0.00" departSpeed="13.90" departDelay="0.00" arrival="353.00" arrivalLane="c2w_1" arrivalPos="990.00" arrivalPosLat="0.00" arrivalSpeed="14.50" duration="163.00" routeLength="1996.47" waitingTime="7.00" waitingCount="2" stopTime="0.00" timeLoss="24.03" rerouteNo="1" devices="tripinfo_car_s2w_190 routing_car_s2w_190" vType="Car" speedFactor="1.04" vaporized=""/>
    <tripinfo id="car_n2e_201" depart="201.00" departLane="n2sep_1" departPos="3.60" departPosLat="0.00" departSpeed="13.90" departDelay="0.00" arrival="353.00" arrivalLane="c2e_1" arrivalPos="990.00" arrivalPosLat="0.00" arrivalSpeed="14.03" duration="152.00" routeLength="1996.47" waitingTime="0.00" waitingCount="0" stopTime="0.00" timeLoss="8.59" rerouteNo="1" devices="tripinfo_car_n2e_201 routing_car_n2e_201" vType="Car" speedFactor="1.01" vaporized=""/>
    <tripinfo id="car_s2e_227" depart="227.00" departLane="s2sep_1" departPos="3.60" departPosLat="0.00" departSpeed="13.90" departDelay="0.00" arrival="367.00" arrivalLane="c2e_1" arrivalPos="990.00" arrivalPosLat="0.00" arrivalSpeed="14.91" duration="140.00" routeLength="1986.69" waitingTime="0.00" waitingCount="0" stopTime="0.00" timeLoss="5.26" rerouteNo="1" devices="tripinfo_car_s2e_227 routing_car_s2e_227" vType="Car" speedFactor="1.07" vaporized=""/>
    <tripinfo id="car_n2e_243" depart="243.00" departLane="n2sep_1" departPos="3.60" departPosLat="0.00" departSpeed="13.90" departDelay="0.00" arrival="371.00" arrivalLane="c2e_1" arrivalPos="990.00" arrivalPosLat="0.00" arrivalSpeed="16.22" duration="128.00" routeLength="1996.47" waitingTime="0.00" waitingCount="0" stopTime="0.00" timeLoss="3.61" rerouteNo="1" devices="tripinfo_car_n2e_243 routing_car_n2e_243" vType="Car" speedFactor="1.17" vaporized=""/>
    <tripinfo id="car_n2w_225" depart="225.00" departLane="n2sep_1" departPos="3.60" departPosLat="0.00" departSpeed="13.90" departDelay="0.00" arrival="374.00" arrivalLane="c2w_1" arrivalPos="990.00" arrivalPosLat="0.00" arrivalSpeed="13.90" duration="149.00" routeLength="1986.69" waitingTime="0.00" waitingCount="0" stopTime="0.00" timeLoss="5.02" rerouteNo="1" devices="tripinfo_car_n2w_225 routing_car_n2w_225" vType="Car" speedFactor="1.00" vaporized=""/>
    <tripinfo id="car_w2e_198" depart="198.00" departLane="w2sep_1" departPos="3.60" departPosLat="0.00" departSpeed="13.90" departDelay="0.00" arrival="386.00" arrivalLane="c2e_1" arrivalPos="990.00" arrivalPosLat="0.00" arrivalSpeed="14.69" duration="188.00" routeLength="1997.01" waitingTime="41.00" waitingCount="1" stopTime="0.00" timeLoss="51.62" rerouteNo="1" devices="tripinfo_car_w2e_198 routing_car_w2e_198" vType="Car" speedFactor="1.06" vaporized=""/>
    <tripinfo id="car_w2s_211" depart="211.00" departLane="w2sep_1" departPos="3.60" departPosLat="0.00" departSpeed="13.90" departDelay="0.00" arrival="388.00" arrivalLane="c2s_1" arrivalPos="990.00" arrivalPosLat="0.00" arrivalSpeed="14.80" duration="177.00" routeLength="1986.69" waitingTime="30.00" waitingCount="1" stopTime="0.00" timeLoss="41.64" rerouteNo="1" devices="tripinfo_car_w2s_211 routing_car_w2s_211" vType="Car" speedFactor="1.07" vaporized=""/>
    <tripinfo id="car_e2w_220" depart="220.00" departLane="e2sep_1" departPos="3.60" departPosLat="0.00" departSpeed="13.90" departDelay="0.00" arrival="390.00" arrivalLane="c2w_1" arrivalPos="990.00" arrivalPosLat="0.00" arrivalSpeed="13.90" duration="170.00" routeLength="1997.01" waitingTime="16.00" waitingCount="1" stopTime="0.00" timeLoss="25.65" rerouteNo="1" devices="tripinfo_car_e2w_220 routing_car_e2w_220" vType="Car" speedFactor="1.00" vaporized=""/>
    <tripinfo id="car_e2n_232" depart="232.00" departLane="e2sep_1" departPos="3.60" departPosLat="0.00" departSpeed="13.90" departDelay="0.00" arrival="391.00" arrivalLane="c2n_1" arrivalPos="990.00" arrivalPosLat="0.00" arrivalSpeed="14.09" duration="159.00" routeLength="1986.69" waitingTime="6.00" waitingCount="1" stopTime="0.00" timeLoss="17.15" rerouteNo="1" devices="tripinfo_car_e2n_232 routing_car_e2n_232" vType="Car" speedFactor="1.01" vaporized=""/>
    <tripinfo id="car_e2w_234" depart="234.00" departLane="e2sep_1" departPos="3.60" departPosLat="0.00" departSpeed="13.90" departDelay="0.00" arrival="394.00" arrivalLane="c2w_1" arrivalPos="990.00" arrivalPosLat="0.00" arrivalSpeed="14.36" duration="160.00" routeLength="1997.01" waitingTime="4.00" waitingCount="1" stopTime="0.00" timeLoss="20.22" rerouteNo="1" devices="tripinfo_car_e2w_234 routing_car_e2w_234" vType="Car" speedFactor="1.03" vaporized=""/>
    <tripinfo id="car_w2s_214" depart="214.00" departLane="w2sep_1" departPos="3.60" departPosLat="0.00" departSpeed="13.90" departDelay="0.00" arrival="396.00" arrivalLane="c2s_1" arrivalPos="990.00" arrivalPosLat="0.00" arrivalSpeed="13.90" duration="182.00" routeLength="1986.69" waitingTime="24.00" waitingCount="1" stopTime="0.00" timeLoss="37.94" rerouteNo="1" devices="tripinfo_car_w2s_214 routing_car_w2s_214" vType="Car" speedFactor="1.00" vaporized=""/>
    <tripinfo id="car_w2s_235" depart="235.00" departLane="w2sep_1" departPos="3.60" departPosLat="0.00" departSpeed="13.90" departDelay="0.00" arrival="399.00" arrivalLane="c2s_1" arrivalPos="990.00" arrivalPosLat="0.00" arrivalSpeed="14.70" duration="164.00" routeLength="1986.69" waitingTime="9.00" waitingCount="1" stopTime="0.00" timeLoss="28.30" rerouteNo="1" devices="tripinfo_car_w2s_235 routing_car_w2s_235" vType="Car" speedFactor="1.06" vaporized=""/>
    <tripinfo id="car_e2s_206" depart="206.00" departLane="e2sep_1" departPos="3.60" departPosLat="0.00" departSpeed="13.90" departDelay="0.00" arrival="401.00" arrivalLane="c2s_1" arrivalPos="990.00" arrivalPosLat="0.00" arrivalSpeed="15.18" duration="195.00" routeLength="1996.47" waitingTime="42.00" waitingCount="2" stopTime="0.00" timeLoss="65.60" rerouteNo="1" devices="tripinfo_car_e2s_206 routing_car_e2s_206" vType="Car" speedFactor="1.12" vaporized=""/>
    <tripinfo id="car_e2s_252" depart="252.00" departLane="e2sep_1" departPos="3.60" departPosLat="0.00" departSpeed="13.90" departDelay="0.00" arrival="403.00" arrivalLane="c2s_1" arrivalPos="990.00" arrivalPosLat="0.00" arrivalSpeed="15.03" duration="151.00" routeLength="1996.47" waitingTime="2.00" waitingCount="1" stopTime="0.00" timeLoss="19.46" rerouteNo="1" devices="tripinfo_car_e2s_252 routing_car_e2s_252" vType="Car" speedFactor="1.10" vaporized=""/>
    <tripinfo id="car_w2e_260" depart="260.00" departLane="w2sep_1" departPos="3.60" departPosLat="0.00" departSpeed="13.90" departDelay="0.00" arrival="404.00" arrivalLane="c2e_1" arrivalPos="990.00" arrivalPosLat="0.00" arrivalSpeed="13.96" duration="144.00" routeLength="1997.01" waitingTime="0.00" waitingCount="0" stopTime="0.00" timeLoss="0.73" rerouteNo="1" devices="tripinfo_car_w2e_260 routing_car_w2e_260" vType="Car" speedFactor="1.00" vaporized=""/>
    <tripinfo id="car_e2w_260" depart="260.00" departLane="e2sep_1" departPos="3.60" departPosLat="0.00" departSpeed="13.90" departDelay="0.00" arrival="404.00" arrivalLane="c2w_1" arrivalPos="990.00" arrivalPosLat="0.00" arrivalSpeed="13.94" duration="144.00" routeLength="1997.01" waitingTime="0.00" waitingCount="0" stopTime="0.00" timeLoss="0.48" rerouteNo="1" devices="tripinfo_car_e2w_260 routing_car_e2w_260" vType="Car" speedFactor="1.00" vaporized=""/>
    <tripinfo id="car_e2w_282" depart="282.00" departLane="e2sep_1" departPos="3.60" departPosLat="0.00" departSpeed="13.90" departDelay="0.00" arrival="409.00" arrivalLane="c2w_1" arrivalPos="990.00" arrivalPosLat="0.00" arrivalSpeed="15.87" duration="127.00" routeLength="1997.01" waitingTime="0.00" waitingCount="0" stopTime="0.00" timeLoss="0.86" rerouteNo="1" devices="tripinfo_car_e2w_282 routing_car_e2w_282" vType="Car" speedFactor="1.14" vaporized=""/>
    <tripinfo id="car_w2s_272" depart="272.00" departLane="w2sep_1" departPos="3.60" departPosLat="0.00" departSpeed="13.90" departDelay="0.00" arrival="418.00" arrivalLane="c2s_1" arrivalPos="990.00" arrivalPosLat="0.00" arrivalSpeed="14.23" duration="146.00" routeLength="1986.69" waitingTime="0.00" waitingCount="0" stopTime="0.00" timeLoss="4.90" rerouteNo="1" devices="tripinfo_car_w2s_272 routing_car_w2s_272" vType="Car" speedFactor="1.02" vaporized=""/>
    <tripinfo id="car_n2s_258" depart="259.00" departLane="n2sep_1" departPos="3.60" departPosLat="0.00" departSpeed="13.90" departDelay="1.00" arrival="433.00" arrivalLane="c2s_1" arrivalPos="990.00" arrivalPosLat="0.00" arrivalSpeed="15.23" duration="174.00" routeLength="1997.01" waitingTime="29.00" waitingCount="1" stopTime="0.00" timeLoss="42.62" rerouteNo="1" devices="tripinfo_car_n2s_258 routing_car_n2s_258" vType="Car" speedFactor="1.10" vaporized=""/>
    <tripinfo id="car_n2w_227" depart="227.00" departLane="n2sep_1" departPos="3.60" departPosLat="0.00" departSpeed="13.90" departDelay="0.00" arrival="434.00" arrivalLane="c2w_1" arrivalPos="990.00" arrivalPosLat="0.00" arrivalSpeed="13.90" duration="207.00" routeLength="1986.69" waitingTime="52.00" waitingCount="1" stopTime="0.00" timeLoss="63.52" rerouteNo="1" devices="tripinfo_car_n2w_227 routing_car_n2w_227" vType="Car" speedFactor="1.00" vaporized=""/>
    <tripinfo id="car_s2n_235" depart="235.00" departLane="s2sep_1" departPos="3.60" departPosLat="0.00" departSpeed="13.90" departDelay="0.00" arrival="435.00" arrivalLane="c2n_1" arrivalPos="990.00" arrivalPosLat="0.00" arrivalSpeed="13.90" duration="200.00" routeLength="1997.01" waitingTime="46.00" waitingCount="1" stopTime="0.00" timeLoss="55.57" rerouteNo="1" devices="tripinfo_car_s2n_235 routing_car_s2n_235" vType="Car" speedFactor="1.00" vaporized=""/>
    <tripinfo id="car_n2w_257" depart="257.00" departLane="n2sep_1" departPos="3.60" departPosLat="0.00" departSpeed="13.90" departDelay="0.00" arrival="437.00" arrivalLane="c2w_1" arrivalPos="990.00" arrivalPosLat="0.00" arrivalSpeed="15.08" duration="180.00" routeLength="1986.69" waitingTime="31.00" waitingCount="1" stopTime="0.00" timeLoss="48.22" rerouteNo="1" devices="tripinfo_car_n2w_257 routing_car_n2w_257" vType="Car" speedFactor="1.10" vaporized=""/>
    <tripinfo id="car_s2n_245" depart="245.00" departLane="s2sep_1" departPos="3.60" departPosLat="0.00" departSpeed="13.90" departDelay="0.00" arrival="439.00" arrivalLane="c2n_1" arrivalPos="990.00" arrivalPosLat="0.00" arrivalSpeed="14.12" duration="194.00" routeLength="1997.01" waitingTime="38.00" waitingCount="1" stopTime="0.00" timeLoss="51.73" rerouteNo="1" devices="tripinfo_car_s2n_245 routing_car_s2n_245" vType="Car" speedFactor="1.02" vaporized=""/>
    <tripinfo id="car_s2n_258" depart="258.00" departLane="s2sep_1" departPos="3.60" departPosLat="0.00" departSpeed="13.90" departDelay="0.00" arrival="440.00" arrivalLane="c2n_1" arrivalPos="990.00" arrivalPosLat="0.00" arrivalSpeed="14.98" duration="182.00" routeLength="1997.01" waitingTime="35.00" waitingCount="1" stopTime="0.00" timeLoss="59.86" rerouteNo="1" devices="tripinfo_car_s2n_258 routing_car_s2n_258" vType="Car" speedFactor="1.18" vaporized=""/>
    <tripinfo id="car_s2e_264" depart="264.00" departLane="s2sep_1" departPos="3.60" departPosLat="0.00" departSpeed="13.90" departDelay="0.00" arrival="442.00" arrivalLane="c2e_1" arrivalPos="990.00" arrivalPosLat="0.00" arrivalSpeed="13.90" duration="178.00" routeLength="1986.69" waitingTime="21.00" waitingCount="1" stopTime="0.00" timeLoss="34.21" rerouteNo="1" devices="tripinfo_car_s2e_264 routing_car_s2e_264" vType="Car" speedFactor="1.00" vaporized=""/>
    <tripinfo id="car_s2n_275" depart="275.00" departLane="s2sep_1" departPos="3.60" departPosLat="0.00" departSpeed="13.90" departDelay="0.00" arrival="442.00" arrivalLane="c2n_1" arrivalPos="990.00" arrivalPosLat="0.00" arrivalSpeed="15.42" duration="167.00" routeLength="1997.01" waitingTime="20.00" waitingCount="1" stopTime="0.00" timeLoss="42.25" rerouteNo="1" devices="tripinfo_car_s2n_275 routing_car_s2n_275" vType="Car" speedFactor="1.15" vaporized=""/>
    <tripinfo id="car_n2w_279" depart="279.00" departLane="n2sep_1" departPos="3.60" departPosLat="0.00" departSpeed="13.90" departDelay="0.00" arrival="442.00" arrivalLane="c2w_1" arrivalPos="990.00" arrivalPosLat="0.00" arrivalSpeed="14.01" duration="163.00" routeLength="1986.69" waitingTime="6.00" waitingCount="1" stopTime="0.00" timeLoss="20.54" rerouteNo="1" devices="tripinfo_car_n2w_279 routing_car_n2w_279" vType="Car" speedFactor="1.01" vaporized=""/>
    <tripinfo id="car_n2s_282" depart="284.00" departLane="n2sep_1" departPos="3.60" departPosLat="0.00" departSpeed="13.90" departDelay="2.00" arrival="443.00" arrivalLane="c2s_1" arrivalPos="990.00" arrivalPosLat="0.00" arrivalSpeed="14.85" duration="159.00" routeLength="1997.01" waitingTime="4.00" waitingCount="1" stopTime="0.00" timeLoss="24.15" rerouteNo="1" devices="tripinfo_car_n2s_282 routing_car_n2s_282" vType="Car" speedFactor="1.07" vaporized=""/>
    <tripinfo id="car_s2e_268" depart="268.00" departLane="s2sep_1" departPos="3.60" departPosLat="0.00" departSpeed="13.90" departDelay="0.00" arrival="444.00" arrivalLane="c2e_1" arrivalPos="990.00" arrivalPosLat="0.00" arrivalSpeed="14.97" duration="176.00" routeLength="1986.69" waitingTime="20.00" waitingCount="1" stopTime="0.00" timeLoss="45.88" rerouteNo="1" devices="tripinfo_car_s2e_268 routing_car_s2e_268" vType="Car" speedFactor="1.10" vaporized=""/>
    <tripinfo id="car_n2w_282" depart="282.00" departLane="n2sep_1" departPos="3.60" departPosLat="0.00" departSpeed="13.90" departDelay="0.00" arrival="446.00" arrivalLane="c2w_1" arrivalPos="990.00" arrivalPosLat="0.00" arrivalSpeed="14.33" duration="164.00" routeLength="1986.69" waitingTime="5.00" waitingCount="1" stopTime="0.00" timeLoss="24.27" rerouteNo="1" devices="tripinfo_car_n2w_282 routing_car_n2w_282" vType="Car" speedFactor="1.03" vaporized=""/>
    <tripinfo id="car_s2e_275" depart="277.00" departLane="s2sep_1" departPos="3.60" departPosLat="0.00" departSpeed="13.90" departDelay="2.00" arrival="449.00" arrivalLane="c2e_1" arrivalPos="990.00" arrivalPosLat="0.00" arrivalSpeed="14.34" duration="172.00" routeLength="1986.69" waitingTime="14.00" waitingCount="1" stopTime="0.00" timeLoss="32.53" rerouteNo="1" devices="tripinfo_car_s2e_275 routing_car_s2e_275" vType="Car" speedFactor="1.03" vaporized=""/>
    <tripinfo id="car_n2s_312" depart="312.00" departLane="n2sep_1" departPos="3.60" departPosLat="0.00" departSpeed="13.90" departDelay="0.00" arrival="450.00" arrivalLane="c2s_1" arrivalPos="990.00" arrivalPosLat="0.00" arrivalSpeed="15.05" duration="138.00" routeLength="1997.01" waitingTime="0.00" waitingCount="0" stopTime="0.00" timeLoss="4.95" rerouteNo="1" devices="tripinfo_car_n2s_312 routing_car_n2s_312" vType="Car" speedFactor="1.08" vaporized=""/>
    <tripinfo id="car_s2e_278" depart="279.00" departLane="s2sep_1" departPos="3.60" departPosLat="0.00" departSpeed="13.90" departDelay="1.00" arrival="451.00" arrivalLane="c2e_1" arrivalPos="990.00" arrivalPosLat="0.00" arrivalSpeed="15.19" duration="172.00" routeLength="1986.69" waitingTime="13.00" waitingCount="1" stopTime="0.00" timeLoss="43.56" rerouteNo="1" devices="tripinfo_car_s2e_278 routing_car_s2e_278" vType="Car" speedFactor="1.12" vaporized=""/>
    <tripinfo id="car_n2w_293" depart="293.00" departLane="n2sep_1" departPos="3.60" departPosLat="0.00" departSpeed="13.90" departDelay="0.00" arrival="451.00" arrivalLane="c2w_1" arrivalPos="990.00" arrivalPosLat="0.00" arrivalSpeed="14.06" duration="158.00" routeLength="1986.69" waitingTime="0.00" waitingCount="0" stopTime="0.00" timeLoss="15.17" rerouteNo="1" devices="tripinfo_car_n2w_293 routing_car_n2w_293" vType="Car" speedFactor="1.01" vaporized=""/>
    <tripinfo id="car_s2n_284" depart="284.00" departLane="s2sep_1" departPos="3.60" departPosLat="0.00" departSpeed="13.90" departDelay="0.00" arrival="453.00" arrivalLane="c2n_1" arrivalPos="990.00" arrivalPosLat="0.00" arrivalSpeed="14.42" duration="169.00" routeLength="1997.01" waitingTime="10.00" waitingCount="1" stopTime="0.00" timeLoss="30.06" rerouteNo="1" devices="tripinfo_car_s2n_284 routing_car_s2n_284" vType="Car" speedFactor="1.04" vaporized=""/>
    <tripinfo id="car_n2w_298" depart="298.00" departLane="n2sep_1" departPos="3.60" departPosLat="0.00" departSpeed="13.90" departDelay="0.00" arrival="453.00" arrivalLane="c2w_1" arrivalPos="990.00" arrivalPosLat="0.00" arrivalSpeed="15.12" duration="155.00" routeLength="1986.69" waitingTime="0.00" waitingCount="0" stopTime="0.00" timeLoss="26.05" rerouteNo="1" devices="tripinfo_car_n2w_298 routing_car_n2w_298" vType="Car" speedFactor="1.12" vaporized=""/>
    <tripinfo id="car_s2e_313" depart="313.00" departLane="s2sep_1" departPos="3.60" departPosLat="0.00" departSpeed="13.90" departDelay="0.00" arrival="454.00" arrivalLane="c2e_1" arrivalPos="990.00" arrivalPosLat="0.00" arrivalSpeed="15.42" duration="141.00" routeLength="1986.69" waitingTime="0.00" waitingCount="0" stopTime="0.00" timeLoss="12.06" rerouteNo="1" devices="tripinfo_car_s2e_313 routing_car_s2e_313" vType="Car" speedFactor="1.12" vaporized=""/>
    <tripinfo id="car_s2w_256" depart="256.00" departLane="s2sep_1" departPos="3.60" departPosLat="0.00" departSpeed="13.90" departDelay="0.00" arrival="458.00" arrivalLane="c2w_1" arrivalPos="990.00" arrivalPosLat="0.00" arrivalSpeed="14.02" duration="202.00" routeLength="1996.47" waitingTime="42.00" waitingCount="2" stopTime="0.00" timeLoss="58.77" rerouteNo="1" devices="tripinfo_car_s2w_256 routing_car_s2w_256" vType="Car" speedFactor="1.01" vaporized=""/>
    <tripinfo id="car_n2e_262" depart="262.00" departLane="n2sep_1" departPos="3.60" departPosLat="0.00" departSpeed="13.90" departDelay="0.00" arrival="458.00" arrivalLane="c2e_1" arrivalPos="990.00" arrivalPosLat="0.00" arrivalSpeed="14.87" duration="196.00" routeLength="1996.47" waitingTime="41.00" waitingCount="2" stopTime="0.00" timeLoss="60.67" rerouteNo="1" devices="tripinfo_car_n2e_262 routing_car_n2e_262" vType="Car" speedFactor="1.07" vaporized=""/>
    <tripinfo id="car_s2w_269" depart="270.00" departLane="s2sep_1" departPos="3.60" departPosLat="0.00" departSpeed="13.90" departDelay="1.00" arrival="462.00" arrivalLane="c2w_1" arrivalPos="990.00" arrivalPosLat="0.00" arrivalSpeed="14.31" duration="192.00" routeLength="1996.47" waitingTime="30.00" waitingCount="2" stopTime="0.00" timeLoss="51.19" rerouteNo="1" devices="tripinfo_car_s2w_269 routing_car_s2w_269" vType="Car" speedFactor="1.03" vaporized=""/>
    <tripinfo id="car_n2e_275" depart="275.00" departLane="n2sep_1" departPos="3.60" departPosLat="0.00" departSpeed="13.90" departDelay="0.00" arrival="462.00" arrivalLane="c2e_1" arrivalPos="990.00" arrivalPosLat="0.00" arrivalSpeed="14.73" duration="187.00" routeLength="1996.47" waitingTime="28.00" waitingCount="2" stopTime="0.00" timeLoss="49.98" rerouteNo="1" devices="tripinfo_car_n2e_275 routing_car_n2e_275" vType="Car" speedFactor="1.06" vaporized=""/>
    <tripinfo id="car_s2w_287" depart="287.00" departLane="s2sep_1" departPos="3.60" departPosLat="0.00" departSpeed="13.90" departDelay="0.00" arrival="463.00" arrivalLane="c2w_1" arrivalPos="990.00" arrivalPosLat="0.00" arrivalSpeed="15.28" duration="176.00" routeLength="1996.47" waitingTime="24.00" waitingCount="2" stopTime="0.00" timeLoss="58.10" rerouteNo="1" devices="tripinfo_car_s2w_287 routing_car_s2w_287" vType="Car" speedFactor="1.23" vaporized=""/>
    <tripinfo id="car_s2w_309" depart="309.00" departLane="s2sep_1" departPos="3.60" departPosLat="0.00" departSpeed="13.90" departDelay="0.00" arrival="465.00" arrivalLane="c2w_1" arrivalPos="990.00" arrivalPosLat="0.00" arrivalSpeed="15.19" duration="156.00" routeLength="1996.47" waitingTime="7.00" waitingCount="1" stopTime="0.00" timeLoss="27.99" rerouteNo="1" devices="tripinfo_car_s2w_309 routing_car_s2w_309" vType="Car" speedFactor="1.13" vaporized=""/>
    <tripinfo id="car_n2e_302" depart="302.00" departLane="n2sep_1" departPos="3.60" departPosLat="0.00" departSpeed="13.90" departDelay="0.00" arrival="467.00" arrivalLane="c2e_1" arrivalPos="990.00" arrivalPosLat="0.00" arrivalSpeed="13.95" duration="165.00" routeLength="1996.47" waitingTime="6.00" waitingCount="1" stopTime="0.00" timeLoss="20.77" rerouteNo="1" devices="tripinfo_car_n2e_302 routing_car_n2e_302" vType="Car" speedFactor="1.00" vaporized=""/>
    <tripinfo id="car_n2e_314" depart="314.00" departLane="n2sep_1" departPos="3.60" departPosLat="0.00" departSpeed="13.90" departDelay="0.00" arrival="471.00" arrivalLane="c2e_1" arrivalPos="990.00" arrivalPosLat="0.00" arrivalSpeed="13.92" duration="157.00" routeLength="1996.47" waitingTime="0.00" waitingCount="0" stopTime="0.00" timeLoss="12.46" rerouteNo="1" devices="tripinfo_car_n2e_314 routing_car_n2e_314" vType="Car" speedFactor="1.00" vaporized=""/>
    <tripinfo id="car_n2e_324" depart="324.00" departLane="n2sep_1" departPos="3.60" departPosLat="0.00" departSpeed="13.90" departDelay="0.00" arrival="475.00" arrivalLane="c2e_1" arrivalPos="990.00" arrivalPosLat="0.00" arrivalSpeed="13.88" duration="151.00" routeLength="1996.47" waitingTime="0.00" waitingCount="0" stopTime="0.00" timeLoss="5.77" rerouteNo="1" devices="tripinfo_car_n2e_324 routing_car_n2e_324" vType="Car" speedFactor="1.00" vaporized=""/>
    <tripinfo id="car_e2w_313" depart="313.00" departLane="e2sep_1" departPos="3.60" departPosLat="0.00" departSpeed="13.90" departDelay="0.00" arrival="476.00" arrivalLane="c2w_1" arrivalPos="990.00" arrivalPosLat="0.00" arrivalSpeed="15.86" duration="163.00" routeLength="1997.01" waitingTime="18.00" waitingCount="1" stopTime="0.00" timeLoss="36.39" rerouteNo="1" devices="tripinfo_car_e2w_313 routing_car_e2w_313" vType="Car" speedFactor="1.14" vaporized=""/>
    <tripinfo id="car_n2e_332" depart="332.00" departLane="n2sep_1" departPos="3.60" departPosLat="0.00" departSpeed="13.90" departDelay="0.00" arrival="477.00" arrivalLane="c2e_1" arrivalPos="990.00" arrivalPosLat="0.00" arrivalSpeed="14.50" duration="145.00" routeLength="1996.47" waitingTime="0.00" waitingCount="0" stopTime="0.00" timeLoss="8.82" rerouteNo="1" devices="tripinfo_car_n2e_332 routing_car_n2e_332" vType="Car" speedFactor="1.06" vaporized=""/>
    <tripinfo id="car_e2n_302" depart="302.00" departLane="e2sep_1" departPos="3.60" departPosLat="0.00" departSpeed="13.90" departDelay="0.00" arrival="478.00" arrivalLane="c2n_1" arrivalPos="990.00" arrivalPosLat="0.00" arrivalSpeed="14.23" duration="176.00" routeLength="1986.69" waitingTime="25.00" waitingCount="1" stopTime="0.00" timeLoss="35.22" rerouteNo="1" devices="tripinfo_car_e2n_302 routing_car_e2n_302" vType="Car" speedFactor="1.02" vaporized=""/>
    <tripinfo id="car_w2s_277" depart="277.00" departLane="w2sep_1" departPos="3.60" departPosLat="0.00" departSpeed="13.90" departDelay="0.00" arrival="479.00" arrivalLane="c2s_1" arrivalPos="990.00" arrivalPosLat="0.00" arrivalSpeed="13.90" duration="202.00" routeLength="1986.69" waitingTime="48.00" waitingCount="1" stopTime="0.00" timeLoss="58.51" rerouteNo="1" devices="tripinfo_car_w2s_277 routing_car_w2s_277" vType="Car" speedFactor="1.00" vaporized=""/>
    <tripinfo id="car_w2e_299" depart="299.00" departLane="w2sep_1" departPos="3.60" departPosLat="0.00" departSpeed="13.90" departDelay="0.00" arrival="482.00" arrivalLane="c2e_1" arrivalPos="990.00" arrivalPosLat="0.00" arrivalSpeed="14.11" duration="183.00" routeLength="1997.01" waitingTime="29.00" waitingCount="1" stopTime="0.00" timeLoss="40.62" rerouteNo="1" devices="tripinfo_car_w2e_299 routing_car_w2e_299" vType="Car" speedFactor="1.02" vaporized=""/>
    <tripinfo id="car_w2e_303" depart="305.00" departLane="w2sep_1" departPos="3.60" departPosLat="0.00" departSpeed="13.90" departDelay="2.00" arrival="484.00" arrivalLane="c2e_1" arrivalPos="990.00" arrivalPosLat="0.00" arrivalSpeed="15.54" duration="179.00" routeLength="1997.01" waitingTime="29.00" waitingCount="1" stopTime="0.00" timeLoss="54.72" rerouteNo="1" devices="tripinfo_car_w2e_303 routing_car_w2e_303" vType="Car" speedFactor="1.16" vaporized=""/>
    <tripinfo id="car_e2n_309" depart="309.00" departLane="e2sep_1" departPos="3.60" departPosLat="0.00" departSpeed="13.90" departDelay="0.00" arrival="484.00" arrivalLane="c2n_1" arrivalPos="990.00" arrivalPosLat="0.00" arrivalSpeed="13.90" duration="175.00" routeLength="1986.69" waitingTime="18.00" waitingCount="1" stopTime="0.00" timeLoss="30.45" rerouteNo="1" devices="tripinfo_car_e2n_309 routing_car_e2n_309" vType="Car" speedFactor="1.00" vaporized=""/>
    <tripinfo id="car_e2w_319" depart="319.00" departLane="e2sep_1" departPos="3.60" departPosLat="0.00" departSpeed="13.90" departDelay="0.00" arrival="484.00" arrivalLane="c2w_1" arrivalPos="990.00" arrivalPosLat="0.00" arrivalSpeed="14.45" duration="165.00" routeLength="1997.01" waitingTime="13.00" waitingCount="1" stopTime="0.00" timeLoss="26.73" rerouteNo="1" devices="tripinfo_car_e2w_319 routing_car_e2w_319" vType="Car" speedFactor="1.04" vaporized=""/>
    <tripinfo id="car_w2n_303" depart="303.00" departLane="w2sep_1" departPos="3.60" departPosLat="0.00" departSpeed="13.90" departDelay="0.00" arrival="486.00" arrivalLane="c2n_1" arrivalPos="990.00" arrivalPosLat="0.00" arrivalSpeed="15.18" duration="183.00" routeLength="1996.47" waitingTime="34.00" waitingCount="2" stopTime="0.00" timeLoss="53.07" rerouteNo="1" devices="tripinfo_car_w2n_303 routing_car_w2n_303" vType="Car" speedFactor="1.11" vaporized=""/>
    <tripinfo id="car_w2s_318" depart="318.00" departLane="w2sep_1" departPos="3.60" departPosLat="0.00" departSpeed="13.90" departDelay="0.00" arrival="487.00" arrivalLane="c2s_1" arrivalPos="990.00" arrivalPosLat="0.00" arrivalSpeed="14.12" duration="169.00" routeLength="1986.69" waitingTime="13.00" waitingCount="1" stopTime="0.00" timeLoss="26.75" rerouteNo="1" devices="tripinfo_car_w2s_318 routing_car_w2s_318" vType="Car" speedFactor="1.02" vaporized=""/>
    <tripinfo id="car_e2w_332" depart="333.00" departLane="e2sep_1" departPos="3.60" departPosLat="0.00" departSpeed="13.90" departDelay="1.00" arrival="487.00" arrivalLane="c2w_1" arrivalPos="990.00" arrivalPosLat="0.00" arrivalSpeed="15.46" duration="154.00" routeLength="1997.01" waitingTime="5.00" waitingCount="1" stopTime="0.00" timeLoss="25.37" rerouteNo="1" devices="tripinfo_car_e2w_332 routing_car_e2w_332" vType="Car" speedFactor="1.12" vaporized=""/>
    <tripinfo id="car_w2n_344" depart="344.00" departLane="w2sep_1" departPos="3.60" departPosLat="0.00" departSpeed="13.90" departDelay="0.00" arrival="489.00" arrivalLane="c2n_1" arrivalPos="990.00" arrivalPosLat="0.00" arrivalSpeed="15.72" duration="145.00" routeLength="1996.47" waitingTime="2.00" waitingCount="1" stopTime="0.00" timeLoss="17.76" rerouteNo="1" devices="tripinfo_car_w2n_344 routing_car_w2n_344" vType="Car" speedFactor="1.14" vaporized=""/>
    <tripinfo id="car_w2e_325" depart="325.00" departLane="w2sep_1" departPos="3.60" departPosLat="0.00" departSpeed="13.90" departDelay="0.00" arrival="490.00" arrivalLane="c2e_1" arrivalPos="990.00" arrivalPosLat="0.00" arrivalSpeed="13.96" duration="165.00" routeLength="1997.01" waitingTime="7.00" waitingCount="1" stopTime="0.00" timeLoss="21.16" rerouteNo="1" devices="tripinfo_car_w2e_325 routing_car_w2e_325" vType="Car" speedFactor="1.00" vaporized=""/>
    <tripinfo id="car_w2e_334" depart="334.00" departLane="w2sep_1" departPos="3.60" departPosLat="0.00" departSpeed="13.90" departDelay="0.00" arrival="492.00" arrivalLane="c2e_1" arrivalPos="990.00" arrivalPosLat="0.00" arrivalSpeed="15.63" duration="158.00" routeLength="1997.01" waitingTime="6.00" waitingCount="1" stopTime="0.00" timeLoss="35.23" rerouteNo="1" devices="tripinfo_car_w2e_334 routing_car_w2e_334" vType="Car" speedFactor="1.18" vaporized=""/>
    <tripinfo id="car_e2w_358" depart="358.00" departLane="e2sep_1" departPos="3.60" departPosLat="0.00" departSpeed="13.90" departDelay="0.00" arrival="497.00" arrivalLane="c2w_1" arrivalPos="990.00" arrivalPosLat="0.00" arrivalSpeed="14.46" duration="139.00" routeLength="1997.01" waitingTime="0.00" waitingCount="0" stopTime="0.00" timeLoss="0.54" rerouteNo="1" devices="tripinfo_car_e2w_358 routing_car_e2w_358" vType="Car" speedFactor="1.04" vaporized=""/>
    <tripinfo id="bus_e2s_326" depart="326.00" departLane="e2sep_1" departPos="12.10" departPosLat="0.00" departSpeed="13.90" departDelay="0.00" arrival="498.00" arrivalLane="c2s_1" arrivalPos="990.00" arrivalPosLat="0.00" arrivalSpeed="13.90" duration="172.00" routeLength="1987.97" waitingTime="9.00" waitingCount="2" stopTime="0.00" timeLoss="27.51" rerouteNo="1" devices="tripinfo_bus_e2s_326 routing_bus_e2s_326" vType="Bus" speedFactor="1.00" vaporized=""/>
    <tripinfo id="car_e2s_331" depart="331.00" departLane="e2sep_1" departPos="3.60" departPosLat="0.00" departSpeed="13.90" departDelay="0.00" arrival="502.00" arrivalLane="c2s_1" arrivalPos="990.00" arrivalPosLat="0.00" arrivalSpeed="13.89" duration="171.00" routeLength="1996.47" waitingTime="8.00" waitingCount="1" stopTime="0.00" timeLoss="26.65" rerouteNo="1" devices="tripinfo_car_e2s_331 routing_car_e2s_331" vType="Car" speedFactor="1.00" vaporized=""/>
    <tripinfo id="car_e2s_338" depart="338.00" departLane="e2sep_1" departPos="3.60" departPosLat="0.00" departSpeed="13.90" departDelay="0.00" arrival="506.00" arrivalLane="c2s_1" arrivalPos="990.00" arrivalPosLat="0.00" arrivalSpeed="13.88" duration="168.00" routeLength="1996.47" waitingTime="5.00" waitingCount="1" stopTime="0.00" timeLoss="23.05" rerouteNo="1" devices="tripinfo_car_e2s_338 routing_car_e2s_338" vType="Car" speedFactor="1.00" vaporized=""/>
    <tripinfo id="car_w2s_365" depart="365.00" departLane="w2sep_1" departPos="3.60" departPosLat="0.00" departSpeed="13.90" departDelay="0.00" arrival="510.00" arrivalLane="c2s_1" arrivalPos="990.00" arrivalPosLat="0.00" arrivalSpeed="14.29" duration="145.00" routeLength="1986.69" waitingTime="0.00" waitingCount="0" stopTime="0.00" timeLoss="4.84" rerouteNo="1" devices="tripinfo_car_w2s_365 routing_car_w2s_365" vType="Car" speedFactor="1.03" vaporized=""/>
    <tripinfo id="car_w2e_367" depart="367.00" departLane="w2sep_1" departPos="3.60" departPosLat="0.00" departSpeed="13.90" departDelay="0.00" arrival="511.00" arrivalLane="c2e_1" arrivalPos="990.00" arrivalPosLat="1.00" arrivalSpeed="14.21" duration="144.00" routeLength="1997.01" waitingTime="0.00" waitingCount="0" stopTime="0.00" timeLoss="3.01" rerouteNo="1" devices="tripinfo_car_w2e_367 routing_car_w2e_367" vType="Car" speedFactor="1.02" vaporized=""/>
    <tripinfo id="amb_w2e_390" depart="390.00" departLane="w2sep_1" departPos="6.60" departPosLat="0.00" departSpeed="13.90" departDelay="0.00" arrival="512.00" arrivalLane="c2e_1" arrivalPos="990.00" arrivalPosLat="0.00" arrivalSpeed="16.11" duration="122.00" routeLength="1994.01" waitingTime="0.00" waitingCount="0" stopTime="0.00" timeLoss="26.37" rerouteNo="1" devices="tripinfo_amb_w2e_390 routing_amb_w2e_390 bluelight_amb_w2e_390" vType="Ambulance" speedFactor="1.50" vaporized="">
        <bluelight/>
    </tripinfo>
    <tripinfo id="car_e2w_368" depart="368.00" departLane="e2sep_1" departPos="3.60" departPosLat="0.00" departSpeed="13.90" departDelay="0.00" arrival="516.00" arrivalLane="c2w_1" arrivalPos="990.00" arrivalPosLat="0.00" arrivalSpeed="15.11" duration="148.00" routeLength="1997.01" waitingTime="5.00" waitingCount="1" stopTime="0.00" timeLoss="15.54" rerouteNo="1" devices="tripinfo_car_e2w_368 routing_car_e2w_368" vType="Car" speedFactor="1.09" vaporized=""/>
    <tripinfo id="car_e2n_372" depart="372.00" departLane="e2sep_1" departPos="3.60" departPosLat="0.00" departSpeed="13.90" departDelay="0.00" arrival="524.00" arrivalLane="c2n_1" arrivalPos="990.00" arrivalPosLat="0.00" arrivalSpeed="13.90" duration="152.00" routeLength="1986.69" waitingTime="0.00" waitingCount="0" stopTime="0.00" timeLoss="8.17" rerouteNo="1" devices="tripinfo_car_e2n_372 routing_car_e2n_372" vType="Car" speedFactor="1.00" vaporized=""/>
    <tripinfo id="car_s2e_330" depart="330.00" departLane="s2sep_1" departPos="3.60" departPosLat="0.00" departSpeed="13.90" departDelay="0.00" arrival="534.00" arrivalLane="c2e_1" arrivalPos="990.00" arrivalPosLat="0.00" arrivalSpeed="14.89" duration="204.00" routeLength="1986.69" waitingTime="59.00" waitingCount="1" stopTime="0.00" timeLoss="69.46" rerouteNo="1" devices="tripinfo_car_s2e_330 routing_car_s2e_330" vType="Car" speedFactor="1.07" vaporized=""/>
    <tripinfo id="car_s2n_337" depart="337.00" departLane="s2sep_1" departPos="3.60" departPosLat="0.00" departSpeed="13.90" departDelay="0.00" arrival="536.00" arrivalLane="c2n_1" arrivalPos="990.00" arrivalPosLat="0.00" arrivalSpeed="15.00" duration="199.00" routeLength="1997.01" waitingTime="54.00" waitingCount="1" stopTime="0.00" timeLoss="65.16" rerouteNo="1" devices="tripinfo_car_s2n_337 routing_car_s2n_337" vType="Car" speedFactor="1.08" vaporized=""/>
    <tripinfo id="car_n2w_345" depart="345.00" departLane="n2sep_1" departPos="3.60" departPosLat="0.00" departSpeed="13.90" departDelay="0.00" arrival="538.00" arrivalLane="c2w_1" arrivalPos="990.00" arrivalPosLat="0.00" arrivalSpeed="13.90" duration="193.00" routeLength="1986.69" waitingTime="40.00" waitingCount="1" stopTime="0.00" timeLoss="49.53" rerouteNo="1" devices="tripinfo_car_n2w_345 routing_car_n2w_345" vType="Car" speedFactor="1.00" vaporized=""/>
    <tripinfo id="car_n2s_348" depart="350.00" departLane="n2sep_1" departPos="3.60" departPosLat="0.00" departSpeed="13.90" departDelay="2.00" arrival="541.00" arrivalLane="c2s_1" arrivalPos="990.00" arrivalPosLat="0.00" arrivalSpeed="14.98" duration="191.00" routeLength="1997.01" waitingTime="37.00" waitingCount="1" stopTime="0.00" timeLoss="57.15" rerouteNo="1" devices="tripinfo_car_n2s_348 routing_car_n2s_348" vType="Car" speedFactor="1.08" vaporized=""/>
    <tripinfo id="car_s2e_358" depart="358.00" departLane="s2sep_1" departPos="3.60" departPosLat="0.00" departSpeed="13.90" departDelay="0.00" arrival="544.00" arrivalLane="c2e_1" arrivalPos="990.00" arrivalPosLat="0.00" arrivalSpeed="13.96" duration="186.00" routeLength="1986.69" waitingTime="30.00" waitingCount="1" stopTime="0.00" timeLoss="42.85" rerouteNo="1" devices="tripinfo_car_s2e_358 routing_car_s2e_358" vType="Car" speedFactor="1.00" vaporized=""/>
    <tripinfo id="bus_n2w_346" depart="348.00" departLane="n2sep_1" departPos="12.10" departPosLat="0.00" departSpeed="13.90" departDelay="2.00" arrival="545.00" arrivalLane="c2w_1" arrivalPos="990.00" arrivalPosLat="0.00" arrivalSpeed="13.89" duration="197.00" routeLength="1978.19" waitingTime="38.00" waitingCount="1" stopTime="0.00" timeLoss="53.63" rerouteNo="1" devices="tripinfo_bus_n2w_346 routing_bus_n2w_346" vType="Bus" speedFactor="1.00" vaporized=""/>
    <tripinfo id="car_n2e_354" depart="354.00" departLane="n2sep_1" departPos="3.60" departPosLat="0.00" departSpeed="13.90" departDelay="0.00" arrival="546.00" arrivalLane="c2e_1" arrivalPos="990.00" arrivalPosLat="0.00" arrivalSpeed="15.26" duration="192.00" routeLength="1996.47" waitingTime="44.00" waitingCount="2" stopTime="0.00" timeLoss="63.90" rerouteNo="1" devices="tripinfo_car_n2e_354 routing_car_n2e_354" vType="Car" speedFactor="1.13" vaporized=""/>
    <tripinfo id="car_n2w_357" depart="357.00" departLane="n2sep_1" departPos="3.60" departPosLat="0.00" departSpeed="13.90" departDelay="0.00" arrival="548.00" arrivalLane="c2w_1" arrivalPos="990.00" arrivalPosLat="0.00" arrivalSpeed="14.55" duration="191.00" routeLength="1986.69" waitingTime="35.00" waitingCount="1" stopTime="0.00" timeLoss="54.53" rerouteNo="1" devices="tripinfo_car_n2w_357 routing_car_n2w_357" vType="Car" speedFactor="1.05" vaporized=""/>
    <tripinfo id="bus_s2n_365" depart="365.00" departLane="s2sep_1" departPos="12.10" departPosLat="0.00" departSpeed="13.90" departDelay="0.00" arrival="548.00" arrivalLane="c2n_1" arrivalPos="990.00" arrivalPosLat="0.00" arrivalSpeed="13.90" duration="183.00" routeLength="1988.51" waitingTime="25.00" waitingCount="1" stopTime="0.00" timeLoss="39.77" rerouteNo="1" devices="tripinfo_bus_s2n_365 routing_bus_s2n_365" vType="Bus" speedFactor="1.00" vaporized=""/>
    <tripinfo id="car_n2w_375" depart="375.00" departLane="n2sep_1" departPos="3.60" departPosLat="0.00" departSpeed="13.90" departDelay="0.00" arrival="550.00" arrivalLane="c2w_1" arrivalPos="990.00" arrivalPosLat="0.00" arrivalSpeed="15.38" duration="175.00" routeLength="1986.69" waitingTime="24.00" waitingCount="1" stopTime="0.00" timeLoss="49.35" rerouteNo="1" devices="tripinfo_car_n2w_375 routing_car_n2w_375" vType="Car" speedFactor="1.14" vaporized=""/>
</tripinfos>
