<?xml version="1.0" encoding="UTF-8"?>

<!-- generated on 2021-05-18 05:31:07 by Eclipse SUMO sumo Version 1.9.1
<configuration xmlns:xsi="http://www.w3.org/2001/XMLSchema-instance" xsi:noNamespaceSchemaLocation="http://sumo.dlr.de/xsd/sumoConfiguration.xsd">

    <input>
        <net-file value="sumofiles/junction.net.xml"/>
        <route-files value="sumofiles/junction_recomp_12.rou.xml"/>
        <additional-files value="sumofiles/junction.det.xml"/>
    </input>

    <output>
        <tripinfo-output value="sumofiles/output/tripinfo_recomp_12.xml"/>
    </output>

    <time>
        <begin value="0"/>
        <end value="10000"/>
        <step-length value="1.0"/>
    </time>

    <processing>
        <lateral-resolution value="0.5"/>
    </processing>

    <report>
        <no-warnings value="true"/>
        <error-log value="sumofiles/output/errorlog_recomp_12.log"/>
        <no-step-log value="true"/>
    </report>

    <traci_server>
        <remote-port value="49663"/>
    </traci_server>

    <gui_only>
        <gui-settings-file value="sumofiles/junction-gui.settings.xml"/>
        <tracker-interval value="1"/>
    </gui_only>

</configuration>
-->

<tripinfos xmlns:xsi="http://www.w3.org/2001/XMLSchema-instance" xsi:noNamespaceSchemaLocation="http://sumo.dlr.de/xsd/tripinfo_file.xsd">
    <tripinfo id="car_e2w_2" depart="2.00" departLane="e2sep_1" departPos="3.60" departPosLat="0.00" departSpeed="13.90" departDelay="0.00" arrival="138.00" arrivalLane="c2w_1" arrivalPos="990.00" arrivalPosLat="0.00" arrivalSpeed="14.73" duration="136.00" routeLength="1997.01" waitingTime="0.00" waitingCount="0" stopTime="0.00" timeLoss="0.12" rerouteNo="1" devices="tripinfo_car_e2w_2 routing_car_e2w_2" vType="Car" speedFactor="1.06" vaporized=""/>
    <tripinfo id="car_w2s_0" depart="0.00" departLane="w2sep_1" departPos="3.60" departPosLat="0.00" departSpeed="13.90" departDelay="0.00" arrival="141.00" arrivalLane="c2s_1" arrivalPos="990.00" arrivalPosLat="0.00" arrivalSpeed="14.73" duration="141.00" routeLength="1986.69" waitingTime="0.00" waitingCount="0" stopTime="0.00" timeLoss="5.41" rerouteNo="1" devices="tripinfo_car_w2s_0 routing_car_w2s_0" vType="Car" speedFactor="1.06" vaporized=""/>
    <tripinfo id="car_w2e_6" depart="6.00" departLane="w2sep_1" departPos="3.60" departPosLat="0.00" departSpeed="13.90" departDelay="0.00" arrival="142.00" arrivalLane="c2e_1" arrivalPos="990.00" arrivalPosLat="0.00" arrivalSpeed="15.05" duration="136.00" routeLength="1997.01" waitingTime="0.00" waitingCount="0" stopTime="0.00" timeLoss="2.45" rerouteNo="1" devices="tripinfo_car_w2e_6 routing_car_w2e_6" vType="Car" speedFactor="1.08" vaporized=""/>
    <tripinfo id="car_w2n_11" depart="11.00" departLane="w2sep_1" departPos="3.60" departPosLat="0.00" departSpeed="13.90" departDelay="0.00" arrival="152.00" arrivalLane="c2n_1" arrivalPos="990.00" arrivalPosLat="0.00" arrivalSpeed="14.54" duration="141.00" routeLength="1996.47" waitingTime="0.00" waitingCount="0" stopTime="0.00" timeLoss="2.43" rerouteNo="1" devices="tripinfo_car_w2n_11 routing_car_w2n_11" vType="Car" speedFactor="1.05" vaporized=""/>
    <tripinfo id="car_w2n_14" depart="14.00" departLane="w2sep_1" departPos="3.60" departPosLat="0.00" departSpeed="13.90" departDelay="0.00" arrival="155.00" arrivalLane="c2n_1" arrivalPos="990.00" arrivalPosLat="0.00" arrivalSpeed="14.99" duration="141.00" routeLength="1996.47" waitingTime="0.00" waitingCount="0" stopTime="0.00" timeLoss="7.41" rerouteNo="1" devices="tripinfo_car_w2n_14 routing_car_w2n_14" vType="Car" speedFactor="1.08" vaporized=""/>
    <tripinfo id="car_n2s_7" depart="7.00" departLane="n2sep_1" departPos="3.60" departPosLat="0.00" departSpeed="13.90" departDelay="0.00" arrival="163.00" arrivalLane="c2s_1" arrivalPos="990.00" arrivalPosLat="0.00" arrivalSpeed="14.32" duration="156.00" routeLength="1997.01" waitingTime="6.00" waitingCount="1" stopTime="0.00" timeLoss="15.78" rerouteNo="1" devices="tripinfo_car_n2s_7 routing_car_n2s_7" vType="Car" speedFactor="1.03" vaporized=""/>
    <tripinfo id="car_s2e_10" depart="10.00" departLane="s2sep_1" departPos="3.60" departPosLat="0.00" departSpeed="13.90" departDelay="0.00" arrival="164.00" arrivalLane="c2e_1" arrivalPos="990.00" arrivalPosLat="0.00" arrivalSpeed="13.90" duration="154.00" routeLength="1986.69" waitingTime="1.00" waitingCount="1" stopTime="0.00" timeLoss="10.51" rerouteNo="1" devices="tripinfo_car_s2e_10 routing_car_s2e_10" vType="Car" speedFactor="1.00" vaporized=""/>
    <tripinfo id="car_s2n_33" depart="33.00" departLane="s2sep_1" departPos="3.60" departPosLat="0.00" departSpeed="13.90" departDelay="0.00" arrival="166.00" arrivalLane="c2n_1" arrivalPos="990.00" arrivalPosLat="0.00" arrivalSpeed="15.16" duration="133.00" routeLength="1997.01" waitingTime="0.00" waitingCount="0" stopTime="0.00" timeLoss="0.63" rerouteNo="1" devices="tripinfo_car_s2n_33 routing_car_s2n_33" vType="Car" speedFactor="1.09" vaporized=""/>
    <tripinfo id="car_n2s_19" depart="19.00" departLane="n2sep_1" departPos="3.60" departPosLat="0.00" departSpeed="13.90" departDelay="0.00" arrival="167.00" arrivalLane="c2s_1" arrivalPos="990.00" arrivalPosLat="0.00" arrivalSpeed="14.31" duration="148.00" routeLength="1997.01" waitingTime="0.00" waitingCount="0" stopTime="0.00" timeLoss="8.08" rerouteNo="1" devices="tripinfo_car_n2s_19 routing_car_n2s_19" vType="Car" speedFactor="1.03" vaporized=""/>
    <tripinfo id="car_s2w_3" depart="3.00" departLane="s2sep_1" departPos="3.60" departPosLat="0.00" departSpeed="13.90" departDelay="0.00" arrival="168.00" arrivalLane="c2w_1" arrivalPos="990.00" arrivalPosLat="0.00" arrivalSpeed="14.04" duration="165.00" routeLength="1996.47" waitingTime="8.00" waitingCount="1" stopTime="0.00" timeLoss="21.90" rerouteNo="1" devices="tripinfo_car_s2w_3 routing_car_s2w_3" vType="Car" speedFactor="1.01" vaporized=""/>
    <tripinfo id="car_s2w_12" depart="12.00" departLane="s2sep_1" departPos="3.60" departPosLat="0.00" departSpeed="13.90" departDelay="0.00" arrival="173.00" arrivalLane="c2w_1" arrivalPos="990.00" arrivalPosLat="0.00" arrivalSpeed="14.04" duration="161.00" routeLength="1996.47" waitingTime="0.00" waitingCount="0" stopTime="0.00" timeLoss="17.39" rerouteNo="1" devices="tripinfo_car_s2w_12 routing_car_s2w_12" vType="Car" speedFactor="1.01" vaporized=""/>
    <tripinfo id="car_s2w_49" depart="49.00" departLane="s2sep_1" departPos="3.60" departPosLat="0.00" departSpeed="13.90" departDelay="0.00" arrival="199.00" arrivalLane="c2w_1" arrivalPos="990.00" arrivalPosLat="0.00" arrivalSpeed="13.90" duration="150.00" routeLength="1996.47" waitingTime="0.00" waitingCount="0" stopTime="0.00" timeLoss="4.79" rerouteNo="1" devices="tripinfo_car_s2w_49 routing_car_s2w_49" vType="Car" speedFactor="1.00" vaporized=""/>
    <tripinfo id="car_w2s_37" depart="37.00" departLane="w2sep_1" departPos="3.60" departPosLat="0.00" departSpeed="13.90" departDelay="0.00" arrival="206.00" arrivalLane="c2s_1" arrivalPos="990.00" arrivalPosLat="0.00" arrivalSpeed="14.55" duration="169.00" routeLength="1986.69" waitingTime="22.00" waitingCount="1" stopTime="0.00" timeLoss="31.83" rerouteNo="1" devices="tripinfo_car_w2s_37 routing_car_w2s_37" vType="Car" speedFactor="1.05" vaporized=""/>
    <tripinfo id="car_w2e_74" depart="74.00" departLane="w2sep_1" departPos="3.60" departPosLat="0.00" departSpeed="13.90" departDelay="0.00" arrival="208.00" arrivalLane="c2e_1" arrivalPos="990.00" arrivalPosLat="0.00" arrivalSpeed="15.16" duration="134.00" routeLength="1997.01" waitingTime="0.00" waitingCount="0" stopTime="0.00" timeLoss="2.06" rerouteNo="1" devices="tripinfo_car_w2e_74 routing_car_w2e_74" vType="Car" speedFactor="1.09" vaporized=""/>
    <tripinfo id="car_w2s_44" depart="44.00" departLane="w2sep_1" departPos="3.60" departPosLat="0.00" departSpeed="13.90" departDelay="0.00" arrival="209.00" arrivalLane="c2s_1" arrivalPos="990.00" arrivalPosLat="0.00" arrivalSpeed="15.48" duration="165.00" routeLength="1986.69" waitingTime="20.00" waitingCount="1" stopTime="0.00" timeLoss="36.43" rerouteNo="1" devices="tripinfo_car_w2s_44 routing_car_w2s_44" vType="Car" speedFactor="1.12" vaporized=""/>
    <tripinfo id="car_e2n_67" depart="67.00" departLane="e2sep_1" departPos="3.60" departPosLat="0.00" departSpeed="13.90" departDelay="0.00" arrival="215.00" arrivalLane="c2n_1" arrivalPos="990.00" arrivalPosLat="0.00" arrivalSpeed="14.04" duration="148.00" routeLength="1986.69" waitingTime="0.00" waitingCount="0" stopTime="0.00" timeLoss="4.91" rerouteNo="1" devices="tripinfo_car_e2n_67 routing_car_e2n_67" vType="Car" speedFactor="1.01" vaporized=""/>
    <tripinfo id="car_e2s_36" depart="36.00" departLane="e2sep_1" departPos="3.60" departPosLat="0.00" departSpeed="13.90" departDelay="0.00" arrival="216.00" arrivalLane="c2s_1" arrivalPos="990.00" arrivalPosLat="0.00" arrivalSpeed="14.27" duration="180.00" routeLength="1996.47" waitingTime="22.00" waitingCount="2" stopTime="0.00" timeLoss="38.76" rerouteNo="1" devices="tripinfo_car_e2s_36 routing_car_e2s_36" vType="Car" speedFactor="1.03" vaporized=""/>
    <tripinfo id="car_e2w_75" depart="75.00" departLane="e2sep_1" departPos="3.60" departPosLat="0.00" departSpeed="13.90" departDelay="0.00" arrival="217.00" arrivalLane="c2w_1" arrivalPos="990.00" arrivalPosLat="0.00" arrivalSpeed="14.27" duration="142.00" routeLength="1997.01" waitingTime="0.00" waitingCount="0" stopTime="0.00" timeLoss="1.05" rerouteNo="1" devices="tripinfo_car_e2w_75 routing_car_e2w_75" vType="Car" speedFactor="1.03" vaporized=""/>
    <tripinfo id="car_w2e_79" depart="79.00" departLane="w2sep_1" departPos="3.60" departPosLat="0.00" departSpeed="13.90" departDelay="0.00" arrival="218.00" arrivalLane="c2e_1" arrivalPos="990.00" arrivalPosLat="0.00" arrivalSpeed="14.55" duration="139.00" routeLength="1997.01" waitingTime="0.00" waitingCount="0" stopTime="0.00" timeLoss="1.15" rerouteNo="1" devices="tripinfo_car_w2e_79 routing_car_w2e_79" vType="Car" speedFactor="1.05" vaporized=""/>
    <tripinfo id="car_e2s_54" depart="54.00" departLane="e2sep_1" departPos="3.60" departPosLat="0.00" departSpeed="13.90" departDelay="0.00" arrival="221.00" arrivalLane="c2s_1" arrivalPos="990.00" arrivalPosLat="0.00" arrivalSpeed="14.53" duration="167.00" routeLength="1996.47" waitingTime="6.00" waitingCount="1" stopTime="0.00" timeLoss="28.32" rerouteNo="1" devices="tripinfo_car_e2s_54 routing_car_e2s_54" vType="Car" speedFactor="1.05" vaporized=""/>
    <tripinfo id="car_e2s_56" depart="56.00" departLane="e2sep_1" departPos="3.60" departPosLat="0.00" departSpeed="13.90" departDelay="0.00" arrival="227.00" arrivalLane="c2s_1" arrivalPos="990.00" arrivalPosLat="0.00" arrivalSpeed="13.90" duration="171.00" routeLength="1996.47" waitingTime="2.00" waitingCount="1" stopTime="0.00" timeLoss="25.96" rerouteNo="1" devices="tripinfo_car_e2s_56 routing_car_e2s_56" vType="Car" speedFactor="1.00" vaporized=""/>
    <tripinfo id="car_e2n_101" depart="101.00" departLane="e2sep_1" departPos="3.60" departPosLat="0.00" departSpeed="13.90" departDelay="0.00" arrival="230.00" arrivalLane="c2n_1" arrivalPos="990.00" arrivalPosLat="0.00" arrivalSpeed="16.38" duration="129.00" routeLength="1986.69" waitingTime="0.00" waitingCount="0" stopTime="0.00" timeLoss="6.41" rerouteNo="1" devices="tripinfo_car_e2n_101 routing_car_e2n_101" vType="Car" speedFactor="1.18" vaporized=""/>
    <tripinfo id="car_e2s_58" depart="58.00" departLane="e2sep_1" departPos="3.60" departPosLat="0.00" departSpeed="13.90" departDelay="0.00" arrival="231.00" arrivalLane="c2s_1" arrivalPos="990.00" arrivalPosLat="0.00" arrivalSpeed="13.89" duration="173.00" routeLength="1996.47" waitingTime="0.00" waitingCount="0" stopTime="0.00" timeLoss="27.75" rerouteNo="1" devices="tripinfo_car_e2s_58 routing_car_e2s_58" vType="Car" speedFactor="1.00" vaporized=""/>
    <tripinfo id="car_e2s_60" depart="60.00" departLane="e2sep_1" departPos="3.60" departPosLat="0.00" departSpeed="13.90" departDelay="0.00" arrival="232.00" arrivalLane="c2s_1" arrivalPos="990.00" arrivalPosLat="0.00" arrivalSpeed="14.76" duration="172.00" routeLength="1996.47" waitingTime="0.00" waitingCount="0" stopTime="0.00" timeLoss="47.33" rerouteNo="1" devices="tripinfo_car_e2s_60 routing_car_e2s_60" vType="Car" speedFactor="1.16" vaporized=""/>
    <tripinfo id="car_e2s_102" depart="103.00" departLane="e2sep_1" departPos="3.60" departPosLat="0.00" departSpeed="13.90" departDelay="1.00" arrival="235.00" arrivalLane="c2s_1" arrivalPos="990.00" arrivalPosLat="0.00" arrivalSpeed="15.91" duration="132.00" routeLength="1996.47" waitingTime="0.00" waitingCount="0" stopTime="0.00" timeLoss="6.98" rerouteNo="1" devices="tripinfo_car_e2s_102 routing_car_e2s_102" vType="Car" speedFactor="1.15" vaporized=""/>
    <tripinfo id="car_n2e_94" depart="94.00" departLane="n2sep_1" departPos="3.60" departPosLat="0.00" departSpeed="13.90" departDelay="0.00" arrival="253.00" arrivalLane="c2e_1" arrivalPos="990.00" arrivalPosLat="0.00" arrivalSpeed="15.73" duration="159.00" routeLength="1996.47" waitingTime="14.00" waitingCount="1" stopTime="0.00" timeLoss="31.02" rerouteNo="1" devices="tripinfo_car_n2e_94 routing_car_n2e_94" vType="Car" speedFactor="1.13" vaporized=""/>
    <tripinfo id="car_n2w_55" depart="55.00" departLane="n2sep_1" departPos="3.60" departPosLat="0.00" departSpeed="13.90" departDelay="0.00" arrival="254.00" arrivalLane="c2w_1" arrivalPos="990.00" arrivalPosLat="0.00" arrivalSpeed="13.90" duration="199.00" routeLength="1986.69" waitingTime="46.00" waitingCount="1" stopTime="0.00" timeLoss="55.51" rerouteNo="1" devices="tripinfo_car_n2w_55 routing_car_n2w_55" vType="Car" speedFactor="1.00" vaporized=""/>
    <tripinfo id="car_s2n_64" depart="64.00" departLane="s2sep_1" departPos="3.60" departPosLat="0.00" departSpeed="13.90" departDelay="0.00" arrival="254.00" arrivalLane="c2n_1" arrivalPos="990.00" arrivalPosLat="0.00" arrivalSpeed="14.15" duration="190.00" routeLength="1997.01" waitingTime="38.00" waitingCount="1" stopTime="0.00" timeLoss="47.90" rerouteNo="1" devices="tripinfo_car_s2n_64 routing_car_s2n_64" vType="Car" speedFactor="1.02" vaporized=""/>
    <tripinfo id="car_n2w_79" depart="79.00" departLane="n2sep_1" departPos="3.60" departPosLat="0.00" departSpeed="13.90" departDelay="0.00" arrival="256.00" arrivalLane="c2w_1" arrivalPos="990.00" arrivalPosLat="0.00" arrivalSpeed="15.15" duration="177.00" routeLength="1986.69" waitingTime="30.00" waitingCount="1" stopTime="0.00" timeLoss="49.09" rerouteNo="1" devices="tripinfo_car_n2w_79 routing_car_n2w_79" vType="Car" speedFactor="1.12" vaporized=""/>
    <tripinfo id="car_n2w_120" depart="120.00" departLane="n2sep_1" departPos="3.60" departPosLat="0.00" departSpeed="13.90" departDelay="0.00" arrival="258.00" arrivalLane="c2w_1" arrivalPos="990.00" arrivalPosLat="0.00" arrivalSpeed="15.53" duration="138.00" routeLength="1986.69" waitingTime="0.00" waitingCount="0" stopTime="0.00" timeLoss="13.96" rerouteNo="1" devices="tripinfo_car_n2w_120 routing_car_n2w_120" vType="Car" speedFactor="1.16" vaporized=""/>
    <tripinfo id="car_s2n_89" depart="89.00" departLane="s2sep_1" departPos="3.60" departPosLat="0.00" departSpeed="13.90" departDelay="0.00" arrival="259.00" arrivalLane="c2n_1" arrivalPos="990.00" arrivalPosLat="0.00" arrivalSpeed="13.90" duration="170.00" routeLength="1997.01" waitingTime="13.00" waitingCount="1" stopTime="0.00" timeLoss="25.55" rerouteNo="1" devices="tripinfo_car_s2n_89 routing_car_s2n_89" vType="Car" speedFactor="1.00" vaporized=""/>
    <tripinfo id="car_n2s_104" depart="104.00" departLane="n2sep_1" departPos="3.60" departPosLat="0.00" departSpeed="13.90" departDelay="0.00" arrival="259.00" arrivalLane="c2s_1" arrivalPos="990.00" arrivalPosLat="0.00" arrivalSpeed="13.97" duration="155.00" routeLength="1997.01" waitingTime="0.00" waitingCount="0" stopTime="0.00" timeLoss="11.50" rerouteNo="1" devices="tripinfo_car_n2s_104 routing_car_n2s_104" vType="Car" speedFactor="1.01" vaporized=""/>
    <tripinfo id="car_s2n_114" depart="114.00" departLane="s2sep_1" departPos="3.60" departPosLat="0.00" departSpeed="13.90" departDelay="0.00" arrival="261.00" arrivalLane="c2n_1" arrivalPos="990.00" arrivalPosLat="0.00" arrivalSpeed="14.92" duration="147.00" routeLength="1997.01" waitingTime="0.00" waitingCount="0" stopTime="0.00" timeLoss="16.06" rerouteNo="1" devices="tripinfo_car_s2n_114 routing_car_s2n_114" vType="Car" speedFactor="1.10" vaporized=""/>
    <tripinfo id="car_n2e_107" depart="107.00" departLane="n2sep_1" departPos="3.60" departPosLat="0.00" departSpeed="13.90" departDelay="0.00" arrival="264.00" arrivalLane="c2e_1" arrivalPos="990.00" arrivalPosLat="0.00" arrivalSpeed="13.90" duration="157.00" routeLength="1996.47" waitingTime="0.00" waitingCount="0" stopTime="0.00" timeLoss="11.99" rerouteNo="1" devices="tripinfo_car_n2e_107 routing_car_n2e_107" vType="Car" speedFactor="1.00" vaporized=""/>
    <tripinfo id="car_n2s_121" depart="122.00" departLane="n2sep_1" departPos="3.60" departPosLat="0.00" departSpeed="13.90" departDelay="1.00" arrival="264.00" arrivalLane="c2s_1" arrivalPos="990.00" arrivalPosLat="0.00" arrivalSpeed="14.32" duration="142.00" routeLength="1997.01" waitingTime="0.00" waitingCount="0" stopTime="0.00" timeLoss="2.19" rerouteNo="1" devices="tripinfo_car_n2s_121 routing_car_n2s_121" vType="Car" speedFactor="1.03" vaporized=""/>
    <tripinfo id="car_s2n_129" depart="129.00" departLane="s2sep_1" departPos="3.60" departPosLat="0.00" departSpeed="13.90" departDelay="0.00" arrival="264.00" arrivalLane="c2n_1" arrivalPos="990.00" arrivalPosLat="0.00" arrivalSpeed="15.04" duration="135.00" routeLength="1997.01" waitingTime="0.00" waitingCount="0" stopTime="0.00" timeLoss="2.32" rerouteNo="1" devices="tripinfo_car_s2n_129 routing_car_s2n_129" vType="Car" speedFactor="1.09" vaporized=""/>
    <tripinfo id="car_s2w_92" depart="92.00" departLane="s2sep_1" departPos="3.60" departPosLat="0.00" departSpeed="13.90" departDelay="0.00" arrival="268.00" arrivalLane="c2w_1" arrivalPos="990.00" arrivalPosLat="0.00" arrivalSpeed="13.90" duration="176.00" routeLength="1996.47" waitingTime="15.00" waitingCount="2" stopTime="0.00" timeLoss="31.50" rerouteNo="1" devices="tripinfo_car_s2w_92 routing_car_s2w_92" vType="Car" speedFactor="1.00" vaporized=""/>
    <tripinfo id="car_s2w_109" depart="109.00" departLane="s2sep_1" departPos="3.60" departPosLat="0.00" departSpeed="13.90" departDelay="0.00" arrival="273.00" arrivalLane="c2w_1" arrivalPos="990.00" arrivalPosLat="0.00" arrivalSpeed="13.90" duration="164.00" routeLength="1996.47" waitingTime="6.00" waitingCount="1" stopTime="0.00" timeLoss="18.88" rerouteNo="1" devices="tripinfo_car_s2w_109 routing_car_s2w_109" vType="Car" speedFactor="1.00" vaporized=""/>
    <tripinfo id="car_s2w_125" depart="125.00" departLane="s2sep_1" departPos="3.60" departPosLat="0.00" departSpeed="13.90" departDelay="0.00" arrival="275.00" arrivalLane="c2w_1" arrivalPos="990.00" arrivalPosLat="0.00" arrivalSpeed="14.25" duration="150.00" routeLength="1996.47" waitingTime="0.00" waitingCount="0" stopTime="0.00" timeLoss="10.65" rerouteNo="1" devices="tripinfo_car_s2w_125 routing_car_s2w_125" vType="Car" speedFactor="1.04" vaporized=""/>
    <tripinfo id="car_s2n_140" depart="140.00" departLane="s2sep_1" departPos="3.60" departPosLat="0.00" departSpeed="13.90" departDelay="0.00" arrival="284.00" arrivalLane="c2n_1" arrivalPos="990.00" arrivalPosLat="0.00" arrivalSpeed="13.94" duration="144.00" routeLength="1997.01" waitingTime="0.00" waitingCount="0" stopTime="0.00" timeLoss="0.16" rerouteNo="1" devices="tripinfo_car_s2n_140 routing_car_s2n_140" vType="Car" speedFactor="1.00" vaporized=""/>
    <tripinfo id="car_n2w_135" depart="135.00" departLane="n2sep_1" departPos="3.60" departPosLat="0.00" departSpeed="13.90" departDelay="0.00" arrival="285.00" arrivalLane="c2w_1" arrivalPos="990.00" arrivalPosLat="0.00" arrivalSpeed="13.90" duration="150.00" routeLength="1986.69" waitingTime="0.00" waitingCount="0" stopTime="0.00" timeLoss="5.51" rerouteNo="1" devices="tripinfo_car_n2w_135 routing_car_n2w_135" vType="Car" speedFactor="1.00" vaporized=""/>
    <tripinfo id="car_n2w_138" depart="138.00" departLane="n2sep_1" departPos="3.60" departPosLat="0.00" departSpeed="13.90" departDelay="0.00" arrival="286.00" arrivalLane="c2w_1" arrivalPos="990.00" arrivalPosLat="0.00" arrivalSpeed="14.92" duration="148.00" routeLength="1986.69" waitingTime="0.00" waitingCount="0" stopTime="0.00" timeLoss="24.93" rerouteNo="1" devices="tripinfo_car_n2w_138 routing_car_n2w_138" vType="Car" speedFactor="1.17" vaporized=""/>
    <tripinfo id="car_s2w_145" depart="145.00" departLane="s2sep_1" departPos="3.60" departPosLat="0.00" departSpeed="13.90" departDelay="0.00" arrival="293.00" arrivalLane="c2w_1" arrivalPos="990.00" arrivalPosLat="0.00" arrivalSpeed="13.90" duration="148.00" routeLength="1996.47" waitingTime="0.00" waitingCount="0" stopTime="0.00" timeLoss="2.95" rerouteNo="1" devices="tripinfo_car_s2w_145 routing_car_s2w_145" vType="Car" speedFactor="1.00" vaporized=""/>
    <tripinfo id="car_e2w_108" depart="108.00" departLane="e2sep_1" departPos="3.60" departPosLat="0.00" departSpeed="13.90" departDelay="0.00" arrival="299.00" arrivalLane="c2w_1" arrivalPos="990.00" arrivalPosLat="0.00" arrivalSpeed="14.17" duration="191.00" routeLength="1997.01" waitingTime="39.00" waitingCount="1" stopTime="0.00" timeLoss="49.55" rerouteNo="1" devices="tripinfo_car_e2w_108 routing_car_e2w_108" vType="Car" speedFactor="1.02" vaporized=""/>
    <tripinfo id="car_e2n_125" depart="125.00" departLane="e2sep_1" departPos="3.60" departPosLat="0.00" departSpeed="13.90" departDelay="0.00" arrival="299.00" arrivalLane="c2n_1" arrivalPos="990.00" arrivalPosLat="0.00" arrivalSpeed="15.18" duration="174.00" routeLength="1986.69" waitingTime="29.00" waitingCount="1" stopTime="0.00" timeLoss="42.30" rerouteNo="1" devices="tripinfo_car_e2n_125 routing_car_e2n_125" vType="Car" speedFactor="1.09" vaporized=""/>
    <tripinfo id="car_w2e_100" depart="100.00" departLane="w2sep_1" departPos="3.60" departPosLat="0.00" departSpeed="13.90" departDelay="0.00" arrival="300.00" arrivalLane="c2e_1" arrivalPos="990.00" arrivalPosLat="0.00" arrivalSpeed="13.90" duration="200.00" routeLength="1997.01" waitingTime="46.00" waitingCount="1" stopTime="0.00" timeLoss="55.57" rerouteNo="1" devices="tripinfo_car_w2e_100 routing_car_w2e_100" vType="Car" speedFactor="1.00" vaporized=""/>
    <tripinfo id="car_e2w_110" depart="110.00" departLane="e2sep_1" departPos="3.60" departPosLat="0.00" departSpeed="13.90" departDelay="0.00" arrival="301.00" arrivalLane="c2w_1" arrivalPos="990.00" arrivalPosLat="0.00" arrivalSpeed="15.71" duration="191.00" routeLength="1997.01" waitingTime="39.00" waitingCount="1" stopTime="0.00" timeLoss="68.58" rerouteNo="1" devices="tripinfo_car_e2w_110 routing_car_e2w_110" vType="Car" speedFactor="1.18" vaporized=""/>
    <tripinfo id="car_w2e_106" depart="106.00" departLane="w2sep_1" departPos="3.60" departPosLat="0.00" departSpeed="13.90" departDelay="0.00" arrival="302.00" arrivalLane="c2e_1" arrivalPos="990.00" arrivalPosLat="0.00" arrivalSpeed="15.57" duration="196.00" routeLength="1997.01" waitingTime="46.00" waitingCount="1" stopTime="0.00" timeLoss="72.56" rerouteNo="1" devices="tripinfo_car_w2e_106 routing_car_w2e_106" vType="Car" speedFactor="1.17" vaporized=""/>
    <tripinfo id="car_w2e_123" depart="123.00" departLane="w2sep_1" departPos="3.60" departPosLat="0.00" departSpeed="13.90" departDelay="0.00" arrival="305.00" arrivalLane="c2e_1" arrivalPos="990.00" arrivalPosLat="0.00" arrivalSpeed="14.12" duration="182.00" routeLength="1997.01" waitingTime="27.00" waitingCount="1" stopTime="0.00" timeLoss="40.86" rerouteNo="1" devices="tripinfo_car_w2e_123 routing_car_w2e_123" vType="Car" speedFactor="1.02" vaporized=""/>
    <tripinfo id="car_w2s_148" depart="148.00" departLane="w2sep_1" departPos="3.60" departPosLat="0.00" departSpeed="13.90" departDelay="0.00" arrival="307.00" arrivalLane="c2s_1" arrivalPos="990.00" arrivalPosLat="0.00" arrivalSpeed="15.88" duration="159.00" routeLength="1986.69" waitingTime="13.00" waitingCount="1" stopTime="0.00" timeLoss="32.33" rerouteNo="1" devices="tripinfo_car_w2s_148 routing_car_w2s_148" vType="Car" speedFactor="1.14" vaporized=""/>
    <tripinfo id="car_w2e_128" depart="129.00" departLane="w2sep_1" departPos="3.60" departPosLat="0.00" departSpeed="13.90" departDelay="1.00" arrival="308.00" arrivalLane="c2e_1" arrivalPos="990.00" arrivalPosLat="0.00" arrivalSpeed="14.43" duration="179.00" routeLength="1997.01" waitingTime="23.00" waitingCount="1" stopTime="0.00" timeLoss="41.07" rerouteNo="1" devices="tripinfo_car_w2e_128 routing_car_w2e_128" vType="Car" speedFactor="1.04" vaporized=""/>
    <tripinfo id="car_e2n_132" depart="132.00" departLane="e2sep_1" departPos="3.60" departPosLat="0.00" departSpeed="13.90" departDelay="0.00" arrival="309.00" arrivalLane="c2n_1" arrivalPos="990.00" arrivalPosLat="0.00" arrivalSpeed="13.90" duration="177.00" routeLength="1986.69" waitingTime="18.00" waitingCount="1" stopTime="0.00" timeLoss="32.53" rerouteNo="1" devices="tripinfo_car_e2n_132 routing_car_e2n_132" vType="Car" speedFactor="1.00" vaporized=""/>
    <tripinfo id="car_e2w_135" depart="135.00" departLane="e2sep_1" departPos="3.60" departPosLat="0.00" departSpeed="13.90" departDelay="0.00" arrival="311.00" arrivalLane="c2w_1" arrivalPos="990.00" arrivalPosLat="0.00" arrivalSpeed="13.90" duration="176.00" routeLength="1997.01" waitingTime="15.00" waitingCount="1" stopTime="0.00" timeLoss="31.50" rerouteNo="1" devices="tripinfo_car_e2w_135 routing_car_e2w_135" vType="Car" speedFactor="1.00" vaporized=""/>
    <tripinfo id="car_e2n_156" depart="156.00" departLane="e2sep_1" departPos="3.60" departPosLat="0.00" departSpeed="13.90" departDelay="0.00" arrival="311.00" arrivalLane="c2n_1" arrivalPos="990.00" arrivalPosLat="0.00" arrivalSpeed="15.26" duration="155.00" routeLength="1986.69" waitingTime="5.00" waitingCount="1" stopTime="0.00" timeLoss="27.55" rerouteNo="1" devices="tripinfo_car_e2n_156 routing_car_e2n_156" vType="Car" speedFactor="1.13" vaporized=""/>
    <tripinfo id="car_w2e_132" depart="132.00" departLane="w2sep_1" departPos="3.60" departPosLat="0.00" departSpeed="13.90" departDelay="0.00" arrival="312.00" arrivalLane="c2e_1" arrivalPos="990.00" arrivalPosLat="0.00" arrivalSpeed="14.02" duration="180.00" routeLength="1997.01" waitingTime="19.00" waitingCount="1" stopTime="0.00" timeLoss="36.92" rerouteNo="1" devices="tripinfo_car_w2e_132 routing_car_w2e_132" vType="Car" speedFactor="1.01" vaporized=""/>
    <tripinfo id="bus_w2e_141" depart="141.00" departLane="w2sep_1" departPos="12.10" departPosLat="0.00" departSpeed="13.90" departDelay="0.00" arrival="315.00" arrivalLane="c2e_1" arrivalPos="990.00" arrivalPosLat="0.00" arrivalSpeed="13.74" duration="174.00" routeLength="1988.51" waitingTime="13.00" waitingCount="1" stopTime="0.00" timeLoss="30.49" rerouteNo="1" devices="tripinfo_bus_w2e_141 routing_bus_w2e_141" vType="Bus" speedFactor="1.00" vaporized=""/>
    <tripinfo id="car_e2w_142" depart="142.00" departLane="e2sep_1" departPos="3.60" departPosLat="0.00" departSpeed="13.90" departDelay="0.00" arrival="315.00" arrivalLane="c2w_1" arrivalPos="990.00" arrivalPosLat="0.00" arrivalSpeed="13.89" duration="173.00" routeLength="1997.01" waitingTime="10.00" waitingCount="1" stopTime="0.00" timeLoss="28.78" rerouteNo="1" devices="tripinfo_car_e2w_142 routing_car_e2w_142" vType="Car" speedFactor="1.00" vaporized=""/>
    <tripinfo id="car_e2w_162" depart="162.00" departLane="e2sep_1" departPos="3.60" departPosLat="0.00" departSpeed="13.90" departDelay="0.00" arrival="317.00" arrivalLane="c2w_1" arrivalPos="990.00" arrivalPosLat="0.00" arrivalSpeed="15.37" duration="155.00" routeLength="1997.01" waitingTime="2.00" waitingCount="1" stopTime="0.00" timeLoss="29.90" rerouteNo="1" devices="tripinfo_car_e2w_162 routing_car_e2w_162" vType="Car" speedFactor="1.15" vaporized=""/>
    <tripinfo id="car_e2s_136" depart="137.00" departLane="e2sep_1" departPos="3.60" departPosLat="0.00" departSpeed="13.90" departDelay="1.00" arrival="318.00" arrivalLane="c2s_1" arrivalPos="990.00" arrivalPosLat="0.00" arrivalSpeed="13.90" duration="181.00" routeLength="1996.47" waitingTime="20.00" waitingCount="2" stopTime="0.00" timeLoss="36.67" rerouteNo="1" devices="tripinfo_car_e2s_136 routing_car_e2s_136" vType="Car" speedFactor="1.00" vaporized=""/>
    <tripinfo id="car_e2n_167" depart="167.00" departLane="e2sep_1" departPos="3.60" departPosLat="0.00" departSpeed="13.90" departDelay="0.00" arrival="318.00" arrivalLane="c2n_1" arrivalPos="990.00" arrivalPosLat="0.00" arrivalSpeed="14.45" duration="151.00" routeLength="1986.69" waitingTime="0.00" waitingCount="0" stopTime="0.00" timeLoss="12.46" rerouteNo="1" devices="tripinfo_car_e2n_167 routing_car_e2n_167" vType="Car" speedFactor="1.04" vaporized=""/>
    <tripinfo id="car_w2e_189" depart="189.00" departLane="w2sep_1" departPos="3.60" departPosLat="0.00" departSpeed="13.90" departDelay="0.00" arrival="319.00" arrivalLane="c2e_1" arrivalPos="990.00" arrivalPosLat="0.00" arrivalSpeed="16.33" duration="130.00" routeLength="1997.01" waitingTime="0.00" waitingCount="0" stopTime="0.00" timeLoss="7.40" rerouteNo="1" devices="tripinfo_car_w2e_189 routing_car_w2e_189" vType="Car" speedFactor="1.18" vaporized=""/>
    <tripinfo id="car_e2w_171" depart="171.00" departLane="e2sep_1" departPos="3.60" departPosLat="0.00" departSpeed="13.90" departDelay="0.00" arrival="322.00" arrivalLane="c2w_1" arrivalPos="990.00" arrivalPosLat="0.00" arrivalSpeed="14.22" duration="151.00" routeLength="1997.01" waitingTime="0.00" waitingCount="0" stopTime="0.00" timeLoss="9.70" rerouteNo="1" devices="tripinfo_car_e2w_171 routing_car_e2w_171" vType="Car" speedFactor="1.02" vaporized=""/>
    <tripinfo id="car_e2n_175" depart="175.00" departLane="e2sep_1" departPos="3.60" departPosLat="0.00" departSpeed="13.90" departDelay="0.00" arrival="323.00" arrivalLane="c2n_1" arrivalPos="990.00" arrivalPosLat="0.00" arrivalSpeed="14.67" duration="148.00" routeLength="1986.69" waitingTime="0.00" waitingCount="0" stopTime="0.00" timeLoss="11.15" rerouteNo="1" devices="tripinfo_car_e2n_175 routing_car_e2n_175" vType="Car" speedFactor="1.06" vaporized=""/>
    <tripinfo id="car_w2s_177" depart="177.00" departLane="w2sep_1" departPos="3.60" departPosLat="0.00" departSpeed="13.90" departDelay="0.00" arrival="327.00" arrivalLane="c2s_1" arrivalPos="990.00" arrivalPosLat="0.00" arrivalSpeed="13.90" duration="150.00" routeLength="1986.69" waitingTime="0.00" waitingCount="0" stopTime="0.00" timeLoss="5.60" rerouteNo="1" devices="tripinfo_car_w2s_177 routing_car_w2s_177" vType="Car" speedFactor="1.00" vaporized=""/>
    <tripinfo id="car_e2s_138" depart="139.00" departLane="e2sep_1" departPos="3.60" departPosLat="0.00" departSpeed="13.90" departDelay="1.00" arrival="329.00" arrivalLane="c2s_1" arrivalPos="990.00" arrivalPosLat="0.00" arrivalSpeed="14.90" duration="190.00" routeLength="1996.47" waitingTime="25.00" waitingCount="3" stopTime="0.00" timeLoss="57.76" rerouteNo="1" devices="tripinfo_car_e2s_138 routing_car_e2s_138" vType="Car" speedFactor="1.10" vaporized=""/>
    <tripinfo id="bus_w2n_127" depart="127.00" departLane="w2sep_1" departPos="12.10" departPosLat="0.00" departSpeed="13.90" departDelay="0.00" arrival="332.00" arrivalLane="c2n_1" arrivalPos="990.00" arrivalPosLat="0.00" arrivalSpeed="13.90" duration="205.00" routeLength="1987.97" waitingTime="42.00" waitingCount="2" stopTime="0.00" timeLoss="60.70" rerouteNo="1" devices="tripinfo_bus_w2n_127 routing_bus_w2n_127" vType="Bus" speedFactor="1.00" vaporized=""/>
    <tripinfo id="car_e2s_154" depart="154.00" departLane="e2sep_1" departPos="3.60" departPosLat="0.00" departSpeed="13.90" departDelay="0.00" arrival="333.00" arrivalLane="c2s_1" arrivalPos="990.00" arrivalPosLat="0.00" arrivalSpeed="14.22" duration="179.00" routeLength="1996.47" waitingTime="17.00" waitingCount="2" stopTime="0.00" timeLoss="38.01" rerouteNo="1" devices="tripinfo_car_e2s_154 routing_car_e2s_154" vType="Car" speedFactor="1.02" vaporized=""/>
    <tripinfo id="car_w2n_160" depart="160.00" departLane="w2sep_1" departPos="3.60" departPosLat="0.00" departSpeed="13.90" departDelay="0.00" arrival="336.00" arrivalLane="c2n_1" arrivalPos="990.00" arrivalPosLat="0.00" arrivalSpeed="14.10" duration="176.00" routeLength="1996.47" waitingTime="17.00" waitingCount="1" stopTime="0.00" timeLoss="33.47" rerouteNo="1" devices="tripinfo_car_w2n_160 routing_car_w2n_160" vType="Car" speedFactor="1.02" vaporized=""/>
    <tripinfo id="car_s2n_160" depart="162.00" departLane="s2sep_1" departPos="3.60" departPosLat="0.00" departSpeed="13.90" departDelay="2.00" arrival="338.00" arrivalLane="c2n_1" arrivalPos="990.00" arrivalPosLat="0.00" arrivalSpeed="15.90" duration="176.00" routeLength="1997.01" waitingTime="39.00" waitingCount="1" stopTime="0.00" timeLoss="53.92" rerouteNo="1" devices="tripinfo_car_s2n_160 routing_car_s2n_160" vType="Car" speedFactor="1.18" vaporized=""/>
    <tripinfo id="car_s2e_156" depart="156.00" departLane="s2sep_1" departPos="3.60" departPosLat="0.00" departSpeed="13.90" departDelay="0.00" arrival="339.00" arrivalLane="c2e_1" arrivalPos="990.00" arrivalPosLat="0.00" arrivalSpeed="15.05" duration="183.00" routeLength="1986.69" waitingTime="40.00" waitingCount="1" stopTime="0.00" timeLoss="50.17" rerouteNo="1" devices="tripinfo_car_s2e_156 routing_car_s2e_156" vType="Car" speedFactor="1.08" vaporized=""/>
    <tripinfo id="car_n2s_138" depart="140.00" departLane="n2sep_1" departPos="3.60" departPosLat="0.00" departSpeed="13.90" departDelay="2.00" arrival="344.00" arrivalLane="c2s_1" arrivalPos="990.00" arrivalPosLat="0.00" arrivalSpeed="14.13" duration="204.00" routeLength="1997.01" waitingTime="50.00" waitingCount="1" stopTime="0.00" timeLoss="61.98" rerouteNo="1" devices="tripinfo_car_n2s_138 routing_car_n2s_138" vType="Car" speedFactor="1.02" vaporized=""/>
    <tripinfo id="car_n2s_203" depart="203.00" departLane="n2sep_1" departPos="3.60" departPosLat="0.00" departSpeed="13.90" departDelay="0.00" arrival="349.00" arrivalLane="c2s_1" arrivalPos="990.00" arrivalPosLat="0.00" arrivalSpeed="13.90" duration="146.00" routeLength="1997.01" waitingTime="0.00" waitingCount="0" stopTime="0.00" timeLoss="2.19" rerouteNo="1" devices="tripinfo_car_n2s_203 routing_car_n2s_203" vType="Car" speedFactor="1.00" vaporized=""/>
    <tripinfo id="car_s2e_163" depart="164.00" departLane="s2sep_1" departPos="3.60" departPosLat="0.00" departSpeed="13.90" departDelay="1.00" arrival="350.00" arrivalLane="c2e_1" arrivalPos="990.00" arrivalPosLat="0.00" arrivalSpeed="13.97" duration="186.00" routeLength="1986.69" waitingTime="29.00" waitingCount="1" stopTime="0.00" timeLoss="42.88" rerouteNo="1" devices="tripinfo_car_s2e_163 routing_car_s2e_163" vType="Car" speedFactor="1.01" vaporized=""/>
    <tripinfo id="car_n2e_158" depart="158.00" departLane="n2sep_1" departPos="3.60" departPosLat="0.00" departSpeed="13.90" departDelay="0.00" arrival="352.00" arrivalLane="c2e_1" arrivalPos="990.00" arrivalPosLat="0.00" arrivalSpeed="15.13" duration="194.00" routeLength="1996.47" waitingTime="42.00" waitingCount="2" stopTime="0.00" timeLoss="64.89" rerouteNo="1" devices="tripinfo_car_n2e_158 routing_car_n2e_158" vType="Car" speedFactor="1.12" vaporized=""/>
    <tripinfo id="bus_s2w_148" depart="148.00" departLane="s2sep_1" departPos="12.10" departPosLat="0.00" departSpeed="13.90" departDelay="0.00" arrival="354.00" arrivalLane="c2w_1" arrivalPos="990.00" arrivalPosLat="0.00" arrivalSpeed="13.90" duration="206.00" routeLength="1987.97" waitingTime="42.00" waitingCount="1" stopTime="0.00" timeLoss="62.15" rerouteNo="1" devices="tripinfo_bus_s2w_148 routing_bus_s2w_148" vType="Bus" speedFactor="1.00" vaporized=""/>
    <tripinfo id="car_s2w_160" depart="160.00" departLane="s2sep_1" departPos="3.60" departPosLat="0.00" departSpeed="13.90" departDelay="0.00" arrival="359.00" arrivalLane="c2w_1" arrivalPos="990.00" arrivalPosLat="0.00" arrivalSpeed="13.90" duration="199.00" routeLength="1996.47" waitingTime="33.00" waitingCount="1" stopTime="0.00" timeLoss="54.38" rerouteNo="1" devices="tripinfo_car_s2w_160 routing_car_s2w_160" vType="Car" speedFactor="1.00" vaporized=""/>
    <tripinfo id="car_s2e_212" depart="212.00" departLane="s2sep_1" departPos="3.60" departPosLat="0.00" departSpeed="13.90" departDelay="0.00" arrival="361.00" arrivalLane="c2e_1" arrivalPos="990.00" arrivalPosLat="0.00" arrivalSpeed="13.92" duration="149.00" routeLength="1986.69" waitingTime="0.00" waitingCount="0" stopTime="0.00" timeLoss="5.41" rerouteNo="1" devices="tripinfo_car_s2e_212 routing_car_s2e_212" vType="Car" speedFactor="1.00" vaporized=""/>
    <tripinfo id="car_n2e_165" depart="165.00" departLane="n2sep_1" departPos="3.60" departPosLat="0.00" departSpeed="13.90" departDelay="0.00" arrival="363.00" arrivalLane="c2e_1" arrivalPos="990.00" arrivalPosLat="0.00" arrivalSpeed="15.66" duration="198.00" routeLength="1996.47" waitingTime="48.00" waitingCount="3" stopTime="0.00" timeLoss="74.70" rerouteNo="1" devices="tripinfo_car_n2e_165 routing_car_n2e_165" vType="Car" speedFactor="1.17" vaporized=""/>
    <tripinfo id="car_s2w_172" depart="172.00" departLane="s2sep_1" departPos="3.60" departPosLat="0.00" departSpeed="13.90" departDelay="0.00" arrival="363.00" arrivalLane="c2w_1" arrivalPos="990.00" arrivalPosLat="0.00" arrivalSpeed="13.88" duration="191.00" routeLength="1996.47" waitingTime="22.00" waitingCount="1" stopTime="0.00" timeLoss="45.86" rerouteNo="1" devices="tripinfo_car_s2w_172 routing_car_s2w_172" vType="Car" speedFactor="1.00" vaporized=""/>
    <tripinfo id="car_n2s_221" depart="221.00" departLane="n2sep_1" departPos="3.60" departPosLat="0.00" departSpeed="13.90" departDelay="0.00" arrival="363.00" arrivalLane="c2s_1" arrivalPos="990.00" arrivalPosLat="0.00" arrivalSpeed="14.21" duration="142.00" routeLength="1997.01" waitingTime="0.00" waitingCount="0" stopTime="0.00" timeLoss="0.65" rerouteNo="1" devices="tripinfo_car_n2s_221 routing_car_n2s_221" vType="Car" speedFactor="1.02" vaporized=""/>
    <tripinfo id="car_s2n_221" depart="221.00" departLane="s2sep_1" departPos="3.60" departPosLat="0.00" departSpeed="13.90" departDelay="0.00" arrival="364.00" arrivalLane="c2n_1" arrivalPos="990.00" arrivalPosLat="0.00" arrivalSpeed="14.13" duration="143.00" routeLength="1997.01" waitingTime="0.00" waitingCount="0" stopTime="0.00" timeLoss="0.80" rerouteNo="1" devices="tripinfo_car_s2n_221 routing_car_s2n_221" vType="Car" speedFactor="1.02" vaporized=""/>
    <tripinfo id="car_s2w_174" depart="174.00" departLane="s2sep_1" departPos="3.60" departPosLat="0.00" departSpeed="13.90" departDelay="0.00" arrival="365.00" arrivalLane="c2w_1" arrivalPos="990.00" arrivalPosLat="0.00" arrivalSpeed="14.02" duration="191.00" routeLength="1996.47" waitingTime="21.00" waitingCount="1" stopTime="0.00" timeLoss="49.37" rerouteNo="1" devices="tripinfo_car_s2w_174 routing_car_s2w_174" vType="Car" speedFactor="1.02" vaporized=""/>
    <tripinfo id="car_s2n_228" depart="228.00" departLane="s2sep_1" departPos="3.60" departPosLat="0.00" departSpeed="13.90" departDelay="0.00" arrival="366.00" arrivalLane="c2n_1" arrivalPos="990.00" arrivalPosLat="0.00" arrivalSpeed="14.92" duration="138.00" routeLength="1997.01" waitingTime="0.00" waitingCount="0" stopTime="0.00" timeLoss="5.99" rerouteNo="1" devices="tripinfo_car_s2n_228 routing_car_s2n_228" vType="Car" speedFactor="1.09" vaporized=""/>
    <tripinfo id="car_s2w_190" depart="190.00" departLane="s2sep_1" departPos="3.60" departPosLat="0.00" departSpeed="13.90" departDelay="0.00" arrival="368.00" arrivalLane="c2w_1" arrivalPos="990.00" arrivalPosLat="0.00" arrivalSpeed="14.26" duration="178.00" routeLength="1996.47" waitingTime="9.00" waitingCount="1" stopTime="0.00" timeLoss="37.80" rerouteNo="1" devices="tripinfo_car_s2w_190 routing_car_s2w_190" vType="Car" speedFactor="1.03" vaporized=""/>
    <tripinfo id="car_n2e_168" depart="168.00" departLane="n2sep_1" departPos="3.60" departPosLat="0.00" departSpeed="13.90" departDelay="0.00" arrival="371.00" arrivalLane="c2e_1" arrivalPos="990.00" arrivalPosLat="0.00" arrivalSpeed="14.21" duration="203.00" routeLength="1996.47" waitingTime="38.00" waitingCount="3" stopTime="0.00" timeLoss="61.79" rerouteNo="1" devices="tripinfo_car_n2e_168 routing_car_n2e_168" vType="Car" speedFactor="1.02" vaporized=""/>
    <tripinfo id="car_n2w_226" depart="226.00" departLane="n2sep_1" departPos="3.60" departPosLat="0.00" departSpeed="13.90" departDelay="0.00" arrival="372.00" arrivalLane="c2w_1" arrivalPos="990.00" arrivalPosLat="0.00" arrivalSpeed="14.41" duration="146.00" routeLength="1986.69" waitingTime="0.00" waitingCount="0" stopTime="0.00" timeLoss="7.07" rerouteNo="1" devices="tripinfo_car_n2w_226 routing_car_n2w_226" vType="Car" speedFactor="1.04" vaporized=""/>
    <tripinfo id="car_n2s_228" depart="228.00" departLane="n2sep_1" departPos="3.60" departPosLat="0.00" departSpeed="13.90" departDelay="0.00" arrival="372.00" arrivalLane="c2s_1" arrivalPos="990.00" arrivalPosLat="0.00" arrivalSpeed="14.50" duration="144.00" routeLength="1997.01" waitingTime="0.00" waitingCount="0" stopTime="0.00" timeLoss="6.14" rerouteNo="1" devices="tripinfo_car_n2s_228 routing_car_n2s_228" vType="Car" speedFactor="1.04" vaporized=""/>
    <tripinfo id="car_n2e_191" depart="191.00" departLane="n2sep_1" departPos="3.60" departPosLat="0.00" departSpeed="13.90" departDelay="0.00" arrival="374.00" arrivalLane="c2e_1" arrivalPos="990.00" arrivalPosLat="0.00" arrivalSpeed="15.18" duration="183.00" routeLength="1996.47" waitingTime="20.00" waitingCount="3" stopTime="0.00" timeLoss="51.32" rerouteNo="1" devices="tripinfo_car_n2e_191 routing_car_n2e_191" vType="Car" speedFactor="1.10" vaporized=""/>
    <tripinfo id="car_n2e_215" depart="215.00" departLane="n2sep_1" departPos="3.60" departPosLat="0.00" departSpeed="13.90" departDelay="0.00" arrival="377.00" arrivalLane="c2e_1" arrivalPos="990.00" arrivalPosLat="0.00" arrivalSpeed="14.46" duration="162.00" routeLength="1996.47" waitingTime="8.00" waitingCount="1" stopTime="0.00" timeLoss="23.43" rerouteNo="1" devices="tripinfo_car_n2e_215 routing_car_n2e_215" vType="Car" speedFactor="1.04" vaporized=""/>
    <tripinfo id="car_s2w_203" depart="203.00" departLane="s2sep_1" departPos="3.60" departPosLat="0.00" departSpeed="13.90" departDelay="0.00" arrival="378.00" arrivalLane="c2w_1" arrivalPos="990.00" arrivalPosLat="0.00" arrivalSpeed="14.13" duration="175.00" routeLength="1996.47" waitingTime="4.00" waitingCount="1" stopTime="0.00" timeLoss="32.28" rerouteNo="1" devices="tripinfo_car_s2w_203 routing_car_s2w_203" vType="Car" speedFactor="1.02" vaporized=""/>
    <tripinfo id="car_w2s_204" depart="204.00" departLane="w2sep_1" departPos="3.60" departPosLat="0.00" departSpeed="13.90" departDelay="0.00" arrival="387.00" arrivalLane="c2s_1" arrivalPos="990.00" arrivalPosLat="0.00" arrivalSpeed="14.32" duration="183.00" routeLength="1986.69" waitingTime="34.00" waitingCount="1" stopTime="0.00" timeLoss="43.76" rerouteNo="1" devices="tripinfo_car_w2s_204 routing_car_w2s_204" vType="Car" speedFactor="1.03" vaporized=""/>
    <tripinfo id="car_e2w_191" depart="191.00" departLane="e2sep_1" departPos="3.60" departPosLat="0.00" departSpeed="13.90" departDelay="0.00" arrival="389.00" arrivalLane="c2w_1" arrivalPos="990.00" arrivalPosLat="0.00" arrivalSpeed="14.00" duration="198.00" routeLength="1997.01" waitingTime="45.00" waitingCount="1" stopTime="0.00" timeLoss="55.26" rerouteNo="1" devices="tripinfo_car_e2w_191 routing_car_e2w_191" vType="Car" speedFactor="1.01" vaporized=""/>
    <tripinfo id="car_w2e_224" depart="224.00" departLane="w2sep_1" departPos="3.60" departPosLat="0.00" departSpeed="13.90" departDelay="0.00" arrival="389.00" arrivalLane="c2e_1" arrivalPos="990.00" arrivalPosLat="0.00" arrivalSpeed="15.18" duration="165.00" routeLength="1997.01" waitingTime="20.00" waitingCount="1" stopTime="0.00" timeLoss="32.45" rerouteNo="1" devices="tripinfo_car_w2e_224 routing_car_w2e_224" vType="Car" speedFactor="1.09" vaporized=""/>
    <tripinfo id="car_e2n_201" depart="201.00" departLane="e2sep_1" departPos="3.60" departPosLat="0.00" departSpeed="13.90" departDelay="0.00" arrival="390.00" arrivalLane="c2n_1" arrivalPos="990.00" arrivalPosLat="0.00" arrivalSpeed="14.38" duration="189.00" routeLength="1986.69" waitingTime="38.00" waitingCount="1" stopTime="0.00" timeLoss="49.62" rerouteNo="1" devices="tripinfo_car_e2n_201 routing_car_e2n_201" vType="Car" speedFactor="1.03" vaporized=""/>
    <tripinfo id="car_w2s_210" depart="210.00" departLane="w2sep_1" departPos="3.60" departPosLat="0.00" departSpeed="13.90" departDelay="0.00" arrival="390.00" arrivalLane="c2s_1" arrivalPos="990.00" arrivalPosLat="0.00" arrivalSpeed="15.73" duration="180.00" routeLength="1986.69" waitingTime="33.00" waitingCount="1" stopTime="0.00" timeLoss="53.94" rerouteNo="1" devices="tripinfo_car_w2s_210 routing_car_w2s_210" vType="Car" speedFactor="1.15" vaporized=""/>
    <tripinfo id="car_e2n_237" depart="237.00" departLane="e2sep_1" departPos="3.60" departPosLat="0.00" departSpeed="13.90" departDelay="0.00" arrival="394.00" arrivalLane="c2n_1" arrivalPos="990.00" arrivalPosLat="0.00" arrivalSpeed="14.67" duration="157.00" routeLength="1986.69" waitingTime="5.00" waitingCount="1" stopTime="0.00" timeLoss="20.37" rerouteNo="1" devices="tripinfo_car_e2n_237 routing_car_e2n_237" vType="Car" speedFactor="1.06" vaporized=""/>
    <tripinfo id="car_w2n_200" depart="200.00" departLane="w2sep_1" departPos="3.60" departPosLat="0.00" departSpeed="13.90" departDelay="0.00" arrival="396.00" arrivalLane="c2n_1" arrivalPos="990.00" arrivalPosLat="0.00" arrivalSpeed="14.92" duration="196.00" routeLength="1996.47" waitingTime="41.00" waitingCount="1" stopTime="0.00" timeLoss="63.28" rerouteNo="1" devices="tripinfo_car_w2n_200 routing_car_w2n_200" vType="Car" speedFactor="1.09" vaporized=""/>
    <tripinfo id="bus_w2e_230" depart="230.00" departLane="w2sep_1" departPos="12.10" departPosLat="0.00" departSpeed="13.90" departDelay="0.00" arrival="399.00" arrivalLane="c2e_1" arrivalPos="990.00" arrivalPosLat="0.00" arrivalSpeed="13.90" duration="169.00" routeLength="1988.51" waitingTime="11.00" waitingCount="1" stopTime="0.00" timeLoss="25.33" rerouteNo="1" devices="tripinfo_bus_w2e_230 routing_bus_w2e_230" vType="Bus" speedFactor="1.00" vaporized=""/>
    <tripinfo id="car_e2s_210" depart="210.00" departLane="e2sep_1" departPos="3.60" departPosLat="0.00" departSpeed="13.90" departDelay="0.00" arrival="401.00" arrivalLane="c2s_1" arrivalPos="990.00" arrivalPosLat="0.00" arrivalSpeed="13.90" duration="191.00" routeLength="1996.47" waitingTime="31.00" waitingCount="2" stopTime="0.00" timeLoss="46.43" rerouteNo="1" devices="tripinfo_car_e2s_210 routing_car_e2s_210" vType="Car" speedFactor="1.00" vaporized=""/>
    <tripinfo id="car_w2n_240" depart="240.00" departLane="w2sep_1" departPos="3.60" departPosLat="0.00" departSpeed="13.90" departDelay="0.00" arrival="401.00" arrivalLane="c2n_1" arrivalPos="990.00" arrivalPosLat="0.00" arrivalSpeed="14.03" duration="161.00" routeLength="1996.47" waitingTime="0.00" waitingCount="0" stopTime="0.00" timeLoss="17.78" rerouteNo="1" devices="tripinfo_car_w2n_240 routing_car_w2n_240" vType="Car" speedFactor="1.01" vaporized=""/>
    <tripinfo id="car_w2n_248" depart="248.00" departLane="w2sep_1" departPos="3.60" departPosLat="0.00" departSpeed="13.90" departDelay="0.00" arrival="403.00" arrivalLane="c2n_1" arrivalPos="990.00" arrivalPosLat="0.00" arrivalSpeed="15.15" duration="155.00" routeLength="1996.47" waitingTime="0.00" waitingCount="0" stopTime="0.00" timeLoss="26.21" rerouteNo="1" devices="tripinfo_car_w2n_248 routing_car_w2n_248" vType="Car" speedFactor="1.12" vaporized=""/>
    <tripinfo id="car_e2w_259" depart="259.00" departLane="e2sep_1" departPos="3.60" departPosLat="0.00" departSpeed="13.90" departDelay="0.00" arrival="404.00" arrivalLane="c2w_1" arrivalPos="990.00" arrivalPosLat="0.00" arrivalSpeed="13.90" duration="145.00" routeLength="1997.01" waitingTime="0.00" waitingCount="0" stopTime="0.00" timeLoss="0.58" rerouteNo="1" devices="tripinfo_car_e2w_259 routing_car_e2w_259" vType="Car" speedFactor="1.00" vaporized=""/>
    <tripinfo id="car_e2s_217" depart="217.00" departLane="e2sep_1" departPos="3.60" departPosLat="0.00" departSpeed="13.90" departDelay="0.00" arrival="405.00" arrivalLane="c2s_1" arrivalPos="990.00" arrivalPosLat="0.00" arrivalSpeed="13.99" duration="188.00" routeLength="1996.47" waitingTime="24.00" waitingCount="2" stopTime="0.00" timeLoss="44.55" rerouteNo="1" devices="tripinfo_car_e2s_217 routing_car_e2s_217" vType="Car" speedFactor="1.01" vaporized=""/>
    <tripinfo id="car_w2n_251" depart="251.00" departLane="w2sep_1" departPos="3.60" departPosLat="0.00" departSpeed="13.90" departDelay="0.00" arrival="406.00" arrivalLane="c2n_1" arrivalPos="990.00" arrivalPosLat="0.00" arrivalSpeed="14.74" duration="155.00" routeLength="1996.47" waitingTime="0.00" waitingCount="0" stopTime="0.00" timeLoss="19.56" rerouteNo="1" devices="tripinfo_car_w2n_251 routing_car_w2n_251" vType="Car" speedFactor="1.07" vaporized=""/>
    <tripinfo id="car_w2e_276" depart="276.00" departLane="w2sep_1" departPos="3.60" departPosLat="0.00" departSpeed="13.90" departDelay="0.00" arrival="408.00" arrivalLane="c2e_1" arrivalPos="990.00" arrivalPosLat="0.00" arrivalSpeed="16.25" duration="132.00" routeLength="1997.01" waitingTime="0.00" waitingCount="0" stopTime="0.00" timeLoss="8.13" rerouteNo="1" devices="tripinfo_car_w2e_276 routing_car_w2e_276" vType="Car" speedFactor="1.17" vaporized=""/>
    <tripinfo id="car_w2s_263" depart="263.00" departLane="w2sep_1" departPos="3.60" departPosLat="0.00" departSpeed="13.90" departDelay="0.00" arrival="413.00" arrivalLane="c2s_1" arrivalPos="990.00" arrivalPosLat="0.00" arrivalSpeed="13.90" duration="150.00" routeLength="1986.69" waitingTime="0.00" waitingCount="0" stopTime="0.00" timeLoss="5.67" rerouteNo="1" devices="tripinfo_car_w2s_263 routing_car_w2s_263" vType="Car" speedFactor="1.00" vaporized=""/>
    <tripinfo id="car_w2s_265" depart="265.00" departLane="w2sep_1" departPos="3.60" departPosLat="0.00" departSpeed="13.90" departDelay="0.00" arrival="415.00" arrivalLane="c2s_1" arrivalPos="990.00" arrivalPosLat="0.00" arrivalSpeed="14.66" duration="150.00" routeLength="1986.69" waitingTime="0.00" waitingCount="0" stopTime="0.00" timeLoss="15.91" rerouteNo="1" devices="tripinfo_car_w2s_265 routing_car_w2s_265" vType="Car" speedFactor="1.07" vaporized=""/>
    <tripinfo id="car_e2s_263" depart="263.00" departLane="e2sep_1" departPos="3.60" departPosLat="0.00" departSpeed="13.90" departDelay="0.00" arrival="422.00" arrivalLane="c2s_1" arrivalPos="990.00" arrivalPosLat="0.00" arrivalSpeed="13.90" duration="159.00" routeLength="1996.47" waitingTime="4.00" waitingCount="1" stopTime="0.00" timeLoss="14.66" rerouteNo="1" devices="tripinfo_car_e2s_263 routing_car_e2s_263" vType="Car" speedFactor="1.00" vaporized=""/>
    <tripinfo id="car_e2s_284" depart="285.00" departLane="e2sep_1" departPos="3.60" departPosLat="0.00" departSpeed="13.90" departDelay="1.00" arrival="425.00" arrivalLane="c2s_1" arrivalPos="990.00" arrivalPosLat="0.00" arrivalSpeed="15.08" duration="140.00" routeLength="1996.47" waitingTime="0.00" waitingCount="0" stopTime="0.00" timeLoss="7.58" rerouteNo="1" devices="tripinfo_car_e2s_284 routing_car_e2s_284" vType="Car" speedFactor="1.10" vaporized=""/>
    <tripinfo id="car_e2s_287" depart="287.00" departLane="e2sep_1" departPos="3.60" departPosLat="0.00" departSpeed="13.90" departDelay="0.00" arrival="427.00" arrivalLane="c2s_1" arrivalPos="990.00" arrivalPosLat="0.00" arrivalSpeed="15.01" duration="140.00" routeLength="1996.47" waitingTime="0.00" waitingCount="0" stopTime="0.00" timeLoss="8.11" rerouteNo="1" devices="tripinfo_car_e2s_287 routing_car_e2s_287" vType="Car" speedFactor="1.10" vaporized=""/>
    <tripinfo id="car_s2e_247" depart="247.00" departLane="s2sep_1" departPos="3.60" departPosLat="0.00" departSpeed="13.90" departDelay="0.00" arrival="429.00" arrivalLane="c2e_1" arrivalPos="990.00" arrivalPosLat="0.00" arrivalSpeed="15.12" duration="182.00" routeLength="1986.69" waitingTime="39.00" waitingCount="1" stopTime="0.00" timeLoss="49.52" rerouteNo="1" devices="tripinfo_car_s2e_247 routing_car_s2e_247" vType="Car" speedFactor="1.09" vaporized=""/>
    <tripinfo id="car_s2e_250" depart="250.00" departLane="s2sep_1" departPos="3.60" departPosLat="0.00" departSpeed="13.90" departDelay="0.00" arrival="433.00" arrivalLane="c2e_1" arrivalPos="990.00" arrivalPosLat="0.00" arrivalSpeed="15.23" duration="183.00" routeLength="1986.69" waitingTime="37.00" waitingCount="1" stopTime="0.00" timeLoss="51.55" rerouteNo="1" devices="tripinfo_car_s2e_250 routing_car_s2e_250" vType="Car" speedFactor="1.10" vaporized=""/>
    <tripinfo id="car_s2w_265" depart="265.00" departLane="s2sep_1" departPos="3.60" departPosLat="0.00" departSpeed="13.90" departDelay="0.00" arrival="436.00" arrivalLane="c2w_1" arrivalPos="990.00" arrivalPosLat="0.00" arrivalSpeed="14.09" duration="171.00" routeLength="1996.47" waitingTime="17.00" waitingCount="1" stopTime="0.00" timeLoss="27.85" rerouteNo="1" devices="tripinfo_car_s2w_265 routing_car_s2w_265" vType="Car" speedFactor="1.01" vaporized=""/>
    <tripinfo id="car_s2n_273" depart="273.00" departLane="s2sep_1" departPos="3.60" departPosLat="0.00" departSpeed="13.90" departDelay="0.00" arrival="437.00" arrivalLane="c2n_1" arrivalPos="990.00" arrivalPosLat="0.00" arrivalSpeed="14.38" duration="164.00" routeLength="1997.01" waitingTime="13.00" waitingCount="1" stopTime="0.00" timeLoss="24.56" rerouteNo="1" devices="tripinfo_car_s2n_273 routing_car_s2n_273" vType="Car" speedFactor="1.03" vaporized=""/>
    <tripinfo id="car_s2w_274" depart="275.00" departLane="s2sep_1" departPos="3.60" departPosLat="0.00" departSpeed="13.90" departDelay="1.00" arrival="439.00" arrivalLane="c2w_1" arrivalPos="990.00" arrivalPosLat="0.00" arrivalSpeed="14.73" duration="164.00" routeLength="1996.47" waitingTime="11.00" waitingCount="1" stopTime="0.00" timeLoss="27.58" rerouteNo="1" devices="tripinfo_car_s2w_274 routing_car_s2w_274" vType="Car" speedFactor="1.06" vaporized=""/>
    <tripinfo id="car_s2n_275" depart="277.00" departLane="s2sep_1" departPos="3.60" departPosLat="0.00" departSpeed="13.90" departDelay="2.00" arrival="443.00" arrivalLane="c2n_1" arrivalPos="990.00" arrivalPosLat="0.00" arrivalSpeed="13.90" duration="166.00" routeLength="1997.01" waitingTime="7.00" waitingCount="1" stopTime="0.00" timeLoss="21.68" rerouteNo="1" devices="tripinfo_car_s2n_275 routing_car_s2n_275" vType="Car" speedFactor="1.00" vaporized=""/>
    <tripinfo id="car_s2w_280" depart="280.00" departLane="s2sep_1" departPos="3.60" departPosLat="0.00" departSpeed="13.90" departDelay="0.00" arrival="443.00" arrivalLane="c2w_1" arrivalPos="990.00" arrivalPosLat="0.00" arrivalSpeed="14.12" duration="163.00" routeLength="1996.47" waitingTime="4.00" waitingCount="1" stopTime="0.00" timeLoss="20.75" rerouteNo="1" devices="tripinfo_car_s2w_280 routing_car_s2w_280" vType="Car" speedFactor="1.02" vaporized=""/>
    <tripinfo id="car_n2s_318" depart="318.00" departLane="n2sep_1" departPos="3.60" departPosLat="0.00" departSpeed="13.90" departDelay="0.00" arrival="443.00" arrivalLane="c2s_1" arrivalPos="990.00" arrivalPosLat="0.00" arrivalSpeed="16.02" duration="125.00" routeLength="1997.01" waitingTime="0.00" waitingCount="0" stopTime="0.00" timeLoss="0.37" rerouteNo="1" devices="tripinfo_car_n2s_318 routing_car_n2s_318" vType="Car" speedFactor="1.15" vaporized=""/>
    <tripinfo id="car_n2e_253" depart="253.00" departLane="n2sep_1" departPos="3.60" departPosLat="0.00" departSpeed="13.90" departDelay="0.00" arrival="444.00" arrivalLane="c2e_1" arrivalPos="990.00" arrivalPosLat="0.00" arrivalSpeed="13.90" duration="191.00" routeLength="1996.47" waitingTime="31.00" waitingCount="2" stopTime="0.00" timeLoss="46.47" rerouteNo="1" devices="tripinfo_car_n2e_253 routing_car_n2e_253" vType="Car" speedFactor="1.00" vaporized=""/>
    <tripinfo id="car_s2n_310" depart="310.00" departLane="s2sep_1" departPos="3.60" departPosLat="0.00" departSpeed="13.90" departDelay="0.00" arrival="445.00" arrivalLane="c2n_1" arrivalPos="990.00" arrivalPosLat="0.00" arrivalSpeed="14.98" duration="135.00" routeLength="1997.01" waitingTime="0.00" waitingCount="0" stopTime="0.00" timeLoss="4.39" rerouteNo="1" devices="tripinfo_car_s2n_310 routing_car_s2n_310" vType="Car" speedFactor="1.10" vaporized=""/>
    <tripinfo id="car_s2w_304" depart="304.00" departLane="s2sep_1" departPos="3.60" departPosLat="0.00" departSpeed="13.90" departDelay="0.00" arrival="455.00" arrivalLane="c2w_1" arrivalPos="990.00" arrivalPosLat="0.00" arrivalSpeed="13.90" duration="151.00" routeLength="1996.47" waitingTime="0.00" waitingCount="0" stopTime="0.00" timeLoss="6.08" rerouteNo="1" devices="tripinfo_car_s2w_304 routing_car_s2w_304" vType="Car" speedFactor="1.00" vaporized=""/>
    <tripinfo id="car_s2e_319" depart="319.00" departLane="s2sep_1" departPos="3.60" departPosLat="0.00" departSpeed="13.90" departDelay="0.00" arrival="464.00" arrivalLane="c2e_1" arrivalPos="990.00" arrivalPosLat="0.00" arrivalSpeed="14.35" duration="145.00" routeLength="1986.69" waitingTime="0.00" waitingCount="0" stopTime="0.00" timeLoss="5.36" rerouteNo="1" devices="tripinfo_car_s2e_319 routing_car_s2e_319" vType="Car" speedFactor="1.03" vaporized=""/>
    <tripinfo id="car_e2w_295" depart="295.00" departLane="e2sep_1" departPos="3.60" departPosLat="0.00" departSpeed="13.90" departDelay="0.00" arrival="471.00" arrivalLane="c2w_1" arrivalPos="990.00" arrivalPosLat="0.00" arrivalSpeed="16.36" duration="176.00" routeLength="1997.01" waitingTime="42.00" waitingCount="1" stopTime="0.00" timeLoss="53.85" rerouteNo="1" devices="tripinfo_car_e2w_295 routing_car_e2w_295" vType="Car" speedFactor="1.18" vaporized=""/>
    <tripinfo id="car_w2e_283" depart="283.00" departLane="w2sep_1" departPos="3.60" departPosLat="0.00" departSpeed="13.90" departDelay="0.00" arrival="474.00" arrivalLane="c2e_1" arrivalPos="990.00" arrivalPosLat="0.00" arrivalSpeed="15.27" duration="191.00" routeLength="1997.01" waitingTime="49.00" waitingCount="1" stopTime="0.00" timeLoss="59.42" rerouteNo="1" devices="tripinfo_car_w2e_283 routing_car_w2e_283" vType="Car" speedFactor="1.10" vaporized=""/>
    <tripinfo id="car_e2n_283" depart="283.00" departLane="e2sep_1" departPos="3.60" departPosLat="0.00" departSpeed="13.90" departDelay="0.00" arrival="479.00" arrivalLane="c2n_1" arrivalPos="990.00" arrivalPosLat="0.00" arrivalSpeed="14.03" duration="196.00" routeLength="1986.69" waitingTime="43.00" waitingCount="1" stopTime="0.00" timeLoss="53.17" rerouteNo="1" devices="tripinfo_car_e2n_283 routing_car_e2n_283" vType="Car" speedFactor="1.01" vaporized=""/>
    <tripinfo id="car_w2e_297" depart="299.00" departLane="w2sep_1" departPos="3.60" departPosLat="0.00" departSpeed="13.90" departDelay="2.00" arrival="482.00" arrivalLane="c2e_1" arrivalPos="990.00" arrivalPosLat="0.00" arrivalSpeed="13.94" duration="183.00" routeLength="1997.01" waitingTime="28.00" waitingCount="1" stopTime="0.00" timeLoss="39.77" rerouteNo="1" devices="tripinfo_car_w2e_297 routing_car_w2e_297" vType="Car" speedFactor="1.00" vaporized=""/>
    <tripinfo id="car_e2w_314" depart="314.00" departLane="e2sep_1" departPos="3.60" departPosLat="0.00" departSpeed="13.90" departDelay="0.00" arrival="482.00" arrivalLane="c2w_1" arrivalPos="990.00" arrivalPosLat="0.00" arrivalSpeed="14.34" duration="168.00" routeLength="1997.01" waitingTime="17.00" waitingCount="1" stopTime="0.00" timeLoss="28.48" rerouteNo="1" devices="tripinfo_car_e2w_314 routing_car_e2w_314" vType="Car" speedFactor="1.03" vaporized=""/>
    <tripinfo id="car_w2s_316" depart="318.00" departLane="w2sep_1" departPos="3.60" departPosLat="0.00" departSpeed="13.90" departDelay="2.00" arrival="483.00" arrivalLane="c2s_1" arrivalPos="990.00" arrivalPosLat="0.00" arrivalSpeed="14.75" duration="165.00" routeLength="1986.69" waitingTime="13.00" waitingCount="1" stopTime="0.00" timeLoss="29.44" rerouteNo="1" devices="tripinfo_car_w2s_316 routing_car_w2s_316" vType="Car" speedFactor="1.06" vaporized=""/>
    <tripinfo id="car_e2w_323" depart="323.00" departLane="e2sep_1" departPos="3.60" departPosLat="0.00" departSpeed="13.90" departDelay="0.00" arrival="485.00" arrivalLane="c2w_1" arrivalPos="990.00" arrivalPosLat="0.00" arrivalSpeed="15.39" duration="162.00" routeLength="1997.01" waitingTime="14.00" waitingCount="1" stopTime="0.00" timeLoss="32.67" rerouteNo="1" devices="tripinfo_car_e2w_323 routing_car_e2w_323" vType="Car" speedFactor="1.12" vaporized=""/>
    <tripinfo id="car_w2e_316" depart="316.00" departLane="w2sep_1" departPos="3.60" departPosLat="0.00" departSpeed="13.90" departDelay="0.00" arrival="486.00" arrivalLane="c2e_1" arrivalPos="990.00" arrivalPosLat="0.00" arrivalSpeed="14.21" duration="170.00" routeLength="1997.01" waitingTime="14.00" waitingCount="1" stopTime="0.00" timeLoss="29.06" rerouteNo="1" devices="tripinfo_car_w2e_316 routing_car_w2e_316" vType="Car" speedFactor="1.02" vaporized=""/>
    <tripinfo id="car_w2n_297" depart="297.00" departLane="w2sep_1" departPos="3.60" departPosLat="0.00" departSpeed="13.90" departDelay="0.00" arrival="489.00" arrivalLane="c2n_1" arrivalPos="990.00" arrivalPosLat="0.00" arrivalSpeed="13.96" duration="192.00" routeLength="1996.47" waitingTime="32.00" waitingCount="2" stopTime="0.00" timeLoss="47.80" rerouteNo="1" devices="tripinfo_car_w2n_297 routing_car_w2n_297" vType="Car" speedFactor="1.00" vaporized=""/>
    <tripinfo id="car_w2e_322" depart="322.00" departLane="w2sep_1" departPos="3.60" departPosLat="0.00" departSpeed="13.90" departDelay="0.00" arrival="491.00" arrivalLane="c2e_1" arrivalPos="990.00" arrivalPosLat="0.00" arrivalSpeed="13.90" duration="169.00" routeLength="1997.01" waitingTime="9.00" waitingCount="1" stopTime="0.00" timeLoss="24.45" rerouteNo="1" devices="tripinfo_car_w2e_322 routing_car_w2e_322" vType="Car" speedFactor="1.00" vaporized=""/>
    <tripinfo id="car_w2n_329" depart="329.00" departLane="w2sep_1" departPos="3.60" departPosLat="0.00" departSpeed="13.90" departDelay="0.00" arrival="493.00" arrivalLane="c2n_1" arrivalPos="990.00" arrivalPosLat="0.00" arrivalSpeed="14.83" duration="164.00" routeLength="1996.47" waitingTime="4.00" waitingCount="2" stopTime="0.00" timeLoss="28.17" rerouteNo="1" devices="tripinfo_car_w2n_329 routing_car_w2n_329" vType="Car" speedFactor="1.07" vaporized=""/>
    <tripinfo id="car_w2e_325" depart="325.00" departLane="w2sep_1" departPos="3.60" departPosLat="0.00" departSpeed="13.90" departDelay="0.00" arrival="494.00" arrivalLane="c2e_1" arrivalPos="990.00" arrivalPosLat="0.00" arrivalSpeed="13.98" duration="169.00" routeLength="1997.01" waitingTime="7.00" waitingCount="1" stopTime="0.00" timeLoss="26.13" rerouteNo="1" devices="tripinfo_car_w2e_325 routing_car_w2e_325" vType="Car" speedFactor="1.01" vaporized=""/>
    <tripinfo id="bus_e2w_349" depart="349.00" departLane="e2sep_1" departPos="12.10" departPosLat="0.00" departSpeed="13.90" departDelay="0.00" arrival="494.00" arrivalLane="c2w_1" arrivalPos="990.00" arrivalPosLat="0.00" arrivalSpeed="13.90" duration="145.00" routeLength="1988.51" waitingTime="0.00" waitingCount="0" stopTime="0.00" timeLoss="1.23" rerouteNo="1" devices="tripinfo_bus_e2w_349 routing_bus_e2w_349" vType="Bus" speedFactor="1.00" vaporized=""/>
    <tripinfo id="bus_w2s_346" depart="346.00" departLane="w2sep_1" departPos="12.10" departPosLat="0.00" departSpeed="13.90" departDelay="0.00" arrival="497.00" arrivalLane="c2s_1" arrivalPos="990.00" arrivalPosLat="0.00" arrivalSpeed="13.90" duration="151.00" routeLength="1978.19" waitingTime="0.00" waitingCount="0" stopTime="0.00" timeLoss="7.79" rerouteNo="1" devices="tripinfo_bus_w2s_346 routing_bus_w2s_346" vType="Bus" speedFactor="1.00" vaporized=""/>
    <tripinfo id="car_e2s_304" depart="304.00" departLane="e2sep_1" departPos="3.60" departPosLat="0.00" departSpeed="13.90" departDelay="0.00" arrival="500.00" arrivalLane="c2s_1" arrivalPos="990.00" arrivalPosLat="0.00" arrivalSpeed="14.77" duration="196.00" routeLength="1996.47" waitingTime="39.00" waitingCount="2" stopTime="0.00" timeLoss="61.13" rerouteNo="1" devices="tripinfo_car_e2s_304 routing_car_e2s_304" vType="Car" speedFactor="1.07" vaporized=""/>
    <tripinfo id="car_e2s_344" depart="344.00" departLane="e2sep_1" departPos="3.60" departPosLat="0.00" departSpeed="13.90" departDelay="0.00" arrival="502.00" arrivalLane="c2s_1" arrivalPos="990.00" arrivalPosLat="0.00" arrivalSpeed="15.17" duration="158.00" routeLength="1996.47" waitingTime="9.00" waitingCount="1" stopTime="0.00" timeLoss="29.08" rerouteNo="1" devices="tripinfo_car_e2s_344 routing_car_e2s_344" vType="Car" speedFactor="1.12" vaporized=""/>
    <tripinfo id="car_w2n_367" depart="367.00" departLane="w2sep_1" departPos="3.60" departPosLat="0.00" departSpeed="13.90" departDelay="0.00" arrival="503.00" arrivalLane="c2n_1" arrivalPos="990.00" arrivalPosLat="0.00" arrivalSpeed="15.48" duration="136.00" routeLength="1996.47" waitingTime="0.00" waitingCount="0" stopTime="0.00" timeLoss="5.52" rerouteNo="1" devices="tripinfo_car_w2n_367 routing_car_w2n_367" vType="Car" speedFactor="1.11" vaporized=""/>
    <tripinfo id="car_e2w_363" depart="363.00" departLane="e2sep_1" departPos="3.60" departPosLat="0.00" departSpeed="13.90" departDelay="0.00" arrival="504.00" arrivalLane="c2w_1" arrivalPos="990.00" arrivalPosLat="0.00" arrivalSpeed="14.23" duration="141.00" routeLength="1997.01" waitingTime="0.00" waitingCount="0" stopTime="0.00" timeLoss="0.45" rerouteNo="1" devices="tripinfo_car_e2w_363 routing_car_e2w_363" vType="Car" speedFactor="1.02" vaporized=""/>
    <tripinfo id="car_w2e_377" depart="377.00" departLane="w2sep_1" departPos="3.60" departPosLat="0.00" departSpeed="13.90" departDelay="0.00" arrival="505.00" arrivalLane="c2e_1" arrivalPos="990.00" arrivalPosLat="0.00" arrivalSpeed="15.69" duration="128.00" routeLength="1997.01" waitingTime="0.00" waitingCount="0" stopTime="0.00" timeLoss="0.42" rerouteNo="1" devices="tripinfo_car_w2e_377 routing_car_w2e_377" vType="Car" speedFactor="1.13" vaporized=""/>
    <tripinfo id="car_w2e_380" depart="380.00" departLane="w2sep_1" departPos="3.60" departPosLat="0.00" departSpeed="13.90" departDelay="0.00" arrival="515.00" arrivalLane="c2e_1" arrivalPos="990.00" arrivalPosLat="1.00" arrivalSpeed="15.05" duration="135.00" routeLength="1997.01" waitingTime="0.00" waitingCount="0" stopTime="0.00" timeLoss="1.29" rerouteNo="1" devices="tripinfo_car_w2e_380 routing_car_w2e_380" vType="Car" speedFactor="1.08" vaporized=""/>
    <tripinfo id="amb_w2e_390" depart="390.00" departLane="w2sep_1" departPos="6.60" departPosLat="0.00" departSpeed="13.90" departDelay="0.00" arrival="516.00" arrivalLane="c2e_1" arrivalPos="990.00" arrivalPosLat="0.00" arrivalSpeed="16.80" duration="126.00" routeLength="1994.01" waitingTime="0.00" waitingCount="0" stopTime="0.00" timeLoss="30.00" rerouteNo="1" devices="tripinfo_amb_w2e_390 routing_amb_w2e_390 bluelight_amb_w2e_390" vType="Ambulance" speedFactor="1.50" vaporized="">
        <bluelight/>
    </tripinfo>
    <tripinfo id="car_w2n_395" depart="395.00" departLane="w2sep_1" departPos="3.60" departPosLat="0.00" departSpeed="13.90" departDelay="0.00" arrival="527.00" arrivalLane="c2n_1" arrivalPos="990.00" arrivalPosLat="0.00" arrivalSpeed="15.62" duration="132.00" routeLength="1996.47" waitingTime="0.00" waitingCount="0" stopTime="0.00" timeLoss="2.93" rerouteNo="1" devices="tripinfo_car_w2n_395 routing_car_w2n_395" vType="Car" speedFactor="1.12" vaporized=""/>
    <tripinfo id="car_s2e_343" depart="343.00" departLane="s2sep_1" departPos="3.60" departPosLat="0.00" departSpeed="13.90" departDelay="0.00" arrival="531.00" arrivalLane="c2e_1" arrivalPos="990.00" arrivalPosLat="0.00" arrivalSpeed="17.04" duration="188.00" routeLength="1986.69" waitingTime="49.00" waitingCount="1" stopTime="0.00" timeLoss="69.89" rerouteNo="1" devices="tripinfo_car_s2e_343 routing_car_s2e_343" vType="Car" speedFactor="1.23" vaporized=""/>
    <tripinfo id="car_e2s_376" depart="376.00" departLane="e2sep_1" departPos="3.60" departPosLat="0.00" departSpeed="13.90" departDelay="0.00" arrival="531.00" arrivalLane="c2s_1" arrivalPos="990.00" arrivalPosLat="0.00" arrivalSpeed="13.90" duration="155.00" routeLength="1996.47" waitingTime="0.00" waitingCount="0" stopTime="0.00" timeLoss="9.83" rerouteNo="1" devices="tripinfo_car_e2s_376 routing_car_e2s_376" vType="Car" speedFactor="1.00" vaporized=""/>
    <tripinfo id="car_e2s_393" depart="393.00" departLane="e2sep_1" departPos="3.60" departPosLat="0.00" departSpeed="13.90" departDelay="0.00" arrival="534.00" arrivalLane="c2s_1" arrivalPos="990.00" arrivalPosLat="0.00" arrivalSpeed="14.72" duration="141.00" routeLength="1996.47" waitingTime="0.00" waitingCount="0" stopTime="0.00" timeLoss="4.66" rerouteNo="1" devices="tripinfo_car_e2s_393 routing_car_e2s_393" vType="Car" speedFactor="1.06" vaporized=""/>
    <tripinfo id="car_s2n_340" depart="340.00" departLane="s2sep_1" departPos="3.60" departPosLat="0.00" departSpeed="13.90" departDelay="0.00" arrival="538.00" arrivalLane="c2n_1" arrivalPos="990.00" arrivalPosLat="0.00" arrivalSpeed="14.42" duration="198.00" routeLength="1997.01" waitingTime="49.00" waitingCount="1" stopTime="0.00" timeLoss="59.43" rerouteNo="1" devices="tripinfo_car_s2n_340 routing_car_s2n_340" vType="Car" speedFactor="1.04" vaporized=""/>
    <tripinfo id="car_n2s_327" depart="327.00" departLane="n2sep_1" departPos="3.60" departPosLat="0.00" departSpeed="13.90" departDelay="0.00" arrival="539.00" arrivalLane="c2s_1" arrivalPos="990.00" arrivalPosLat="0.00" arrivalSpeed="14.35" duration="212.00" routeLength="1997.01" waitingTime="62.00" waitingCount="1" stopTime="0.00" timeLoss="72.68" rerouteNo="1" devices="tripinfo_car_n2s_327 routing_car_n2s_327" vType="Car" speedFactor="1.03" vaporized=""/>
    <tripinfo id="car_n2s_338" depart="338.00" departLane="n2sep_1" departPos="3.60" departPosLat="0.00" departSpeed="13.90" departDelay="0.00" arrival="541.00" arrivalLane="c2s_1" arrivalPos="990.00" arrivalPosLat="0.00" arrivalSpeed="15.43" duration="203.00" routeLength="1997.01" waitingTime="58.00" waitingCount="1" stopTime="0.00" timeLoss="77.20" rerouteNo="1" devices="tripinfo_car_n2s_338 routing_car_n2s_338" vType="Car" speedFactor="1.14" vaporized=""/>
    <tripinfo id="car_s2e_380" depart="380.00" departLane="s2sep_1" departPos="3.60" departPosLat="0.00" departSpeed="13.90" departDelay="0.00" arrival="542.00" arrivalLane="c2e_1" arrivalPos="990.00" arrivalPosLat="0.00" arrivalSpeed="15.86" duration="162.00" routeLength="1986.69" waitingTime="20.00" waitingCount="1" stopTime="0.00" timeLoss="35.38" rerouteNo="1" devices="tripinfo_car_s2e_380 routing_car_s2e_380" vType="Car" speedFactor="1.14" vaporized=""/>
    <tripinfo id="car_s2n_348" depart="348.00" departLane="s2sep_1" departPos="3.60" departPosLat="0.00" departSpeed="13.90" departDelay="0.00" arrival="545.00" arrivalLane="c2n_1" arrivalPos="990.00" arrivalPosLat="0.00" arrivalSpeed="14.11" duration="197.00" routeLength="1997.01" waitingTime="42.00" waitingCount="1" stopTime="0.00" timeLoss="54.90" rerouteNo="1" devices="tripinfo_car_s2n_348 routing_car_s2n_348" vType="Car" speedFactor="1.02" vaporized=""/>
    <tripinfo id="car_n2s_344" depart="344.00" departLane="n2sep_1" departPos="3.60" departPosLat="0.00" departSpeed="13.90" departDelay="0.00" arrival="546.00" arrivalLane="c2s_1" arrivalPos="990.00" arrivalPosLat="0.00" arrivalSpeed="14.06" duration="202.00" routeLength="1997.01" waitingTime="46.00" waitingCount="1" stopTime="0.00" timeLoss="59.76" rerouteNo="1" devices="tripinfo_car_n2s_344 routing_car_n2s_344" vType="Car" speedFactor="1.01" vaporized=""/>
    <tripinfo id="car_s2n_368" depart="368.00" departLane="s2sep_1" departPos="3.60" departPosLat="0.00" departSpeed="13.90" departDelay="0.00" arrival="547.00" arrivalLane="c2n_1" arrivalPos="990.00" arrivalPosLat="0.00" arrivalSpeed="15.56" duration="179.00" routeLength="1997.01" waitingTime="32.00" waitingCount="1" stopTime="0.00" timeLoss="54.99" rerouteNo="1" devices="tripinfo_car_s2n_368 routing_car_s2n_368" vType="Car" speedFactor="1.16" vaporized=""/>
    <tripinfo id="car_n2w_352" depart="352.00" departLane="n2sep_1" departPos="3.60" departPosLat="0.00" departSpeed="13.90" departDelay="0.00" arrival="548.00" arrivalLane="c2w_1" arrivalPos="990.00" arrivalPosLat="0.00" arrivalSpeed="13.95" duration="196.00" routeLength="1986.69" waitingTime="39.00" waitingCount="1" stopTime="0.00" timeLoss="52.50" rerouteNo="1" devices="tripinfo_car_n2w_352 routing_car_n2w_352" vType="Car" speedFactor="1.00" vaporized=""/>
    <tripinfo id="car_n2s_404" depart="404.00" departLane="n2sep_1" departPos="3.60" departPosLat="0.00" departSpeed="13.90" departDelay="0.00" arrival="550.00" arrivalLane="c2s_1" arrivalPos="990.00" arrivalPosLat="0.00" arrivalSpeed="15.63" duration="146.00" routeLength="1997.01" waitingTime="0.00" waitingCount="0" stopTime="0.00" timeLoss="17.68" rerouteNo="1" devices="tripinfo_car_n2s_404 routing_car_n2s_404" vType="Car" speedFactor="1.13" vaporized=""/>
    <tripinfo id="car_n2w_387" depart="388.00" departLane="n2sep_1" departPos="3.60" departPosLat="0.00" departSpeed="13.90" departDelay="1.00" arrival="551.00" arrivalLane="c2w_1" arrivalPos="990.00" arrivalPosLat="0.00" arrivalSpeed="14.40" duration="163.00" routeLength="1986.69" waitingTime="6.00" waitingCount="1" stopTime="0.00" timeLoss="24.80" rerouteNo="1" devices="tripinfo_car_n2w_387 routing_car_n2w_387" vType="Car" speedFactor="1.04" vaporized=""/>
    <tripinfo id="car_s2n_385" depart="386.00" departLane="s2sep_1" departPos="3.60" departPosLat="0.00" departSpeed="13.90" departDelay="1.00" arrival="553.00" arrivalLane="c2n_1" arrivalPos="990.00" arrivalPosLat="0.00" arrivalSpeed="13.93" duration="167.00" routeLength="1997.01" waitingTime="8.00" waitingCount="1" stopTime="0.00" timeLoss="23.01" rerouteNo="1" devices="tripinfo_car_s2n_385 routing_car_s2n_385" vType="Car" speedFactor="1.00" vaporized=""/>
    <tripinfo id="car_n2w_401" depart="401.00" departLane="n2sep_1" departPos="3.60" departPosLat="0.00" departSpeed="13.90" departDelay="0.00" arrival="554.00" arrivalLane="c2w_1" arrivalPos="990.00" arrivalPosLat="0.00" arrivalSpeed="14.87" duration="153.00" routeLength="1986.69" waitingTime="0.00" waitingCount="0" stopTime="0.00" timeLoss="18.93" rerouteNo="1" devices="tripinfo_car_n2w_401 routing_car_n2w_401" vType="Car" speedFactor="1.08" vaporized=""/>
    <tripinfo id="car_s2w_384" depart="384.00" departLane="s2sep_1" departPos="3.60" departPosLat="0.00" departSpeed="13.90" departDelay="0.00" arrival="556.00" arrivalLane="c2w_1" arrivalPos="990.00" arrivalPosLat="0.00" arrivalSpeed="15.21" duration="172.00" routeLength="1996.47" waitingTime="22.00" waitingCount="2" stopTime="0.00" timeLoss="42.70" rerouteNo="1" devices="tripinfo_car_s2w_384 routing_car_s2w_384" vType="Car" speedFactor="1.12" vaporized=""/>
    <tripinfo id="car_s2n_395" depart="395.00" departLane="s2sep_1" departPos="3.60" departPosLat="0.00" departSpeed="13.90" departDelay="0.00" arrival="557.00" arrivalLane="c2n_1" arrivalPos="990.00" arrivalPosLat="0.00" arrivalSpeed="13.89" duration="162.00" routeLength="1997.01" waitingTime="0.00" waitingCount="0" stopTime="0.00" timeLoss="17.76" rerouteNo="1" devices="tripinfo_car_s2n_395 routing_car_s2n_395" vType="Car" speedFactor="1.00" vaporized=""/>
    <tripinfo id="car_s2n_396" depart="397.00" departLane="s2sep_1" departPos="3.60" departPosLat="0.00" departSpeed="13.90" departDelay="1.00" arrival="559.00" arrivalLane="c2n_1" arrivalPos="990.00" arrivalPosLat="0.00" arrivalSpeed="15.25" duration="162.00" routeLength="1997.01" waitingTime="0.00" waitingCount="0" stopTime="0.00" timeLoss="35.57" rerouteNo="1" devices="tripinfo_car_s2n_396 routing_car_s2n_396" vType="Car" speedFactor="1.14" vaporized=""/>
    <tripinfo id="car_n2s_418" depart="418.00" departLane="n2sep_1" departPos="3.60" departPosLat="0.00" departSpeed="13.90" departDelay="0.00" arrival="560.00" arrivalLane="c2s_1" arrivalPos="990.00" arrivalPosLat="0.00" arrivalSpeed="14.31" duration="142.00" routeLength="1997.01" waitingTime="0.00" waitingCount="0" stopTime="0.00" timeLoss="1.55" rerouteNo="1" devices="tripinfo_car_n2s_418 routing_car_n2s_418" vType="Car" speedFactor="1.03" vaporized=""/>
    <tripinfo id="car_s2n_409" depart="409.00" departLane="s2sep_1" departPos="3.60" departPosLat="0.00" departSpeed="13.90" departDelay="0.00" arrival="562.00" arrivalLane="c2n_1" arrivalPos="990.00" arrivalPosLat="0.00" arrivalSpeed="13.86" duration="153.00" routeLength="1997.01" waitingTime="0.00" waitingCount="0" stopTime="0.00" timeLoss="9.13" rerouteNo="1" devices="tripinfo_car_s2n_409 routing_car_s2n_409" vType="Car" speedFactor="1.00" vaporized=""/>
    <tripinfo id="car_s2e_412" depart="412.00" departLane="s2sep_1" departPos="3.60" departPosLat="0.00" departSpeed="13.90" departDelay="0.00" arrival="562.00" arrivalLane="c2e_1" arrivalPos="990.00" arrivalPosLat="0.00" arrivalSpeed="13.96" duration="150.00" routeLength="1986.69" waitingTime="0.00" waitingCount="0" stopTime="0.00" timeLoss="6.48" rerouteNo="1" devices="tripinfo_car_s2e_412 routing_car_s2e_412" vType="Car" speedFactor="1.00" vaporized=""/>
    <tripinfo id="car_s2w_388" depart="388.00" departLane="s2sep_1" departPos="3.60" departPosLat="0.00" departSpeed="13.90" departDelay="0.00" arrival="564.00" arrivalLane="c2w_1" arrivalPos="990.00" arrivalPosLat="0.00" arrivalSpeed="13.90" duration="176.00" routeLength="1996.47" waitingTime="11.00" waitingCount="1" stopTime="0.00" timeLoss="31.48" rerouteNo="1" devices="tripinfo_car_s2w_388 routing_car_s2w_388" vType="Car" speedFactor="1.00" vaporized=""/>
</tripinfos>
