<?xml version="1.0" encoding="UTF-8" standalone="no"?>
<!-- Created with Inkscape (http://www.inkscape.org/) -->

<svg
   xmlns:dc="http://purl.org/dc/elements/1.1/"
   xmlns:cc="http://creativecommons.org/ns#"
   xmlns:rdf="http://www.w3.org/1999/02/22-rdf-syntax-ns#"
   xmlns:svg="http://www.w3.org/2000/svg"
   xmlns="http://www.w3.org/2000/svg"
   xmlns:sodipodi="http://sodipodi.sourceforge.net/DTD/sodipodi-0.dtd"
   xmlns:inkscape="http://www.inkscape.org/namespaces/inkscape"
   width="146.08987mm"
   height="54.291435mm"
   viewBox="0 0 146.08987 54.291435"
   version="1.1"
   id="svg11364"
   inkscape:version="0.92.5 (2060ec1f9f, 2020-04-08)"
   sodipodi:docname="distance_based3.svg">
  <defs
     id="defs11358">
    <clipPath
       id="clip1-6">
      <path
         inkscape:connector-curvature="0"
         id="path834-9"
         d="M 0,0 H 806.13672 V 400 H 0 Z m 0,0" />
    </clipPath>
    <clipPath
       id="clip2-8">
      <path
         inkscape:connector-curvature="0"
         id="path837-7"
         d="M 577,319 H 735 V 476.95703 H 577 Z m 0,0" />
    </clipPath>
    <clipPath
       id="clip1-6-0">
      <path
         inkscape:connector-curvature="0"
         id="path834-9-9"
         d="M 0,0 H 806.13672 V 400 H 0 Z m 0,0" />
    </clipPath>
    <clipPath
       id="clip2-8-7">
      <path
         inkscape:connector-curvature="0"
         id="path837-7-5"
         d="M 577,319 H 735 V 476.95703 H 577 Z m 0,0" />
    </clipPath>
  </defs>
  <sodipodi:namedview
     id="base"
     pagecolor="#ffffff"
     bordercolor="#666666"
     borderopacity="1.0"
     inkscape:pageopacity="0.0"
     inkscape:pageshadow="2"
     inkscape:zoom="0.98994949"
     inkscape:cx="137.64578"
     inkscape:cy="180.42446"
     inkscape:document-units="mm"
     inkscape:current-layer="layer1"
     showgrid="false"
     inkscape:window-width="1920"
     inkscape:window-height="1016"
     inkscape:window-x="0"
     inkscape:window-y="27"
     inkscape:window-maximized="1" />
  <metadata
     id="metadata11361">
    <rdf:RDF>
      <cc:Work
         rdf:about="">
        <dc:format>image/svg+xml</dc:format>
        <dc:type
           rdf:resource="http://purl.org/dc/dcmitype/StillImage" />
        <dc:title />
      </cc:Work>
    </rdf:RDF>
  </metadata>
  <g
     inkscape:label="Layer 1"
     inkscape:groupmode="layer"
     id="layer1"
     transform="translate(-30.044558,-106.28077)">
    <g
       transform="translate(9.7876588,90.879193)"
       id="g12586">
      <g
         transform="matrix(-0.02984598,0,0,0.02984598,46.018938,43.162062)"
         id="surface9143-28">
        <g
           style="clip-rule:nonzero"
           clip-path="url(#clip1-6-0)"
           id="g844-2">
          <path
             inkscape:connector-curvature="0"
             style="fill:#000000;fill-opacity:1;fill-rule:nonzero;stroke:none"
             d="m 19.378906,287.21484 c -0.582031,3.94922 -0.359375,25.14453 0.261719,26.78907 0.359375,0.0351 0.75,0.10937 1.140625,0.10937 15.5,0.008 30.996094,0.0117 46.496094,0.004 1.992187,-0.004 2.410156,-0.34375 2.402344,-2.3711 -0.01953,-4.72656 -0.53125,-9.38672 -2.296876,-13.82812 -1.355468,-3.41016 -3.410156,-6.125 -7.140624,-7.19141 -0.992188,-0.28125 -1.953126,-0.6875 -2.953126,-0.9375 -7.777343,-1.9375 -15.746093,-2.25 -23.691406,-2.66015 -3.90625,-0.19922 -7.828125,-0.0391 -11.742187,-0.0274 -0.78125,0 -1.566407,0.0703 -2.476563,0.11328 m 780.480464,59.12891 c 0.55469,-2.72656 0.45313,-39.32031 -0.14062,-41.35547 h -34.14844 c -0.55859,0 -1.125,-0.0391 -1.67969,0.0195 -3.19921,0.33594 -5.49609,2.73438 -5.50781,5.875 -0.0273,9.91406 -0.004,19.82422 -0.0117,29.73828 0,1.92188 0.86719,3.36719 2.37891,4.45703 1.40625,1.01172 2.98828,1.41407 4.73437,1.41016 10.79297,-0.0273 21.58204,-0.0117 32.375,-0.0195 0.62891,0 1.25391,-0.0781 2,-0.125 M 225.23828,177.5 c 0.0547,-5.50391 -0.41797,-10.40625 -2.21094,-15.09375 -1.01172,-2.64453 -2.48437,-4.79688 -5.66797,-5.125 -2.29296,-0.23828 -4.55859,-0.75 -6.85156,-0.93359 -3.33203,-0.26563 -6.67969,-0.5 -10.01562,-0.46485 -2.85157,0.0312 -5.69532,0.51953 -8.55078,0.69922 -3.61329,0.22656 -6.86719,1.42188 -9.76954,3.52344 -2.57812,1.86719 -5.09375,3.82812 -7.58593,5.8164 -4.36328,3.48438 -7.87891,7.66016 -10.20313,12.77735 -2.22656,4.89844 -0.97656,9.24219 3.70703,11.82031 2.28516,1.25781 4.75391,2.38672 7.28125,2.96484 4.87891,1.11329 9.83985,1.92969 14.80469,2.60547 2.98828,0.40625 6.05078,0.47266 9.07031,0.40235 3.65625,-0.082 7.31641,-0.36719 10.95703,-0.75391 3.64063,-0.38672 7.27735,-0.86719 10.74219,-2.21875 1.58985,-0.61719 2.41406,-1.64062 2.75391,-3.28516 0.91406,-4.375 1.73047,-8.75781 1.53906,-12.73437 m 293.10938,9.53125 h 176.87109 c 0.64062,0 1.28125,0.0352 1.91797,-0.0117 1.78125,-0.13281 2.62109,-1.00781 2.67187,-2.72656 0.0469,-1.61328 -0.8789,-2.74219 -2.48047,-2.95703 -0.55078,-0.0742 -1.11718,-0.0234 -1.67578,-0.0234 -118.15625,0 -236.30859,0 -354.46093,0 -0.5625,0 -1.12891,-0.0469 -1.67969,0.0273 -1.46094,0.19922 -2.53125,1.54297 -2.48047,3.03125 0.0547,1.55078 0.92578,2.48828 2.52734,2.64063 0.63282,0.0625 1.27735,0.0195 1.91797,0.0195 58.95703,0 117.91406,0 176.8711,0 m 3.54296,-115.667969 c -53.51953,0 -107.03515,0 -160.55468,0 -0.80078,0 -1.60547,-0.04687 -2.39844,0.03516 -1.84766,0.191406 -2.57422,1.042968 -2.51172,2.824218 0.0625,1.800782 0.83594,2.660156 2.59766,2.800782 0.79297,0.06641 1.59765,0.02344 2.39843,0.02344 105.9961,0.0039 211.9961,0.0039 317.99219,0.0039 0.5625,0 1.125,0.04297 1.67969,-0.0078 1.22266,-0.113281 1.92969,0.472656 2.39062,1.546875 0.78907,1.835937 1.69532,3.617187 2.42969,5.472656 3.10547,7.851562 6.32031,15.667969 9.1836,23.609378 2.08203,5.76953 3.84375,11.66796 5.43359,17.59375 1.84375,6.86328 3.33203,13.82421 4.0625,20.91406 0.38281,3.71875 0.69922,7.44922 0.90234,11.18359 0.082,1.49609 -0.17968,3.01953 -0.37109,4.51953 -0.38672,3.07813 -0.76563,6.16016 -1.27734,9.21875 -0.27344,1.64453 -0.89844,3.23047 -1.19141,4.875 -0.25781,1.44922 0.58594,2.64844 1.82422,2.96485 1.67969,0.43359 3,-0.0781 3.65234,-1.46094 0.26953,-0.57422 0.48828,-1.1836 0.65625,-1.80078 1.6836,-6.11719 2.38672,-12.38282 2.39844,-18.69532 0.008,-3.8164 -0.35938,-7.64843 -0.82422,-11.4375 -1.46484,-11.92578 -4.28906,-23.55859 -8.10156,-34.93749 -2.07813,-6.19532 -4.29297,-12.355472 -6.72266,-18.421878 -2.48828,-6.214844 -5.34375,-12.277344 -7.97265,-18.433594 -0.76954,-1.800781 -1.9961,-2.59375 -3.91797,-2.398437 -0.39453,0.03906 -0.80078,0.0078 -1.19922,0.0078 z M 451.17187,288.40234 c -1.125,-0.0742 -1.82812,-0.15625 -2.52734,-0.15625 -8.32031,-0.008 -16.64062,-0.008 -24.95703,-0.008 -0.40234,0 -0.80078,0.0117 -1.19922,0.0234 -0.85547,0.0195 -1.34766,0.4375 -1.38672,1.30859 -0.0273,0.5586 -0.0312,1.11719 -0.0312,1.67578 0,6.80078 0,13.60157 0.004,20.40235 0,3.21093 0.004,3.21484 -3.10156,3.21484 -6.48047,0.004 -12.96094,0 -19.4375,0.004 -0.64063,0 -1.28125,0.008 -1.92188,0.0234 -0.86328,0.0234 -1.3125,0.49219 -1.35937,1.34375 -0.0234,0.39844 -0.0234,0.80079 -0.0234,1.19922 0,8.48047 0,16.96094 0,25.44141 0,0.39844 -0.004,0.80078 0.0351,1.19531 0.0664,0.74219 0.48829,1.16797 1.23047,1.21094 0.64063,0.0391 1.28125,0.0391 1.92188,0.0391 6.55859,0.004 13.11719,0 19.67578,0 h 2.78516 c 0.082,1.16016 0.18359,2.01172 0.1875,2.86328 0.0117,6.87891 0,13.76172 0.0117,20.64063 0,0.93359 0.10547,1.86719 0.16016,2.72265 2.36719,0.56641 27.71875,0.52735 29.88281,-0.0664 v -8.48828 c 0,-2.96094 -0.0195,-5.92188 0.008,-8.87891 0.0234,-2.85156 -0.125,-5.71094 0.11718,-8.79297 h 8.63282 c 2.71875,0 5.4414,0.0274 8.16015,-0.004 2.76172,-0.0352 5.54297,0.15625 8.3711,-0.15235 0.082,-0.92578 0.18359,-1.55078 0.18359,-2.17578 0.0117,-8.5625 0.008,-17.12109 0.008,-25.67969 0,-0.39843 0.004,-0.80078 -0.0312,-1.19922 -0.0625,-0.74218 -0.46875,-1.16796 -1.22656,-1.20703 -0.63672,-0.0273 -1.27734,-0.0351 -1.91797,-0.0351 -6.48047,-0.004 -12.95703,0.004 -19.4375,-0.008 -0.85156,0 -1.70312,-0.0742 -2.81641,-0.1289 z m -116.09375,-21.625 c 0.53516,-1.94922 0.60938,-21.20703 0.0899,-23.65234 H 9.605469 c -1.636719,3.65625 -4.457031,17.85156 -4.710938,23.65234 z m -31.30859,-93.5664 c 0.0703,-1.10547 0.17969,-2.03516 0.17969,-2.96485 0.008,-28.95312 0.008,-57.90234 0.008,-86.855465 0,-0.558594 0.14063,-1.191406 -0.0781,-1.652344 -0.23047,-0.492187 -0.76563,-1.101562 -1.24219,-1.175781 -1.8086,-0.269531 -3.64453,-0.363281 -5.47266,-0.484375 -4.21094,-0.273437 -8.42578,-0.527344 -12.64062,-0.785156 -4.05469,-0.246094 -8.10938,-0.683594 -12.16407,-0.6875 -7.66406,-0.01172 -15.32812,0.1875 -22.98828,0.382812 -5.03906,0.132813 -9.97265,1.035157 -14.89843,2.089844 -4.33594,0.929687 -7.42969,3.296875 -9.8086,7.015625 -4.32031,6.761719 -7.66797,13.99219 -10.76562,21.34375 -5.20313,12.35156 -9.28907,25.10937 -13.53125,37.80859 -0.26563,0.79688 -0.3086,1.66407 -0.47657,2.61719 2.25,0.23438 4.21875,0.63281 6.1875,0.60547 4.33204,-0.0586 8.58594,0.54687 12.84766,1.16406 2.44531,0.35156 4.53125,1.35156 6.26563,3.19141 2.6914,2.85937 3.80468,6.41015 4.60156,10.08594 0.4375,2.01953 0.55859,4.10546 0.87109,6.15625 0.29297,1.92968 0.60938,2.19531 2.39453,2.26562 0.32032,0.0117 0.64063,0.004 0.96094,0.004 22.3125,0 44.625,0 66.9375,-0.008 0.86328,0 1.72656,-0.0703 2.8125,-0.11718 m 37.44531,70.08984 v 2.40625 c 0,5.83984 0.004,11.67578 -0.004,17.51563 -0.004,3.79687 -0.25391,3.70703 3.61328,3.70703 151.49219,-0.004 302.98437,-0.004 454.47265,-0.004 0.5625,0 1.1211,0.0234 1.67969,-0.004 1.70703,-0.0898 2.08985,-0.53906 1.86719,-2.25781 -0.62109,-4.74219 -1.22266,-9.48828 -1.90625,-14.21875 -0.35156,-2.42578 -0.86328,-4.82812 -1.34766,-7.48047 -152.26562,0 -304.3789,0 -456.49218,0.0117 -0.53516,0 -1.07032,0.17969 -1.88282,0.32422 m -92.26562,155.90625 c 0.0547,-28.71875 -10.66797,-52.28516 -33.19922,-69.90625 -15.92969,-12.45312 -34.41016,-18.26953 -54.57813,-17.36719 -22.8789,1.01953 -42.52734,9.79688 -58.33984,26.64063 -15.816405,16.85156 -23.058592,36.99219 -22.945311,59.99609 -1.667969,0.69922 -3.324219,0.44141 -4.96875,0.29297 -0.789063,-0.0703 -1.574219,-0.25 -2.367188,-0.26562 -6.382812,-0.14063 -12.722656,-0.74219 -19.0625,-1.46485 -6.273437,-0.71484 -12.484375,-1.67969 -18.570312,-3.35547 -6.882813,-1.89062 -13.511719,-4.33203 -19.308594,-8.67968 -7.546875,-5.66407 -11.835937,-13.23438 -13.3125,-22.45704 -0.375,-2.35156 -0.535156,-4.75 -0.625,-7.13671 C 1.476562,350.32031 1.402344,345.13281 1.25,339.94531 1.152344,336.67969 1.234375,333.37891 0.816406,330.14844 0.210938,325.44531 0.46875,320.75 0.375,316.04687 c -0.132812,-6.625 -0.3359375,-13.25 -0.37109375,-19.875 -0.01953125,-3.58593 0.06640625,-7.1914 0.39843775,-10.75781 0.953125,-10.23047 1.46875,-20.50781 3.460937,-30.625 1.902344,-9.66797 4.382813,-19.13281 9.042969,-27.91406 3.75,-7.07813 8.714844,-13.00781 15.859375,-16.82031 3.519531,-1.87891 7.191406,-3.48438 10.839844,-5.10157 7.960937,-3.52734 15.925781,-7.04296 23.9375,-10.44921 7.792969,-3.31641 15.628906,-6.52344 23.472656,-9.71094 10.65625,-4.33594 21.328125,-8.62891 32.011715,-12.89453 4.3711,-1.7461 8.77735,-3.41016 13.19922,-5.02735 1.375,-0.5039 2.20313,-1.33593 2.89063,-2.62109 5.69922,-10.61719 11.25781,-21.32422 17.26172,-31.76953 9.125,-15.86328 18.84375,-31.36719 29.80859,-46.054689 C 186.72656,80.34375 191.29297,74.285156 196.5,68.75 199.83984,65.203125 203.11328,61.578125 206.64844,58.234375 211,54.113281 215.72656,50.398438 221.07422,47.625 c 4.27734,-2.21875 8.74219,-3.707031 13.73047,-3.695312 29.43359,0.08984 58.875,0.04297 88.3125,0.04297 h 3.07031 c 0.0742,-1.066406 0.17969,-1.910156 0.18359,-2.753906 0.0156,-4.238281 -0.0625,-8.480469 0.0195,-12.71875 0.19141,-9.855469 3.9961,-18.15625 11.25782,-24.75 2.6875,-2.4375 6.01172,-3.8046875 9.83593,-3.75 6.47657,0.0976562 12.96094,0.09375 19.4375,0.0078125 4.67969,-0.0664063 8.59375,1.6640625 11.8125,4.8867185 5.35547,5.367188 8.76563,11.855469 9.55469,19.398438 0.54688,5.222656 0.33594,10.527343 0.45313,15.796875 0.0273,1.175781 0.004,2.355468 0.004,3.648437 0.91407,0.101563 1.52344,0.207031 2.13672,0.226563 0.96094,0.03516 1.92188,0.0078 2.87891,0.0078 112.39453,0 224.78515,0.01172 337.17969,-0.03516 3.78515,-0.0039 6.73828,1.335938 9.44531,3.863281 5.18359,4.835938 8.69922,10.820313 11.85156,17.023438 5.53516,10.894531 10.01563,22.238281 13.875,33.835937 1.30859,3.937508 2.88281,7.789068 4.08203,11.753908 3.25391,10.76953 6.48828,21.55078 9.51563,32.38672 2.77343,9.91406 5.40234,19.87109 7.83984,29.87109 2.78125,11.41407 5.37891,22.875 7.87891,34.35547 3.27734,15.0586 6.16406,30.19922 8.48047,45.4375 0.69531,4.5625 0.88671,9.21094 1.71093,13.7461 0.58203,3.19531 0.4375,6.35547 0.44141,9.53125 0.0352,29.03906 0.18359,58.07812 -0.082,87.11328 -0.0742,8.0664 -1.78516,16.02734 -6.30078,23.03906 -4.17578,6.48047 -9.94532,10.79297 -17.54297,12.32422 -3.1875,0.64062 -6.46875,1.01953 -9.71485,1.06641 -9.51953,0.13671 -19.03906,0.0508 -28.55859,0.0508 h -2.92969 c -0.16797,-0.77344 -0.38672,-1.29688 -0.38672,-1.82032 -0.0117,-8.11328 -1.25,-16.05859 -3.5625,-23.80859 -2.03125,-6.82422 -5.02343,-13.25 -8.69531,-19.37109 -4.35937,-7.26172 -9.78906,-13.65625 -16.08594,-19.23828 -9.94921,-8.82032 -21.37109,-15.05079 -34.30859,-18.38282 -5.65625,-1.45703 -11.375,-2.28125 -17.21875,-2.65625 -13.60156,-0.8789 -26.55469,1.65235 -38.95703,7.04688 -7.35547,3.19922 -14.06641,7.50781 -20.18359,12.75781 -6.29688,5.39844 -11.80469,11.45703 -16.27344,18.44141 -4.0586,6.34765 -7.26563,13.08984 -9.56641,20.29297 -1.70703,5.35546 -2.8164,10.8125 -3.51562,16.35937 -0.33985,2.67969 -0.37891,5.40234 -0.51172,8.10547 -0.0977,2.05078 -0.1875,2.1875 -2.17578,2.26172 -0.71875,0.0273 -1.4375,0.0117 -2.16016,0.0117 -104.79297,0 -209.58594,0 -314.37891,-0.008 -1.2539,0 -2.51171,-0.0742 -4.0039,-0.12109"
             id="path842-9" />
        </g>
        <path
           inkscape:connector-curvature="0"
           style="fill:#000000;fill-opacity:1;fill-rule:nonzero;stroke:none"
           d="m 164.4375,443.89844 c 25.39453,0.51953 46.59375,-21 47.51953,-45.35547 1.0625,-27.92578 -21.28906,-49.14844 -46.30859,-49.80078 -26.9336,-0.70703 -50.09375,21.96484 -48.83203,49.92578 1.08984,24.10547 21.91796,45.77734 47.62109,45.23047 m -0.20313,31.20312 c -43.44921,-0.17969 -77.351558,-35.0625 -78.492182,-76.1914 -1.261719,-45.55469 35.148442,-81.82813 79.636722,-81.24219 43.01562,0.5664 76.55859,34.78125 77.64453,76.51562 1.18359,45.6875 -35.76172,81.0625 -78.78907,80.91797"
           id="path846-9" />
        <g
           style="clip-rule:nonzero"
           clip-path="url(#clip2-8-7)"
           id="g850-6">
          <path
             inkscape:connector-curvature="0"
             style="fill:#000000;fill-opacity:1;fill-rule:nonzero;stroke:none"
             d="m 703.64844,396.30859 c 0.3125,-22.625 -19.88282,-45.35937 -46.98047,-45.60547 -26.92969,-0.25 -47.24219,21.19922 -48.10938,45.82032 -0.48047,13.75 4.28125,25.62109 13.78516,35.33984 9.16406,9.37109 20.73437,14.21484 33.79297,14.20703 13.04687,-0.008 24.58203,-4.83203 33.76172,-14.21875 9.07812,-9.28125 13.85937,-20.55078 13.75,-35.54297 m -47.63282,80.64453 c -42.46875,0.36719 -79.33984,-34.94531 -78.55859,-80.17578 0.38672,-22.21484 9.16016,-41.07812 25.44531,-56.24218 14.98047,-13.94532 33.01563,-21.03516 53.3125,-20.94141 22.87891,0.10547 42.46094,8.85156 57.99219,25.86328 14.28906,15.64844 21.13281,34.27344 20.55078,55.39844 -1.14844,41.64453 -36.03515,76.49219 -78.74219,76.09765"
             id="path848-0" />
        </g>
        <path
           inkscape:connector-curvature="0"
           style="fill:#000000;fill-opacity:1;fill-rule:nonzero;stroke:none"
           d="m 164.17578,405.07812 c 4.69531,0.48438 8.89844,-4.10937 8.97266,-8.63281 0.082,-4.71094 -4.04297,-8.875 -8.78907,-8.85937 -4.64843,0.0117 -8.73046,4.07812 -8.72656,8.68359 0.008,4.77734 3.87891,8.77344 8.54297,8.80859 m -0.0781,5.66797 c -8.17579,0.35938 -14.3086,-7.20312 -14.22657,-14.29297 0.0937,-8.01562 6.37891,-14.59375 14.55078,-14.61718 8.10157,-0.0195 14.45704,6.8125 14.51172,14.71484 0.0469,6.96484 -6.24609,14.86719 -14.83593,14.19531"
           id="path852-2" />
        <path
           inkscape:connector-curvature="0"
           style="fill:#000000;fill-opacity:1;fill-rule:nonzero;stroke:none"
           d="m 664.82812,398.46484 c 0.23047,-4.45703 -3.3125,-8.83984 -8.71875,-8.92578 -4.6289,-0.0703 -8.71875,4.09766 -8.78906,8.75391 -0.0547,3.94531 3.85156,8.71875 8.71094,8.76953 4.71875,0.0469 9.26562,-4.80469 8.79687,-8.59766 m -8.74609,14.30078 c -7.42187,0.32813 -14.51953,-5.92187 -14.48047,-14.5664 0.0274,-6.96094 5.50781,-14.33985 14.53906,-14.39844 8.54688,-0.0586 14.69922,7.38281 14.48829,14.92188 -0.20704,7.30078 -6.44532,14.37109 -14.54688,14.04296"
           id="path854-7" />
      </g>
      <path
         id="path972-0"
         d="m 152.63622,57.219382 c 0.53473,-0.13865 1.03468,-0.56136 1.23663,-1.04555 0.15569,-0.37326 0.1434,-1.1153 -0.0245,-1.47982 -0.29931,-0.64979 -0.89436,-1.01241 -1.65222,-1.0068 -0.46418,0.003 -1.04254,0.2315 -1.28426,0.50645 -0.21404,0.24346 -0.43529,0.75866 -0.47552,1.10729 -0.0763,0.66131 0.43518,1.55598 1.0322,1.80542 0.3042,0.12711 0.89341,0.18415 1.1676,0.11305 z m -16.68417,-0.0706 c 0.43183,-0.15317 0.89203,-0.55674 1.07531,-0.94288 0.0882,-0.18584 0.11243,-0.40464 0.0936,-0.84483 -0.0231,-0.54051 -0.048,-0.62539 -0.27565,-0.94164 -0.76318,-1.06014 -2.46231,-0.96099 -3.03916,0.17731 -0.26788,0.52865 -0.29779,0.95398 -0.10336,1.46988 0.36072,0.95704 1.31186,1.41473 2.24928,1.08225 z m 19.93097,-1.8123 c 0.2598,-0.0928 0.29185,-0.25155 0.29185,-1.44508 0,-0.82593 -0.0272,-1.21291 -0.0912,-1.30011 -0.0713,-0.0971 -0.83738,-0.25035 -3.5145,-0.70322 l -3.42328,-0.57909 -1.65121,-1.6455 -1.6512,-1.64551 H 136.33 l -2.17084,1.72095 c -1.19395,0.94653 -2.24467,1.80202 -2.335,1.9011 -0.15993,0.1755 -0.16416,0.22205 -0.16416,1.80375 0,1.95333 -0.017,1.90686 0.69733,1.90686 h 0.49022 l 0.12237,-0.43777 c 0.17338,-0.62025 0.30904,-0.84519 0.74822,-1.24086 0.56163,-0.50592 0.9129,-0.64143 1.66294,-0.64143 0.74218,0 1.13645,0.14816 1.6504,0.62013 0.35757,0.32834 0.75633,1.04948 0.75837,1.37161 0.002,0.3847 -0.30409,0.36701 6.0154,0.34699 l 5.89787,-0.0187 0.12167,-0.43777 c 0.17216,-0.61948 0.30794,-0.8449 0.74749,-1.24087 0.54994,-0.49539 0.91538,-0.63945 1.62647,-0.64113 0.72167,-0.002 1.09691,0.1312 1.61136,0.57074 0.41118,0.35127 0.83286,1.06911 0.83286,1.41771 0,0.10596 0.0394,0.23205 0.0875,0.2802 0.0874,0.0874 0.93566,0.11453 1.15281,0.0369 z m -14.30051,-3.59577 c -0.0892,-0.0563 -0.11366,-0.3118 -0.13225,-1.38146 -0.0149,-0.85613 0.005,-1.36439 0.0573,-1.46201 0.0779,-0.14562 0.13719,-0.14965 2.19506,-0.14965 h 2.11494 l 1.27515,1.22094 c 1.0373,0.99323 1.27523,1.25787 1.27523,1.4186 0,0.42326 -0.0137,0.42491 -3.50013,0.42369 -1.86971,-6.7e-4 -3.22082,-0.0295 -3.28532,-0.0702 z m -6.37839,-0.14209 c -0.12223,-0.11487 -0.1882,-0.25463 -0.1882,-0.39869 0,-0.18878 0.16604,-0.38784 1.1153,-1.33709 l 1.11528,-1.11529 h 1.72424 c 0.94837,0 1.77618,0.02 1.83966,0.0442 0.0997,0.0383 0.11541,0.23501 0.11541,1.44464 0,1.01366 -0.0249,1.42524 -0.0901,1.49046 -0.0689,0.0689 -0.71761,0.0852 -2.76679,0.0693 l -2.67667,-0.0208 -0.1882,-0.17688 z"
         inkscape:connector-curvature="0"
         style="fill:#010101;stroke-width:0.0729618" />
      <path
         id="path984-7"
         d="m 124.85824,57.170872 c 0.98702,-0.33656 1.41655,-0.95485 1.41655,-2.03903 0,-0.55801 -0.0417,-0.70215 -0.32429,-1.1188 -0.42471,-0.6264 -0.93488,-0.88909 -1.72909,-0.89036 -1.21062,-0.002 -2.03783,0.83786 -2.03783,2.06896 0,1.18066 0.58055,1.82568 1.89593,2.10648 0.13721,0.0293 0.48763,-0.028 0.77873,-0.12722 z m -14.81621,0.0464 c 0.58686,-0.15483 1.32157,-0.83105 1.46536,-1.3488 0.21013,-0.75638 0.0552,-1.51474 -0.42028,-2.05618 -0.37917,-0.43186 -0.69454,-0.60108 -1.28534,-0.68969 -0.62855,-0.0943 -1.22248,0.0893 -1.70884,0.52826 -0.50709,0.45757 -0.67757,0.85187 -0.67757,1.56703 0,0.90811 0.53442,1.68867 1.31966,1.92746 0.61525,0.18712 0.82628,0.19871 1.30709,0.0719 z m 18.27378,-2.30874 c 0.15038,-0.15037 0.16456,-0.39377 0.1296,-2.22522 l -0.0392,-2.05638 -0.81599,-2.2356 c -0.44881,-1.22957 -0.81601,-2.36184 -0.81601,-2.5161 0,-0.17839 0.0727,-0.3194 0.19957,-0.38732 0.15382,-0.0823 0.19958,-0.20893 0.19958,-0.55233 v -0.44553 h -9.98557 c -6.65761,0 -10.04943,0.0342 -10.17716,0.1027 -0.31088,0.16639 -0.47915,0.60207 -1.15122,2.98071 l -0.63718,2.25516 -10e-4,2.26852 -0.001,2.26853 0.27574,0.3086 c 0.19562,0.21894 0.37486,0.31362 0.61696,0.32588 0.3201,0.0163 0.34638,-0.007 0.42395,-0.37011 0.32344,-1.51486 1.69457,-2.55452 3.20852,-2.43299 0.69037,0.0554 1.12069,0.2415 1.69846,0.73438 0.51992,0.44358 0.65211,0.64984 0.91318,1.42505 l 0.22261,0.66095 h 8.65074 l 0.0709,-0.41474 c 0.27991,-1.63969 1.99611,-2.73254 3.66313,-2.3326 0.46721,0.11203 1.27776,0.62104 1.5875,0.99675 0.26812,0.3253 0.561,0.9689 0.61498,1.35149 0.0557,0.39449 0.0616,0.39949 0.51821,0.42906 0.33105,0.0215 0.5097,-0.0179 0.63073,-0.13893 z m -5.57194,-4.8835 c -0.23568,-0.23569 -0.2768,-0.66045 -0.24242,-2.50363 0.0236,-1.25961 0.0676,-1.74695 0.16875,-1.86869 0.1167,-0.14032 0.36766,-0.16447 1.69636,-0.16316 0.85768,7.9e-4 1.61384,0.0361 1.68029,0.0784 0.14948,0.095 0.28277,0.41211 0.97643,2.32291 0.30205,0.83207 0.54918,1.59728 0.54918,1.70046 0,0.10316 -0.0898,0.27738 -0.19957,0.38715 -0.18716,0.18714 -0.33262,0.19956 -2.33789,0.19956 -1.78756,0 -2.16335,-0.0251 -2.29118,-0.15289 z m -5.16711,-0.0123 c -0.10236,-0.0926 -0.18217,-0.30075 -0.18176,-0.47399 0.001,-0.43264 1.04955,-3.8596 1.2125,-3.96288 0.0736,-0.0466 0.76516,-0.0855 1.5367,-0.0863 1.05603,-10e-4 1.45079,0.0334 1.59657,0.1401 0.18055,0.13202 0.1937,0.27695 0.1937,2.13493 0,1.82009 -0.0165,2.01148 -0.19009,2.20336 -0.18055,0.19952 -0.28527,0.21005 -2.08762,0.21005 -1.62572,0 -1.92367,-0.0237 -2.08003,-0.16514 z m -5.41408,0.008 c -0.0862,-0.0862 -0.1568,-0.29959 -0.1568,-0.47411 0,-0.38396 0.94137,-3.72101 1.10543,-3.91878 0.0927,-0.11169 0.51037,-0.14026 2.0477,-0.14026 h 1.93136 l 0.16188,0.24706 c 0.15423,0.23538 0.1355,0.34034 -0.39632,2.22024 -0.34742,1.22807 -0.62213,2.02026 -0.72748,2.0979 -0.12083,0.0891 -0.69004,0.12473 -1.98913,0.12473 -1.52133,0 -1.84554,-0.0257 -1.97666,-0.15682 z m -5.06343,-0.008 c -0.27245,-0.24657 -0.22866,-0.62691 0.27361,-2.3767 0.4645,-1.61823 0.58649,-1.94173 0.78123,-2.07175 0.0604,-0.0403 0.93697,-0.074 1.94801,-0.0748 1.57183,-0.001 1.8646,0.0224 2.02066,0.16361 0.10043,0.0909 0.18175,0.25921 0.18084,0.3742 -0.003,0.43251 -1.08946,3.89903 -1.26089,4.02436 -0.12405,0.0906 -0.67761,0.12623 -1.96678,0.12623 -1.52942,0 -1.8211,-0.0243 -1.97666,-0.16514 z"
         inkscape:connector-curvature="0"
         style="fill:#010101;stroke-width:0.09978583" />
      <rect
         transform="rotate(-90)"
         ry="1.0289841"
         y="20.256899"
         x="-59.062878"
         height="144.15182"
         width="2.0579758"
         id="rect1038-3-58"
         style="opacity:0.98000004;fill:#000000;fill-opacity:1;stroke:none;stroke-width:0.26458332;stroke-opacity:1" />
      <g
         transform="translate(3.247198,-40.866108)"
         id="g1129-7">
        <rect
           style="opacity:0.98000004;fill:#000000;fill-opacity:1;stroke:none;stroke-width:0.26458332;stroke-opacity:1"
           id="rect1038-6-0"
           width="0.77173615"
           height="97.18087"
           x="81.201714"
           y="-151.4763"
           ry="0"
           rx="0.36832884"
           transform="rotate(90)" />
        <rect
           style="opacity:0.98000004;fill:#000000;fill-opacity:1;stroke:none;stroke-width:0.26458332;stroke-opacity:1"
           id="rect1038-35-4"
           width="0.77174377"
           height="3.2046795"
           x="54.295437"
           y="81.201714"
           ry="0"
           rx="0.38587189" />
        <rect
           style="opacity:0.98000004;fill:#000000;fill-opacity:1;stroke:none;stroke-width:0.26458332;stroke-opacity:1"
           id="rect1038-62-8"
           width="0.77174377"
           height="3.2046795"
           x="54.295437"
           y="78.768768"
           ry="0"
           rx="0.38587189" />
      </g>
      <text
         id="text1139-0"
         y="38.514111"
         x="58.94199"
         style="font-style:normal;font-weight:normal;font-size:10.58333302px;line-height:1.25;font-family:sans-serif;letter-spacing:0px;word-spacing:0px;fill:#000000;fill-opacity:1;stroke:none;stroke-width:0.26458332"
         xml:space="preserve"><tspan
           style="font-size:7.05555534px;stroke-width:0.26458332"
           y="38.514111"
           x="58.94199"
           id="tspan1137-4"
           sodipodi:role="line">preemption distance</tspan></text>
      <path
         style="stroke-width:0.06183126"
         id="path899-6-6-9"
         d="m 160.09019,40.25282 h 1.94202 a 0.45395717,1.300989 0 0 1 0.45395,1.30099 v 14.92332 a 0.45395717,1.300989 0 0 1 -0.45395,1.30099 h -1.94202 a 0.45395717,1.300989 0 0 1 -0.45396,-1.30099 V 41.55381 a 0.45395717,1.300989 0 0 1 0.45396,-1.30099"
         inkscape:connector-curvature="0" />
      <path
         style="stroke-width:0.03655764"
         id="path5180-1"
         d="m 160.16094,28.60451 h 1.7975 a 1.6723294,1.6723294 0 0 1 1.67233,1.672327 v 7.909247 a 1.6723294,1.6723294 0 0 1 -1.67233,1.672328 h -1.7975 a 1.6723294,1.6723294 0 0 1 -1.67233,-1.672328 v -7.909247 a 1.6723294,1.6723294 0 0 1 1.67233,-1.672327"
         inkscape:connector-curvature="0" />
      <path
         id="path5182-0"
         d="m 162.6499,37.610101 a 1.59026,1.5902792 0 1 1 -3.18052,0 1.59026,1.5902792 0 1 1 3.18052,0 z"
         inkscape:connector-curvature="0"
         style="fill:#ffffff;fill-opacity:0;stroke-width:0.02012371" />
      <path
         id="path5184-4"
         d="m 162.6499,34.231447 a 1.59026,1.5902792 0 1 1 -3.18052,0 1.59026,1.5902792 0 1 1 3.18052,0 z"
         inkscape:connector-curvature="0"
         style="fill:#ffffff;fill-opacity:0.05381165;stroke-width:0.02012371" />
      <path
         id="path5186-2"
         d="m 162.6499,30.852787 a 1.59026,1.5902792 0 1 1 -3.18052,0 1.59026,1.5902792 0 1 1 3.18052,0 z"
         inkscape:connector-curvature="0"
         style="fill:#ff0500;fill-opacity:1;stroke-width:0.02012371" />
      <path
         style="stroke-width:0.03655764"
         id="path5188-2"
         d="m 157.63115,39.021242 c -0.0547,-0.02203 -0.50972,-0.596951 -1.01144,-1.276665 -0.84236,-1.14122 -0.90546,-1.251076 -0.82379,-1.43412 0.0874,-0.195913 0.10015,-0.135733 1.09377,-0.135733 h 1.19353 v 1.431926 c 0,1.205559 -0.0149,1.302146 -0.15166,1.385128 -0.12371,0.07507 -0.17755,0.07895 -0.30038,0.02944 z"
         inkscape:connector-curvature="0" />
      <path
         style="stroke-width:0.03655764"
         id="path5190-2"
         d="m 157.63115,35.642587 c -0.0547,-0.02203 -0.50972,-0.596951 -1.01144,-1.276669 -0.84236,-1.14122 -0.90546,-1.251077 -0.82379,-1.434121 0.0874,-0.195912 0.10015,-0.135733 1.09377,-0.135733 h 1.19353 v 1.431927 c 0,1.205563 -0.0149,1.302145 -0.15166,1.385133 -0.12371,0.07506 -0.17755,0.07895 -0.30038,0.02943 z"
         inkscape:connector-curvature="0" />
      <path
         style="stroke-width:0.03655764"
         id="path5192-0"
         d="m 157.63115,32.263927 c -0.0547,-0.02203 -0.50972,-0.59695 -1.01144,-1.276664 -0.84236,-1.14122 -0.90546,-1.251077 -0.82379,-1.434121 0.0874,-0.195912 0.10015,-0.135733 1.09377,-0.135733 h 1.19353 v 1.431922 c 0,1.205564 -0.0149,1.302151 -0.15166,1.385133 -0.12371,0.07506 -0.17755,0.07895 -0.30038,0.02943 z"
         inkscape:connector-curvature="0" />
      <g
         id="g5200-5"
         transform="matrix(0.03655764,0,0,0.03655764,196.98546,7.7242423)">
        <path
           id="path5194-5"
           d="m -889.02,856.09 c 1.4967,-0.60315 13.943,-16.329 27.667,-34.922 23.042,-31.217 24.768,-34.222 22.534,-39.229 -2.3912,-5.359 -2.7394,-3.7129 -29.919,-3.7129 h -32.648 v 39.169 c 0,32.977 0.408,35.619 4.1487,37.889 3.384,2.0532 4.8567,2.1596 8.2167,0.80559 z"
           inkscape:connector-curvature="0" />
        <path
           id="path5196-2"
           d="m -889.02,763.67 c 1.4967,-0.60315 13.943,-16.329 27.667,-34.922 23.042,-31.217 24.768,-34.222 22.534,-39.229 -2.3912,-5.359 -2.7394,-3.7129 -29.919,-3.7129 h -32.648 v 39.169 c 0,32.977 0.408,35.619 4.1487,37.889 3.384,2.0532 4.8567,2.1596 8.2167,0.80559 z"
           inkscape:connector-curvature="0" />
        <path
           id="path5198-9"
           d="m -889.02,671.26 c 1.4967,-0.60315 13.943,-16.329 27.667,-34.922 23.042,-31.217 24.768,-34.222 22.534,-39.229 -2.3912,-5.359 -2.7394,-3.7129 -29.919,-3.7129 h -32.648 v 39.169 c 0,32.977 0.408,35.619 4.1487,37.889 3.384,2.0532 4.8567,2.1596 8.2167,0.80559 z"
           inkscape:connector-curvature="0" />
      </g>
      <g
         transform="translate(-10.076018,12.084742)"
         id="g6299-9">
        <path
           inkscape:connector-curvature="0"
           d="m 173.05023,11.381145 c -0.0223,0.276238 -0.0526,0.619816 -0.0762,0.963395 -0.008,0.122619 -0.0699,0.200192 -0.16881,0.261425 q -0.95126,0.588512 -1.90114,1.179391 c -0.17018,0.10567 -0.33907,0.213783 -0.50926,0.319147 -0.24653,0.152702 -0.53041,0.205002 -0.80168,0.288911 q -1.92015,0.594392 -3.8435,1.178017 c -0.41062,0.124681 -0.32068,0.154992 -0.71304,-0.07956 -0.64898,-0.387862 -1.30087,-0.771143 -1.95038,-1.1587 -0.049,-0.02909 -0.12904,-0.04581 -0.12499,-0.114526 0.004,-0.07589 0.0902,-0.06627 0.14285,-0.08254 q 2.19891,-0.676239 4.39781,-1.348966 2.31564,-0.709834 4.6303,-1.420508 c 0.23531,-0.07223 0.47123,-0.142699 0.70647,-0.215156 0.20943,-0.06452 0.22302,-0.05482 0.21157,0.229663 z"
           id="path6199-3"
           style="stroke-width:0.00763508" />
        <path
           inkscape:connector-curvature="0"
           d="m 173.62133,14.130462 c -0.003,0.09819 -0.0662,0.122162 -0.13201,0.142394 q -0.40351,0.123842 -0.80726,0.246843 -1.89174,0.579503 -3.78364,1.159158 -1.36668,0.418479 -2.73427,0.835813 -0.62051,0.189884 -1.2404,0.381754 c -0.1414,0.04367 -0.18149,0.02291 -0.22439,-0.117428 q -0.21279,-0.696166 -0.42581,-1.39241 c -0.0126,-0.04138 -0.0498,-0.09215 -0.004,-0.126437 0.046,-0.03428 0.0847,0.01527 0.12216,0.03726 0.26998,0.158505 0.54003,0.316857 0.80795,0.478874 0.0992,0.06009 0.19507,0.07696 0.31021,0.04123 q 1.71308,-0.531783 3.42861,-1.056465 c 0.39702,-0.122162 0.7926,-0.246919 1.19107,-0.361598 0.16965,-0.04879 0.31464,-0.139341 0.46063,-0.22974 q 1.18435,-0.733349 2.3658,-1.470898 c 0.19752,-0.123078 0.19424,-0.123383 0.26189,0.101164 0.12399,0.410844 0.25081,0.820696 0.37595,1.231081 0.0115,0.0368 0.0205,0.07437 0.0273,0.09941 z"
           id="path6201-9"
           style="stroke-width:0.00763508" />
        <path
           inkscape:connector-curvature="0"
           d="m 172.83293,15.37208 c -7.2e-4,0.06871 -0.0335,0.105516 -0.0897,0.122847 q -0.4581,0.141403 -0.91728,0.281735 c -0.0916,0.02802 -0.14354,-0.02596 -0.19347,-0.09101 -0.23287,-0.303188 -0.53858,-0.422067 -0.91163,-0.336707 -0.37305,0.08536 -0.62944,0.403514 -0.65074,0.786414 -0.009,0.164536 -0.0283,0.18767 -0.18538,0.235695 q -0.66562,0.203627 -1.33095,0.408324 c -0.15682,0.04795 -0.1856,0.0313 -0.23508,-0.127887 -0.048,-0.154382 -0.098,-0.308305 -0.14354,-0.463451 -0.0363,-0.123611 -0.0125,-0.165376 0.11094,-0.203245 q 2.07689,-0.637071 4.15417,-1.273379 c 0.15118,-0.04635 0.18546,-0.02596 0.22982,0.122161 0.0452,0.151557 0.093,0.302349 0.13934,0.453601 0.009,0.03039 0.017,0.061 0.0235,0.0849 z"
           id="path6203-2"
           style="stroke-width:0.00763508" />
        <path
           inkscape:connector-curvature="0"
           d="m 170.92699,16.890621 c -0.38779,0 -0.70945,-0.320673 -0.7077,-0.704413 0.002,-0.38893 0.31701,-0.700595 0.70922,-0.701053 0.38878,-4.12e-4 0.70755,0.315787 0.70678,0.701129 -7.2e-4,0.383969 -0.32319,0.704566 -0.7083,0.704337 z"
           id="path6209-8"
           style="stroke-width:0.00763508" />
        <path
           inkscape:connector-curvature="0"
           d="m 164.01548,15.425448 c 0.0916,-0.004 0.13117,0.02642 0.14866,0.08307 q 0.14025,0.453677 0.27814,0.907888 c 0.0238,0.07895 -0.0116,0.128651 -0.0877,0.152701 -0.14415,0.04581 -0.28808,0.09162 -0.43223,0.136898 -0.0812,0.02542 -0.13995,-7.21e-4 -0.16553,-0.08299 q -0.13788,-0.443217 -0.27249,-0.887578 c -0.027,-0.08903 0,-0.14919 0.0955,-0.176752 0.15522,-0.04474 0.30915,-0.09429 0.43566,-0.133233 z"
           id="path6211-3"
           style="stroke-width:0.00763508" />
      </g>
      <text
         id="text6398-9"
         y="21.526871"
         x="129.37529"
         style="font-style:normal;font-variant:normal;font-weight:normal;font-stretch:normal;font-size:4.23333311px;line-height:1.25;font-family:sans-serif;-inkscape-font-specification:'sans-serif, Normal';font-variant-ligatures:normal;font-variant-caps:normal;font-variant-numeric:normal;font-feature-settings:normal;text-align:start;letter-spacing:0px;word-spacing:0px;writing-mode:lr-tb;text-anchor:start;fill:#000000;fill-opacity:1;stroke:none;stroke-width:0.26458332"
         xml:space="preserve"><tspan
           id="tspan6582"
           sodipodi:role="line"
           x="129.37529"
           y="21.526871">2345</tspan></text>
      <g
         style="fill:#2999ff;fill-opacity:1"
         transform="matrix(0.03756319,0,0,0.03756319,170.99739,23.485188)"
         id="g5060-9">
        <circle
           style="opacity:0.98999999;fill:#2999ff;fill-opacity:1"
           cx="-312"
           cy="610.35999"
           r="19"
           id="circle5046-9" />
        <path
           style="opacity:0.98999999;fill:#2999ff;fill-opacity:1"
           inkscape:connector-curvature="0"
           d="m -313.01,448.9 a 161.52,161.52 0 0 0 -160.5,161.46 161.52,161.52 0 0 0 0.0371,0.75 l 25.588,0.19922 a 135.92,135.92 0 0 1 -0.0332,-0.94922 135.92,135.92 0 0 1 135.11,-135.89 l -0.19726,-25.57 z m 0.36133,46.65 a 114.85,114.85 0 0 0 -114.2,114.81 114.85,114.85 0 0 0 0.0547,1.1113 l 18.188,0.14062 a 96.65,96.65 0 0 1 -0.0449,-1.252 96.65,96.65 0 0 1 96.139,-96.633 l -0.14062,-18.182 z m 0.28906,37.461 a 77.372,77.372 0 0 0 -77.008,77.354 77.372,77.372 0 0 0 0.0703,1.4004 l 12.242,0.0957 a 65.111,65.111 0 0 1 -0.0527,-1.4961 65.111,65.111 0 0 1 64.842,-65.102 l -0.0937,-12.252 z m 0.21875,28.275 a 49.087,49.087 0 0 0 -48.941,49.078 49.087,49.087 0 0 0 0.082,1.6191 l 7.7539,0.0605 a 41.309,41.309 0 0 1 -0.0586,-1.6797 41.309,41.309 0 0 1 41.225,-41.305 l -0.0605,-7.7734 z"
           id="path5048-4" />
      </g>
      <path
         id="path10927"
         d="m 137.3772,15.75369 c 1.55284,0 2.89993,0.36178 3.65349,0.896056 0.69915,-0.213475 1.54659,-0.342549 2.46713,-0.342544 2.36904,0 4.29386,0.831837 4.29386,1.855615 0,0.07524 -0.0323,0.147148 -0.0525,0.220046 2.04598,0.141084 3.61675,0.90015 3.61675,1.823889 0,0.915245 -1.5406,1.672781 -3.55897,1.823889 0.041,0.102762 0.0734,0.207534 0.0734,0.315316 0,1.02383 -1.92482,1.853364 -4.29388,1.853364 -1.1604,0 -2.20882,-0.200309 -2.98155,-0.524043 -0.78749,0.404814 -1.9517,0.669215 -3.27027,0.669215 -1.88133,0 -3.46295,-0.528239 -4.0419,-1.256761 -0.46344,0.07406 -0.95752,0.122504 -1.48034,0.122504 -2.36906,0 -4.28863,-0.831837 -4.28863,-1.855667 0,-0.514831 0.48567,-0.979567 1.27032,-1.315709 -0.39614,-0.280857 -0.64042,-0.606837 -0.64042,-0.959559 0,-1.02383 1.92482,-1.853364 4.29387,-1.853364 0.24939,0 0.49187,0.01182 0.72964,0.02949 0.38257,-0.854761 2.12081,-1.501767 4.20996,-1.501767 z"
         inkscape:connector-curvature="0"
         style="fill:none;stroke:#000000;stroke-width:0.70415759;stroke-linejoin:round" />
      <path
         id="path10929"
         d="m 150.41395,22.994903 a 0.80963,0.77084227 0 1 0 1.61926,0 0.80963,0.77084227 0 1 0 -1.61926,0 z"
         inkscape:connector-curvature="0"
         style="fill:none;stroke:#000000;stroke-width:0.24556977;stroke-linejoin:round" />
      <path
         id="path10931"
         d="m 152.48433,24.215844 a 0.56196025,0.53504429 0 1 0 1.12387,0 0.56196025,0.53504429 0 1 0 -1.12387,0 z"
         inkscape:connector-curvature="0"
         style="fill:none;stroke:#000000;stroke-width:0.27647707;stroke-linejoin:round" />
      <g
         transform="matrix(0.06255053,0,0,0.04148547,27.085557,22.63809)"
         id="g10961-3">
        <path
           style="fill-opacity:0.5;fill-rule:evenodd"
           inkscape:connector-curvature="0"
           d="M 257.44,30.841 C 148.26,32.5954 51.96,93.438 31.51,179.751 c -23.357,98.599 61.082,193.28 188.51,211.41 0.0268,0.15189 -0.0183,0.37662 -0.0305,0.59375 l -0.73076,0.0312 -99.292,92.344 204,-95.844 -2.0096,0.0625 1.3093,-1 2.923,-0.0937 -2.2227,1.0312 2.8012,-0.0937 v -0.96875 h 0.0305 c 88.273,-19.445 150.16,-72.131 166.7,-141.97 23.366,-98.639 -61.177,-193.36 -188.69,-211.44 -15.939,-2.2595 -31.78,-3.2194 -47.377,-2.9688 z"
           id="path10947-7" />
        <path
           style="fill:#ffffff;fill-rule:evenodd;stroke:#000000;stroke-width:10;stroke-linejoin:round"
           inkscape:connector-curvature="0"
           d="M 241.67,22.75 C 132.49,24.5044 36.19,85.347 15.74,171.66 c -23.357,98.599 61.082,193.28 188.51,211.41 0.0268,0.15189 -0.0183,0.37663 -0.0305,0.59375 l -0.73076,0.0312 -99.292,92.344 204,-95.844 -2.0096,0.0625 1.3093,-1 2.923,-0.0937 -2.2227,1.0312 2.8012,-0.0937 v -0.96875 h 0.0304 c 88.273,-19.445 150.16,-72.131 166.7,-141.97 23.366,-98.639 -61.177,-193.36 -188.69,-211.44 -15.939,-2.2595 -31.78,-3.2194 -47.377,-2.9688 z"
           id="path10949-7" />
      </g>
      <g
         style="fill:#2999ff;fill-opacity:1"
         transform="matrix(-0.03756319,0,0,0.03756319,28.056231,21.693739)"
         id="g5060-0-2">
        <circle
           style="opacity:0.98999999;fill:#2999ff;fill-opacity:1"
           cx="-312"
           cy="610.35999"
           r="19"
           id="circle5046-1-6" />
        <path
           style="opacity:0.98999999;fill:#2999ff;fill-opacity:1"
           inkscape:connector-curvature="0"
           d="m -313.01,448.9 a 161.52,161.52 0 0 0 -160.5,161.46 161.52,161.52 0 0 0 0.0371,0.75 l 25.588,0.19922 a 135.92,135.92 0 0 1 -0.0332,-0.94922 135.92,135.92 0 0 1 135.11,-135.89 l -0.19726,-25.57 z m 0.36133,46.65 a 114.85,114.85 0 0 0 -114.2,114.81 114.85,114.85 0 0 0 0.0547,1.1113 l 18.188,0.14062 a 96.65,96.65 0 0 1 -0.0449,-1.252 96.65,96.65 0 0 1 96.139,-96.633 l -0.14062,-18.182 z m 0.28906,37.461 a 77.372,77.372 0 0 0 -77.008,77.354 77.372,77.372 0 0 0 0.0703,1.4004 l 12.242,0.0957 a 65.111,65.111 0 0 1 -0.0527,-1.4961 65.111,65.111 0 0 1 64.842,-65.102 l -0.0937,-12.252 z m 0.21875,28.275 a 49.087,49.087 0 0 0 -48.941,49.078 49.087,49.087 0 0 0 0.082,1.6191 l 7.7539,0.0605 a 41.309,41.309 0 0 1 -0.0586,-1.6797 41.309,41.309 0 0 1 41.225,-41.305 l -0.0605,-7.7734 z"
           id="path5048-0-4" />
      </g>
      <text
         id="text6398-9-5"
         y="30.227299"
         x="33.28059"
         style="font-style:normal;font-variant:normal;font-weight:normal;font-stretch:normal;font-size:4.23333311px;line-height:1.25;font-family:sans-serif;-inkscape-font-specification:'sans-serif, Normal';font-variant-ligatures:normal;font-variant-caps:normal;font-variant-numeric:normal;font-feature-settings:normal;text-align:start;letter-spacing:0px;word-spacing:0px;writing-mode:lr-tb;text-anchor:start;fill:#000000;fill-opacity:1;stroke:none;stroke-width:0.26458332"
         xml:space="preserve"><tspan
           id="tspan6582-2"
           sodipodi:role="line"
           x="33.28059"
           y="30.227299"
           style="stroke-width:0.26458332">23</tspan></text>
      <text
         id="text6398-9-5-0"
         y="35.396885"
         x="33.339222"
         style="font-style:normal;font-variant:normal;font-weight:normal;font-stretch:normal;font-size:4.23333311px;line-height:1.25;font-family:sans-serif;-inkscape-font-specification:'sans-serif, Normal';font-variant-ligatures:normal;font-variant-caps:normal;font-variant-numeric:normal;font-feature-settings:normal;text-align:start;letter-spacing:0px;word-spacing:0px;writing-mode:lr-tb;text-anchor:start;fill:#000000;fill-opacity:1;stroke:none;stroke-width:0.26458332"
         xml:space="preserve"><tspan
           id="tspan6582-2-2"
           sodipodi:role="line"
           x="33.339222"
           y="35.396885"
           style="stroke-width:0.26458332">45</tspan></text>
      <rect
         transform="rotate(90)"
         rx="0.43752253"
         ry="0"
         y="-161.17926"
         x="62.693867"
         height="115.43713"
         width="0.91671336"
         id="rect1038-6-0-9"
         style="opacity:0.98000004;fill:#000000;fill-opacity:1;stroke:none;stroke-width:0.31428754;stroke-opacity:1" />
      <rect
         rx="0.45836121"
         ry="0"
         y="62.693867"
         x="45.742149"
         height="3.8067057"
         width="0.91672242"
         id="rect1038-35-4-9"
         style="opacity:0.98000004;fill:#000000;fill-opacity:1;stroke:none;stroke-width:0.31428754;stroke-opacity:1" />
      <rect
         rx="0.45836121"
         ry="0"
         y="59.803871"
         x="45.742149"
         height="3.8067057"
         width="0.91672242"
         id="rect1038-62-8-4"
         style="opacity:0.98000004;fill:#000000;fill-opacity:1;stroke:none;stroke-width:0.31428754;stroke-opacity:1" />
      <text
         id="text1139-0-5"
         y="69.593109"
         x="47.567722"
         style="font-style:normal;font-weight:normal;font-size:10.58333302px;line-height:1.25;font-family:sans-serif;letter-spacing:0px;word-spacing:0px;fill:#000000;fill-opacity:1;stroke:none;stroke-width:0.26458332"
         xml:space="preserve"><tspan
           style="font-size:7.05555534px;stroke-width:0.26458332"
           y="69.593109"
           x="47.567722"
           id="tspan1137-4-1"
           sodipodi:role="line">ev distance</tspan></text>
      <rect
         rx="0.45836121"
         ry="0"
         y="62.693871"
         x="160.26254"
         height="3.8067057"
         width="0.91672242"
         id="rect1038-35-4-9-0"
         style="opacity:0.98000004;fill:#000000;fill-opacity:1;stroke:none;stroke-width:0.31428754;stroke-opacity:1" />
      <rect
         rx="0.45836121"
         ry="0"
         y="59.803871"
         x="160.26254"
         height="3.8067057"
         width="0.91672242"
         id="rect1038-62-8-4-3"
         style="opacity:0.98000004;fill:#000000;fill-opacity:1;stroke:none;stroke-width:0.31428754;stroke-opacity:1" />
      <g
         transform="translate(-22.357292,11.575521)"
         id="g11189">
        <rect
           style="opacity:0.98000004;fill:#000000;fill-opacity:1;stroke:none;stroke-width:0.13142917;stroke-opacity:1"
           id="rect1038-6-0-9-7"
           width="0.91671336"
           height="20.187134"
           x="51.124294"
           y="-66.05999"
           ry="0"
           rx="0.43752253"
           transform="rotate(90)" />
        <rect
           style="opacity:0.98000004;fill:#000000;fill-opacity:1;stroke:none;stroke-width:0.31428754;stroke-opacity:1"
           id="rect1038-35-4-9-0-4"
           width="0.91672242"
           height="3.8067057"
           x="82.397972"
           y="-10.387155"
           ry="0"
           rx="0.45836121"
           inkscape:transform-center-x="0.94257663"
           inkscape:transform-center-y="1.0087259"
           transform="rotate(45)" />
        <rect
           style="opacity:0.98000004;fill:#000000;fill-opacity:1;stroke:none;stroke-width:0.31428754;stroke-opacity:1"
           id="rect1038-62-8-4-3-6"
           width="0.91672242"
           height="3.8067057"
           x="9.4704323"
           y="79.507988"
           ry="0"
           rx="0.45836121"
           inkscape:transform-center-x="1.1079444"
           inkscape:transform-center-y="-1.0417992"
           transform="rotate(-45)" />
      </g>
      <text
         id="text1139-0-5-7"
         y="69.593109"
         x="28.94397"
         style="font-style:normal;font-weight:normal;font-size:10.58333302px;line-height:1.25;font-family:sans-serif;letter-spacing:0px;word-spacing:0px;fill:#000000;fill-opacity:1;stroke:none;stroke-width:0.26458332"
         xml:space="preserve"><tspan
           style="font-size:7.05555534px;stroke-width:0.26458332"
           y="69.593109"
           x="28.94397"
           id="tspan1137-4-1-6"
           sodipodi:role="line">vel</tspan></text>
    </g>
  </g>
</svg>
