<?xml version="1.0" encoding="UTF-8"?>

<!-- generated on Sat Apr 24 17:20:06 2021 by Eclipse SUMO Version 1.4.0
<configuration xmlns:xsi="http://www.w3.org/2001/XMLSchema-instance" xsi:noNamespaceSchemaLocation="http://sumo.dlr.de/xsd/sumoConfiguration.xsd">

    <input>
        <net-file value="sumofiles/junction.net.xml"/>
        <route-files value="sumofiles/junction_preemption_350.rou.xml"/>
        <additional-files value="sumofiles/junction.det.xml"/>
    </input>

    <output>
        <tripinfo-output value="sumofiles/output/tripinfo_preemption_350.xml"/>
    </output>

    <time>
        <begin value="0"/>
        <end value="10000"/>
        <step-length value="0.05"/>
    </time>

    <processing>
        <lateral-resolution value="0.1"/>
    </processing>

    <report>
        <no-warnings value="true"/>
        <error-log value="sumofiles/output/errorlog_preemption_350.log"/>
        <no-step-log value="true"/>
    </report>

    <traci_server>
        <remote-port value="57855"/>
    </traci_server>

    <gui_only>
        <gui-settings-file value="sumofiles/junction-gui.settings.xml"/>
        <tracker-interval value="0.05"/>
    </gui_only>

</configuration>
-->

<tripinfos xmlns:xsi="http://www.w3.org/2001/XMLSchema-instance" xsi:noNamespaceSchemaLocation="http://sumo.dlr.de/xsd/tripinfo_file.xsd">
    <tripinfo id="car_n2e_4" depart="4.00" departLane="n2sep_1" departPos="3.60" departPosLat="0.00" departSpeed="13.90" departDelay="0.00" arrival="162.80" arrivalLane="c2e_1" arrivalPos="990.00" arrivalPosLat="0.00" arrivalSpeed="14.73" duration="158.80" routeLength="1996.47" waitingTime="14.75" waitingCount="1" stopTime="0.00" timeLoss="22.65" rerouteNo="1" devices="tripinfo_car_n2e_4 routing_car_n2e_4" vType="Car" speedFactor="1.06" vaporized=""/>
    <tripinfo id="car_s2w_17" depart="17.00" departLane="s2sep_1" departPos="3.60" departPosLat="0.00" departSpeed="13.90" departDelay="0.00" arrival="162.80" arrivalLane="c2w_1" arrivalPos="990.00" arrivalPosLat="0.00" arrivalSpeed="14.73" duration="145.80" routeLength="1996.47" waitingTime="1.75" waitingCount="1" stopTime="0.00" timeLoss="9.65" rerouteNo="1" devices="tripinfo_car_s2w_17 routing_car_s2w_17" vType="Car" speedFactor="1.06" vaporized=""/>
    <tripinfo id="car_s2n_36" depart="36.00" departLane="s2sep_1" departPos="3.60" departPosLat="0.00" departSpeed="13.90" departDelay="0.00" arrival="169.10" arrivalLane="c2n_1" arrivalPos="990.00" arrivalPosLat="0.00" arrivalSpeed="15.05" duration="133.10" routeLength="1997.01" waitingTime="0.00" waitingCount="0" stopTime="0.00" timeLoss="0.39" rerouteNo="1" devices="tripinfo_car_s2n_36 routing_car_s2n_36" vType="Car" speedFactor="1.08" vaporized=""/>
    <tripinfo id="car_n2e_23" depart="23.00" departLane="n2sep_1" departPos="3.60" departPosLat="0.00" departSpeed="13.90" departDelay="0.00" arrival="170.25" arrivalLane="c2e_1" arrivalPos="990.00" arrivalPosLat="0.00" arrivalSpeed="14.04" duration="147.25" routeLength="1996.47" waitingTime="0.00" waitingCount="0" stopTime="0.00" timeLoss="4.40" rerouteNo="1" devices="tripinfo_car_n2e_23 routing_car_n2e_23" vType="Car" speedFactor="1.01" vaporized=""/>
    <tripinfo id="car_n2e_36" depart="36.00" departLane="n2sep_1" departPos="3.60" departPosLat="0.00" departSpeed="13.90" departDelay="0.00" arrival="182.40" arrivalLane="c2e_1" arrivalPos="990.00" arrivalPosLat="0.00" arrivalSpeed="14.04" duration="146.40" routeLength="1996.47" waitingTime="0.00" waitingCount="0" stopTime="0.00" timeLoss="3.53" rerouteNo="1" devices="tripinfo_car_n2e_36 routing_car_n2e_36" vType="Car" speedFactor="1.01" vaporized=""/>
    <tripinfo id="car_s2w_39" depart="39.00" departLane="s2sep_1" departPos="3.60" departPosLat="0.00" departSpeed="13.90" departDelay="0.00" arrival="183.25" arrivalLane="c2w_1" arrivalPos="990.00" arrivalPosLat="0.00" arrivalSpeed="14.32" duration="144.25" routeLength="1996.47" waitingTime="0.00" waitingCount="0" stopTime="0.00" timeLoss="4.15" rerouteNo="1" devices="tripinfo_car_s2w_39 routing_car_s2w_39" vType="Car" speedFactor="1.03" vaporized=""/>
    <tripinfo id="car_n2e_57" depart="57.40" departLane="n2sep_1" departPos="3.60" departPosLat="0.00" departSpeed="13.90" departDelay="0.40" arrival="202.05" arrivalLane="c2e_1" arrivalPos="990.00" arrivalPosLat="0.00" arrivalSpeed="14.55" duration="144.65" routeLength="1996.47" waitingTime="0.00" waitingCount="0" stopTime="0.00" timeLoss="6.82" rerouteNo="1" devices="tripinfo_car_n2e_57 routing_car_n2e_57" vType="Car" speedFactor="1.05" vaporized=""/>
    <tripinfo id="car_w2e_58" depart="58.00" departLane="w2sep_1" departPos="3.60" departPosLat="0.00" departSpeed="13.90" departDelay="0.00" arrival="205.05" arrivalLane="c2e_1" arrivalPos="990.00" arrivalPosLat="0.00" arrivalSpeed="15.50" duration="147.05" routeLength="1997.01" waitingTime="9.25" waitingCount="1" stopTime="0.00" timeLoss="19.07" rerouteNo="1" devices="tripinfo_car_w2e_58 routing_car_w2e_58" vType="Car" speedFactor="1.12" vaporized=""/>
    <tripinfo id="car_e2w_25" depart="25.00" departLane="e2sep_1" departPos="3.60" departPosLat="0.00" departSpeed="13.90" departDelay="0.00" arrival="205.40" arrivalLane="c2w_1" arrivalPos="990.00" arrivalPosLat="0.00" arrivalSpeed="15.05" duration="180.40" routeLength="1997.01" waitingTime="40.20" waitingCount="1" stopTime="0.00" timeLoss="47.71" rerouteNo="1" devices="tripinfo_car_e2w_25 routing_car_e2w_25" vType="Car" speedFactor="1.08" vaporized=""/>
    <tripinfo id="car_e2w_45" depart="45.00" departLane="e2sep_1" departPos="3.60" departPosLat="0.00" departSpeed="13.90" departDelay="0.00" arrival="210.15" arrivalLane="c2w_1" arrivalPos="990.00" arrivalPosLat="0.00" arrivalSpeed="15.15" duration="165.15" routeLength="1997.01" waitingTime="22.45" waitingCount="1" stopTime="0.00" timeLoss="33.42" rerouteNo="1" devices="tripinfo_car_e2w_45 routing_car_e2w_45" vType="Car" speedFactor="1.09" vaporized=""/>
    <tripinfo id="car_e2n_26" depart="26.35" departLane="e2sep_1" departPos="3.60" departPosLat="0.00" departSpeed="13.90" departDelay="0.35" arrival="210.85" arrivalLane="c2n_1" arrivalPos="990.00" arrivalPosLat="0.00" arrivalSpeed="14.32" duration="184.50" routeLength="1986.69" waitingTime="35.00" waitingCount="1" stopTime="0.00" timeLoss="45.09" rerouteNo="1" devices="tripinfo_car_e2n_26 routing_car_e2n_26" vType="Car" speedFactor="1.03" vaporized=""/>
    <tripinfo id="car_w2e_74" depart="74.00" departLane="w2sep_1" departPos="3.60" departPosLat="0.00" departSpeed="13.90" departDelay="0.00" arrival="217.80" arrivalLane="c2e_1" arrivalPos="990.00" arrivalPosLat="0.00" arrivalSpeed="14.04" duration="143.80" routeLength="1997.01" waitingTime="0.00" waitingCount="0" stopTime="0.00" timeLoss="1.54" rerouteNo="1" devices="tripinfo_car_w2e_74 routing_car_w2e_74" vType="Car" speedFactor="1.01" vaporized=""/>
    <tripinfo id="bus_e2w_50" depart="50.00" departLane="e2sep_1" departPos="12.10" departPosLat="0.00" departSpeed="13.90" departDelay="0.00" arrival="219.40" arrivalLane="c2w_1" arrivalPos="990.00" arrivalPosLat="0.00" arrivalSpeed="13.90" duration="169.40" routeLength="1988.51" waitingTime="14.45" waitingCount="1" stopTime="0.00" timeLoss="26.34" rerouteNo="1" devices="tripinfo_bus_e2w_50 routing_bus_e2w_50" vType="Bus" speedFactor="1.00" vaporized=""/>
    <tripinfo id="car_e2n_76" depart="76.00" departLane="e2sep_1" departPos="3.60" departPosLat="0.00" departSpeed="13.90" departDelay="0.00" arrival="219.75" arrivalLane="c2n_1" arrivalPos="990.00" arrivalPosLat="0.00" arrivalSpeed="15.16" duration="143.75" routeLength="1986.69" waitingTime="0.00" waitingCount="0" stopTime="0.00" timeLoss="12.03" rerouteNo="1" devices="tripinfo_car_e2n_76 routing_car_e2n_76" vType="Car" speedFactor="1.09" vaporized=""/>
    <tripinfo id="car_w2e_84" depart="84.00" departLane="w2sep_1" departPos="3.60" departPosLat="0.00" departSpeed="13.90" departDelay="0.00" arrival="220.30" arrivalLane="c2e_1" arrivalPos="990.00" arrivalPosLat="0.00" arrivalSpeed="15.49" duration="136.30" routeLength="1997.01" waitingTime="0.00" waitingCount="0" stopTime="0.00" timeLoss="9.32" rerouteNo="1" devices="tripinfo_car_w2e_84 routing_car_w2e_84" vType="Car" speedFactor="1.13" vaporized=""/>
    <tripinfo id="car_e2n_90" depart="90.00" departLane="e2sep_1" departPos="3.60" departPosLat="0.00" departSpeed="13.90" departDelay="0.00" arrival="222.50" arrivalLane="c2n_1" arrivalPos="990.00" arrivalPosLat="0.00" arrivalSpeed="15.89" duration="132.50" routeLength="1986.69" waitingTime="0.00" waitingCount="0" stopTime="0.00" timeLoss="8.04" rerouteNo="1" devices="tripinfo_car_e2n_90 routing_car_e2n_90" vType="Car" speedFactor="1.15" vaporized=""/>
    <tripinfo id="car_e2w_59" depart="59.00" departLane="e2sep_1" departPos="3.60" departPosLat="0.00" departSpeed="13.90" departDelay="0.00" arrival="224.15" arrivalLane="c2w_1" arrivalPos="990.00" arrivalPosLat="0.00" arrivalSpeed="13.89" duration="165.15" routeLength="1997.01" waitingTime="6.35" waitingCount="1" stopTime="0.00" timeLoss="21.48" rerouteNo="1" devices="tripinfo_car_e2w_59 routing_car_e2w_59" vType="Car" speedFactor="1.00" vaporized=""/>
    <tripinfo id="car_e2w_67" depart="67.00" departLane="e2sep_1" departPos="3.60" departPosLat="0.00" departSpeed="13.90" departDelay="0.00" arrival="227.60" arrivalLane="c2w_1" arrivalPos="990.00" arrivalPosLat="0.00" arrivalSpeed="13.87" duration="160.60" routeLength="1997.01" waitingTime="0.00" waitingCount="0" stopTime="0.00" timeLoss="16.91" rerouteNo="1" devices="tripinfo_car_e2w_67 routing_car_e2w_67" vType="Car" speedFactor="1.00" vaporized=""/>
    <tripinfo id="car_w2n_28" depart="28.00" departLane="w2sep_1" departPos="3.60" departPosLat="0.00" departSpeed="13.90" departDelay="0.00" arrival="232.25" arrivalLane="c2n_1" arrivalPos="990.00" arrivalPosLat="0.00" arrivalSpeed="13.90" duration="204.25" routeLength="1996.47" waitingTime="48.75" waitingCount="2" stopTime="0.00" timeLoss="59.93" rerouteNo="1" devices="tripinfo_car_w2n_28 routing_car_w2n_28" vType="Car" speedFactor="1.00" vaporized=""/>
    <tripinfo id="car_w2n_32" depart="32.00" departLane="w2sep_1" departPos="3.60" departPosLat="0.00" departSpeed="13.90" departDelay="0.00" arrival="235.20" arrivalLane="c2n_1" arrivalPos="990.00" arrivalPosLat="0.00" arrivalSpeed="14.45" duration="203.20" routeLength="1996.47" waitingTime="45.85" waitingCount="2" stopTime="0.00" timeLoss="65.17" rerouteNo="1" devices="tripinfo_car_w2n_32 routing_car_w2n_32" vType="Car" speedFactor="1.05" vaporized=""/>
    <tripinfo id="car_w2n_70" depart="70.00" departLane="w2sep_1" departPos="3.60" departPosLat="0.00" departSpeed="13.90" departDelay="0.00" arrival="239.25" arrivalLane="c2n_1" arrivalPos="990.00" arrivalPosLat="0.00" arrivalSpeed="13.89" duration="169.25" routeLength="1996.47" waitingTime="11.25" waitingCount="1" stopTime="0.00" timeLoss="24.90" rerouteNo="1" devices="tripinfo_car_w2n_70 routing_car_w2n_70" vType="Car" speedFactor="1.00" vaporized=""/>
    <tripinfo id="car_w2n_81" depart="81.00" departLane="w2sep_1" departPos="3.60" departPosLat="0.00" departSpeed="13.90" departDelay="0.00" arrival="242.65" arrivalLane="c2n_1" arrivalPos="990.00" arrivalPosLat="0.00" arrivalSpeed="13.86" duration="161.65" routeLength="1996.47" waitingTime="4.10" waitingCount="1" stopTime="0.00" timeLoss="17.32" rerouteNo="1" devices="tripinfo_car_w2n_81 routing_car_w2n_81" vType="Car" speedFactor="1.00" vaporized=""/>
    <tripinfo id="bus_w2n_87" depart="87.00" departLane="w2sep_1" departPos="12.10" departPosLat="0.00" departSpeed="13.90" departDelay="0.00" arrival="246.20" arrivalLane="c2n_1" arrivalPos="990.00" arrivalPosLat="0.00" arrivalSpeed="13.77" duration="159.20" routeLength="1987.97" waitingTime="0.00" waitingCount="0" stopTime="0.00" timeLoss="15.47" rerouteNo="1" devices="tripinfo_bus_w2n_87 routing_bus_w2n_87" vType="Bus" speedFactor="1.00" vaporized=""/>
    <tripinfo id="car_w2n_95" depart="95.00" departLane="w2sep_1" departPos="3.60" departPosLat="0.00" departSpeed="13.90" departDelay="0.00" arrival="249.95" arrivalLane="c2n_1" arrivalPos="990.00" arrivalPosLat="0.00" arrivalSpeed="13.94" duration="154.95" routeLength="1996.47" waitingTime="0.00" waitingCount="0" stopTime="0.00" timeLoss="11.37" rerouteNo="1" devices="tripinfo_car_w2n_95 routing_car_w2n_95" vType="Car" speedFactor="1.01" vaporized=""/>
    <tripinfo id="car_n2w_56" depart="56.00" departLane="n2sep_1" departPos="3.60" departPosLat="0.00" departSpeed="13.90" departDelay="0.00" arrival="253.85" arrivalLane="c2w_1" arrivalPos="990.00" arrivalPosLat="0.00" arrivalSpeed="14.27" duration="197.85" routeLength="1986.69" waitingTime="51.00" waitingCount="1" stopTime="0.00" timeLoss="57.87" rerouteNo="1" devices="tripinfo_car_n2w_56 routing_car_n2w_56" vType="Car" speedFactor="1.03" vaporized=""/>
    <tripinfo id="car_n2s_60" depart="60.00" departLane="n2sep_1" departPos="3.60" departPosLat="0.00" departSpeed="13.90" departDelay="0.00" arrival="254.75" arrivalLane="c2s_1" arrivalPos="990.00" arrivalPosLat="0.00" arrivalSpeed="14.54" duration="194.75" routeLength="1997.01" waitingTime="45.25" waitingCount="1" stopTime="0.00" timeLoss="57.34" rerouteNo="1" devices="tripinfo_car_n2s_60 routing_car_n2s_60" vType="Car" speedFactor="1.05" vaporized=""/>
    <tripinfo id="car_s2n_69" depart="69.00" departLane="s2sep_1" departPos="3.60" departPosLat="0.00" departSpeed="13.90" departDelay="0.00" arrival="256.25" arrivalLane="c2n_1" arrivalPos="990.00" arrivalPosLat="0.00" arrivalSpeed="13.90" duration="187.25" routeLength="1997.01" waitingTime="36.00" waitingCount="1" stopTime="0.00" timeLoss="43.54" rerouteNo="1" devices="tripinfo_car_s2n_69 routing_car_s2n_69" vType="Car" speedFactor="1.00" vaporized=""/>
    <tripinfo id="car_s2n_80" depart="80.00" departLane="s2sep_1" departPos="3.60" departPosLat="0.00" departSpeed="13.90" departDelay="0.00" arrival="258.30" arrivalLane="c2n_1" arrivalPos="990.00" arrivalPosLat="0.00" arrivalSpeed="15.10" duration="178.30" routeLength="1997.01" waitingTime="29.25" waitingCount="1" stopTime="0.00" timeLoss="50.32" rerouteNo="1" devices="tripinfo_car_s2n_80 routing_car_s2n_80" vType="Car" speedFactor="1.12" vaporized=""/>
    <tripinfo id="car_n2s_70" depart="71.25" departLane="n2sep_1" departPos="3.60" departPosLat="0.00" departSpeed="13.90" departDelay="1.25" arrival="260.25" arrivalLane="c2s_1" arrivalPos="990.00" arrivalPosLat="0.00" arrivalSpeed="14.15" duration="189.00" routeLength="1997.01" waitingTime="36.05" waitingCount="1" stopTime="0.00" timeLoss="47.84" rerouteNo="1" devices="tripinfo_car_n2s_70 routing_car_n2s_70" vType="Car" speedFactor="1.02" vaporized=""/>
    <tripinfo id="car_s2n_82" depart="82.00" departLane="s2sep_1" departPos="3.60" departPosLat="0.00" departSpeed="13.90" departDelay="0.00" arrival="262.45" arrivalLane="c2n_1" arrivalPos="990.00" arrivalPosLat="0.00" arrivalSpeed="13.89" duration="180.45" routeLength="1997.01" waitingTime="24.10" waitingCount="1" stopTime="0.00" timeLoss="36.75" rerouteNo="1" devices="tripinfo_car_s2n_82 routing_car_s2n_82" vType="Car" speedFactor="1.00" vaporized=""/>
    <tripinfo id="car_n2s_77" depart="77.00" departLane="n2sep_1" departPos="3.60" departPosLat="0.00" departSpeed="13.90" departDelay="0.00" arrival="263.25" arrivalLane="c2s_1" arrivalPos="990.00" arrivalPosLat="0.00" arrivalSpeed="14.48" duration="186.25" routeLength="1997.01" waitingTime="33.50" waitingCount="1" stopTime="0.00" timeLoss="49.03" rerouteNo="1" devices="tripinfo_car_n2s_77 routing_car_n2s_77" vType="Car" speedFactor="1.05" vaporized=""/>
    <tripinfo id="car_n2w_88" depart="88.00" departLane="n2sep_1" departPos="3.60" departPosLat="0.00" departSpeed="13.90" departDelay="0.00" arrival="264.65" arrivalLane="c2w_1" arrivalPos="990.00" arrivalPosLat="0.00" arrivalSpeed="13.90" duration="176.65" routeLength="1986.69" waitingTime="21.50" waitingCount="1" stopTime="0.00" timeLoss="32.98" rerouteNo="1" devices="tripinfo_car_n2w_88 routing_car_n2w_88" vType="Car" speedFactor="1.00" vaporized=""/>
    <tripinfo id="car_s2e_120" depart="120.00" departLane="s2sep_1" departPos="3.60" departPosLat="0.00" departSpeed="13.90" departDelay="0.00" arrival="265.05" arrivalLane="c2e_1" arrivalPos="990.00" arrivalPosLat="0.00" arrivalSpeed="14.15" duration="145.05" routeLength="1986.69" waitingTime="0.00" waitingCount="0" stopTime="0.00" timeLoss="3.95" rerouteNo="1" devices="tripinfo_car_s2e_120 routing_car_s2e_120" vType="Car" speedFactor="1.02" vaporized=""/>
    <tripinfo id="car_n2s_88" depart="89.45" departLane="n2sep_1" departPos="3.60" departPosLat="0.00" departSpeed="13.90" departDelay="1.45" arrival="265.10" arrivalLane="c2s_1" arrivalPos="990.00" arrivalPosLat="0.00" arrivalSpeed="15.58" duration="175.65" routeLength="1997.01" waitingTime="20.95" waitingCount="1" stopTime="0.00" timeLoss="53.75" rerouteNo="1" devices="tripinfo_car_n2s_88 routing_car_n2s_88" vType="Car" speedFactor="1.18" vaporized=""/>
    <tripinfo id="car_n2s_115" depart="115.00" departLane="n2sep_1" departPos="3.60" departPosLat="0.00" departSpeed="13.90" departDelay="0.00" arrival="267.10" arrivalLane="c2s_1" arrivalPos="990.00" arrivalPosLat="0.00" arrivalSpeed="15.54" duration="152.10" routeLength="1997.01" waitingTime="5.90" waitingCount="1" stopTime="0.00" timeLoss="28.04" rerouteNo="1" devices="tripinfo_car_n2s_115 routing_car_n2s_115" vType="Car" speedFactor="1.16" vaporized=""/>
    <tripinfo id="car_n2w_128" depart="128.00" departLane="n2sep_1" departPos="3.60" departPosLat="0.00" departSpeed="13.90" departDelay="0.00" arrival="271.05" arrivalLane="c2w_1" arrivalPos="990.00" arrivalPosLat="0.00" arrivalSpeed="14.42" duration="143.05" routeLength="1986.69" waitingTime="0.00" waitingCount="0" stopTime="0.00" timeLoss="4.64" rerouteNo="1" devices="tripinfo_car_n2w_128 routing_car_n2w_128" vType="Car" speedFactor="1.04" vaporized=""/>
    <tripinfo id="bus_s2e_120" depart="122.00" departLane="s2sep_1" departPos="12.10" departPosLat="0.00" departSpeed="13.90" departDelay="2.00" arrival="273.25" arrivalLane="c2e_1" arrivalPos="990.00" arrivalPosLat="0.00" arrivalSpeed="13.90" duration="151.25" routeLength="1978.19" waitingTime="0.00" waitingCount="0" stopTime="0.00" timeLoss="8.21" rerouteNo="1" devices="tripinfo_bus_s2e_120 routing_bus_s2e_120" vType="Bus" speedFactor="1.00" vaporized=""/>
    <tripinfo id="car_s2e_129" depart="129.00" departLane="s2sep_1" departPos="3.60" departPosLat="0.00" departSpeed="13.90" departDelay="0.00" arrival="277.90" arrivalLane="c2e_1" arrivalPos="990.00" arrivalPosLat="0.00" arrivalSpeed="14.03" duration="148.90" routeLength="1986.69" waitingTime="0.00" waitingCount="0" stopTime="0.00" timeLoss="6.65" rerouteNo="1" devices="tripinfo_car_s2e_129 routing_car_s2e_129" vType="Car" speedFactor="1.01" vaporized=""/>
    <tripinfo id="car_n2e_70" depart="70.00" departLane="n2sep_1" departPos="3.60" departPosLat="0.00" departSpeed="13.90" departDelay="0.00" arrival="279.75" arrivalLane="c2e_1" arrivalPos="990.00" arrivalPosLat="0.00" arrivalSpeed="15.33" duration="209.75" routeLength="1996.47" waitingTime="61.95" waitingCount="2" stopTime="0.00" timeLoss="85.15" rerouteNo="1" devices="tripinfo_car_n2e_70 routing_car_n2e_70" vType="Car" speedFactor="1.16" vaporized=""/>
    <tripinfo id="car_n2w_133" depart="133.00" departLane="n2sep_1" departPos="3.60" departPosLat="0.00" departSpeed="13.90" departDelay="0.00" arrival="280.95" arrivalLane="c2w_1" arrivalPos="990.00" arrivalPosLat="0.00" arrivalSpeed="13.90" duration="147.95" routeLength="1986.69" waitingTime="0.00" waitingCount="0" stopTime="0.00" timeLoss="4.29" rerouteNo="1" devices="tripinfo_car_n2w_133 routing_car_n2w_133" vType="Car" speedFactor="1.00" vaporized=""/>
    <tripinfo id="car_n2e_99" depart="99.00" departLane="n2sep_1" departPos="3.60" departPosLat="0.00" departSpeed="13.90" departDelay="0.00" arrival="281.65" arrivalLane="c2e_1" arrivalPos="990.00" arrivalPosLat="0.00" arrivalSpeed="15.56" duration="182.65" routeLength="1996.47" waitingTime="32.95" waitingCount="2" stopTime="0.00" timeLoss="59.48" rerouteNo="1" devices="tripinfo_car_n2e_99 routing_car_n2e_99" vType="Car" speedFactor="1.17" vaporized=""/>
    <tripinfo id="car_s2w_76" depart="76.00" departLane="s2sep_1" departPos="3.60" departPosLat="0.00" departSpeed="13.90" departDelay="0.00" arrival="284.55" arrivalLane="c2w_1" arrivalPos="990.00" arrivalPosLat="0.00" arrivalSpeed="14.23" duration="208.55" routeLength="1996.47" waitingTime="54.00" waitingCount="3" stopTime="0.00" timeLoss="67.90" rerouteNo="1" devices="tripinfo_car_s2w_76 routing_car_s2w_76" vType="Car" speedFactor="1.03" vaporized=""/>
    <tripinfo id="car_e2w_114" depart="114.00" departLane="e2sep_1" departPos="3.60" departPosLat="0.00" departSpeed="13.90" departDelay="0.00" arrival="294.45" arrivalLane="c2w_1" arrivalPos="990.00" arrivalPosLat="0.00" arrivalSpeed="15.32" duration="180.45" routeLength="1997.01" waitingTime="42.30" waitingCount="1" stopTime="0.00" timeLoss="50.08" rerouteNo="1" devices="tripinfo_car_e2w_114 routing_car_e2w_114" vType="Car" speedFactor="1.10" vaporized=""/>
    <tripinfo id="car_e2w_129" depart="129.00" departLane="e2sep_1" departPos="3.60" departPosLat="0.00" departSpeed="13.90" departDelay="0.00" arrival="299.05" arrivalLane="c2w_1" arrivalPos="990.00" arrivalPosLat="0.00" arrivalSpeed="15.11" duration="170.05" routeLength="1997.01" waitingTime="27.20" waitingCount="1" stopTime="0.00" timeLoss="37.98" rerouteNo="1" devices="tripinfo_car_e2w_129 routing_car_e2w_129" vType="Car" speedFactor="1.09" vaporized=""/>
    <tripinfo id="car_w2e_102" depart="102.00" departLane="w2sep_1" departPos="3.60" departPosLat="0.00" departSpeed="13.90" departDelay="0.00" arrival="300.75" arrivalLane="c2e_1" arrivalPos="990.00" arrivalPosLat="0.00" arrivalSpeed="13.90" duration="198.75" routeLength="1997.01" waitingTime="47.90" waitingCount="1" stopTime="0.00" timeLoss="55.06" rerouteNo="1" devices="tripinfo_car_w2e_102 routing_car_w2e_102" vType="Car" speedFactor="1.00" vaporized=""/>
    <tripinfo id="car_w2e_104" depart="104.00" departLane="w2sep_1" departPos="3.60" departPosLat="0.00" departSpeed="13.90" departDelay="0.00" arrival="304.40" arrivalLane="c2e_1" arrivalPos="990.00" arrivalPosLat="0.00" arrivalSpeed="14.15" duration="200.40" routeLength="1997.01" waitingTime="45.45" waitingCount="1" stopTime="0.00" timeLoss="59.49" rerouteNo="1" devices="tripinfo_car_w2e_104 routing_car_w2e_104" vType="Car" speedFactor="1.02" vaporized=""/>
    <tripinfo id="car_w2s_105" depart="105.65" departLane="w2sep_1" departPos="3.60" departPosLat="0.00" departSpeed="13.90" departDelay="0.65" arrival="305.15" arrivalLane="c2s_1" arrivalPos="990.00" arrivalPosLat="0.00" arrivalSpeed="13.90" duration="199.50" routeLength="1986.69" waitingTime="43.00" waitingCount="1" stopTime="0.00" timeLoss="55.84" rerouteNo="1" devices="tripinfo_car_w2s_105 routing_car_w2s_105" vType="Car" speedFactor="1.00" vaporized=""/>
    <tripinfo id="bus_e2n_133" depart="133.00" departLane="e2sep_1" departPos="12.10" departPosLat="0.00" departSpeed="13.90" departDelay="0.00" arrival="308.40" arrivalLane="c2n_1" arrivalPos="990.00" arrivalPosLat="0.00" arrivalSpeed="13.90" duration="175.40" routeLength="1978.19" waitingTime="20.10" waitingCount="1" stopTime="0.00" timeLoss="32.34" rerouteNo="1" devices="tripinfo_bus_e2n_133 routing_bus_e2n_133" vType="Bus" speedFactor="1.00" vaporized=""/>
    <tripinfo id="car_w2s_116" depart="116.00" departLane="w2sep_1" departPos="3.60" departPosLat="0.00" departSpeed="13.90" departDelay="0.00" arrival="308.55" arrivalLane="c2s_1" arrivalPos="990.00" arrivalPosLat="0.00" arrivalSpeed="14.28" duration="192.55" routeLength="1986.69" waitingTime="38.40" waitingCount="1" stopTime="0.00" timeLoss="53.12" rerouteNo="1" devices="tripinfo_car_w2s_116 routing_car_w2s_116" vType="Car" speedFactor="1.03" vaporized=""/>
    <tripinfo id="car_w2s_157" depart="157.00" departLane="w2sep_1" departPos="3.60" departPosLat="0.00" departSpeed="13.90" departDelay="0.00" arrival="310.85" arrivalLane="c2s_1" arrivalPos="990.00" arrivalPosLat="0.00" arrivalSpeed="14.94" duration="153.85" routeLength="1986.69" waitingTime="3.10" waitingCount="1" stopTime="0.00" timeLoss="22.73" rerouteNo="1" devices="tripinfo_car_w2s_157 routing_car_w2s_157" vType="Car" speedFactor="1.10" vaporized=""/>
    <tripinfo id="car_e2n_135" depart="135.00" departLane="e2sep_1" departPos="3.60" departPosLat="0.00" departSpeed="13.90" departDelay="0.00" arrival="313.30" arrivalLane="c2n_1" arrivalPos="990.00" arrivalPosLat="0.00" arrivalSpeed="13.89" duration="178.30" routeLength="1986.69" waitingTime="17.10" waitingCount="1" stopTime="0.00" timeLoss="34.65" rerouteNo="1" devices="tripinfo_car_e2n_135 routing_car_e2n_135" vType="Car" speedFactor="1.00" vaporized=""/>
    <tripinfo id="bus_e2w_139" depart="139.00" departLane="e2sep_1" departPos="12.10" departPosLat="0.00" departSpeed="13.90" departDelay="0.00" arrival="313.80" arrivalLane="c2w_1" arrivalPos="990.00" arrivalPosLat="0.00" arrivalSpeed="13.90" duration="174.80" routeLength="1988.51" waitingTime="16.00" waitingCount="1" stopTime="0.00" timeLoss="31.70" rerouteNo="1" devices="tripinfo_bus_e2w_139 routing_bus_e2w_139" vType="Bus" speedFactor="1.00" vaporized=""/>
    <tripinfo id="car_e2w_145" depart="145.00" departLane="e2sep_1" departPos="3.60" departPosLat="0.00" departSpeed="13.90" departDelay="0.00" arrival="318.65" arrivalLane="c2w_1" arrivalPos="990.00" arrivalPosLat="0.00" arrivalSpeed="13.89" duration="173.65" routeLength="1997.01" waitingTime="12.15" waitingCount="1" stopTime="0.00" timeLoss="29.94" rerouteNo="1" devices="tripinfo_car_e2w_145 routing_car_e2w_145" vType="Car" speedFactor="1.00" vaporized=""/>
    <tripinfo id="car_e2w_181" depart="181.00" departLane="e2sep_1" departPos="3.60" departPosLat="0.00" departSpeed="13.90" departDelay="0.00" arrival="320.60" arrivalLane="c2w_1" arrivalPos="990.00" arrivalPosLat="0.00" arrivalSpeed="15.11" duration="139.60" routeLength="1997.01" waitingTime="0.00" waitingCount="0" stopTime="0.00" timeLoss="12.63" rerouteNo="1" devices="tripinfo_car_e2w_181 routing_car_e2w_181" vType="Car" speedFactor="1.13" vaporized=""/>
    <tripinfo id="car_e2n_181" depart="182.25" departLane="e2sep_1" departPos="3.60" departPosLat="0.00" departSpeed="13.90" departDelay="1.25" arrival="320.95" arrivalLane="c2n_1" arrivalPos="990.00" arrivalPosLat="0.00" arrivalSpeed="15.05" duration="138.70" routeLength="1986.69" waitingTime="0.00" waitingCount="0" stopTime="0.00" timeLoss="5.97" rerouteNo="1" devices="tripinfo_car_e2n_181 routing_car_e2n_181" vType="Car" speedFactor="1.08" vaporized=""/>
    <tripinfo id="car_e2w_190" depart="190.00" departLane="e2sep_1" departPos="3.60" departPosLat="0.00" departSpeed="13.90" departDelay="0.00" arrival="322.45" arrivalLane="c2w_1" arrivalPos="990.00" arrivalPosLat="0.00" arrivalSpeed="15.56" duration="132.45" routeLength="1997.01" waitingTime="0.00" waitingCount="0" stopTime="0.00" timeLoss="10.51" rerouteNo="1" devices="tripinfo_car_e2w_190 routing_car_e2w_190" vType="Car" speedFactor="1.18" vaporized=""/>
    <tripinfo id="car_w2n_110" depart="110.00" departLane="w2sep_1" departPos="3.60" departPosLat="0.00" departSpeed="13.90" departDelay="0.00" arrival="323.30" arrivalLane="c2n_1" arrivalPos="990.00" arrivalPosLat="0.00" arrivalSpeed="16.09" duration="213.30" routeLength="1996.47" waitingTime="64.90" waitingCount="3" stopTime="0.00" timeLoss="90.96" rerouteNo="1" devices="tripinfo_car_w2n_110 routing_car_w2n_110" vType="Car" speedFactor="1.18" vaporized=""/>
    <tripinfo id="car_w2n_124" depart="124.00" departLane="w2sep_1" departPos="3.60" departPosLat="0.00" departSpeed="13.90" departDelay="0.00" arrival="328.20" arrivalLane="c2n_1" arrivalPos="990.00" arrivalPosLat="0.00" arrivalSpeed="15.17" duration="204.20" routeLength="1996.47" waitingTime="56.25" waitingCount="2" stopTime="0.00" timeLoss="72.05" rerouteNo="1" devices="tripinfo_car_w2n_124 routing_car_w2n_124" vType="Car" speedFactor="1.09" vaporized=""/>
    <tripinfo id="car_w2n_129" depart="129.00" departLane="w2sep_1" departPos="3.60" departPosLat="0.00" departSpeed="13.90" departDelay="0.00" arrival="333.75" arrivalLane="c2n_1" arrivalPos="990.00" arrivalPosLat="0.00" arrivalSpeed="14.50" duration="204.75" routeLength="1996.47" waitingTime="47.50" waitingCount="2" stopTime="0.00" timeLoss="66.43" rerouteNo="1" devices="tripinfo_car_w2n_129 routing_car_w2n_129" vType="Car" speedFactor="1.04" vaporized=""/>
    <tripinfo id="car_w2n_149" depart="149.00" departLane="w2sep_1" departPos="3.60" departPosLat="0.00" departSpeed="13.90" departDelay="0.00" arrival="335.80" arrivalLane="c2n_1" arrivalPos="990.00" arrivalPosLat="0.00" arrivalSpeed="15.70" duration="186.80" routeLength="1996.47" waitingTime="35.00" waitingCount="2" stopTime="0.00" timeLoss="63.31" rerouteNo="1" devices="tripinfo_car_w2n_149 routing_car_w2n_149" vType="Car" speedFactor="1.17" vaporized=""/>
    <tripinfo id="car_n2w_182" depart="182.00" departLane="n2sep_1" departPos="3.60" departPosLat="0.00" departSpeed="13.90" departDelay="0.00" arrival="340.55" arrivalLane="c2w_1" arrivalPos="990.00" arrivalPosLat="0.00" arrivalSpeed="15.56" duration="158.55" routeLength="1986.69" waitingTime="20.55" waitingCount="1" stopTime="0.00" timeLoss="30.20" rerouteNo="1" devices="tripinfo_car_n2w_182 routing_car_n2w_182" vType="Car" speedFactor="1.12" vaporized=""/>
    <tripinfo id="car_w2n_167" depart="167.00" departLane="w2sep_1" departPos="3.60" departPosLat="0.00" departSpeed="13.90" departDelay="0.00" arrival="341.35" arrivalLane="c2n_1" arrivalPos="990.00" arrivalPosLat="0.00" arrivalSpeed="13.94" duration="174.35" routeLength="1996.47" waitingTime="18.40" waitingCount="1" stopTime="0.00" timeLoss="30.45" rerouteNo="1" devices="tripinfo_car_w2n_167 routing_car_w2n_167" vType="Car" speedFactor="1.00" vaporized=""/>
    <tripinfo id="car_w2n_179" depart="179.00" departLane="w2sep_1" departPos="3.60" departPosLat="0.00" departSpeed="13.90" departDelay="0.00" arrival="343.30" arrivalLane="c2n_1" arrivalPos="990.00" arrivalPosLat="0.00" arrivalSpeed="15.24" duration="164.30" routeLength="1996.47" waitingTime="15.60" waitingCount="1" stopTime="0.00" timeLoss="37.96" rerouteNo="1" devices="tripinfo_car_w2n_179 routing_car_w2n_179" vType="Car" speedFactor="1.14" vaporized=""/>
    <tripinfo id="car_n2s_146" depart="146.00" departLane="n2sep_1" departPos="3.60" departPosLat="0.00" departSpeed="13.90" departDelay="0.00" arrival="345.70" arrivalLane="c2s_1" arrivalPos="990.00" arrivalPosLat="0.00" arrivalSpeed="13.90" duration="199.70" routeLength="1997.01" waitingTime="49.25" waitingCount="1" stopTime="0.00" timeLoss="56.02" rerouteNo="1" devices="tripinfo_car_n2s_146 routing_car_n2s_146" vType="Car" speedFactor="1.00" vaporized=""/>
    <tripinfo id="car_s2n_154" depart="154.00" departLane="s2sep_1" departPos="3.60" departPosLat="0.00" departSpeed="13.90" departDelay="0.00" arrival="346.95" arrivalLane="c2n_1" arrivalPos="990.00" arrivalPosLat="0.00" arrivalSpeed="14.11" duration="192.95" routeLength="1997.01" waitingTime="42.20" waitingCount="1" stopTime="0.00" timeLoss="51.65" rerouteNo="1" devices="tripinfo_car_s2n_154 routing_car_s2n_154" vType="Car" speedFactor="1.02" vaporized=""/>
    <tripinfo id="car_n2e_171" depart="171.00" departLane="n2sep_1" departPos="3.60" departPosLat="0.00" departSpeed="13.90" departDelay="0.00" arrival="347.75" arrivalLane="c2e_1" arrivalPos="990.00" arrivalPosLat="0.00" arrivalSpeed="13.90" duration="176.75" routeLength="1996.47" waitingTime="24.00" waitingCount="1" stopTime="0.00" timeLoss="32.45" rerouteNo="1" devices="tripinfo_car_n2e_171 routing_car_n2e_171" vType="Car" speedFactor="1.00" vaporized=""/>
    <tripinfo id="car_n2w_201" depart="201.00" departLane="n2sep_1" departPos="3.60" departPosLat="0.00" departSpeed="13.90" departDelay="0.00" arrival="350.75" arrivalLane="c2w_1" arrivalPos="990.00" arrivalPosLat="0.00" arrivalSpeed="13.90" duration="149.75" routeLength="1986.69" waitingTime="0.00" waitingCount="0" stopTime="0.00" timeLoss="6.11" rerouteNo="1" devices="tripinfo_car_n2w_201 routing_car_n2w_201" vType="Car" speedFactor="1.00" vaporized=""/>
    <tripinfo id="car_n2e_183" depart="183.30" departLane="n2sep_1" departPos="3.60" departPosLat="0.00" departSpeed="13.90" departDelay="0.30" arrival="351.60" arrivalLane="c2e_1" arrivalPos="990.00" arrivalPosLat="0.00" arrivalSpeed="14.10" duration="168.30" routeLength="1996.47" waitingTime="12.55" waitingCount="1" stopTime="0.00" timeLoss="26.19" rerouteNo="1" devices="tripinfo_car_n2e_183 routing_car_n2e_183" vType="Car" speedFactor="1.02" vaporized=""/>
    <tripinfo id="car_n2e_196" depart="196.00" departLane="n2sep_1" departPos="3.60" departPosLat="0.00" departSpeed="13.90" departDelay="0.00" arrival="353.45" arrivalLane="c2e_1" arrivalPos="990.00" arrivalPosLat="0.00" arrivalSpeed="15.45" duration="157.45" routeLength="1996.47" waitingTime="10.45" waitingCount="1" stopTime="0.00" timeLoss="34.25" rerouteNo="1" devices="tripinfo_car_n2e_196 routing_car_n2e_196" vType="Car" speedFactor="1.17" vaporized=""/>
    <tripinfo id="car_s2w_167" depart="167.00" departLane="s2sep_1" departPos="3.60" departPosLat="0.00" departSpeed="13.90" departDelay="0.00" arrival="355.25" arrivalLane="c2w_1" arrivalPos="990.00" arrivalPosLat="0.00" arrivalSpeed="13.89" duration="188.25" routeLength="1996.47" waitingTime="31.20" waitingCount="2" stopTime="0.00" timeLoss="43.93" rerouteNo="1" devices="tripinfo_car_s2w_167 routing_car_s2w_167" vType="Car" speedFactor="1.00" vaporized=""/>
    <tripinfo id="car_s2e_210" depart="210.45" departLane="s2sep_1" departPos="3.60" departPosLat="0.00" departSpeed="13.90" departDelay="0.45" arrival="356.45" arrivalLane="c2e_1" arrivalPos="990.00" arrivalPosLat="0.00" arrivalSpeed="14.60" duration="146.00" routeLength="1986.69" waitingTime="0.00" waitingCount="0" stopTime="0.00" timeLoss="9.89" rerouteNo="1" devices="tripinfo_car_s2e_210 routing_car_s2e_210" vType="Car" speedFactor="1.06" vaporized=""/>
    <tripinfo id="car_s2n_214" depart="214.45" departLane="s2sep_1" departPos="3.60" departPosLat="0.00" departSpeed="13.90" departDelay="0.45" arrival="358.25" arrivalLane="c2n_1" arrivalPos="990.00" arrivalPosLat="0.00" arrivalSpeed="14.35" duration="143.80" routeLength="1997.01" waitingTime="0.00" waitingCount="0" stopTime="0.00" timeLoss="4.65" rerouteNo="1" devices="tripinfo_car_s2n_214 routing_car_s2n_214" vType="Car" speedFactor="1.03" vaporized=""/>
    <tripinfo id="car_s2w_179" depart="179.00" departLane="s2sep_1" departPos="3.60" departPosLat="0.00" departSpeed="13.90" departDelay="0.00" arrival="358.30" arrivalLane="c2w_1" arrivalPos="990.00" arrivalPosLat="0.00" arrivalSpeed="14.16" duration="179.30" routeLength="1996.47" waitingTime="20.60" waitingCount="2" stopTime="0.00" timeLoss="38.28" rerouteNo="1" devices="tripinfo_car_s2w_179 routing_car_s2w_179" vType="Car" speedFactor="1.02" vaporized=""/>
    <tripinfo id="car_n2s_227" depart="227.00" departLane="n2sep_1" departPos="3.60" departPosLat="0.00" departSpeed="13.90" departDelay="0.00" arrival="359.85" arrivalLane="c2s_1" arrivalPos="990.00" arrivalPosLat="0.00" arrivalSpeed="15.11" duration="132.85" routeLength="1997.01" waitingTime="0.00" waitingCount="0" stopTime="0.00" timeLoss="0.66" rerouteNo="1" devices="tripinfo_car_n2s_227 routing_car_n2s_227" vType="Car" speedFactor="1.09" vaporized=""/>
    <tripinfo id="car_s2w_190" depart="190.00" departLane="s2sep_1" departPos="3.60" departPosLat="0.00" departSpeed="13.90" departDelay="0.00" arrival="360.15" arrivalLane="c2w_1" arrivalPos="990.00" arrivalPosLat="0.00" arrivalSpeed="15.27" duration="170.15" routeLength="1996.47" waitingTime="15.70" waitingCount="1" stopTime="0.00" timeLoss="45.14" rerouteNo="1" devices="tripinfo_car_s2w_190 routing_car_s2w_190" vType="Car" speedFactor="1.15" vaporized=""/>
    <tripinfo id="car_s2w_199" depart="199.00" departLane="s2sep_1" departPos="3.60" departPosLat="0.00" departSpeed="13.90" departDelay="0.00" arrival="362.85" arrivalLane="c2w_1" arrivalPos="990.00" arrivalPosLat="0.00" arrivalSpeed="14.35" duration="163.85" routeLength="1996.47" waitingTime="1.75" waitingCount="1" stopTime="0.00" timeLoss="25.08" rerouteNo="1" devices="tripinfo_car_s2w_199 routing_car_s2w_199" vType="Car" speedFactor="1.04" vaporized=""/>
    <tripinfo id="car_s2w_209" depart="209.00" departLane="s2sep_1" departPos="3.60" departPosLat="0.00" departSpeed="13.90" departDelay="0.00" arrival="365.85" arrivalLane="c2w_1" arrivalPos="990.00" arrivalPosLat="0.00" arrivalSpeed="14.10" duration="156.85" routeLength="1996.47" waitingTime="0.00" waitingCount="0" stopTime="0.00" timeLoss="15.28" rerouteNo="1" devices="tripinfo_car_s2w_209 routing_car_s2w_209" vType="Car" speedFactor="1.02" vaporized=""/>
    <tripinfo id="car_s2w_213" depart="213.00" departLane="s2sep_1" departPos="3.60" departPosLat="0.00" departSpeed="13.90" departDelay="0.00" arrival="367.60" arrivalLane="c2w_1" arrivalPos="990.00" arrivalPosLat="0.00" arrivalSpeed="15.38" duration="154.60" routeLength="1996.47" waitingTime="0.25" waitingCount="1" stopTime="0.00" timeLoss="32.25" rerouteNo="1" devices="tripinfo_car_s2w_213 routing_car_s2w_213" vType="Car" speedFactor="1.18" vaporized=""/>
    <tripinfo id="car_s2n_225" depart="225.00" departLane="s2sep_1" departPos="3.60" departPosLat="0.00" departSpeed="13.90" departDelay="0.00" arrival="368.25" arrivalLane="c2n_1" arrivalPos="990.00" arrivalPosLat="0.00" arrivalSpeed="14.00" duration="143.25" routeLength="1997.01" waitingTime="0.00" waitingCount="0" stopTime="0.00" timeLoss="0.62" rerouteNo="1" devices="tripinfo_car_s2n_225 routing_car_s2n_225" vType="Car" speedFactor="1.01" vaporized=""/>
    <tripinfo id="car_s2n_231" depart="231.00" departLane="s2sep_1" departPos="3.60" departPosLat="0.00" departSpeed="13.90" departDelay="0.00" arrival="373.90" arrivalLane="c2n_1" arrivalPos="990.00" arrivalPosLat="0.00" arrivalSpeed="14.13" duration="142.90" routeLength="1997.01" waitingTime="0.00" waitingCount="0" stopTime="0.00" timeLoss="1.62" rerouteNo="1" devices="tripinfo_car_s2n_231 routing_car_s2n_231" vType="Car" speedFactor="1.02" vaporized=""/>
    <tripinfo id="car_n2e_241" depart="241.00" departLane="n2sep_1" departPos="3.60" departPosLat="0.00" departSpeed="13.90" departDelay="0.00" arrival="383.80" arrivalLane="c2e_1" arrivalPos="990.00" arrivalPosLat="0.00" arrivalSpeed="14.49" duration="142.80" routeLength="1996.47" waitingTime="0.00" waitingCount="0" stopTime="0.00" timeLoss="4.39" rerouteNo="1" devices="tripinfo_car_n2e_241 routing_car_n2e_241" vType="Car" speedFactor="1.04" vaporized=""/>
    <tripinfo id="car_e2n_222" depart="222.00" departLane="e2sep_1" departPos="3.60" departPosLat="0.00" departSpeed="13.90" departDelay="0.00" arrival="386.55" arrivalLane="c2n_1" arrivalPos="990.00" arrivalPosLat="0.00" arrivalSpeed="15.32" duration="164.55" routeLength="1986.69" waitingTime="25.00" waitingCount="1" stopTime="0.00" timeLoss="34.24" rerouteNo="1" devices="tripinfo_car_e2n_222 routing_car_e2n_222" vType="Car" speedFactor="1.10" vaporized=""/>
    <tripinfo id="car_e2w_200" depart="200.00" departLane="e2sep_1" departPos="3.60" departPosLat="0.00" departSpeed="13.90" departDelay="0.00" arrival="389.15" arrivalLane="c2w_1" arrivalPos="990.00" arrivalPosLat="0.00" arrivalSpeed="14.22" duration="189.15" routeLength="1997.01" waitingTime="41.55" waitingCount="1" stopTime="0.00" timeLoss="48.71" rerouteNo="1" devices="tripinfo_car_e2w_200 routing_car_e2w_200" vType="Car" speedFactor="1.02" vaporized=""/>
    <tripinfo id="car_w2s_187" depart="187.00" departLane="w2sep_1" departPos="3.60" departPosLat="0.00" departSpeed="13.90" departDelay="0.00" arrival="390.65" arrivalLane="c2s_1" arrivalPos="990.00" arrivalPosLat="0.00" arrivalSpeed="13.90" duration="203.65" routeLength="1986.69" waitingTime="53.25" waitingCount="1" stopTime="0.00" timeLoss="59.96" rerouteNo="1" devices="tripinfo_car_w2s_187 routing_car_w2s_187" vType="Car" speedFactor="1.00" vaporized=""/>
    <tripinfo id="car_w2e_200" depart="200.00" departLane="w2sep_1" departPos="3.60" departPosLat="0.00" departSpeed="13.90" departDelay="0.00" arrival="393.85" arrivalLane="c2e_1" arrivalPos="990.00" arrivalPosLat="0.00" arrivalSpeed="14.21" duration="193.85" routeLength="1997.01" waitingTime="43.00" waitingCount="1" stopTime="0.00" timeLoss="53.26" rerouteNo="1" devices="tripinfo_car_w2e_200 routing_car_w2e_200" vType="Car" speedFactor="1.02" vaporized=""/>
    <tripinfo id="car_w2s_194" depart="194.00" departLane="w2sep_1" departPos="3.60" departPosLat="0.00" departSpeed="13.90" departDelay="0.00" arrival="394.95" arrivalLane="c2s_1" arrivalPos="990.00" arrivalPosLat="0.00" arrivalSpeed="13.96" duration="200.95" routeLength="1986.69" waitingTime="47.05" waitingCount="1" stopTime="0.00" timeLoss="58.01" rerouteNo="1" devices="tripinfo_car_w2s_194 routing_car_w2s_194" vType="Car" speedFactor="1.01" vaporized=""/>
    <tripinfo id="car_e2w_256" depart="256.00" departLane="e2sep_1" departPos="3.60" departPosLat="0.00" departSpeed="13.90" departDelay="0.00" arrival="395.60" arrivalLane="c2w_1" arrivalPos="990.00" arrivalPosLat="0.00" arrivalSpeed="14.42" duration="139.60" routeLength="1997.01" waitingTime="0.00" waitingCount="0" stopTime="0.00" timeLoss="1.16" rerouteNo="1" devices="tripinfo_car_e2w_256 routing_car_e2w_256" vType="Car" speedFactor="1.04" vaporized=""/>
    <tripinfo id="car_w2s_213" depart="213.00" departLane="w2sep_1" departPos="3.60" departPosLat="0.00" departSpeed="13.90" departDelay="0.00" arrival="399.25" arrivalLane="c2s_1" arrivalPos="990.00" arrivalPosLat="0.00" arrivalSpeed="13.89" duration="186.25" routeLength="1986.69" waitingTime="30.25" waitingCount="1" stopTime="0.00" timeLoss="42.59" rerouteNo="1" devices="tripinfo_car_w2s_213 routing_car_w2s_213" vType="Car" speedFactor="1.00" vaporized=""/>
    <tripinfo id="car_w2n_240" depart="240.00" departLane="w2sep_1" departPos="3.60" departPosLat="0.00" departSpeed="13.90" departDelay="0.00" arrival="401.15" arrivalLane="c2n_1" arrivalPos="990.00" arrivalPosLat="0.00" arrivalSpeed="13.90" duration="161.15" routeLength="1996.47" waitingTime="6.05" waitingCount="1" stopTime="0.00" timeLoss="16.81" rerouteNo="1" devices="tripinfo_car_w2n_240 routing_car_w2n_240" vType="Car" speedFactor="1.00" vaporized=""/>
    <tripinfo id="car_w2s_229" depart="229.00" departLane="w2sep_1" departPos="3.60" departPosLat="0.00" departSpeed="13.90" departDelay="0.00" arrival="402.10" arrivalLane="c2s_1" arrivalPos="990.00" arrivalPosLat="0.00" arrivalSpeed="14.28" duration="173.10" routeLength="1986.69" waitingTime="17.70" waitingCount="1" stopTime="0.00" timeLoss="34.20" rerouteNo="1" devices="tripinfo_car_w2s_229 routing_car_w2s_229" vType="Car" speedFactor="1.03" vaporized=""/>
    <tripinfo id="car_e2w_263" depart="263.45" departLane="e2sep_1" departPos="3.60" departPosLat="0.00" departSpeed="13.90" departDelay="0.45" arrival="402.10" arrivalLane="c2w_1" arrivalPos="990.00" arrivalPosLat="0.00" arrivalSpeed="15.12" duration="138.65" routeLength="1997.01" waitingTime="0.00" waitingCount="0" stopTime="0.00" timeLoss="6.56" rerouteNo="1" devices="tripinfo_car_e2w_263 routing_car_e2w_263" vType="Car" speedFactor="1.09" vaporized=""/>
    <tripinfo id="car_w2s_235" depart="235.00" departLane="w2sep_1" departPos="3.60" departPosLat="0.00" departSpeed="13.90" departDelay="0.00" arrival="404.95" arrivalLane="c2s_1" arrivalPos="990.00" arrivalPosLat="0.00" arrivalSpeed="14.23" duration="169.95" routeLength="1986.69" waitingTime="12.55" waitingCount="1" stopTime="0.00" timeLoss="30.53" rerouteNo="1" devices="tripinfo_car_w2s_235 routing_car_w2s_235" vType="Car" speedFactor="1.03" vaporized=""/>
    <tripinfo id="car_w2n_250" depart="250.00" departLane="w2sep_1" departPos="3.60" departPosLat="0.00" departSpeed="13.90" departDelay="0.00" arrival="405.20" arrivalLane="c2n_1" arrivalPos="990.00" arrivalPosLat="0.00" arrivalSpeed="13.98" duration="155.20" routeLength="1996.47" waitingTime="0.00" waitingCount="0" stopTime="0.00" timeLoss="11.90" rerouteNo="1" devices="tripinfo_car_w2n_250 routing_car_w2n_250" vType="Car" speedFactor="1.01" vaporized=""/>
    <tripinfo id="car_e2w_266" depart="266.00" departLane="e2sep_1" departPos="3.60" departPosLat="0.00" departSpeed="13.90" departDelay="0.00" arrival="407.40" arrivalLane="c2w_1" arrivalPos="990.00" arrivalPosLat="0.00" arrivalSpeed="14.80" duration="141.40" routeLength="1997.01" waitingTime="0.00" waitingCount="0" stopTime="0.00" timeLoss="6.47" rerouteNo="1" devices="tripinfo_car_e2w_266 routing_car_e2w_266" vType="Car" speedFactor="1.07" vaporized=""/>
    <tripinfo id="bus_w2s_245" depart="245.00" departLane="w2sep_1" departPos="12.10" departPosLat="0.00" departSpeed="13.90" departDelay="0.00" arrival="408.80" arrivalLane="c2s_1" arrivalPos="990.00" arrivalPosLat="0.00" arrivalSpeed="13.80" duration="163.80" routeLength="1978.19" waitingTime="2.90" waitingCount="1" stopTime="0.00" timeLoss="20.73" rerouteNo="1" devices="tripinfo_bus_w2s_245 routing_bus_w2s_245" vType="Bus" speedFactor="1.00" vaporized=""/>
    <tripinfo id="car_w2n_258" depart="258.00" departLane="w2sep_1" departPos="3.60" departPosLat="0.00" departSpeed="13.90" departDelay="0.00" arrival="411.45" arrivalLane="c2n_1" arrivalPos="990.00" arrivalPosLat="0.00" arrivalSpeed="14.50" duration="153.45" routeLength="1996.47" waitingTime="3.40" waitingCount="1" stopTime="0.00" timeLoss="15.15" rerouteNo="1" devices="tripinfo_car_w2n_258 routing_car_w2n_258" vType="Car" speedFactor="1.04" vaporized=""/>
    <tripinfo id="car_w2s_251" depart="251.50" departLane="w2sep_1" departPos="3.60" departPosLat="0.00" departSpeed="13.90" departDelay="0.50" arrival="412.25" arrivalLane="c2s_1" arrivalPos="990.00" arrivalPosLat="0.00" arrivalSpeed="14.15" duration="160.75" routeLength="1986.69" waitingTime="0.00" waitingCount="0" stopTime="0.00" timeLoss="20.18" rerouteNo="1" devices="tripinfo_car_w2s_251 routing_car_w2s_251" vType="Car" speedFactor="1.02" vaporized=""/>
    <tripinfo id="car_w2n_264" depart="264.00" departLane="w2sep_1" departPos="3.60" departPosLat="0.00" departSpeed="13.90" departDelay="0.00" arrival="413.85" arrivalLane="c2n_1" arrivalPos="990.00" arrivalPosLat="0.00" arrivalSpeed="15.34" duration="149.85" routeLength="1996.47" waitingTime="0.75" waitingCount="1" stopTime="0.00" timeLoss="21.19" rerouteNo="1" devices="tripinfo_car_w2n_264 routing_car_w2n_264" vType="Car" speedFactor="1.12" vaporized=""/>
    <tripinfo id="car_w2s_252" depart="253.30" departLane="w2sep_1" departPos="3.60" departPosLat="0.00" departSpeed="13.90" departDelay="1.30" arrival="415.20" arrivalLane="c2s_1" arrivalPos="990.00" arrivalPosLat="0.00" arrivalSpeed="14.06" duration="161.90" routeLength="1986.69" waitingTime="0.00" waitingCount="0" stopTime="0.00" timeLoss="20.58" rerouteNo="1" devices="tripinfo_car_w2s_252 routing_car_w2s_252" vType="Car" speedFactor="1.02" vaporized=""/>
    <tripinfo id="car_w2n_266" depart="266.00" departLane="w2sep_1" departPos="3.60" departPosLat="0.00" departSpeed="13.90" departDelay="0.00" arrival="416.60" arrivalLane="c2n_1" arrivalPos="990.00" arrivalPosLat="0.00" arrivalSpeed="15.13" duration="150.60" routeLength="1996.47" waitingTime="0.00" waitingCount="0" stopTime="0.00" timeLoss="19.06" rerouteNo="1" devices="tripinfo_car_w2n_266 routing_car_w2n_266" vType="Car" speedFactor="1.10" vaporized=""/>
    <tripinfo id="car_w2s_258" depart="259.45" departLane="w2sep_1" departPos="3.60" departPosLat="0.00" departSpeed="13.90" departDelay="1.45" arrival="417.30" arrivalLane="c2s_1" arrivalPos="990.00" arrivalPosLat="0.00" arrivalSpeed="14.75" duration="157.85" routeLength="1986.69" waitingTime="0.00" waitingCount="0" stopTime="0.00" timeLoss="26.16" rerouteNo="1" devices="tripinfo_car_w2s_258 routing_car_w2s_258" vType="Car" speedFactor="1.09" vaporized=""/>
    <tripinfo id="car_e2s_240" depart="240.00" departLane="e2sep_1" departPos="3.60" departPosLat="0.00" departSpeed="13.90" departDelay="0.00" arrival="420.40" arrivalLane="c2s_1" arrivalPos="990.00" arrivalPosLat="0.00" arrivalSpeed="13.87" duration="180.40" routeLength="1996.47" waitingTime="21.60" waitingCount="2" stopTime="0.00" timeLoss="36.34" rerouteNo="1" devices="tripinfo_car_e2s_240 routing_car_e2s_240" vType="Car" speedFactor="1.00" vaporized=""/>
    <tripinfo id="car_w2n_271" depart="271.00" departLane="w2sep_1" departPos="3.60" departPosLat="0.00" departSpeed="13.90" departDelay="0.00" arrival="422.30" arrivalLane="c2n_1" arrivalPos="990.00" arrivalPosLat="0.00" arrivalSpeed="13.90" duration="151.30" routeLength="1996.47" waitingTime="0.00" waitingCount="0" stopTime="0.00" timeLoss="6.96" rerouteNo="1" devices="tripinfo_car_w2n_271 routing_car_w2n_271" vType="Car" speedFactor="1.00" vaporized=""/>
    <tripinfo id="car_e2s_262" depart="262.00" departLane="e2sep_1" departPos="3.60" departPosLat="0.00" departSpeed="13.90" departDelay="0.00" arrival="423.25" arrivalLane="c2s_1" arrivalPos="990.00" arrivalPosLat="0.00" arrivalSpeed="13.95" duration="161.25" routeLength="1996.47" waitingTime="5.20" waitingCount="1" stopTime="0.00" timeLoss="18.30" rerouteNo="1" devices="tripinfo_car_e2s_262 routing_car_e2s_262" vType="Car" speedFactor="1.01" vaporized=""/>
    <tripinfo id="car_e2s_268" depart="268.00" departLane="e2sep_1" departPos="3.60" departPosLat="0.00" departSpeed="13.90" departDelay="0.00" arrival="426.10" arrivalLane="c2s_1" arrivalPos="990.00" arrivalPosLat="0.00" arrivalSpeed="13.82" duration="158.10" routeLength="1996.47" waitingTime="0.00" waitingCount="0" stopTime="0.00" timeLoss="13.80" rerouteNo="1" devices="tripinfo_car_e2s_268 routing_car_e2s_268" vType="Car" speedFactor="1.00" vaporized=""/>
    <tripinfo id="car_w2s_289" depart="289.00" departLane="w2sep_1" departPos="3.60" departPosLat="0.00" departSpeed="13.90" departDelay="0.00" arrival="428.15" arrivalLane="c2s_1" arrivalPos="990.00" arrivalPosLat="0.00" arrivalSpeed="14.74" duration="139.15" routeLength="1986.69" waitingTime="0.00" waitingCount="0" stopTime="0.00" timeLoss="8.05" rerouteNo="1" devices="tripinfo_car_w2s_289 routing_car_w2s_289" vType="Car" speedFactor="1.10" vaporized=""/>
</tripinfos>
 id="car_e2w_290" depart="290.00" departLane="e2sep_1" departPos="3.60" departPosLat="0.00" departSpeed="13.90" departDelay="0.00" arrival="441.20" arrivalLane="c2w_1" arrivalPos="990.00" arrivalPosLat="0.00" arrivalSpeed="16.36" duration="151.20" routeLength="1997.01" waitingTime="13.85" waitingCount="1" stopTime="0.00" timeLoss="29.13" rerouteNo="1" devices="tripinfo_car_e2w_290 routing_car_e2w_290" vType="Car" speedFactor="1.18" vaporized=""/>
    <tripinfo id="bus_w2e_298" depart="298.00" departLane="w2sep_1" departPos="12.10" departPosLat="0.00" departSpeed="13.90" departDelay="0.00" arrival="441.25" arrivalLane="c2e_1" arrivalPos="990.00" arrivalPosLat="0.00" arrivalSpeed="13.90" duration="143.25" routeLength="1988.51" waitingTime="0.00" waitingCount="0" stopTime="0.00" timeLoss="0.16" rerouteNo="1" devices="tripinfo_bus_w2e_298 routing_bus_w2e_298" vType="Bus" speedFactor="1.00" vaporized=""/>
    <tripinfo id="amb_w2e_300" depart="300.00" departLane="w2sep_1" departPos="6.60" departPosLat="0.00" departSpeed="13.90" departDelay="0.00" arrival="443.15" arrivalLane="c2e_1" arrivalPos="990.00" arrivalPosLat="0.00" arrivalSpeed="17.24" duration="143.15" routeLength="1994.01" waitingTime="0.00" waitingCount="0" stopTime="0.00" timeLoss="47.51" rerouteNo="1" devices="tripinfo_amb_w2e_300 routing_amb_w2e_300 bluelight_amb_w2e_300 fcd_amb_w2e_300" vType="Ambulance" speedFactor="1.50" vaporized="">
        <example_device customValue1="0.00" customValue2="-1.00"/>
    </tripinfo>
    <tripinfo id="car_e2n_285" depart="285.00" departLane="e2sep_1" departPos="3.60" departPosLat="0.00" departSpeed="13.90" departDelay="0.00" arrival="448.35" arrivalLane="c2n_1" arrivalPos="990.00" arrivalPosLat="0.00" arrivalSpeed="14.13" duration="163.35" routeLength="1986.69" waitingTime="14.75" waitingCount="1" stopTime="0.00" timeLoss="22.04" rerouteNo="1" devices="tripinfo_car_e2n_285 routing_car_e2n_285" vType="Car" speedFactor="1.02" vaporized=""/>
</tripinfos>
 id="car_e2s_269" depart="269.70" departLane="e2sep_1" departPos="3.60" departPosLat="0.00" departSpeed="13.90" departDelay="0.70" arrival="450.65" arrivalLane="c2s_1" arrivalPos="990.00" arrivalPosLat="0.00" arrivalSpeed="13.90" duration="180.95" routeLength="1996.47" waitingTime="24.50" waitingCount="1" stopTime="0.00" timeLoss="36.62" rerouteNo="1" devices="tripinfo_car_e2s_269 routing_car_e2s_269" vType="Car" speedFactor="1.00" vaporized=""/>
    <tripinfo id="car_e2s_270" depart="271.60" departLane="e2sep_1" departPos="3.60" departPosLat="0.00" departSpeed="13.90" departDelay="1.60" arrival="455.15" arrivalLane="c2s_1" arrivalPos="990.00" arrivalPosLat="0.00" arrivalSpeed="13.89" duration="183.55" routeLength="1996.47" waitingTime="22.85" waitingCount="1" stopTime="0.00" timeLoss="39.23" rerouteNo="1" devices="tripinfo_car_e2s_270 routing_car_e2s_270" vType="Car" speedFactor="1.00" vaporized=""/>
    <tripinfo id="bus_w2n_309" depart="309.00" departLane="w2sep_1" departPos="12.10" departPosLat="0.00" departSpeed="13.90" departDelay="0.00" arrival="458.25" arrivalLane="c2n_1" arrivalPos="990.00" arrivalPosLat="0.00" arrivalSpeed="13.90" duration="149.25" routeLength="1987.97" waitingTime="0.00" waitingCount="0" stopTime="0.00" timeLoss="5.54" rerouteNo="1" devices="tripinfo_bus_w2n_309 routing_bus_w2n_309" vType="Bus" speedFactor="1.00" vaporized=""/>
    <tripinfo id="car_n2s_252" depart="252.00" departLane="n2sep_1" departPos="3.60" departPosLat="0.00" departSpeed="13.90" departDelay="0.00" arrival="465.20" arrivalLane="c2s_1" arrivalPos="990.00" arrivalPosLat="0.00" arrivalSpeed="15.18" duration="213.20" routeLength="1997.01" waitingTime="71.30" waitingCount="1" stopTime="0.00" timeLoss="81.63" rerouteNo="1" devices="tripinfo_car_n2s_252 routing_car_n2s_252" vType="Car" speedFactor="1.09" vaporized=""/>
    <tripinfo id="car_n2w_231" depart="231.00" departLane="n2sep_1" departPos="3.60" departPosLat="0.00" departSpeed="13.90" departDelay="0.00" arrival="466.50" arrivalLane="c2w_1" arrivalPos="990.00" arrivalPosLat="0.00" arrivalSpeed="13.90" duration="235.50" routeLength="1986.69" waitingTime="84.85" waitingCount="1" stopTime="0.00" timeLoss="91.81" rerouteNo="1" devices="tripinfo_car_n2w_231 routing_car_n2w_231" vType="Car" speedFactor="1.00" vaporized=""/>
    <tripinfo id="car_n2w_239" depart="239.00" departLane="n2sep_1" departPos="3.60" departPosLat="0.00" departSpeed="13.90" departDelay="0.00" arrival="468.45" arrivalLane="c2w_1" arrivalPos="990.00" arrivalPosLat="0.00" arrivalSpeed="15.30" duration="229.45" routeLength="1986.69" waitingTime="83.80" waitingCount="1" stopTime="0.00" timeLoss="104.27" rerouteNo="1" devices="tripinfo_car_n2w_239 routing_car_n2w_239" vType="Car" speedFactor="1.15" vaporized=""/>
    <tripinfo id="car_s2n_281" depart="281.00" departLane="s2sep_1" departPos="3.60" departPosLat="0.00" departSpeed="13.90" departDelay="0.00" arrival="469.30" arrivalLane="c2n_1" arrivalPos="990.00" arrivalPosLat="0.00" arrivalSpeed="14.80" duration="188.30" routeLength="1997.01" waitingTime="41.05" waitingCount="1" stopTime="0.00" timeLoss="53.36" rerouteNo="1" devices="tripinfo_car_s2n_281 routing_car_s2n_281" vType="Car" speedFactor="1.06" vaporized=""/>
    <tripinfo id="bus_s2e_260" depart="260.00" departLane="s2sep_1" departPos="12.10" departPosLat="0.00" departSpeed="13.90" departDelay="0.00" arrival="469.80" arrivalLane="c2e_1" arrivalPos="990.00" arrivalPosLat="0.00" arrivalSpeed="13.90" duration="209.80" routeLength="1978.19" waitingTime="56.15" waitingCount="1" stopTime="0.00" timeLoss="66.73" rerouteNo="1" devices="tripinfo_bus_s2e_260 routing_bus_s2e_260" vType="Bus" speedFactor="1.00" vaporized=""/>
    <tripinfo id="car_n2s_271" depart="271.00" departLane="n2sep_1" departPos="3.60" departPosLat="0.00" departSpeed="13.90" departDelay="0.00" arrival="470.00" arrivalLane="c2s_1" arrivalPos="990.00" arrivalPosLat="0.00" arrivalSpeed="14.90" duration="199.00" routeLength="1997.01" waitingTime="52.50" waitingCount="1" stopTime="0.00" timeLoss="65.07" rerouteNo="1" devices="tripinfo_car_n2s_271 routing_car_n2s_271" vType="Car" speedFactor="1.07" vaporized=""/>
    <tripinfo id="car_s2w_285" depart="285.00" departLane="s2sep_1" departPos="3.60" departPosLat="0.00" departSpeed="13.90" departDelay="0.00" arrival="471.30" arrivalLane="c2w_1" arrivalPos="990.00" arrivalPosLat="0.00" arrivalSpeed="15.16" duration="186.30" routeLength="1996.47" waitingTime="37.80" waitingCount="2" stopTime="0.00" timeLoss="54.93" rerouteNo="1" devices="tripinfo_car_s2w_285 routing_car_s2w_285" vType="Car" speedFactor="1.10" vaporized=""/>
</tripinfos>
