<?xml version="1.0" encoding="UTF-8"?>

<!-- generated on Sat Apr 24 18:28:58 2021 by Eclipse SUMO Version 1.4.0
<configuration xmlns:xsi="http://www.w3.org/2001/XMLSchema-instance" xsi:noNamespaceSchemaLocation="http://sumo.dlr.de/xsd/sumoConfiguration.xsd">

    <input>
        <net-file value="sumofiles/junction.net.xml"/>
        <route-files value="sumofiles/junction_preemption_219.rou.xml"/>
        <additional-files value="sumofiles/junction.det.xml"/>
    </input>

    <output>
        <tripinfo-output value="sumofiles/output/tripinfo_preemption_219.xml"/>
    </output>

    <time>
        <begin value="0"/>
        <end value="10000"/>
        <step-length value="0.05"/>
    </time>

    <processing>
        <lateral-resolution value="0.1"/>
    </processing>

    <report>
        <no-warnings value="true"/>
        <error-log value="sumofiles/output/errorlog_preemption_219.log"/>
        <no-step-log value="true"/>
    </report>

    <traci_server>
        <remote-port value="36021"/>
    </traci_server>

    <gui_only>
        <gui-settings-file value="sumofiles/junction-gui.settings.xml"/>
        <tracker-interval value="0.05"/>
    </gui_only>

</configuration>
-->

<tripinfos xmlns:xsi="http://www.w3.org/2001/XMLSchema-instance" xsi:noNamespaceSchemaLocation="http://sumo.dlr.de/xsd/tripinfo_file.xsd">
    <tripinfo id="car_w2s_1" depart="1.00" departLane="w2sep_1" departPos="3.60" departPosLat="0.00" departSpeed="13.90" departDelay="0.00" arrival="140.30" arrivalLane="c2s_1" arrivalPos="990.00" arrivalPosLat="0.00" arrivalSpeed="14.73" duration="139.30" routeLength="1986.69" waitingTime="0.00" waitingCount="0" stopTime="0.00" timeLoss="3.75" rerouteNo="1" devices="tripinfo_car_w2s_1 routing_car_w2s_1" vType="Car" speedFactor="1.06" vaporized=""/>
    <tripinfo id="car_w2e_2" depart="2.35" departLane="w2sep_1" departPos="3.60" departPosLat="0.00" departSpeed="13.90" departDelay="0.35" arrival="141.85" arrivalLane="c2e_1" arrivalPos="990.00" arrivalPosLat="0.00" arrivalSpeed="14.73" duration="139.50" routeLength="1997.01" waitingTime="0.00" waitingCount="0" stopTime="0.00" timeLoss="3.92" rerouteNo="1" devices="tripinfo_car_w2e_2 routing_car_w2e_2" vType="Car" speedFactor="1.06" vaporized=""/>
    <tripinfo id="car_e2s_10" depart="11.55" departLane="e2sep_1" departPos="3.60" departPosLat="0.00" departSpeed="13.90" departDelay="1.55" arrival="158.75" arrivalLane="c2s_1" arrivalPos="990.00" arrivalPosLat="0.00" arrivalSpeed="14.32" duration="147.20" routeLength="1996.47" waitingTime="0.00" waitingCount="0" stopTime="0.00" timeLoss="7.12" rerouteNo="1" devices="tripinfo_car_e2s_10 routing_car_e2s_10" vType="Car" speedFactor="1.03" vaporized=""/>
    <tripinfo id="car_s2w_20" depart="20.00" departLane="s2sep_1" departPos="3.60" departPosLat="0.00" departSpeed="13.90" departDelay="0.00" arrival="163.20" arrivalLane="c2w_1" arrivalPos="990.00" arrivalPosLat="0.00" arrivalSpeed="14.54" duration="143.20" routeLength="1996.47" waitingTime="0.00" waitingCount="0" stopTime="0.00" timeLoss="5.17" rerouteNo="1" devices="tripinfo_car_s2w_20 routing_car_s2w_20" vType="Car" speedFactor="1.05" vaporized=""/>
    <tripinfo id="car_s2n_23" depart="23.00" departLane="s2sep_1" departPos="3.60" departPosLat="0.00" departSpeed="13.90" departDelay="0.00" arrival="164.80" arrivalLane="c2n_1" arrivalPos="990.00" arrivalPosLat="0.00" arrivalSpeed="15.05" duration="141.80" routeLength="1997.01" waitingTime="0.00" waitingCount="0" stopTime="0.00" timeLoss="9.08" rerouteNo="1" devices="tripinfo_car_s2n_23 routing_car_s2n_23" vType="Car" speedFactor="1.08" vaporized=""/>
    <tripinfo id="bus_s2e_7" depart="7.00" departLane="s2sep_1" departPos="12.10" departPosLat="0.00" departSpeed="13.90" departDelay="0.00" arrival="168.95" arrivalLane="c2e_1" arrivalPos="990.00" arrivalPosLat="0.00" arrivalSpeed="13.90" duration="161.95" routeLength="1978.19" waitingTime="8.25" waitingCount="1" stopTime="0.00" timeLoss="18.87" rerouteNo="1" devices="tripinfo_bus_s2e_7 routing_bus_s2e_7" vType="Bus" speedFactor="1.00" vaporized=""/>
    <tripinfo id="car_s2w_29" depart="29.00" departLane="s2sep_1" departPos="3.60" departPosLat="0.00" departSpeed="13.90" departDelay="0.00" arrival="169.45" arrivalLane="c2w_1" arrivalPos="990.00" arrivalPosLat="0.00" arrivalSpeed="15.16" duration="140.45" routeLength="1996.47" waitingTime="0.00" waitingCount="0" stopTime="0.00" timeLoss="8.12" rerouteNo="1" devices="tripinfo_car_s2w_29 routing_car_s2w_29" vType="Car" speedFactor="1.09" vaporized=""/>
    <tripinfo id="car_s2n_25" depart="25.00" departLane="s2sep_1" departPos="3.60" departPosLat="0.00" departSpeed="13.90" departDelay="0.00" arrival="171.20" arrivalLane="c2n_1" arrivalPos="990.00" arrivalPosLat="0.00" arrivalSpeed="14.32" duration="146.20" routeLength="1997.01" waitingTime="0.00" waitingCount="0" stopTime="0.00" timeLoss="6.76" rerouteNo="1" devices="tripinfo_car_s2n_25 routing_car_s2n_25" vType="Car" speedFactor="1.03" vaporized=""/>
    <tripinfo id="car_s2e_40" depart="40.00" departLane="s2sep_1" departPos="3.60" departPosLat="0.00" departSpeed="13.90" departDelay="0.00" arrival="173.35" arrivalLane="c2e_1" arrivalPos="990.00" arrivalPosLat="0.00" arrivalSpeed="15.58" duration="133.35" routeLength="1986.69" waitingTime="0.00" waitingCount="0" stopTime="0.00" timeLoss="5.41" rerouteNo="1" devices="tripinfo_car_s2e_40 routing_car_s2e_40" vType="Car" speedFactor="1.12" vaporized=""/>
    <tripinfo id="car_s2w_56" depart="56.00" departLane="s2sep_1" departPos="3.60" departPosLat="0.00" departSpeed="13.90" departDelay="0.00" arrival="201.05" arrivalLane="c2w_1" arrivalPos="990.00" arrivalPosLat="0.00" arrivalSpeed="14.15" duration="145.05" routeLength="1996.47" waitingTime="0.00" waitingCount="0" stopTime="0.00" timeLoss="3.32" rerouteNo="1" devices="tripinfo_car_s2w_56 routing_car_s2w_56" vType="Car" speedFactor="1.02" vaporized=""/>
    <tripinfo id="car_e2w_10" depart="10.00" departLane="e2sep_1" departPos="3.60" departPosLat="0.00" departSpeed="13.90" departDelay="0.00" arrival="207.85" arrivalLane="c2w_1" arrivalPos="990.00" arrivalPosLat="0.00" arrivalSpeed="15.05" duration="197.85" routeLength="1997.01" waitingTime="51.60" waitingCount="1" stopTime="0.00" timeLoss="65.13" rerouteNo="1" devices="tripinfo_car_e2w_10 routing_car_e2w_10" vType="Car" speedFactor="1.08" vaporized=""/>
    <tripinfo id="car_e2n_8" depart="8.00" departLane="e2sep_1" departPos="3.60" departPosLat="0.00" departSpeed="13.90" departDelay="0.00" arrival="209.90" arrivalLane="c2n_1" arrivalPos="990.00" arrivalPosLat="0.00" arrivalSpeed="14.04" duration="201.90" routeLength="1986.69" waitingTime="53.00" waitingCount="1" stopTime="0.00" timeLoss="59.72" rerouteNo="1" devices="tripinfo_car_e2n_8 routing_car_e2n_8" vType="Car" speedFactor="1.01" vaporized=""/>
    <tripinfo id="car_w2e_50" depart="50.00" departLane="w2sep_1" departPos="3.60" departPosLat="0.00" departSpeed="13.90" departDelay="0.00" arrival="210.70" arrivalLane="c2e_1" arrivalPos="990.00" arrivalPosLat="0.00" arrivalSpeed="13.90" duration="160.70" routeLength="1997.01" waitingTime="9.95" waitingCount="1" stopTime="0.00" timeLoss="17.01" rerouteNo="1" devices="tripinfo_car_w2e_50 routing_car_w2e_50" vType="Car" speedFactor="1.00" vaporized=""/>
    <tripinfo id="car_e2w_37" depart="37.00" departLane="e2sep_1" departPos="3.60" departPosLat="0.00" departSpeed="13.90" departDelay="0.00" arrival="214.30" arrivalLane="c2w_1" arrivalPos="990.00" arrivalPosLat="0.00" arrivalSpeed="14.26" duration="177.30" routeLength="1997.01" waitingTime="26.65" waitingCount="1" stopTime="0.00" timeLoss="37.28" rerouteNo="1" devices="tripinfo_car_e2w_37 routing_car_e2w_37" vType="Car" speedFactor="1.03" vaporized=""/>
    <tripinfo id="car_e2n_49" depart="49.45" departLane="e2sep_1" departPos="3.60" departPosLat="0.00" departSpeed="13.90" departDelay="0.45" arrival="215.10" arrivalLane="c2n_1" arrivalPos="990.00" arrivalPosLat="0.00" arrivalSpeed="14.53" duration="165.65" routeLength="1986.69" waitingTime="12.45" waitingCount="1" stopTime="0.00" timeLoss="28.27" rerouteNo="1" devices="tripinfo_car_e2n_49 routing_car_e2n_49" vType="Car" speedFactor="1.05" vaporized=""/>
    <tripinfo id="car_w2s_68" depart="68.00" departLane="w2sep_1" departPos="3.60" departPosLat="0.00" departSpeed="13.90" departDelay="0.00" arrival="215.65" arrivalLane="c2s_1" arrivalPos="990.00" arrivalPosLat="0.00" arrivalSpeed="13.90" duration="147.65" routeLength="1986.69" waitingTime="0.00" waitingCount="0" stopTime="0.00" timeLoss="3.98" rerouteNo="1" devices="tripinfo_car_w2s_68 routing_car_w2s_68" vType="Car" speedFactor="1.00" vaporized=""/>
    <tripinfo id="car_e2s_13" depart="13.35" departLane="e2sep_1" departPos="3.60" departPosLat="0.00" departSpeed="13.90" departDelay="0.35" arrival="220.45" arrivalLane="c2s_1" arrivalPos="990.00" arrivalPosLat="0.00" arrivalSpeed="13.89" duration="207.10" routeLength="1996.47" waitingTime="46.75" waitingCount="2" stopTime="0.00" timeLoss="62.76" rerouteNo="1" devices="tripinfo_car_e2s_13 routing_car_e2s_13" vType="Car" speedFactor="1.00" vaporized=""/>
    <tripinfo id="car_e2n_51" depart="51.20" departLane="e2sep_1" departPos="3.60" departPosLat="0.00" departSpeed="13.90" departDelay="0.20" arrival="221.15" arrivalLane="c2n_1" arrivalPos="990.00" arrivalPosLat="0.00" arrivalSpeed="13.90" duration="169.95" routeLength="1986.69" waitingTime="10.10" waitingCount="1" stopTime="0.00" timeLoss="26.27" rerouteNo="1" devices="tripinfo_car_e2n_51 routing_car_e2n_51" vType="Car" speedFactor="1.00" vaporized=""/>
    <tripinfo id="car_w2e_78" depart="78.00" departLane="w2sep_1" departPos="3.60" departPosLat="0.00" departSpeed="13.90" departDelay="0.00" arrival="221.80" arrivalLane="c2e_1" arrivalPos="990.00" arrivalPosLat="0.00" arrivalSpeed="13.97" duration="143.80" routeLength="1997.01" waitingTime="0.00" waitingCount="0" stopTime="0.00" timeLoss="0.83" rerouteNo="1" devices="tripinfo_car_w2e_78 routing_car_w2e_78" vType="Car" speedFactor="1.01" vaporized=""/>
    <tripinfo id="car_e2w_87" depart="87.00" departLane="e2sep_1" departPos="3.60" departPosLat="0.00" departSpeed="13.90" departDelay="0.00" arrival="222.50" arrivalLane="c2w_1" arrivalPos="990.00" arrivalPosLat="0.00" arrivalSpeed="15.18" duration="135.50" routeLength="1997.01" waitingTime="0.00" waitingCount="0" stopTime="0.00" timeLoss="3.91" rerouteNo="1" devices="tripinfo_car_e2w_87 routing_car_e2w_87" vType="Car" speedFactor="1.09" vaporized=""/>
    <tripinfo id="car_w2s_86" depart="87.30" departLane="w2sep_1" departPos="3.60" departPosLat="0.00" departSpeed="13.90" departDelay="1.30" arrival="222.70" arrivalLane="c2s_1" arrivalPos="990.00" arrivalPosLat="0.00" arrivalSpeed="15.69" duration="135.40" routeLength="1986.69" waitingTime="0.00" waitingCount="0" stopTime="0.00" timeLoss="11.34" rerouteNo="1" devices="tripinfo_car_w2s_86 routing_car_w2s_86" vType="Car" speedFactor="1.16" vaporized=""/>
    <tripinfo id="car_e2n_54" depart="54.00" departLane="e2sep_1" departPos="3.60" departPosLat="0.00" departSpeed="13.90" departDelay="0.00" arrival="225.10" arrivalLane="c2n_1" arrivalPos="990.00" arrivalPosLat="0.00" arrivalSpeed="13.88" duration="171.10" routeLength="1986.69" waitingTime="8.20" waitingCount="1" stopTime="0.00" timeLoss="27.41" rerouteNo="1" devices="tripinfo_car_e2n_54 routing_car_e2n_54" vType="Car" speedFactor="1.00" vaporized=""/>
    <tripinfo id="car_e2n_65" depart="65.00" departLane="e2sep_1" departPos="3.60" departPosLat="0.00" departSpeed="13.90" departDelay="0.00" arrival="228.45" arrivalLane="c2n_1" arrivalPos="990.00" arrivalPosLat="0.00" arrivalSpeed="13.86" duration="163.45" routeLength="1986.69" waitingTime="0.55" waitingCount="1" stopTime="0.00" timeLoss="19.80" rerouteNo="1" devices="tripinfo_car_e2n_65 routing_car_e2n_65" vType="Car" speedFactor="1.00" vaporized=""/>
    <tripinfo id="car_e2n_66" depart="66.50" departLane="e2sep_1" departPos="3.60" departPosLat="0.00" departSpeed="13.90" departDelay="0.50" arrival="230.35" arrivalLane="c2n_1" arrivalPos="990.00" arrivalPosLat="0.00" arrivalSpeed="15.03" duration="163.85" routeLength="1986.69" waitingTime="0.00" waitingCount="0" stopTime="0.00" timeLoss="36.91" rerouteNo="1" devices="tripinfo_car_e2n_66 routing_car_e2n_66" vType="Car" speedFactor="1.13" vaporized=""/>
    <tripinfo id="car_w2n_55" depart="55.00" departLane="w2sep_1" departPos="3.60" departPosLat="0.00" departSpeed="13.90" departDelay="0.00" arrival="232.20" arrivalLane="c2n_1" arrivalPos="990.00" arrivalPosLat="0.00" arrivalSpeed="15.32" duration="177.20" routeLength="1996.47" waitingTime="24.70" waitingCount="2" stopTime="0.00" timeLoss="52.58" rerouteNo="1" devices="tripinfo_car_w2n_55 routing_car_w2n_55" vType="Car" speedFactor="1.16" vaporized=""/>
    <tripinfo id="car_w2n_60" depart="60.00" departLane="w2sep_1" departPos="3.60" departPosLat="0.00" departSpeed="13.90" departDelay="0.00" arrival="235.05" arrivalLane="c2n_1" arrivalPos="990.00" arrivalPosLat="0.00" arrivalSpeed="14.18" duration="175.05" routeLength="1996.47" waitingTime="17.40" waitingCount="2" stopTime="0.00" timeLoss="34.40" rerouteNo="1" devices="tripinfo_car_w2n_60 routing_car_w2n_60" vType="Car" speedFactor="1.03" vaporized=""/>
    <tripinfo id="car_w2s_87" depart="88.90" departLane="w2sep_1" departPos="3.60" departPosLat="0.00" departSpeed="13.90" departDelay="1.90" arrival="235.70" arrivalLane="c2s_1" arrivalPos="990.00" arrivalPosLat="0.00" arrivalSpeed="14.15" duration="146.80" routeLength="1986.69" waitingTime="0.00" waitingCount="0" stopTime="0.00" timeLoss="5.66" rerouteNo="1" devices="tripinfo_car_w2s_87 routing_car_w2s_87" vType="Car" speedFactor="1.02" vaporized=""/>
    <tripinfo id="car_w2n_86" depart="86.00" departLane="w2sep_1" departPos="3.60" departPosLat="0.00" departSpeed="13.90" departDelay="0.00" arrival="237.10" arrivalLane="c2n_1" arrivalPos="990.00" arrivalPosLat="0.00" arrivalSpeed="14.87" duration="151.10" routeLength="1996.47" waitingTime="0.00" waitingCount="0" stopTime="0.00" timeLoss="20.16" rerouteNo="1" devices="tripinfo_car_w2n_86 routing_car_w2n_86" vType="Car" speedFactor="1.10" vaporized=""/>
    <tripinfo id="car_e2s_23" depart="23.00" departLane="e2sep_1" departPos="3.60" departPosLat="0.00" departSpeed="13.90" departDelay="0.00" arrival="242.80" arrivalLane="c2s_1" arrivalPos="990.00" arrivalPosLat="0.00" arrivalSpeed="14.04" duration="219.80" routeLength="1996.47" waitingTime="59.90" waitingCount="4" stopTime="0.00" timeLoss="76.93" rerouteNo="1" devices="tripinfo_car_e2s_23 routing_car_e2s_23" vType="Car" speedFactor="1.01" vaporized=""/>
    <tripinfo id="car_s2e_68" depart="68.00" departLane="s2sep_1" departPos="3.60" departPosLat="0.00" departSpeed="13.90" departDelay="0.00" arrival="245.15" arrivalLane="c2e_1" arrivalPos="990.00" arrivalPosLat="0.00" arrivalSpeed="16.38" duration="177.15" routeLength="1986.69" waitingTime="41.50" waitingCount="1" stopTime="0.00" timeLoss="55.26" rerouteNo="1" devices="tripinfo_car_s2e_68 routing_car_s2e_68" vType="Car" speedFactor="1.18" vaporized=""/>
    <tripinfo id="car_e2s_39" depart="39.00" departLane="e2sep_1" departPos="3.60" departPosLat="0.00" departSpeed="13.90" departDelay="0.00" arrival="245.85" arrivalLane="c2s_1" arrivalPos="990.00" arrivalPosLat="0.00" arrivalSpeed="14.48" duration="206.85" routeLength="1996.47" waitingTime="41.55" waitingCount="3" stopTime="0.00" timeLoss="68.99" rerouteNo="1" devices="tripinfo_car_e2s_39 routing_car_e2s_39" vType="Car" speedFactor="1.05" vaporized=""/>
    <tripinfo id="car_s2e_84" depart="84.00" departLane="s2sep_1" departPos="3.60" departPosLat="0.00" departSpeed="13.90" departDelay="0.00" arrival="249.35" arrivalLane="c2e_1" arrivalPos="990.00" arrivalPosLat="0.00" arrivalSpeed="16.37" duration="165.35" routeLength="1986.69" waitingTime="31.95" waitingCount="1" stopTime="0.00" timeLoss="43.54" rerouteNo="1" devices="tripinfo_car_s2e_84 routing_car_s2e_84" vType="Car" speedFactor="1.18" vaporized=""/>
    <tripinfo id="car_e2s_48" depart="48.00" departLane="e2sep_1" departPos="3.60" departPosLat="0.00" departSpeed="13.90" departDelay="0.00" arrival="250.10" arrivalLane="c2s_1" arrivalPos="990.00" arrivalPosLat="0.00" arrivalSpeed="13.89" duration="202.10" routeLength="1996.47" waitingTime="30.50" waitingCount="2" stopTime="0.00" timeLoss="57.79" rerouteNo="1" devices="tripinfo_car_e2s_48 routing_car_e2s_48" vType="Car" speedFactor="1.00" vaporized=""/>
    <tripinfo id="car_e2s_59" depart="59.00" departLane="e2sep_1" departPos="3.60" departPosLat="0.00" departSpeed="13.90" departDelay="0.00" arrival="252.30" arrivalLane="c2s_1" arrivalPos="990.00" arrivalPosLat="0.00" arrivalSpeed="14.80" duration="193.30" routeLength="1996.47" waitingTime="19.35" waitingCount="2" stopTime="0.00" timeLoss="60.96" rerouteNo="1" devices="tripinfo_car_e2s_59 routing_car_e2s_59" vType="Car" speedFactor="1.09" vaporized=""/>
    <tripinfo id="car_s2n_96" depart="96.00" departLane="s2sep_1" departPos="3.60" departPosLat="0.00" departSpeed="13.90" departDelay="0.00" arrival="254.45" arrivalLane="c2n_1" arrivalPos="990.00" arrivalPosLat="0.00" arrivalSpeed="15.12" duration="158.45" routeLength="1997.01" waitingTime="13.05" waitingCount="1" stopTime="0.00" timeLoss="26.39" rerouteNo="1" devices="tripinfo_car_s2n_96 routing_car_s2n_96" vType="Car" speedFactor="1.09" vaporized=""/>
    <tripinfo id="car_n2w_59" depart="59.00" departLane="n2sep_1" departPos="3.60" departPosLat="0.00" departSpeed="13.90" departDelay="0.00" arrival="254.90" arrivalLane="c2w_1" arrivalPos="990.00" arrivalPosLat="0.00" arrivalSpeed="14.04" duration="195.90" routeLength="1986.69" waitingTime="46.95" waitingCount="1" stopTime="0.00" timeLoss="53.70" rerouteNo="1" devices="tripinfo_car_n2w_59 routing_car_n2w_59" vType="Car" speedFactor="1.01" vaporized=""/>
    <tripinfo id="car_e2s_61" depart="61.00" departLane="e2sep_1" departPos="3.60" departPosLat="0.00" departSpeed="13.90" departDelay="0.00" arrival="254.90" arrivalLane="c2s_1" arrivalPos="990.00" arrivalPosLat="0.00" arrivalSpeed="14.42" duration="193.90" routeLength="1996.47" waitingTime="17.80" waitingCount="2" stopTime="0.00" timeLoss="56.07" rerouteNo="1" devices="tripinfo_car_e2s_61 routing_car_e2s_61" vType="Car" speedFactor="1.05" vaporized=""/>
    <tripinfo id="car_n2w_62" depart="62.00" departLane="n2sep_1" departPos="3.60" departPosLat="0.00" departSpeed="13.90" departDelay="0.00" arrival="257.05" arrivalLane="c2w_1" arrivalPos="990.00" arrivalPosLat="0.00" arrivalSpeed="15.20" duration="195.05" routeLength="1986.69" waitingTime="45.85" waitingCount="1" stopTime="0.00" timeLoss="67.13" rerouteNo="1" devices="tripinfo_car_n2w_62 routing_car_n2w_62" vType="Car" speedFactor="1.12" vaporized=""/>
    <tripinfo id="car_n2e_83" depart="84.50" departLane="n2sep_1" departPos="3.60" departPosLat="0.00" departSpeed="13.90" departDelay="1.50" arrival="261.80" arrivalLane="c2e_1" arrivalPos="990.00" arrivalPosLat="0.00" arrivalSpeed="14.17" duration="177.30" routeLength="1996.47" waitingTime="21.10" waitingCount="2" stopTime="0.00" timeLoss="35.76" rerouteNo="1" devices="tripinfo_car_n2e_83 routing_car_n2e_83" vType="Car" speedFactor="1.02" vaporized=""/>
    <tripinfo id="bus_n2s_75" depart="75.00" departLane="n2sep_1" departPos="12.10" departPosLat="0.00" departSpeed="13.90" departDelay="0.00" arrival="263.05" arrivalLane="c2s_1" arrivalPos="990.00" arrivalPosLat="0.00" arrivalSpeed="13.90" duration="188.05" routeLength="1988.51" waitingTime="33.40" waitingCount="1" stopTime="0.00" timeLoss="45.00" rerouteNo="1" devices="tripinfo_bus_n2s_75 routing_bus_n2s_75" vType="Bus" speedFactor="1.00" vaporized=""/>
    <tripinfo id="car_n2s_78" depart="78.00" departLane="n2sep_1" departPos="3.60" departPosLat="0.00" departSpeed="13.90" departDelay="0.00" arrival="265.45" arrivalLane="c2s_1" arrivalPos="990.00" arrivalPosLat="0.00" arrivalSpeed="15.67" duration="187.45" routeLength="1997.01" waitingTime="32.25" waitingCount="1" stopTime="0.00" timeLoss="64.84" rerouteNo="1" devices="tripinfo_car_n2s_78 routing_car_n2s_78" vType="Car" speedFactor="1.17" vaporized=""/>
    <tripinfo id="car_n2e_84" depart="88.80" departLane="n2sep_1" departPos="3.60" departPosLat="0.00" departSpeed="13.90" departDelay="4.80" arrival="266.95" arrivalLane="c2e_1" arrivalPos="990.00" arrivalPosLat="0.00" arrivalSpeed="13.90" duration="178.15" routeLength="1996.47" waitingTime="13.70" waitingCount="2" stopTime="0.00" timeLoss="33.82" rerouteNo="1" devices="tripinfo_car_n2e_84 routing_car_n2e_84" vType="Car" speedFactor="1.00" vaporized=""/>
    <tripinfo id="car_n2w_83" depart="83.00" departLane="n2sep_1" departPos="3.60" departPosLat="0.00" departSpeed="13.90" departDelay="0.00" arrival="267.00" arrivalLane="c2w_1" arrivalPos="990.00" arrivalPosLat="0.00" arrivalSpeed="13.90" duration="184.00" routeLength="1986.69" waitingTime="27.25" waitingCount="1" stopTime="0.00" timeLoss="40.32" rerouteNo="1" devices="tripinfo_car_n2w_83 routing_car_n2w_83" vType="Car" speedFactor="1.00" vaporized=""/>
    <tripinfo id="car_n2e_116" depart="116.00" departLane="n2sep_1" departPos="3.60" departPosLat="0.00" departSpeed="13.90" departDelay="0.00" arrival="270.70" arrivalLane="c2e_1" arrivalPos="990.00" arrivalPosLat="0.00" arrivalSpeed="13.88" duration="154.70" routeLength="1996.47" waitingTime="0.00" waitingCount="0" stopTime="0.00" timeLoss="10.35" rerouteNo="1" devices="tripinfo_car_n2e_116 routing_car_n2e_116" vType="Car" speedFactor="1.00" vaporized=""/>
    <tripinfo id="car_s2n_130" depart="130.00" departLane="s2sep_1" departPos="3.60" departPosLat="0.00" departSpeed="13.90" departDelay="0.00" arrival="270.75" arrivalLane="c2n_1" arrivalPos="990.00" arrivalPosLat="0.00" arrivalSpeed="14.23" duration="140.75" routeLength="1997.01" waitingTime="0.00" waitingCount="0" stopTime="0.00" timeLoss="0.35" rerouteNo="1" devices="tripinfo_car_s2n_130 routing_car_s2n_130" vType="Car" speedFactor="1.02" vaporized=""/>
    <tripinfo id="bus_n2w_84" depart="87.10" departLane="n2sep_1" departPos="12.10" departPosLat="0.00" departSpeed="13.90" departDelay="3.10" arrival="272.35" arrivalLane="c2w_1" arrivalPos="990.00" arrivalPosLat="0.00" arrivalSpeed="13.87" duration="185.25" routeLength="1978.19" waitingTime="22.75" waitingCount="1" stopTime="0.00" timeLoss="42.17" rerouteNo="1" devices="tripinfo_bus_n2w_84 routing_bus_n2w_84" vType="Bus" speedFactor="1.00" vaporized=""/>
    <tripinfo id="car_n2w_86" depart="90.70" departLane="n2sep_1" departPos="3.60" departPosLat="0.00" departSpeed="13.90" departDelay="4.70" arrival="275.95" arrivalLane="c2w_1" arrivalPos="990.00" arrivalPosLat="0.00" arrivalSpeed="14.27" duration="185.25" routeLength="1986.69" waitingTime="18.10" waitingCount="1" stopTime="0.00" timeLoss="45.82" rerouteNo="1" devices="tripinfo_car_n2w_86 routing_car_n2w_86" vType="Car" speedFactor="1.03" vaporized=""/>
    <tripinfo id="car_n2s_98" depart="98.00" departLane="n2sep_1" departPos="3.60" departPosLat="0.00" departSpeed="13.90" departDelay="0.00" arrival="277.75" arrivalLane="c2s_1" arrivalPos="990.00" arrivalPosLat="0.00" arrivalSpeed="13.90" duration="179.75" routeLength="1997.01" waitingTime="15.80" waitingCount="1" stopTime="0.00" timeLoss="36.05" rerouteNo="1" devices="tripinfo_car_n2s_98 routing_car_n2s_98" vType="Car" speedFactor="1.00" vaporized=""/>
    <tripinfo id="car_n2w_90" depart="92.60" departLane="n2sep_1" departPos="3.60" departPosLat="0.00" departSpeed="13.90" departDelay="2.60" arrival="278.75" arrivalLane="c2w_1" arrivalPos="990.00" arrivalPosLat="0.00" arrivalSpeed="14.33" duration="186.15" routeLength="1986.69" waitingTime="17.15" waitingCount="1" stopTime="0.00" timeLoss="47.73" rerouteNo="1" devices="tripinfo_car_n2w_90 routing_car_n2w_90" vType="Car" speedFactor="1.04" vaporized=""/>
    <tripinfo id="car_n2s_112" depart="112.00" departLane="n2sep_1" departPos="3.60" departPosLat="0.00" departSpeed="13.90" departDelay="0.00" arrival="280.05" arrivalLane="c2s_1" arrivalPos="990.00" arrivalPosLat="0.00" arrivalSpeed="14.94" duration="168.05" routeLength="1997.01" waitingTime="12.60" waitingCount="1" stopTime="0.00" timeLoss="36.91" rerouteNo="1" devices="tripinfo_car_n2s_112 routing_car_n2s_112" vType="Car" speedFactor="1.10" vaporized=""/>
    <tripinfo id="car_n2w_100" depart="100.00" departLane="n2sep_1" departPos="3.60" departPosLat="0.00" departSpeed="13.90" departDelay="0.00" arrival="282.45" arrivalLane="c2w_1" arrivalPos="990.00" arrivalPosLat="0.00" arrivalSpeed="13.88" duration="182.45" routeLength="1986.69" waitingTime="14.45" waitingCount="1" stopTime="0.00" timeLoss="38.77" rerouteNo="1" devices="tripinfo_car_n2w_100 routing_car_n2w_100" vType="Car" speedFactor="1.00" vaporized=""/>
    <tripinfo id="car_n2s_119" depart="119.00" departLane="n2sep_1" departPos="3.60" departPosLat="0.00" departSpeed="13.90" departDelay="0.00" arrival="285.20" arrivalLane="c2s_1" arrivalPos="990.00" arrivalPosLat="0.00" arrivalSpeed="13.90" duration="166.20" routeLength="1997.01" waitingTime="0.00" waitingCount="0" stopTime="0.00" timeLoss="22.53" rerouteNo="1" devices="tripinfo_car_n2s_119 routing_car_n2s_119" vType="Car" speedFactor="1.00" vaporized=""/>
    <tripinfo id="car_s2w_62" depart="62.00" departLane="s2sep_1" departPos="3.60" departPosLat="0.00" departSpeed="13.90" departDelay="0.00" arrival="288.55" arrivalLane="c2w_1" arrivalPos="990.00" arrivalPosLat="0.00" arrivalSpeed="13.90" duration="226.55" routeLength="1996.47" waitingTime="70.55" waitingCount="3" stopTime="0.00" timeLoss="82.22" rerouteNo="1" devices="tripinfo_car_s2w_62 routing_car_s2w_62" vType="Car" speedFactor="1.00" vaporized=""/>
    <tripinfo id="car_s2w_94" depart="94.00" departLane="s2sep_1" departPos="3.60" departPosLat="0.00" departSpeed="13.90" departDelay="0.00" arrival="291.40" arrivalLane="c2w_1" arrivalPos="990.00" arrivalPosLat="0.00" arrivalSpeed="14.41" duration="197.40" routeLength="1996.47" waitingTime="41.45" waitingCount="2" stopTime="0.00" timeLoss="59.09" rerouteNo="1" devices="tripinfo_car_s2w_94 routing_car_s2w_94" vType="Car" speedFactor="1.04" vaporized=""/>
    <tripinfo id="car_s2w_111" depart="111.00" departLane="s2sep_1" departPos="3.60" departPosLat="0.00" departSpeed="13.90" departDelay="0.00" arrival="293.30" arrivalLane="c2w_1" arrivalPos="990.00" arrivalPosLat="0.00" arrivalSpeed="15.48" duration="182.30" routeLength="1996.47" waitingTime="29.95" waitingCount="2" stopTime="0.00" timeLoss="58.81" rerouteNo="1" devices="tripinfo_car_s2w_111 routing_car_s2w_111" vType="Car" speedFactor="1.17" vaporized=""/>
    <tripinfo id="car_s2w_112" depart="112.25" departLane="s2sep_1" departPos="3.60" departPosLat="0.00" departSpeed="13.90" departDelay="0.25" arrival="297.30" arrivalLane="c2w_1" arrivalPos="990.00" arrivalPosLat="0.00" arrivalSpeed="13.93" duration="185.05" routeLength="1996.47" waitingTime="23.65" waitingCount="1" stopTime="0.00" timeLoss="41.18" rerouteNo="1" devices="tripinfo_car_s2w_112 routing_car_s2w_112" vType="Car" speedFactor="1.00" vaporized=""/>
    <tripinfo id="car_s2w_137" depart="137.00" departLane="s2sep_1" departPos="3.60" departPosLat="0.00" departSpeed="13.90" departDelay="0.00" arrival="299.55" arrivalLane="c2w_1" arrivalPos="990.00" arrivalPosLat="0.00" arrivalSpeed="14.73" duration="162.55" routeLength="1996.47" waitingTime="10.15" waitingCount="1" stopTime="0.00" timeLoss="29.19" rerouteNo="1" devices="tripinfo_car_s2w_137 routing_car_s2w_137" vType="Car" speedFactor="1.08" vaporized=""/>
    <tripinfo id="car_w2s_98" depart="98.00" departLane="w2sep_1" departPos="3.60" departPosLat="0.00" departSpeed="13.90" departDelay="0.00" arrival="300.00" arrivalLane="c2s_1" arrivalPos="990.00" arrivalPosLat="0.00" arrivalSpeed="14.04" duration="202.00" routeLength="1986.69" waitingTime="52.55" waitingCount="1" stopTime="0.00" timeLoss="59.78" rerouteNo="1" devices="tripinfo_car_w2s_98 routing_car_w2s_98" vType="Car" speedFactor="1.01" vaporized=""/>
    <tripinfo id="car_e2n_101" depart="101.00" departLane="e2sep_1" departPos="3.60" departPosLat="0.00" departSpeed="13.90" departDelay="0.00" arrival="300.65" arrivalLane="c2n_1" arrivalPos="990.00" arrivalPosLat="0.00" arrivalSpeed="13.90" duration="199.65" routeLength="1986.69" waitingTime="49.20" waitingCount="1" stopTime="0.00" timeLoss="55.96" rerouteNo="1" devices="tripinfo_car_e2n_101 routing_car_e2n_101" vType="Car" speedFactor="1.00" vaporized=""/>
    <tripinfo id="car_e2n_163" depart="163.35" departLane="e2sep_1" departPos="3.60" departPosLat="0.00" departSpeed="13.90" departDelay="0.35" arrival="302.50" arrivalLane="c2n_1" arrivalPos="990.00" arrivalPosLat="0.00" arrivalSpeed="15.51" duration="139.15" routeLength="1986.69" waitingTime="0.00" waitingCount="0" stopTime="0.00" timeLoss="17.33" rerouteNo="1" devices="tripinfo_car_e2n_163 routing_car_e2n_163" vType="Car" speedFactor="1.18" vaporized=""/>
    <tripinfo id="car_w2e_112" depart="112.45" departLane="w2sep_1" departPos="3.60" departPosLat="0.00" departSpeed="13.90" departDelay="0.45" arrival="304.00" arrivalLane="c2e_1" arrivalPos="990.00" arrivalPosLat="0.00" arrivalSpeed="14.13" duration="191.55" routeLength="1997.01" waitingTime="37.80" waitingCount="1" stopTime="0.00" timeLoss="50.21" rerouteNo="1" devices="tripinfo_car_w2e_112 routing_car_w2e_112" vType="Car" speedFactor="1.02" vaporized=""/>
    <tripinfo id="car_w2s_111" depart="111.00" departLane="w2sep_1" departPos="3.60" departPosLat="0.00" departSpeed="13.90" departDelay="0.00" arrival="304.90" arrivalLane="c2s_1" arrivalPos="990.00" arrivalPosLat="0.00" arrivalSpeed="13.89" duration="193.90" routeLength="1986.69" waitingTime="39.90" waitingCount="1" stopTime="0.00" timeLoss="50.26" rerouteNo="1" devices="tripinfo_car_w2s_111 routing_car_w2s_111" vType="Car" speedFactor="1.00" vaporized=""/>
    <tripinfo id="car_w2e_121" depart="121.00" departLane="w2sep_1" departPos="3.60" departPosLat="0.00" departSpeed="13.90" departDelay="0.00" arrival="306.05" arrivalLane="c2e_1" arrivalPos="990.00" arrivalPosLat="0.00" arrivalSpeed="15.37" duration="185.05" routeLength="1997.01" waitingTime="37.05" waitingCount="1" stopTime="0.00" timeLoss="59.28" rerouteNo="1" devices="tripinfo_car_w2e_121 routing_car_w2e_121" vType="Car" speedFactor="1.14" vaporized=""/>
    <tripinfo id="car_e2w_173" depart="173.00" departLane="e2sep_1" departPos="3.60" departPosLat="0.00" departSpeed="13.90" departDelay="0.00" arrival="306.30" arrivalLane="c2w_1" arrivalPos="990.00" arrivalPosLat="0.00" arrivalSpeed="15.11" duration="133.30" routeLength="1997.01" waitingTime="0.00" waitingCount="0" stopTime="0.00" timeLoss="1.12" rerouteNo="1" devices="tripinfo_car_e2w_173 routing_car_e2w_173" vType="Car" speedFactor="1.09" vaporized=""/>
    <tripinfo id="car_e2s_69" depart="69.00" departLane="e2sep_1" departPos="3.60" departPosLat="0.00" departSpeed="13.90" departDelay="0.00" arrival="308.00" arrivalLane="c2s_1" arrivalPos="990.00" arrivalPosLat="0.00" arrivalSpeed="15.93" duration="239.00" routeLength="1996.47" waitingTime="68.75" waitingCount="3" stopTime="0.00" timeLoss="113.98" rerouteNo="1" devices="tripinfo_car_e2s_69 routing_car_e2s_69" vType="Car" speedFactor="1.15" vaporized=""/>
    <tripinfo id="car_w2n_142" depart="142.00" departLane="w2sep_1" departPos="3.60" departPosLat="0.00" departSpeed="13.90" departDelay="0.00" arrival="308.15" arrivalLane="c2n_1" arrivalPos="990.00" arrivalPosLat="0.00" arrivalSpeed="15.55" duration="166.15" routeLength="1996.47" waitingTime="24.95" waitingCount="2" stopTime="0.00" timeLoss="37.21" rerouteNo="1" devices="tripinfo_car_w2n_142 routing_car_w2n_142" vType="Car" speedFactor="1.12" vaporized=""/>
    <tripinfo id="car_w2e_155" depart="155.00" departLane="w2sep_1" departPos="3.60" departPosLat="0.00" departSpeed="13.90" departDelay="0.00" arrival="309.65" arrivalLane="c2e_1" arrivalPos="990.00" arrivalPosLat="0.00" arrivalSpeed="14.43" duration="154.65" routeLength="1997.01" waitingTime="2.00" waitingCount="1" stopTime="0.00" timeLoss="16.46" rerouteNo="1" devices="tripinfo_car_w2e_155 routing_car_w2e_155" vType="Car" speedFactor="1.04" vaporized=""/>
    <tripinfo id="car_e2s_137" depart="137.00" departLane="e2sep_1" departPos="3.60" departPosLat="0.00" departSpeed="13.90" departDelay="0.00" arrival="312.05" arrivalLane="c2s_1" arrivalPos="990.00" arrivalPosLat="0.00" arrivalSpeed="15.71" duration="175.05" routeLength="1996.47" waitingTime="31.55" waitingCount="2" stopTime="0.00" timeLoss="47.55" rerouteNo="1" devices="tripinfo_car_e2s_137 routing_car_e2s_137" vType="Car" speedFactor="1.13" vaporized=""/>
    <tripinfo id="car_w2e_163" depart="163.00" departLane="w2sep_1" departPos="3.60" departPosLat="0.00" departSpeed="13.90" departDelay="0.00" arrival="313.95" arrivalLane="c2e_1" arrivalPos="990.00" arrivalPosLat="0.00" arrivalSpeed="13.89" duration="150.95" routeLength="1997.01" waitingTime="0.00" waitingCount="0" stopTime="0.00" timeLoss="7.26" rerouteNo="1" devices="tripinfo_car_w2e_163 routing_car_w2e_163" vType="Car" speedFactor="1.00" vaporized=""/>
    <tripinfo id="car_w2n_166" depart="166.00" departLane="w2sep_1" departPos="3.60" departPosLat="0.00" departSpeed="13.90" departDelay="0.00" arrival="315.85" arrivalLane="c2n_1" arrivalPos="990.00" arrivalPosLat="0.00" arrivalSpeed="14.35" duration="149.85" routeLength="1996.47" waitingTime="0.00" waitingCount="0" stopTime="0.00" timeLoss="10.04" rerouteNo="1" devices="tripinfo_car_w2n_166 routing_car_w2n_166" vType="Car" speedFactor="1.03" vaporized=""/>
    <tripinfo id="car_w2e_167" depart="167.50" departLane="w2sep_1" departPos="3.60" departPosLat="0.00" departSpeed="13.90" departDelay="0.50" arrival="316.05" arrivalLane="c2e_1" arrivalPos="990.00" arrivalPosLat="0.00" arrivalSpeed="14.89" duration="148.55" routeLength="1997.01" waitingTime="0.00" waitingCount="0" stopTime="0.00" timeLoss="18.19" rerouteNo="1" devices="tripinfo_car_w2e_167 routing_car_w2e_167" vType="Car" speedFactor="1.10" vaporized=""/>
    <tripinfo id="car_w2n_177" depart="177.00" departLane="w2sep_1" departPos="3.60" departPosLat="0.00" departSpeed="13.90" departDelay="0.00" arrival="321.30" arrivalLane="c2n_1" arrivalPos="990.00" arrivalPosLat="0.00" arrivalSpeed="14.38" duration="144.30" routeLength="1996.47" waitingTime="0.00" waitingCount="0" stopTime="0.00" timeLoss="4.76" rerouteNo="1" devices="tripinfo_car_w2n_177 routing_car_w2n_177" vType="Car" speedFactor="1.03" vaporized=""/>
    <tripinfo id="car_e2s_149" depart="149.00" departLane="e2sep_1" departPos="3.60" departPosLat="0.00" departSpeed="13.90" departDelay="0.00" arrival="321.45" arrivalLane="c2s_1" arrivalPos="990.00" arrivalPosLat="0.00" arrivalSpeed="13.90" duration="172.45" routeLength="1996.47" waitingTime="10.60" waitingCount="2" stopTime="0.00" timeLoss="28.11" rerouteNo="1" devices="tripinfo_car_e2s_149 routing_car_e2s_149" vType="Car" speedFactor="1.00" vaporized=""/>
    <tripinfo id="car_e2s_152" depart="152.00" departLane="e2sep_1" departPos="3.60" departPosLat="0.00" departSpeed="13.90" departDelay="0.00" arrival="323.35" arrivalLane="c2s_1" arrivalPos="990.00" arrivalPosLat="0.00" arrivalSpeed="15.33" duration="171.35" routeLength="1996.47" waitingTime="9.20" waitingCount="2" stopTime="0.00" timeLoss="46.33" rerouteNo="1" devices="tripinfo_car_e2s_152 routing_car_e2s_152" vType="Car" speedFactor="1.15" vaporized=""/>
    <tripinfo id="car_e2s_162" depart="162.00" departLane="e2sep_1" departPos="3.60" departPosLat="0.00" departSpeed="13.90" departDelay="0.00" arrival="326.15" arrivalLane="c2s_1" arrivalPos="990.00" arrivalPosLat="0.00" arrivalSpeed="14.58" duration="164.15" routeLength="1996.47" waitingTime="6.40" waitingCount="1" stopTime="0.00" timeLoss="27.46" rerouteNo="1" devices="tripinfo_car_e2s_162 routing_car_e2s_162" vType="Car" speedFactor="1.06" vaporized=""/>
    <tripinfo id="car_e2s_189" depart="189.00" departLane="e2sep_1" departPos="3.60" departPosLat="0.00" departSpeed="13.90" departDelay="0.00" arrival="334.75" arrivalLane="c2s_1" arrivalPos="990.00" arrivalPosLat="0.00" arrivalSpeed="14.13" duration="145.75" routeLength="1996.47" waitingTime="0.00" waitingCount="0" stopTime="0.00" timeLoss="3.81" rerouteNo="1" devices="tripinfo_car_e2s_189 routing_car_e2s_189" vType="Car" speedFactor="1.02" vaporized=""/>
    <tripinfo id="car_s2e_154" depart="154.00" departLane="s2sep_1" departPos="3.60" departPosLat="0.00" departSpeed="13.90" departDelay="0.00" arrival="335.55" arrivalLane="c2e_1" arrivalPos="990.00" arrivalPosLat="0.00" arrivalSpeed="16.29" duration="181.55" routeLength="1986.69" waitingTime="50.35" waitingCount="1" stopTime="0.00" timeLoss="58.91" rerouteNo="1" devices="tripinfo_car_s2e_154 routing_car_s2e_154" vType="Car" speedFactor="1.17" vaporized=""/>
    <tripinfo id="car_n2w_145" depart="145.00" departLane="n2sep_1" departPos="3.60" departPosLat="0.00" departSpeed="13.90" departDelay="0.00" arrival="344.55" arrivalLane="c2w_1" arrivalPos="990.00" arrivalPosLat="0.00" arrivalSpeed="14.12" duration="199.55" routeLength="1986.69" waitingTime="51.00" waitingCount="1" stopTime="0.00" timeLoss="58.10" rerouteNo="1" devices="tripinfo_car_n2w_145 routing_car_n2w_145" vType="Car" speedFactor="1.02" vaporized=""/>
    <tripinfo id="car_n2s_156" depart="156.00" departLane="n2sep_1" departPos="3.60" departPosLat="0.00" departSpeed="13.90" departDelay="0.00" arrival="346.45" arrivalLane="c2s_1" arrivalPos="990.00" arrivalPosLat="0.00" arrivalSpeed="14.21" duration="190.45" routeLength="1997.01" waitingTime="39.45" waitingCount="1" stopTime="0.00" timeLoss="49.85" rerouteNo="1" devices="tripinfo_car_n2s_156 routing_car_n2s_156" vType="Car" speedFactor="1.02" vaporized=""/>
    <tripinfo id="car_s2e_157" depart="157.00" departLane="s2sep_1" departPos="3.60" departPosLat="0.00" departSpeed="13.90" departDelay="0.00" arrival="347.00" arrivalLane="c2e_1" arrivalPos="990.00" arrivalPosLat="0.00" arrivalSpeed="14.22" duration="190.00" routeLength="1986.69" waitingTime="40.15" waitingCount="1" stopTime="0.00" timeLoss="49.56" rerouteNo="1" devices="tripinfo_car_s2e_157 routing_car_s2e_157" vType="Car" speedFactor="1.02" vaporized=""/>
    <tripinfo id="car_n2s_160" depart="160.00" departLane="n2sep_1" departPos="3.60" departPosLat="0.00" departSpeed="13.90" departDelay="0.00" arrival="351.65" arrivalLane="c2s_1" arrivalPos="990.00" arrivalPosLat="0.00" arrivalSpeed="13.90" duration="191.65" routeLength="1997.01" waitingTime="36.05" waitingCount="1" stopTime="0.00" timeLoss="47.98" rerouteNo="1" devices="tripinfo_car_n2s_160 routing_car_n2s_160" vType="Car" speedFactor="1.00" vaporized=""/>
    <tripinfo id="bus_s2n_191" depart="191.00" departLane="s2sep_1" departPos="12.10" departPosLat="0.00" departSpeed="13.90" departDelay="0.00" arrival="352.75" arrivalLane="c2n_1" arrivalPos="990.00" arrivalPosLat="0.00" arrivalSpeed="13.90" duration="161.75" routeLength="1988.51" waitingTime="7.35" waitingCount="1" stopTime="0.00" timeLoss="18.68" rerouteNo="1" devices="tripinfo_bus_s2n_191 routing_bus_s2n_191" vType="Bus" speedFactor="1.00" vaporized=""/>
    <tripinfo id="car_n2w_170" depart="170.00" departLane="n2sep_1" departPos="3.60" departPosLat="0.00" departSpeed="13.90" departDelay="0.00" arrival="354.20" arrivalLane="c2w_1" arrivalPos="990.00" arrivalPosLat="0.00" arrivalSpeed="14.00" duration="184.20" routeLength="1986.69" waitingTime="29.70" waitingCount="1" stopTime="0.00" timeLoss="41.57" rerouteNo="1" devices="tripinfo_car_n2w_170 routing_car_n2w_170" vType="Car" speedFactor="1.01" vaporized=""/>
    <tripinfo id="car_n2s_162" depart="162.00" departLane="n2sep_1" departPos="3.60" departPosLat="0.00" departSpeed="13.90" departDelay="0.00" arrival="354.85" arrivalLane="c2s_1" arrivalPos="990.00" arrivalPosLat="0.00" arrivalSpeed="14.12" duration="192.85" routeLength="1997.01" waitingTime="34.30" waitingCount="1" stopTime="0.00" timeLoss="51.95" rerouteNo="1" devices="tripinfo_car_n2s_162 routing_car_n2s_162" vType="Car" speedFactor="1.02" vaporized=""/>
    <tripinfo id="car_s2w_150" depart="150.00" departLane="s2sep_1" departPos="3.60" departPosLat="0.00" departSpeed="13.90" departDelay="0.00" arrival="356.05" arrivalLane="c2w_1" arrivalPos="990.00" arrivalPosLat="0.00" arrivalSpeed="15.53" duration="206.05" routeLength="1996.47" waitingTime="55.40" waitingCount="3" stopTime="0.00" timeLoss="83.58" rerouteNo="1" devices="tripinfo_car_s2w_150 routing_car_s2w_150" vType="Car" speedFactor="1.18" vaporized=""/>
    <tripinfo id="car_n2e_153" depart="153.00" departLane="n2sep_1" departPos="3.60" departPosLat="0.00" departSpeed="13.90" departDelay="0.00" arrival="357.00" arrivalLane="c2e_1" arrivalPos="990.00" arrivalPosLat="0.00" arrivalSpeed="13.97" duration="204.00" routeLength="1996.47" waitingTime="49.40" waitingCount="2" stopTime="0.00" timeLoss="60.42" rerouteNo="1" devices="tripinfo_car_n2e_153 routing_car_n2e_153" vType="Car" speedFactor="1.01" vaporized=""/>
    <tripinfo id="car_s2n_200" depart="200.00" departLane="s2sep_1" departPos="3.60" departPosLat="0.00" departSpeed="13.90" departDelay="0.00" arrival="357.65" arrivalLane="c2n_1" arrivalPos="990.00" arrivalPosLat="0.00" arrivalSpeed="13.89" duration="157.65" routeLength="1997.01" waitingTime="0.00" waitingCount="0" stopTime="0.00" timeLoss="13.94" rerouteNo="1" devices="tripinfo_car_s2n_200 routing_car_s2n_200" vType="Car" speedFactor="1.00" vaporized=""/>
    <tripinfo id="car_n2s_217" depart="217.00" departLane="n2sep_1" departPos="3.60" departPosLat="0.00" departSpeed="13.90" departDelay="0.00" arrival="360.90" arrivalLane="c2s_1" arrivalPos="990.00" arrivalPosLat="0.00" arrivalSpeed="14.00" duration="143.90" routeLength="1997.01" waitingTime="0.00" waitingCount="0" stopTime="0.00" timeLoss="1.23" rerouteNo="1" devices="tripinfo_car_n2s_217 routing_car_n2s_217" vType="Car" speedFactor="1.01" vaporized=""/>
    <tripinfo id="car_s2e_217" depart="217.00" departLane="s2sep_1" departPos="3.60" departPosLat="0.00" departSpeed="13.90" departDelay="0.00" arrival="362.25" arrivalLane="c2e_1" arrivalPos="990.00" arrivalPosLat="0.00" arrivalSpeed="14.20" duration="145.25" routeLength="1986.69" waitingTime="0.00" waitingCount="0" stopTime="0.00" timeLoss="4.70" rerouteNo="1" devices="tripinfo_car_s2e_217 routing_car_s2e_217" vType="Car" speedFactor="1.02" vaporized=""/>
    <tripinfo id="car_n2s_220" depart="220.00" departLane="n2sep_1" departPos="3.60" departPosLat="0.00" departSpeed="13.90" departDelay="0.00" arrival="365.15" arrivalLane="c2s_1" arrivalPos="990.00" arrivalPosLat="0.00" arrivalSpeed="14.12" duration="145.15" routeLength="1997.01" waitingTime="0.00" waitingCount="0" stopTime="0.00" timeLoss="3.80" rerouteNo="1" devices="tripinfo_car_n2s_220 routing_car_n2s_220" vType="Car" speedFactor="1.02" vaporized=""/>
    <tripinfo id="bus_s2n_219" depart="219.00" departLane="s2sep_1" departPos="12.10" departPosLat="0.00" departSpeed="13.90" departDelay="0.00" arrival="365.70" arrivalLane="c2n_1" arrivalPos="990.00" arrivalPosLat="0.00" arrivalSpeed="13.90" duration="146.70" routeLength="1988.51" waitingTime="0.00" waitingCount="0" stopTime="0.00" timeLoss="3.62" rerouteNo="1" devices="tripinfo_bus_s2n_219 routing_bus_s2n_219" vType="Bus" speedFactor="1.00" vaporized=""/>
    <tripinfo id="car_n2w_227" depart="227.00" departLane="n2sep_1" departPos="3.60" departPosLat="0.00" departSpeed="13.90" departDelay="0.00" arrival="367.95" arrivalLane="c2w_1" arrivalPos="990.00" arrivalPosLat="0.00" arrivalSpeed="15.16" duration="140.95" routeLength="1986.69" waitingTime="0.00" waitingCount="0" stopTime="0.00" timeLoss="9.25" rerouteNo="1" devices="tripinfo_car_n2w_227 routing_car_n2w_227" vType="Car" speedFactor="1.09" vaporized=""/>
    <tripinfo id="car_n2s_225" depart="225.00" departLane="n2sep_1" departPos="3.60" departPosLat="0.00" departSpeed="13.90" departDelay="0.00" arrival="368.35" arrivalLane="c2s_1" arrivalPos="990.00" arrivalPosLat="0.00" arrivalSpeed="14.37" duration="143.35" routeLength="1997.01" waitingTime="0.00" waitingCount="0" stopTime="0.00" timeLoss="4.88" rerouteNo="1" devices="tripinfo_car_n2s_225 routing_car_n2s_225" vType="Car" speedFactor="1.04" vaporized=""/>
    <tripinfo id="car_s2n_222" depart="222.00" departLane="s2sep_1" departPos="3.60" departPosLat="0.00" departSpeed="13.90" departDelay="0.00" arrival="368.55" arrivalLane="c2n_1" arrivalPos="990.00" arrivalPosLat="0.00" arrivalSpeed="14.97" duration="146.55" routeLength="1997.01" waitingTime="0.00" waitingCount="0" stopTime="0.00" timeLoss="14.95" rerouteNo="1" devices="tripinfo_car_s2n_222 routing_car_s2n_222" vType="Car" speedFactor="1.09" vaporized=""/>
    <tripinfo id="car_n2e_188" depart="188.00" departLane="n2sep_1" departPos="3.60" departPosLat="0.00" departSpeed="13.90" departDelay="0.00" arrival="371.40" arrivalLane="c2e_1" arrivalPos="990.00" arrivalPosLat="0.00" arrivalSpeed="13.90" duration="183.40" routeLength="1996.47" waitingTime="22.65" waitingCount="3" stopTime="0.00" timeLoss="39.09" rerouteNo="1" devices="tripinfo_car_n2e_188 routing_car_n2e_188" vType="Car" speedFactor="1.00" vaporized=""/>
    <tripinfo id="car_s2w_237" depart="237.00" departLane="s2sep_1" departPos="3.60" departPosLat="0.00" departSpeed="13.90" departDelay="0.00" arrival="373.30" arrivalLane="c2w_1" arrivalPos="990.00" arrivalPosLat="0.00" arrivalSpeed="15.25" duration="136.30" routeLength="1996.47" waitingTime="0.00" waitingCount="0" stopTime="0.00" timeLoss="4.74" rerouteNo="1" devices="tripinfo_car_s2w_237 routing_car_s2w_237" vType="Car" speedFactor="1.10" vaporized=""/>
    <tripinfo id="car_n2e_231" depart="231.00" departLane="n2sep_1" departPos="3.60" departPosLat="0.00" departSpeed="13.90" departDelay="0.00" arrival="378.80" arrivalLane="c2e_1" arrivalPos="990.00" arrivalPosLat="0.00" arrivalSpeed="14.04" duration="147.80" routeLength="1996.47" waitingTime="0.00" waitingCount="0" stopTime="0.00" timeLoss="4.87" rerouteNo="1" devices="tripinfo_car_n2e_231 routing_car_n2e_231" vType="Car" speedFactor="1.01" vaporized=""/>
    <tripinfo id="car_w2s_200" depart="200.00" departLane="w2sep_1" departPos="3.60" departPosLat="0.00" departSpeed="13.90" departDelay="0.00" arrival="384.10" arrivalLane="c2s_1" arrivalPos="990.00" arrivalPosLat="0.00" arrivalSpeed="15.95" duration="184.10" routeLength="1986.69" waitingTime="48.55" waitingCount="1" stopTime="0.00" timeLoss="58.92" rerouteNo="1" devices="tripinfo_car_w2s_200 routing_car_w2s_200" vType="Car" speedFactor="1.15" vaporized=""/>
    <tripinfo id="car_n2e_239" depart="239.00" departLane="n2sep_1" departPos="3.60" departPosLat="0.00" departSpeed="13.90" departDelay="0.00" arrival="387.30" arrivalLane="c2e_1" arrivalPos="990.00" arrivalPosLat="0.00" arrivalSpeed="13.90" duration="148.30" routeLength="1996.47" waitingTime="0.00" waitingCount="0" stopTime="0.00" timeLoss="3.97" rerouteNo="1" devices="tripinfo_car_n2e_239 routing_car_n2e_239" vType="Car" speedFactor="1.00" vaporized=""/>
    <tripinfo id="car_e2w_206" depart="206.00" departLane="e2sep_1" departPos="3.60" departPosLat="0.00" departSpeed="13.90" departDelay="0.00" arrival="387.95" arrivalLane="c2w_1" arrivalPos="990.00" arrivalPosLat="0.00" arrivalSpeed="14.49" duration="181.95" routeLength="1997.01" waitingTime="36.75" waitingCount="1" stopTime="0.00" timeLoss="44.13" rerouteNo="1" devices="tripinfo_car_e2w_206 routing_car_e2w_206" vType="Car" speedFactor="1.04" vaporized=""/>
    <tripinfo id="car_e2n_225" depart="225.00" departLane="e2sep_1" departPos="3.60" departPosLat="0.00" departSpeed="13.90" departDelay="0.00" arrival="390.10" arrivalLane="c2n_1" arrivalPos="990.00" arrivalPosLat="0.00" arrivalSpeed="14.50" duration="165.10" routeLength="1986.69" waitingTime="18.60" waitingCount="1" stopTime="0.00" timeLoss="27.41" rerouteNo="1" devices="tripinfo_car_e2n_225 routing_car_e2n_225" vType="Car" speedFactor="1.04" vaporized=""/>
    <tripinfo id="car_w2e_192" depart="192.00" departLane="w2sep_1" departPos="3.60" departPosLat="0.00" departSpeed="13.90" departDelay="0.00" arrival="390.80" arrivalLane="c2e_1" arrivalPos="990.00" arrivalPosLat="0.00" arrivalSpeed="14.29" duration="198.80" routeLength="1997.01" waitingTime="50.55" waitingCount="1" stopTime="0.00" timeLoss="59.37" rerouteNo="1" devices="tripinfo_car_w2e_192 routing_car_w2e_192" vType="Car" speedFactor="1.03" vaporized=""/>
    <tripinfo id="car_e2w_233" depart="233.00" departLane="e2sep_1" departPos="3.60" departPosLat="0.00" departSpeed="13.90" departDelay="0.00" arrival="391.25" arrivalLane="c2w_1" arrivalPos="990.00" arrivalPosLat="0.00" arrivalSpeed="15.07" duration="158.25" routeLength="1997.01" waitingTime="13.05" waitingCount="1" stopTime="0.00" timeLoss="26.19" rerouteNo="1" devices="tripinfo_car_e2w_233 routing_car_e2w_233" vType="Car" speedFactor="1.09" vaporized=""/>
    <tripinfo id="car_w2s_244" depart="244.00" departLane="w2sep_1" departPos="3.60" departPosLat="0.00" departSpeed="13.90" departDelay="0.00" arrival="393.10" arrivalLane="c2s_1" arrivalPos="990.00" arrivalPosLat="0.00" arrivalSpeed="14.91" duration="149.10" routeLength="1986.69" waitingTime="0.00" waitingCount="0" stopTime="0.00" timeLoss="15.16" rerouteNo="1" devices="tripinfo_car_w2s_244 routing_car_w2s_244" vType="Car" speedFactor="1.07" vaporized=""/>
    <tripinfo id="car_e2w_237" depart="237.00" departLane="e2sep_1" departPos="3.60" departPosLat="0.00" departSpeed="13.90" departDelay="0.00" arrival="393.85" arrivalLane="c2w_1" arrivalPos="990.00" arrivalPosLat="0.00" arrivalSpeed="15.42" duration="156.85" routeLength="1997.01" waitingTime="11.65" waitingCount="1" stopTime="0.00" timeLoss="28.75" rerouteNo="1" devices="tripinfo_car_e2w_237 routing_car_e2w_237" vType="Car" speedFactor="1.12" vaporized=""/>
    <tripinfo id="car_w2e_242" depart="242.00" departLane="w2sep_1" departPos="3.60" departPosLat="0.00" departSpeed="13.90" departDelay="0.00" arrival="396.00" arrivalLane="c2e_1" arrivalPos="990.00" arrivalPosLat="0.00" arrivalSpeed="13.90" duration="154.00" routeLength="1997.01" waitingTime="0.00" waitingCount="0" stopTime="0.00" timeLoss="10.31" rerouteNo="1" devices="tripinfo_car_w2e_242 routing_car_w2e_242" vType="Car" speedFactor="1.00" vaporized=""/>
    <tripinfo id="car_e2w_251" depart="251.00" departLane="e2sep_1" departPos="3.60" departPosLat="0.00" departSpeed="13.90" departDelay="0.00" arrival="396.25" arrivalLane="c2w_1" arrivalPos="990.00" arrivalPosLat="0.00" arrivalSpeed="15.97" duration="145.25" routeLength="1997.01" waitingTime="0.00" waitingCount="0" stopTime="0.00" timeLoss="22.33" rerouteNo="1" devices="tripinfo_car_e2w_251 routing_car_e2w_251" vType="Car" speedFactor="1.17" vaporized=""/>
    <tripinfo id="car_w2s_261" depart="261.00" departLane="w2sep_1" departPos="3.60" departPosLat="0.00" departSpeed="13.90" departDelay="0.00" arrival="397.55" arrivalLane="c2s_1" arrivalPos="990.00" arrivalPosLat="0.00" arrivalSpeed="15.23" duration="136.55" routeLength="1986.69" waitingTime="0.00" waitingCount="0" stopTime="0.00" timeLoss="5.52" rerouteNo="1" devices="tripinfo_car_w2s_261 routing_car_w2s_261" vType="Car" speedFactor="1.10" vaporized=""/>
    <tripinfo id="car_e2w_267" depart="267.00" departLane="e2sep_1" departPos="3.60" departPosLat="0.00" departSpeed="13.90" departDelay="0.00" arrival="401.20" arrivalLane="c2w_1" arrivalPos="990.00" arrivalPosLat="0.00" arrivalSpeed="15.22" duration="134.20" routeLength="1997.01" waitingTime="0.00" waitingCount="0" stopTime="0.00" timeLoss="3.07" rerouteNo="1" devices="tripinfo_car_e2w_267 routing_car_e2w_267" vType="Car" speedFactor="1.10" vaporized=""/>
    <tripinfo id="bus_e2n_245" depart="245.00" departLane="e2sep_1" departPos="12.10" departPosLat="0.00" departSpeed="13.90" departDelay="0.00" arrival="402.45" arrivalLane="c2n_1" arrivalPos="990.00" arrivalPosLat="0.00" arrivalSpeed="13.90" duration="157.45" routeLength="1978.19" waitingTime="0.00" waitingCount="0" stopTime="0.00" timeLoss="14.40" rerouteNo="1" devices="tripinfo_bus_e2n_245 routing_bus_e2n_245" vType="Bus" speedFactor="1.00" vaporized=""/>
    <tripinfo id="car_e2s_227" depart="227.00" departLane="e2sep_1" departPos="3.60" departPosLat="0.00" departSpeed="13.90" departDelay="0.00" arrival="403.20" arrivalLane="c2s_1" arrivalPos="990.00" arrivalPosLat="0.00" arrivalSpeed="14.69" duration="176.20" routeLength="1996.47" waitingTime="24.85" waitingCount="2" stopTime="0.00" timeLoss="39.62" rerouteNo="1" devices="tripinfo_car_e2s_227 routing_car_e2s_227" vType="Car" speedFactor="1.06" vaporized=""/>
    <tripinfo id="car_e2w_273" depart="273.00" departLane="e2sep_1" departPos="3.60" departPosLat="0.00" departSpeed="13.90" departDelay="0.00" arrival="403.50" arrivalLane="c2w_1" arrivalPos="990.00" arrivalPosLat="0.00" arrivalSpeed="16.04" duration="130.50" routeLength="1997.01" waitingTime="0.00" waitingCount="0" stopTime="0.00" timeLoss="8.45" rerouteNo="1" devices="tripinfo_car_e2w_273 routing_car_e2w_273" vType="Car" speedFactor="1.18" vaporized=""/>
    <tripinfo id="car_e2s_242" depart="242.00" departLane="e2sep_1" departPos="3.60" departPosLat="0.00" departSpeed="13.90" departDelay="0.00" arrival="409.45" arrivalLane="c2s_1" arrivalPos="990.00" arrivalPosLat="0.00" arrivalSpeed="13.90" duration="167.45" routeLength="1996.47" waitingTime="9.75" waitingCount="1" stopTime="0.00" timeLoss="23.10" rerouteNo="1" devices="tripinfo_car_e2s_242 routing_car_e2s_242" vType="Car" speedFactor="1.00" vaporized=""/>
    <tripinfo id="car_w2n_201" depart="201.25" departLane="w2sep_1" departPos="3.60" departPosLat="0.00" departSpeed="13.90" departDelay="0.25" arrival="411.95" arrivalLane="c2n_1" arrivalPos="990.00" arrivalPosLat="0.00" arrivalSpeed="13.92" duration="210.70" routeLength="1996.47" waitingTime="54.85" waitingCount="2" stopTime="0.00" timeLoss="66.61" rerouteNo="1" devices="tripinfo_car_w2n_201 routing_car_w2n_201" vType="Car" speedFactor="1.00" vaporized=""/>
    <tripinfo id="car_e2s_251" depart="252.25" departLane="e2sep_1" departPos="3.60" departPosLat="0.00" departSpeed="13.90" departDelay="1.25" arrival="412.85" arrivalLane="c2s_1" arrivalPos="990.00" arrivalPosLat="0.00" arrivalSpeed="14.09" duration="160.60" routeLength="1996.47" waitingTime="2.55" waitingCount="1" stopTime="0.00" timeLoss="18.65" rerouteNo="1" devices="tripinfo_car_e2s_251 routing_car_e2s_251" vType="Car" speedFactor="1.02" vaporized=""/>
    <tripinfo id="car_w2n_245" depart="245.55" departLane="w2sep_1" departPos="3.60" departPosLat="0.00" departSpeed="13.90" departDelay="0.55" arrival="415.75" arrivalLane="c2n_1" arrivalPos="990.00" arrivalPosLat="0.00" arrivalSpeed="14.07" duration="170.20" routeLength="1996.47" waitingTime="13.65" waitingCount="1" stopTime="0.00" timeLoss="27.86" rerouteNo="1" devices="tripinfo_car_w2n_245 routing_car_w2n_245" vType="Car" speedFactor="1.01" vaporized=""/>
    <tripinfo id="car_e2s_254" depart="254.00" departLane="e2sep_1" departPos="3.60" departPosLat="0.00" departSpeed="13.90" departDelay="0.00" arrival="416.15" arrivalLane="c2s_1" arrivalPos="990.00" arrivalPosLat="0.00" arrivalSpeed="13.98" duration="162.15" routeLength="1996.47" waitingTime="2.10" waitingCount="1" stopTime="0.00" timeLoss="19.12" rerouteNo="1" devices="tripinfo_car_e2s_254 routing_car_e2s_254" vType="Car" speedFactor="1.01" vaporized=""/>
    <tripinfo id="car_w2e_279" depart="279.45" departLane="w2sep_1" departPos="3.60" departPosLat="0.00" departSpeed="13.90" departDelay="0.45" arrival="416.65" arrivalLane="c2e_1" arrivalPos="990.00" arrivalPosLat="0.00" arrivalSpeed="15.33" duration="137.20" routeLength="1997.01" waitingTime="0.00" waitingCount="0" stopTime="0.00" timeLoss="6.97" rerouteNo="1" devices="tripinfo_car_w2e_279 routing_car_w2e_279" vType="Car" speedFactor="1.10" vaporized=""/>
    <tripinfo id="car_w2n_278" depart="278.00" departLane="w2sep_1" departPos="3.60" departPosLat="0.00" departSpeed="13.90" departDelay="0.00" arrival="425.80" arrivalLane="c2n_1" arrivalPos="990.00" arrivalPosLat="0.00" arrivalSpeed="13.90" duration="147.80" routeLength="1996.47" waitingTime="0.00" waitingCount="0" stopTime="0.00" timeLoss="3.45" rerouteNo="1" devices="tripinfo_car_w2n_278 routing_car_w2n_278" vType="Car" speedFactor="1.00" vaporized=""/>
    <tripinfo id="car_w2s_288" depart="288.00" departLane="w2sep_1" departPos="3.60" departPosLat="0.00" departSpeed="13.90" departDelay="0.00" arrival="431.35" arrivalLane="c2s_1" arrivalPos="990.00" arrivalPosLat="0.00" arrivalSpeed="14.35" duration="143.35" routeLength="1986.69" waitingTime="0.00" waitingCount="0" stopTime="0.00" timeLoss="4.16" rerouteNo="1" devices="tripinfo_car_w2s_288 routing_car_w2s_288" vType="Car" speedFactor="1.03" vaporized=""/>
    <tripinfo id="car_w2e_289" depart="289.40" departLane="w2sep_1" departPos="3.60" departPosLat="0.00" departSpeed="13.90" departDelay="0.40" arrival="435.85" arrivalLane="c2e_1" arrivalPos="990.00" arrivalPosLat="0.00" arrivalSpeed="13.90" duration="146.45" routeLength="1997.01" waitingTime="0.00" waitingCount="0" stopTime="0.00" timeLoss="2.79" rerouteNo="1" devices="tripinfo_car_w2e_289 routing_car_w2e_289" vType="Car" speedFactor="1.00" vaporized=""/>
    <tripinfo id="car_w2n_294" depart="294.00" departLane="w2sep_1" departPos="3.60" departPosLat="0.00" departSpeed="13.90" departDelay="0.00" arrival="439.90" arrivalLane="c2n_1" arrivalPos="990.00" arrivalPosLat="0.00" arrivalSpeed="14.35" duration="145.90" routeLength="1996.47" waitingTime="0.00" waitingCount="0" stopTime="0.00" timeLoss="6.09" rerouteNo="1" devices="tripinfo_car_w2n_294 routing_car_w2n_294" vType="Car" speedFactor="1.03" vaporized=""/>
    <tripinfo id="bus_w2e_299" depart="299.00" departLane="w2sep_1" departPos="12.10" departPosLat="0.00" departSpeed="13.90" departDelay="0.00" arrival="443.65" arrivalLane="c2e_1" arrivalPos="990.00" arrivalPosLat="0.00" arrivalSpeed="13.89" duration="144.65" routeLength="1988.51" waitingTime="0.00" waitingCount="0" stopTime="0.00" timeLoss="1.58" rerouteNo="1" devices="tripinfo_bus_w2e_299 routing_bus_w2e_299" vType="Bus" speedFactor="1.00" vaporized=""/>
    <tripinfo id="amb_w2e_300" depart="300.70" departLane="w2sep_1" departPos="6.60" departPosLat="0.00" departSpeed="13.90" departDelay="0.70" arrival="445.60" arrivalLane="c2e_1" arrivalPos="990.00" arrivalPosLat="0.00" arrivalSpeed="17.30" duration="144.90" routeLength="1994.01" waitingTime="0.00" waitingCount="0" stopTime="0.00" timeLoss="49.23" rerouteNo="1" devices="tripinfo_amb_w2e_300 routing_amb_w2e_300 bluelight_amb_w2e_300 fcd_amb_w2e_300" vType="Ambulance" speedFactor="1.50" vaporized="">
        <example_device customValue1="0.00" customValue2="-1.00"/>
    </tripinfo>
    <tripinfo id="car_w2e_303" depart="303.00" departLane="w2sep_1" departPos="3.60" departPosLat="0.00" departSpeed="13.90" departDelay="0.00" arrival="447.90" arrivalLane="c2e_1" arrivalPos="990.00" arrivalPosLat="0.00" arrivalSpeed="15.54" duration="144.90" routeLength="1997.01" waitingTime="0.00" waitingCount="0" stopTime="0.00" timeLoss="19.12" rerouteNo="1" devices="tripinfo_car_w2e_303 routing_car_w2e_303" vType="Car" speedFactor="1.14" vaporized=""/>
    <tripinfo id="car_e2s_306" depart="306.00" departLane="e2sep_1" departPos="3.60" departPosLat="0.00" departSpeed="13.90" departDelay="0.00" arrival="449.70" arrivalLane="c2s_1" arrivalPos="990.00" arrivalPosLat="0.00" arrivalSpeed="14.42" duration="143.70" routeLength="1996.47" waitingTime="0.00" waitingCount="0" stopTime="0.00" timeLoss="4.59" rerouteNo="1" devices="tripinfo_car_e2s_306 routing_car_e2s_306" vType="Car" speedFactor="1.04" vaporized=""/>
    <tripinfo id="car_e2n_286" depart="286.00" departLane="e2sep_1" departPos="3.60" departPosLat="0.00" departSpeed="13.90" departDelay="0.00" arrival="449.80" arrivalLane="c2n_1" arrivalPos="990.00" arrivalPosLat="0.00" arrivalSpeed="14.75" duration="163.80" routeLength="1986.69" waitingTime="19.40" waitingCount="1" stopTime="0.00" timeLoss="28.36" rerouteNo="1" devices="tripinfo_car_e2n_286 routing_car_e2n_286" vType="Car" speedFactor="1.06" vaporized=""/>
    <tripinfo id="car_e2w_274" depart="274.25" departLane="e2sep_1" departPos="3.60" departPosLat="0.00" departSpeed="13.90" departDelay="0.25" arrival="451.15" arrivalLane="c2w_1" arrivalPos="990.00" arrivalPosLat="0.00" arrivalSpeed="13.96" duration="176.90" routeLength="1997.01" waitingTime="29.70" waitingCount="1" stopTime="0.00" timeLoss="33.84" rerouteNo="1" devices="tripinfo_car_e2w_274 routing_car_e2w_274" vType="Car" speedFactor="1.00" vaporized=""/>
    <tripinfo id="car_s2n_237" depart="238.30" departLane="s2sep_1" departPos="3.60" departPosLat="0.00" departSpeed="13.90" departDelay="1.30" arrival="464.40" arrivalLane="c2n_1" arrivalPos="990.00" arrivalPosLat="0.00" arrivalSpeed="14.80" duration="226.10" routeLength="1997.01" waitingTime="82.05" waitingCount="1" stopTime="0.00" timeLoss="91.17" rerouteNo="1" devices="tripinfo_car_s2n_237 routing_car_s2n_237" vType="Car" speedFactor="1.07" vaporized=""/>
    <tripinfo id="car_n2s_253" depart="253.00" departLane="n2sep_1" departPos="3.60" departPosLat="0.00" departSpeed="13.90" departDelay="0.00" arrival="464.45" arrivalLane="c2s_1" arrivalPos="990.00" arrivalPosLat="0.00" arrivalSpeed="15.27" duration="211.45" routeLength="1997.01" waitingTime="66.75" waitingCount="1" stopTime="0.00" timeLoss="80.67" rerouteNo="1" devices="tripinfo_car_n2s_253 routing_car_n2s_253" vType="Car" speedFactor="1.10" vaporized=""/>
    <tripinfo id="car_n2w_249" depart="249.00" departLane="n2sep_1" departPos="3.60" departPosLat="0.00" departSpeed="13.90" departDelay="0.00" arrival="468.55" arrivalLane="c2w_1" arrivalPos="990.00" arrivalPosLat="0.00" arrivalSpeed="13.90" duration="219.55" routeLength="1986.69" waitingTime="67.80" waitingCount="1" stopTime="0.00" timeLoss="75.86" rerouteNo="1" devices="tripinfo_car_n2w_249 routing_car_n2w_249" vType="Car" speedFactor="1.00" vaporized=""/>
    <tripinfo id="car_s2n_248" depart="248.00" departLane="s2sep_1" departPos="3.60" departPosLat="0.00" departSpeed="13.90" departDelay="0.00" arrival="469.50" arrivalLane="c2n_1" arrivalPos="990.00" arrivalPosLat="0.00" arrivalSpeed="14.80" duration="221.50" routeLength="1997.01" waitingTime="74.75" waitingCount="1" stopTime="0.00" timeLoss="86.57" rerouteNo="1" devices="tripinfo_car_s2n_248 routing_car_s2n_248" vType="Car" speedFactor="1.06" vaporized=""/>
    <tripinfo id="car_s2e_241" depart="241.00" departLane="s2sep_1" departPos="3.60" departPosLat="0.00" departSpeed="13.90" departDelay="0.00" arrival="470.85" arrivalLane="c2e_1" arrivalPos="990.00" arrivalPosLat="0.00" arrivalSpeed="13.90" duration="229.85" routeLength="1986.69" waitingTime="76.45" waitingCount="1" stopTime="0.00" timeLoss="86.19" rerouteNo="1" devices="tripinfo_car_s2e_241 routing_car_s2e_241" vType="Car" speedFactor="1.00" vaporized=""/>
    <tripinfo id="car_n2w_284" depart="284.00" departLane="n2sep_1" departPos="3.60" departPosLat="0.00" departSpeed="13.90" departDelay="0.00" arrival="472.55" arrivalLane="c2w_1" arrivalPos="990.00" arrivalPosLat="0.00" arrivalSpeed="14.32" duration="188.55" routeLength="1986.69" waitingTime="37.45" waitingCount="1" stopTime="0.00" timeLoss="49.25" rerouteNo="1" devices="tripinfo_car_n2w_284 routing_car_n2w_284" vType="Car" speedFactor="1.03" vaporized=""/>
    <tripinfo id="car_s2e_277" depart="277.00" departLane="s2sep_1" departPos="3.60" departPosLat="0.00" departSpeed="13.90" departDelay="0.00" arrival="473.55" arrivalLane="c2e_1" arrivalPos="990.00" arrivalPosLat="0.00" arrivalSpeed="14.75" duration="196.55" routeLength="1986.69" waitingTime="48.40" waitingCount="1" stopTime="0.00" timeLoss="62.41" rerouteNo="1" devices="tripinfo_car_s2e_277 routing_car_s2e_277" vType="Car" speedFactor="1.07" vaporized=""/>
    <tripinfo id="car_s2e_310" depart="310.00" departLane="s2sep_1" departPos="3.60" departPosLat="0.00" departSpeed="13.90" departDelay="0.00" arrival="475.30" arrivalLane="c2e_1" arrivalPos="990.00" arrivalPosLat="0.00" arrivalSpeed="15.95" duration="165.30" routeLength="1986.69" waitingTime="25.50" waitingCount="1" stopTime="0.00" timeLoss="48.13" rerouteNo="1" devices="tripinfo_car_s2e_310 routing_car_s2e_310" vType="Car" speedFactor="1.23" vaporized=""/>
    <tripinfo id="car_s2n_285" depart="285.00" departLane="s2sep_1" departPos="3.60" departPosLat="0.00" departSpeed="13.90" departDelay="0.00" arrival="476.15" arrivalLane="c2n_1" arrivalPos="990.00" arrivalPosLat="0.00" arrivalSpeed="14.22" duration="191.15" routeLength="1997.01" waitingTime="38.75" waitingCount="1" stopTime="0.00" timeLoss="50.75" rerouteNo="1" devices="tripinfo_car_s2n_285 routing_car_s2n_285" vType="Car" speedFactor="1.02" vaporized=""/>
    <tripinfo id="car_s2e_312" depart="312.00" departLane="s2sep_1" departPos="3.60" departPosLat="0.00" departSpeed="13.90" departDelay="0.00" arrival="481.85" arrivalLane="c2e_1" arrivalPos="990.00" arrivalPosLat="0.00" arrivalSpeed="14.06" duration="169.85" routeLength="1986.69" waitingTime="13.40" waitingCount="1" stopTime="0.00" timeLoss="27.82" rerouteNo="1" devices="tripinfo_car_s2e_312 routing_car_s2e_312" vType="Car" speedFactor="1.01" vaporized=""/>
    <tripinfo id="car_s2e_321" depart="321.00" departLane="s2sep_1" departPos="3.60" departPosLat="0.00" departSpeed="13.90" departDelay="0.00" arrival="483.95" arrivalLane="c2e_1" arrivalPos="990.00" arrivalPosLat="0.00" arrivalSpeed="15.14" duration="162.95" routeLength="1986.69" waitingTime="11.65" waitingCount="1" stopTime="0.00" timeLoss="34.64" rerouteNo="1" devices="tripinfo_car_s2e_321 routing_car_s2e_321" vType="Car" speedFactor="1.12" vaporized=""/>
    <tripinfo id="car_s2e_330" depart="330.00" departLane="s2sep_1" departPos="3.60" departPosLat="0.00" departSpeed="13.90" departDelay="0.00" arrival="487.70" arrivalLane="c2e_1" arrivalPos="990.00" arrivalPosLat="0.00" arrivalSpeed="14.21" duration="157.70" routeLength="1986.69" waitingTime="0.00" waitingCount="0" stopTime="0.00" timeLoss="17.36" rerouteNo="1" devices="tripinfo_car_s2e_330 routing_car_s2e_330" vType="Car" speedFactor="1.02" vaporized=""/>
    <tripinfo id="bus_n2s_345" depart="345.00" departLane="n2sep_1" departPos="12.10" departPosLat="0.00" departSpeed="13.90" departDelay="0.00" arrival="489.20" arrivalLane="c2s_1" arrivalPos="990.00" arrivalPosLat="0.00" arrivalSpeed="13.90" duration="144.20" routeLength="1988.51" waitingTime="0.00" waitingCount="0" stopTime="0.00" timeLoss="1.13" rerouteNo="1" devices="tripinfo_bus_n2s_345 routing_bus_n2s_345" vType="Bus" speedFactor="1.00" vaporized=""/>
</tripinfos>
