<?xml version="1.0" encoding="UTF-8"?>

<!-- generated on Sat Apr 24 18:39:07 2021 by Eclipse SUMO Version 1.4.0
<configuration xmlns:xsi="http://www.w3.org/2001/XMLSchema-instance" xsi:noNamespaceSchemaLocation="http://sumo.dlr.de/xsd/sumoConfiguration.xsd">

    <input>
        <net-file value="sumofiles/junction.net.xml"/>
        <route-files value="sumofiles/junction_preemption_254.rou.xml"/>
        <additional-files value="sumofiles/junction.det.xml"/>
    </input>

    <output>
        <tripinfo-output value="sumofiles/output/tripinfo_preemption_254.xml"/>
    </output>

    <time>
        <begin value="0"/>
        <end value="10000"/>
        <step-length value="0.05"/>
    </time>

    <processing>
        <lateral-resolution value="0.1"/>
    </processing>

    <report>
        <no-warnings value="true"/>
        <error-log value="sumofiles/output/errorlog_preemption_254.log"/>
        <no-step-log value="true"/>
    </report>

    <traci_server>
        <remote-port value="49225"/>
    </traci_server>

    <gui_only>
        <gui-settings-file value="sumofiles/junction-gui.settings.xml"/>
        <tracker-interval value="0.05"/>
    </gui_only>

</configuration>
-->

<tripinfos xmlns:xsi="http://www.w3.org/2001/XMLSchema-instance" xsi:noNamespaceSchemaLocation="http://sumo.dlr.de/xsd/tripinfo_file.xsd">
    <tripinfo id="car_e2s_3" depart="3.00" departLane="e2sep_1" departPos="3.60" departPosLat="0.00" departSpeed="13.90" departDelay="0.00" arrival="149.15" arrivalLane="c2s_1" arrivalPos="990.00" arrivalPosLat="0.00" arrivalSpeed="14.04" duration="146.15" routeLength="1996.47" waitingTime="0.00" waitingCount="0" stopTime="0.00" timeLoss="3.30" rerouteNo="1" devices="tripinfo_car_e2s_3 routing_car_e2s_3" vType="Car" speedFactor="1.01" vaporized=""/>
    <tripinfo id="car_e2s_12" depart="12.00" departLane="e2sep_1" departPos="3.60" departPosLat="0.00" departSpeed="13.90" departDelay="0.00" arrival="151.95" arrivalLane="c2s_1" arrivalPos="990.00" arrivalPosLat="0.00" arrivalSpeed="14.93" duration="139.95" routeLength="1996.47" waitingTime="0.00" waitingCount="0" stopTime="0.00" timeLoss="6.64" rerouteNo="1" devices="tripinfo_car_e2s_12 routing_car_e2s_12" vType="Car" speedFactor="1.08" vaporized=""/>
    <tripinfo id="car_s2e_2" depart="2.00" departLane="s2sep_1" departPos="3.60" departPosLat="0.00" departSpeed="13.90" departDelay="0.00" arrival="161.70" arrivalLane="c2e_1" arrivalPos="990.00" arrivalPosLat="0.00" arrivalSpeed="14.73" duration="159.70" routeLength="1986.69" waitingTime="16.75" waitingCount="1" stopTime="0.00" timeLoss="24.14" rerouteNo="1" devices="tripinfo_car_s2e_2 routing_car_s2e_2" vType="Car" speedFactor="1.06" vaporized=""/>
    <tripinfo id="car_n2s_0" depart="0.00" departLane="n2sep_1" departPos="3.60" departPosLat="0.00" departSpeed="13.90" departDelay="0.00" arrival="161.95" arrivalLane="c2s_1" arrivalPos="990.00" arrivalPosLat="0.00" arrivalSpeed="14.73" duration="161.95" routeLength="1997.01" waitingTime="18.75" waitingCount="1" stopTime="0.00" timeLoss="26.40" rerouteNo="1" devices="tripinfo_car_n2s_0 routing_car_n2s_0" vType="Car" speedFactor="1.06" vaporized=""/>
    <tripinfo id="car_s2w_12" depart="12.00" departLane="s2sep_1" departPos="3.60" departPosLat="0.00" departSpeed="13.90" departDelay="0.00" arrival="165.75" arrivalLane="c2w_1" arrivalPos="990.00" arrivalPosLat="0.00" arrivalSpeed="14.32" duration="153.75" routeLength="1996.47" waitingTime="4.85" waitingCount="1" stopTime="0.00" timeLoss="13.65" rerouteNo="1" devices="tripinfo_car_s2w_12 routing_car_s2w_12" vType="Car" speedFactor="1.03" vaporized=""/>
    <tripinfo id="car_n2s_36" depart="36.00" departLane="n2sep_1" departPos="3.60" departPosLat="0.00" departSpeed="13.90" departDelay="0.00" arrival="176.30" arrivalLane="c2s_1" arrivalPos="990.00" arrivalPosLat="0.00" arrivalSpeed="14.27" duration="140.30" routeLength="1997.01" waitingTime="0.00" waitingCount="0" stopTime="0.00" timeLoss="0.30" rerouteNo="1" devices="tripinfo_car_n2s_36 routing_car_n2s_36" vType="Car" speedFactor="1.03" vaporized=""/>
    <tripinfo id="car_n2s_50" depart="50.00" departLane="n2sep_1" departPos="3.60" departPosLat="0.00" departSpeed="13.90" departDelay="0.00" arrival="187.75" arrivalLane="c2s_1" arrivalPos="990.00" arrivalPosLat="0.00" arrivalSpeed="14.54" duration="137.75" routeLength="1997.01" waitingTime="0.00" waitingCount="0" stopTime="0.00" timeLoss="0.36" rerouteNo="1" devices="tripinfo_car_n2s_50 routing_car_n2s_50" vType="Car" speedFactor="1.05" vaporized=""/>
    <tripinfo id="car_s2e_47" depart="47.00" departLane="s2sep_1" departPos="3.60" departPosLat="0.00" departSpeed="13.90" departDelay="0.00" arrival="194.15" arrivalLane="c2e_1" arrivalPos="990.00" arrivalPosLat="0.00" arrivalSpeed="13.90" duration="147.15" routeLength="1986.69" waitingTime="0.00" waitingCount="0" stopTime="0.00" timeLoss="3.50" rerouteNo="1" devices="tripinfo_car_s2e_47 routing_car_s2e_47" vType="Car" speedFactor="1.00" vaporized=""/>
    <tripinfo id="car_e2w_23" depart="23.00" departLane="e2sep_1" departPos="3.60" departPosLat="0.00" departSpeed="13.90" departDelay="0.00" arrival="207.65" arrivalLane="c2w_1" arrivalPos="990.00" arrivalPosLat="0.00" arrivalSpeed="14.54" duration="184.65" routeLength="1997.01" waitingTime="38.95" waitingCount="1" stopTime="0.00" timeLoss="47.26" rerouteNo="1" devices="tripinfo_car_e2w_23 routing_car_e2w_23" vType="Car" speedFactor="1.05" vaporized=""/>
    <tripinfo id="car_w2e_35" depart="35.00" departLane="w2sep_1" departPos="3.60" departPosLat="0.00" departSpeed="13.90" departDelay="0.00" arrival="209.40" arrivalLane="c2e_1" arrivalPos="990.00" arrivalPosLat="0.00" arrivalSpeed="15.16" duration="174.40" routeLength="1997.01" waitingTime="31.75" waitingCount="1" stopTime="0.00" timeLoss="42.66" rerouteNo="1" devices="tripinfo_car_w2e_35 routing_car_w2e_35" vType="Car" speedFactor="1.09" vaporized=""/>
    <tripinfo id="car_e2n_24" depart="24.40" departLane="e2sep_1" departPos="3.60" departPosLat="0.00" departSpeed="13.90" departDelay="0.40" arrival="212.20" arrivalLane="c2n_1" arrivalPos="990.00" arrivalPosLat="0.00" arrivalSpeed="14.04" duration="187.80" routeLength="1986.69" waitingTime="35.15" waitingCount="1" stopTime="0.00" timeLoss="45.62" rerouteNo="1" devices="tripinfo_car_e2n_24 routing_car_e2n_24" vType="Car" speedFactor="1.01" vaporized=""/>
    <tripinfo id="bus_w2s_10" depart="10.00" departLane="w2sep_1" departPos="12.10" departPosLat="0.00" departSpeed="13.90" departDelay="0.00" arrival="213.95" arrivalLane="c2s_1" arrivalPos="990.00" arrivalPosLat="0.00" arrivalSpeed="13.90" duration="203.95" routeLength="1978.19" waitingTime="50.85" waitingCount="1" stopTime="0.00" timeLoss="60.88" rerouteNo="1" devices="tripinfo_bus_w2s_10 routing_bus_w2s_10" vType="Bus" speedFactor="1.00" vaporized=""/>
    <tripinfo id="car_e2n_31" depart="31.00" departLane="e2sep_1" departPos="3.60" departPosLat="0.00" departSpeed="13.90" departDelay="0.00" arrival="215.95" arrivalLane="c2n_1" arrivalPos="990.00" arrivalPosLat="0.00" arrivalSpeed="14.30" duration="184.95" routeLength="1986.69" waitingTime="32.20" waitingCount="1" stopTime="0.00" timeLoss="45.49" rerouteNo="1" devices="tripinfo_car_e2n_31 routing_car_e2n_31" vType="Car" speedFactor="1.03" vaporized=""/>
    <tripinfo id="car_e2w_84" depart="84.00" departLane="e2sep_1" departPos="3.60" departPosLat="0.00" departSpeed="13.90" departDelay="0.00" arrival="216.85" arrivalLane="c2w_1" arrivalPos="990.00" arrivalPosLat="0.00" arrivalSpeed="15.16" duration="132.85" routeLength="1997.01" waitingTime="0.00" waitingCount="0" stopTime="0.00" timeLoss="1.09" rerouteNo="1" devices="tripinfo_car_e2w_84 routing_car_e2w_84" vType="Car" speedFactor="1.09" vaporized=""/>
    <tripinfo id="car_w2e_58" depart="58.00" departLane="w2sep_1" departPos="3.60" departPosLat="0.00" departSpeed="13.90" departDelay="0.00" arrival="217.95" arrivalLane="c2e_1" arrivalPos="990.00" arrivalPosLat="0.00" arrivalSpeed="13.90" duration="159.95" routeLength="1997.01" waitingTime="4.85" waitingCount="1" stopTime="0.00" timeLoss="16.24" rerouteNo="1" devices="tripinfo_car_w2e_58 routing_car_w2e_58" vType="Car" speedFactor="1.00" vaporized=""/>
    <tripinfo id="car_e2n_46" depart="46.00" departLane="e2sep_1" departPos="3.60" departPosLat="0.00" departSpeed="13.90" departDelay="0.00" arrival="218.05" arrivalLane="c2n_1" arrivalPos="990.00" arrivalPosLat="0.00" arrivalSpeed="15.18" duration="172.05" routeLength="1986.69" waitingTime="24.35" waitingCount="1" stopTime="0.00" timeLoss="44.11" rerouteNo="1" devices="tripinfo_car_e2n_46 routing_car_e2n_46" vType="Car" speedFactor="1.12" vaporized=""/>
    <tripinfo id="car_e2s_17" depart="17.00" departLane="e2sep_1" departPos="3.60" departPosLat="0.00" departSpeed="13.90" departDelay="0.00" arrival="220.65" arrivalLane="c2s_1" arrivalPos="990.00" arrivalPosLat="0.00" arrivalSpeed="13.90" duration="203.65" routeLength="1996.47" waitingTime="47.75" waitingCount="2" stopTime="0.00" timeLoss="59.32" rerouteNo="1" devices="tripinfo_car_e2s_17 routing_car_e2s_17" vType="Car" speedFactor="1.00" vaporized=""/>
    <tripinfo id="car_w2n_29" depart="29.00" departLane="w2sep_1" departPos="3.60" departPosLat="0.00" departSpeed="13.90" departDelay="0.00" arrival="221.80" arrivalLane="c2n_1" arrivalPos="990.00" arrivalPosLat="0.00" arrivalSpeed="15.02" duration="192.80" routeLength="1996.47" waitingTime="47.10" waitingCount="2" stopTime="0.00" timeLoss="59.48" rerouteNo="1" devices="tripinfo_car_w2n_29 routing_car_w2n_29" vType="Car" speedFactor="1.08" vaporized=""/>
    <tripinfo id="car_w2e_95" depart="95.00" departLane="w2sep_1" departPos="3.60" departPosLat="0.00" departSpeed="13.90" departDelay="0.00" arrival="223.85" arrivalLane="c2e_1" arrivalPos="990.00" arrivalPosLat="0.00" arrivalSpeed="15.60" duration="128.85" routeLength="1997.01" waitingTime="0.00" waitingCount="0" stopTime="0.00" timeLoss="0.91" rerouteNo="1" devices="tripinfo_car_w2e_95 routing_car_w2e_95" vType="Car" speedFactor="1.12" vaporized=""/>
    <tripinfo id="car_e2s_69" depart="69.00" departLane="e2sep_1" departPos="3.60" departPosLat="0.00" departSpeed="13.90" departDelay="0.00" arrival="224.10" arrivalLane="c2s_1" arrivalPos="990.00" arrivalPosLat="0.00" arrivalSpeed="14.11" duration="155.10" routeLength="1996.47" waitingTime="1.95" waitingCount="1" stopTime="0.00" timeLoss="13.35" rerouteNo="1" devices="tripinfo_car_e2s_69 routing_car_e2s_69" vType="Car" speedFactor="1.02" vaporized=""/>
    <tripinfo id="car_w2n_45" depart="45.00" departLane="w2sep_1" departPos="3.60" departPosLat="0.00" departSpeed="13.90" departDelay="0.00" arrival="226.65" arrivalLane="c2n_1" arrivalPos="990.00" arrivalPosLat="0.00" arrivalSpeed="14.55" duration="181.65" routeLength="1996.47" waitingTime="28.60" waitingCount="2" stopTime="0.00" timeLoss="43.83" rerouteNo="1" devices="tripinfo_car_w2n_45 routing_car_w2n_45" vType="Car" speedFactor="1.05" vaporized=""/>
    <tripinfo id="bus_e2s_71" depart="71.00" departLane="e2sep_1" departPos="12.10" departPosLat="0.00" departSpeed="13.90" departDelay="0.00" arrival="228.45" arrivalLane="c2s_1" arrivalPos="990.00" arrivalPosLat="0.00" arrivalSpeed="13.84" duration="157.45" routeLength="1987.97" waitingTime="0.00" waitingCount="0" stopTime="0.00" timeLoss="13.74" rerouteNo="1" devices="tripinfo_bus_e2s_71 routing_bus_e2s_71" vType="Bus" speedFactor="1.00" vaporized=""/>
    <tripinfo id="car_w2s_103" depart="103.00" departLane="w2sep_1" departPos="3.60" departPosLat="0.00" departSpeed="13.90" departDelay="0.00" arrival="231.40" arrivalLane="c2s_1" arrivalPos="990.00" arrivalPosLat="0.00" arrivalSpeed="16.13" duration="128.40" routeLength="1986.69" waitingTime="0.00" waitingCount="0" stopTime="0.00" timeLoss="6.48" rerouteNo="1" devices="tripinfo_car_w2s_103 routing_car_w2s_103" vType="Car" speedFactor="1.18" vaporized=""/>
    <tripinfo id="car_w2n_80" depart="80.00" departLane="w2sep_1" departPos="3.60" departPosLat="0.00" departSpeed="13.90" departDelay="0.00" arrival="231.70" arrivalLane="c2n_1" arrivalPos="990.00" arrivalPosLat="0.00" arrivalSpeed="14.04" duration="151.70" routeLength="1996.47" waitingTime="0.00" waitingCount="0" stopTime="0.00" timeLoss="8.81" rerouteNo="1" devices="tripinfo_car_w2n_80 routing_car_w2n_80" vType="Car" speedFactor="1.01" vaporized=""/>
    <tripinfo id="car_n2w_91" depart="91.00" departLane="n2sep_1" departPos="3.60" departPosLat="0.00" departSpeed="13.90" departDelay="0.00" arrival="253.85" arrivalLane="c2w_1" arrivalPos="990.00" arrivalPosLat="0.00" arrivalSpeed="14.27" duration="162.85" routeLength="1986.69" waitingTime="15.70" waitingCount="1" stopTime="0.00" timeLoss="22.85" rerouteNo="1" devices="tripinfo_car_n2w_91 routing_car_n2w_91" vType="Car" speedFactor="1.03" vaporized=""/>
    <tripinfo id="car_n2s_92" depart="92.40" departLane="n2sep_1" departPos="3.60" departPosLat="0.00" departSpeed="13.90" departDelay="0.40" arrival="254.65" arrivalLane="c2s_1" arrivalPos="990.00" arrivalPosLat="0.00" arrivalSpeed="14.55" duration="162.25" routeLength="1997.01" waitingTime="13.55" waitingCount="1" stopTime="0.00" timeLoss="25.04" rerouteNo="1" devices="tripinfo_car_n2s_92 routing_car_n2s_92" vType="Car" speedFactor="1.05" vaporized=""/>
    <tripinfo id="car_s2e_61" depart="61.00" departLane="s2sep_1" departPos="3.60" departPosLat="0.00" departSpeed="13.90" departDelay="0.00" arrival="255.65" arrivalLane="c2e_1" arrivalPos="990.00" arrivalPosLat="0.00" arrivalSpeed="13.90" duration="194.65" routeLength="1986.69" waitingTime="44.05" waitingCount="1" stopTime="0.00" timeLoss="50.95" rerouteNo="1" devices="tripinfo_car_s2e_61 routing_car_s2e_61" vType="Car" speedFactor="1.00" vaporized=""/>
    <tripinfo id="car_s2n_99" depart="99.00" departLane="s2sep_1" departPos="3.60" departPosLat="0.00" departSpeed="13.90" departDelay="0.00" arrival="257.80" arrivalLane="c2n_1" arrivalPos="990.00" arrivalPosLat="0.00" arrivalSpeed="13.90" duration="158.80" routeLength="1997.01" waitingTime="6.85" waitingCount="1" stopTime="0.00" timeLoss="15.13" rerouteNo="1" devices="tripinfo_car_s2n_99 routing_car_s2n_99" vType="Car" speedFactor="1.00" vaporized=""/>
    <tripinfo id="car_s2e_123" depart="123.00" departLane="s2sep_1" departPos="3.60" departPosLat="0.00" departSpeed="13.90" departDelay="0.00" arrival="259.65" arrivalLane="c2e_1" arrivalPos="990.00" arrivalPosLat="0.00" arrivalSpeed="15.29" duration="136.65" routeLength="1986.69" waitingTime="0.00" waitingCount="0" stopTime="0.00" timeLoss="6.30" rerouteNo="1" devices="tripinfo_car_s2e_123 routing_car_s2e_123" vType="Car" speedFactor="1.10" vaporized=""/>
    <tripinfo id="car_n2w_95" depart="95.00" departLane="n2sep_1" departPos="3.60" departPosLat="0.00" departSpeed="13.90" departDelay="0.00" arrival="260.95" arrivalLane="c2w_1" arrivalPos="990.00" arrivalPosLat="0.00" arrivalSpeed="13.90" duration="165.95" routeLength="1986.69" waitingTime="10.00" waitingCount="1" stopTime="0.00" timeLoss="22.30" rerouteNo="1" devices="tripinfo_car_n2w_95 routing_car_n2w_95" vType="Car" speedFactor="1.00" vaporized=""/>
    <tripinfo id="car_s2n_115" depart="115.00" departLane="s2sep_1" departPos="3.60" departPosLat="0.00" departSpeed="13.90" departDelay="0.00" arrival="262.25" arrivalLane="c2n_1" arrivalPos="990.00" arrivalPosLat="0.00" arrivalSpeed="13.89" duration="147.25" routeLength="1997.01" waitingTime="0.00" waitingCount="0" stopTime="0.00" timeLoss="3.59" rerouteNo="1" devices="tripinfo_car_s2n_115 routing_car_s2n_115" vType="Car" speedFactor="1.00" vaporized=""/>
    <tripinfo id="car_n2e_108" depart="108.00" departLane="n2sep_1" departPos="3.60" departPosLat="0.00" departSpeed="13.90" departDelay="0.00" arrival="262.30" arrivalLane="c2e_1" arrivalPos="990.00" arrivalPosLat="0.00" arrivalSpeed="15.87" duration="154.30" routeLength="1996.47" waitingTime="9.25" waitingCount="2" stopTime="0.00" timeLoss="29.27" rerouteNo="1" devices="tripinfo_car_n2e_108 routing_car_n2e_108" vType="Car" speedFactor="1.15" vaporized=""/>
    <tripinfo id="car_n2s_95" depart="96.65" departLane="n2sep_1" departPos="3.60" departPosLat="0.00" departSpeed="13.90" departDelay="1.65" arrival="262.70" arrivalLane="c2s_1" arrivalPos="990.00" arrivalPosLat="0.00" arrivalSpeed="13.90" duration="166.05" routeLength="1997.01" waitingTime="7.90" waitingCount="1" stopTime="0.00" timeLoss="22.34" rerouteNo="1" devices="tripinfo_car_n2s_95 routing_car_n2s_95" vType="Car" speedFactor="1.00" vaporized=""/>
    <tripinfo id="car_n2w_98" depart="98.50" departLane="n2sep_1" departPos="3.60" departPosLat="0.00" departSpeed="13.90" departDelay="0.50" arrival="262.95" arrivalLane="c2w_1" arrivalPos="990.00" arrivalPosLat="0.00" arrivalSpeed="15.17" duration="164.45" routeLength="1986.69" waitingTime="7.25" waitingCount="1" stopTime="0.00" timeLoss="37.52" rerouteNo="1" devices="tripinfo_car_n2w_98 routing_car_n2w_98" vType="Car" speedFactor="1.13" vaporized=""/>
    <tripinfo id="car_n2s_114" depart="114.00" departLane="n2sep_1" departPos="3.60" departPosLat="0.00" departSpeed="13.90" departDelay="0.00" arrival="264.55" arrivalLane="c2s_1" arrivalPos="990.00" arrivalPosLat="0.00" arrivalSpeed="15.44" duration="150.55" routeLength="1997.01" waitingTime="0.00" waitingCount="0" stopTime="0.00" timeLoss="27.91" rerouteNo="1" devices="tripinfo_car_n2s_114 routing_car_n2s_114" vType="Car" speedFactor="1.17" vaporized=""/>
    <tripinfo id="car_n2w_109" depart="109.25" departLane="n2sep_1" departPos="3.60" departPosLat="0.00" departSpeed="13.90" departDelay="0.25" arrival="268.05" arrivalLane="c2w_1" arrivalPos="990.00" arrivalPosLat="0.00" arrivalSpeed="13.97" duration="158.80" routeLength="1986.69" waitingTime="0.75" waitingCount="1" stopTime="0.00" timeLoss="15.83" rerouteNo="1" devices="tripinfo_car_n2w_109 routing_car_n2w_109" vType="Car" speedFactor="1.01" vaporized=""/>
    <tripinfo id="car_n2s_116" depart="116.00" departLane="n2sep_1" departPos="3.60" departPosLat="0.00" departSpeed="13.90" departDelay="0.00" arrival="270.25" arrivalLane="c2s_1" arrivalPos="990.00" arrivalPosLat="0.00" arrivalSpeed="14.17" duration="154.25" routeLength="1997.01" waitingTime="0.00" waitingCount="0" stopTime="0.00" timeLoss="13.36" rerouteNo="1" devices="tripinfo_car_n2s_116 routing_car_n2s_116" vType="Car" speedFactor="1.02" vaporized=""/>
    <tripinfo id="car_n2e_134" depart="134.00" departLane="n2sep_1" departPos="3.60" departPosLat="0.00" departSpeed="13.90" departDelay="0.00" arrival="270.30" arrivalLane="c2e_1" arrivalPos="990.00" arrivalPosLat="0.00" arrivalSpeed="15.18" duration="136.30" routeLength="1996.47" waitingTime="0.00" waitingCount="0" stopTime="0.00" timeLoss="4.12" rerouteNo="1" devices="tripinfo_car_n2e_134 routing_car_n2e_134" vType="Car" speedFactor="1.09" vaporized=""/>
    <tripinfo id="car_s2w_62" depart="62.45" departLane="s2sep_1" departPos="3.60" departPosLat="0.00" departSpeed="13.90" departDelay="0.45" arrival="274.15" arrivalLane="c2w_1" arrivalPos="990.00" arrivalPosLat="0.00" arrivalSpeed="13.90" duration="211.70" routeLength="1996.47" waitingTime="53.40" waitingCount="2" stopTime="0.00" timeLoss="67.37" rerouteNo="1" devices="tripinfo_car_s2w_62 routing_car_s2w_62" vType="Car" speedFactor="1.00" vaporized=""/>
    <tripinfo id="car_s2w_63" depart="64.30" departLane="s2sep_1" departPos="3.60" departPosLat="0.00" departSpeed="13.90" departDelay="1.30" arrival="276.05" arrivalLane="c2w_1" arrivalPos="990.00" arrivalPosLat="0.00" arrivalSpeed="15.34" duration="211.75" routeLength="1996.47" waitingTime="51.45" waitingCount="2" stopTime="0.00" timeLoss="87.11" rerouteNo="1" devices="tripinfo_car_s2w_63 routing_car_s2w_63" vType="Car" speedFactor="1.16" vaporized=""/>
    <tripinfo id="car_n2s_142" depart="142.00" departLane="n2sep_1" departPos="3.60" departPosLat="0.00" departSpeed="13.90" departDelay="0.00" arrival="280.20" arrivalLane="c2s_1" arrivalPos="990.00" arrivalPosLat="0.00" arrivalSpeed="14.50" duration="138.20" routeLength="1997.01" waitingTime="0.00" waitingCount="0" stopTime="0.00" timeLoss="0.51" rerouteNo="1" devices="tripinfo_car_n2s_142 routing_car_n2s_142" vType="Car" speedFactor="1.04" vaporized=""/>
    <tripinfo id="car_e2w_120" depart="120.45" departLane="e2sep_1" departPos="3.60" departPosLat="0.00" departSpeed="13.90" departDelay="0.45" arrival="290.25" arrivalLane="c2w_1" arrivalPos="990.00" arrivalPosLat="0.00" arrivalSpeed="16.40" duration="169.80" routeLength="1997.01" waitingTime="29.85" waitingCount="1" stopTime="0.00" timeLoss="47.99" rerouteNo="1" devices="tripinfo_car_e2w_120 routing_car_e2w_120" vType="Car" speedFactor="1.18" vaporized=""/>
    <tripinfo id="car_w2e_127" depart="127.00" departLane="w2sep_1" departPos="3.60" departPosLat="0.00" departSpeed="13.90" departDelay="0.00" arrival="298.65" arrivalLane="c2e_1" arrivalPos="990.00" arrivalPosLat="0.00" arrivalSpeed="14.32" duration="171.65" routeLength="1997.01" waitingTime="24.95" waitingCount="1" stopTime="0.00" timeLoss="32.21" rerouteNo="1" devices="tripinfo_car_w2e_127 routing_car_w2e_127" vType="Car" speedFactor="1.03" vaporized=""/>
    <tripinfo id="car_w2s_136" depart="136.00" departLane="w2sep_1" departPos="3.60" departPosLat="0.00" departSpeed="13.90" departDelay="0.00" arrival="300.40" arrivalLane="c2s_1" arrivalPos="990.00" arrivalPosLat="0.00" arrivalSpeed="14.42" duration="164.40" routeLength="1986.69" waitingTime="16.65" waitingCount="1" stopTime="0.00" timeLoss="25.99" rerouteNo="1" devices="tripinfo_car_w2s_136 routing_car_w2s_136" vType="Car" speedFactor="1.04" vaporized=""/>
    <tripinfo id="bus_e2n_123" depart="123.00" departLane="e2sep_1" departPos="12.10" departPosLat="0.00" departSpeed="13.90" departDelay="0.00" arrival="306.30" arrivalLane="c2n_1" arrivalPos="990.00" arrivalPosLat="0.00" arrivalSpeed="13.90" duration="183.30" routeLength="1978.19" waitingTime="26.85" waitingCount="1" stopTime="0.00" timeLoss="40.24" rerouteNo="1" devices="tripinfo_bus_e2n_123 routing_bus_e2n_123" vType="Bus" speedFactor="1.00" vaporized=""/>
    <tripinfo id="bus_w2s_147" depart="147.00" departLane="w2sep_1" departPos="12.10" departPosLat="0.00" departSpeed="13.90" departDelay="0.00" arrival="308.85" arrivalLane="c2s_1" arrivalPos="990.00" arrivalPosLat="0.00" arrivalSpeed="13.90" duration="161.85" routeLength="1978.19" waitingTime="6.25" waitingCount="1" stopTime="0.00" timeLoss="18.80" rerouteNo="1" devices="tripinfo_bus_w2s_147 routing_bus_w2s_147" vType="Bus" speedFactor="1.00" vaporized=""/>
    <tripinfo id="car_e2n_145" depart="145.00" departLane="e2sep_1" departPos="3.60" departPosLat="0.00" departSpeed="13.90" departDelay="0.00" arrival="309.20" arrivalLane="c2n_1" arrivalPos="990.00" arrivalPosLat="0.00" arrivalSpeed="14.94" duration="164.20" routeLength="1986.69" waitingTime="13.15" waitingCount="1" stopTime="0.00" timeLoss="32.15" rerouteNo="1" devices="tripinfo_car_e2n_145 routing_car_e2n_145" vType="Car" speedFactor="1.09" vaporized=""/>
    <tripinfo id="car_e2w_149" depart="149.00" departLane="e2sep_1" departPos="3.60" departPosLat="0.00" departSpeed="13.90" departDelay="0.00" arrival="310.05" arrivalLane="c2w_1" arrivalPos="990.00" arrivalPosLat="0.00" arrivalSpeed="13.90" duration="161.05" routeLength="1997.01" waitingTime="4.90" waitingCount="1" stopTime="0.00" timeLoss="17.38" rerouteNo="1" devices="tripinfo_car_e2w_149 routing_car_e2w_149" vType="Car" speedFactor="1.00" vaporized=""/>
    <tripinfo id="car_w2e_152" depart="152.00" departLane="w2sep_1" departPos="3.60" departPosLat="0.00" departSpeed="13.90" departDelay="0.00" arrival="310.05" arrivalLane="c2e_1" arrivalPos="990.00" arrivalPosLat="0.00" arrivalSpeed="13.90" duration="158.05" routeLength="1997.01" waitingTime="0.00" waitingCount="0" stopTime="0.00" timeLoss="14.35" rerouteNo="1" devices="tripinfo_car_w2e_152 routing_car_w2e_152" vType="Car" speedFactor="1.00" vaporized=""/>
    <tripinfo id="car_e2w_178" depart="178.00" departLane="e2sep_1" departPos="3.60" departPosLat="0.00" departSpeed="13.90" departDelay="0.00" arrival="312.25" arrivalLane="c2w_1" arrivalPos="990.00" arrivalPosLat="0.00" arrivalSpeed="15.16" duration="134.25" routeLength="1997.01" waitingTime="0.00" waitingCount="0" stopTime="0.00" timeLoss="5.86" rerouteNo="1" devices="tripinfo_car_e2w_178 routing_car_e2w_178" vType="Car" speedFactor="1.12" vaporized=""/>
    <tripinfo id="car_w2s_158" depart="158.00" departLane="w2sep_1" departPos="3.60" departPosLat="0.00" departSpeed="13.90" departDelay="0.00" arrival="313.95" arrivalLane="c2s_1" arrivalPos="990.00" arrivalPosLat="0.00" arrivalSpeed="13.94" duration="155.95" routeLength="1986.69" waitingTime="0.00" waitingCount="0" stopTime="0.00" timeLoss="12.70" rerouteNo="1" devices="tripinfo_car_w2s_158 routing_car_w2s_158" vType="Car" speedFactor="1.00" vaporized=""/>
    <tripinfo id="car_e2n_163" depart="163.00" departLane="e2sep_1" departPos="3.60" departPosLat="0.00" departSpeed="13.90" departDelay="0.00" arrival="314.00" arrivalLane="c2n_1" arrivalPos="990.00" arrivalPosLat="0.00" arrivalSpeed="13.89" duration="151.00" routeLength="1986.69" waitingTime="0.00" waitingCount="0" stopTime="0.00" timeLoss="7.32" rerouteNo="1" devices="tripinfo_car_e2n_163 routing_car_e2n_163" vType="Car" speedFactor="1.00" vaporized=""/>
    <tripinfo id="car_e2w_182" depart="182.00" departLane="e2sep_1" departPos="3.60" departPosLat="0.00" departSpeed="13.90" departDelay="0.00" arrival="314.15" arrivalLane="c2w_1" arrivalPos="990.00" arrivalPosLat="0.00" arrivalSpeed="15.70" duration="132.15" routeLength="1997.01" waitingTime="0.00" waitingCount="0" stopTime="0.00" timeLoss="10.25" rerouteNo="1" devices="tripinfo_car_e2w_182 routing_car_e2w_182" vType="Car" speedFactor="1.18" vaporized=""/>
    <tripinfo id="car_w2e_159" depart="159.50" departLane="w2sep_1" departPos="3.60" departPosLat="0.00" departSpeed="13.90" departDelay="0.50" arrival="315.30" arrivalLane="c2e_1" arrivalPos="990.00" arrivalPosLat="0.00" arrivalSpeed="13.90" duration="155.80" routeLength="1997.01" waitingTime="0.00" waitingCount="0" stopTime="0.00" timeLoss="12.09" rerouteNo="1" devices="tripinfo_car_w2e_159 routing_car_w2e_159" vType="Car" speedFactor="1.00" vaporized=""/>
    <tripinfo id="car_e2s_119" depart="119.00" departLane="e2sep_1" departPos="3.60" departPosLat="0.00" departSpeed="13.90" departDelay="0.00" arrival="318.45" arrivalLane="c2s_1" arrivalPos="990.00" arrivalPosLat="0.00" arrivalSpeed="13.89" duration="199.45" routeLength="1996.47" waitingTime="43.05" waitingCount="2" stopTime="0.00" timeLoss="55.15" rerouteNo="1" devices="tripinfo_car_e2s_119 routing_car_e2s_119" vType="Car" speedFactor="1.00" vaporized=""/>
    <tripinfo id="car_e2s_125" depart="125.00" departLane="e2sep_1" departPos="3.60" departPosLat="0.00" departSpeed="13.90" departDelay="0.00" arrival="320.35" arrivalLane="c2s_1" arrivalPos="990.00" arrivalPosLat="0.00" arrivalSpeed="15.31" duration="195.35" routeLength="1996.47" waitingTime="34.95" waitingCount="2" stopTime="0.00" timeLoss="70.71" rerouteNo="1" devices="tripinfo_car_e2s_125 routing_car_e2s_125" vType="Car" speedFactor="1.16" vaporized=""/>
    <tripinfo id="car_w2n_128" depart="128.40" departLane="w2sep_1" departPos="3.60" departPosLat="0.00" departSpeed="13.90" departDelay="0.40" arrival="321.00" arrivalLane="c2n_1" arrivalPos="990.00" arrivalPosLat="0.00" arrivalSpeed="14.15" duration="192.60" routeLength="1996.47" waitingTime="37.20" waitingCount="2" stopTime="0.00" timeLoss="50.85" rerouteNo="1" devices="tripinfo_car_w2n_128 routing_car_w2n_128" vType="Car" speedFactor="1.02" vaporized=""/>
    <tripinfo id="car_e2s_152" depart="152.00" departLane="e2sep_1" departPos="3.60" departPosLat="0.00" departSpeed="13.90" departDelay="0.00" arrival="322.20" arrivalLane="c2s_1" arrivalPos="990.00" arrivalPosLat="0.00" arrivalSpeed="15.50" duration="170.20" routeLength="1996.47" waitingTime="10.00" waitingCount="2" stopTime="0.00" timeLoss="46.73" rerouteNo="1" devices="tripinfo_car_e2s_152 routing_car_e2s_152" vType="Car" speedFactor="1.17" vaporized=""/>
    <tripinfo id="car_e2s_175" depart="175.00" departLane="e2sep_1" departPos="3.60" departPosLat="0.00" departSpeed="13.90" departDelay="0.00" arrival="324.25" arrivalLane="c2s_1" arrivalPos="990.00" arrivalPosLat="0.00" arrivalSpeed="15.27" duration="149.25" routeLength="1996.47" waitingTime="3.15" waitingCount="1" stopTime="0.00" timeLoss="21.73" rerouteNo="1" devices="tripinfo_car_e2s_175 routing_car_e2s_175" vType="Car" speedFactor="1.13" vaporized=""/>
    <tripinfo id="car_w2n_148" depart="148.45" departLane="w2sep_1" departPos="3.60" departPosLat="0.00" departSpeed="13.90" departDelay="0.45" arrival="325.90" arrivalLane="c2n_1" arrivalPos="990.00" arrivalPosLat="0.00" arrivalSpeed="13.90" duration="177.45" routeLength="1996.47" waitingTime="15.75" waitingCount="1" stopTime="0.00" timeLoss="33.14" rerouteNo="1" devices="tripinfo_car_w2n_148 routing_car_w2n_148" vType="Car" speedFactor="1.00" vaporized=""/>
    <tripinfo id="car_e2s_189" depart="189.00" departLane="e2sep_1" departPos="3.60" departPosLat="0.00" departSpeed="13.90" departDelay="0.00" arrival="336.15" arrivalLane="c2s_1" arrivalPos="990.00" arrivalPosLat="0.00" arrivalSpeed="13.97" duration="147.15" routeLength="1996.47" waitingTime="0.00" waitingCount="0" stopTime="0.00" timeLoss="3.56" rerouteNo="1" devices="tripinfo_car_e2s_189 routing_car_e2s_189" vType="Car" speedFactor="1.01" vaporized=""/>
    <tripinfo id="car_n2s_207" depart="207.00" departLane="n2sep_1" departPos="3.60" departPosLat="0.00" departSpeed="13.90" departDelay="0.00" arrival="342.60" arrivalLane="c2s_1" arrivalPos="990.00" arrivalPosLat="0.00" arrivalSpeed="16.28" duration="135.60" routeLength="1997.01" waitingTime="0.60" waitingCount="1" stopTime="0.00" timeLoss="12.97" rerouteNo="1" devices="tripinfo_car_n2s_207 routing_car_n2s_207" vType="Car" speedFactor="1.17" vaporized=""/>
    <tripinfo id="car_s2n_147" depart="147.00" departLane="s2sep_1" departPos="3.60" departPosLat="0.00" departSpeed="13.90" departDelay="0.00" arrival="345.05" arrivalLane="c2n_1" arrivalPos="990.00" arrivalPosLat="0.00" arrivalSpeed="14.04" duration="198.05" routeLength="1997.01" waitingTime="49.05" waitingCount="1" stopTime="0.00" timeLoss="55.80" rerouteNo="1" devices="tripinfo_car_s2n_147 routing_car_s2n_147" vType="Car" speedFactor="1.01" vaporized=""/>
    <tripinfo id="car_n2w_152" depart="152.00" departLane="n2sep_1" departPos="3.60" departPosLat="0.00" departSpeed="13.90" departDelay="0.00" arrival="345.65" arrivalLane="c2w_1" arrivalPos="990.00" arrivalPosLat="0.00" arrivalSpeed="13.90" duration="193.65" routeLength="1986.69" waitingTime="43.00" waitingCount="1" stopTime="0.00" timeLoss="49.96" rerouteNo="1" devices="tripinfo_car_n2w_152 routing_car_n2w_152" vType="Car" speedFactor="1.00" vaporized=""/>
    <tripinfo id="car_s2n_168" depart="168.00" departLane="s2sep_1" departPos="3.60" departPosLat="0.00" departSpeed="13.90" departDelay="0.00" arrival="347.20" arrivalLane="c2n_1" arrivalPos="990.00" arrivalPosLat="0.00" arrivalSpeed="15.43" duration="179.20" routeLength="1997.01" waitingTime="37.95" waitingCount="1" stopTime="0.00" timeLoss="53.41" rerouteNo="1" devices="tripinfo_car_s2n_168 routing_car_s2n_168" vType="Car" speedFactor="1.14" vaporized=""/>
    <tripinfo id="car_n2w_170" depart="170.00" departLane="n2sep_1" departPos="3.60" departPosLat="0.00" departSpeed="13.90" departDelay="0.00" arrival="349.25" arrivalLane="c2w_1" arrivalPos="990.00" arrivalPosLat="0.00" arrivalSpeed="14.20" duration="179.25" routeLength="1986.69" waitingTime="27.35" waitingCount="1" stopTime="0.00" timeLoss="38.89" rerouteNo="1" devices="tripinfo_car_n2w_170 routing_car_n2w_170" vType="Car" speedFactor="1.02" vaporized=""/>
    <tripinfo id="car_s2n_182" depart="182.45" departLane="s2sep_1" departPos="3.60" departPosLat="0.00" departSpeed="13.90" departDelay="0.45" arrival="349.75" arrivalLane="c2n_1" arrivalPos="990.00" arrivalPosLat="0.00" arrivalSpeed="15.84" duration="167.30" routeLength="1997.01" waitingTime="17.55" waitingCount="1" stopTime="0.00" timeLoss="42.86" rerouteNo="1" devices="tripinfo_car_s2n_182 routing_car_s2n_182" vType="Car" speedFactor="1.15" vaporized=""/>
    <tripinfo id="bus_s2e_148" depart="149.05" departLane="s2sep_1" departPos="12.10" departPosLat="0.00" departSpeed="13.90" departDelay="1.05" arrival="351.30" arrivalLane="c2e_1" arrivalPos="990.00" arrivalPosLat="0.00" arrivalSpeed="13.90" duration="202.25" routeLength="1978.19" waitingTime="46.15" waitingCount="1" stopTime="0.00" timeLoss="59.19" rerouteNo="1" devices="tripinfo_bus_s2e_148 routing_bus_s2e_148" vType="Bus" speedFactor="1.00" vaporized=""/>
    <tripinfo id="car_n2w_180" depart="180.00" departLane="n2sep_1" departPos="3.60" departPosLat="0.00" departSpeed="13.90" departDelay="0.00" arrival="352.80" arrivalLane="c2w_1" arrivalPos="990.00" arrivalPosLat="0.00" arrivalSpeed="14.09" duration="172.80" routeLength="1986.69" waitingTime="17.40" waitingCount="1" stopTime="0.00" timeLoss="31.36" rerouteNo="1" devices="tripinfo_car_n2w_180 routing_car_n2w_180" vType="Car" speedFactor="1.02" vaporized=""/>
    <tripinfo id="car_s2w_157" depart="157.00" departLane="s2sep_1" departPos="3.60" departPosLat="0.00" departSpeed="13.90" departDelay="0.00" arrival="354.95" arrivalLane="c2w_1" arrivalPos="990.00" arrivalPosLat="0.00" arrivalSpeed="14.87" duration="197.95" routeLength="1996.47" waitingTime="47.05" waitingCount="2" stopTime="0.00" timeLoss="66.25" rerouteNo="1" devices="tripinfo_car_s2w_157 routing_car_s2w_157" vType="Car" speedFactor="1.10" vaporized=""/>
    <tripinfo id="car_s2e_181" depart="181.00" departLane="s2sep_1" departPos="3.60" departPosLat="0.00" departSpeed="13.90" departDelay="0.00" arrival="356.70" arrivalLane="c2e_1" arrivalPos="990.00" arrivalPosLat="0.00" arrivalSpeed="13.90" duration="175.70" routeLength="1986.69" waitingTime="18.10" waitingCount="1" stopTime="0.00" timeLoss="32.03" rerouteNo="1" devices="tripinfo_car_s2e_181 routing_car_s2e_181" vType="Car" speedFactor="1.00" vaporized=""/>
    <tripinfo id="car_n2w_220" depart="220.00" departLane="n2sep_1" departPos="3.60" departPosLat="0.00" departSpeed="13.90" departDelay="0.00" arrival="357.55" arrivalLane="c2w_1" arrivalPos="990.00" arrivalPosLat="0.00" arrivalSpeed="16.15" duration="137.55" routeLength="1986.69" waitingTime="0.00" waitingCount="0" stopTime="0.00" timeLoss="15.75" rerouteNo="1" devices="tripinfo_car_n2w_220 routing_car_n2w_220" vType="Car" speedFactor="1.18" vaporized=""/>
    <tripinfo id="car_n2s_218" depart="218.00" departLane="n2sep_1" departPos="3.60" departPosLat="0.00" departSpeed="13.90" departDelay="0.00" arrival="361.95" arrivalLane="c2s_1" arrivalPos="990.00" arrivalPosLat="0.00" arrivalSpeed="13.90" duration="143.95" routeLength="1997.01" waitingTime="0.00" waitingCount="0" stopTime="0.00" timeLoss="0.27" rerouteNo="1" devices="tripinfo_car_n2s_218 routing_car_n2s_218" vType="Car" speedFactor="1.00" vaporized=""/>
    <tripinfo id="bus_s2e_186" depart="186.00" departLane="s2sep_1" departPos="12.10" departPosLat="0.00" departSpeed="13.90" departDelay="0.00" arrival="362.45" arrivalLane="c2e_1" arrivalPos="990.00" arrivalPosLat="0.00" arrivalSpeed="13.88" duration="176.45" routeLength="1978.19" waitingTime="15.85" waitingCount="1" stopTime="0.00" timeLoss="33.38" rerouteNo="1" devices="tripinfo_bus_s2e_186 routing_bus_s2e_186" vType="Bus" speedFactor="1.00" vaporized=""/>
    <tripinfo id="car_s2n_216" depart="216.40" departLane="s2sep_1" departPos="3.60" departPosLat="0.00" departSpeed="13.90" departDelay="0.40" arrival="364.20" arrivalLane="c2n_1" arrivalPos="990.00" arrivalPosLat="0.00" arrivalSpeed="14.17" duration="147.80" routeLength="1997.01" waitingTime="0.00" waitingCount="0" stopTime="0.00" timeLoss="6.89" rerouteNo="1" devices="tripinfo_car_s2n_216 routing_car_s2n_216" vType="Car" speedFactor="1.02" vaporized=""/>
    <tripinfo id="car_s2e_215" depart="215.00" departLane="s2sep_1" departPos="3.60" departPosLat="0.00" departSpeed="13.90" departDelay="0.00" arrival="366.30" arrivalLane="c2e_1" arrivalPos="990.00" arrivalPosLat="0.00" arrivalSpeed="14.19" duration="151.30" routeLength="1986.69" waitingTime="0.00" waitingCount="0" stopTime="0.00" timeLoss="10.84" rerouteNo="1" devices="tripinfo_car_s2e_215 routing_car_s2e_215" vType="Car" speedFactor="1.02" vaporized=""/>
    <tripinfo id="car_s2n_217" depart="218.20" departLane="s2sep_1" departPos="3.60" departPosLat="0.00" departSpeed="13.90" departDelay="1.20" arrival="367.35" arrivalLane="c2n_1" arrivalPos="990.00" arrivalPosLat="0.00" arrivalSpeed="14.61" duration="149.15" routeLength="1997.01" waitingTime="0.00" waitingCount="0" stopTime="0.00" timeLoss="13.06" rerouteNo="1" devices="tripinfo_car_s2n_217 routing_car_s2n_217" vType="Car" speedFactor="1.06" vaporized=""/>
    <tripinfo id="car_n2e_156" depart="156.00" departLane="n2sep_1" departPos="3.60" departPosLat="0.00" departSpeed="13.90" departDelay="0.00" arrival="370.35" arrivalLane="c2e_1" arrivalPos="990.00" arrivalPosLat="0.00" arrivalSpeed="14.12" duration="214.35" routeLength="1996.47" waitingTime="58.95" waitingCount="2" stopTime="0.00" timeLoss="72.40" rerouteNo="1" devices="tripinfo_car_n2e_156 routing_car_n2e_156" vType="Car" speedFactor="1.02" vaporized=""/>
    <tripinfo id="car_s2n_232" depart="232.00" departLane="s2sep_1" departPos="3.60" departPosLat="0.00" departSpeed="13.90" departDelay="0.00" arrival="372.40" arrivalLane="c2n_1" arrivalPos="990.00" arrivalPosLat="0.00" arrivalSpeed="14.37" duration="140.40" routeLength="1997.01" waitingTime="0.00" waitingCount="0" stopTime="0.00" timeLoss="1.52" rerouteNo="1" devices="tripinfo_car_s2n_232 routing_car_s2n_232" vType="Car" speedFactor="1.03" vaporized=""/>
    <tripinfo id="car_n2e_177" depart="177.00" departLane="n2sep_1" departPos="3.60" departPosLat="0.00" departSpeed="13.90" departDelay="0.00" arrival="373.50" arrivalLane="c2e_1" arrivalPos="990.00" arrivalPosLat="0.00" arrivalSpeed="14.97" duration="196.50" routeLength="1996.47" waitingTime="44.15" waitingCount="3" stopTime="0.00" timeLoss="63.16" rerouteNo="1" devices="tripinfo_car_n2e_177 routing_car_n2e_177" vType="Car" speedFactor="1.08" vaporized=""/>
    <tripinfo id="car_e2n_220" depart="220.00" departLane="e2sep_1" departPos="3.60" departPosLat="0.00" departSpeed="13.90" departDelay="0.00" arrival="388.50" arrivalLane="c2n_1" arrivalPos="990.00" arrivalPosLat="0.00" arrivalSpeed="14.35" duration="168.50" routeLength="1986.69" waitingTime="21.35" waitingCount="1" stopTime="0.00" timeLoss="29.35" rerouteNo="1" devices="tripinfo_car_e2n_220 routing_car_e2n_220" vType="Car" speedFactor="1.03" vaporized=""/>
    <tripinfo id="car_w2s_216" depart="216.00" departLane="w2sep_1" departPos="3.60" departPosLat="0.00" departSpeed="13.90" departDelay="0.00" arrival="390.65" arrivalLane="c2s_1" arrivalPos="990.00" arrivalPosLat="0.00" arrivalSpeed="13.90" duration="174.65" routeLength="1986.69" waitingTime="22.65" waitingCount="1" stopTime="0.00" timeLoss="30.96" rerouteNo="1" devices="tripinfo_car_w2s_216 routing_car_w2s_216" vType="Car" speedFactor="1.00" vaporized=""/>
    <tripinfo id="car_e2w_243" depart="243.00" departLane="e2sep_1" departPos="3.60" departPosLat="0.00" departSpeed="13.90" departDelay="0.00" arrival="392.25" arrivalLane="c2w_1" arrivalPos="990.00" arrivalPosLat="0.00" arrivalSpeed="14.49" duration="149.25" routeLength="1997.01" waitingTime="0.00" waitingCount="0" stopTime="0.00" timeLoss="11.47" rerouteNo="1" devices="tripinfo_car_e2w_243 routing_car_e2w_243" vType="Car" speedFactor="1.04" vaporized=""/>
    <tripinfo id="car_w2e_225" depart="225.00" departLane="w2sep_1" departPos="3.60" departPosLat="0.00" departSpeed="13.90" departDelay="0.00" arrival="392.35" arrivalLane="c2e_1" arrivalPos="990.00" arrivalPosLat="0.00" arrivalSpeed="14.00" duration="167.35" routeLength="1997.01" waitingTime="16.15" waitingCount="1" stopTime="0.00" timeLoss="24.69" rerouteNo="1" devices="tripinfo_car_w2e_225 routing_car_w2e_225" vType="Car" speedFactor="1.01" vaporized=""/>
    <tripinfo id="car_w2s_228" depart="228.00" departLane="w2sep_1" departPos="3.60" departPosLat="0.00" departSpeed="13.90" departDelay="0.00" arrival="393.10" arrivalLane="c2s_1" arrivalPos="990.00" arrivalPosLat="0.00" arrivalSpeed="14.89" duration="165.10" routeLength="1986.69" waitingTime="15.15" waitingCount="1" stopTime="0.00" timeLoss="32.92" rerouteNo="1" devices="tripinfo_car_w2s_228 routing_car_w2s_228" vType="Car" speedFactor="1.09" vaporized=""/>
    <tripinfo id="car_e2n_238" depart="238.00" departLane="e2sep_1" departPos="3.60" departPosLat="0.00" departSpeed="13.90" departDelay="0.00" arrival="394.40" arrivalLane="c2n_1" arrivalPos="990.00" arrivalPosLat="0.00" arrivalSpeed="13.92" duration="156.40" routeLength="1986.69" waitingTime="0.80" waitingCount="1" stopTime="0.00" timeLoss="12.97" rerouteNo="1" devices="tripinfo_car_e2n_238 routing_car_e2n_238" vType="Car" speedFactor="1.00" vaporized=""/>
    <tripinfo id="car_w2e_235" depart="235.00" departLane="w2sep_1" departPos="3.60" departPosLat="0.00" departSpeed="13.90" departDelay="0.00" arrival="396.50" arrivalLane="c2e_1" arrivalPos="990.00" arrivalPosLat="0.00" arrivalSpeed="14.31" duration="161.50" routeLength="1997.01" waitingTime="10.00" waitingCount="1" stopTime="0.00" timeLoss="22.06" rerouteNo="1" devices="tripinfo_car_w2e_235 routing_car_w2e_235" vType="Car" speedFactor="1.03" vaporized=""/>
    <tripinfo id="car_e2w_259" depart="259.00" departLane="e2sep_1" departPos="3.60" departPosLat="0.00" departSpeed="13.90" departDelay="0.00" arrival="396.60" arrivalLane="c2w_1" arrivalPos="990.00" arrivalPosLat="0.00" arrivalSpeed="14.79" duration="137.60" routeLength="1997.01" waitingTime="0.00" waitingCount="0" stopTime="0.00" timeLoss="2.68" rerouteNo="1" devices="tripinfo_car_e2w_259 routing_car_e2w_259" vType="Car" speedFactor="1.07" vaporized=""/>
    <tripinfo id="car_w2n_214" depart="214.00" departLane="w2sep_1" departPos="3.60" departPosLat="0.00" departSpeed="13.90" departDelay="0.00" arrival="400.80" arrivalLane="c2n_1" arrivalPos="990.00" arrivalPosLat="0.00" arrivalSpeed="14.45" duration="186.80" routeLength="1996.47" waitingTime="36.50" waitingCount="2" stopTime="0.00" timeLoss="48.00" rerouteNo="1" devices="tripinfo_car_w2n_214 routing_car_w2n_214" vType="Car" speedFactor="1.04" vaporized=""/>
    <tripinfo id="car_e2w_266" depart="266.00" departLane="e2sep_1" departPos="3.60" departPosLat="0.00" departSpeed="13.90" departDelay="0.00" arrival="401.80" arrivalLane="c2w_1" arrivalPos="990.00" arrivalPosLat="0.00" arrivalSpeed="14.91" duration="135.80" routeLength="1997.01" waitingTime="0.00" waitingCount="0" stopTime="0.00" timeLoss="1.84" rerouteNo="1" devices="tripinfo_car_e2w_266 routing_car_e2w_266" vType="Car" speedFactor="1.07" vaporized=""/>
    <tripinfo id="bus_w2s_256" depart="256.00" departLane="w2sep_1" departPos="12.10" departPosLat="0.00" departSpeed="13.90" departDelay="0.00" arrival="406.60" arrivalLane="c2s_1" arrivalPos="990.00" arrivalPosLat="0.00" arrivalSpeed="13.90" duration="150.60" routeLength="1978.19" waitingTime="0.00" waitingCount="0" stopTime="0.00" timeLoss="7.56" rerouteNo="1" devices="tripinfo_bus_w2s_256 routing_bus_w2s_256" vType="Bus" speedFactor="1.00" vaporized=""/>
    <tripinfo id="car_w2n_247" depart="247.00" departLane="w2sep_1" departPos="3.60" departPosLat="0.00" departSpeed="13.90" departDelay="0.00" arrival="408.15" arrivalLane="c2n_1" arrivalPos="990.00" arrivalPosLat="0.00" arrivalSpeed="14.21" duration="161.15" routeLength="1996.47" waitingTime="7.85" waitingCount="2" stopTime="0.00" timeLoss="19.93" rerouteNo="1" devices="tripinfo_car_w2n_247 routing_car_w2n_247" vType="Car" speedFactor="1.02" vaporized=""/>
    <tripinfo id="amb_w2e_300" depart="300.00" departLane="w2sep_1" departPos="6.60" departPosLat="0.00" departSpeed="13.90" departDelay="0.00" arrival="408.30" arrivalLane="c2e_1" arrivalPos="990.00" arrivalPosLat="-0.95" arrivalSpeed="20.25" duration="108.30" routeLength="1994.01" waitingTime="0.00" waitingCount="0" stopTime="0.00" timeLoss="12.64" rerouteNo="1" devices="tripinfo_amb_w2e_300 routing_amb_w2e_300 bluelight_amb_w2e_300 fcd_amb_w2e_300" vType="Ambulance" speedFactor="1.50" vaporized="">
        <example_device customValue1="0.00" customValue2="-1.00"/>
    </tripinfo>
    <tripinfo id="car_w2e_261" depart="261.00" departLane="w2sep_1" departPos="3.60" departPosLat="0.00" departSpeed="13.90" departDelay="0.00" arrival="408.35" arrivalLane="c2e_1" arrivalPos="990.00" arrivalPosLat="1.10" arrivalSpeed="13.90" duration="147.35" routeLength="1997.01" waitingTime="0.00" waitingCount="0" stopTime="0.00" timeLoss="3.68" rerouteNo="1" devices="tripinfo_car_w2e_261 routing_car_w2e_261" vType="Car@car_w2e_261" speedFactor="1.00" vaporized=""/>
    <tripinfo id="car_e2w_273" depart="273.00" departLane="e2sep_1" departPos="3.60" departPosLat="0.00" departSpeed="13.90" departDelay="0.00" arrival="409.10" arrivalLane="c2w_1" arrivalPos="990.00" arrivalPosLat="0.00" arrivalSpeed="14.80" duration="136.10" routeLength="1997.01" waitingTime="0.00" waitingCount="0" stopTime="0.00" timeLoss="1.16" rerouteNo="1" devices="tripinfo_car_e2w_273 routing_car_e2w_273" vType="Car" speedFactor="1.06" vaporized=""/>
    <tripinfo id="car_e2s_215" depart="215.00" departLane="e2sep_1" departPos="3.60" departPosLat="0.00" departSpeed="13.90" departDelay="0.00" arrival="411.45" arrivalLane="c2s_1" arrivalPos="990.00" arrivalPosLat="0.00" arrivalSpeed="14.20" duration="196.45" routeLength="1996.47" waitingTime="42.80" waitingCount="3" stopTime="0.00" timeLoss="55.25" rerouteNo="1" devices="tripinfo_car_e2s_215 routing_car_e2s_215" vType="Car" speedFactor="1.02" vaporized=""/>
    <tripinfo id="car_w2n_254" depart="254.00" departLane="w2sep_1" departPos="3.60" departPosLat="0.00" departSpeed="13.90" departDelay="0.00" arrival="413.40" arrivalLane="c2n_1" arrivalPos="990.00" arrivalPosLat="0.00" arrivalSpeed="14.69" duration="159.40" routeLength="1996.47" waitingTime="3.80" waitingCount="2" stopTime="0.00" timeLoss="22.81" rerouteNo="1" devices="tripinfo_car_w2n_254 routing_car_w2n_254" vType="Car" speedFactor="1.06" vaporized=""/>
    <tripinfo id="car_e2s_222" depart="222.00" departLane="e2sep_1" departPos="3.60" departPosLat="0.00" departSpeed="13.90" departDelay="0.00" arrival="413.70" arrivalLane="c2s_1" arrivalPos="990.00" arrivalPosLat="0.00" arrivalSpeed="15.01" duration="191.70" routeLength="1996.47" waitingTime="35.55" waitingCount="2" stopTime="0.00" timeLoss="60.78" rerouteNo="1" devices="tripinfo_car_e2s_222 routing_car_e2s_222" vType="Car" speedFactor="1.10" vaporized=""/>
    <tripinfo id="car_w2n_259" depart="259.00" departLane="w2sep_1" departPos="3.60" departPosLat="0.00" departSpeed="13.90" departDelay="0.00" arrival="416.25" arrivalLane="c2n_1" arrivalPos="990.00" arrivalPosLat="0.00" arrivalSpeed="15.14" duration="157.25" routeLength="1996.47" waitingTime="1.10" waitingCount="1" stopTime="0.00" timeLoss="25.70" rerouteNo="1" devices="tripinfo_car_w2n_259 routing_car_w2n_259" vType="Car" speedFactor="1.10" vaporized=""/>
    <tripinfo id="car_e2s_236" depart="236.00" departLane="e2sep_1" departPos="3.60" departPosLat="0.00" departSpeed="13.90" departDelay="0.00" arrival="418.30" arrivalLane="c2s_1" arrivalPos="990.00" arrivalPosLat="0.00" arrivalSpeed="13.89" duration="182.30" routeLength="1996.47" waitingTime="19.05" waitingCount="2" stopTime="0.00" timeLoss="37.97" rerouteNo="1" devices="tripinfo_car_e2s_236 routing_car_e2s_236" vType="Car" speedFactor="1.00" vaporized=""/>
    <tripinfo id="car_e2s_256" depart="256.00" departLane="e2sep_1" departPos="3.60" departPosLat="0.00" departSpeed="13.90" departDelay="0.00" arrival="420.30" arrivalLane="c2s_1" arrivalPos="990.00" arrivalPosLat="0.00" arrivalSpeed="15.05" duration="164.30" routeLength="1996.47" waitingTime="12.30" waitingCount="1" stopTime="0.00" timeLoss="35.60" rerouteNo="1" devices="tripinfo_car_e2s_256 routing_car_e2s_256" vType="Car" speedFactor="1.12" vaporized=""/>
    <tripinfo id="car_w2n_273" depart="273.00" departLane="w2sep_1" departPos="3.60" departPosLat="0.00" departSpeed="13.90" departDelay="0.00" arrival="420.70" arrivalLane="c2n_1" arrivalPos="990.00" arrivalPosLat="0.00" arrivalSpeed="14.37" duration="147.70" routeLength="1996.47" waitingTime="0.00" waitingCount="0" stopTime="0.00" timeLoss="8.20" rerouteNo="1" devices="tripinfo_car_w2n_273 routing_car_w2n_273" vType="Car" speedFactor="1.03" vaporized=""/>
    <tripinfo id="car_w2n_286" depart="286.00" departLane="w2sep_1" departPos="3.60" departPosLat="0.00" departSpeed="13.90" departDelay="0.00" arrival="432.15" arrivalLane="c2n_1" arrivalPos="990.00" arrivalPosLat="0.00" arrivalSpeed="14.13" duration="146.15" routeLength="1996.47" waitingTime="0.00" waitingCount="0" stopTime="0.00" timeLoss="4.21" rerouteNo="1" devices="tripinfo_car_w2n_286 routing_car_w2n_286" vType="Car" speedFactor="1.02" vaporized=""/>
    <tripinfo id="car_e2n_281" depart="281.00" departLane="e2sep_1" departPos="3.60" departPosLat="0.00" departSpeed="13.90" departDelay="0.00" arrival="437.20" arrivalLane="c2n_1" arrivalPos="990.00" arrivalPosLat="0.00" arrivalSpeed="13.90" duration="156.20" routeLength="1986.69" waitingTime="2.90" waitingCount="1" stopTime="0.00" timeLoss="12.55" rerouteNo="1" devices="tripinfo_car_e2n_281 routing_car_e2n_281" vType="Car" speedFactor="1.00" vaporized=""/>
    <tripinfo id="car_e2n_293" depart="293.00" departLane="e2sep_1" departPos="3.60" departPosLat="0.00" departSpeed="13.90" departDelay="0.00" arrival="439.40" arrivalLane="c2n_1" arrivalPos="990.00" arrivalPosLat="0.00" arrivalSpeed="14.88" duration="146.40" routeLength="1986.69" waitingTime="0.00" waitingCount="0" stopTime="0.00" timeLoss="15.34" rerouteNo="1" devices="tripinfo_car_e2n_293 routing_car_e2n_293" vType="Car" speedFactor="1.10" vaporized=""/>
    <tripinfo id="car_n2s_255" depart="256.60" departLane="n2sep_1" departPos="3.60" departPosLat="0.00" departSpeed="13.90" departDelay="1.60" arrival="447.95" arrivalLane="c2s_1" arrivalPos="990.00" arrivalPosLat="0.00" arrivalSpeed="15.12" duration="191.35" routeLength="1997.01" waitingTime="43.95" waitingCount="1" stopTime="0.00" timeLoss="59.30" rerouteNo="1" devices="tripinfo_car_n2s_255 routing_car_n2s_255" vType="Car" speedFactor="1.09" vaporized=""/>
    <tripinfo id="car_n2w_253" depart="253.00" departLane="n2sep_1" departPos="3.60" departPosLat="0.00" departSpeed="13.90" departDelay="0.00" arrival="448.50" arrivalLane="c2w_1" arrivalPos="990.00" arrivalPosLat="0.00" arrivalSpeed="14.50" duration="195.50" routeLength="1986.69" waitingTime="50.60" waitingCount="1" stopTime="0.00" timeLoss="57.83" rerouteNo="1" devices="tripinfo_car_n2w_253 routing_car_n2w_253" vType="Car" speedFactor="1.04" vaporized=""/>
    <tripinfo id="car_s2e_232" depart="233.40" departLane="s2sep_1" departPos="3.60" departPosLat="0.00" departSpeed="13.90" departDelay="1.40" arrival="451.45" arrivalLane="c2e_1" arrivalPos="990.00" arrivalPosLat="0.00" arrivalSpeed="13.90" duration="218.05" routeLength="1986.69" waitingTime="65.60" waitingCount="1" stopTime="0.00" timeLoss="74.35" rerouteNo="1" devices="tripinfo_car_s2e_232 routing_car_s2e_232" vType="Car" speedFactor="1.00" vaporized=""/>
    <tripinfo id="car_s2e_234" depart="235.20" departLane="s2sep_1" departPos="3.60" departPosLat="0.00" departSpeed="13.90" departDelay="1.20" arrival="455.30" arrivalLane="c2e_1" arrivalPos="990.00" arrivalPosLat="0.00" arrivalSpeed="14.11" duration="220.10" routeLength="1986.69" waitingTime="63.50" waitingCount="1" stopTime="0.00" timeLoss="78.80" rerouteNo="1" devices="tripinfo_car_s2e_234 routing_car_s2e_234" vType="Car" speedFactor="1.02" vaporized=""/>
    <tripinfo id="car_n2w_265" depart="265.00" departLane="n2sep_1" departPos="3.60" departPosLat="0.00" departSpeed="13.90" departDelay="0.00" arrival="456.65" arrivalLane="c2w_1" arrivalPos="990.00" arrivalPosLat="0.00" arrivalSpeed="13.90" duration="191.65" routeLength="1986.69" waitingTime="37.55" waitingCount="1" stopTime="0.00" timeLoss="47.98" rerouteNo="1" devices="tripinfo_car_n2w_265 routing_car_n2w_265" vType="Car" speedFactor="1.00" vaporized=""/>
    <tripinfo id="car_s2e_235" depart="237.05" departLane="s2sep_1" departPos="3.60" departPosLat="0.00" departSpeed="13.90" departDelay="2.05" arrival="457.20" arrivalLane="c2e_1" arrivalPos="990.00" arrivalPosLat="0.00" arrivalSpeed="15.28" duration="220.15" routeLength="1986.69" waitingTime="62.70" waitingCount="1" stopTime="0.00" timeLoss="95.01" rerouteNo="1" devices="tripinfo_car_s2e_235 routing_car_s2e_235" vType="Car" speedFactor="1.15" vaporized=""/>
    <tripinfo id="car_s2n_245" depart="245.00" departLane="s2sep_1" departPos="3.60" departPosLat="0.00" departSpeed="13.90" departDelay="0.00" arrival="457.80" arrivalLane="c2n_1" arrivalPos="990.00" arrivalPosLat="0.00" arrivalSpeed="14.00" duration="212.80" routeLength="1997.01" waitingTime="59.00" waitingCount="1" stopTime="0.00" timeLoss="70.10" rerouteNo="1" devices="tripinfo_car_s2n_245 routing_car_s2n_245" vType="Car" speedFactor="1.01" vaporized=""/>
    <tripinfo id="car_n2w_283" depart="283.00" departLane="n2sep_1" departPos="3.60" departPosLat="0.00" departSpeed="13.90" departDelay="0.00" arrival="458.50" arrivalLane="c2w_1" arrivalPos="990.00" arrivalPosLat="0.00" arrivalSpeed="15.41" duration="175.50" routeLength="1986.69" waitingTime="30.55" waitingCount="1" stopTime="0.00" timeLoss="52.57" rerouteNo="1" devices="tripinfo_car_n2w_283 routing_car_n2w_283" vType="Car" speedFactor="1.17" vaporized=""/>
    <tripinfo id="car_s2e_250" depart="250.00" departLane="s2sep_1" departPos="3.60" departPosLat="0.00" departSpeed="13.90" departDelay="0.00" arrival="459.55" arrivalLane="c2e_1" arrivalPos="990.00" arrivalPosLat="0.00" arrivalSpeed="14.93" duration="209.55" routeLength="1986.69" waitingTime="54.60" waitingCount="1" stopTime="0.00" timeLoss="77.97" rerouteNo="1" devices="tripinfo_car_s2e_250 routing_car_s2e_250" vType="Car" speedFactor="1.09" vaporized=""/>
    <tripinfo id="car_n2w_288" depart="288.00" departLane="n2sep_1" departPos="3.60" departPosLat="0.00" departSpeed="13.90" departDelay="0.00" arrival="460.80" arrivalLane="c2w_1" arrivalPos="990.00" arrivalPosLat="0.00" arrivalSpeed="15.00" duration="172.80" routeLength="1986.69" waitingTime="23.05" waitingCount="1" stopTime="0.00" timeLoss="42.01" rerouteNo="1" devices="tripinfo_car_n2w_288 routing_car_n2w_288" vType="Car" speedFactor="1.10" vaporized=""/>
    <tripinfo id="car_s2n_252" depart="252.00" departLane="s2sep_1" departPos="3.60" departPosLat="0.00" departSpeed="13.90" departDelay="0.00" arrival="461.60" arrivalLane="c2n_1" arrivalPos="990.00" arrivalPosLat="0.00" arrivalSpeed="14.40" duration="209.60" routeLength="1997.01" waitingTime="53.05" waitingCount="1" stopTime="0.00" timeLoss="71.14" rerouteNo="1" devices="tripinfo_car_s2n_252 routing_car_s2n_252" vType="Car" speedFactor="1.04" vaporized=""/>
    <tripinfo id="car_n2w_302" depart="302.00" departLane="n2sep_1" departPos="3.60" departPosLat="0.00" departSpeed="13.90" departDelay="0.00" arrival="465.10" arrivalLane="c2w_1" arrivalPos="990.00" arrivalPosLat="0.00" arrivalSpeed="13.95" duration="163.10" routeLength="1986.69" waitingTime="4.95" waitingCount="1" stopTime="0.00" timeLoss="20.05" rerouteNo="1" devices="tripinfo_car_n2w_302 routing_car_n2w_302" vType="Car" speedFactor="1.00" vaporized=""/>
    <tripinfo id="car_s2e_261" depart="261.00" departLane="s2sep_1" departPos="3.60" departPosLat="0.00" departSpeed="13.90" departDelay="0.00" arrival="465.70" arrivalLane="c2e_1" arrivalPos="990.00" arrivalPosLat="0.00" arrivalSpeed="13.90" duration="204.70" routeLength="1986.69" waitingTime="46.45" waitingCount="1" stopTime="0.00" timeLoss="61.05" rerouteNo="1" devices="tripinfo_car_s2e_261 routing_car_s2e_261" vType="Car" speedFactor="1.00" vaporized=""/>
    <tripinfo id="car_s2n_288" depart="288.00" departLane="s2sep_1" departPos="3.60" departPosLat="0.00" departSpeed="13.90" departDelay="0.00" arrival="467.10" arrivalLane="c2n_1" arrivalPos="990.00" arrivalPosLat="0.00" arrivalSpeed="14.02" duration="179.10" routeLength="1997.01" waitingTime="21.85" waitingCount="1" stopTime="0.00" timeLoss="36.68" rerouteNo="1" devices="tripinfo_car_s2n_288 routing_car_s2n_288" vType="Car" speedFactor="1.01" vaporized=""/>
    <tripinfo id="car_s2e_324" depart="324.00" departLane="s2sep_1" departPos="3.60" departPosLat="0.00" departSpeed="13.90" departDelay="0.00" arrival="467.65" arrivalLane="c2e_1" arrivalPos="990.00" arrivalPosLat="0.00" arrivalSpeed="15.32" duration="143.65" routeLength="1986.69" waitingTime="0.00" waitingCount="0" stopTime="0.00" timeLoss="19.01" rerouteNo="1" devices="tripinfo_car_s2e_324 routing_car_s2e_324" vType="Car" speedFactor="1.15" vaporized=""/>
    <tripinfo id="car_n2w_322" depart="322.00" departLane="n2sep_1" departPos="3.60" departPosLat="0.00" departSpeed="13.90" departDelay="0.00" arrival="468.15" arrivalLane="c2w_1" arrivalPos="990.00" arrivalPosLat="0.00" arrivalSpeed="14.27" duration="146.15" routeLength="1986.69" waitingTime="0.00" waitingCount="0" stopTime="0.00" timeLoss="6.87" rerouteNo="1" devices="tripinfo_car_n2w_322 routing_car_n2w_322" vType="Car" speedFactor="1.03" vaporized=""/>
    <tripinfo id="car_s2n_345" depart="345.00" departLane="s2sep_1" departPos="3.60" departPosLat="0.00" departSpeed="13.90" departDelay="0.00" arrival="468.85" arrivalLane="c2n_1" arrivalPos="990.00" arrivalPosLat="0.00" arrivalSpeed="15.85" duration="123.85" routeLength="1997.01" waitingTime="0.00" waitingCount="0" stopTime="0.00" timeLoss="6.63" rerouteNo="1" devices="tripinfo_car_s2n_345 routing_car_s2n_345" vType="Car" speedFactor="1.23" vaporized=""/>
</tripinfos>
