<?xml version="1.0" encoding="UTF-8"?>

<!-- generated on Sat Apr 24 18:22:15 2021 by Eclipse SUMO Version 1.4.0
<configuration xmlns:xsi="http://www.w3.org/2001/XMLSchema-instance" xsi:noNamespaceSchemaLocation="http://sumo.dlr.de/xsd/sumoConfiguration.xsd">

    <input>
        <net-file value="sumofiles/junction.net.xml"/>
        <route-files value="sumofiles/junction_preemption_212.rou.xml"/>
        <additional-files value="sumofiles/junction.det.xml"/>
    </input>

    <output>
        <tripinfo-output value="sumofiles/output/tripinfo_preemption_212.xml"/>
    </output>

    <time>
        <begin value="0"/>
        <end value="10000"/>
        <step-length value="0.05"/>
    </time>

    <processing>
        <lateral-resolution value="0.1"/>
    </processing>

    <report>
        <no-warnings value="true"/>
        <error-log value="sumofiles/output/errorlog_preemption_212.log"/>
        <no-step-log value="true"/>
    </report>

    <traci_server>
        <remote-port value="47971"/>
    </traci_server>

    <gui_only>
        <gui-settings-file value="sumofiles/junction-gui.settings.xml"/>
        <tracker-interval value="0.05"/>
    </gui_only>

</configuration>
-->

<tripinfos xmlns:xsi="http://www.w3.org/2001/XMLSchema-instance" xsi:noNamespaceSchemaLocation="http://sumo.dlr.de/xsd/tripinfo_file.xsd">
    <tripinfo id="car_e2n_3" depart="3.00" departLane="e2sep_1" departPos="3.60" departPosLat="0.00" departSpeed="13.90" departDelay="0.00" arrival="142.30" arrivalLane="c2n_1" arrivalPos="990.00" arrivalPosLat="0.00" arrivalSpeed="14.73" duration="139.30" routeLength="1986.69" waitingTime="0.00" waitingCount="0" stopTime="0.00" timeLoss="3.74" rerouteNo="1" devices="tripinfo_car_e2n_3 routing_car_e2n_3" vType="Car" speedFactor="1.06" vaporized=""/>
    <tripinfo id="car_e2s_7" depart="7.00" departLane="e2sep_1" departPos="3.60" departPosLat="0.00" departSpeed="13.90" departDelay="0.00" arrival="147.65" arrivalLane="c2s_1" arrivalPos="990.00" arrivalPosLat="0.00" arrivalSpeed="14.73" duration="140.65" routeLength="1996.47" waitingTime="0.00" waitingCount="0" stopTime="0.00" timeLoss="4.48" rerouteNo="1" devices="tripinfo_car_e2s_7 routing_car_e2s_7" vType="Car" speedFactor="1.06" vaporized=""/>
    <tripinfo id="car_s2w_14" depart="14.00" departLane="s2sep_1" departPos="3.60" departPosLat="0.00" departSpeed="13.90" departDelay="0.00" arrival="166.05" arrivalLane="c2w_1" arrivalPos="990.00" arrivalPosLat="0.00" arrivalSpeed="14.04" duration="152.05" routeLength="1996.47" waitingTime="1.65" waitingCount="1" stopTime="0.00" timeLoss="9.20" rerouteNo="1" devices="tripinfo_car_s2w_14 routing_car_s2w_14" vType="Car" speedFactor="1.01" vaporized=""/>
    <tripinfo id="car_n2e_26" depart="26.00" departLane="n2sep_1" departPos="3.60" departPosLat="0.00" departSpeed="13.90" departDelay="0.00" arrival="173.80" arrivalLane="c2e_1" arrivalPos="990.00" arrivalPosLat="0.00" arrivalSpeed="13.90" duration="147.80" routeLength="1996.47" waitingTime="0.00" waitingCount="0" stopTime="0.00" timeLoss="3.49" rerouteNo="1" devices="tripinfo_car_n2e_26 routing_car_n2e_26" vType="Car" speedFactor="1.00" vaporized=""/>
    <tripinfo id="car_s2e_37" depart="37.00" departLane="s2sep_1" departPos="3.60" departPosLat="0.00" departSpeed="13.90" departDelay="0.00" arrival="176.25" arrivalLane="c2e_1" arrivalPos="990.00" arrivalPosLat="0.00" arrivalSpeed="14.93" duration="139.25" routeLength="1986.69" waitingTime="0.00" waitingCount="0" stopTime="0.00" timeLoss="7.49" rerouteNo="1" devices="tripinfo_car_s2e_37 routing_car_s2e_37" vType="Car" speedFactor="1.09" vaporized=""/>
    <tripinfo id="car_n2w_36" depart="36.00" departLane="n2sep_1" departPos="3.60" departPosLat="0.00" departSpeed="13.90" departDelay="0.00" arrival="179.40" arrivalLane="c2w_1" arrivalPos="990.00" arrivalPosLat="0.00" arrivalSpeed="14.32" duration="143.40" routeLength="1986.69" waitingTime="0.00" waitingCount="0" stopTime="0.00" timeLoss="3.96" rerouteNo="1" devices="tripinfo_car_n2w_36 routing_car_n2w_36" vType="Car" speedFactor="1.03" vaporized=""/>
    <tripinfo id="car_n2w_42" depart="42.00" departLane="n2sep_1" departPos="3.60" departPosLat="0.00" departSpeed="13.90" departDelay="0.00" arrival="184.50" arrivalLane="c2w_1" arrivalPos="990.00" arrivalPosLat="0.00" arrivalSpeed="14.55" duration="142.50" routeLength="1986.69" waitingTime="0.00" waitingCount="0" stopTime="0.00" timeLoss="5.31" rerouteNo="1" devices="tripinfo_car_n2w_42 routing_car_n2w_42" vType="Car" speedFactor="1.05" vaporized=""/>
    <tripinfo id="car_s2w_51" depart="51.00" departLane="s2sep_1" departPos="3.60" departPosLat="0.00" departSpeed="13.90" departDelay="0.00" arrival="198.65" arrivalLane="c2w_1" arrivalPos="990.00" arrivalPosLat="0.00" arrivalSpeed="13.90" duration="147.65" routeLength="1996.47" waitingTime="0.00" waitingCount="0" stopTime="0.00" timeLoss="3.34" rerouteNo="1" devices="tripinfo_car_s2w_51 routing_car_s2w_51" vType="Car" speedFactor="1.00" vaporized=""/>
    <tripinfo id="car_n2e_64" depart="64.00" departLane="n2sep_1" departPos="3.60" departPosLat="0.00" departSpeed="13.90" departDelay="0.00" arrival="200.30" arrivalLane="c2e_1" arrivalPos="990.00" arrivalPosLat="0.00" arrivalSpeed="15.16" duration="136.30" routeLength="1996.47" waitingTime="0.00" waitingCount="0" stopTime="0.00" timeLoss="3.99" rerouteNo="1" devices="tripinfo_car_n2e_64 routing_car_n2e_64" vType="Car" speedFactor="1.09" vaporized=""/>
    <tripinfo id="car_s2w_59" depart="59.00" departLane="s2sep_1" departPos="3.60" departPosLat="0.00" departSpeed="13.90" departDelay="0.00" arrival="205.05" arrivalLane="c2w_1" arrivalPos="990.00" arrivalPosLat="0.00" arrivalSpeed="14.15" duration="146.05" routeLength="1996.47" waitingTime="0.00" waitingCount="0" stopTime="0.00" timeLoss="4.30" rerouteNo="1" devices="tripinfo_car_s2w_59 routing_car_s2w_59" vType="Car" speedFactor="1.02" vaporized=""/>
    <tripinfo id="car_e2n_20" depart="20.00" departLane="e2sep_1" departPos="3.60" departPosLat="0.00" departSpeed="13.90" departDelay="0.00" arrival="205.30" arrivalLane="c2n_1" arrivalPos="990.00" arrivalPosLat="0.00" arrivalSpeed="15.05" duration="185.30" routeLength="1986.69" waitingTime="45.20" waitingCount="1" stopTime="0.00" timeLoss="52.61" rerouteNo="1" devices="tripinfo_car_e2n_20 routing_car_e2n_20" vType="Car" speedFactor="1.08" vaporized=""/>
    <tripinfo id="car_w2e_24" depart="24.00" departLane="w2sep_1" departPos="3.60" departPosLat="0.00" departSpeed="13.90" departDelay="0.00" arrival="209.05" arrivalLane="c2e_1" arrivalPos="990.00" arrivalPosLat="0.00" arrivalSpeed="14.32" duration="185.05" routeLength="1997.01" waitingTime="38.05" waitingCount="1" stopTime="0.00" timeLoss="45.61" rerouteNo="1" devices="tripinfo_car_w2e_24 routing_car_w2e_24" vType="Car" speedFactor="1.03" vaporized=""/>
    <tripinfo id="car_w2e_34" depart="34.00" departLane="w2sep_1" departPos="3.60" departPosLat="0.00" departSpeed="13.90" departDelay="0.00" arrival="212.70" arrivalLane="c2e_1" arrivalPos="990.00" arrivalPosLat="0.00" arrivalSpeed="14.51" duration="178.70" routeLength="1997.01" waitingTime="29.65" waitingCount="1" stopTime="0.00" timeLoss="41.31" rerouteNo="1" devices="tripinfo_car_w2e_34 routing_car_w2e_34" vType="Car" speedFactor="1.05" vaporized=""/>
    <tripinfo id="car_w2s_34" depart="35.40" departLane="w2sep_1" departPos="3.60" departPosLat="0.00" departSpeed="13.90" departDelay="1.40" arrival="214.45" arrivalLane="c2s_1" arrivalPos="990.00" arrivalPosLat="0.00" arrivalSpeed="14.04" duration="179.05" routeLength="1986.69" waitingTime="25.60" waitingCount="1" stopTime="0.00" timeLoss="36.84" rerouteNo="1" devices="tripinfo_car_w2s_34 routing_car_w2s_34" vType="Car" speedFactor="1.01" vaporized=""/>
    <tripinfo id="car_w2e_36" depart="37.20" departLane="w2sep_1" departPos="3.60" departPosLat="0.00" departSpeed="13.90" departDelay="1.20" arrival="215.35" arrivalLane="c2e_1" arrivalPos="990.00" arrivalPosLat="0.00" arrivalSpeed="14.90" duration="178.15" routeLength="1997.01" waitingTime="24.60" waitingCount="1" stopTime="0.00" timeLoss="45.45" rerouteNo="1" devices="tripinfo_car_w2e_36 routing_car_w2e_36" vType="Car" speedFactor="1.08" vaporized=""/>
    <tripinfo id="bus_e2n_22" depart="22.00" departLane="e2sep_1" departPos="12.10" departPosLat="0.00" departSpeed="13.90" departDelay="0.00" arrival="216.60" arrivalLane="c2n_1" arrivalPos="990.00" arrivalPosLat="0.00" arrivalSpeed="13.90" duration="194.60" routeLength="1978.19" waitingTime="39.30" waitingCount="1" stopTime="0.00" timeLoss="51.56" rerouteNo="1" devices="tripinfo_bus_e2n_22 routing_bus_e2n_22" vType="Bus" speedFactor="1.00" vaporized=""/>
    <tripinfo id="car_w2e_55" depart="55.00" departLane="w2sep_1" departPos="3.60" departPosLat="0.00" departSpeed="13.90" departDelay="0.00" arrival="217.50" arrivalLane="c2e_1" arrivalPos="990.00" arrivalPosLat="0.00" arrivalSpeed="15.66" duration="162.50" routeLength="1997.01" waitingTime="11.75" waitingCount="1" stopTime="0.00" timeLoss="38.43" rerouteNo="1" devices="tripinfo_car_w2e_55 routing_car_w2e_55" vType="Car" speedFactor="1.16" vaporized=""/>
    <tripinfo id="car_w2s_38" depart="38.95" departLane="w2sep_1" departPos="3.60" departPosLat="0.00" departSpeed="13.90" departDelay="0.95" arrival="219.00" arrivalLane="c2s_1" arrivalPos="990.00" arrivalPosLat="0.00" arrivalSpeed="14.26" duration="180.05" routeLength="1986.69" waitingTime="22.75" waitingCount="1" stopTime="0.00" timeLoss="40.07" rerouteNo="1" devices="tripinfo_car_w2s_38 routing_car_w2s_38" vType="Car" speedFactor="1.03" vaporized=""/>
    <tripinfo id="car_e2n_43" depart="43.00" departLane="e2sep_1" departPos="3.60" departPosLat="0.00" departSpeed="13.90" departDelay="0.00" arrival="219.25" arrivalLane="c2n_1" arrivalPos="990.00" arrivalPosLat="0.00" arrivalSpeed="15.28" duration="176.25" routeLength="1986.69" waitingTime="27.05" waitingCount="1" stopTime="0.00" timeLoss="48.30" rerouteNo="1" devices="tripinfo_car_e2n_43 routing_car_e2n_43" vType="Car" speedFactor="1.12" vaporized=""/>
    <tripinfo id="car_w2e_88" depart="88.00" departLane="w2sep_1" departPos="3.60" departPosLat="0.00" departSpeed="13.90" departDelay="0.00" arrival="219.65" arrivalLane="c2e_1" arrivalPos="990.00" arrivalPosLat="0.00" arrivalSpeed="15.96" duration="131.65" routeLength="1997.01" waitingTime="0.00" waitingCount="0" stopTime="0.00" timeLoss="9.72" rerouteNo="1" devices="tripinfo_car_w2e_88 routing_car_w2e_88" vType="Car" speedFactor="1.18" vaporized=""/>
    <tripinfo id="car_e2w_45" depart="45.00" departLane="e2sep_1" departPos="3.60" departPosLat="0.00" departSpeed="13.90" departDelay="0.00" arrival="220.25" arrivalLane="c2w_1" arrivalPos="990.00" arrivalPosLat="0.00" arrivalSpeed="13.90" duration="175.25" routeLength="1997.01" waitingTime="18.65" waitingCount="1" stopTime="0.00" timeLoss="31.58" rerouteNo="1" devices="tripinfo_car_e2w_45 routing_car_e2w_45" vType="Car" speedFactor="1.00" vaporized=""/>
    <tripinfo id="car_w2s_50" depart="50.00" departLane="w2sep_1" departPos="3.60" departPosLat="0.00" departSpeed="13.90" departDelay="0.00" arrival="222.25" arrivalLane="c2s_1" arrivalPos="990.00" arrivalPosLat="0.00" arrivalSpeed="14.48" duration="172.25" routeLength="1986.69" waitingTime="18.45" waitingCount="1" stopTime="0.00" timeLoss="34.87" rerouteNo="1" devices="tripinfo_car_w2s_50 routing_car_w2s_50" vType="Car" speedFactor="1.05" vaporized=""/>
    <tripinfo id="car_e2w_95" depart="95.00" departLane="e2sep_1" departPos="3.60" departPosLat="0.00" departSpeed="13.90" departDelay="0.00" arrival="222.45" arrivalLane="c2w_1" arrivalPos="990.00" arrivalPosLat="0.00" arrivalSpeed="15.61" duration="127.45" routeLength="1997.01" waitingTime="0.00" waitingCount="0" stopTime="0.00" timeLoss="2.99" rerouteNo="1" devices="tripinfo_car_e2w_95 routing_car_e2w_95" vType="Car" speedFactor="1.15" vaporized=""/>
    <tripinfo id="car_w2n_53" depart="53.00" departLane="w2sep_1" departPos="3.60" departPosLat="0.00" departSpeed="13.90" departDelay="0.00" arrival="224.35" arrivalLane="c2n_1" arrivalPos="990.00" arrivalPosLat="0.00" arrivalSpeed="13.90" duration="171.35" routeLength="1996.47" waitingTime="14.05" waitingCount="2" stopTime="0.00" timeLoss="27.02" rerouteNo="1" devices="tripinfo_car_w2n_53 routing_car_w2n_53" vType="Car" speedFactor="1.00" vaporized=""/>
    <tripinfo id="car_e2s_80" depart="80.00" departLane="e2sep_1" departPos="3.60" departPosLat="0.00" departSpeed="13.90" departDelay="0.00" arrival="224.35" arrivalLane="c2s_1" arrivalPos="990.00" arrivalPosLat="0.00" arrivalSpeed="15.31" duration="144.35" routeLength="1996.47" waitingTime="5.00" waitingCount="1" stopTime="0.00" timeLoss="16.84" rerouteNo="1" devices="tripinfo_car_e2s_80 routing_car_e2s_80" vType="Car" speedFactor="1.13" vaporized=""/>
    <tripinfo id="car_w2n_63" depart="63.00" departLane="w2sep_1" departPos="3.60" departPosLat="0.00" departSpeed="13.90" departDelay="0.00" arrival="227.85" arrivalLane="c2n_1" arrivalPos="990.00" arrivalPosLat="0.00" arrivalSpeed="14.01" duration="164.85" routeLength="1996.47" waitingTime="7.05" waitingCount="1" stopTime="0.00" timeLoss="21.98" rerouteNo="1" devices="tripinfo_car_w2n_63 routing_car_w2n_63" vType="Car" speedFactor="1.01" vaporized=""/>
    <tripinfo id="car_w2n_67" depart="67.00" departLane="w2sep_1" departPos="3.60" departPosLat="0.00" departSpeed="13.90" departDelay="0.00" arrival="231.35" arrivalLane="c2n_1" arrivalPos="990.00" arrivalPosLat="0.00" arrivalSpeed="14.51" duration="164.35" routeLength="1996.47" waitingTime="6.85" waitingCount="2" stopTime="0.00" timeLoss="26.49" rerouteNo="1" devices="tripinfo_car_w2n_67 routing_car_w2n_67" vType="Car" speedFactor="1.05" vaporized=""/>
    <tripinfo id="car_w2n_98" depart="98.00" departLane="w2sep_1" departPos="3.60" departPosLat="0.00" departSpeed="13.90" departDelay="0.00" arrival="245.00" arrivalLane="c2n_1" arrivalPos="990.00" arrivalPosLat="0.00" arrivalSpeed="13.97" duration="147.00" routeLength="1996.47" waitingTime="0.00" waitingCount="0" stopTime="0.00" timeLoss="3.43" rerouteNo="1" devices="tripinfo_car_w2n_98 routing_car_w2n_98" vType="Car" speedFactor="1.01" vaporized=""/>
    <tripinfo id="car_w2n_101" depart="101.45" departLane="w2sep_1" departPos="3.60" departPosLat="0.00" departSpeed="13.90" departDelay="0.45" arrival="252.15" arrivalLane="c2n_1" arrivalPos="990.00" arrivalPosLat="0.00" arrivalSpeed="13.90" duration="150.70" routeLength="1996.47" waitingTime="0.00" waitingCount="0" stopTime="0.00" timeLoss="6.39" rerouteNo="1" devices="tripinfo_car_w2n_101 routing_car_w2n_101" vType="Car" speedFactor="1.00" vaporized=""/>
    <tripinfo id="car_n2s_68" depart="68.00" departLane="n2sep_1" departPos="3.60" departPosLat="0.00" departSpeed="13.90" departDelay="0.00" arrival="252.50" arrivalLane="c2s_1" arrivalPos="990.00" arrivalPosLat="0.00" arrivalSpeed="15.61" duration="184.50" routeLength="1997.01" waitingTime="39.70" waitingCount="1" stopTime="0.00" timeLoss="56.51" rerouteNo="1" devices="tripinfo_car_n2s_68 routing_car_n2s_68" vType="Car" speedFactor="1.12" vaporized=""/>
    <tripinfo id="car_s2n_104" depart="104.50" departLane="s2sep_1" departPos="3.60" departPosLat="0.00" departSpeed="13.90" departDelay="0.50" arrival="254.05" arrivalLane="c2n_1" arrivalPos="990.00" arrivalPosLat="0.00" arrivalSpeed="15.35" duration="149.55" routeLength="1997.01" waitingTime="1.30" waitingCount="1" stopTime="0.00" timeLoss="25.50" rerouteNo="1" devices="tripinfo_car_s2n_104 routing_car_s2n_104" vType="Car" speedFactor="1.16" vaporized=""/>
    <tripinfo id="car_n2w_52" depart="52.00" departLane="n2sep_1" departPos="3.60" departPosLat="0.00" departSpeed="13.90" departDelay="0.00" arrival="255.65" arrivalLane="c2w_1" arrivalPos="990.00" arrivalPosLat="0.00" arrivalSpeed="13.90" duration="203.65" routeLength="1986.69" waitingTime="53.15" waitingCount="1" stopTime="0.00" timeLoss="59.95" rerouteNo="1" devices="tripinfo_car_n2w_52 routing_car_n2w_52" vType="Car" speedFactor="1.00" vaporized=""/>
    <tripinfo id="car_n2e_78" depart="78.00" departLane="n2sep_1" departPos="3.60" departPosLat="0.00" departSpeed="13.90" departDelay="0.00" arrival="257.75" arrivalLane="c2e_1" arrivalPos="990.00" arrivalPosLat="0.00" arrivalSpeed="13.90" duration="179.75" routeLength="1996.47" waitingTime="26.85" waitingCount="1" stopTime="0.00" timeLoss="35.45" rerouteNo="1" devices="tripinfo_car_n2e_78 routing_car_n2e_78" vType="Car" speedFactor="1.00" vaporized=""/>
    <tripinfo id="car_n2w_66" depart="66.00" departLane="n2sep_1" departPos="3.60" departPosLat="0.00" departSpeed="13.90" departDelay="0.00" arrival="259.15" arrivalLane="c2w_1" arrivalPos="990.00" arrivalPosLat="0.00" arrivalSpeed="14.23" duration="193.15" routeLength="1986.69" waitingTime="40.60" waitingCount="1" stopTime="0.00" timeLoss="53.18" rerouteNo="1" devices="tripinfo_car_n2w_66 routing_car_n2w_66" vType="Car" speedFactor="1.03" vaporized=""/>
    <tripinfo id="car_n2w_124" depart="124.00" departLane="n2sep_1" departPos="3.60" departPosLat="0.00" departSpeed="13.90" departDelay="0.00" arrival="262.10" arrivalLane="c2w_1" arrivalPos="990.00" arrivalPosLat="0.00" arrivalSpeed="15.02" duration="138.10" routeLength="1986.69" waitingTime="0.00" waitingCount="0" stopTime="0.00" timeLoss="6.05" rerouteNo="1" devices="tripinfo_car_n2w_124 routing_car_n2w_124" vType="Car" speedFactor="1.09" vaporized=""/>
    <tripinfo id="car_n2e_81" depart="81.00" departLane="n2sep_1" departPos="3.60" departPosLat="0.00" departSpeed="13.90" departDelay="0.00" arrival="262.20" arrivalLane="c2e_1" arrivalPos="990.00" arrivalPosLat="0.00" arrivalSpeed="13.89" duration="181.20" routeLength="1996.47" waitingTime="23.50" waitingCount="1" stopTime="0.00" timeLoss="36.85" rerouteNo="1" devices="tripinfo_car_n2e_81 routing_car_n2e_81" vType="Car" speedFactor="1.00" vaporized=""/>
    <tripinfo id="car_s2w_70" depart="70.00" departLane="s2sep_1" departPos="3.60" departPosLat="0.00" departSpeed="13.90" departDelay="0.00" arrival="269.85" arrivalLane="c2w_1" arrivalPos="990.00" arrivalPosLat="0.00" arrivalSpeed="13.90" duration="199.85" routeLength="1996.47" waitingTime="44.05" waitingCount="2" stopTime="0.00" timeLoss="55.52" rerouteNo="1" devices="tripinfo_car_s2w_70 routing_car_s2w_70" vType="Car" speedFactor="1.00" vaporized=""/>
    <tripinfo id="car_s2e_126" depart="126.00" departLane="s2sep_1" departPos="3.60" departPosLat="0.00" departSpeed="13.90" departDelay="0.00" arrival="272.00" arrivalLane="c2e_1" arrivalPos="990.00" arrivalPosLat="0.00" arrivalSpeed="14.04" duration="146.00" routeLength="1986.69" waitingTime="0.00" waitingCount="0" stopTime="0.00" timeLoss="3.78" rerouteNo="1" devices="tripinfo_car_s2e_126 routing_car_s2e_126" vType="Car" speedFactor="1.01" vaporized=""/>
    <tripinfo id="car_s2w_101" depart="101.00" departLane="s2sep_1" departPos="3.60" departPosLat="0.00" departSpeed="13.90" departDelay="0.00" arrival="273.35" arrivalLane="c2w_1" arrivalPos="990.00" arrivalPosLat="0.00" arrivalSpeed="14.14" duration="172.35" routeLength="1996.47" waitingTime="14.25" waitingCount="2" stopTime="0.00" timeLoss="30.80" rerouteNo="1" devices="tripinfo_car_s2w_101 routing_car_s2w_101" vType="Car" speedFactor="1.02" vaporized=""/>
    <tripinfo id="car_n2w_137" depart="137.00" departLane="n2sep_1" departPos="3.60" departPosLat="0.00" departSpeed="13.90" departDelay="0.00" arrival="275.65" arrivalLane="c2w_1" arrivalPos="990.00" arrivalPosLat="0.00" arrivalSpeed="14.94" duration="138.65" routeLength="1986.69" waitingTime="0.00" waitingCount="0" stopTime="0.00" timeLoss="7.51" rerouteNo="1" devices="tripinfo_car_n2w_137 routing_car_n2w_137" vType="Car" speedFactor="1.10" vaporized=""/>
    <tripinfo id="car_s2w_103" depart="103.00" departLane="s2sep_1" departPos="3.60" departPosLat="0.00" departSpeed="13.90" departDelay="0.00" arrival="278.15" arrivalLane="c2w_1" arrivalPos="990.00" arrivalPosLat="0.00" arrivalSpeed="15.13" duration="175.15" routeLength="1996.47" waitingTime="15.25" waitingCount="3" stopTime="0.00" timeLoss="44.21" rerouteNo="1" devices="tripinfo_car_s2w_103 routing_car_s2w_103" vType="Car" speedFactor="1.10" vaporized=""/>
    <tripinfo id="car_s2e_131" depart="131.00" departLane="s2sep_1" departPos="3.60" departPosLat="0.00" departSpeed="13.90" departDelay="0.00" arrival="279.35" arrivalLane="c2e_1" arrivalPos="990.00" arrivalPosLat="0.00" arrivalSpeed="13.90" duration="148.35" routeLength="1986.69" waitingTime="0.00" waitingCount="0" stopTime="0.00" timeLoss="4.66" rerouteNo="1" devices="tripinfo_car_s2e_131 routing_car_s2e_131" vType="Car" speedFactor="1.00" vaporized=""/>
    <tripinfo id="car_s2e_133" depart="133.00" departLane="s2sep_1" departPos="3.60" departPosLat="0.00" departSpeed="13.90" departDelay="0.00" arrival="284.15" arrivalLane="c2e_1" arrivalPos="990.00" arrivalPosLat="0.00" arrivalSpeed="13.89" duration="151.15" routeLength="1986.69" waitingTime="0.00" waitingCount="0" stopTime="0.00" timeLoss="7.48" rerouteNo="1" devices="tripinfo_car_s2e_133 routing_car_s2e_133" vType="Car" speedFactor="1.00" vaporized=""/>
    <tripinfo id="car_s2e_134" depart="134.65" departLane="s2sep_1" departPos="3.60" departPosLat="0.00" departSpeed="13.90" departDelay="0.65" arrival="286.00" arrivalLane="c2e_1" arrivalPos="990.00" arrivalPosLat="0.00" arrivalSpeed="15.38" duration="151.35" routeLength="1986.69" waitingTime="0.00" waitingCount="0" stopTime="0.00" timeLoss="28.41" rerouteNo="1" devices="tripinfo_car_s2e_134 routing_car_s2e_134" vType="Car" speedFactor="1.17" vaporized=""/>
    <tripinfo id="car_s2e_136" depart="136.35" departLane="s2sep_1" departPos="3.60" departPosLat="0.00" departSpeed="13.90" departDelay="0.35" arrival="289.45" arrivalLane="c2e_1" arrivalPos="990.00" arrivalPosLat="0.00" arrivalSpeed="14.10" duration="153.10" routeLength="1986.69" waitingTime="0.00" waitingCount="0" stopTime="0.00" timeLoss="11.81" rerouteNo="1" devices="tripinfo_car_s2e_136 routing_car_s2e_136" vType="Car" speedFactor="1.02" vaporized=""/>
    <tripinfo id="car_s2w_153" depart="153.00" departLane="s2sep_1" departPos="3.60" departPosLat="0.00" departSpeed="13.90" departDelay="0.00" arrival="290.30" arrivalLane="c2w_1" arrivalPos="990.00" arrivalPosLat="0.00" arrivalSpeed="15.05" duration="137.30" routeLength="1996.47" waitingTime="0.00" waitingCount="0" stopTime="0.00" timeLoss="3.96" rerouteNo="1" devices="tripinfo_car_s2w_153 routing_car_s2w_153" vType="Car" speedFactor="1.08" vaporized=""/>
    <tripinfo id="car_w2s_100" depart="100.00" departLane="w2sep_1" departPos="3.60" departPosLat="0.00" departSpeed="13.90" departDelay="0.00" arrival="290.50" arrivalLane="c2s_1" arrivalPos="990.00" arrivalPosLat="0.00" arrivalSpeed="16.29" duration="190.50" routeLength="1986.69" waitingTime="51.25" waitingCount="1" stopTime="0.00" timeLoss="67.87" rerouteNo="1" devices="tripinfo_car_w2s_100 routing_car_w2s_100" vType="Car" speedFactor="1.17" vaporized=""/>
    <tripinfo id="car_n2e_143" depart="143.00" departLane="n2sep_1" departPos="3.60" departPosLat="0.00" departSpeed="13.90" departDelay="0.00" arrival="293.25" arrivalLane="c2e_1" arrivalPos="990.00" arrivalPosLat="0.00" arrivalSpeed="13.88" duration="150.25" routeLength="1996.47" waitingTime="0.00" waitingCount="0" stopTime="0.00" timeLoss="5.92" rerouteNo="1" devices="tripinfo_car_n2e_143 routing_car_n2e_143" vType="Car" speedFactor="1.00" vaporized=""/>
    <tripinfo id="car_e2n_114" depart="114.00" departLane="e2sep_1" departPos="3.60" departPosLat="0.00" departSpeed="13.90" departDelay="0.00" arrival="294.75" arrivalLane="c2n_1" arrivalPos="990.00" arrivalPosLat="0.00" arrivalSpeed="15.18" duration="180.75" routeLength="1986.69" waitingTime="41.75" waitingCount="1" stopTime="0.00" timeLoss="49.20" rerouteNo="1" devices="tripinfo_car_e2n_114 routing_car_e2n_114" vType="Car" speedFactor="1.09" vaporized=""/>
    <tripinfo id="car_w2s_103" depart="105.15" departLane="w2sep_1" departPos="3.60" departPosLat="0.00" departSpeed="13.90" departDelay="2.15" arrival="295.55" arrivalLane="c2s_1" arrivalPos="990.00" arrivalPosLat="0.00" arrivalSpeed="16.39" duration="190.40" routeLength="1986.69" waitingTime="42.95" waitingCount="1" stopTime="0.00" timeLoss="68.63" rerouteNo="1" devices="tripinfo_car_w2s_103 routing_car_w2s_103" vType="Car" speedFactor="1.18" vaporized=""/>
    <tripinfo id="car_e2w_121" depart="121.00" departLane="e2sep_1" departPos="3.60" departPosLat="0.00" departSpeed="13.90" departDelay="0.00" arrival="300.45" arrivalLane="c2w_1" arrivalPos="990.00" arrivalPosLat="0.00" arrivalSpeed="14.42" duration="179.45" routeLength="1997.01" waitingTime="32.20" waitingCount="1" stopTime="0.00" timeLoss="41.01" rerouteNo="1" devices="tripinfo_car_e2w_121 routing_car_e2w_121" vType="Car" speedFactor="1.04" vaporized=""/>
    <tripinfo id="car_w2e_103" depart="103.25" departLane="w2sep_1" departPos="3.60" departPosLat="0.00" departSpeed="13.90" departDelay="0.25" arrival="303.00" arrivalLane="c2e_1" arrivalPos="990.00" arrivalPosLat="0.00" arrivalSpeed="13.90" duration="199.75" routeLength="1997.01" waitingTime="43.60" waitingCount="1" stopTime="0.00" timeLoss="56.05" rerouteNo="1" devices="tripinfo_car_w2e_103 routing_car_w2e_103" vType="Car" speedFactor="1.00" vaporized=""/>
    <tripinfo id="car_w2n_112" depart="112.00" departLane="w2sep_1" departPos="3.60" departPosLat="0.00" departSpeed="13.90" departDelay="0.00" arrival="304.70" arrivalLane="c2n_1" arrivalPos="990.00" arrivalPosLat="0.00" arrivalSpeed="14.15" duration="192.70" routeLength="1996.47" waitingTime="36.00" waitingCount="2" stopTime="0.00" timeLoss="50.95" rerouteNo="1" devices="tripinfo_car_w2n_112 routing_car_w2n_112" vType="Car" speedFactor="1.02" vaporized=""/>
    <tripinfo id="car_w2e_109" depart="109.00" departLane="w2sep_1" departPos="3.60" departPosLat="0.00" departSpeed="13.90" departDelay="0.00" arrival="306.75" arrivalLane="c2e_1" arrivalPos="990.00" arrivalPosLat="0.00" arrivalSpeed="14.30" duration="197.75" routeLength="1997.01" waitingTime="41.80" waitingCount="1" stopTime="0.00" timeLoss="58.31" rerouteNo="1" devices="tripinfo_car_w2e_109 routing_car_w2e_109" vType="Car" speedFactor="1.03" vaporized=""/>
    <tripinfo id="car_w2s_123" depart="123.00" departLane="w2sep_1" departPos="3.60" departPosLat="0.00" departSpeed="13.90" departDelay="0.00" arrival="307.00" arrivalLane="c2s_1" arrivalPos="990.00" arrivalPosLat="0.00" arrivalSpeed="14.50" duration="184.00" routeLength="1986.69" waitingTime="34.05" waitingCount="1" stopTime="0.00" timeLoss="46.34" rerouteNo="1" devices="tripinfo_car_w2s_123 routing_car_w2s_123" vType="Car" speedFactor="1.04" vaporized=""/>
    <tripinfo id="car_w2n_128" depart="128.00" departLane="w2sep_1" departPos="3.60" departPosLat="0.00" departSpeed="13.90" departDelay="0.00" arrival="309.70" arrivalLane="c2n_1" arrivalPos="990.00" arrivalPosLat="0.00" arrivalSpeed="13.90" duration="181.70" routeLength="1996.47" waitingTime="22.50" waitingCount="1" stopTime="0.00" timeLoss="37.38" rerouteNo="1" devices="tripinfo_car_w2n_128 routing_car_w2n_128" vType="Car" speedFactor="1.00" vaporized=""/>
    <tripinfo id="car_w2s_167" depart="167.00" departLane="w2sep_1" departPos="3.60" departPosLat="0.00" departSpeed="13.90" departDelay="0.00" arrival="310.95" arrivalLane="c2s_1" arrivalPos="990.00" arrivalPosLat="0.00" arrivalSpeed="16.01" duration="143.95" routeLength="1986.69" waitingTime="1.25" waitingCount="1" stopTime="0.00" timeLoss="19.47" rerouteNo="1" devices="tripinfo_car_w2s_167 routing_car_w2s_167" vType="Car" speedFactor="1.15" vaporized=""/>
    <tripinfo id="car_w2n_151" depart="151.00" departLane="w2sep_1" departPos="3.60" departPosLat="0.00" departSpeed="13.90" departDelay="0.00" arrival="311.70" arrivalLane="c2n_1" arrivalPos="990.00" arrivalPosLat="0.00" arrivalSpeed="15.15" duration="160.70" routeLength="1996.47" waitingTime="8.35" waitingCount="1" stopTime="0.00" timeLoss="33.16" rerouteNo="1" devices="tripinfo_car_w2n_151 routing_car_w2n_151" vType="Car" speedFactor="1.13" vaporized=""/>
    <tripinfo id="car_w2e_131" depart="131.00" departLane="w2sep_1" departPos="3.60" departPosLat="0.00" departSpeed="13.90" departDelay="0.00" arrival="312.35" arrivalLane="c2e_1" arrivalPos="990.00" arrivalPosLat="0.00" arrivalSpeed="13.90" duration="181.35" routeLength="1997.01" waitingTime="23.25" waitingCount="1" stopTime="0.00" timeLoss="37.68" rerouteNo="1" devices="tripinfo_car_w2e_131 routing_car_w2e_131" vType="Car" speedFactor="1.00" vaporized=""/>
    <tripinfo id="car_w2e_139" depart="139.00" departLane="w2sep_1" departPos="3.60" departPosLat="0.00" departSpeed="13.90" departDelay="0.00" arrival="316.30" arrivalLane="c2e_1" arrivalPos="990.00" arrivalPosLat="0.00" arrivalSpeed="13.88" duration="177.30" routeLength="1997.01" waitingTime="17.95" waitingCount="1" stopTime="0.00" timeLoss="33.60" rerouteNo="1" devices="tripinfo_car_w2e_139 routing_car_w2e_139" vType="Car" speedFactor="1.00" vaporized=""/>
    <tripinfo id="car_e2n_169" depart="169.00" departLane="e2sep_1" departPos="3.60" departPosLat="0.00" departSpeed="13.90" departDelay="0.00" arrival="317.05" arrivalLane="c2n_1" arrivalPos="990.00" arrivalPosLat="0.00" arrivalSpeed="13.97" duration="148.05" routeLength="1986.69" waitingTime="0.00" waitingCount="0" stopTime="0.00" timeLoss="5.13" rerouteNo="1" devices="tripinfo_car_e2n_169 routing_car_e2n_169" vType="Car" speedFactor="1.01" vaporized=""/>
    <tripinfo id="car_w2e_159" depart="159.00" departLane="w2sep_1" departPos="3.60" departPosLat="0.00" departSpeed="13.90" departDelay="0.00" arrival="318.25" arrivalLane="c2e_1" arrivalPos="990.00" arrivalPosLat="0.00" arrivalSpeed="14.98" duration="159.25" routeLength="1997.01" waitingTime="6.20" waitingCount="1" stopTime="0.00" timeLoss="30.90" rerouteNo="1" devices="tripinfo_car_w2e_159 routing_car_w2e_159" vType="Car" speedFactor="1.12" vaporized=""/>
    <tripinfo id="car_w2e_165" depart="165.00" departLane="w2sep_1" departPos="3.60" departPosLat="0.00" departSpeed="13.90" departDelay="0.00" arrival="320.10" arrivalLane="c2e_1" arrivalPos="990.00" arrivalPosLat="0.00" arrivalSpeed="15.52" duration="155.10" routeLength="1997.01" waitingTime="4.00" waitingCount="1" stopTime="0.00" timeLoss="33.17" rerouteNo="1" devices="tripinfo_car_w2e_165 routing_car_w2e_165" vType="Car" speedFactor="1.18" vaporized=""/>
    <tripinfo id="car_w2s_181" depart="181.00" departLane="w2sep_1" departPos="3.60" departPosLat="0.00" departSpeed="13.90" departDelay="0.00" arrival="325.55" arrivalLane="c2s_1" arrivalPos="990.00" arrivalPosLat="0.00" arrivalSpeed="14.21" duration="144.55" routeLength="1986.69" waitingTime="0.00" waitingCount="0" stopTime="0.00" timeLoss="3.97" rerouteNo="1" devices="tripinfo_car_w2s_181 routing_car_w2s_181" vType="Car" speedFactor="1.02" vaporized=""/>
    <tripinfo id="car_e2w_192" depart="192.00" departLane="e2sep_1" departPos="3.60" departPosLat="0.00" departSpeed="13.90" departDelay="0.00" arrival="328.30" arrivalLane="c2w_1" arrivalPos="990.00" arrivalPosLat="0.00" arrivalSpeed="14.67" duration="136.30" routeLength="1997.01" waitingTime="0.00" waitingCount="0" stopTime="0.00" timeLoss="0.18" rerouteNo="1" devices="tripinfo_car_e2w_192 routing_car_e2w_192" vType="Car" speedFactor="1.06" vaporized=""/>
    <tripinfo id="car_e2s_137" depart="137.00" departLane="e2sep_1" departPos="3.60" departPosLat="0.00" departSpeed="13.90" departDelay="0.00" arrival="331.15" arrivalLane="c2s_1" arrivalPos="990.00" arrivalPosLat="0.00" arrivalSpeed="13.94" duration="194.15" routeLength="1996.47" waitingTime="38.10" waitingCount="3" stopTime="0.00" timeLoss="50.26" rerouteNo="1" devices="tripinfo_car_e2s_137 routing_car_e2s_137" vType="Car" speedFactor="1.00" vaporized=""/>
    <tripinfo id="car_w2n_184" depart="184.00" departLane="w2sep_1" departPos="3.60" departPosLat="0.00" departSpeed="13.90" departDelay="0.00" arrival="333.95" arrivalLane="c2n_1" arrivalPos="990.00" arrivalPosLat="0.00" arrivalSpeed="14.22" duration="149.95" routeLength="1996.47" waitingTime="0.45" waitingCount="1" stopTime="0.00" timeLoss="8.86" rerouteNo="1" devices="tripinfo_car_w2n_184 routing_car_w2n_184" vType="Car" speedFactor="1.02" vaporized=""/>
    <tripinfo id="car_e2s_150" depart="150.00" departLane="e2sep_1" departPos="3.60" departPosLat="0.00" departSpeed="13.90" departDelay="0.00" arrival="334.45" arrivalLane="c2s_1" arrivalPos="990.00" arrivalPosLat="0.00" arrivalSpeed="14.18" duration="184.45" routeLength="1996.47" waitingTime="26.35" waitingCount="2" stopTime="0.00" timeLoss="43.42" rerouteNo="1" devices="tripinfo_car_e2s_150 routing_car_e2s_150" vType="Car" speedFactor="1.02" vaporized=""/>
    <tripinfo id="car_n2w_150" depart="150.00" departLane="n2sep_1" departPos="3.60" departPosLat="0.00" departSpeed="13.90" departDelay="0.00" arrival="337.20" arrivalLane="c2w_1" arrivalPos="990.00" arrivalPosLat="0.00" arrivalSpeed="15.88" duration="187.20" routeLength="1986.69" waitingTime="50.55" waitingCount="1" stopTime="0.00" timeLoss="61.43" rerouteNo="1" devices="tripinfo_car_n2w_150 routing_car_n2w_150" vType="Car" speedFactor="1.14" vaporized=""/>
    <tripinfo id="car_e2s_164" depart="164.00" departLane="e2sep_1" departPos="3.60" departPosLat="0.00" departSpeed="13.90" departDelay="0.00" arrival="338.10" arrivalLane="c2s_1" arrivalPos="990.00" arrivalPosLat="0.00" arrivalSpeed="13.88" duration="174.10" routeLength="1996.47" waitingTime="15.60" waitingCount="1" stopTime="0.00" timeLoss="29.78" rerouteNo="1" devices="tripinfo_car_e2s_164 routing_car_e2s_164" vType="Car" speedFactor="1.00" vaporized=""/>
    <tripinfo id="car_w2n_193" depart="193.00" departLane="w2sep_1" departPos="3.60" departPosLat="0.00" departSpeed="13.90" departDelay="0.00" arrival="338.25" arrivalLane="c2n_1" arrivalPos="990.00" arrivalPosLat="0.00" arrivalSpeed="14.34" duration="145.25" routeLength="1996.47" waitingTime="0.00" waitingCount="0" stopTime="0.00" timeLoss="5.49" rerouteNo="1" devices="tripinfo_car_w2n_193 routing_car_w2n_193" vType="Car" speedFactor="1.03" vaporized=""/>
    <tripinfo id="car_n2s_162" depart="162.00" departLane="n2sep_1" departPos="3.60" departPosLat="0.00" departSpeed="13.90" departDelay="0.00" arrival="346.95" arrivalLane="c2s_1" arrivalPos="990.00" arrivalPosLat="0.00" arrivalSpeed="14.12" duration="184.95" routeLength="1997.01" waitingTime="34.95" waitingCount="1" stopTime="0.00" timeLoss="43.48" rerouteNo="1" devices="tripinfo_car_n2s_162 routing_car_n2s_162" vType="Car" speedFactor="1.02" vaporized=""/>
    <tripinfo id="car_n2w_194" depart="194.00" departLane="n2sep_1" departPos="3.60" departPosLat="0.00" departSpeed="13.90" departDelay="0.00" arrival="348.10" arrivalLane="c2w_1" arrivalPos="990.00" arrivalPosLat="0.00" arrivalSpeed="15.32" duration="154.10" routeLength="1986.69" waitingTime="11.60" waitingCount="1" stopTime="0.00" timeLoss="23.75" rerouteNo="1" devices="tripinfo_car_n2w_194 routing_car_n2w_194" vType="Car" speedFactor="1.10" vaporized=""/>
    <tripinfo id="car_n2s_173" depart="173.00" departLane="n2sep_1" departPos="3.60" departPosLat="0.00" departSpeed="13.90" departDelay="0.00" arrival="348.85" arrivalLane="c2s_1" arrivalPos="990.00" arrivalPosLat="0.00" arrivalSpeed="15.55" duration="175.85" routeLength="1997.01" waitingTime="33.30" waitingCount="1" stopTime="0.00" timeLoss="53.23" rerouteNo="1" devices="tripinfo_car_n2s_173 routing_car_n2s_173" vType="Car" speedFactor="1.17" vaporized=""/>
    <tripinfo id="bus_s2e_169" depart="169.00" departLane="s2sep_1" departPos="12.10" departPosLat="0.00" departSpeed="13.90" departDelay="0.00" arrival="348.95" arrivalLane="c2e_1" arrivalPos="990.00" arrivalPosLat="0.00" arrivalSpeed="13.90" duration="179.95" routeLength="1978.19" waitingTime="26.30" waitingCount="1" stopTime="0.00" timeLoss="36.88" rerouteNo="1" devices="tripinfo_bus_s2e_169 routing_bus_s2e_169" vType="Bus" speedFactor="1.00" vaporized=""/>
    <tripinfo id="car_s2n_188" depart="188.00" departLane="s2sep_1" departPos="3.60" departPosLat="0.00" departSpeed="13.90" departDelay="0.00" arrival="350.30" arrivalLane="c2n_1" arrivalPos="990.00" arrivalPosLat="0.00" arrivalSpeed="13.90" duration="162.30" routeLength="1997.01" waitingTime="8.60" waitingCount="1" stopTime="0.00" timeLoss="18.60" rerouteNo="1" devices="tripinfo_car_s2n_188 routing_car_s2n_188" vType="Car" speedFactor="1.00" vaporized=""/>
    <tripinfo id="car_n2w_212" depart="212.40" departLane="n2sep_1" departPos="3.60" departPosLat="0.00" departSpeed="13.90" departDelay="0.40" arrival="351.55" arrivalLane="c2w_1" arrivalPos="990.00" arrivalPosLat="0.00" arrivalSpeed="15.90" duration="139.15" routeLength="1986.69" waitingTime="0.00" waitingCount="0" stopTime="0.00" timeLoss="14.00" rerouteNo="1" devices="tripinfo_car_n2w_212 routing_car_n2w_212" vType="Car" speedFactor="1.15" vaporized=""/>
    <tripinfo id="car_n2s_174" depart="174.25" departLane="n2sep_1" departPos="3.60" departPosLat="0.00" departSpeed="13.90" departDelay="0.25" arrival="352.35" arrivalLane="c2s_1" arrivalPos="990.00" arrivalPosLat="0.00" arrivalSpeed="14.42" duration="178.10" routeLength="1997.01" waitingTime="25.70" waitingCount="1" stopTime="0.00" timeLoss="39.93" rerouteNo="1" devices="tripinfo_car_n2s_174 routing_car_n2s_174" vType="Car" speedFactor="1.04" vaporized=""/>
    <tripinfo id="car_s2n_190" depart="190.00" departLane="s2sep_1" departPos="3.60" departPosLat="0.00" departSpeed="13.90" departDelay="0.00" arrival="353.90" arrivalLane="c2n_1" arrivalPos="990.00" arrivalPosLat="0.00" arrivalSpeed="14.14" duration="163.90" routeLength="1997.01" waitingTime="6.70" waitingCount="1" stopTime="0.00" timeLoss="22.98" rerouteNo="1" devices="tripinfo_car_s2n_190 routing_car_s2n_190" vType="Car" speedFactor="1.02" vaporized=""/>
    <tripinfo id="car_s2w_192" depart="192.00" departLane="s2sep_1" departPos="3.60" departPosLat="0.00" departSpeed="13.90" departDelay="0.00" arrival="354.35" arrivalLane="c2w_1" arrivalPos="990.00" arrivalPosLat="0.00" arrivalSpeed="16.25" duration="162.35" routeLength="1996.47" waitingTime="14.05" waitingCount="2" stopTime="0.00" timeLoss="40.02" rerouteNo="1" devices="tripinfo_car_s2w_192 routing_car_s2w_192" vType="Car" speedFactor="1.18" vaporized=""/>
    <tripinfo id="car_n2s_211" depart="211.00" departLane="n2sep_1" departPos="3.60" departPosLat="0.00" departSpeed="13.90" departDelay="0.00" arrival="356.00" arrivalLane="c2s_1" arrivalPos="990.00" arrivalPosLat="0.00" arrivalSpeed="14.29" duration="145.00" routeLength="1997.01" waitingTime="0.00" waitingCount="0" stopTime="0.00" timeLoss="5.55" rerouteNo="1" devices="tripinfo_car_n2s_211 routing_car_n2s_211" vType="Car" speedFactor="1.03" vaporized=""/>
    <tripinfo id="car_s2n_200" depart="200.00" departLane="s2sep_1" departPos="3.60" departPosLat="0.00" departSpeed="13.90" departDelay="0.00" arrival="356.80" arrivalLane="c2n_1" arrivalPos="990.00" arrivalPosLat="0.00" arrivalSpeed="14.30" duration="156.80" routeLength="1997.01" waitingTime="0.70" waitingCount="1" stopTime="0.00" timeLoss="17.92" rerouteNo="1" devices="tripinfo_car_s2n_200 routing_car_s2n_200" vType="Car" speedFactor="1.03" vaporized=""/>
    <tripinfo id="car_s2n_203" depart="203.00" departLane="s2sep_1" departPos="3.60" departPosLat="0.00" departSpeed="13.90" departDelay="0.00" arrival="360.35" arrivalLane="c2n_1" arrivalPos="990.00" arrivalPosLat="0.00" arrivalSpeed="13.87" duration="157.35" routeLength="1997.01" waitingTime="0.00" waitingCount="0" stopTime="0.00" timeLoss="13.65" rerouteNo="1" devices="tripinfo_car_s2n_203 routing_car_s2n_203" vType="Car" speedFactor="1.00" vaporized=""/>
    <tripinfo id="car_s2n_215" depart="215.00" departLane="s2sep_1" departPos="3.60" departPosLat="0.00" departSpeed="13.90" departDelay="0.00" arrival="363.45" arrivalLane="c2n_1" arrivalPos="990.00" arrivalPosLat="0.00" arrivalSpeed="13.87" duration="148.45" routeLength="1997.01" waitingTime="0.00" waitingCount="0" stopTime="0.00" timeLoss="5.00" rerouteNo="1" devices="tripinfo_car_s2n_215 routing_car_s2n_215" vType="Car" speedFactor="1.00" vaporized=""/>
    <tripinfo id="car_n2e_226" depart="226.00" departLane="n2sep_1" departPos="3.60" departPosLat="0.00" departSpeed="13.90" departDelay="0.00" arrival="370.65" arrivalLane="c2e_1" arrivalPos="990.00" arrivalPosLat="0.00" arrivalSpeed="14.21" duration="144.65" routeLength="1996.47" waitingTime="0.00" waitingCount="0" stopTime="0.00" timeLoss="3.42" rerouteNo="1" devices="tripinfo_car_n2e_226 routing_car_n2e_226" vType="Car" speedFactor="1.02" vaporized=""/>
    <tripinfo id="car_n2e_241" depart="241.00" departLane="n2sep_1" departPos="3.60" departPosLat="0.00" departSpeed="13.90" departDelay="0.00" arrival="377.50" arrivalLane="c2e_1" arrivalPos="990.00" arrivalPosLat="0.00" arrivalSpeed="15.16" duration="136.50" routeLength="1996.47" waitingTime="0.00" waitingCount="0" stopTime="0.00" timeLoss="4.20" rerouteNo="1" devices="tripinfo_car_n2e_241 routing_car_n2e_241" vType="Car" speedFactor="1.09" vaporized=""/>
    <tripinfo id="car_e2w_198" depart="198.00" departLane="e2sep_1" departPos="3.60" departPosLat="0.00" departSpeed="13.90" departDelay="0.00" arrival="387.20" arrivalLane="c2w_1" arrivalPos="990.00" arrivalPosLat="0.00" arrivalSpeed="15.11" duration="189.20" routeLength="1997.01" waitingTime="44.00" waitingCount="1" stopTime="0.00" timeLoss="57.03" rerouteNo="1" devices="tripinfo_car_e2w_198 routing_car_e2w_198" vType="Car" speedFactor="1.09" vaporized=""/>
    <tripinfo id="car_w2e_211" depart="211.00" departLane="w2sep_1" departPos="3.60" departPosLat="0.00" departSpeed="13.90" departDelay="0.00" arrival="389.70" arrivalLane="c2e_1" arrivalPos="990.00" arrivalPosLat="0.00" arrivalSpeed="14.13" duration="178.70" routeLength="1997.01" waitingTime="30.05" waitingCount="1" stopTime="0.00" timeLoss="37.40" rerouteNo="1" devices="tripinfo_car_w2e_211 routing_car_w2e_211" vType="Car" speedFactor="1.02" vaporized=""/>
    <tripinfo id="car_e2n_192" depart="193.35" departLane="e2sep_1" departPos="3.60" departPosLat="0.00" departSpeed="13.90" departDelay="1.35" arrival="390.65" arrivalLane="c2n_1" arrivalPos="990.00" arrivalPosLat="0.00" arrivalSpeed="13.90" duration="197.30" routeLength="1986.69" waitingTime="45.15" waitingCount="1" stopTime="0.00" timeLoss="53.62" rerouteNo="1" devices="tripinfo_car_e2n_192 routing_car_e2n_192" vType="Car" speedFactor="1.00" vaporized=""/>
    <tripinfo id="car_w2e_234" depart="234.00" departLane="w2sep_1" departPos="3.60" departPosLat="0.00" departSpeed="13.90" departDelay="0.00" arrival="392.20" arrivalLane="c2e_1" arrivalPos="990.00" arrivalPosLat="0.00" arrivalSpeed="14.97" duration="158.20" routeLength="1997.01" waitingTime="12.45" waitingCount="1" stopTime="0.00" timeLoss="26.60" rerouteNo="1" devices="tripinfo_car_w2e_234 routing_car_w2e_234" vType="Car" speedFactor="1.09" vaporized=""/>
    <tripinfo id="car_e2w_218" depart="218.00" departLane="e2sep_1" departPos="3.60" departPosLat="0.00" departSpeed="13.90" departDelay="0.00" arrival="394.80" arrivalLane="c2w_1" arrivalPos="990.00" arrivalPosLat="0.00" arrivalSpeed="14.49" duration="176.80" routeLength="1997.01" waitingTime="26.40" waitingCount="1" stopTime="0.00" timeLoss="39.01" rerouteNo="1" devices="tripinfo_car_e2w_218 routing_car_e2w_218" vType="Car" speedFactor="1.04" vaporized=""/>
    <tripinfo id="car_w2e_255" depart="255.00" departLane="w2sep_1" departPos="3.60" departPosLat="0.00" departSpeed="13.90" departDelay="0.00" arrival="395.00" arrivalLane="c2e_1" arrivalPos="990.00" arrivalPosLat="0.00" arrivalSpeed="14.80" duration="140.00" routeLength="1997.01" waitingTime="0.00" waitingCount="0" stopTime="0.00" timeLoss="6.05" rerouteNo="1" devices="tripinfo_car_w2e_255 routing_car_w2e_255" vType="Car" speedFactor="1.07" vaporized=""/>
    <tripinfo id="car_e2s_238" depart="238.40" departLane="e2sep_1" departPos="3.60" departPosLat="0.00" departSpeed="13.90" departDelay="0.40" arrival="395.80" arrivalLane="c2s_1" arrivalPos="990.00" arrivalPosLat="0.00" arrivalSpeed="14.50" duration="157.40" routeLength="1996.47" waitingTime="4.95" waitingCount="2" stopTime="0.00" timeLoss="19.09" rerouteNo="1" devices="tripinfo_car_e2s_238 routing_car_e2s_238" vType="Car" speedFactor="1.04" vaporized=""/>
    <tripinfo id="car_e2n_214" depart="214.00" departLane="e2sep_1" departPos="3.60" departPosLat="0.00" departSpeed="13.90" departDelay="0.00" arrival="396.25" arrivalLane="c2n_1" arrivalPos="990.00" arrivalPosLat="0.00" arrivalSpeed="13.90" duration="182.25" routeLength="1986.69" waitingTime="28.00" waitingCount="1" stopTime="0.00" timeLoss="38.58" rerouteNo="1" devices="tripinfo_car_e2n_214 routing_car_e2n_214" vType="Car" speedFactor="1.00" vaporized=""/>
    <tripinfo id="car_w2e_264" depart="264.00" departLane="w2sep_1" departPos="3.60" departPosLat="0.00" departSpeed="13.90" departDelay="0.00" arrival="400.15" arrivalLane="c2e_1" arrivalPos="990.00" arrivalPosLat="0.00" arrivalSpeed="14.80" duration="136.15" routeLength="1997.01" waitingTime="0.00" waitingCount="0" stopTime="0.00" timeLoss="1.19" rerouteNo="1" devices="tripinfo_car_w2e_264 routing_car_w2e_264" vType="Car" speedFactor="1.06" vaporized=""/>
    <tripinfo id="car_e2w_223" depart="223.00" departLane="e2sep_1" departPos="3.60" departPosLat="0.00" departSpeed="13.90" departDelay="0.00" arrival="400.35" arrivalLane="c2w_1" arrivalPos="990.00" arrivalPosLat="0.00" arrivalSpeed="14.00" duration="177.35" routeLength="1997.01" waitingTime="21.60" waitingCount="1" stopTime="0.00" timeLoss="34.66" rerouteNo="1" devices="tripinfo_car_e2w_223 routing_car_e2w_223" vType="Car" speedFactor="1.01" vaporized=""/>
    <tripinfo id="car_w2e_266" depart="266.00" departLane="w2sep_1" departPos="3.60" departPosLat="0.00" departSpeed="13.90" departDelay="0.00" arrival="402.30" arrivalLane="c2e_1" arrivalPos="990.00" arrivalPosLat="0.00" arrivalSpeed="15.81" duration="136.30" routeLength="1997.01" waitingTime="0.00" waitingCount="0" stopTime="0.00" timeLoss="13.36" rerouteNo="1" devices="tripinfo_car_w2e_266 routing_car_w2e_266" vType="Car" speedFactor="1.17" vaporized=""/>
    <tripinfo id="car_e2w_230" depart="230.00" departLane="e2sep_1" departPos="3.60" departPosLat="0.00" departSpeed="13.90" departDelay="0.00" arrival="403.80" arrivalLane="c2w_1" arrivalPos="990.00" arrivalPosLat="0.00" arrivalSpeed="14.10" duration="173.80" routeLength="1997.01" waitingTime="16.65" waitingCount="1" stopTime="0.00" timeLoss="32.49" rerouteNo="1" devices="tripinfo_car_e2w_230 routing_car_e2w_230" vType="Car" speedFactor="1.02" vaporized=""/>
    <tripinfo id="car_e2w_237" depart="237.00" departLane="e2sep_1" departPos="3.60" departPosLat="0.00" departSpeed="13.90" departDelay="0.00" arrival="406.55" arrivalLane="c2w_1" arrivalPos="990.00" arrivalPosLat="0.00" arrivalSpeed="14.31" duration="169.55" routeLength="1997.01" waitingTime="12.30" waitingCount="1" stopTime="0.00" timeLoss="31.11" rerouteNo="1" devices="tripinfo_car_e2w_237 routing_car_e2w_237" vType="Car" speedFactor="1.04" vaporized=""/>
    <tripinfo id="car_w2n_195" depart="195.00" departLane="w2sep_1" departPos="3.60" departPosLat="0.00" departSpeed="13.90" departDelay="0.00" arrival="406.95" arrivalLane="c2n_1" arrivalPos="990.00" arrivalPosLat="0.00" arrivalSpeed="14.00" duration="211.95" routeLength="1996.47" waitingTime="56.10" waitingCount="2" stopTime="0.00" timeLoss="68.68" rerouteNo="1" devices="tripinfo_car_w2n_195 routing_car_w2n_195" vType="Car" speedFactor="1.01" vaporized=""/>
    <tripinfo id="car_e2w_246" depart="246.00" departLane="e2sep_1" departPos="3.60" departPosLat="0.00" departSpeed="13.90" departDelay="0.00" arrival="408.55" arrivalLane="c2w_1" arrivalPos="990.00" arrivalPosLat="0.00" arrivalSpeed="15.06" duration="162.55" routeLength="1997.01" waitingTime="7.60" waitingCount="1" stopTime="0.00" timeLoss="34.45" rerouteNo="1" devices="tripinfo_car_e2w_246 routing_car_e2w_246" vType="Car" speedFactor="1.12" vaporized=""/>
    <tripinfo id="car_w2n_242" depart="242.00" departLane="w2sep_1" departPos="3.60" departPosLat="0.00" departSpeed="13.90" departDelay="0.00" arrival="409.85" arrivalLane="c2n_1" arrivalPos="990.00" arrivalPosLat="0.00" arrivalSpeed="14.59" duration="167.85" routeLength="1996.47" waitingTime="13.50" waitingCount="2" stopTime="0.00" timeLoss="31.26" rerouteNo="1" devices="tripinfo_car_w2n_242 routing_car_w2n_242" vType="Car" speedFactor="1.06" vaporized=""/>
    <tripinfo id="amb_w2e_300" depart="300.00" departLane="w2sep_1" departPos="6.60" departPosLat="0.00" departSpeed="13.90" departDelay="0.00" arrival="411.90" arrivalLane="c2e_1" arrivalPos="990.00" arrivalPosLat="-0.95" arrivalSpeed="20.83" duration="111.90" routeLength="1994.01" waitingTime="0.00" waitingCount="0" stopTime="0.00" timeLoss="16.25" rerouteNo="1" devices="tripinfo_amb_w2e_300 routing_amb_w2e_300 bluelight_amb_w2e_300 fcd_amb_w2e_300" vType="Ambulance" speedFactor="1.50" vaporized="">
        <example_device customValue1="0.00" customValue2="-1.00"/>
    </tripinfo>
    <tripinfo id="car_w2n_244" depart="244.00" departLane="w2sep_1" departPos="3.60" departPosLat="0.00" departSpeed="13.90" departDelay="0.00" arrival="412.25" arrivalLane="c2n_1" arrivalPos="990.00" arrivalPosLat="0.00" arrivalSpeed="14.90" duration="168.25" routeLength="1996.47" waitingTime="9.15" waitingCount="2" stopTime="0.00" timeLoss="35.60" rerouteNo="1" devices="tripinfo_car_w2n_244 routing_car_w2n_244" vType="Car" speedFactor="1.09" vaporized=""/>
    <tripinfo id="car_w2e_277" depart="277.00" departLane="w2sep_1" departPos="3.60" departPosLat="0.00" departSpeed="13.90" departDelay="0.00" arrival="413.80" arrivalLane="c2e_1" arrivalPos="990.00" arrivalPosLat="1.10" arrivalSpeed="15.24" duration="136.80" routeLength="1997.01" waitingTime="0.00" waitingCount="0" stopTime="0.00" timeLoss="5.77" rerouteNo="1" devices="tripinfo_car_w2e_277 routing_car_w2e_277" vType="Car@car_w2e_277" speedFactor="1.10" vaporized=""/>
    <tripinfo id="car_w2n_248" depart="248.00" departLane="w2sep_1" departPos="3.60" departPosLat="0.00" departSpeed="13.90" departDelay="0.00" arrival="414.60" arrivalLane="c2n_1" arrivalPos="990.00" arrivalPosLat="0.00" arrivalSpeed="15.00" duration="166.60" routeLength="1996.47" waitingTime="8.10" waitingCount="1" stopTime="0.00" timeLoss="35.04" rerouteNo="1" devices="tripinfo_car_w2n_248 routing_car_w2n_248" vType="Car" speedFactor="1.10" vaporized=""/>
    <tripinfo id="car_w2s_269" depart="269.00" departLane="w2sep_1" departPos="3.60" departPosLat="0.00" departSpeed="13.90" departDelay="0.00" arrival="414.85" arrivalLane="c2s_1" arrivalPos="990.00" arrivalPosLat="0.00" arrivalSpeed="14.13" duration="145.85" routeLength="1986.69" waitingTime="0.00" waitingCount="0" stopTime="0.00" timeLoss="4.54" rerouteNo="1" devices="tripinfo_car_w2s_269 routing_car_w2s_269" vType="Car" speedFactor="1.02" vaporized=""/>
    <tripinfo id="car_w2n_284" depart="284.00" departLane="w2sep_1" departPos="3.60" departPosLat="0.00" departSpeed="13.90" departDelay="0.00" arrival="416.55" arrivalLane="c2n_1" arrivalPos="990.00" arrivalPosLat="0.00" arrivalSpeed="15.72" duration="132.55" routeLength="1996.47" waitingTime="0.00" waitingCount="0" stopTime="0.00" timeLoss="9.92" rerouteNo="1" devices="tripinfo_car_w2n_284 routing_car_w2n_284" vType="Car" speedFactor="1.18" vaporized=""/>
    <tripinfo id="car_w2s_270" depart="270.50" departLane="w2sep_1" departPos="3.60" departPosLat="0.00" departSpeed="13.90" departDelay="0.50" arrival="417.30" arrivalLane="c2s_1" arrivalPos="990.00" arrivalPosLat="0.00" arrivalSpeed="15.04" duration="146.80" routeLength="1986.69" waitingTime="0.00" waitingCount="0" stopTime="0.00" timeLoss="16.00" rerouteNo="1" devices="tripinfo_car_w2s_270 routing_car_w2s_270" vType="Car" speedFactor="1.10" vaporized=""/>
    <tripinfo id="car_w2s_287" depart="287.00" departLane="w2sep_1" departPos="3.60" departPosLat="0.00" departSpeed="13.90" departDelay="0.00" arrival="434.05" arrivalLane="c2s_1" arrivalPos="990.00" arrivalPosLat="0.00" arrivalSpeed="13.94" duration="147.05" routeLength="1986.69" waitingTime="0.00" waitingCount="0" stopTime="0.00" timeLoss="3.84" rerouteNo="1" devices="tripinfo_car_w2s_287 routing_car_w2s_287" vType="Car" speedFactor="1.00" vaporized=""/>
    <tripinfo id="car_e2n_286" depart="286.00" departLane="e2sep_1" departPos="3.60" departPosLat="0.00" departSpeed="13.90" departDelay="0.00" arrival="436.55" arrivalLane="c2n_1" arrivalPos="990.00" arrivalPosLat="0.00" arrivalSpeed="13.96" duration="150.55" routeLength="1986.69" waitingTime="0.55" waitingCount="1" stopTime="0.00" timeLoss="7.50" rerouteNo="1" devices="tripinfo_car_e2n_286 routing_car_e2n_286" vType="Car" speedFactor="1.00" vaporized=""/>
    <tripinfo id="car_w2e_297" depart="297.00" departLane="w2sep_1" departPos="3.60" departPosLat="0.00" departSpeed="13.90" departDelay="0.00" arrival="437.90" arrivalLane="c2e_1" arrivalPos="990.00" arrivalPosLat="0.00" arrivalSpeed="14.23" duration="140.90" routeLength="1997.01" waitingTime="0.00" waitingCount="0" stopTime="0.00" timeLoss="0.49" rerouteNo="1" devices="tripinfo_car_w2e_297 routing_car_w2e_297" vType="Car" speedFactor="1.02" vaporized=""/>
    <tripinfo id="car_e2w_287" depart="287.45" departLane="e2sep_1" departPos="3.60" departPosLat="0.00" departSpeed="13.90" departDelay="0.45" arrival="438.75" arrivalLane="c2w_1" arrivalPos="990.00" arrivalPosLat="0.00" arrivalSpeed="13.90" duration="151.30" routeLength="1997.01" waitingTime="0.00" waitingCount="0" stopTime="0.00" timeLoss="7.61" rerouteNo="1" devices="tripinfo_car_e2w_287 routing_car_e2w_287" vType="Car" speedFactor="1.00" vaporized=""/>
    <tripinfo id="car_e2n_292" depart="292.00" departLane="e2sep_1" departPos="3.60" departPosLat="0.00" departSpeed="13.90" departDelay="0.00" arrival="438.85" arrivalLane="c2n_1" arrivalPos="990.00" arrivalPosLat="0.00" arrivalSpeed="15.03" duration="146.85" routeLength="1986.69" waitingTime="0.00" waitingCount="0" stopTime="0.00" timeLoss="16.62" rerouteNo="1" devices="tripinfo_car_e2n_292 routing_car_e2n_292" vType="Car" speedFactor="1.10" vaporized=""/>
    <tripinfo id="car_w2n_303" depart="303.00" departLane="w2sep_1" departPos="3.60" departPosLat="0.00" departSpeed="13.90" departDelay="0.00" arrival="447.20" arrivalLane="c2n_1" arrivalPos="990.00" arrivalPosLat="0.00" arrivalSpeed="14.35" duration="144.20" routeLength="1996.47" waitingTime="0.00" waitingCount="0" stopTime="0.00" timeLoss="4.39" rerouteNo="1" devices="tripinfo_car_w2n_303 routing_car_w2n_303" vType="Car" speedFactor="1.03" vaporized=""/>
    <tripinfo id="car_s2e_256" depart="256.00" departLane="s2sep_1" departPos="3.60" departPosLat="0.00" departSpeed="13.90" departDelay="0.00" arrival="452.95" arrivalLane="c2e_1" arrivalPos="990.00" arrivalPosLat="0.00" arrivalSpeed="14.09" duration="196.95" routeLength="1986.69" waitingTime="44.00" waitingCount="1" stopTime="0.00" timeLoss="55.25" rerouteNo="1" devices="tripinfo_car_s2e_256 routing_car_s2e_256" vType="Car" speedFactor="1.01" vaporized=""/>
    <tripinfo id="car_n2s_242" depart="242.30" departLane="n2sep_1" departPos="3.60" departPosLat="0.00" departSpeed="13.90" departDelay="0.30" arrival="453.25" arrivalLane="c2s_1" arrivalPos="990.00" arrivalPosLat="0.00" arrivalSpeed="14.04" duration="210.95" routeLength="1997.01" waitingTime="60.30" waitingCount="1" stopTime="0.00" timeLoss="68.68" rerouteNo="1" devices="tripinfo_car_n2s_242 routing_car_n2s_242" vType="Car" speedFactor="1.01" vaporized=""/>
    <tripinfo id="car_s2e_297" depart="297.00" departLane="s2sep_1" departPos="3.60" departPosLat="0.00" departSpeed="13.90" departDelay="0.00" arrival="455.90" arrivalLane="c2e_1" arrivalPos="990.00" arrivalPosLat="0.00" arrivalSpeed="14.66" duration="158.90" routeLength="1986.69" waitingTime="8.00" waitingCount="1" stopTime="0.00" timeLoss="23.47" rerouteNo="1" devices="tripinfo_car_s2e_297 routing_car_s2e_297" vType="Car" speedFactor="1.06" vaporized=""/>
    <tripinfo id="car_n2w_249" depart="249.40" departLane="n2sep_1" departPos="3.60" departPosLat="0.00" departSpeed="13.90" departDelay="0.40" arrival="456.20" arrivalLane="c2w_1" arrivalPos="990.00" arrivalPosLat="0.00" arrivalSpeed="13.90" duration="206.80" routeLength="1986.69" waitingTime="52.90" waitingCount="1" stopTime="0.00" timeLoss="63.13" rerouteNo="1" devices="tripinfo_car_n2w_249 routing_car_n2w_249" vType="Car" speedFactor="1.00" vaporized=""/>
    <tripinfo id="car_n2w_324" depart="324.00" departLane="n2sep_1" departPos="3.60" departPosLat="0.00" departSpeed="13.90" departDelay="0.00" arrival="457.90" arrivalLane="c2w_1" arrivalPos="990.00" arrivalPosLat="0.00" arrivalSpeed="15.72" duration="133.90" routeLength="1986.69" waitingTime="0.00" waitingCount="0" stopTime="0.00" timeLoss="16.70" rerouteNo="1" devices="tripinfo_car_n2w_324 routing_car_n2w_324" vType="Car" speedFactor="1.23" vaporized=""/>
    <tripinfo id="car_n2e_248" depart="248.00" departLane="n2sep_1" departPos="3.60" departPosLat="0.00" departSpeed="13.90" departDelay="0.00" arrival="458.80" arrivalLane="c2e_1" arrivalPos="990.00" arrivalPosLat="0.00" arrivalSpeed="14.71" duration="210.80" routeLength="1996.47" waitingTime="58.85" waitingCount="2" stopTime="0.00" timeLoss="75.31" rerouteNo="1" devices="tripinfo_car_n2e_248 routing_car_n2e_248" vType="Car" speedFactor="1.07" vaporized=""/>
    <tripinfo id="car_n2s_251" depart="251.20" departLane="n2sep_1" departPos="3.60" departPosLat="0.00" departSpeed="13.90" departDelay="0.20" arrival="459.00" arrivalLane="c2s_1" arrivalPos="990.00" arrivalPosLat="0.00" arrivalSpeed="13.90" duration="207.80" routeLength="1997.01" waitingTime="50.60" waitingCount="1" stopTime="0.00" timeLoss="64.13" rerouteNo="1" devices="tripinfo_car_n2s_251 routing_car_n2s_251" vType="Car" speedFactor="1.00" vaporized=""/>
    <tripinfo id="car_n2s_308" depart="308.00" departLane="n2sep_1" departPos="3.60" departPosLat="0.00" departSpeed="13.90" departDelay="0.00" arrival="462.65" arrivalLane="c2s_1" arrivalPos="990.00" arrivalPosLat="0.00" arrivalSpeed="13.99" duration="154.65" routeLength="1997.01" waitingTime="0.00" waitingCount="0" stopTime="0.00" timeLoss="12.17" rerouteNo="1" devices="tripinfo_car_n2s_308 routing_car_n2s_308" vType="Car" speedFactor="1.01" vaporized=""/>
    <tripinfo id="car_n2e_265" depart="265.00" departLane="n2sep_1" departPos="3.60" departPosLat="0.00" departSpeed="13.90" departDelay="0.00" arrival="463.95" arrivalLane="c2e_1" arrivalPos="990.00" arrivalPosLat="0.00" arrivalSpeed="13.90" duration="198.95" routeLength="1996.47" waitingTime="38.95" waitingCount="1" stopTime="0.00" timeLoss="54.62" rerouteNo="1" devices="tripinfo_car_n2e_265 routing_car_n2e_265" vType="Car" speedFactor="1.00" vaporized=""/>
    <tripinfo id="car_s2w_252" depart="252.00" departLane="s2sep_1" departPos="3.60" departPosLat="0.00" departSpeed="13.90" departDelay="0.00" arrival="466.20" arrivalLane="c2w_1" arrivalPos="990.00" arrivalPosLat="0.00" arrivalSpeed="13.90" duration="214.20" routeLength="1996.47" waitingTime="58.75" waitingCount="2" stopTime="0.00" timeLoss="69.85" rerouteNo="1" devices="tripinfo_car_s2w_252 routing_car_s2w_252" vType="Car" speedFactor="1.00" vaporized=""/>
    <tripinfo id="car_s2e_323" depart="323.00" departLane="s2sep_1" departPos="3.60" departPosLat="0.00" departSpeed="13.90" departDelay="0.00" arrival="467.25" arrivalLane="c2e_1" arrivalPos="990.00" arrivalPosLat="0.00" arrivalSpeed="14.37" duration="144.25" routeLength="1986.69" waitingTime="0.00" waitingCount="0" stopTime="0.00" timeLoss="5.77" rerouteNo="1" devices="tripinfo_car_s2e_323 routing_car_s2e_323" vType="Car" speedFactor="1.04" vaporized=""/>
    <tripinfo id="car_s2w_254" depart="254.00" departLane="s2sep_1" departPos="3.60" departPosLat="0.00" departSpeed="13.90" departDelay="0.00" arrival="470.40" arrivalLane="c2w_1" arrivalPos="990.00" arrivalPosLat="0.00" arrivalSpeed="13.89" duration="216.40" routeLength="1996.47" waitingTime="54.60" waitingCount="2" stopTime="0.00" timeLoss="72.09" rerouteNo="1" devices="tripinfo_car_s2w_254 routing_car_s2w_254" vType="Car" speedFactor="1.00" vaporized=""/>
</tripinfos>
