<?xml version="1.0" encoding="UTF-8"?>

<!-- generated on 2021-05-18 05:16:56 by Eclipse SUMO sumo Version 1.9.1
<configuration xmlns:xsi="http://www.w3.org/2001/XMLSchema-instance" xsi:noNamespaceSchemaLocation="http://sumo.dlr.de/xsd/sumoConfiguration.xsd">

    <input>
        <net-file value="sumofiles/junction.net.xml"/>
        <route-files value="sumofiles/junction_radius_19.rou.xml"/>
        <additional-files value="sumofiles/junction.det.xml"/>
    </input>

    <output>
        <tripinfo-output value="sumofiles/output/tripinfo_radius_19.xml"/>
    </output>

    <time>
        <begin value="0"/>
        <end value="10000"/>
        <step-length value="1.0"/>
    </time>

    <processing>
        <lateral-resolution value="0.5"/>
    </processing>

    <report>
        <no-warnings value="true"/>
        <error-log value="sumofiles/output/errorlog_radius_19.log"/>
        <no-step-log value="true"/>
    </report>

    <traci_server>
        <remote-port value="45933"/>
    </traci_server>

    <gui_only>
        <gui-settings-file value="sumofiles/junction-gui.settings.xml"/>
        <tracker-interval value="1"/>
    </gui_only>

</configuration>
-->

<tripinfos xmlns:xsi="http://www.w3.org/2001/XMLSchema-instance" xsi:noNamespaceSchemaLocation="http://sumo.dlr.de/xsd/tripinfo_file.xsd">
    <tripinfo id="car_w2e_3" depart="3.00" departLane="w2sep_1" departPos="3.60" departPosLat="0.00" departSpeed="13.90" departDelay="0.00" arrival="139.00" arrivalLane="c2e_1" arrivalPos="990.00" arrivalPosLat="0.00" arrivalSpeed="14.73" duration="136.00" routeLength="1997.01" waitingTime="0.00" waitingCount="0" stopTime="0.00" timeLoss="0.09" rerouteNo="1" devices="tripinfo_car_w2e_3 routing_car_w2e_3" vType="Car" speedFactor="1.06" vaporized=""/>
    <tripinfo id="car_e2s_3" depart="3.00" departLane="e2sep_1" departPos="3.60" departPosLat="0.00" departSpeed="13.90" departDelay="0.00" arrival="151.00" arrivalLane="c2s_1" arrivalPos="990.00" arrivalPosLat="0.00" arrivalSpeed="14.04" duration="148.00" routeLength="1996.47" waitingTime="0.00" waitingCount="0" stopTime="0.00" timeLoss="4.39" rerouteNo="1" devices="tripinfo_car_e2s_3 routing_car_e2s_3" vType="Car" speedFactor="1.01" vaporized=""/>
    <tripinfo id="car_w2n_9" depart="9.00" departLane="w2sep_1" departPos="3.60" departPosLat="0.00" departSpeed="13.90" departDelay="0.00" arrival="152.00" arrivalLane="c2n_1" arrivalPos="990.00" arrivalPosLat="0.00" arrivalSpeed="14.32" duration="143.00" routeLength="1996.47" waitingTime="0.00" waitingCount="0" stopTime="0.00" timeLoss="2.91" rerouteNo="1" devices="tripinfo_car_w2n_9 routing_car_w2n_9" vType="Car" speedFactor="1.03" vaporized=""/>
    <tripinfo id="car_s2e_7" depart="7.00" departLane="s2sep_1" departPos="3.60" departPosLat="0.00" departSpeed="13.90" departDelay="0.00" arrival="159.00" arrivalLane="c2e_1" arrivalPos="990.00" arrivalPosLat="0.00" arrivalSpeed="15.05" duration="152.00" routeLength="1986.69" waitingTime="9.00" waitingCount="1" stopTime="0.00" timeLoss="19.19" rerouteNo="1" devices="tripinfo_car_s2e_7 routing_car_s2e_7" vType="Car" speedFactor="1.08" vaporized=""/>
    <tripinfo id="car_n2w_2" depart="2.00" departLane="n2sep_1" departPos="3.60" departPosLat="0.00" departSpeed="13.90" departDelay="0.00" arrival="160.00" arrivalLane="c2w_1" arrivalPos="990.00" arrivalPosLat="0.00" arrivalSpeed="14.73" duration="158.00" routeLength="1986.69" waitingTime="12.00" waitingCount="1" stopTime="0.00" timeLoss="22.68" rerouteNo="1" devices="tripinfo_car_n2w_2 routing_car_n2w_2" vType="Car" speedFactor="1.06" vaporized=""/>
    <tripinfo id="car_s2n_11" depart="11.00" departLane="s2sep_1" departPos="3.60" departPosLat="0.00" departSpeed="13.90" departDelay="0.00" arrival="164.00" arrivalLane="c2n_1" arrivalPos="990.00" arrivalPosLat="0.00" arrivalSpeed="14.54" duration="153.00" routeLength="1997.01" waitingTime="4.00" waitingCount="1" stopTime="0.00" timeLoss="15.01" rerouteNo="1" devices="tripinfo_car_s2n_11 routing_car_s2n_11" vType="Car" speedFactor="1.05" vaporized=""/>
    <tripinfo id="car_n2e_12" depart="12.00" departLane="n2sep_1" departPos="3.60" departPosLat="0.00" departSpeed="13.90" departDelay="0.00" arrival="170.00" arrivalLane="c2e_1" arrivalPos="990.00" arrivalPosLat="0.00" arrivalSpeed="14.04" duration="158.00" routeLength="1996.47" waitingTime="0.00" waitingCount="0" stopTime="0.00" timeLoss="14.22" rerouteNo="1" devices="tripinfo_car_n2e_12 routing_car_n2e_12" vType="Car" speedFactor="1.01" vaporized=""/>
    <tripinfo id="car_s2n_36" depart="36.00" departLane="s2sep_1" departPos="3.60" departPosLat="0.00" departSpeed="13.90" departDelay="0.00" arrival="174.00" arrivalLane="c2n_1" arrivalPos="990.00" arrivalPosLat="0.00" arrivalSpeed="14.54" duration="138.00" routeLength="1997.01" waitingTime="0.00" waitingCount="0" stopTime="0.00" timeLoss="0.55" rerouteNo="1" devices="tripinfo_car_s2n_36 routing_car_s2n_36" vType="Car" speedFactor="1.05" vaporized=""/>
    <tripinfo id="car_s2e_36" depart="38.00" departLane="s2sep_1" departPos="3.60" departPosLat="0.00" departSpeed="13.90" departDelay="2.00" arrival="188.00" arrivalLane="c2e_1" arrivalPos="990.00" arrivalPosLat="0.00" arrivalSpeed="13.90" duration="150.00" routeLength="1986.69" waitingTime="0.00" waitingCount="0" stopTime="0.00" timeLoss="6.26" rerouteNo="1" devices="tripinfo_car_s2e_36 routing_car_s2e_36" vType="Car" speedFactor="1.00" vaporized=""/>
    <tripinfo id="car_s2n_43" depart="43.00" departLane="s2sep_1" departPos="3.60" departPosLat="0.00" departSpeed="13.90" departDelay="0.00" arrival="190.00" arrivalLane="c2n_1" arrivalPos="990.00" arrivalPosLat="0.00" arrivalSpeed="13.90" duration="147.00" routeLength="1997.01" waitingTime="0.00" waitingCount="0" stopTime="0.00" timeLoss="2.97" rerouteNo="1" devices="tripinfo_car_s2n_43 routing_car_s2n_43" vType="Car" speedFactor="1.00" vaporized=""/>
    <tripinfo id="car_s2n_44" depart="45.00" departLane="s2sep_1" departPos="3.60" departPosLat="0.00" departSpeed="13.90" departDelay="1.00" arrival="192.00" arrivalLane="c2n_1" arrivalPos="990.00" arrivalPosLat="0.00" arrivalSpeed="15.45" duration="147.00" routeLength="1997.01" waitingTime="0.00" waitingCount="0" stopTime="0.00" timeLoss="22.51" rerouteNo="1" devices="tripinfo_car_s2n_44 routing_car_s2n_44" vType="Car" speedFactor="1.16" vaporized=""/>
    <tripinfo id="car_n2e_41" depart="41.00" departLane="n2sep_1" departPos="3.60" departPosLat="0.00" departSpeed="13.90" departDelay="0.00" arrival="195.00" arrivalLane="c2e_1" arrivalPos="990.00" arrivalPosLat="0.00" arrivalSpeed="13.90" duration="154.00" routeLength="1996.47" waitingTime="0.00" waitingCount="0" stopTime="0.00" timeLoss="8.82" rerouteNo="1" devices="tripinfo_car_n2e_41 routing_car_n2e_41" vType="Car" speedFactor="1.00" vaporized=""/>
    <tripinfo id="car_w2e_17" depart="17.00" departLane="w2sep_1" departPos="3.60" departPosLat="0.00" departSpeed="13.90" departDelay="0.00" arrival="205.00" arrivalLane="c2e_1" arrivalPos="990.00" arrivalPosLat="0.00" arrivalSpeed="15.05" duration="188.00" routeLength="1997.01" waitingTime="44.00" waitingCount="1" stopTime="0.00" timeLoss="54.41" rerouteNo="1" devices="tripinfo_car_w2e_17 routing_car_w2e_17" vType="Car" speedFactor="1.08" vaporized=""/>
    <tripinfo id="car_e2w_9" depart="9.00" departLane="e2sep_1" departPos="3.60" departPosLat="0.00" departSpeed="13.90" departDelay="0.00" arrival="210.00" arrivalLane="c2w_1" arrivalPos="990.00" arrivalPosLat="0.00" arrivalSpeed="13.90" duration="201.00" routeLength="1997.01" waitingTime="47.00" waitingCount="1" stopTime="0.00" timeLoss="56.57" rerouteNo="1" devices="tripinfo_car_e2w_9 routing_car_e2w_9" vType="Car" speedFactor="1.00" vaporized=""/>
    <tripinfo id="car_w2s_21" depart="21.00" departLane="w2sep_1" departPos="3.60" departPosLat="0.00" departSpeed="13.90" departDelay="0.00" arrival="210.00" arrivalLane="c2s_1" arrivalPos="990.00" arrivalPosLat="0.00" arrivalSpeed="14.27" duration="189.00" routeLength="1986.69" waitingTime="38.00" waitingCount="1" stopTime="0.00" timeLoss="49.02" rerouteNo="1" devices="tripinfo_car_w2s_21 routing_car_w2s_21" vType="Car" speedFactor="1.03" vaporized=""/>
    <tripinfo id="car_w2e_23" depart="23.00" departLane="w2sep_1" departPos="3.60" departPosLat="0.00" departSpeed="13.90" departDelay="0.00" arrival="212.00" arrivalLane="c2e_1" arrivalPos="990.00" arrivalPosLat="0.00" arrivalSpeed="14.55" duration="189.00" routeLength="1997.01" waitingTime="36.00" waitingCount="1" stopTime="0.00" timeLoss="50.99" rerouteNo="1" devices="tripinfo_car_w2e_23 routing_car_w2e_23" vType="Car" speedFactor="1.05" vaporized=""/>
    <tripinfo id="car_e2w_17" depart="17.00" departLane="e2sep_1" departPos="3.60" departPosLat="0.00" departSpeed="13.90" departDelay="0.00" arrival="213.00" arrivalLane="c2w_1" arrivalPos="990.00" arrivalPosLat="0.00" arrivalSpeed="14.27" duration="196.00" routeLength="1997.01" waitingTime="42.00" waitingCount="1" stopTime="0.00" timeLoss="56.17" rerouteNo="1" devices="tripinfo_car_e2w_17 routing_car_e2w_17" vType="Car" speedFactor="1.03" vaporized=""/>
    <tripinfo id="car_w2e_33" depart="33.00" departLane="w2sep_1" departPos="3.60" departPosLat="0.00" departSpeed="13.90" departDelay="0.00" arrival="214.00" arrivalLane="c2e_1" arrivalPos="990.00" arrivalPosLat="0.00" arrivalSpeed="15.32" duration="181.00" routeLength="1997.01" waitingTime="34.00" waitingCount="1" stopTime="0.00" timeLoss="52.72" rerouteNo="1" devices="tripinfo_car_w2e_33 routing_car_w2e_33" vType="Car" speedFactor="1.12" vaporized=""/>
    <tripinfo id="car_e2w_72" depart="72.00" departLane="e2sep_1" departPos="3.60" departPosLat="0.00" departSpeed="13.90" departDelay="0.00" arrival="218.00" arrivalLane="c2w_1" arrivalPos="990.00" arrivalPosLat="0.00" arrivalSpeed="13.90" duration="146.00" routeLength="1997.01" waitingTime="0.00" waitingCount="0" stopTime="0.00" timeLoss="1.92" rerouteNo="1" devices="tripinfo_car_e2w_72 routing_car_e2w_72" vType="Car" speedFactor="1.00" vaporized=""/>
    <tripinfo id="car_w2e_36" depart="36.00" departLane="w2sep_1" departPos="3.60" departPosLat="0.00" departSpeed="13.90" departDelay="0.00" arrival="220.00" arrivalLane="c2e_1" arrivalPos="990.00" arrivalPosLat="0.00" arrivalSpeed="13.90" duration="184.00" routeLength="1997.01" waitingTime="25.00" waitingCount="1" stopTime="0.00" timeLoss="39.85" rerouteNo="1" devices="tripinfo_car_w2e_36 routing_car_w2e_36" vType="Car" speedFactor="1.00" vaporized=""/>
    <tripinfo id="car_w2s_64" depart="64.00" departLane="w2sep_1" departPos="3.60" departPosLat="0.00" departSpeed="13.90" departDelay="0.00" arrival="221.00" arrivalLane="c2s_1" arrivalPos="990.00" arrivalPosLat="0.00" arrivalSpeed="14.27" duration="157.00" routeLength="1986.69" waitingTime="0.00" waitingCount="0" stopTime="0.00" timeLoss="16.17" rerouteNo="1" devices="tripinfo_car_w2s_64 routing_car_w2s_64" vType="Car" speedFactor="1.03" vaporized=""/>
    <tripinfo id="car_e2n_72" depart="74.00" departLane="e2sep_1" departPos="3.60" departPosLat="0.00" departSpeed="13.90" departDelay="2.00" arrival="225.00" arrivalLane="c2n_1" arrivalPos="990.00" arrivalPosLat="0.00" arrivalSpeed="13.90" duration="151.00" routeLength="1986.69" waitingTime="0.00" waitingCount="0" stopTime="0.00" timeLoss="7.22" rerouteNo="1" devices="tripinfo_car_e2n_72 routing_car_e2n_72" vType="Car" speedFactor="1.00" vaporized=""/>
    <tripinfo id="car_w2e_91" depart="91.00" departLane="w2sep_1" departPos="3.60" departPosLat="0.00" departSpeed="13.90" departDelay="0.00" arrival="225.00" arrivalLane="c2e_1" arrivalPos="990.00" arrivalPosLat="0.00" arrivalSpeed="15.31" duration="134.00" routeLength="1997.01" waitingTime="0.00" waitingCount="0" stopTime="0.00" timeLoss="2.68" rerouteNo="1" devices="tripinfo_car_w2e_91 routing_car_w2e_91" vType="Car" speedFactor="1.10" vaporized=""/>
    <tripinfo id="car_w2s_75" depart="75.00" departLane="w2sep_1" departPos="3.60" departPosLat="0.00" departSpeed="13.90" departDelay="0.00" arrival="226.00" arrivalLane="c2s_1" arrivalPos="990.00" arrivalPosLat="0.00" arrivalSpeed="13.90" duration="151.00" routeLength="1986.69" waitingTime="0.00" waitingCount="0" stopTime="0.00" timeLoss="7.47" rerouteNo="1" devices="tripinfo_car_w2s_75 routing_car_w2s_75" vType="Car" speedFactor="1.00" vaporized=""/>
    <tripinfo id="car_w2e_94" depart="94.00" departLane="w2sep_1" departPos="3.60" departPosLat="0.00" departSpeed="13.90" departDelay="0.00" arrival="227.00" arrivalLane="c2e_1" arrivalPos="990.00" arrivalPosLat="0.00" arrivalSpeed="15.84" duration="133.00" routeLength="1997.01" waitingTime="0.00" waitingCount="0" stopTime="0.00" timeLoss="8.60" rerouteNo="1" devices="tripinfo_car_w2e_94 routing_car_w2e_94" vType="Car" speedFactor="1.16" vaporized=""/>
    <tripinfo id="car_e2s_19" depart="19.00" departLane="e2sep_1" departPos="3.60" departPosLat="0.00" departSpeed="13.90" departDelay="0.00" arrival="229.00" arrivalLane="c2s_1" arrivalPos="990.00" arrivalPosLat="0.00" arrivalSpeed="15.00" duration="210.00" routeLength="1996.47" waitingTime="54.00" waitingCount="2" stopTime="0.00" timeLoss="76.95" rerouteNo="1" devices="tripinfo_car_e2s_19 routing_car_e2s_19" vType="Car" speedFactor="1.09" vaporized=""/>
    <tripinfo id="car_e2w_87" depart="87.00" departLane="e2sep_1" departPos="3.60" departPosLat="0.00" departSpeed="13.90" departDelay="0.00" arrival="232.00" arrivalLane="c2w_1" arrivalPos="990.00" arrivalPosLat="0.00" arrivalSpeed="13.90" duration="145.00" routeLength="1997.01" waitingTime="0.00" waitingCount="0" stopTime="0.00" timeLoss="0.47" rerouteNo="1" devices="tripinfo_car_e2w_87 routing_car_e2w_87" vType="Car" speedFactor="1.00" vaporized=""/>
    <tripinfo id="car_w2n_83" depart="83.00" departLane="w2sep_1" departPos="3.60" departPosLat="0.00" departSpeed="13.90" departDelay="0.00" arrival="234.00" arrivalLane="c2n_1" arrivalPos="990.00" arrivalPosLat="0.00" arrivalSpeed="13.97" duration="151.00" routeLength="1996.47" waitingTime="0.00" waitingCount="0" stopTime="0.00" timeLoss="6.49" rerouteNo="1" devices="tripinfo_car_w2n_83 routing_car_w2n_83" vType="Car" speedFactor="1.01" vaporized=""/>
    <tripinfo id="car_w2n_89" depart="89.00" departLane="w2sep_1" departPos="3.60" departPosLat="0.00" departSpeed="13.90" departDelay="0.00" arrival="239.00" arrivalLane="c2n_1" arrivalPos="990.00" arrivalPosLat="0.00" arrivalSpeed="13.90" duration="150.00" routeLength="1996.47" waitingTime="0.00" waitingCount="0" stopTime="0.00" timeLoss="5.49" rerouteNo="1" devices="tripinfo_car_w2n_89 routing_car_w2n_89" vType="Car" speedFactor="1.00" vaporized=""/>
    <tripinfo id="bus_e2s_27" depart="27.00" departLane="e2sep_1" departPos="12.10" departPosLat="0.00" departSpeed="13.90" departDelay="0.00" arrival="246.00" arrivalLane="c2s_1" arrivalPos="990.00" arrivalPosLat="0.00" arrivalSpeed="13.90" duration="219.00" routeLength="1987.97" waitingTime="49.00" waitingCount="3" stopTime="0.00" timeLoss="74.38" rerouteNo="1" devices="tripinfo_bus_e2s_27 routing_bus_e2s_27" vType="Bus" speedFactor="1.00" vaporized=""/>
    <tripinfo id="car_s2w_89" depart="89.00" departLane="s2sep_1" departPos="3.60" departPosLat="0.00" departSpeed="13.90" departDelay="0.00" arrival="246.00" arrivalLane="c2w_1" arrivalPos="990.00" arrivalPosLat="0.00" arrivalSpeed="16.40" duration="157.00" routeLength="1996.47" waitingTime="21.00" waitingCount="1" stopTime="0.00" timeLoss="34.32" rerouteNo="1" devices="tripinfo_car_s2w_89 routing_car_s2w_89" vType="Car" speedFactor="1.18" vaporized=""/>
    <tripinfo id="car_s2n_77" depart="77.00" departLane="s2sep_1" departPos="3.60" departPosLat="0.00" departSpeed="13.90" departDelay="0.00" arrival="247.00" arrivalLane="c2n_1" arrivalPos="990.00" arrivalPosLat="0.00" arrivalSpeed="16.38" duration="170.00" routeLength="1997.01" waitingTime="35.00" waitingCount="1" stopTime="0.00" timeLoss="47.16" rerouteNo="1" devices="tripinfo_car_s2n_77 routing_car_s2n_77" vType="Car" speedFactor="1.18" vaporized=""/>
    <tripinfo id="car_s2e_62" depart="62.00" departLane="s2sep_1" departPos="3.60" departPosLat="0.00" departSpeed="13.90" departDelay="0.00" arrival="249.00" arrivalLane="c2e_1" arrivalPos="990.00" arrivalPosLat="0.00" arrivalSpeed="15.16" duration="187.00" routeLength="1986.69" waitingTime="44.00" waitingCount="1" stopTime="0.00" timeLoss="54.69" rerouteNo="1" devices="tripinfo_car_s2e_62 routing_car_s2e_62" vType="Car" speedFactor="1.09" vaporized=""/>
    <tripinfo id="car_e2s_48" depart="48.00" departLane="e2sep_1" departPos="3.60" departPosLat="0.00" departSpeed="13.90" departDelay="0.00" arrival="250.00" arrivalLane="c2s_1" arrivalPos="990.00" arrivalPosLat="0.00" arrivalSpeed="14.13" duration="202.00" routeLength="1996.47" waitingTime="30.00" waitingCount="3" stopTime="0.00" timeLoss="59.52" rerouteNo="1" devices="tripinfo_car_e2s_48 routing_car_e2s_48" vType="Car" speedFactor="1.02" vaporized=""/>
    <tripinfo id="car_s2n_82" depart="82.00" departLane="s2sep_1" departPos="3.60" departPosLat="0.00" departSpeed="13.90" departDelay="0.00" arrival="251.00" arrivalLane="c2n_1" arrivalPos="990.00" arrivalPosLat="0.00" arrivalSpeed="16.03" duration="169.00" routeLength="1997.01" waitingTime="30.00" waitingCount="1" stopTime="0.00" timeLoss="44.30" rerouteNo="1" devices="tripinfo_car_s2n_82 routing_car_s2n_82" vType="Car" speedFactor="1.15" vaporized=""/>
    <tripinfo id="car_e2s_51" depart="51.00" departLane="e2sep_1" departPos="3.60" departPosLat="0.00" departSpeed="13.90" departDelay="0.00" arrival="253.00" arrivalLane="c2s_1" arrivalPos="990.00" arrivalPosLat="0.00" arrivalSpeed="14.00" duration="202.00" routeLength="1996.47" waitingTime="27.00" waitingCount="3" stopTime="0.00" timeLoss="58.87" rerouteNo="1" devices="tripinfo_car_e2s_51 routing_car_e2s_51" vType="Car" speedFactor="1.01" vaporized=""/>
    <tripinfo id="car_e2s_66" depart="66.00" departLane="e2sep_1" departPos="3.60" departPosLat="0.00" departSpeed="13.90" departDelay="0.00" arrival="256.00" arrivalLane="c2s_1" arrivalPos="990.00" arrivalPosLat="0.00" arrivalSpeed="14.45" duration="190.00" routeLength="1996.47" waitingTime="17.00" waitingCount="2" stopTime="0.00" timeLoss="51.36" rerouteNo="1" devices="tripinfo_car_e2s_66 routing_car_e2s_66" vType="Car" speedFactor="1.05" vaporized=""/>
    <tripinfo id="car_s2e_87" depart="87.00" departLane="s2sep_1" departPos="3.60" departPosLat="0.00" departSpeed="13.90" departDelay="0.00" arrival="261.00" arrivalLane="c2e_1" arrivalPos="990.00" arrivalPosLat="0.00" arrivalSpeed="14.17" duration="174.00" routeLength="1986.69" waitingTime="19.00" waitingCount="1" stopTime="0.00" timeLoss="32.76" rerouteNo="1" devices="tripinfo_car_s2e_87 routing_car_s2e_87" vType="Car" speedFactor="1.02" vaporized=""/>
    <tripinfo id="car_s2e_119" depart="119.00" departLane="s2sep_1" departPos="3.60" departPosLat="0.00" departSpeed="13.90" departDelay="0.00" arrival="264.00" arrivalLane="c2e_1" arrivalPos="990.00" arrivalPosLat="0.00" arrivalSpeed="15.01" duration="145.00" routeLength="1986.69" waitingTime="0.00" waitingCount="0" stopTime="0.00" timeLoss="12.26" rerouteNo="1" devices="tripinfo_car_s2e_119 routing_car_s2e_119" vType="Car" speedFactor="1.09" vaporized=""/>
    <tripinfo id="car_n2e_86" depart="86.00" departLane="n2sep_1" departPos="3.60" departPosLat="0.00" departSpeed="13.90" departDelay="0.00" arrival="266.00" arrivalLane="c2e_1" arrivalPos="990.00" arrivalPosLat="0.00" arrivalSpeed="15.75" duration="180.00" routeLength="1996.47" waitingTime="29.00" waitingCount="2" stopTime="0.00" timeLoss="56.14" rerouteNo="1" devices="tripinfo_car_n2e_86 routing_car_n2e_86" vType="Car" speedFactor="1.17" vaporized=""/>
    <tripinfo id="car_n2e_98" depart="98.00" departLane="n2sep_1" departPos="3.60" departPosLat="0.00" departSpeed="13.90" departDelay="0.00" arrival="270.00" arrivalLane="c2e_1" arrivalPos="990.00" arrivalPosLat="0.00" arrivalSpeed="14.31" duration="172.00" routeLength="1996.47" waitingTime="10.00" waitingCount="2" stopTime="0.00" timeLoss="31.27" rerouteNo="1" devices="tripinfo_car_n2e_98 routing_car_n2e_98" vType="Car" speedFactor="1.03" vaporized=""/>
    <tripinfo id="car_n2e_101" depart="101.00" departLane="n2sep_1" departPos="3.60" departPosLat="0.00" departSpeed="13.90" departDelay="0.00" arrival="274.00" arrivalLane="c2e_1" arrivalPos="990.00" arrivalPosLat="0.00" arrivalSpeed="14.14" duration="173.00" routeLength="1996.47" waitingTime="7.00" waitingCount="2" stopTime="0.00" timeLoss="30.56" rerouteNo="1" devices="tripinfo_car_n2e_101 routing_car_n2e_101" vType="Car" speedFactor="1.02" vaporized=""/>
    <tripinfo id="car_n2s_130" depart="130.00" departLane="n2sep_1" departPos="3.60" departPosLat="0.00" departSpeed="13.90" departDelay="0.00" arrival="274.00" arrivalLane="c2s_1" arrivalPos="990.00" arrivalPosLat="0.00" arrivalSpeed="13.90" duration="144.00" routeLength="1997.01" waitingTime="0.00" waitingCount="0" stopTime="0.00" timeLoss="0.17" rerouteNo="1" devices="tripinfo_car_n2s_130 routing_car_n2s_130" vType="Car" speedFactor="1.00" vaporized=""/>
    <tripinfo id="car_s2n_141" depart="141.00" departLane="s2sep_1" departPos="3.60" departPosLat="0.00" departSpeed="13.90" departDelay="0.00" arrival="276.00" arrivalLane="c2n_1" arrivalPos="990.00" arrivalPosLat="0.00" arrivalSpeed="15.23" duration="135.00" routeLength="1997.01" waitingTime="0.00" waitingCount="0" stopTime="0.00" timeLoss="3.26" rerouteNo="1" devices="tripinfo_car_s2n_141 routing_car_s2n_141" vType="Car" speedFactor="1.10" vaporized=""/>
    <tripinfo id="car_s2e_131" depart="131.00" departLane="s2sep_1" departPos="3.60" departPosLat="0.00" departSpeed="13.90" departDelay="0.00" arrival="281.00" arrivalLane="c2e_1" arrivalPos="990.00" arrivalPosLat="0.00" arrivalSpeed="13.90" duration="150.00" routeLength="1986.69" waitingTime="0.00" waitingCount="0" stopTime="0.00" timeLoss="5.47" rerouteNo="1" devices="tripinfo_car_s2e_131 routing_car_s2e_131" vType="Car" speedFactor="1.00" vaporized=""/>
    <tripinfo id="car_n2e_134" depart="134.00" departLane="n2sep_1" departPos="3.60" departPosLat="0.00" departSpeed="13.90" departDelay="0.00" arrival="283.00" arrivalLane="c2e_1" arrivalPos="990.00" arrivalPosLat="0.00" arrivalSpeed="15.53" duration="149.00" routeLength="1996.47" waitingTime="5.00" waitingCount="1" stopTime="0.00" timeLoss="24.65" rerouteNo="1" devices="tripinfo_car_n2e_134 routing_car_n2e_134" vType="Car" speedFactor="1.17" vaporized=""/>
    <tripinfo id="car_w2s_102" depart="102.00" departLane="w2sep_1" departPos="3.60" departPosLat="0.00" departSpeed="13.90" departDelay="0.00" arrival="294.00" arrivalLane="c2s_1" arrivalPos="990.00" arrivalPosLat="0.00" arrivalSpeed="15.18" duration="192.00" routeLength="1986.69" waitingTime="49.00" waitingCount="1" stopTime="0.00" timeLoss="59.78" rerouteNo="1" devices="tripinfo_car_w2s_102 routing_car_w2s_102" vType="Car" speedFactor="1.09" vaporized=""/>
    <tripinfo id="car_s2w_147" depart="147.00" departLane="s2sep_1" departPos="3.60" departPosLat="0.00" departSpeed="13.90" departDelay="0.00" arrival="294.00" arrivalLane="c2w_1" arrivalPos="990.00" arrivalPosLat="0.00" arrivalSpeed="13.94" duration="147.00" routeLength="1996.47" waitingTime="0.00" waitingCount="0" stopTime="0.00" timeLoss="2.37" rerouteNo="1" devices="tripinfo_car_s2w_147 routing_car_s2w_147" vType="Car" speedFactor="1.00" vaporized=""/>
    <tripinfo id="car_e2w_139" depart="139.00" departLane="e2sep_1" departPos="3.60" departPosLat="0.00" departSpeed="13.90" departDelay="0.00" arrival="299.00" arrivalLane="c2w_1" arrivalPos="990.00" arrivalPosLat="0.00" arrivalSpeed="14.13" duration="160.00" routeLength="1997.01" waitingTime="8.00" waitingCount="1" stopTime="0.00" timeLoss="18.55" rerouteNo="1" devices="tripinfo_car_e2w_139 routing_car_e2w_139" vType="Car" speedFactor="1.02" vaporized=""/>
    <tripinfo id="car_w2s_118" depart="118.00" departLane="w2sep_1" departPos="3.60" departPosLat="0.00" departSpeed="13.90" departDelay="0.00" arrival="301.00" arrivalLane="c2s_1" arrivalPos="990.00" arrivalPosLat="0.00" arrivalSpeed="14.42" duration="183.00" routeLength="1986.69" waitingTime="32.00" waitingCount="1" stopTime="0.00" timeLoss="43.71" rerouteNo="1" devices="tripinfo_car_w2s_118 routing_car_w2s_118" vType="Car" speedFactor="1.04" vaporized=""/>
    <tripinfo id="car_w2n_121" depart="122.00" departLane="w2sep_1" departPos="3.60" departPosLat="0.00" departSpeed="13.90" departDelay="1.00" arrival="301.00" arrivalLane="c2n_1" arrivalPos="990.00" arrivalPosLat="0.00" arrivalSpeed="14.04" duration="179.00" routeLength="1996.47" waitingTime="24.00" waitingCount="1" stopTime="0.00" timeLoss="35.58" rerouteNo="1" devices="tripinfo_car_w2n_121 routing_car_w2n_121" vType="Car" speedFactor="1.01" vaporized=""/>
    <tripinfo id="car_w2s_119" depart="120.00" departLane="w2sep_1" departPos="3.60" departPosLat="0.00" departSpeed="13.90" departDelay="1.00" arrival="305.00" arrivalLane="c2s_1" arrivalPos="990.00" arrivalPosLat="0.00" arrivalSpeed="14.49" duration="185.00" routeLength="1986.69" waitingTime="29.00" waitingCount="1" stopTime="0.00" timeLoss="46.50" rerouteNo="1" devices="tripinfo_car_w2s_119 routing_car_w2s_119" vType="Car" speedFactor="1.04" vaporized=""/>
    <tripinfo id="car_e2n_169" depart="169.00" departLane="e2sep_1" departPos="3.60" departPosLat="0.00" departSpeed="13.90" departDelay="0.00" arrival="305.00" arrivalLane="c2n_1" arrivalPos="990.00" arrivalPosLat="0.00" arrivalSpeed="15.53" duration="136.00" routeLength="1986.69" waitingTime="0.00" waitingCount="0" stopTime="0.00" timeLoss="6.87" rerouteNo="1" devices="tripinfo_car_e2n_169 routing_car_e2n_169" vType="Car" speedFactor="1.12" vaporized=""/>
    <tripinfo id="car_w2s_131" depart="131.00" departLane="w2sep_1" departPos="3.60" departPosLat="0.00" departSpeed="13.90" departDelay="0.00" arrival="310.00" arrivalLane="c2s_1" arrivalPos="990.00" arrivalPosLat="0.00" arrivalSpeed="13.90" duration="179.00" routeLength="1986.69" waitingTime="19.00" waitingCount="1" stopTime="0.00" timeLoss="34.81" rerouteNo="1" devices="tripinfo_car_w2s_131 routing_car_w2s_131" vType="Car" speedFactor="1.00" vaporized=""/>
    <tripinfo id="car_w2e_148" depart="148.00" departLane="w2sep_1" departPos="3.60" departPosLat="0.00" departSpeed="13.90" departDelay="0.00" arrival="310.00" arrivalLane="c2e_1" arrivalPos="990.00" arrivalPosLat="0.00" arrivalSpeed="13.90" duration="162.00" routeLength="1997.01" waitingTime="3.00" waitingCount="1" stopTime="0.00" timeLoss="18.26" rerouteNo="1" devices="tripinfo_car_w2e_148 routing_car_w2e_148" vType="Car" speedFactor="1.00" vaporized=""/>
    <tripinfo id="car_e2s_68" depart="68.00" departLane="e2sep_1" departPos="3.60" departPosLat="0.00" departSpeed="13.90" departDelay="0.00" arrival="312.00" arrivalLane="c2s_1" arrivalPos="990.00" arrivalPosLat="0.00" arrivalSpeed="15.12" duration="244.00" routeLength="1996.47" waitingTime="65.00" waitingCount="4" stopTime="0.00" timeLoss="114.89" rerouteNo="1" devices="tripinfo_car_e2s_68 routing_car_e2s_68" vType="Car" speedFactor="1.12" vaporized=""/>
    <tripinfo id="car_w2n_162" depart="162.00" departLane="w2sep_1" departPos="3.60" departPosLat="0.00" departSpeed="13.90" departDelay="0.00" arrival="313.00" arrivalLane="c2n_1" arrivalPos="990.00" arrivalPosLat="0.00" arrivalSpeed="14.23" duration="151.00" routeLength="1996.47" waitingTime="0.00" waitingCount="0" stopTime="0.00" timeLoss="9.17" rerouteNo="1" devices="tripinfo_car_w2n_162 routing_car_w2n_162" vType="Car" speedFactor="1.02" vaporized=""/>
    <tripinfo id="car_e2s_72" depart="76.00" departLane="e2sep_1" departPos="3.60" departPosLat="0.00" departSpeed="13.90" departDelay="4.00" arrival="314.00" arrivalLane="c2s_1" arrivalPos="990.00" arrivalPosLat="0.00" arrivalSpeed="15.25" duration="238.00" routeLength="1996.47" waitingTime="64.00" waitingCount="4" stopTime="0.00" timeLoss="110.00" rerouteNo="1" devices="tripinfo_car_e2s_72 routing_car_e2s_72" vType="Car" speedFactor="1.13" vaporized=""/>
    <tripinfo id="car_e2w_172" depart="172.00" departLane="e2sep_1" departPos="3.60" departPosLat="0.00" departSpeed="13.90" departDelay="0.00" arrival="315.00" arrivalLane="c2w_1" arrivalPos="990.00" arrivalPosLat="0.00" arrivalSpeed="14.12" duration="143.00" routeLength="1997.01" waitingTime="0.00" waitingCount="0" stopTime="0.00" timeLoss="1.25" rerouteNo="1" devices="tripinfo_car_e2w_172 routing_car_e2w_172" vType="Car" speedFactor="1.02" vaporized=""/>
    <tripinfo id="car_e2s_126" depart="126.00" departLane="e2sep_1" departPos="3.60" departPosLat="0.00" departSpeed="13.90" departDelay="0.00" arrival="319.00" arrivalLane="c2s_1" arrivalPos="990.00" arrivalPosLat="0.00" arrivalSpeed="13.90" duration="193.00" routeLength="1996.47" waitingTime="29.00" waitingCount="2" stopTime="0.00" timeLoss="48.24" rerouteNo="1" devices="tripinfo_car_e2s_126 routing_car_e2s_126" vType="Car" speedFactor="1.00" vaporized=""/>
    <tripinfo id="car_e2s_179" depart="179.00" departLane="e2sep_1" departPos="3.60" departPosLat="0.00" departSpeed="13.90" departDelay="0.00" arrival="321.00" arrivalLane="c2s_1" arrivalPos="990.00" arrivalPosLat="0.00" arrivalSpeed="15.59" duration="142.00" routeLength="1996.47" waitingTime="0.00" waitingCount="0" stopTime="0.00" timeLoss="18.89" rerouteNo="1" devices="tripinfo_car_e2s_179 routing_car_e2s_179" vType="Car" speedFactor="1.18" vaporized=""/>
    <tripinfo id="car_n2w_158" depart="158.00" departLane="n2sep_1" departPos="3.60" departPosLat="0.00" departSpeed="13.90" departDelay="0.00" arrival="336.00" arrivalLane="c2w_1" arrivalPos="990.00" arrivalPosLat="0.00" arrivalSpeed="15.88" duration="178.00" routeLength="1986.69" waitingTime="41.00" waitingCount="1" stopTime="0.00" timeLoss="51.79" rerouteNo="1" devices="tripinfo_car_n2w_158 routing_car_n2w_158" vType="Car" speedFactor="1.14" vaporized=""/>
    <tripinfo id="car_s2e_167" depart="169.00" departLane="s2sep_1" departPos="3.60" departPosLat="0.00" departSpeed="13.90" departDelay="2.00" arrival="339.00" arrivalLane="c2e_1" arrivalPos="990.00" arrivalPosLat="0.00" arrivalSpeed="15.05" duration="170.00" routeLength="1986.69" waitingTime="26.00" waitingCount="1" stopTime="0.00" timeLoss="37.15" rerouteNo="1" devices="tripinfo_car_s2e_167 routing_car_s2e_167" vType="Car" speedFactor="1.08" vaporized=""/>
    <tripinfo id="car_s2e_185" depart="185.00" departLane="s2sep_1" departPos="3.60" departPosLat="0.00" departSpeed="13.90" departDelay="0.00" arrival="346.00" arrivalLane="c2e_1" arrivalPos="990.00" arrivalPosLat="0.00" arrivalSpeed="14.45" duration="161.00" routeLength="1986.69" waitingTime="9.00" waitingCount="1" stopTime="0.00" timeLoss="21.98" rerouteNo="1" devices="tripinfo_car_s2e_185 routing_car_s2e_185" vType="Car" speedFactor="1.04" vaporized=""/>
    <tripinfo id="car_n2s_179" depart="179.00" departLane="n2sep_1" departPos="3.60" departPosLat="0.00" departSpeed="13.90" departDelay="0.00" arrival="347.00" arrivalLane="c2s_1" arrivalPos="990.00" arrivalPosLat="0.00" arrivalSpeed="13.90" duration="168.00" routeLength="1997.01" waitingTime="13.00" waitingCount="1" stopTime="0.00" timeLoss="23.66" rerouteNo="1" devices="tripinfo_car_n2s_179 routing_car_n2s_179" vType="Car" speedFactor="1.00" vaporized=""/>
    <tripinfo id="car_s2n_193" depart="193.00" departLane="s2sep_1" departPos="3.60" departPosLat="0.00" departSpeed="13.90" departDelay="0.00" arrival="348.00" arrivalLane="c2n_1" arrivalPos="990.00" arrivalPosLat="0.00" arrivalSpeed="14.22" duration="155.00" routeLength="1997.01" waitingTime="2.00" waitingCount="1" stopTime="0.00" timeLoss="13.77" rerouteNo="1" devices="tripinfo_car_s2n_193 routing_car_s2n_193" vType="Car" speedFactor="1.02" vaporized=""/>
    <tripinfo id="car_s2e_209" depart="209.00" departLane="s2sep_1" departPos="3.60" departPosLat="0.00" departSpeed="13.90" departDelay="0.00" arrival="349.00" arrivalLane="c2e_1" arrivalPos="990.00" arrivalPosLat="0.00" arrivalSpeed="15.06" duration="140.00" routeLength="1986.69" waitingTime="0.00" waitingCount="0" stopTime="0.00" timeLoss="7.58" rerouteNo="1" devices="tripinfo_car_s2e_209 routing_car_s2e_209" vType="Car" speedFactor="1.09" vaporized=""/>
    <tripinfo id="car_n2s_197" depart="197.00" departLane="n2sep_1" departPos="3.60" departPosLat="0.00" departSpeed="13.90" departDelay="0.00" arrival="350.00" arrivalLane="c2s_1" arrivalPos="990.00" arrivalPosLat="0.00" arrivalSpeed="14.14" duration="153.00" routeLength="1997.01" waitingTime="0.00" waitingCount="0" stopTime="0.00" timeLoss="12.10" rerouteNo="1" devices="tripinfo_car_n2s_197 routing_car_n2s_197" vType="Car" speedFactor="1.02" vaporized=""/>
    <tripinfo id="car_n2w_199" depart="199.00" departLane="n2sep_1" departPos="3.60" departPosLat="0.00" departSpeed="13.90" departDelay="0.00" arrival="352.00" arrivalLane="c2w_1" arrivalPos="990.00" arrivalPosLat="0.00" arrivalSpeed="13.90" duration="153.00" routeLength="1986.69" waitingTime="0.00" waitingCount="0" stopTime="0.00" timeLoss="9.31" rerouteNo="1" devices="tripinfo_car_n2w_199 routing_car_n2w_199" vType="Car" speedFactor="1.00" vaporized=""/>
    <tripinfo id="car_s2w_167" depart="167.00" departLane="s2sep_1" departPos="3.60" departPosLat="0.00" departSpeed="13.90" departDelay="0.00" arrival="354.00" arrivalLane="c2w_1" arrivalPos="990.00" arrivalPosLat="0.00" arrivalSpeed="15.23" duration="187.00" routeLength="1996.47" waitingTime="35.00" waitingCount="2" stopTime="0.00" timeLoss="59.38" rerouteNo="1" devices="tripinfo_car_s2w_167 routing_car_s2w_167" vType="Car" speedFactor="1.13" vaporized=""/>
    <tripinfo id="car_n2e_153" depart="153.00" departLane="n2sep_1" departPos="3.60" departPosLat="0.00" departSpeed="13.90" departDelay="0.00" arrival="356.00" arrivalLane="c2e_1" arrivalPos="990.00" arrivalPosLat="0.00" arrivalSpeed="13.90" duration="203.00" routeLength="1996.47" waitingTime="41.00" waitingCount="2" stopTime="0.00" timeLoss="58.81" rerouteNo="1" devices="tripinfo_car_n2e_153 routing_car_n2e_153" vType="Car" speedFactor="1.00" vaporized=""/>
    <tripinfo id="car_n2e_181" depart="181.00" departLane="n2sep_1" departPos="3.60" departPosLat="0.00" departSpeed="13.90" departDelay="0.00" arrival="358.00" arrivalLane="c2e_1" arrivalPos="990.00" arrivalPosLat="0.00" arrivalSpeed="15.41" duration="177.00" routeLength="1996.47" waitingTime="21.00" waitingCount="2" stopTime="0.00" timeLoss="51.83" rerouteNo="1" devices="tripinfo_car_n2e_181 routing_car_n2e_181" vType="Car" speedFactor="1.15" vaporized=""/>
    <tripinfo id="car_n2s_212" depart="212.00" departLane="n2sep_1" departPos="3.60" departPosLat="0.00" departSpeed="13.90" departDelay="0.00" arrival="358.00" arrivalLane="c2s_1" arrivalPos="990.00" arrivalPosLat="0.00" arrivalSpeed="13.90" duration="146.00" routeLength="1997.01" waitingTime="0.00" waitingCount="0" stopTime="0.00" timeLoss="1.64" rerouteNo="1" devices="tripinfo_car_n2s_212 routing_car_n2s_212" vType="Car" speedFactor="1.00" vaporized=""/>
    <tripinfo id="car_n2s_215" depart="215.00" departLane="n2sep_1" departPos="3.60" departPosLat="0.00" departSpeed="13.90" departDelay="0.00" arrival="362.00" arrivalLane="c2s_1" arrivalPos="990.00" arrivalPosLat="0.00" arrivalSpeed="14.12" duration="147.00" routeLength="1997.01" waitingTime="0.00" waitingCount="0" stopTime="0.00" timeLoss="4.83" rerouteNo="1" devices="tripinfo_car_n2s_215 routing_car_n2s_215" vType="Car" speedFactor="1.02" vaporized=""/>
    <tripinfo id="car_n2s_217" depart="217.00" departLane="n2sep_1" departPos="3.60" departPosLat="0.00" departSpeed="13.90" departDelay="0.00" arrival="366.00" arrivalLane="c2s_1" arrivalPos="990.00" arrivalPosLat="0.00" arrivalSpeed="13.89" duration="149.00" routeLength="1997.01" waitingTime="0.00" waitingCount="0" stopTime="0.00" timeLoss="4.86" rerouteNo="1" devices="tripinfo_car_n2s_217 routing_car_n2s_217" vType="Car" speedFactor="1.00" vaporized=""/>
    <tripinfo id="car_s2e_223" depart="223.00" departLane="s2sep_1" departPos="3.60" departPosLat="0.00" departSpeed="13.90" departDelay="0.00" arrival="369.00" arrivalLane="c2e_1" arrivalPos="990.00" arrivalPosLat="0.00" arrivalSpeed="14.21" duration="146.00" routeLength="1986.69" waitingTime="0.00" waitingCount="0" stopTime="0.00" timeLoss="4.89" rerouteNo="1" devices="tripinfo_car_s2e_223 routing_car_s2e_223" vType="Car" speedFactor="1.02" vaporized=""/>
    <tripinfo id="car_n2w_224" depart="224.00" departLane="n2sep_1" departPos="3.60" departPosLat="0.00" departSpeed="13.90" departDelay="0.00" arrival="372.00" arrivalLane="c2w_1" arrivalPos="990.00" arrivalPosLat="0.00" arrivalSpeed="14.13" duration="148.00" routeLength="1986.69" waitingTime="0.00" waitingCount="0" stopTime="0.00" timeLoss="6.25" rerouteNo="1" devices="tripinfo_car_n2w_224 routing_car_n2w_224" vType="Car" speedFactor="1.02" vaporized=""/>
    <tripinfo id="car_s2e_226" depart="227.00" departLane="s2sep_1" departPos="3.60" departPosLat="0.00" departSpeed="13.90" departDelay="1.00" arrival="374.00" arrivalLane="c2e_1" arrivalPos="990.00" arrivalPosLat="0.00" arrivalSpeed="14.50" duration="147.00" routeLength="1986.69" waitingTime="0.00" waitingCount="0" stopTime="0.00" timeLoss="8.27" rerouteNo="1" devices="tripinfo_car_s2e_226 routing_car_s2e_226" vType="Car" speedFactor="1.04" vaporized=""/>
    <tripinfo id="car_n2w_227" depart="228.00" departLane="n2sep_1" departPos="3.60" departPosLat="0.00" departSpeed="13.90" departDelay="1.00" arrival="375.00" arrivalLane="c2w_1" arrivalPos="990.00" arrivalPosLat="0.00" arrivalSpeed="14.63" duration="147.00" routeLength="1986.69" waitingTime="0.00" waitingCount="0" stopTime="0.00" timeLoss="11.04" rerouteNo="1" devices="tripinfo_car_n2w_227 routing_car_n2w_227" vType="Car" speedFactor="1.06" vaporized=""/>
    <tripinfo id="car_n2e_222" depart="222.00" departLane="n2sep_1" departPos="3.60" departPosLat="0.00" departSpeed="13.90" departDelay="0.00" arrival="377.00" arrivalLane="c2e_1" arrivalPos="990.00" arrivalPosLat="0.00" arrivalSpeed="14.46" duration="155.00" routeLength="1996.47" waitingTime="3.00" waitingCount="1" stopTime="0.00" timeLoss="16.46" rerouteNo="1" devices="tripinfo_car_n2e_222 routing_car_n2e_222" vType="Car" speedFactor="1.04" vaporized=""/>
    <tripinfo id="car_s2w_181" depart="181.00" departLane="s2sep_1" departPos="3.60" departPosLat="0.00" departSpeed="13.90" departDelay="0.00" arrival="380.00" arrivalLane="c2w_1" arrivalPos="990.00" arrivalPosLat="0.00" arrivalSpeed="13.97" duration="199.00" routeLength="1996.47" waitingTime="29.00" waitingCount="3" stopTime="0.00" timeLoss="55.19" rerouteNo="1" devices="tripinfo_car_s2w_181 routing_car_s2w_181" vType="Car" speedFactor="1.01" vaporized=""/>
    <tripinfo id="car_n2e_225" depart="226.00" departLane="n2sep_1" departPos="3.60" departPosLat="0.00" departSpeed="13.90" departDelay="1.00" arrival="381.00" arrivalLane="c2e_1" arrivalPos="990.00" arrivalPosLat="0.00" arrivalSpeed="14.40" duration="155.00" routeLength="1996.47" waitingTime="0.00" waitingCount="0" stopTime="0.00" timeLoss="15.17" rerouteNo="1" devices="tripinfo_car_n2e_225 routing_car_n2e_225" vType="Car" speedFactor="1.04" vaporized=""/>
    <tripinfo id="car_s2w_183" depart="183.00" departLane="s2sep_1" departPos="3.60" departPosLat="0.00" departSpeed="13.90" departDelay="0.00" arrival="382.00" arrivalLane="c2w_1" arrivalPos="990.00" arrivalPosLat="0.00" arrivalSpeed="15.56" duration="199.00" routeLength="1996.47" waitingTime="29.00" waitingCount="3" stopTime="0.00" timeLoss="75.35" rerouteNo="1" devices="tripinfo_car_s2w_183 routing_car_s2w_183" vType="Car" speedFactor="1.17" vaporized=""/>
    <tripinfo id="car_e2n_206" depart="206.00" departLane="e2sep_1" departPos="3.60" departPosLat="0.00" departSpeed="13.90" departDelay="0.00" arrival="383.00" arrivalLane="c2n_1" arrivalPos="990.00" arrivalPosLat="0.00" arrivalSpeed="15.32" duration="177.00" routeLength="1986.69" waitingTime="36.00" waitingCount="1" stopTime="0.00" timeLoss="46.38" rerouteNo="1" devices="tripinfo_car_e2n_206 routing_car_e2n_206" vType="Car" speedFactor="1.10" vaporized=""/>
    <tripinfo id="car_s2w_224" depart="225.00" departLane="s2sep_1" departPos="3.60" departPosLat="0.00" departSpeed="13.90" departDelay="1.00" arrival="384.00" arrivalLane="c2w_1" arrivalPos="990.00" arrivalPosLat="0.00" arrivalSpeed="14.87" duration="159.00" routeLength="1996.47" waitingTime="6.00" waitingCount="1" stopTime="0.00" timeLoss="26.70" rerouteNo="1" devices="tripinfo_car_s2w_224 routing_car_s2w_224" vType="Car" speedFactor="1.09" vaporized=""/>
    <tripinfo id="car_w2s_186" depart="186.00" departLane="w2sep_1" departPos="3.60" departPosLat="0.00" departSpeed="13.90" departDelay="0.00" arrival="388.00" arrivalLane="c2s_1" arrivalPos="990.00" arrivalPosLat="0.00" arrivalSpeed="14.21" duration="202.00" routeLength="1986.69" waitingTime="51.00" waitingCount="1" stopTime="0.00" timeLoss="61.13" rerouteNo="1" devices="tripinfo_car_w2s_186 routing_car_w2s_186" vType="Car" speedFactor="1.02" vaporized=""/>
    <tripinfo id="car_w2e_198" depart="198.00" departLane="w2sep_1" departPos="3.60" departPosLat="0.00" departSpeed="13.90" departDelay="0.00" arrival="388.00" arrivalLane="c2e_1" arrivalPos="990.00" arrivalPosLat="0.00" arrivalSpeed="14.67" duration="190.00" routeLength="1997.01" waitingTime="43.00" waitingCount="1" stopTime="0.00" timeLoss="53.85" rerouteNo="1" devices="tripinfo_car_w2e_198 routing_car_w2e_198" vType="Car" speedFactor="1.06" vaporized=""/>
    <tripinfo id="car_w2e_200" depart="200.00" departLane="w2sep_1" departPos="3.60" departPosLat="0.00" departSpeed="13.90" departDelay="0.00" arrival="390.00" arrivalLane="c2e_1" arrivalPos="990.00" arrivalPosLat="0.00" arrivalSpeed="15.89" duration="190.00" routeLength="1997.01" waitingTime="42.00" waitingCount="1" stopTime="0.00" timeLoss="68.19" rerouteNo="1" devices="tripinfo_car_w2e_200 routing_car_w2e_200" vType="Car" speedFactor="1.18" vaporized=""/>
    <tripinfo id="car_e2w_211" depart="211.00" departLane="e2sep_1" departPos="3.60" departPosLat="0.00" departSpeed="13.90" departDelay="0.00" arrival="390.00" arrivalLane="c2w_1" arrivalPos="990.00" arrivalPosLat="0.00" arrivalSpeed="14.38" duration="179.00" routeLength="1997.01" waitingTime="28.00" waitingCount="1" stopTime="0.00" timeLoss="39.69" rerouteNo="1" devices="tripinfo_car_e2w_211 routing_car_e2w_211" vType="Car" speedFactor="1.03" vaporized=""/>
    <tripinfo id="car_e2w_216" depart="216.00" departLane="e2sep_1" departPos="3.60" departPosLat="0.00" departSpeed="13.90" departDelay="0.00" arrival="392.00" arrivalLane="c2w_1" arrivalPos="990.00" arrivalPosLat="0.00" arrivalSpeed="15.49" duration="176.00" routeLength="1997.01" waitingTime="28.00" waitingCount="1" stopTime="0.00" timeLoss="50.50" rerouteNo="1" devices="tripinfo_car_e2w_216 routing_car_e2w_216" vType="Car" speedFactor="1.15" vaporized=""/>
    <tripinfo id="car_w2s_202" depart="202.00" departLane="w2sep_1" departPos="3.60" departPosLat="0.00" departSpeed="13.90" departDelay="0.00" arrival="395.00" arrivalLane="c2s_1" arrivalPos="990.00" arrivalPosLat="0.00" arrivalSpeed="14.35" duration="193.00" routeLength="1986.69" waitingTime="39.00" waitingCount="1" stopTime="0.00" timeLoss="53.89" rerouteNo="1" devices="tripinfo_car_w2s_202 routing_car_w2s_202" vType="Car" speedFactor="1.03" vaporized=""/>
    <tripinfo id="car_e2n_239" depart="239.00" departLane="e2sep_1" departPos="3.60" departPosLat="0.00" departSpeed="13.90" departDelay="0.00" arrival="397.00" arrivalLane="c2n_1" arrivalPos="990.00" arrivalPosLat="0.00" arrivalSpeed="13.90" duration="158.00" routeLength="1986.69" waitingTime="1.00" waitingCount="1" stopTime="0.00" timeLoss="14.30" rerouteNo="1" devices="tripinfo_car_e2n_239 routing_car_e2n_239" vType="Car" speedFactor="1.00" vaporized=""/>
    <tripinfo id="car_w2e_208" depart="208.00" departLane="w2sep_1" departPos="3.60" departPosLat="0.00" departSpeed="13.90" departDelay="0.00" arrival="399.00" arrivalLane="c2e_1" arrivalPos="990.00" arrivalPosLat="0.00" arrivalSpeed="14.00" duration="191.00" routeLength="1997.01" waitingTime="34.00" waitingCount="1" stopTime="0.00" timeLoss="48.04" rerouteNo="1" devices="tripinfo_car_w2e_208 routing_car_w2e_208" vType="Car" speedFactor="1.01" vaporized=""/>
    <tripinfo id="car_e2w_245" depart="245.00" departLane="e2sep_1" departPos="3.60" departPosLat="0.00" departSpeed="13.90" departDelay="0.00" arrival="399.00" arrivalLane="c2w_1" arrivalPos="990.00" arrivalPosLat="0.00" arrivalSpeed="14.09" duration="154.00" routeLength="1997.01" waitingTime="0.00" waitingCount="0" stopTime="0.00" timeLoss="11.75" rerouteNo="1" devices="tripinfo_car_e2w_245 routing_car_e2w_245" vType="Car" speedFactor="1.01" vaporized=""/>
    <tripinfo id="car_w2n_245" depart="245.00" departLane="w2sep_1" departPos="3.60" departPosLat="0.00" departSpeed="13.90" departDelay="0.00" arrival="400.00" arrivalLane="c2n_1" arrivalPos="990.00" arrivalPosLat="0.00" arrivalSpeed="14.81" duration="155.00" routeLength="1996.47" waitingTime="6.00" waitingCount="1" stopTime="0.00" timeLoss="19.95" rerouteNo="1" devices="tripinfo_car_w2n_245 routing_car_w2n_245" vType="Car" speedFactor="1.07" vaporized=""/>
    <tripinfo id="car_w2s_216" depart="216.00" departLane="w2sep_1" departPos="3.60" departPosLat="0.00" departSpeed="13.90" departDelay="0.00" arrival="401.00" arrivalLane="c2s_1" arrivalPos="990.00" arrivalPosLat="0.00" arrivalSpeed="14.32" duration="185.00" routeLength="1986.69" waitingTime="29.00" waitingCount="1" stopTime="0.00" timeLoss="45.18" rerouteNo="1" devices="tripinfo_car_w2s_216 routing_car_w2s_216" vType="Car" speedFactor="1.03" vaporized=""/>
    <tripinfo id="car_w2e_222" depart="222.00" departLane="w2sep_1" departPos="3.60" departPosLat="0.00" departSpeed="13.90" departDelay="0.00" arrival="405.00" arrivalLane="c2e_1" arrivalPos="990.00" arrivalPosLat="0.00" arrivalSpeed="13.92" duration="183.00" routeLength="1997.01" waitingTime="22.00" waitingCount="1" stopTime="0.00" timeLoss="39.10" rerouteNo="1" devices="tripinfo_car_w2e_222 routing_car_w2e_222" vType="Car" speedFactor="1.00" vaporized=""/>
    <tripinfo id="car_w2e_227" depart="227.00" departLane="w2sep_1" departPos="3.60" departPosLat="0.00" departSpeed="13.90" departDelay="0.00" arrival="407.00" arrivalLane="c2e_1" arrivalPos="990.00" arrivalPosLat="0.00" arrivalSpeed="14.83" duration="180.00" routeLength="1997.01" waitingTime="22.00" waitingCount="1" stopTime="0.00" timeLoss="48.10" rerouteNo="1" devices="tripinfo_car_w2e_227 routing_car_w2e_227" vType="Car" speedFactor="1.09" vaporized=""/>
    <tripinfo id="car_w2e_229" depart="229.00" departLane="w2sep_1" departPos="3.60" departPosLat="0.00" departSpeed="13.90" departDelay="0.00" arrival="411.00" arrivalLane="c2e_1" arrivalPos="990.00" arrivalPosLat="0.00" arrivalSpeed="14.02" duration="182.00" routeLength="1997.01" waitingTime="18.00" waitingCount="1" stopTime="0.00" timeLoss="39.23" rerouteNo="1" devices="tripinfo_car_w2e_229 routing_car_w2e_229" vType="Car" speedFactor="1.01" vaporized=""/>
    <tripinfo id="car_w2n_264" depart="264.00" departLane="w2sep_1" departPos="3.60" departPosLat="0.00" departSpeed="13.90" departDelay="0.00" arrival="412.00" arrivalLane="c2n_1" arrivalPos="990.00" arrivalPosLat="0.00" arrivalSpeed="14.13" duration="148.00" routeLength="1996.47" waitingTime="0.00" waitingCount="0" stopTime="0.00" timeLoss="5.18" rerouteNo="1" devices="tripinfo_car_w2n_264 routing_car_w2n_264" vType="Car" speedFactor="1.02" vaporized=""/>
    <tripinfo id="car_e2s_195" depart="195.00" departLane="e2sep_1" departPos="3.60" departPosLat="0.00" departSpeed="13.90" departDelay="0.00" arrival="413.00" arrivalLane="c2s_1" arrivalPos="990.00" arrivalPosLat="0.00" arrivalSpeed="13.90" duration="218.00" routeLength="1996.47" waitingTime="58.00" waitingCount="2" stopTime="0.00" timeLoss="73.41" rerouteNo="1" devices="tripinfo_car_e2s_195 routing_car_e2s_195" vType="Car" speedFactor="1.00" vaporized=""/>
    <tripinfo id="car_w2e_251" depart="251.00" departLane="w2sep_1" departPos="3.60" departPosLat="0.00" departSpeed="13.90" departDelay="0.00" arrival="413.00" arrivalLane="c2e_1" arrivalPos="990.00" arrivalPosLat="0.00" arrivalSpeed="15.51" duration="162.00" routeLength="1997.01" waitingTime="7.00" waitingCount="1" stopTime="0.00" timeLoss="38.45" rerouteNo="1" devices="tripinfo_car_w2e_251 routing_car_w2e_251" vType="Car" speedFactor="1.17" vaporized=""/>
    <tripinfo id="car_e2s_222" depart="222.00" departLane="e2sep_1" departPos="3.60" departPosLat="0.00" departSpeed="13.90" departDelay="0.00" arrival="417.00" arrivalLane="c2s_1" arrivalPos="990.00" arrivalPosLat="0.00" arrivalSpeed="13.99" duration="195.00" routeLength="1996.47" waitingTime="32.00" waitingCount="2" stopTime="0.00" timeLoss="51.54" rerouteNo="1" devices="tripinfo_car_e2s_222 routing_car_e2s_222" vType="Car" speedFactor="1.01" vaporized=""/>
    <tripinfo id="car_e2s_235" depart="235.00" departLane="e2sep_1" departPos="3.60" departPosLat="0.00" departSpeed="13.90" departDelay="0.00" arrival="419.00" arrivalLane="c2s_1" arrivalPos="990.00" arrivalPosLat="0.00" arrivalSpeed="15.10" duration="184.00" routeLength="1996.47" waitingTime="27.00" waitingCount="2" stopTime="0.00" timeLoss="55.09" rerouteNo="1" devices="tripinfo_car_e2s_235 routing_car_e2s_235" vType="Car" speedFactor="1.12" vaporized=""/>
    <tripinfo id="car_e2s_245" depart="247.00" departLane="e2sep_1" departPos="3.60" departPosLat="0.00" departSpeed="13.90" departDelay="2.00" arrival="422.00" arrivalLane="c2s_1" arrivalPos="990.00" arrivalPosLat="0.00" arrivalSpeed="14.32" duration="175.00" routeLength="1996.47" waitingTime="16.00" waitingCount="1" stopTime="0.00" timeLoss="35.29" rerouteNo="1" devices="tripinfo_car_e2s_245 routing_car_e2s_245" vType="Car" speedFactor="1.03" vaporized=""/>
    <tripinfo id="car_e2s_247" depart="249.00" departLane="e2sep_1" departPos="3.60" departPosLat="0.00" departSpeed="13.90" departDelay="2.00" arrival="427.00" arrivalLane="c2s_1" arrivalPos="990.00" arrivalPosLat="0.00" arrivalSpeed="13.90" duration="178.00" routeLength="1996.47" waitingTime="14.00" waitingCount="1" stopTime="0.00" timeLoss="32.76" rerouteNo="1" devices="tripinfo_car_e2s_247 routing_car_e2s_247" vType="Car" speedFactor="1.00" vaporized=""/>
    <tripinfo id="car_s2n_234" depart="234.00" departLane="s2sep_1" departPos="3.60" departPosLat="0.00" departSpeed="13.90" departDelay="0.00" arrival="429.00" arrivalLane="c2n_1" arrivalPos="990.00" arrivalPosLat="0.00" arrivalSpeed="15.12" duration="195.00" routeLength="1997.01" waitingTime="52.00" waitingCount="1" stopTime="0.00" timeLoss="62.63" rerouteNo="1" devices="tripinfo_car_s2n_234 routing_car_s2n_234" vType="Car" speedFactor="1.09" vaporized=""/>
    <tripinfo id="car_n2w_238" depart="238.00" departLane="n2sep_1" departPos="3.60" departPosLat="0.00" departSpeed="13.90" departDelay="0.00" arrival="430.00" arrivalLane="c2w_1" arrivalPos="990.00" arrivalPosLat="0.00" arrivalSpeed="14.80" duration="192.00" routeLength="1986.69" waitingTime="47.00" waitingCount="1" stopTime="0.00" timeLoss="57.03" rerouteNo="1" devices="tripinfo_car_n2w_238 routing_car_n2w_238" vType="Car" speedFactor="1.07" vaporized=""/>
    <tripinfo id="car_s2e_235" depart="236.00" departLane="s2sep_1" departPos="3.60" departPosLat="0.00" departSpeed="13.90" departDelay="1.00" arrival="431.00" arrivalLane="c2e_1" arrivalPos="990.00" arrivalPosLat="0.00" arrivalSpeed="15.25" duration="195.00" routeLength="1986.69" waitingTime="50.00" waitingCount="1" stopTime="0.00" timeLoss="63.73" rerouteNo="1" devices="tripinfo_car_s2e_235 routing_car_s2e_235" vType="Car" speedFactor="1.10" vaporized=""/>
    <tripinfo id="car_n2s_268" depart="268.00" departLane="n2sep_1" departPos="3.60" departPosLat="0.00" departSpeed="13.90" departDelay="0.00" arrival="436.00" arrivalLane="c2s_1" arrivalPos="990.00" arrivalPosLat="0.00" arrivalSpeed="14.03" duration="168.00" routeLength="1997.01" waitingTime="15.00" waitingCount="1" stopTime="0.00" timeLoss="25.51" rerouteNo="1" devices="tripinfo_car_n2s_268 routing_car_n2s_268" vType="Car" speedFactor="1.01" vaporized=""/>
    <tripinfo id="car_s2n_239" depart="239.00" departLane="s2sep_1" departPos="3.60" departPosLat="0.00" departSpeed="13.90" departDelay="0.00" arrival="440.00" arrivalLane="c2n_1" arrivalPos="990.00" arrivalPosLat="0.00" arrivalSpeed="13.90" duration="201.00" routeLength="1997.01" waitingTime="44.00" waitingCount="1" stopTime="0.00" timeLoss="56.40" rerouteNo="1" devices="tripinfo_car_s2n_239 routing_car_s2n_239" vType="Car" speedFactor="1.00" vaporized=""/>
    <tripinfo id="car_n2w_273" depart="273.00" departLane="n2sep_1" departPos="3.60" departPosLat="0.00" departSpeed="13.90" departDelay="0.00" arrival="440.00" arrivalLane="c2w_1" arrivalPos="990.00" arrivalPosLat="0.00" arrivalSpeed="13.94" duration="167.00" routeLength="1986.69" waitingTime="10.00" waitingCount="1" stopTime="0.00" timeLoss="23.77" rerouteNo="1" devices="tripinfo_car_n2w_273 routing_car_n2w_273" vType="Car" speedFactor="1.00" vaporized=""/>
    <tripinfo id="car_s2e_275" depart="278.00" departLane="s2sep_1" departPos="3.60" departPosLat="0.00" departSpeed="13.90" departDelay="3.00" arrival="440.00" arrivalLane="c2e_1" arrivalPos="990.00" arrivalPosLat="0.00" arrivalSpeed="14.89" duration="162.00" routeLength="1986.69" waitingTime="12.00" waitingCount="1" stopTime="0.00" timeLoss="27.28" rerouteNo="1" devices="tripinfo_car_s2e_275 routing_car_s2e_275" vType="Car" speedFactor="1.07" vaporized=""/>
    <tripinfo id="car_s2n_271" depart="274.00" departLane="s2sep_1" departPos="3.60" departPosLat="0.00" departSpeed="13.90" departDelay="3.00" arrival="441.00" arrivalLane="c2n_1" arrivalPos="990.00" arrivalPosLat="0.00" arrivalSpeed="14.96" duration="167.00" routeLength="1997.01" waitingTime="20.00" waitingCount="1" stopTime="0.00" timeLoss="44.90" rerouteNo="1" devices="tripinfo_car_s2n_271 routing_car_s2n_271" vType="Car" speedFactor="1.18" vaporized=""/>
    <tripinfo id="car_n2s_298" depart="298.00" departLane="n2sep_1" departPos="3.60" departPosLat="0.00" departSpeed="13.90" departDelay="0.00" arrival="441.00" arrivalLane="c2s_1" arrivalPos="990.00" arrivalPosLat="0.00" arrivalSpeed="15.87" duration="143.00" routeLength="1997.01" waitingTime="0.00" waitingCount="0" stopTime="0.00" timeLoss="16.26" rerouteNo="1" devices="tripinfo_car_n2s_298 routing_car_n2s_298" vType="Car" speedFactor="1.14" vaporized=""/>
    <tripinfo id="car_s2e_282" depart="282.00" departLane="s2sep_1" departPos="3.60" departPosLat="0.00" departSpeed="13.90" departDelay="0.00" arrival="442.00" arrivalLane="c2e_1" arrivalPos="990.00" arrivalPosLat="0.00" arrivalSpeed="15.71" duration="160.00" routeLength="1986.69" waitingTime="11.00" waitingCount="1" stopTime="0.00" timeLoss="35.34" rerouteNo="1" devices="tripinfo_car_s2e_282 routing_car_s2e_282" vType="Car" speedFactor="1.15" vaporized=""/>
    <tripinfo id="car_n2w_278" depart="278.00" departLane="n2sep_1" departPos="3.60" departPosLat="0.00" departSpeed="13.90" departDelay="0.00" arrival="443.00" arrivalLane="c2w_1" arrivalPos="990.00" arrivalPosLat="0.00" arrivalSpeed="15.16" duration="165.00" routeLength="1986.69" waitingTime="10.00" waitingCount="1" stopTime="0.00" timeLoss="33.97" rerouteNo="1" devices="tripinfo_car_n2w_278 routing_car_n2w_278" vType="Car" speedFactor="1.10" vaporized=""/>
    <tripinfo id="car_n2s_309" depart="309.00" departLane="n2sep_1" departPos="3.60" departPosLat="0.00" departSpeed="13.90" departDelay="0.00" arrival="443.00" arrivalLane="c2s_1" arrivalPos="990.00" arrivalPosLat="0.00" arrivalSpeed="16.63" duration="134.00" routeLength="1997.01" waitingTime="0.00" waitingCount="0" stopTime="0.00" timeLoss="16.14" rerouteNo="1" devices="tripinfo_car_n2s_309 routing_car_n2s_309" vType="Car" speedFactor="1.23" vaporized=""/>
    <tripinfo id="car_n2e_264" depart="264.00" departLane="n2sep_1" departPos="3.60" departPosLat="0.00" departSpeed="13.90" departDelay="0.00" arrival="446.00" arrivalLane="c2e_1" arrivalPos="990.00" arrivalPosLat="0.00" arrivalSpeed="15.24" duration="182.00" routeLength="1996.47" waitingTime="30.00" waitingCount="2" stopTime="0.00" timeLoss="50.11" rerouteNo="1" devices="tripinfo_car_n2e_264 routing_car_n2e_264" vType="Car" speedFactor="1.10" vaporized=""/>
    <tripinfo id="car_n2w_289" depart="289.00" departLane="n2sep_1" departPos="3.60" departPosLat="0.00" departSpeed="13.90" departDelay="0.00" arrival="446.00" arrivalLane="c2w_1" arrivalPos="990.00" arrivalPosLat="0.00" arrivalSpeed="14.31" duration="157.00" routeLength="1986.69" waitingTime="0.00" waitingCount="0" stopTime="0.00" timeLoss="17.49" rerouteNo="1" devices="tripinfo_car_n2w_289 routing_car_n2w_289" vType="Car" speedFactor="1.03" vaporized=""/>
    <tripinfo id="car_n2e_279" depart="280.00" departLane="n2sep_1" departPos="3.60" departPosLat="0.00" departSpeed="13.90" departDelay="1.00" arrival="451.00" arrivalLane="c2e_1" arrivalPos="990.00" arrivalPosLat="0.00" arrivalSpeed="14.33" duration="171.00" routeLength="1996.47" waitingTime="10.00" waitingCount="2" stopTime="0.00" timeLoss="30.87" rerouteNo="1" devices="tripinfo_car_n2e_279 routing_car_n2e_279" vType="Car" speedFactor="1.03" vaporized=""/>
    <tripinfo id="car_s2w_240" depart="241.00" departLane="s2sep_1" departPos="3.60" departPosLat="0.00" departSpeed="13.90" departDelay="1.00" arrival="454.00" arrivalLane="c2w_1" arrivalPos="990.00" arrivalPosLat="0.00" arrivalSpeed="13.90" duration="213.00" routeLength="1996.47" waitingTime="51.00" waitingCount="2" stopTime="0.00" timeLoss="67.74" rerouteNo="1" devices="tripinfo_car_s2w_240 routing_car_s2w_240" vType="Car" speedFactor="1.00" vaporized=""/>
    <tripinfo id="car_n2s_311" depart="311.00" departLane="n2sep_1" departPos="3.60" departPosLat="0.00" departSpeed="13.90" departDelay="0.00" arrival="455.00" arrivalLane="c2s_1" arrivalPos="990.00" arrivalPosLat="0.00" arrivalSpeed="14.06" duration="144.00" routeLength="1997.01" waitingTime="0.00" waitingCount="0" stopTime="0.00" timeLoss="1.46" rerouteNo="1" devices="tripinfo_car_n2s_311 routing_car_n2s_311" vType="Car" speedFactor="1.01" vaporized=""/>
    <tripinfo id="car_s2w_243" depart="243.00" departLane="s2sep_1" departPos="3.60" departPosLat="0.00" departSpeed="13.90" departDelay="0.00" arrival="459.00" arrivalLane="c2w_1" arrivalPos="990.00" arrivalPosLat="0.00" arrivalSpeed="13.90" duration="216.00" routeLength="1996.47" waitingTime="48.00" waitingCount="2" stopTime="0.00" timeLoss="71.04" rerouteNo="1" devices="tripinfo_car_s2w_243 routing_car_s2w_243" vType="Car" speedFactor="1.00" vaporized=""/>
    <tripinfo id="car_s2w_246" depart="246.00" departLane="s2sep_1" departPos="3.60" departPosLat="0.00" departSpeed="13.90" departDelay="0.00" arrival="461.00" arrivalLane="c2w_1" arrivalPos="990.00" arrivalPosLat="0.00" arrivalSpeed="14.56" duration="215.00" routeLength="1996.47" waitingTime="47.00" waitingCount="2" stopTime="0.00" timeLoss="79.34" rerouteNo="1" devices="tripinfo_car_s2w_246 routing_car_s2w_246" vType="Car" speedFactor="1.06" vaporized=""/>
    <tripinfo id="car_s2n_320" depart="321.00" departLane="s2sep_1" departPos="3.60" departPosLat="0.00" departSpeed="13.90" departDelay="1.00" arrival="463.00" arrivalLane="c2n_1" arrivalPos="990.00" arrivalPosLat="0.00" arrivalSpeed="14.11" duration="142.00" routeLength="1997.01" waitingTime="0.00" waitingCount="0" stopTime="0.00" timeLoss="0.43" rerouteNo="1" devices="tripinfo_car_s2n_320 routing_car_s2n_320" vType="Car" speedFactor="1.02" vaporized=""/>
    <tripinfo id="car_s2w_270" depart="270.00" departLane="s2sep_1" departPos="3.60" departPosLat="0.00" departSpeed="13.90" departDelay="0.00" arrival="464.00" arrivalLane="c2w_1" arrivalPos="990.00" arrivalPosLat="0.00" arrivalSpeed="15.07" duration="194.00" routeLength="1996.47" waitingTime="32.00" waitingCount="2" stopTime="0.00" timeLoss="61.46" rerouteNo="1" devices="tripinfo_car_s2w_270 routing_car_s2w_270" vType="Car" speedFactor="1.10" vaporized=""/>
    <tripinfo id="car_s2w_271" depart="272.00" departLane="s2sep_1" departPos="3.60" departPosLat="0.00" departSpeed="13.90" departDelay="1.00" arrival="466.00" arrivalLane="c2w_1" arrivalPos="990.00" arrivalPosLat="0.00" arrivalSpeed="14.94" duration="194.00" routeLength="1996.47" waitingTime="29.00" waitingCount="2" stopTime="0.00" timeLoss="61.69" rerouteNo="1" devices="tripinfo_car_s2w_271 routing_car_s2w_271" vType="Car" speedFactor="1.10" vaporized=""/>
    <tripinfo id="car_s2w_272" depart="276.00" departLane="s2sep_1" departPos="3.60" departPosLat="0.00" departSpeed="13.90" departDelay="4.00" arrival="471.00" arrivalLane="c2w_1" arrivalPos="990.00" arrivalPosLat="0.00" arrivalSpeed="13.96" duration="195.00" routeLength="1996.47" waitingTime="22.00" waitingCount="2" stopTime="0.00" timeLoss="50.51" rerouteNo="1" devices="tripinfo_car_s2w_272 routing_car_s2w_272" vType="Car" speedFactor="1.00" vaporized=""/>
    <tripinfo id="car_s2w_287" depart="287.00" departLane="s2sep_1" departPos="3.60" departPosLat="0.00" departSpeed="13.90" departDelay="0.00" arrival="473.00" arrivalLane="c2w_1" arrivalPos="990.00" arrivalPosLat="0.00" arrivalSpeed="15.08" duration="186.00" routeLength="1996.47" waitingTime="19.00" waitingCount="2" stopTime="0.00" timeLoss="56.30" rerouteNo="1" devices="tripinfo_car_s2w_287 routing_car_s2w_287" vType="Car" speedFactor="1.12" vaporized=""/>
    <tripinfo id="car_s2w_319" depart="319.00" departLane="s2sep_1" departPos="3.60" departPosLat="0.00" departSpeed="13.90" departDelay="0.00" arrival="475.00" arrivalLane="c2w_1" arrivalPos="990.00" arrivalPosLat="0.00" arrivalSpeed="15.13" duration="156.00" routeLength="1996.47" waitingTime="0.00" waitingCount="0" stopTime="0.00" timeLoss="26.55" rerouteNo="1" devices="tripinfo_car_s2w_319 routing_car_s2w_319" vType="Car" speedFactor="1.12" vaporized=""/>
    <tripinfo id="car_e2n_280" depart="280.00" departLane="e2sep_1" departPos="3.60" departPosLat="0.00" departSpeed="13.90" departDelay="0.00" arrival="476.00" arrivalLane="c2n_1" arrivalPos="990.00" arrivalPosLat="0.00" arrivalSpeed="14.75" duration="196.00" routeLength="1986.69" waitingTime="50.00" waitingCount="1" stopTime="0.00" timeLoss="59.87" rerouteNo="1" devices="tripinfo_car_e2n_280 routing_car_e2n_280" vType="Car" speedFactor="1.06" vaporized=""/>
    <tripinfo id="car_e2n_330" depart="330.00" departLane="e2sep_1" departPos="3.60" departPosLat="0.00" departSpeed="13.90" departDelay="0.00" arrival="479.00" arrivalLane="c2n_1" arrivalPos="990.00" arrivalPosLat="0.00" arrivalSpeed="15.43" duration="149.00" routeLength="1986.69" waitingTime="5.00" waitingCount="1" stopTime="0.00" timeLoss="20.07" rerouteNo="1" devices="tripinfo_car_e2n_330 routing_car_e2n_330" vType="Car" speedFactor="1.11" vaporized=""/>
    <tripinfo id="car_w2e_277" depart="277.00" departLane="w2sep_1" departPos="3.60" departPosLat="0.00" departSpeed="13.90" departDelay="0.00" arrival="480.00" arrivalLane="c2e_1" arrivalPos="990.00" arrivalPosLat="0.00" arrivalSpeed="13.90" duration="203.00" routeLength="1997.01" waitingTime="50.00" waitingCount="1" stopTime="0.00" timeLoss="58.58" rerouteNo="1" devices="tripinfo_car_w2e_277 routing_car_w2e_277" vType="Car" speedFactor="1.00" vaporized=""/>
    <tripinfo id="car_e2w_284" depart="284.00" departLane="e2sep_1" departPos="3.60" departPosLat="0.00" departSpeed="13.90" departDelay="0.00" arrival="480.00" arrivalLane="c2w_1" arrivalPos="990.00" arrivalPosLat="0.00" arrivalSpeed="14.34" duration="196.00" routeLength="1997.01" waitingTime="45.00" waitingCount="1" stopTime="0.00" timeLoss="56.64" rerouteNo="1" devices="tripinfo_car_e2w_284 routing_car_e2w_284" vType="Car" speedFactor="1.03" vaporized=""/>
    <tripinfo id="car_e2n_333" depart="333.00" departLane="e2sep_1" departPos="3.60" departPosLat="0.00" departSpeed="13.90" departDelay="0.00" arrival="482.00" arrivalLane="c2n_1" arrivalPos="990.00" arrivalPosLat="0.00" arrivalSpeed="16.05" duration="149.00" routeLength="1986.69" waitingTime="4.00" waitingCount="1" stopTime="0.00" timeLoss="25.24" rerouteNo="1" devices="tripinfo_car_e2n_333 routing_car_e2n_333" vType="Car" speedFactor="1.16" vaporized=""/>
    <tripinfo id="car_w2e_280" depart="280.00" departLane="w2sep_1" departPos="3.60" departPosLat="0.00" departSpeed="13.90" departDelay="0.00" arrival="483.00" arrivalLane="c2e_1" arrivalPos="990.00" arrivalPosLat="0.00" arrivalSpeed="14.18" duration="203.00" routeLength="1997.01" waitingTime="47.00" waitingCount="1" stopTime="0.00" timeLoss="62.44" rerouteNo="1" devices="tripinfo_car_w2e_280 routing_car_w2e_280" vType="Car" speedFactor="1.02" vaporized=""/>
    <tripinfo id="car_w2s_328" depart="328.00" departLane="w2sep_1" departPos="3.60" departPosLat="0.00" departSpeed="13.90" departDelay="0.00" arrival="484.00" arrivalLane="c2s_1" arrivalPos="990.00" arrivalPosLat="0.00" arrivalSpeed="14.23" duration="156.00" routeLength="1986.69" waitingTime="2.00" waitingCount="1" stopTime="0.00" timeLoss="14.69" rerouteNo="1" devices="tripinfo_car_w2s_328 routing_car_w2s_328" vType="Car" speedFactor="1.02" vaporized=""/>
    <tripinfo id="car_e2n_344" depart="344.00" departLane="e2sep_1" departPos="3.60" departPosLat="0.00" departSpeed="13.90" departDelay="0.00" arrival="487.00" arrivalLane="c2n_1" arrivalPos="990.00" arrivalPosLat="0.00" arrivalSpeed="15.04" duration="143.00" routeLength="1986.69" waitingTime="0.00" waitingCount="0" stopTime="0.00" timeLoss="9.86" rerouteNo="1" devices="tripinfo_car_e2n_344 routing_car_e2n_344" vType="Car" speedFactor="1.08" vaporized=""/>
    <tripinfo id="car_e2s_286" depart="286.00" departLane="e2sep_1" departPos="3.60" departPosLat="0.00" departSpeed="13.90" departDelay="0.00" arrival="489.00" arrivalLane="c2s_1" arrivalPos="990.00" arrivalPosLat="0.00" arrivalSpeed="13.90" duration="203.00" routeLength="1996.47" waitingTime="39.00" waitingCount="1" stopTime="0.00" timeLoss="58.46" rerouteNo="1" devices="tripinfo_car_e2s_286 routing_car_e2s_286" vType="Car" speedFactor="1.00" vaporized=""/>
    <tripinfo id="car_e2n_349" depart="349.00" departLane="e2sep_1" departPos="3.60" departPosLat="0.00" departSpeed="13.90" departDelay="0.00" arrival="490.00" arrivalLane="c2n_1" arrivalPos="990.00" arrivalPosLat="0.00" arrivalSpeed="15.73" duration="141.00" routeLength="1986.69" waitingTime="0.00" waitingCount="0" stopTime="0.00" timeLoss="14.25" rerouteNo="1" devices="tripinfo_car_e2n_349 routing_car_e2n_349" vType="Car" speedFactor="1.14" vaporized=""/>
    <tripinfo id="car_e2s_333" depart="335.00" departLane="e2sep_1" departPos="3.60" departPosLat="0.00" departSpeed="13.90" departDelay="2.00" arrival="493.00" arrivalLane="c2s_1" arrivalPos="990.00" arrivalPosLat="0.00" arrivalSpeed="13.89" duration="158.00" routeLength="1996.47" waitingTime="0.00" waitingCount="0" stopTime="0.00" timeLoss="13.32" rerouteNo="1" devices="tripinfo_car_e2s_333 routing_car_e2s_333" vType="Car" speedFactor="1.00" vaporized=""/>
    <tripinfo id="car_w2n_288" depart="288.00" departLane="w2sep_1" departPos="3.60" departPosLat="0.00" departSpeed="13.90" departDelay="0.00" arrival="497.00" arrivalLane="c2n_1" arrivalPos="990.00" arrivalPosLat="0.00" arrivalSpeed="14.02" duration="209.00" routeLength="1996.47" waitingTime="47.00" waitingCount="2" stopTime="0.00" timeLoss="65.49" rerouteNo="1" devices="tripinfo_car_w2n_288 routing_car_w2n_288" vType="Car" speedFactor="1.01" vaporized=""/>
    <tripinfo id="car_w2n_296" depart="296.00" departLane="w2sep_1" departPos="3.60" departPosLat="0.00" departSpeed="13.90" departDelay="0.00" arrival="500.00" arrivalLane="c2n_1" arrivalPos="990.00" arrivalPosLat="0.00" arrivalSpeed="14.75" duration="204.00" routeLength="1996.47" waitingTime="43.00" waitingCount="2" stopTime="0.00" timeLoss="68.17" rerouteNo="1" devices="tripinfo_car_w2n_296 routing_car_w2n_296" vType="Car" speedFactor="1.07" vaporized=""/>
    <tripinfo id="car_w2n_301" depart="301.00" departLane="w2sep_1" departPos="3.60" departPosLat="0.00" departSpeed="13.90" departDelay="0.00" arrival="503.00" arrivalLane="c2n_1" arrivalPos="990.00" arrivalPosLat="0.00" arrivalSpeed="14.37" duration="202.00" routeLength="1996.47" waitingTime="38.00" waitingCount="2" stopTime="0.00" timeLoss="62.19" rerouteNo="1" devices="tripinfo_car_w2n_301 routing_car_w2n_301" vType="Car" speedFactor="1.04" vaporized=""/>
    <tripinfo id="car_w2n_359" depart="359.00" departLane="w2sep_1" departPos="3.60" departPosLat="0.00" departSpeed="13.90" departDelay="0.00" arrival="505.00" arrivalLane="c2n_1" arrivalPos="990.00" arrivalPosLat="0.00" arrivalSpeed="15.12" duration="146.00" routeLength="1996.47" waitingTime="0.00" waitingCount="0" stopTime="0.00" timeLoss="16.41" rerouteNo="1" devices="tripinfo_car_w2n_359 routing_car_w2n_359" vType="Car" speedFactor="1.12" vaporized=""/>
    <tripinfo id="car_w2n_363" depart="363.00" departLane="w2sep_1" departPos="3.60" departPosLat="0.00" departSpeed="13.90" departDelay="0.00" arrival="509.00" arrivalLane="c2n_1" arrivalPos="990.00" arrivalPosLat="0.00" arrivalSpeed="14.44" duration="146.00" routeLength="1996.47" waitingTime="0.00" waitingCount="0" stopTime="0.00" timeLoss="6.57" rerouteNo="1" devices="tripinfo_car_w2n_363 routing_car_w2n_363" vType="Car" speedFactor="1.04" vaporized=""/>
    <tripinfo id="car_e2s_362" depart="362.00" departLane="e2sep_1" departPos="3.60" departPosLat="0.00" departSpeed="13.90" departDelay="0.00" arrival="510.00" arrivalLane="c2s_1" arrivalPos="990.00" arrivalPosLat="0.00" arrivalSpeed="14.12" duration="148.00" routeLength="1996.47" waitingTime="0.00" waitingCount="0" stopTime="0.00" timeLoss="5.00" rerouteNo="1" devices="tripinfo_car_e2s_362 routing_car_e2s_362" vType="Car" speedFactor="1.02" vaporized=""/>
    <tripinfo id="car_e2s_365" depart="365.00" departLane="e2sep_1" departPos="3.60" departPosLat="0.00" departSpeed="13.90" departDelay="0.00" arrival="515.00" arrivalLane="c2s_1" arrivalPos="990.00" arrivalPosLat="0.00" arrivalSpeed="13.96" duration="150.00" routeLength="1996.47" waitingTime="0.00" waitingCount="0" stopTime="0.00" timeLoss="6.07" rerouteNo="1" devices="tripinfo_car_e2s_365 routing_car_e2s_365" vType="Car" speedFactor="1.00" vaporized=""/>
    <tripinfo id="car_e2s_371" depart="371.00" departLane="e2sep_1" departPos="3.60" departPosLat="0.00" departSpeed="13.90" departDelay="0.00" arrival="520.00" arrivalLane="c2s_1" arrivalPos="990.00" arrivalPosLat="0.00" arrivalSpeed="13.90" duration="149.00" routeLength="1996.47" waitingTime="0.00" waitingCount="0" stopTime="0.00" timeLoss="4.30" rerouteNo="1" devices="tripinfo_car_e2s_371 routing_car_e2s_371" vType="Car" speedFactor="1.00" vaporized=""/>
    <tripinfo id="car_w2s_378" depart="378.00" departLane="w2sep_1" departPos="3.60" departPosLat="0.00" departSpeed="13.90" departDelay="0.00" arrival="522.00" arrivalLane="c2s_1" arrivalPos="990.00" arrivalPosLat="0.00" arrivalSpeed="14.70" duration="144.00" routeLength="1986.69" waitingTime="0.00" waitingCount="0" stopTime="0.00" timeLoss="10.74" rerouteNo="1" devices="tripinfo_car_w2s_378 routing_car_w2s_378" vType="Car" speedFactor="1.08" vaporized=""/>
    <tripinfo id="car_w2e_379" depart="380.00" departLane="w2sep_1" departPos="3.60" departPosLat="0.00" departSpeed="13.90" departDelay="1.00" arrival="526.00" arrivalLane="c2e_1" arrivalPos="990.00" arrivalPosLat="1.00" arrivalSpeed="13.90" duration="146.00" routeLength="1997.01" waitingTime="0.00" waitingCount="0" stopTime="0.00" timeLoss="1.81" rerouteNo="1" devices="tripinfo_car_w2e_379 routing_car_w2e_379" vType="Car" speedFactor="1.00" vaporized=""/>
    <tripinfo id="amb_w2e_390" depart="390.00" departLane="w2sep_1" departPos="6.60" departPosLat="0.00" departSpeed="13.90" departDelay="0.00" arrival="527.00" arrivalLane="c2e_1" arrivalPos="990.00" arrivalPosLat="0.00" arrivalSpeed="15.86" duration="137.00" routeLength="1994.01" waitingTime="0.00" waitingCount="0" stopTime="0.00" timeLoss="41.30" rerouteNo="1" devices="tripinfo_amb_w2e_390 routing_amb_w2e_390 bluelight_amb_w2e_390" vType="Ambulance" speedFactor="1.50" vaporized="">
        <bluelight/>
    </tripinfo>
    <tripinfo id="car_s2e_339" depart="339.00" departLane="s2sep_1" departPos="3.60" departPosLat="0.00" departSpeed="13.90" departDelay="0.00" arrival="533.00" arrivalLane="c2e_1" arrivalPos="990.00" arrivalPosLat="0.00" arrivalSpeed="15.69" duration="194.00" routeLength="1986.69" waitingTime="54.00" waitingCount="1" stopTime="0.00" timeLoss="66.11" rerouteNo="1" devices="tripinfo_car_s2e_339 routing_car_s2e_339" vType="Car" speedFactor="1.13" vaporized=""/>
    <tripinfo id="car_s2n_321" depart="323.00" departLane="s2sep_1" departPos="3.60" departPosLat="0.00" departSpeed="13.90" departDelay="2.00" arrival="537.00" arrivalLane="c2n_1" arrivalPos="990.00" arrivalPosLat="0.00" arrivalSpeed="13.95" duration="214.00" routeLength="1997.01" waitingTime="59.00" waitingCount="1" stopTime="0.00" timeLoss="70.87" rerouteNo="1" devices="tripinfo_car_s2n_321 routing_car_s2n_321" vType="Car" speedFactor="1.00" vaporized=""/>
    <tripinfo id="car_n2s_365" depart="365.00" departLane="n2sep_1" departPos="3.60" departPosLat="0.00" departSpeed="13.90" departDelay="0.00" arrival="538.00" arrivalLane="c2s_1" arrivalPos="990.00" arrivalPosLat="0.00" arrivalSpeed="13.90" duration="173.00" routeLength="1997.01" waitingTime="19.00" waitingCount="1" stopTime="0.00" timeLoss="28.65" rerouteNo="1" devices="tripinfo_car_n2s_365 routing_car_n2s_365" vType="Car" speedFactor="1.00" vaporized=""/>
    <tripinfo id="car_n2s_377" depart="377.00" departLane="n2sep_1" departPos="3.60" departPosLat="0.00" departSpeed="13.90" departDelay="0.00" arrival="540.00" arrivalLane="c2s_1" arrivalPos="990.00" arrivalPosLat="0.00" arrivalSpeed="15.62" duration="163.00" routeLength="1997.01" waitingTime="18.00" waitingCount="1" stopTime="0.00" timeLoss="40.35" rerouteNo="1" devices="tripinfo_car_n2s_377 routing_car_n2s_377" vType="Car" speedFactor="1.18" vaporized=""/>
    <tripinfo id="car_s2n_365" depart="365.00" departLane="s2sep_1" departPos="3.60" departPosLat="0.00" departSpeed="13.90" departDelay="0.00" arrival="542.00" arrivalLane="c2n_1" arrivalPos="990.00" arrivalPosLat="0.00" arrivalSpeed="14.88" duration="177.00" routeLength="1997.01" waitingTime="26.00" waitingCount="1" stopTime="0.00" timeLoss="42.04" rerouteNo="1" devices="tripinfo_car_s2n_365 routing_car_s2n_365" vType="Car" speedFactor="1.07" vaporized=""/>
    <tripinfo id="car_n2s_388" depart="388.00" departLane="n2sep_1" departPos="3.60" departPosLat="0.00" departSpeed="13.90" departDelay="0.00" arrival="542.00" arrivalLane="c2s_1" arrivalPos="990.00" arrivalPosLat="0.00" arrivalSpeed="15.25" duration="154.00" routeLength="1997.01" waitingTime="6.00" waitingCount="1" stopTime="0.00" timeLoss="25.84" rerouteNo="1" devices="tripinfo_car_n2s_388 routing_car_n2s_388" vType="Car" speedFactor="1.13" vaporized=""/>
    <tripinfo id="car_n2w_390" depart="390.00" departLane="n2sep_1" departPos="3.60" departPosLat="0.00" departSpeed="13.90" departDelay="0.00" arrival="542.00" arrivalLane="c2w_1" arrivalPos="990.00" arrivalPosLat="0.00" arrivalSpeed="14.62" duration="152.00" routeLength="1986.69" waitingTime="0.00" waitingCount="0" stopTime="0.00" timeLoss="14.85" rerouteNo="1" devices="tripinfo_car_n2w_390 routing_car_n2w_390" vType="Car" speedFactor="1.05" vaporized=""/>
    <tripinfo id="car_s2e_359" depart="359.00" departLane="s2sep_1" departPos="3.60" departPosLat="0.00" departSpeed="13.90" departDelay="0.00" arrival="543.00" arrivalLane="c2e_1" arrivalPos="990.00" arrivalPosLat="0.00" arrivalSpeed="13.93" duration="184.00" routeLength="1986.69" waitingTime="28.00" waitingCount="1" stopTime="0.00" timeLoss="40.78" rerouteNo="1" devices="tripinfo_car_s2e_359 routing_car_s2e_359" vType="Car" speedFactor="1.00" vaporized=""/>
    <tripinfo id="car_n2s_402" depart="402.00" departLane="n2sep_1" departPos="3.60" departPosLat="0.00" departSpeed="13.90" departDelay="0.00" arrival="544.00" arrivalLane="c2s_1" arrivalPos="990.00" arrivalPosLat="0.00" arrivalSpeed="14.89" duration="142.00" routeLength="1997.01" waitingTime="0.00" waitingCount="0" stopTime="0.00" timeLoss="9.79" rerouteNo="1" devices="tripinfo_car_n2s_402 routing_car_n2s_402" vType="Car" speedFactor="1.09" vaporized=""/>
    <tripinfo id="car_n2w_405" depart="405.00" departLane="n2sep_1" departPos="3.60" departPosLat="0.00" departSpeed="13.90" departDelay="0.00" arrival="544.00" arrivalLane="c2w_1" arrivalPos="990.00" arrivalPosLat="0.00" arrivalSpeed="15.59" duration="139.00" routeLength="1986.69" waitingTime="0.00" waitingCount="0" stopTime="0.00" timeLoss="13.15" rerouteNo="1" devices="tripinfo_car_n2w_405 routing_car_n2w_405" vType="Car" speedFactor="1.14" vaporized=""/>
    <tripinfo id="car_s2n_371" depart="371.00" departLane="s2sep_1" departPos="3.60" departPosLat="0.00" departSpeed="13.90" departDelay="0.00" arrival="546.00" arrivalLane="c2n_1" arrivalPos="990.00" arrivalPosLat="0.00" arrivalSpeed="14.78" duration="175.00" routeLength="1997.01" waitingTime="22.00" waitingCount="1" stopTime="0.00" timeLoss="39.11" rerouteNo="1" devices="tripinfo_car_s2n_371 routing_car_s2n_371" vType="Car" speedFactor="1.06" vaporized=""/>
    <tripinfo id="car_s2e_382" depart="383.00" departLane="s2sep_1" departPos="3.60" departPosLat="0.00" departSpeed="13.90" departDelay="1.00" arrival="547.00" arrivalLane="c2e_1" arrivalPos="990.00" arrivalPosLat="0.00" arrivalSpeed="14.95" duration="164.00" routeLength="1986.69" waitingTime="12.00" waitingCount="1" stopTime="0.00" timeLoss="29.99" rerouteNo="1" devices="tripinfo_car_s2e_382 routing_car_s2e_382" vType="Car" speedFactor="1.08" vaporized=""/>
    <tripinfo id="car_s2w_379" depart="379.00" departLane="s2sep_1" departPos="3.60" departPosLat="0.00" departSpeed="13.90" departDelay="0.00" arrival="548.00" arrivalLane="c2w_1" arrivalPos="990.00" arrivalPosLat="0.00" arrivalSpeed="15.84" duration="169.00" routeLength="1996.47" waitingTime="24.00" waitingCount="2" stopTime="0.00" timeLoss="42.04" rerouteNo="1" devices="tripinfo_car_s2w_379 routing_car_s2w_379" vType="Car" speedFactor="1.14" vaporized=""/>
    <tripinfo id="car_n2s_405" depart="407.00" departLane="n2sep_1" departPos="3.60" departPosLat="0.00" departSpeed="13.90" departDelay="2.00" arrival="553.00" arrivalLane="c2s_1" arrivalPos="990.00" arrivalPosLat="0.00" arrivalSpeed="13.90" duration="146.00" routeLength="1997.01" waitingTime="0.00" waitingCount="0" stopTime="0.00" timeLoss="2.06" rerouteNo="1" devices="tripinfo_car_n2s_405 routing_car_n2s_405" vType="Car" speedFactor="1.00" vaporized=""/>
    <tripinfo id="car_s2e_402" depart="402.00" departLane="s2sep_1" departPos="3.60" departPosLat="0.00" departSpeed="13.90" departDelay="0.00" arrival="554.00" arrivalLane="c2e_1" arrivalPos="990.00" arrivalPosLat="0.00" arrivalSpeed="13.90" duration="152.00" routeLength="1986.69" waitingTime="0.00" waitingCount="0" stopTime="0.00" timeLoss="8.00" rerouteNo="1" devices="tripinfo_car_s2e_402 routing_car_s2e_402" vType="Car" speedFactor="1.00" vaporized=""/>
    <tripinfo id="car_s2e_413" depart="413.00" departLane="s2sep_1" departPos="3.60" departPosLat="0.00" departSpeed="13.90" departDelay="0.00" arrival="556.00" arrivalLane="c2e_1" arrivalPos="990.00" arrivalPosLat="0.00" arrivalSpeed="14.77" duration="143.00" routeLength="1986.69" waitingTime="0.00" waitingCount="0" stopTime="0.00" timeLoss="10.46" rerouteNo="1" devices="tripinfo_car_s2e_413 routing_car_s2e_413" vType="Car" speedFactor="1.08" vaporized=""/>
    <tripinfo id="car_s2w_380" depart="381.00" departLane="s2sep_1" departPos="3.60" departPosLat="0.00" departSpeed="13.90" departDelay="1.00" arrival="558.00" arrivalLane="c2w_1" arrivalPos="990.00" arrivalPosLat="0.00" arrivalSpeed="13.90" duration="177.00" routeLength="1996.47" waitingTime="14.00" waitingCount="2" stopTime="0.00" timeLoss="32.11" rerouteNo="1" devices="tripinfo_car_s2w_380 routing_car_s2w_380" vType="Car" speedFactor="1.00" vaporized=""/>
    <tripinfo id="car_s2w_387" depart="387.00" departLane="s2sep_1" departPos="3.60" departPosLat="0.00" departSpeed="13.90" departDelay="0.00" arrival="562.00" arrivalLane="c2w_1" arrivalPos="990.00" arrivalPosLat="0.00" arrivalSpeed="13.89" duration="175.00" routeLength="1996.47" waitingTime="10.00" waitingCount="1" stopTime="0.00" timeLoss="30.30" rerouteNo="1" devices="tripinfo_car_s2w_387 routing_car_s2w_387" vType="Car" speedFactor="1.00" vaporized=""/>
</tripinfos>
