<?xml version="1.0" encoding="UTF-8"?>

<!-- generated on Sat Apr 24 18:14:46 2021 by Eclipse SUMO Version 1.4.0
<configuration xmlns:xsi="http://www.w3.org/2001/XMLSchema-instance" xsi:noNamespaceSchemaLocation="http://sumo.dlr.de/xsd/sumoConfiguration.xsd">

    <input>
        <net-file value="sumofiles/junction.net.xml"/>
        <route-files value="sumofiles/junction_preemption_57.rou.xml"/>
        <additional-files value="sumofiles/junction.det.xml"/>
    </input>

    <output>
        <tripinfo-output value="sumofiles/output/tripinfo_preemption_57.xml"/>
    </output>

    <time>
        <begin value="0"/>
        <end value="10000"/>
        <step-length value="0.05"/>
    </time>

    <processing>
        <lateral-resolution value="0.1"/>
    </processing>

    <report>
        <no-warnings value="true"/>
        <error-log value="sumofiles/output/errorlog_preemption_57.log"/>
        <no-step-log value="true"/>
    </report>

    <traci_server>
        <remote-port value="44993"/>
    </traci_server>

    <gui_only>
        <gui-settings-file value="sumofiles/junction-gui.settings.xml"/>
        <tracker-interval value="0.05"/>
    </gui_only>

</configuration>
-->

<tripinfos xmlns:xsi="http://www.w3.org/2001/XMLSchema-instance" xsi:noNamespaceSchemaLocation="http://sumo.dlr.de/xsd/tripinfo_file.xsd">
    <tripinfo id="car_w2e_0" depart="0.00" departLane="w2sep_1" departPos="3.60" departPosLat="0.00" departSpeed="13.90" departDelay="0.00" arrival="135.70" arrivalLane="c2e_1" arrivalPos="990.00" arrivalPosLat="0.00" arrivalSpeed="14.73" duration="135.70" routeLength="1997.01" waitingTime="0.00" waitingCount="0" stopTime="0.00" timeLoss="0.13" rerouteNo="1" devices="tripinfo_car_w2e_0 routing_car_w2e_0" vType="Car" speedFactor="1.06" vaporized=""/>
    <tripinfo id="car_w2n_3" depart="3.00" departLane="w2sep_1" departPos="3.60" departPosLat="0.00" departSpeed="13.90" departDelay="0.00" arrival="144.10" arrivalLane="c2n_1" arrivalPos="990.00" arrivalPosLat="0.00" arrivalSpeed="14.73" duration="141.10" routeLength="1996.47" waitingTime="0.00" waitingCount="0" stopTime="0.00" timeLoss="4.92" rerouteNo="1" devices="tripinfo_car_w2n_3 routing_car_w2n_3" vType="Car" speedFactor="1.06" vaporized=""/>
    <tripinfo id="car_w2e_8" depart="8.00" departLane="w2sep_1" departPos="3.60" departPosLat="0.00" departSpeed="13.90" departDelay="0.00" arrival="148.40" arrivalLane="c2e_1" arrivalPos="990.00" arrivalPosLat="0.00" arrivalSpeed="14.32" duration="140.40" routeLength="1997.01" waitingTime="0.00" waitingCount="0" stopTime="0.00" timeLoss="0.92" rerouteNo="1" devices="tripinfo_car_w2e_8 routing_car_w2e_8" vType="Car" speedFactor="1.03" vaporized=""/>
    <tripinfo id="car_w2n_10" depart="10.00" departLane="w2sep_1" departPos="3.60" departPosLat="0.00" departSpeed="13.90" departDelay="0.00" arrival="159.45" arrivalLane="c2n_1" arrivalPos="990.00" arrivalPosLat="0.00" arrivalSpeed="13.90" duration="149.45" routeLength="1996.47" waitingTime="0.00" waitingCount="0" stopTime="0.00" timeLoss="5.12" rerouteNo="1" devices="tripinfo_car_w2n_10 routing_car_w2n_10" vType="Car" speedFactor="1.00" vaporized=""/>
    <tripinfo id="car_n2w_5" depart="5.00" departLane="n2sep_1" departPos="3.60" departPosLat="0.00" departSpeed="13.90" departDelay="0.00" arrival="160.30" arrivalLane="c2w_1" arrivalPos="990.00" arrivalPosLat="0.00" arrivalSpeed="15.05" duration="155.30" routeLength="1986.69" waitingTime="15.05" waitingCount="1" stopTime="0.00" timeLoss="22.61" rerouteNo="1" devices="tripinfo_car_n2w_5 routing_car_n2w_5" vType="Car" speedFactor="1.08" vaporized=""/>
    <tripinfo id="car_n2s_35" depart="35.00" departLane="n2sep_1" departPos="3.60" departPosLat="0.00" departSpeed="13.90" departDelay="0.00" arrival="164.65" arrivalLane="c2s_1" arrivalPos="990.00" arrivalPosLat="0.00" arrivalSpeed="15.61" duration="129.65" routeLength="1997.01" waitingTime="0.00" waitingCount="0" stopTime="0.00" timeLoss="1.67" rerouteNo="1" devices="tripinfo_car_n2s_35 routing_car_n2s_35" vType="Car" speedFactor="1.12" vaporized=""/>
    <tripinfo id="car_s2n_4" depart="4.00" departLane="s2sep_1" departPos="3.60" departPosLat="0.00" departSpeed="13.90" departDelay="0.00" arrival="165.60" arrivalLane="c2n_1" arrivalPos="990.00" arrivalPosLat="0.00" arrivalSpeed="14.04" duration="161.60" routeLength="1997.01" waitingTime="11.65" waitingCount="1" stopTime="0.00" timeLoss="19.41" rerouteNo="1" devices="tripinfo_car_s2n_4 routing_car_s2n_4" vType="Car" speedFactor="1.01" vaporized=""/>
    <tripinfo id="car_n2w_11" depart="11.00" departLane="n2sep_1" departPos="3.60" departPosLat="0.00" departSpeed="13.90" departDelay="0.00" arrival="166.30" arrivalLane="c2w_1" arrivalPos="990.00" arrivalPosLat="0.00" arrivalSpeed="14.54" duration="155.30" routeLength="1986.69" waitingTime="7.60" waitingCount="1" stopTime="0.00" timeLoss="17.94" rerouteNo="1" devices="tripinfo_car_n2w_11 routing_car_n2w_11" vType="Car" speedFactor="1.05" vaporized=""/>
    <tripinfo id="car_s2n_15" depart="15.00" departLane="s2sep_1" departPos="3.60" departPosLat="0.00" departSpeed="13.90" departDelay="0.00" arrival="167.95" arrivalLane="c2n_1" arrivalPos="990.00" arrivalPosLat="0.00" arrivalSpeed="14.90" duration="152.95" routeLength="1997.01" waitingTime="6.25" waitingCount="1" stopTime="0.00" timeLoss="21.23" rerouteNo="1" devices="tripinfo_car_s2n_15 routing_car_s2n_15" vType="Car" speedFactor="1.09" vaporized=""/>
    <tripinfo id="car_n2w_15" depart="15.00" departLane="n2sep_1" departPos="3.60" departPosLat="0.00" departSpeed="13.90" departDelay="0.00" arrival="170.80" arrivalLane="c2w_1" arrivalPos="990.00" arrivalPosLat="0.00" arrivalSpeed="14.31" duration="155.80" routeLength="1986.69" waitingTime="3.35" waitingCount="1" stopTime="0.00" timeLoss="16.34" rerouteNo="1" devices="tripinfo_car_n2w_15 routing_car_n2w_15" vType="Car" speedFactor="1.03" vaporized=""/>
    <tripinfo id="car_s2n_21" depart="21.00" departLane="s2sep_1" departPos="3.60" departPosLat="0.00" departSpeed="13.90" departDelay="0.00" arrival="171.00" arrivalLane="c2n_1" arrivalPos="990.00" arrivalPosLat="0.00" arrivalSpeed="14.49" duration="150.00" routeLength="1997.01" waitingTime="0.00" waitingCount="0" stopTime="0.00" timeLoss="12.77" rerouteNo="1" devices="tripinfo_car_s2n_21 routing_car_s2n_21" vType="Car" speedFactor="1.05" vaporized=""/>
    <tripinfo id="car_n2s_49" depart="49.00" departLane="n2sep_1" departPos="3.60" departPosLat="0.00" departSpeed="13.90" departDelay="0.00" arrival="192.80" arrivalLane="c2s_1" arrivalPos="990.00" arrivalPosLat="0.00" arrivalSpeed="13.90" duration="143.80" routeLength="1997.01" waitingTime="0.00" waitingCount="0" stopTime="0.00" timeLoss="0.09" rerouteNo="1" devices="tripinfo_car_n2s_49 routing_car_n2s_49" vType="Car" speedFactor="1.00" vaporized=""/>
    <tripinfo id="car_n2s_53" depart="53.00" departLane="n2sep_1" departPos="3.60" departPosLat="0.00" departSpeed="13.90" departDelay="0.00" arrival="194.70" arrivalLane="c2s_1" arrivalPos="990.00" arrivalPosLat="0.00" arrivalSpeed="15.36" duration="141.70" routeLength="1997.01" waitingTime="0.00" waitingCount="0" stopTime="0.00" timeLoss="17.62" rerouteNo="1" devices="tripinfo_car_n2s_53 routing_car_n2s_53" vType="Car" speedFactor="1.16" vaporized=""/>
    <tripinfo id="car_w2e_68" depart="68.00" departLane="w2sep_1" departPos="3.60" departPosLat="0.00" departSpeed="13.90" departDelay="0.00" arrival="208.85" arrivalLane="c2e_1" arrivalPos="990.00" arrivalPosLat="0.00" arrivalSpeed="14.27" duration="140.85" routeLength="1997.01" waitingTime="0.00" waitingCount="0" stopTime="0.00" timeLoss="0.86" rerouteNo="1" devices="tripinfo_car_w2e_68 routing_car_w2e_68" vType="Car" speedFactor="1.03" vaporized=""/>
    <tripinfo id="car_e2n_13" depart="13.00" departLane="e2sep_1" departPos="3.60" departPosLat="0.00" departSpeed="13.90" departDelay="0.00" arrival="209.90" arrivalLane="c2n_1" arrivalPos="990.00" arrivalPosLat="0.00" arrivalSpeed="14.04" duration="196.90" routeLength="1986.69" waitingTime="47.95" waitingCount="1" stopTime="0.00" timeLoss="54.72" rerouteNo="1" devices="tripinfo_car_e2n_13 routing_car_e2n_13" vType="Car" speedFactor="1.01" vaporized=""/>
    <tripinfo id="car_e2s_18" depart="18.00" departLane="e2sep_1" departPos="3.60" departPosLat="0.00" departSpeed="13.90" departDelay="0.00" arrival="211.95" arrivalLane="c2s_1" arrivalPos="990.00" arrivalPosLat="0.00" arrivalSpeed="14.27" duration="193.95" routeLength="1996.47" waitingTime="41.75" waitingCount="1" stopTime="0.00" timeLoss="53.32" rerouteNo="1" devices="tripinfo_car_e2s_18 routing_car_e2s_18" vType="Car" speedFactor="1.03" vaporized=""/>
    <tripinfo id="car_e2n_14" depart="14.45" departLane="e2sep_1" departPos="3.60" departPosLat="0.00" departSpeed="13.90" departDelay="0.45" arrival="212.45" arrivalLane="c2n_1" arrivalPos="990.00" arrivalPosLat="0.00" arrivalSpeed="14.87" duration="198.00" routeLength="1986.69" waitingTime="46.60" waitingCount="1" stopTime="0.00" timeLoss="65.31" rerouteNo="1" devices="tripinfo_car_e2n_14 routing_car_e2n_14" vType="Car" speedFactor="1.08" vaporized=""/>
    <tripinfo id="car_e2n_53" depart="53.00" departLane="e2sep_1" departPos="3.60" departPosLat="0.00" departSpeed="13.90" departDelay="0.00" arrival="216.65" arrivalLane="c2n_1" arrivalPos="990.00" arrivalPosLat="0.00" arrivalSpeed="14.14" duration="163.65" routeLength="1986.69" waitingTime="9.85" waitingCount="1" stopTime="0.00" timeLoss="22.56" rerouteNo="1" devices="tripinfo_car_e2n_53 routing_car_e2n_53" vType="Car" speedFactor="1.02" vaporized=""/>
    <tripinfo id="car_e2s_41" depart="41.00" departLane="e2sep_1" departPos="3.60" departPosLat="0.00" departSpeed="13.90" departDelay="0.00" arrival="217.40" arrivalLane="c2s_1" arrivalPos="990.00" arrivalPosLat="0.00" arrivalSpeed="13.90" duration="176.40" routeLength="1996.47" waitingTime="19.85" waitingCount="1" stopTime="0.00" timeLoss="32.08" rerouteNo="1" devices="tripinfo_car_e2s_41 routing_car_e2s_41" vType="Car" speedFactor="1.00" vaporized=""/>
    <tripinfo id="car_e2s_47" depart="47.00" departLane="e2sep_1" departPos="3.60" departPosLat="0.00" departSpeed="13.90" departDelay="0.00" arrival="220.15" arrivalLane="c2s_1" arrivalPos="990.00" arrivalPosLat="0.00" arrivalSpeed="14.42" duration="173.15" routeLength="1996.47" waitingTime="17.30" waitingCount="1" stopTime="0.00" timeLoss="35.14" rerouteNo="1" devices="tripinfo_car_e2s_47 routing_car_e2s_47" vType="Car" speedFactor="1.05" vaporized=""/>
    <tripinfo id="car_w2n_50" depart="50.00" departLane="w2sep_1" departPos="3.60" departPosLat="0.00" departSpeed="13.90" departDelay="0.00" arrival="220.95" arrivalLane="c2n_1" arrivalPos="990.00" arrivalPosLat="0.00" arrivalSpeed="13.89" duration="170.95" routeLength="1996.47" waitingTime="13.65" waitingCount="2" stopTime="0.00" timeLoss="26.61" rerouteNo="1" devices="tripinfo_car_w2n_50 routing_car_w2n_50" vType="Car" speedFactor="1.00" vaporized=""/>
    <tripinfo id="car_e2s_70" depart="70.00" departLane="e2sep_1" departPos="3.60" departPosLat="0.00" departSpeed="13.90" departDelay="0.00" arrival="222.80" arrivalLane="c2s_1" arrivalPos="990.00" arrivalPosLat="0.00" arrivalSpeed="14.43" duration="152.80" routeLength="1996.47" waitingTime="0.00" waitingCount="0" stopTime="0.00" timeLoss="14.97" rerouteNo="1" devices="tripinfo_car_e2s_70 routing_car_e2s_70" vType="Car" speedFactor="1.05" vaporized=""/>
    <tripinfo id="car_w2e_79" depart="79.00" departLane="w2sep_1" departPos="3.60" departPosLat="0.00" departSpeed="13.90" departDelay="0.00" arrival="223.20" arrivalLane="c2e_1" arrivalPos="990.00" arrivalPosLat="0.00" arrivalSpeed="13.90" duration="144.20" routeLength="1997.01" waitingTime="0.00" waitingCount="0" stopTime="0.00" timeLoss="0.50" rerouteNo="1" devices="tripinfo_car_w2e_79 routing_car_w2e_79" vType="Car" speedFactor="1.00" vaporized=""/>
    <tripinfo id="car_e2s_85" depart="85.00" departLane="e2sep_1" departPos="3.60" departPosLat="0.00" departSpeed="13.90" departDelay="0.00" arrival="224.70" arrivalLane="c2s_1" arrivalPos="990.00" arrivalPosLat="0.00" arrivalSpeed="15.33" duration="139.70" routeLength="1996.47" waitingTime="0.00" waitingCount="0" stopTime="0.00" timeLoss="14.67" rerouteNo="1" devices="tripinfo_car_e2s_85 routing_car_e2s_85" vType="Car" speedFactor="1.15" vaporized=""/>
    <tripinfo id="car_e2n_77" depart="77.00" departLane="e2sep_1" departPos="3.60" departPosLat="0.00" departSpeed="13.90" departDelay="0.00" arrival="225.65" arrivalLane="c2n_1" arrivalPos="990.00" arrivalPosLat="0.00" arrivalSpeed="13.89" duration="148.65" routeLength="1986.69" waitingTime="0.00" waitingCount="0" stopTime="0.00" timeLoss="4.98" rerouteNo="1" devices="tripinfo_car_e2n_77 routing_car_e2n_77" vType="Car" speedFactor="1.00" vaporized=""/>
    <tripinfo id="car_w2s_91" depart="91.00" departLane="w2sep_1" departPos="3.60" departPosLat="0.00" departSpeed="13.90" departDelay="0.00" arrival="238.35" arrivalLane="c2s_1" arrivalPos="990.00" arrivalPosLat="0.00" arrivalSpeed="13.90" duration="147.35" routeLength="1986.69" waitingTime="0.00" waitingCount="0" stopTime="0.00" timeLoss="3.69" rerouteNo="1" devices="tripinfo_car_w2s_91 routing_car_w2s_91" vType="Car" speedFactor="1.00" vaporized=""/>
    <tripinfo id="car_w2n_92" depart="92.45" departLane="w2sep_1" departPos="3.60" departPosLat="0.00" departSpeed="13.90" departDelay="0.45" arrival="240.80" arrivalLane="c2n_1" arrivalPos="990.00" arrivalPosLat="0.00" arrivalSpeed="14.17" duration="148.35" routeLength="1996.47" waitingTime="0.00" waitingCount="0" stopTime="0.00" timeLoss="6.80" rerouteNo="1" devices="tripinfo_car_w2n_92 routing_car_w2n_92" vType="Car" speedFactor="1.02" vaporized=""/>
    <tripinfo id="car_e2s_86" depart="86.25" departLane="e2sep_1" departPos="3.60" departPosLat="0.00" departSpeed="13.90" departDelay="0.25" arrival="242.80" arrivalLane="c2s_1" arrivalPos="990.00" arrivalPosLat="0.00" arrivalSpeed="13.96" duration="156.55" routeLength="1996.47" waitingTime="3.50" waitingCount="1" stopTime="0.00" timeLoss="12.96" rerouteNo="1" devices="tripinfo_car_e2s_86 routing_car_e2s_86" vType="Car" speedFactor="1.01" vaporized=""/>
    <tripinfo id="car_e2s_95" depart="95.00" departLane="e2sep_1" departPos="3.60" departPosLat="0.00" departSpeed="13.90" departDelay="0.00" arrival="244.60" arrivalLane="c2s_1" arrivalPos="990.00" arrivalPosLat="0.00" arrivalSpeed="15.45" duration="149.60" routeLength="1996.47" waitingTime="2.65" waitingCount="1" stopTime="0.00" timeLoss="27.26" rerouteNo="1" devices="tripinfo_car_e2s_95 routing_car_e2s_95" vType="Car" speedFactor="1.18" vaporized=""/>
    <tripinfo id="car_w2n_101" depart="101.00" departLane="w2sep_1" departPos="3.60" departPosLat="0.00" departSpeed="13.90" departDelay="0.00" arrival="246.10" arrivalLane="c2n_1" arrivalPos="990.00" arrivalPosLat="0.00" arrivalSpeed="14.32" duration="145.10" routeLength="1996.47" waitingTime="0.00" waitingCount="0" stopTime="0.00" timeLoss="5.01" rerouteNo="1" devices="tripinfo_car_w2n_101 routing_car_w2n_101" vType="Car" speedFactor="1.03" vaporized=""/>
    <tripinfo id="car_s2n_71" depart="71.00" departLane="s2sep_1" departPos="3.60" departPosLat="0.00" departSpeed="13.90" departDelay="0.00" arrival="250.80" arrivalLane="c2n_1" arrivalPos="990.00" arrivalPosLat="0.00" arrivalSpeed="15.59" duration="179.80" routeLength="1997.01" waitingTime="42.20" waitingCount="1" stopTime="0.00" timeLoss="51.86" rerouteNo="1" devices="tripinfo_car_s2n_71 routing_car_s2n_71" vType="Car" speedFactor="1.12" vaporized=""/>
    <tripinfo id="car_s2n_83" depart="83.00" departLane="s2sep_1" departPos="3.60" departPosLat="0.00" departSpeed="13.90" departDelay="0.00" arrival="253.75" arrivalLane="c2n_1" arrivalPos="990.00" arrivalPosLat="0.00" arrivalSpeed="16.26" duration="170.75" routeLength="1997.01" waitingTime="25.40" waitingCount="1" stopTime="0.00" timeLoss="48.81" rerouteNo="1" devices="tripinfo_car_s2n_83 routing_car_s2n_83" vType="Car" speedFactor="1.18" vaporized=""/>
    <tripinfo id="car_n2w_63" depart="63.00" departLane="n2sep_1" departPos="3.60" departPosLat="0.00" departSpeed="13.90" departDelay="0.00" arrival="254.90" arrivalLane="c2w_1" arrivalPos="990.00" arrivalPosLat="0.00" arrivalSpeed="14.04" duration="191.90" routeLength="1986.69" waitingTime="40.15" waitingCount="1" stopTime="0.00" timeLoss="49.69" rerouteNo="1" devices="tripinfo_car_n2w_63 routing_car_n2w_63" vType="Car" speedFactor="1.01" vaporized=""/>
    <tripinfo id="car_s2e_52" depart="52.00" departLane="s2sep_1" departPos="3.60" departPosLat="0.00" departSpeed="13.90" departDelay="0.00" arrival="255.65" arrivalLane="c2e_1" arrivalPos="990.00" arrivalPosLat="0.00" arrivalSpeed="13.90" duration="203.65" routeLength="1986.69" waitingTime="53.30" waitingCount="1" stopTime="0.00" timeLoss="59.96" rerouteNo="1" devices="tripinfo_car_s2e_52 routing_car_s2e_52" vType="Car" speedFactor="1.00" vaporized=""/>
    <tripinfo id="car_n2w_66" depart="66.00" departLane="n2sep_1" departPos="3.60" departPosLat="0.00" departSpeed="13.90" departDelay="0.00" arrival="257.35" arrivalLane="c2w_1" arrivalPos="990.00" arrivalPosLat="0.00" arrivalSpeed="14.94" duration="191.35" routeLength="1986.69" waitingTime="39.05" waitingCount="1" stopTime="0.00" timeLoss="59.63" rerouteNo="1" devices="tripinfo_car_n2w_66 routing_car_n2w_66" vType="Car" speedFactor="1.09" vaporized=""/>
    <tripinfo id="car_n2w_81" depart="81.00" departLane="n2sep_1" departPos="3.60" departPosLat="0.00" departSpeed="13.90" departDelay="0.00" arrival="259.50" arrivalLane="c2w_1" arrivalPos="990.00" arrivalPosLat="0.00" arrivalSpeed="15.34" duration="178.50" routeLength="1986.69" waitingTime="33.65" waitingCount="1" stopTime="0.00" timeLoss="51.56" rerouteNo="1" devices="tripinfo_car_n2w_81 routing_car_n2w_81" vType="Car" speedFactor="1.13" vaporized=""/>
    <tripinfo id="car_s2e_81" depart="81.00" departLane="s2sep_1" departPos="3.60" departPosLat="0.00" departSpeed="13.90" departDelay="0.00" arrival="261.25" arrivalLane="c2e_1" arrivalPos="990.00" arrivalPosLat="0.00" arrivalSpeed="13.90" duration="180.25" routeLength="1986.69" waitingTime="26.00" waitingCount="1" stopTime="0.00" timeLoss="36.58" rerouteNo="1" devices="tripinfo_car_s2e_81 routing_car_s2e_81" vType="Car" speedFactor="1.00" vaporized=""/>
    <tripinfo id="car_n2s_108" depart="108.30" departLane="n2sep_1" departPos="3.60" departPosLat="0.00" departSpeed="13.90" departDelay="0.30" arrival="261.45" arrivalLane="c2s_1" arrivalPos="990.00" arrivalPosLat="0.00" arrivalSpeed="15.12" duration="153.15" routeLength="1997.01" waitingTime="5.60" waitingCount="1" stopTime="0.00" timeLoss="21.10" rerouteNo="1" devices="tripinfo_car_n2s_108 routing_car_n2s_108" vType="Car" speedFactor="1.09" vaporized=""/>
    <tripinfo id="car_n2w_100" depart="100.00" departLane="n2sep_1" departPos="3.60" departPosLat="0.00" departSpeed="13.90" departDelay="0.00" arrival="261.55" arrivalLane="c2w_1" arrivalPos="990.00" arrivalPosLat="0.00" arrivalSpeed="15.59" duration="161.55" routeLength="1986.69" waitingTime="15.50" waitingCount="1" stopTime="0.00" timeLoss="37.48" rerouteNo="1" devices="tripinfo_car_n2w_100 routing_car_n2w_100" vType="Car" speedFactor="1.16" vaporized=""/>
    <tripinfo id="car_n2w_107" depart="107.00" departLane="n2sep_1" departPos="3.60" departPosLat="0.00" departSpeed="13.90" departDelay="0.00" arrival="264.10" arrivalLane="c2w_1" arrivalPos="990.00" arrivalPosLat="0.00" arrivalSpeed="15.02" duration="157.10" routeLength="1986.69" waitingTime="7.95" waitingCount="1" stopTime="0.00" timeLoss="25.54" rerouteNo="1" devices="tripinfo_car_n2w_107 routing_car_n2w_107" vType="Car" speedFactor="1.09" vaporized=""/>
    <tripinfo id="car_s2e_94" depart="94.00" departLane="s2sep_1" departPos="3.60" departPosLat="0.00" departSpeed="13.90" departDelay="0.00" arrival="266.00" arrivalLane="c2e_1" arrivalPos="990.00" arrivalPosLat="0.00" arrivalSpeed="13.89" duration="172.00" routeLength="1986.69" waitingTime="15.40" waitingCount="1" stopTime="0.00" timeLoss="28.35" rerouteNo="1" devices="tripinfo_car_s2e_94 routing_car_s2e_94" vType="Car" speedFactor="1.00" vaporized=""/>
    <tripinfo id="car_s2w_87" depart="87.00" departLane="s2sep_1" departPos="3.60" departPosLat="0.00" departSpeed="13.90" departDelay="0.00" arrival="266.10" arrivalLane="c2w_1" arrivalPos="990.00" arrivalPosLat="0.00" arrivalSpeed="15.70" duration="179.10" routeLength="1996.47" waitingTime="30.60" waitingCount="2" stopTime="0.00" timeLoss="55.91" rerouteNo="1" devices="tripinfo_car_s2w_87 routing_car_s2w_87" vType="Car" speedFactor="1.17" vaporized=""/>
    <tripinfo id="car_s2e_124" depart="124.00" departLane="s2sep_1" departPos="3.60" departPosLat="0.00" departSpeed="13.90" departDelay="0.00" arrival="272.15" arrivalLane="c2e_1" arrivalPos="990.00" arrivalPosLat="0.00" arrivalSpeed="13.90" duration="148.15" routeLength="1986.69" waitingTime="0.00" waitingCount="0" stopTime="0.00" timeLoss="4.46" rerouteNo="1" devices="tripinfo_car_s2e_124 routing_car_s2e_124" vType="Car" speedFactor="1.00" vaporized=""/>
    <tripinfo id="car_s2w_139" depart="139.00" departLane="s2sep_1" departPos="3.60" departPosLat="0.00" departSpeed="13.90" departDelay="0.00" arrival="276.70" arrivalLane="c2w_1" arrivalPos="990.00" arrivalPosLat="0.00" arrivalSpeed="15.05" duration="137.70" routeLength="1996.47" waitingTime="0.00" waitingCount="0" stopTime="0.00" timeLoss="4.35" rerouteNo="1" devices="tripinfo_car_s2w_139 routing_car_s2w_139" vType="Car" speedFactor="1.08" vaporized=""/>
    <tripinfo id="car_s2e_129" depart="129.00" departLane="s2sep_1" departPos="3.60" departPosLat="0.00" departSpeed="13.90" departDelay="0.00" arrival="277.80" arrivalLane="c2e_1" arrivalPos="990.00" arrivalPosLat="0.00" arrivalSpeed="13.90" duration="148.80" routeLength="1986.69" waitingTime="0.00" waitingCount="0" stopTime="0.00" timeLoss="5.12" rerouteNo="1" devices="tripinfo_car_s2e_129 routing_car_s2e_129" vType="Car" speedFactor="1.00" vaporized=""/>
    <tripinfo id="bus_n2e_61" depart="61.00" departLane="n2sep_1" departPos="12.10" departPosLat="0.00" departSpeed="13.90" departDelay="0.00" arrival="284.30" arrivalLane="c2e_1" arrivalPos="990.00" arrivalPosLat="0.00" arrivalSpeed="13.89" duration="223.30" routeLength="1987.97" waitingTime="64.60" waitingCount="2" stopTime="0.00" timeLoss="79.59" rerouteNo="1" devices="tripinfo_bus_n2e_61 routing_bus_n2e_61" vType="Bus" speedFactor="1.00" vaporized=""/>
    <tripinfo id="car_n2e_96" depart="96.00" departLane="n2sep_1" departPos="3.60" departPosLat="0.00" departSpeed="13.90" departDelay="0.00" arrival="287.05" arrivalLane="c2e_1" arrivalPos="990.00" arrivalPosLat="0.00" arrivalSpeed="15.07" duration="191.05" routeLength="1996.47" waitingTime="35.25" waitingCount="2" stopTime="0.00" timeLoss="60.10" rerouteNo="1" devices="tripinfo_car_n2e_96 routing_car_n2e_96" vType="Car" speedFactor="1.10" vaporized=""/>
    <tripinfo id="car_n2e_127" depart="127.00" departLane="n2sep_1" departPos="3.60" departPosLat="0.00" departSpeed="13.90" departDelay="0.00" arrival="291.05" arrivalLane="c2e_1" arrivalPos="990.00" arrivalPosLat="0.00" arrivalSpeed="13.89" duration="164.05" routeLength="1996.47" waitingTime="5.35" waitingCount="1" stopTime="0.00" timeLoss="19.74" rerouteNo="1" devices="tripinfo_car_n2e_127 routing_car_n2e_127" vType="Car" speedFactor="1.00" vaporized=""/>
    <tripinfo id="car_n2e_134" depart="134.00" departLane="n2sep_1" departPos="3.60" departPosLat="0.00" departSpeed="13.90" departDelay="0.00" arrival="294.30" arrivalLane="c2e_1" arrivalPos="990.00" arrivalPosLat="0.00" arrivalSpeed="13.90" duration="160.30" routeLength="1996.47" waitingTime="0.00" waitingCount="0" stopTime="0.00" timeLoss="16.44" rerouteNo="1" devices="tripinfo_car_n2e_134 routing_car_n2e_134" vType="Car" speedFactor="1.00" vaporized=""/>
    <tripinfo id="car_w2s_108" depart="108.00" departLane="w2sep_1" departPos="3.60" departPosLat="0.00" departSpeed="13.90" departDelay="0.00" arrival="297.70" arrivalLane="c2s_1" arrivalPos="990.00" arrivalPosLat="0.00" arrivalSpeed="14.50" duration="189.70" routeLength="1986.69" waitingTime="44.45" waitingCount="1" stopTime="0.00" timeLoss="52.04" rerouteNo="1" devices="tripinfo_car_w2s_108 routing_car_w2s_108" vType="Car" speedFactor="1.04" vaporized=""/>
    <tripinfo id="car_e2w_106" depart="106.00" departLane="e2sep_1" departPos="3.60" departPosLat="0.00" departSpeed="13.90" departDelay="0.00" arrival="299.50" arrivalLane="c2w_1" arrivalPos="990.00" arrivalPosLat="0.00" arrivalSpeed="14.15" duration="193.50" routeLength="1997.01" waitingTime="45.35" waitingCount="1" stopTime="0.00" timeLoss="52.35" rerouteNo="1" devices="tripinfo_car_e2w_106 routing_car_e2w_106" vType="Car" speedFactor="1.02" vaporized=""/>
    <tripinfo id="car_e2n_131" depart="131.00" departLane="e2sep_1" departPos="3.60" departPosLat="0.00" departSpeed="13.90" departDelay="0.00" arrival="301.80" arrivalLane="c2n_1" arrivalPos="990.00" arrivalPosLat="0.00" arrivalSpeed="14.13" duration="170.80" routeLength="1986.69" waitingTime="20.95" waitingCount="1" stopTime="0.00" timeLoss="29.48" rerouteNo="1" devices="tripinfo_car_e2n_131 routing_car_e2n_131" vType="Car" speedFactor="1.02" vaporized=""/>
    <tripinfo id="car_w2s_112" depart="112.00" departLane="w2sep_1" departPos="3.60" departPosLat="0.00" departSpeed="13.90" departDelay="0.00" arrival="303.75" arrivalLane="c2s_1" arrivalPos="990.00" arrivalPosLat="0.00" arrivalSpeed="14.04" duration="191.75" routeLength="1986.69" waitingTime="39.00" waitingCount="1" stopTime="0.00" timeLoss="49.52" rerouteNo="1" devices="tripinfo_car_w2s_112 routing_car_w2s_112" vType="Car" speedFactor="1.01" vaporized=""/>
    <tripinfo id="car_w2e_114" depart="114.00" departLane="w2sep_1" departPos="3.60" departPosLat="0.00" departSpeed="13.90" departDelay="0.00" arrival="305.30" arrivalLane="c2e_1" arrivalPos="990.00" arrivalPosLat="0.00" arrivalSpeed="13.90" duration="191.30" routeLength="1997.01" waitingTime="36.00" waitingCount="1" stopTime="0.00" timeLoss="47.61" rerouteNo="1" devices="tripinfo_car_w2e_114 routing_car_w2e_114" vType="Car" speedFactor="1.00" vaporized=""/>
    <tripinfo id="car_w2s_130" depart="130.00" departLane="w2sep_1" departPos="3.60" departPosLat="0.00" departSpeed="13.90" departDelay="0.00" arrival="305.65" arrivalLane="c2s_1" arrivalPos="990.00" arrivalPosLat="0.00" arrivalSpeed="15.48" duration="175.65" routeLength="1986.69" waitingTime="32.70" waitingCount="1" stopTime="0.00" timeLoss="52.71" rerouteNo="1" devices="tripinfo_car_w2s_130 routing_car_w2s_130" vType="Car" speedFactor="1.17" vaporized=""/>
    <tripinfo id="car_e2n_135" depart="135.00" departLane="e2sep_1" departPos="3.60" departPosLat="0.00" departSpeed="13.90" departDelay="0.00" arrival="307.05" arrivalLane="c2n_1" arrivalPos="990.00" arrivalPosLat="0.00" arrivalSpeed="13.90" duration="172.05" routeLength="1986.69" waitingTime="16.35" waitingCount="1" stopTime="0.00" timeLoss="28.37" rerouteNo="1" devices="tripinfo_car_e2n_135 routing_car_e2n_135" vType="Car" speedFactor="1.00" vaporized=""/>
    <tripinfo id="car_w2e_134" depart="134.00" departLane="w2sep_1" departPos="3.60" departPosLat="0.00" departSpeed="13.90" departDelay="0.00" arrival="307.60" arrivalLane="c2e_1" arrivalPos="990.00" arrivalPosLat="0.00" arrivalSpeed="14.94" duration="173.60" routeLength="1997.01" waitingTime="26.00" waitingCount="1" stopTime="0.00" timeLoss="42.46" rerouteNo="1" devices="tripinfo_car_w2e_134 routing_car_w2e_134" vType="Car" speedFactor="1.10" vaporized=""/>
    <tripinfo id="car_w2s_142" depart="142.00" departLane="w2sep_1" departPos="3.60" departPosLat="0.00" departSpeed="13.90" departDelay="0.00" arrival="307.90" arrivalLane="c2s_1" arrivalPos="990.00" arrivalPosLat="0.00" arrivalSpeed="15.26" duration="165.90" routeLength="1986.69" waitingTime="16.60" waitingCount="1" stopTime="0.00" timeLoss="37.55" rerouteNo="1" devices="tripinfo_car_w2s_142 routing_car_w2s_142" vType="Car" speedFactor="1.12" vaporized=""/>
    <tripinfo id="car_e2w_138" depart="138.50" departLane="e2sep_1" departPos="3.60" departPosLat="0.00" departSpeed="13.90" departDelay="0.50" arrival="308.25" arrivalLane="c2w_1" arrivalPos="990.00" arrivalPosLat="0.00" arrivalSpeed="14.23" duration="169.75" routeLength="1997.01" waitingTime="13.95" waitingCount="1" stopTime="0.00" timeLoss="29.36" rerouteNo="1" devices="tripinfo_car_e2w_138 routing_car_e2w_138" vType="Car" speedFactor="1.02" vaporized=""/>
    <tripinfo id="car_e2n_137" depart="137.00" departLane="e2sep_1" departPos="3.60" departPosLat="0.00" departSpeed="13.90" departDelay="0.00" arrival="308.95" arrivalLane="c2n_1" arrivalPos="990.00" arrivalPosLat="0.00" arrivalSpeed="15.20" duration="171.95" routeLength="1986.69" waitingTime="15.70" waitingCount="1" stopTime="0.00" timeLoss="46.22" rerouteNo="1" devices="tripinfo_car_e2n_137 routing_car_e2n_137" vType="Car" speedFactor="1.14" vaporized=""/>
    <tripinfo id="car_e2w_148" depart="148.00" departLane="e2sep_1" departPos="3.60" departPosLat="0.00" departSpeed="13.90" departDelay="0.00" arrival="310.25" arrivalLane="c2w_1" arrivalPos="990.00" arrivalPosLat="0.00" arrivalSpeed="15.49" duration="162.25" routeLength="1997.01" waitingTime="4.65" waitingCount="1" stopTime="0.00" timeLoss="37.80" rerouteNo="1" devices="tripinfo_car_e2w_148 routing_car_e2w_148" vType="Car" speedFactor="1.15" vaporized=""/>
    <tripinfo id="car_e2n_139" depart="140.30" departLane="e2sep_1" departPos="3.60" departPosLat="0.00" departSpeed="13.90" departDelay="1.30" arrival="311.00" arrivalLane="c2n_1" arrivalPos="990.00" arrivalPosLat="0.00" arrivalSpeed="15.25" duration="170.70" routeLength="1986.69" waitingTime="13.25" waitingCount="1" stopTime="0.00" timeLoss="43.76" rerouteNo="1" devices="tripinfo_car_e2n_139 routing_car_e2n_139" vType="Car" speedFactor="1.13" vaporized=""/>
    <tripinfo id="car_e2n_153" depart="153.00" departLane="e2sep_1" departPos="3.60" departPosLat="0.00" departSpeed="13.90" departDelay="0.00" arrival="312.90" arrivalLane="c2n_1" arrivalPos="990.00" arrivalPosLat="0.00" arrivalSpeed="15.58" duration="159.90" routeLength="1986.69" waitingTime="4.05" waitingCount="1" stopTime="0.00" timeLoss="37.30" rerouteNo="1" devices="tripinfo_car_e2n_153 routing_car_e2n_153" vType="Car" speedFactor="1.17" vaporized=""/>
    <tripinfo id="car_w2e_155" depart="155.00" departLane="w2sep_1" departPos="3.60" departPosLat="0.00" departSpeed="13.90" departDelay="0.00" arrival="312.95" arrivalLane="c2e_1" arrivalPos="990.00" arrivalPosLat="0.00" arrivalSpeed="14.20" duration="157.95" routeLength="1997.01" waitingTime="3.55" waitingCount="1" stopTime="0.00" timeLoss="17.38" rerouteNo="1" devices="tripinfo_car_w2e_155 routing_car_w2e_155" vType="Car" speedFactor="1.02" vaporized=""/>
    <tripinfo id="car_e2s_107" depart="107.45" departLane="e2sep_1" departPos="3.60" departPosLat="0.00" departSpeed="13.90" departDelay="0.45" arrival="314.55" arrivalLane="c2s_1" arrivalPos="990.00" arrivalPosLat="0.00" arrivalSpeed="14.42" duration="207.10" routeLength="1996.47" waitingTime="53.45" waitingCount="2" stopTime="0.00" timeLoss="68.04" rerouteNo="1" devices="tripinfo_car_e2s_107 routing_car_e2s_107" vType="Car" speedFactor="1.04" vaporized=""/>
    <tripinfo id="car_e2n_164" depart="164.00" departLane="e2sep_1" departPos="3.60" departPosLat="0.00" departSpeed="13.90" departDelay="0.00" arrival="316.50" arrivalLane="c2n_1" arrivalPos="990.00" arrivalPosLat="0.00" arrivalSpeed="14.64" duration="152.50" routeLength="1986.69" waitingTime="0.00" waitingCount="0" stopTime="0.00" timeLoss="16.41" rerouteNo="1" devices="tripinfo_car_e2n_164 routing_car_e2n_164" vType="Car" speedFactor="1.06" vaporized=""/>
    <tripinfo id="car_e2n_174" depart="174.00" departLane="e2sep_1" departPos="3.60" departPosLat="0.00" departSpeed="13.90" departDelay="0.00" arrival="319.30" arrivalLane="c2n_1" arrivalPos="990.00" arrivalPosLat="0.00" arrivalSpeed="14.99" duration="145.30" routeLength="1986.69" waitingTime="0.00" waitingCount="0" stopTime="0.00" timeLoss="13.11" rerouteNo="1" devices="tripinfo_car_e2n_174 routing_car_e2n_174" vType="Car" speedFactor="1.09" vaporized=""/>
    <tripinfo id="car_e2s_142" depart="142.05" departLane="e2sep_1" departPos="3.60" departPosLat="0.00" departSpeed="13.90" departDelay="0.05" arrival="319.50" arrivalLane="c2s_1" arrivalPos="990.00" arrivalPosLat="0.00" arrivalSpeed="14.11" duration="177.45" routeLength="1996.47" waitingTime="15.30" waitingCount="2" stopTime="0.00" timeLoss="35.37" rerouteNo="1" devices="tripinfo_car_e2s_142 routing_car_e2s_142" vType="Car" speedFactor="1.02" vaporized=""/>
    <tripinfo id="car_e2s_143" depart="143.95" departLane="e2sep_1" departPos="3.60" departPosLat="0.00" departSpeed="13.90" departDelay="0.95" arrival="323.75" arrivalLane="c2s_1" arrivalPos="990.00" arrivalPosLat="0.00" arrivalSpeed="13.89" duration="179.80" routeLength="1996.47" waitingTime="11.20" waitingCount="2" stopTime="0.00" timeLoss="35.49" rerouteNo="1" devices="tripinfo_car_e2s_143 routing_car_e2s_143" vType="Car" speedFactor="1.00" vaporized=""/>
    <tripinfo id="car_w2n_137" depart="137.00" departLane="w2sep_1" departPos="3.60" departPosLat="0.00" departSpeed="13.90" departDelay="0.00" arrival="325.20" arrivalLane="c2n_1" arrivalPos="990.00" arrivalPosLat="0.00" arrivalSpeed="13.90" duration="188.20" routeLength="1996.47" waitingTime="31.25" waitingCount="2" stopTime="0.00" timeLoss="43.86" rerouteNo="1" devices="tripinfo_car_w2n_137 routing_car_w2n_137" vType="Car" speedFactor="1.00" vaporized=""/>
    <tripinfo id="car_e2s_145" depart="145.85" departLane="e2sep_1" departPos="3.60" departPosLat="0.00" departSpeed="13.90" departDelay="0.85" arrival="325.55" arrivalLane="c2s_1" arrivalPos="990.00" arrivalPosLat="0.00" arrivalSpeed="15.41" duration="179.70" routeLength="1996.47" waitingTime="9.85" waitingCount="2" stopTime="0.00" timeLoss="57.23" rerouteNo="1" devices="tripinfo_car_e2s_145 routing_car_e2s_145" vType="Car" speedFactor="1.18" vaporized=""/>
    <tripinfo id="car_e2w_183" depart="183.00" departLane="e2sep_1" departPos="3.60" departPosLat="0.00" departSpeed="13.90" departDelay="0.00" arrival="327.30" arrivalLane="c2w_1" arrivalPos="990.00" arrivalPosLat="0.00" arrivalSpeed="13.90" duration="144.30" routeLength="1997.01" waitingTime="0.00" waitingCount="0" stopTime="0.00" timeLoss="0.61" rerouteNo="1" devices="tripinfo_car_e2w_183 routing_car_e2w_183" vType="Car" speedFactor="1.00" vaporized=""/>
    <tripinfo id="car_e2s_154" depart="154.30" departLane="e2sep_1" departPos="3.60" departPosLat="0.00" departSpeed="13.90" departDelay="0.30" arrival="328.30" arrivalLane="c2s_1" arrivalPos="990.00" arrivalPosLat="0.00" arrivalSpeed="14.35" duration="174.00" routeLength="1996.47" waitingTime="6.90" waitingCount="1" stopTime="0.00" timeLoss="35.22" rerouteNo="1" devices="tripinfo_car_e2s_154 routing_car_e2s_154" vType="Car" speedFactor="1.04" vaporized=""/>
    <tripinfo id="car_w2n_167" depart="167.00" departLane="w2sep_1" departPos="3.60" departPosLat="0.00" departSpeed="13.90" departDelay="0.00" arrival="331.25" arrivalLane="c2n_1" arrivalPos="990.00" arrivalPosLat="0.00" arrivalSpeed="13.90" duration="164.25" routeLength="1996.47" waitingTime="8.40" waitingCount="2" stopTime="0.00" timeLoss="19.92" rerouteNo="1" devices="tripinfo_car_w2n_167 routing_car_w2n_167" vType="Car" speedFactor="1.00" vaporized=""/>
    <tripinfo id="car_w2n_181" depart="181.00" departLane="w2sep_1" departPos="3.60" departPosLat="0.00" departSpeed="13.90" departDelay="0.00" arrival="334.30" arrivalLane="c2n_1" arrivalPos="990.00" arrivalPosLat="0.00" arrivalSpeed="14.31" duration="153.30" routeLength="1996.47" waitingTime="0.70" waitingCount="1" stopTime="0.00" timeLoss="13.77" rerouteNo="1" devices="tripinfo_car_w2n_181 routing_car_w2n_181" vType="Car" speedFactor="1.03" vaporized=""/>
    <tripinfo id="car_w2n_186" depart="186.00" departLane="w2sep_1" departPos="3.60" departPosLat="0.00" departSpeed="13.90" departDelay="0.00" arrival="337.60" arrivalLane="c2n_1" arrivalPos="990.00" arrivalPosLat="0.00" arrivalSpeed="14.09" duration="151.60" routeLength="1996.47" waitingTime="0.00" waitingCount="0" stopTime="0.00" timeLoss="9.69" rerouteNo="1" devices="tripinfo_car_w2n_186 routing_car_w2n_186" vType="Car" speedFactor="1.02" vaporized=""/>
    <tripinfo id="car_s2e_186" depart="186.00" departLane="s2sep_1" departPos="3.60" departPosLat="0.00" departSpeed="13.90" departDelay="0.00" arrival="343.35" arrivalLane="c2e_1" arrivalPos="990.00" arrivalPosLat="0.00" arrivalSpeed="15.95" duration="157.35" routeLength="1986.69" waitingTime="20.65" waitingCount="1" stopTime="0.00" timeLoss="32.14" rerouteNo="1" devices="tripinfo_car_s2e_186 routing_car_s2e_186" vType="Car" speedFactor="1.15" vaporized=""/>
    <tripinfo id="car_n2s_150" depart="150.00" departLane="n2sep_1" departPos="3.60" departPosLat="0.00" departSpeed="13.90" departDelay="0.00" arrival="345.40" arrivalLane="c2s_1" arrivalPos="990.00" arrivalPosLat="0.00" arrivalSpeed="13.97" duration="195.40" routeLength="1997.01" waitingTime="45.50" waitingCount="1" stopTime="0.00" timeLoss="52.45" rerouteNo="1" devices="tripinfo_car_n2s_150 routing_car_n2s_150" vType="Car" speedFactor="1.01" vaporized=""/>
    <tripinfo id="car_s2n_158" depart="158.00" departLane="s2sep_1" departPos="3.60" departPosLat="0.00" departSpeed="13.90" departDelay="0.00" arrival="346.00" arrivalLane="c2n_1" arrivalPos="990.00" arrivalPosLat="0.00" arrivalSpeed="13.90" duration="188.00" routeLength="1997.01" waitingTime="37.00" waitingCount="1" stopTime="0.00" timeLoss="44.32" rerouteNo="1" devices="tripinfo_car_s2n_158 routing_car_s2n_158" vType="Car" speedFactor="1.00" vaporized=""/>
    <tripinfo id="car_n2w_186" depart="186.00" departLane="n2sep_1" departPos="3.60" departPosLat="0.00" departSpeed="13.90" departDelay="0.00" arrival="348.15" arrivalLane="c2w_1" arrivalPos="990.00" arrivalPosLat="0.00" arrivalSpeed="14.32" duration="162.15" routeLength="1986.69" waitingTime="12.85" waitingCount="1" stopTime="0.00" timeLoss="22.70" rerouteNo="1" devices="tripinfo_car_n2w_186 routing_car_n2w_186" vType="Car" speedFactor="1.03" vaporized=""/>
    <tripinfo id="car_n2s_156" depart="156.00" departLane="n2sep_1" departPos="3.60" departPosLat="0.00" departSpeed="13.90" departDelay="0.00" arrival="349.10" arrivalLane="c2s_1" arrivalPos="990.00" arrivalPosLat="0.00" arrivalSpeed="14.19" duration="193.10" routeLength="1997.01" waitingTime="40.90" waitingCount="1" stopTime="0.00" timeLoss="52.65" rerouteNo="1" devices="tripinfo_car_n2s_156 routing_car_n2s_156" vType="Car" speedFactor="1.02" vaporized=""/>
    <tripinfo id="car_s2n_169" depart="169.25" departLane="s2sep_1" departPos="3.60" departPosLat="0.00" departSpeed="13.90" departDelay="0.25" arrival="349.20" arrivalLane="c2n_1" arrivalPos="990.00" arrivalPosLat="0.00" arrivalSpeed="14.29" duration="179.95" routeLength="1997.01" waitingTime="27.35" waitingCount="1" stopTime="0.00" timeLoss="40.79" rerouteNo="1" devices="tripinfo_car_s2n_169 routing_car_s2n_169" vType="Car" speedFactor="1.03" vaporized=""/>
    <tripinfo id="car_s2n_173" depart="173.00" departLane="s2sep_1" departPos="3.60" departPosLat="0.00" departSpeed="13.90" departDelay="0.00" arrival="351.40" arrivalLane="c2n_1" arrivalPos="990.00" arrivalPosLat="0.00" arrivalSpeed="14.97" duration="178.40" routeLength="1997.01" waitingTime="26.35" waitingCount="1" stopTime="0.00" timeLoss="48.04" rerouteNo="1" devices="tripinfo_car_s2n_173 routing_car_s2n_173" vType="Car" speedFactor="1.10" vaporized=""/>
    <tripinfo id="car_n2s_190" depart="190.00" departLane="n2sep_1" departPos="3.60" departPosLat="0.00" departSpeed="13.90" departDelay="0.00" arrival="352.90" arrivalLane="c2s_1" arrivalPos="990.00" arrivalPosLat="0.00" arrivalSpeed="14.47" duration="162.90" routeLength="1997.01" waitingTime="7.80" waitingCount="1" stopTime="0.00" timeLoss="25.09" rerouteNo="1" devices="tripinfo_car_n2s_190 routing_car_n2s_190" vType="Car" speedFactor="1.04" vaporized=""/>
    <tripinfo id="car_n2w_187" depart="187.40" departLane="n2sep_1" departPos="3.60" departPosLat="0.00" departSpeed="13.90" departDelay="0.40" arrival="353.95" arrivalLane="c2w_1" arrivalPos="990.00" arrivalPosLat="0.00" arrivalSpeed="13.90" duration="166.55" routeLength="1986.69" waitingTime="9.05" waitingCount="1" stopTime="0.00" timeLoss="22.90" rerouteNo="1" devices="tripinfo_car_n2w_187 routing_car_n2w_187" vType="Car" speedFactor="1.00" vaporized=""/>
    <tripinfo id="car_n2e_174" depart="174.00" departLane="n2sep_1" departPos="3.60" departPosLat="0.00" departSpeed="13.90" departDelay="0.00" arrival="355.20" arrivalLane="c2e_1" arrivalPos="990.00" arrivalPosLat="0.00" arrivalSpeed="14.00" duration="181.20" routeLength="1996.47" waitingTime="26.70" waitingCount="2" stopTime="0.00" timeLoss="37.93" rerouteNo="1" devices="tripinfo_car_n2e_174 routing_car_n2e_174" vType="Car" speedFactor="1.01" vaporized=""/>
    <tripinfo id="car_n2w_198" depart="198.00" departLane="n2sep_1" departPos="3.60" departPosLat="0.00" departSpeed="13.90" departDelay="0.00" arrival="357.50" arrivalLane="c2w_1" arrivalPos="990.00" arrivalPosLat="0.00" arrivalSpeed="14.17" duration="159.50" routeLength="1986.69" waitingTime="3.85" waitingCount="1" stopTime="0.00" timeLoss="18.96" rerouteNo="1" devices="tripinfo_car_n2w_198 routing_car_n2w_198" vType="Car" speedFactor="1.02" vaporized=""/>
    <tripinfo id="car_s2w_162" depart="162.00" departLane="s2sep_1" departPos="3.60" departPosLat="0.00" departSpeed="13.90" departDelay="0.00" arrival="361.10" arrivalLane="c2w_1" arrivalPos="990.00" arrivalPosLat="0.00" arrivalSpeed="14.14" duration="199.10" routeLength="1996.47" waitingTime="42.90" waitingCount="2" stopTime="0.00" timeLoss="57.55" rerouteNo="1" devices="tripinfo_car_s2w_162 routing_car_s2w_162" vType="Car" speedFactor="1.02" vaporized=""/>
    <tripinfo id="car_s2w_168" depart="168.00" departLane="s2sep_1" departPos="3.60" departPosLat="0.00" departSpeed="13.90" departDelay="0.00" arrival="362.90" arrivalLane="c2w_1" arrivalPos="990.00" arrivalPosLat="0.00" arrivalSpeed="15.48" duration="194.90" routeLength="1996.47" waitingTime="41.00" waitingCount="2" stopTime="0.00" timeLoss="72.57" rerouteNo="1" devices="tripinfo_car_s2w_168 routing_car_s2w_168" vType="Car" speedFactor="1.18" vaporized=""/>
    <tripinfo id="car_s2w_188" depart="188.00" departLane="s2sep_1" departPos="3.60" departPosLat="0.00" departSpeed="13.90" departDelay="0.00" arrival="366.95" arrivalLane="c2w_1" arrivalPos="990.00" arrivalPosLat="0.00" arrivalSpeed="13.91" duration="178.95" routeLength="1996.47" waitingTime="15.25" waitingCount="2" stopTime="0.00" timeLoss="34.88" rerouteNo="1" devices="tripinfo_car_s2w_188 routing_car_s2w_188" vType="Car" speedFactor="1.00" vaporized=""/>
    <tripinfo id="car_e2n_205" depart="205.00" departLane="e2sep_1" departPos="3.60" departPosLat="0.00" departSpeed="13.90" departDelay="0.00" arrival="387.05" arrivalLane="c2n_1" arrivalPos="990.00" arrivalPosLat="0.00" arrivalSpeed="15.18" duration="182.05" routeLength="1986.69" waitingTime="39.55" waitingCount="1" stopTime="0.00" timeLoss="50.50" rerouteNo="1" devices="tripinfo_car_e2n_205 routing_car_e2n_205" vType="Car" speedFactor="1.09" vaporized=""/>
    <tripinfo id="car_w2s_213" depart="213.00" departLane="w2sep_1" departPos="3.60" departPosLat="0.00" departSpeed="13.90" departDelay="0.00" arrival="387.70" arrivalLane="c2s_1" arrivalPos="990.00" arrivalPosLat="0.00" arrivalSpeed="14.50" duration="174.70" routeLength="1986.69" waitingTime="29.75" waitingCount="1" stopTime="0.00" timeLoss="37.04" rerouteNo="1" devices="tripinfo_car_w2s_213 routing_car_w2s_213" vType="Car" speedFactor="1.04" vaporized=""/>
    <tripinfo id="car_e2w_195" depart="195.00" departLane="e2sep_1" departPos="3.60" departPosLat="0.00" departSpeed="13.90" departDelay="0.00" arrival="390.25" arrivalLane="c2w_1" arrivalPos="990.00" arrivalPosLat="0.00" arrivalSpeed="14.00" duration="195.25" routeLength="1997.01" waitingTime="45.50" waitingCount="1" stopTime="0.00" timeLoss="52.56" rerouteNo="1" devices="tripinfo_car_e2w_195 routing_car_e2w_195" vType="Car" speedFactor="1.01" vaporized=""/>
    <tripinfo id="car_w2s_215" depart="215.00" departLane="w2sep_1" departPos="3.60" departPosLat="0.00" departSpeed="13.90" departDelay="0.00" arrival="390.70" arrivalLane="c2s_1" arrivalPos="990.00" arrivalPosLat="0.00" arrivalSpeed="15.07" duration="175.70" routeLength="1986.69" waitingTime="28.20" waitingCount="1" stopTime="0.00" timeLoss="44.03" rerouteNo="1" devices="tripinfo_car_w2s_215 routing_car_w2s_215" vType="Car" speedFactor="1.09" vaporized=""/>
    <tripinfo id="car_e2w_227" depart="227.00" departLane="e2sep_1" departPos="3.60" departPosLat="0.00" departSpeed="13.90" departDelay="0.00" arrival="393.30" arrivalLane="c2w_1" arrivalPos="990.00" arrivalPosLat="0.00" arrivalSpeed="15.03" duration="166.30" routeLength="1997.01" waitingTime="21.50" waitingCount="1" stopTime="0.00" timeLoss="34.22" rerouteNo="1" devices="tripinfo_car_e2w_227 routing_car_e2w_227" vType="Car" speedFactor="1.09" vaporized=""/>
    <tripinfo id="car_e2n_206" depart="206.35" departLane="e2sep_1" departPos="3.60" departPosLat="0.00" departSpeed="13.90" departDelay="0.35" arrival="393.90" arrivalLane="c2n_1" arrivalPos="990.00" arrivalPosLat="0.00" arrivalSpeed="14.42" duration="187.55" routeLength="1986.69" waitingTime="36.25" waitingCount="1" stopTime="0.00" timeLoss="49.08" rerouteNo="1" devices="tripinfo_car_e2n_206 routing_car_e2n_206" vType="Car" speedFactor="1.04" vaporized=""/>
    <tripinfo id="car_w2s_263" depart="263.00" departLane="w2sep_1" departPos="3.60" departPosLat="0.00" departSpeed="13.90" departDelay="0.00" arrival="393.95" arrivalLane="c2s_1" arrivalPos="990.00" arrivalPosLat="0.00" arrivalSpeed="16.27" duration="130.95" routeLength="1986.69" waitingTime="0.00" waitingCount="0" stopTime="0.00" timeLoss="8.89" rerouteNo="1" devices="tripinfo_car_w2s_263 routing_car_w2s_263" vType="Car" speedFactor="1.18" vaporized=""/>
    <tripinfo id="car_w2e_219" depart="219.45" departLane="w2sep_1" departPos="3.60" departPosLat="0.00" departSpeed="13.90" departDelay="0.45" arrival="394.40" arrivalLane="c2e_1" arrivalPos="990.00" arrivalPosLat="0.00" arrivalSpeed="14.04" duration="174.95" routeLength="1997.01" waitingTime="20.75" waitingCount="1" stopTime="0.00" timeLoss="32.67" rerouteNo="1" devices="tripinfo_car_w2e_219 routing_car_w2e_219" vType="Car" speedFactor="1.01" vaporized=""/>
    <tripinfo id="car_e2w_228" depart="228.30" departLane="e2sep_1" departPos="3.60" departPosLat="0.00" departSpeed="13.90" departDelay="0.30" arrival="395.85" arrivalLane="c2w_1" arrivalPos="990.00" arrivalPosLat="0.00" arrivalSpeed="15.41" duration="167.55" routeLength="1997.01" waitingTime="20.10" waitingCount="1" stopTime="0.00" timeLoss="39.45" rerouteNo="1" devices="tripinfo_car_e2w_228 routing_car_e2w_228" vType="Car" speedFactor="1.12" vaporized=""/>
    <tripinfo id="car_e2w_232" depart="232.00" departLane="e2sep_1" departPos="3.60" departPosLat="0.00" departSpeed="13.90" departDelay="0.00" arrival="398.90" arrivalLane="c2w_1" arrivalPos="990.00" arrivalPosLat="0.00" arrivalSpeed="15.17" duration="166.90" routeLength="1997.01" waitingTime="17.85" waitingCount="1" stopTime="0.00" timeLoss="35.93" rerouteNo="1" devices="tripinfo_car_e2w_232 routing_car_e2w_232" vType="Car" speedFactor="1.10" vaporized=""/>
    <tripinfo id="car_w2e_239" depart="239.45" departLane="w2sep_1" departPos="3.60" departPosLat="0.00" departSpeed="13.90" departDelay="0.45" arrival="399.20" arrivalLane="c2e_1" arrivalPos="990.00" arrivalPosLat="0.00" arrivalSpeed="13.89" duration="159.75" routeLength="1997.01" waitingTime="1.25" waitingCount="1" stopTime="0.00" timeLoss="16.04" rerouteNo="1" devices="tripinfo_car_w2e_239 routing_car_w2e_239" vType="Car" speedFactor="1.00" vaporized=""/>
    <tripinfo id="car_w2e_244" depart="244.00" departLane="w2sep_1" departPos="3.60" departPosLat="0.00" departSpeed="13.90" departDelay="0.00" arrival="402.80" arrivalLane="c2e_1" arrivalPos="990.00" arrivalPosLat="0.00" arrivalSpeed="13.87" duration="158.80" routeLength="1997.01" waitingTime="0.00" waitingCount="0" stopTime="0.00" timeLoss="15.13" rerouteNo="1" devices="tripinfo_car_w2e_244 routing_car_w2e_244" vType="Car" speedFactor="1.00" vaporized=""/>
    <tripinfo id="car_w2n_218" depart="218.00" departLane="w2sep_1" departPos="3.60" departPosLat="0.00" departSpeed="13.90" departDelay="0.00" arrival="403.70" arrivalLane="c2n_1" arrivalPos="990.00" arrivalPosLat="0.00" arrivalSpeed="14.69" duration="185.70" routeLength="1996.47" waitingTime="35.45" waitingCount="2" stopTime="0.00" timeLoss="49.15" rerouteNo="1" devices="tripinfo_car_w2n_218 routing_car_w2n_218" vType="Car" speedFactor="1.06" vaporized=""/>
    <tripinfo id="car_e2w_248" depart="248.00" departLane="e2sep_1" departPos="3.60" departPosLat="0.00" departSpeed="13.90" departDelay="0.00" arrival="404.15" arrivalLane="c2w_1" arrivalPos="990.00" arrivalPosLat="0.00" arrivalSpeed="14.09" duration="156.15" routeLength="1997.01" waitingTime="0.00" waitingCount="0" stopTime="0.00" timeLoss="14.46" rerouteNo="1" devices="tripinfo_car_e2w_248 routing_car_e2w_248" vType="Car" speedFactor="1.01" vaporized=""/>
    <tripinfo id="car_w2e_249" depart="249.00" departLane="w2sep_1" departPos="3.60" departPosLat="0.00" departSpeed="13.90" departDelay="0.00" arrival="405.10" arrivalLane="c2e_1" arrivalPos="990.00" arrivalPosLat="0.00" arrivalSpeed="14.53" duration="156.10" routeLength="1997.01" waitingTime="0.00" waitingCount="0" stopTime="0.00" timeLoss="21.16" rerouteNo="1" devices="tripinfo_car_w2e_249 routing_car_w2e_249" vType="Car" speedFactor="1.06" vaporized=""/>
    <tripinfo id="car_e2s_199" depart="199.00" departLane="e2sep_1" departPos="3.60" departPosLat="0.00" departSpeed="13.90" departDelay="0.00" arrival="405.55" arrivalLane="c2s_1" arrivalPos="990.00" arrivalPosLat="0.00" arrivalSpeed="14.13" duration="206.55" routeLength="1996.47" waitingTime="52.40" waitingCount="2" stopTime="0.00" timeLoss="64.60" rerouteNo="1" devices="tripinfo_car_e2s_199 routing_car_e2s_199" vType="Car" speedFactor="1.02" vaporized=""/>
    <tripinfo id="car_e2w_254" depart="254.00" departLane="e2sep_1" departPos="3.60" departPosLat="0.00" departSpeed="13.90" departDelay="0.00" arrival="406.45" arrivalLane="c2w_1" arrivalPos="990.00" arrivalPosLat="0.00" arrivalSpeed="14.95" duration="152.45" routeLength="1997.01" waitingTime="0.00" waitingCount="0" stopTime="0.00" timeLoss="21.40" rerouteNo="1" devices="tripinfo_car_e2w_254 routing_car_e2w_254" vType="Car" speedFactor="1.10" vaporized=""/>
    <tripinfo id="car_w2e_264" depart="264.25" departLane="w2sep_1" departPos="3.60" departPosLat="0.00" departSpeed="13.90" departDelay="0.25" arrival="409.80" arrivalLane="c2e_1" arrivalPos="990.00" arrivalPosLat="0.00" arrivalSpeed="13.94" duration="145.55" routeLength="1997.01" waitingTime="0.00" waitingCount="0" stopTime="0.00" timeLoss="2.31" rerouteNo="1" devices="tripinfo_car_w2e_264 routing_car_w2e_264" vType="Car" speedFactor="1.00" vaporized=""/>
    <tripinfo id="car_w2n_238" depart="238.00" departLane="w2sep_1" departPos="3.60" departPosLat="0.00" departSpeed="13.90" departDelay="0.00" arrival="410.55" arrivalLane="c2n_1" arrivalPos="990.00" arrivalPosLat="0.00" arrivalSpeed="13.90" duration="172.55" routeLength="1996.47" waitingTime="13.90" waitingCount="2" stopTime="0.00" timeLoss="28.24" rerouteNo="1" devices="tripinfo_car_w2n_238 routing_car_w2n_238" vType="Car" speedFactor="1.00" vaporized=""/>
    <tripinfo id="amb_w2e_300" depart="300.00" departLane="w2sep_1" departPos="6.60" departPosLat="0.00" departSpeed="13.90" departDelay="0.00" arrival="411.35" arrivalLane="c2e_1" arrivalPos="990.00" arrivalPosLat="-0.95" arrivalSpeed="17.57" duration="111.35" routeLength="1994.01" waitingTime="0.00" waitingCount="0" stopTime="0.00" timeLoss="15.70" rerouteNo="1" devices="tripinfo_amb_w2e_300 routing_amb_w2e_300 bluelight_amb_w2e_300 fcd_amb_w2e_300" vType="Ambulance" speedFactor="1.50" vaporized="">
        <example_device customValue1="0.00" customValue2="-1.00"/>
    </tripinfo>
    <tripinfo id="car_e2s_263" depart="263.00" departLane="e2sep_1" departPos="3.60" departPosLat="0.00" departSpeed="13.90" departDelay="0.00" arrival="412.20" arrivalLane="c2s_1" arrivalPos="990.00" arrivalPosLat="0.00" arrivalSpeed="13.96" duration="149.20" routeLength="1996.47" waitingTime="0.00" waitingCount="0" stopTime="0.00" timeLoss="5.49" rerouteNo="1" devices="tripinfo_car_e2s_263 routing_car_e2s_263" vType="Car" speedFactor="1.00" vaporized=""/>
    <tripinfo id="car_w2n_252" depart="252.00" departLane="w2sep_1" departPos="3.60" departPosLat="0.00" departSpeed="13.90" departDelay="0.00" arrival="412.75" arrivalLane="c2n_1" arrivalPos="990.00" arrivalPosLat="0.00" arrivalSpeed="14.92" duration="160.75" routeLength="1996.47" waitingTime="6.60" waitingCount="1" stopTime="0.00" timeLoss="29.39" rerouteNo="1" devices="tripinfo_car_w2n_252 routing_car_w2n_252" vType="Car" speedFactor="1.10" vaporized=""/>
    <tripinfo id="car_w2e_278" depart="278.00" departLane="w2sep_1" departPos="3.60" departPosLat="0.00" departSpeed="13.90" departDelay="0.00" arrival="414.55" arrivalLane="c2e_1" arrivalPos="990.00" arrivalPosLat="1.10" arrivalSpeed="14.74" duration="136.55" routeLength="1997.01" waitingTime="0.00" waitingCount="0" stopTime="0.00" timeLoss="1.10" rerouteNo="1" devices="tripinfo_car_w2e_278 routing_car_w2e_278" vType="Car@car_w2e_278" speedFactor="1.06" vaporized=""/>
    <tripinfo id="car_e2n_274" depart="274.00" departLane="e2sep_1" departPos="3.60" departPosLat="0.00" departSpeed="13.90" departDelay="0.00" arrival="417.90" arrivalLane="c2n_1" arrivalPos="990.00" arrivalPosLat="0.00" arrivalSpeed="14.33" duration="143.90" routeLength="1986.69" waitingTime="0.00" waitingCount="0" stopTime="0.00" timeLoss="4.60" rerouteNo="1" devices="tripinfo_car_e2n_274 routing_car_e2n_274" vType="Car" speedFactor="1.03" vaporized=""/>
    <tripinfo id="car_w2s_293" depart="293.00" departLane="w2sep_1" departPos="3.60" departPosLat="0.00" departSpeed="13.90" departDelay="0.00" arrival="431.35" arrivalLane="c2s_1" arrivalPos="990.00" arrivalPosLat="0.00" arrivalSpeed="14.85" duration="138.35" routeLength="1986.69" waitingTime="0.00" waitingCount="0" stopTime="0.00" timeLoss="3.89" rerouteNo="1" devices="tripinfo_car_w2s_293 routing_car_w2s_293" vType="Car" speedFactor="1.07" vaporized=""/>
    <tripinfo id="car_e2w_288" depart="288.00" departLane="e2sep_1" departPos="3.60" departPosLat="0.00" departSpeed="13.90" departDelay="0.00" arrival="433.50" arrivalLane="c2w_1" arrivalPos="990.00" arrivalPosLat="0.00" arrivalSpeed="13.90" duration="145.50" routeLength="1997.01" waitingTime="0.00" waitingCount="0" stopTime="0.00" timeLoss="1.81" rerouteNo="1" devices="tripinfo_car_e2w_288 routing_car_e2w_288" vType="Car" speedFactor="1.00" vaporized=""/>
    <tripinfo id="car_e2w_291" depart="291.00" departLane="e2sep_1" departPos="3.60" departPosLat="0.00" departSpeed="13.90" departDelay="0.00" arrival="436.85" arrivalLane="c2w_1" arrivalPos="990.00" arrivalPosLat="0.00" arrivalSpeed="14.30" duration="145.85" routeLength="1997.01" waitingTime="0.00" waitingCount="0" stopTime="0.00" timeLoss="6.63" rerouteNo="1" devices="tripinfo_car_e2w_291 routing_car_e2w_291" vType="Car" speedFactor="1.03" vaporized=""/>
    <tripinfo id="car_n2w_250" depart="250.00" departLane="n2sep_1" departPos="3.60" departPosLat="0.00" departSpeed="13.90" departDelay="0.00" arrival="442.20" arrivalLane="c2w_1" arrivalPos="990.00" arrivalPosLat="0.00" arrivalSpeed="16.24" duration="192.20" routeLength="1986.69" waitingTime="60.95" waitingCount="1" stopTime="0.00" timeLoss="69.27" rerouteNo="1" devices="tripinfo_car_n2w_250 routing_car_n2w_250" vType="Car" speedFactor="1.17" vaporized=""/>
    <tripinfo id="car_s2e_237" depart="237.00" departLane="s2sep_1" departPos="3.60" departPosLat="0.00" departSpeed="13.90" departDelay="0.00" arrival="447.50" arrivalLane="c2e_1" arrivalPos="990.00" arrivalPosLat="0.00" arrivalSpeed="14.80" duration="210.50" routeLength="1986.69" waitingTime="68.55" waitingCount="1" stopTime="0.00" timeLoss="75.58" rerouteNo="1" devices="tripinfo_car_s2e_237 routing_car_s2e_237" vType="Car" speedFactor="1.07" vaporized=""/>
    <tripinfo id="car_s2n_246" depart="246.00" departLane="s2sep_1" departPos="3.60" departPosLat="0.00" departSpeed="13.90" departDelay="0.00" arrival="449.15" arrivalLane="c2n_1" arrivalPos="990.00" arrivalPosLat="0.00" arrivalSpeed="14.91" duration="203.15" routeLength="1997.01" waitingTime="58.85" waitingCount="1" stopTime="0.00" timeLoss="69.22" rerouteNo="1" devices="tripinfo_car_s2n_246 routing_car_s2n_246" vType="Car" speedFactor="1.07" vaporized=""/>
    <tripinfo id="car_n2w_258" depart="258.00" departLane="n2sep_1" departPos="3.60" departPosLat="0.00" departSpeed="13.90" departDelay="0.00" arrival="452.60" arrivalLane="c2w_1" arrivalPos="990.00" arrivalPosLat="0.00" arrivalSpeed="15.23" duration="194.60" routeLength="1986.69" waitingTime="47.20" waitingCount="1" stopTime="0.00" timeLoss="63.50" rerouteNo="1" devices="tripinfo_car_n2w_258 routing_car_n2w_258" vType="Car" speedFactor="1.10" vaporized=""/>
    <tripinfo id="car_n2s_250" depart="251.25" departLane="n2sep_1" departPos="3.60" departPosLat="0.00" departSpeed="13.90" departDelay="1.25" arrival="452.75" arrivalLane="c2s_1" arrivalPos="990.00" arrivalPosLat="0.00" arrivalSpeed="14.13" duration="201.50" routeLength="1997.01" waitingTime="51.15" waitingCount="1" stopTime="0.00" timeLoss="60.18" rerouteNo="1" devices="tripinfo_car_n2s_250 routing_car_n2s_250" vType="Car" speedFactor="1.02" vaporized=""/>
    <tripinfo id="car_s2e_264" depart="264.00" departLane="s2sep_1" departPos="3.60" departPosLat="0.00" departSpeed="13.90" departDelay="0.00" arrival="456.80" arrivalLane="c2e_1" arrivalPos="990.00" arrivalPosLat="0.00" arrivalSpeed="13.90" duration="192.80" routeLength="1986.69" waitingTime="39.05" waitingCount="1" stopTime="0.00" timeLoss="49.16" rerouteNo="1" devices="tripinfo_car_s2e_264 routing_car_s2e_264" vType="Car" speedFactor="1.00" vaporized=""/>
    <tripinfo id="car_n2s_254" depart="254.00" departLane="n2sep_1" departPos="3.60" departPosLat="0.00" departSpeed="13.90" departDelay="0.00" arrival="457.40" arrivalLane="c2s_1" arrivalPos="990.00" arrivalPosLat="0.00" arrivalSpeed="14.02" duration="203.40" routeLength="1997.01" waitingTime="48.05" waitingCount="1" stopTime="0.00" timeLoss="61.01" rerouteNo="1" devices="tripinfo_car_n2s_254 routing_car_n2s_254" vType="Car" speedFactor="1.01" vaporized=""/>
    <tripinfo id="car_s2e_280" depart="280.00" departLane="s2sep_1" departPos="3.60" departPosLat="0.00" departSpeed="13.90" departDelay="0.00" arrival="458.75" arrivalLane="c2e_1" arrivalPos="990.00" arrivalPosLat="0.00" arrivalSpeed="15.34" duration="178.75" routeLength="1986.69" waitingTime="33.05" waitingCount="1" stopTime="0.00" timeLoss="54.11" rerouteNo="1" devices="tripinfo_car_s2e_280 routing_car_s2e_280" vType="Car" speedFactor="1.15" vaporized=""/>
    <tripinfo id="car_s2e_296" depart="296.00" departLane="s2sep_1" departPos="3.60" departPosLat="0.00" departSpeed="13.90" departDelay="0.00" arrival="460.50" arrivalLane="c2e_1" arrivalPos="990.00" arrivalPosLat="0.00" arrivalSpeed="15.94" duration="164.50" routeLength="1986.69" waitingTime="21.60" waitingCount="1" stopTime="0.00" timeLoss="47.29" rerouteNo="1" devices="tripinfo_car_s2e_296 routing_car_s2e_296" vType="Car" speedFactor="1.23" vaporized=""/>
    <tripinfo id="car_n2s_275" depart="275.00" departLane="n2sep_1" departPos="3.60" departPosLat="0.00" departSpeed="13.90" departDelay="0.00" arrival="460.90" arrivalLane="c2s_1" arrivalPos="990.00" arrivalPosLat="0.00" arrivalSpeed="14.19" duration="185.90" routeLength="1997.01" waitingTime="31.90" waitingCount="1" stopTime="0.00" timeLoss="45.52" rerouteNo="1" devices="tripinfo_car_n2s_275 routing_car_n2s_275" vType="Car" speedFactor="1.02" vaporized=""/>
    <tripinfo id="car_n2w_281" depart="281.00" departLane="n2sep_1" departPos="3.60" departPosLat="0.00" departSpeed="13.90" departDelay="0.00" arrival="461.10" arrivalLane="c2w_1" arrivalPos="990.00" arrivalPosLat="0.00" arrivalSpeed="14.35" duration="180.10" routeLength="1986.69" waitingTime="27.65" waitingCount="1" stopTime="0.00" timeLoss="40.88" rerouteNo="1" devices="tripinfo_car_n2w_281 routing_car_n2w_281" vType="Car" speedFactor="1.03" vaporized=""/>
    <tripinfo id="car_s2e_300" depart="300.00" departLane="s2sep_1" departPos="3.60" departPosLat="0.00" departSpeed="13.90" departDelay="0.00" arrival="464.70" arrivalLane="c2e_1" arrivalPos="990.00" arrivalPosLat="0.00" arrivalSpeed="14.05" duration="164.70" routeLength="1986.69" waitingTime="7.60" waitingCount="1" stopTime="0.00" timeLoss="22.70" rerouteNo="1" devices="tripinfo_car_s2e_300 routing_car_s2e_300" vType="Car" speedFactor="1.01" vaporized=""/>
    <tripinfo id="car_n2s_290" depart="291.30" departLane="n2sep_1" departPos="3.60" departPosLat="0.00" departSpeed="13.90" departDelay="1.30" arrival="465.35" arrivalLane="c2s_1" arrivalPos="990.00" arrivalPosLat="0.00" arrivalSpeed="14.01" duration="174.05" routeLength="1997.01" waitingTime="16.45" waitingCount="1" stopTime="0.00" timeLoss="31.53" rerouteNo="1" devices="tripinfo_car_n2s_290 routing_car_n2s_290" vType="Car" speedFactor="1.01" vaporized=""/>
    <tripinfo id="car_n2w_294" depart="294.75" departLane="n2sep_1" departPos="3.60" departPosLat="0.00" departSpeed="13.90" departDelay="0.75" arrival="465.75" arrivalLane="c2w_1" arrivalPos="990.00" arrivalPosLat="0.00" arrivalSpeed="14.41" duration="171.00" routeLength="1986.69" waitingTime="12.95" waitingCount="1" stopTime="0.00" timeLoss="32.51" rerouteNo="1" devices="tripinfo_car_n2w_294 routing_car_n2w_294" vType="Car" speedFactor="1.04" vaporized=""/>
    <tripinfo id="car_n2e_264" depart="264.00" departLane="n2sep_1" departPos="3.60" departPosLat="0.00" departSpeed="13.90" departDelay="0.00" arrival="467.15" arrivalLane="c2e_1" arrivalPos="990.00" arrivalPosLat="0.00" arrivalSpeed="14.68" duration="203.15" routeLength="1996.47" waitingTime="50.85" waitingCount="2" stopTime="0.00" timeLoss="68.38" rerouteNo="1" devices="tripinfo_car_n2e_264 routing_car_n2e_264" vType="Car" speedFactor="1.07" vaporized=""/>
    <tripinfo id="car_n2e_270" depart="270.00" departLane="n2sep_1" departPos="3.60" departPosLat="0.00" departSpeed="13.90" departDelay="0.00" arrival="469.35" arrivalLane="c2e_1" arrivalPos="990.00" arrivalPosLat="0.00" arrivalSpeed="15.00" duration="199.35" routeLength="1996.47" waitingTime="47.10" waitingCount="2" stopTime="0.00" timeLoss="68.53" rerouteNo="1" devices="tripinfo_car_n2e_270 routing_car_n2e_270" vType="Car" speedFactor="1.10" vaporized=""/>
    <tripinfo id="car_n2w_310" depart="310.00" departLane="n2sep_1" departPos="3.60" departPosLat="0.00" departSpeed="13.90" departDelay="0.00" arrival="470.85" arrivalLane="c2w_1" arrivalPos="990.00" arrivalPosLat="0.00" arrivalSpeed="13.95" duration="160.85" routeLength="1986.69" waitingTime="1.05" waitingCount="1" stopTime="0.00" timeLoss="17.73" rerouteNo="1" devices="tripinfo_car_n2w_310 routing_car_n2w_310" vType="Car" speedFactor="1.00" vaporized=""/>
    <tripinfo id="car_n2e_290" depart="290.00" departLane="n2sep_1" departPos="3.60" departPosLat="0.00" departSpeed="13.90" departDelay="0.00" arrival="471.50" arrivalLane="c2e_1" arrivalPos="990.00" arrivalPosLat="0.00" arrivalSpeed="15.16" duration="181.50" routeLength="1996.47" waitingTime="26.75" waitingCount="2" stopTime="0.00" timeLoss="52.43" rerouteNo="1" devices="tripinfo_car_n2e_290 routing_car_n2e_290" vType="Car" speedFactor="1.12" vaporized=""/>
    <tripinfo id="car_n2w_324" depart="324.00" departLane="n2sep_1" departPos="3.60" departPosLat="0.00" departSpeed="13.90" departDelay="0.00" arrival="472.95" arrivalLane="c2w_1" arrivalPos="990.00" arrivalPosLat="0.00" arrivalSpeed="15.04" duration="148.95" routeLength="1986.69" waitingTime="0.00" waitingCount="0" stopTime="0.00" timeLoss="19.93" rerouteNo="1" devices="tripinfo_car_n2w_324 routing_car_n2w_324" vType="Car" speedFactor="1.11" vaporized=""/>
    <tripinfo id="car_n2e_293" depart="293.05" departLane="n2sep_1" departPos="3.60" departPosLat="0.00" departSpeed="13.90" departDelay="0.05" arrival="473.50" arrivalLane="c2e_1" arrivalPos="990.00" arrivalPosLat="0.00" arrivalSpeed="15.36" duration="180.45" routeLength="1996.47" waitingTime="17.25" waitingCount="2" stopTime="0.00" timeLoss="54.12" rerouteNo="1" devices="tripinfo_car_n2e_293 routing_car_n2e_293" vType="Car" speedFactor="1.14" vaporized=""/>
</tripinfos>
