<?xml version="1.0" encoding="UTF-8"?>

<!-- generated on 2021-05-18 05:44:38 by Eclipse SUMO sumo Version 1.9.1
<configuration xmlns:xsi="http://www.w3.org/2001/XMLSchema-instance" xsi:noNamespaceSchemaLocation="http://sumo.dlr.de/xsd/sumoConfiguration.xsd">

    <input>
        <net-file value="sumofiles/junction.net.xml"/>
        <route-files value="sumofiles/junction_none_2.rou.xml"/>
        <additional-files value="sumofiles/junction.det.xml"/>
    </input>

    <output>
        <tripinfo-output value="sumofiles/output/tripinfo_none_2.xml"/>
    </output>

    <time>
        <begin value="0"/>
        <end value="10000"/>
        <step-length value="1.0"/>
    </time>

    <processing>
        <lateral-resolution value="0.5"/>
    </processing>

    <report>
        <no-warnings value="true"/>
        <error-log value="sumofiles/output/errorlog_none_2.log"/>
        <no-step-log value="true"/>
    </report>

    <traci_server>
        <remote-port value="39085"/>
    </traci_server>

    <gui_only>
        <gui-settings-file value="sumofiles/junction-gui.settings.xml"/>
        <tracker-interval value="1"/>
    </gui_only>

</configuration>
-->

<tripinfos xmlns:xsi="http://www.w3.org/2001/XMLSchema-instance" xsi:noNamespaceSchemaLocation="http://sumo.dlr.de/xsd/tripinfo_file.xsd">
    <tripinfo id="car_w2s_4" depart="4.00" departLane="w2sep_1" departPos="3.60" departPosLat="0.00" departSpeed="13.90" departDelay="0.00" arrival="145.00" arrivalLane="c2s_1" arrivalPos="990.00" arrivalPosLat="0.00" arrivalSpeed="14.73" duration="141.00" routeLength="1986.69" waitingTime="0.00" waitingCount="0" stopTime="0.00" timeLoss="5.41" rerouteNo="1" devices="tripinfo_car_w2s_4 routing_car_w2s_4" vType="Car" speedFactor="1.06" vaporized=""/>
    <tripinfo id="car_e2w_4" depart="4.00" departLane="e2sep_1" departPos="3.60" departPosLat="0.00" departSpeed="13.90" departDelay="0.00" arrival="147.00" arrivalLane="c2w_1" arrivalPos="990.00" arrivalPosLat="0.00" arrivalSpeed="14.04" duration="143.00" routeLength="1997.01" waitingTime="0.00" waitingCount="0" stopTime="0.00" timeLoss="0.06" rerouteNo="1" devices="tripinfo_car_e2w_4 routing_car_e2w_4" vType="Car" speedFactor="1.01" vaporized=""/>
    <tripinfo id="car_n2s_4" depart="4.00" departLane="n2sep_1" departPos="3.60" departPosLat="0.00" departSpeed="13.90" departDelay="0.00" arrival="161.00" arrivalLane="c2s_1" arrivalPos="990.00" arrivalPosLat="0.00" arrivalSpeed="14.73" duration="157.00" routeLength="1997.01" waitingTime="10.00" waitingCount="1" stopTime="0.00" timeLoss="20.83" rerouteNo="1" devices="tripinfo_car_n2s_4 routing_car_n2s_4" vType="Car" speedFactor="1.06" vaporized=""/>
    <tripinfo id="car_n2s_13" depart="13.00" departLane="n2sep_1" departPos="3.60" departPosLat="0.00" departSpeed="13.90" departDelay="0.00" arrival="164.00" arrivalLane="c2s_1" arrivalPos="990.00" arrivalPosLat="0.00" arrivalSpeed="15.10" duration="151.00" routeLength="1997.01" waitingTime="5.00" waitingCount="1" stopTime="0.00" timeLoss="18.97" rerouteNo="1" devices="tripinfo_car_n2s_13 routing_car_n2s_13" vType="Car" speedFactor="1.09" vaporized=""/>
    <tripinfo id="car_n2e_6" depart="6.00" departLane="n2sep_1" departPos="3.60" departPosLat="0.00" departSpeed="13.90" departDelay="0.00" arrival="167.00" arrivalLane="c2e_1" arrivalPos="990.00" arrivalPosLat="0.00" arrivalSpeed="13.90" duration="161.00" routeLength="1996.47" waitingTime="4.00" waitingCount="1" stopTime="0.00" timeLoss="15.81" rerouteNo="1" devices="tripinfo_car_n2e_6 routing_car_n2e_6" vType="Car" speedFactor="1.00" vaporized=""/>
    <tripinfo id="car_n2s_15" depart="15.00" departLane="n2sep_1" departPos="3.60" departPosLat="0.00" departSpeed="13.90" departDelay="0.00" arrival="169.00" arrivalLane="c2s_1" arrivalPos="990.00" arrivalPosLat="0.00" arrivalSpeed="14.26" duration="154.00" routeLength="1997.01" waitingTime="0.00" waitingCount="0" stopTime="0.00" timeLoss="13.80" rerouteNo="1" devices="tripinfo_car_n2s_15 routing_car_n2s_15" vType="Car" speedFactor="1.03" vaporized=""/>
    <tripinfo id="car_n2w_24" depart="24.00" departLane="n2sep_1" departPos="3.60" departPosLat="0.00" departSpeed="13.90" departDelay="0.00" arrival="169.00" arrivalLane="c2w_1" arrivalPos="990.00" arrivalPosLat="0.00" arrivalSpeed="14.55" duration="145.00" routeLength="1986.69" waitingTime="0.00" waitingCount="0" stopTime="0.00" timeLoss="7.59" rerouteNo="1" devices="tripinfo_car_n2w_24 routing_car_n2w_24" vType="Car" speedFactor="1.05" vaporized=""/>
    <tripinfo id="car_n2e_27" depart="27.00" departLane="n2sep_1" departPos="3.60" departPosLat="0.00" departSpeed="13.90" departDelay="0.00" arrival="169.00" arrivalLane="c2e_1" arrivalPos="990.00" arrivalPosLat="0.00" arrivalSpeed="15.15" duration="142.00" routeLength="1996.47" waitingTime="0.00" waitingCount="0" stopTime="0.00" timeLoss="12.64" rerouteNo="1" devices="tripinfo_car_n2e_27 routing_car_n2e_27" vType="Car" speedFactor="1.12" vaporized=""/>
    <tripinfo id="car_s2w_8" depart="8.00" departLane="s2sep_1" departPos="3.60" departPosLat="0.00" departSpeed="13.90" departDelay="0.00" arrival="172.00" arrivalLane="c2w_1" arrivalPos="990.00" arrivalPosLat="0.00" arrivalSpeed="14.99" duration="164.00" routeLength="1996.47" waitingTime="10.00" waitingCount="2" stopTime="0.00" timeLoss="30.69" rerouteNo="1" devices="tripinfo_car_s2w_8 routing_car_s2w_8" vType="Car" speedFactor="1.08" vaporized=""/>
    <tripinfo id="car_s2w_32" depart="32.00" departLane="s2sep_1" departPos="3.60" departPosLat="0.00" departSpeed="13.90" departDelay="0.00" arrival="177.00" arrivalLane="c2w_1" arrivalPos="990.00" arrivalPosLat="0.00" arrivalSpeed="14.53" duration="145.00" routeLength="1996.47" waitingTime="0.00" waitingCount="0" stopTime="0.00" timeLoss="6.44" rerouteNo="1" devices="tripinfo_car_s2w_32 routing_car_s2w_32" vType="Car" speedFactor="1.05" vaporized=""/>
    <tripinfo id="car_s2n_33" depart="34.00" departLane="s2sep_1" departPos="3.60" departPosLat="0.00" departSpeed="13.90" departDelay="1.00" arrival="179.00" arrivalLane="c2n_1" arrivalPos="990.00" arrivalPosLat="0.00" arrivalSpeed="13.90" duration="145.00" routeLength="1997.01" waitingTime="0.00" waitingCount="0" stopTime="0.00" timeLoss="0.50" rerouteNo="1" devices="tripinfo_car_s2n_33 routing_car_s2n_33" vType="Car" speedFactor="1.00" vaporized=""/>
    <tripinfo id="car_n2s_37" depart="37.00" departLane="n2sep_1" departPos="3.60" departPosLat="0.00" departSpeed="13.90" departDelay="0.00" arrival="182.00" arrivalLane="c2s_1" arrivalPos="990.00" arrivalPosLat="0.00" arrivalSpeed="13.90" duration="145.00" routeLength="1997.01" waitingTime="0.00" waitingCount="0" stopTime="0.00" timeLoss="0.62" rerouteNo="1" devices="tripinfo_car_n2s_37 routing_car_n2s_37" vType="Car" speedFactor="1.00" vaporized=""/>
    <tripinfo id="car_n2s_41" depart="41.00" departLane="n2sep_1" departPos="3.60" departPosLat="0.00" departSpeed="13.90" departDelay="0.00" arrival="186.00" arrivalLane="c2s_1" arrivalPos="990.00" arrivalPosLat="0.00" arrivalSpeed="14.14" duration="145.00" routeLength="1997.01" waitingTime="0.00" waitingCount="0" stopTime="0.00" timeLoss="3.38" rerouteNo="1" devices="tripinfo_car_n2s_41 routing_car_n2s_41" vType="Car" speedFactor="1.02" vaporized=""/>
    <tripinfo id="car_s2n_50" depart="50.00" departLane="s2sep_1" departPos="3.60" departPosLat="0.00" departSpeed="13.90" departDelay="0.00" arrival="188.00" arrivalLane="c2n_1" arrivalPos="990.00" arrivalPosLat="0.00" arrivalSpeed="14.55" duration="138.00" routeLength="1997.01" waitingTime="0.00" waitingCount="0" stopTime="0.00" timeLoss="0.45" rerouteNo="1" devices="tripinfo_car_s2n_50 routing_car_s2n_50" vType="Car" speedFactor="1.05" vaporized=""/>
    <tripinfo id="car_s2w_39" depart="39.00" departLane="s2sep_1" departPos="3.60" departPosLat="0.00" departSpeed="13.90" departDelay="0.00" arrival="189.00" arrivalLane="c2w_1" arrivalPos="990.00" arrivalPosLat="0.00" arrivalSpeed="13.90" duration="150.00" routeLength="1996.47" waitingTime="0.00" waitingCount="0" stopTime="0.00" timeLoss="4.83" rerouteNo="1" devices="tripinfo_car_s2w_39 routing_car_s2w_39" vType="Car" speedFactor="1.00" vaporized=""/>
    <tripinfo id="car_s2w_45" depart="45.00" departLane="s2sep_1" departPos="3.60" departPosLat="0.00" departSpeed="13.90" departDelay="0.00" arrival="191.00" arrivalLane="c2w_1" arrivalPos="990.00" arrivalPosLat="0.00" arrivalSpeed="14.84" duration="146.00" routeLength="1996.47" waitingTime="0.00" waitingCount="0" stopTime="0.00" timeLoss="13.22" rerouteNo="1" devices="tripinfo_car_s2w_45 routing_car_s2w_45" vType="Car" speedFactor="1.09" vaporized=""/>
    <tripinfo id="car_w2s_5" depart="6.00" departLane="w2sep_1" departPos="3.60" departPosLat="0.00" departSpeed="13.90" departDelay="1.00" arrival="204.00" arrivalLane="c2s_1" arrivalPos="990.00" arrivalPosLat="0.00" arrivalSpeed="15.05" duration="198.00" routeLength="1986.69" waitingTime="54.00" waitingCount="1" stopTime="0.00" timeLoss="65.20" rerouteNo="1" devices="tripinfo_car_w2s_5 routing_car_w2s_5" vType="Car" speedFactor="1.08" vaporized=""/>
    <tripinfo id="car_s2w_55" depart="57.00" departLane="s2sep_1" departPos="3.60" departPosLat="0.00" departSpeed="13.90" departDelay="2.00" arrival="205.00" arrivalLane="c2w_1" arrivalPos="990.00" arrivalPosLat="0.00" arrivalSpeed="13.90" duration="148.00" routeLength="1996.47" waitingTime="0.00" waitingCount="0" stopTime="0.00" timeLoss="3.14" rerouteNo="1" devices="tripinfo_car_s2w_55 routing_car_s2w_55" vType="Car" speedFactor="1.00" vaporized=""/>
    <tripinfo id="car_e2n_40" depart="40.00" departLane="e2sep_1" departPos="3.60" departPosLat="0.00" departSpeed="13.90" departDelay="0.00" arrival="206.00" arrivalLane="c2n_1" arrivalPos="990.00" arrivalPosLat="0.00" arrivalSpeed="16.10" duration="166.00" routeLength="1986.69" waitingTime="26.00" waitingCount="1" stopTime="0.00" timeLoss="41.21" rerouteNo="1" devices="tripinfo_car_e2n_40 routing_car_e2n_40" vType="Car" speedFactor="1.16" vaporized=""/>
    <tripinfo id="car_e2w_8" depart="8.00" departLane="e2sep_1" departPos="3.60" departPosLat="0.00" departSpeed="13.90" departDelay="0.00" arrival="210.00" arrivalLane="c2w_1" arrivalPos="990.00" arrivalPosLat="0.00" arrivalSpeed="14.04" duration="202.00" routeLength="1997.01" waitingTime="48.00" waitingCount="1" stopTime="0.00" timeLoss="59.34" rerouteNo="1" devices="tripinfo_car_e2w_8 routing_car_e2w_8" vType="Car" speedFactor="1.01" vaporized=""/>
    <tripinfo id="car_w2s_6" depart="8.00" departLane="w2sep_1" departPos="3.60" departPosLat="0.00" departSpeed="13.90" departDelay="2.00" arrival="211.00" arrivalLane="c2s_1" arrivalPos="990.00" arrivalPosLat="0.00" arrivalSpeed="14.32" duration="203.00" routeLength="1986.69" waitingTime="49.00" waitingCount="1" stopTime="0.00" timeLoss="63.22" rerouteNo="1" devices="tripinfo_car_w2s_6 routing_car_w2s_6" vType="Car" speedFactor="1.03" vaporized=""/>
    <tripinfo id="car_w2e_7" depart="10.00" departLane="w2sep_1" departPos="3.60" departPosLat="0.00" departSpeed="13.90" departDelay="3.00" arrival="211.00" arrivalLane="c2e_1" arrivalPos="990.00" arrivalPosLat="0.00" arrivalSpeed="14.54" duration="201.00" routeLength="1997.01" waitingTime="48.00" waitingCount="1" stopTime="0.00" timeLoss="63.34" rerouteNo="1" devices="tripinfo_car_w2e_7 routing_car_w2e_7" vType="Car" speedFactor="1.05" vaporized=""/>
    <tripinfo id="car_e2w_31" depart="31.00" departLane="e2sep_1" departPos="3.60" departPosLat="0.00" departSpeed="13.90" departDelay="0.00" arrival="214.00" arrivalLane="c2w_1" arrivalPos="990.00" arrivalPosLat="0.00" arrivalSpeed="13.89" duration="183.00" routeLength="1997.01" waitingTime="26.00" waitingCount="1" stopTime="0.00" timeLoss="39.15" rerouteNo="1" devices="tripinfo_car_e2w_31 routing_car_e2w_31" vType="Car" speedFactor="1.00" vaporized=""/>
    <tripinfo id="car_w2s_13" depart="13.00" departLane="w2sep_1" departPos="3.60" departPosLat="0.00" departSpeed="13.90" departDelay="0.00" arrival="216.00" arrivalLane="c2s_1" arrivalPos="990.00" arrivalPosLat="0.00" arrivalSpeed="14.32" duration="203.00" routeLength="1986.69" waitingTime="46.00" waitingCount="1" stopTime="0.00" timeLoss="63.31" rerouteNo="1" devices="tripinfo_car_w2s_13 routing_car_w2s_13" vType="Car" speedFactor="1.03" vaporized=""/>
    <tripinfo id="car_w2e_50" depart="50.00" departLane="w2sep_1" departPos="3.60" departPosLat="0.00" departSpeed="13.90" departDelay="0.00" arrival="218.00" arrivalLane="c2e_1" arrivalPos="990.00" arrivalPosLat="0.00" arrivalSpeed="14.27" duration="168.00" routeLength="1997.01" waitingTime="13.00" waitingCount="1" stopTime="0.00" timeLoss="27.54" rerouteNo="1" devices="tripinfo_car_w2e_50 routing_car_w2e_50" vType="Car" speedFactor="1.03" vaporized=""/>
    <tripinfo id="car_e2w_51" depart="51.00" departLane="e2sep_1" departPos="3.60" departPosLat="0.00" departSpeed="13.90" departDelay="0.00" arrival="219.00" arrivalLane="c2w_1" arrivalPos="990.00" arrivalPosLat="0.00" arrivalSpeed="13.90" duration="168.00" routeLength="1997.01" waitingTime="9.00" waitingCount="1" stopTime="0.00" timeLoss="23.56" rerouteNo="1" devices="tripinfo_car_e2w_51 routing_car_e2w_51" vType="Car" speedFactor="1.00" vaporized=""/>
    <tripinfo id="car_w2e_64" depart="64.00" departLane="w2sep_1" departPos="3.60" departPosLat="0.00" departSpeed="13.90" departDelay="0.00" arrival="220.00" arrivalLane="c2e_1" arrivalPos="990.00" arrivalPosLat="0.00" arrivalSpeed="15.53" duration="156.00" routeLength="1997.01" waitingTime="8.00" waitingCount="1" stopTime="0.00" timeLoss="31.13" rerouteNo="1" devices="tripinfo_car_w2e_64 routing_car_w2e_64" vType="Car" speedFactor="1.15" vaporized=""/>
    <tripinfo id="car_w2n_42" depart="42.00" departLane="w2sep_1" departPos="3.60" departPosLat="0.00" departSpeed="13.90" departDelay="0.00" arrival="221.00" arrivalLane="c2n_1" arrivalPos="990.00" arrivalPosLat="0.00" arrivalSpeed="14.04" duration="179.00" routeLength="1996.47" waitingTime="20.00" waitingCount="2" stopTime="0.00" timeLoss="36.11" rerouteNo="1" devices="tripinfo_car_w2n_42 routing_car_w2n_42" vType="Car" speedFactor="1.01" vaporized=""/>
    <tripinfo id="car_e2w_64" depart="64.00" departLane="e2sep_1" departPos="3.60" departPosLat="0.00" departSpeed="13.90" departDelay="0.00" arrival="222.00" arrivalLane="c2w_1" arrivalPos="990.00" arrivalPosLat="0.00" arrivalSpeed="13.93" duration="158.00" routeLength="1997.01" waitingTime="0.00" waitingCount="0" stopTime="0.00" timeLoss="14.86" rerouteNo="1" devices="tripinfo_car_e2w_64 routing_car_e2w_64" vType="Car" speedFactor="1.01" vaporized=""/>
    <tripinfo id="car_w2e_65" depart="66.00" departLane="w2sep_1" departPos="3.60" departPosLat="0.00" departSpeed="13.90" departDelay="1.00" arrival="222.00" arrivalLane="c2e_1" arrivalPos="990.00" arrivalPosLat="0.00" arrivalSpeed="15.74" duration="156.00" routeLength="1997.01" waitingTime="6.00" waitingCount="1" stopTime="0.00" timeLoss="32.98" rerouteNo="1" devices="tripinfo_car_w2e_65 routing_car_w2e_65" vType="Car" speedFactor="1.17" vaporized=""/>
    <tripinfo id="car_w2n_77" depart="77.00" departLane="w2sep_1" departPos="3.60" departPosLat="0.00" departSpeed="13.90" departDelay="0.00" arrival="224.00" arrivalLane="c2n_1" arrivalPos="990.00" arrivalPosLat="0.00" arrivalSpeed="15.16" duration="147.00" routeLength="1996.47" waitingTime="0.00" waitingCount="0" stopTime="0.00" timeLoss="15.23" rerouteNo="1" devices="tripinfo_car_w2n_77 routing_car_w2n_77" vType="Car" speedFactor="1.10" vaporized=""/>
    <tripinfo id="car_w2s_69" depart="69.00" departLane="w2sep_1" departPos="3.60" departPosLat="0.00" departSpeed="13.90" departDelay="0.00" arrival="225.00" arrivalLane="c2s_1" arrivalPos="990.00" arrivalPosLat="0.00" arrivalSpeed="14.17" duration="156.00" routeLength="1986.69" waitingTime="0.00" waitingCount="0" stopTime="0.00" timeLoss="14.88" rerouteNo="1" devices="tripinfo_car_w2s_69 routing_car_w2s_69" vType="Car" speedFactor="1.02" vaporized=""/>
    <tripinfo id="car_w2s_77" depart="79.00" departLane="w2sep_1" departPos="3.60" departPosLat="0.00" departSpeed="13.90" departDelay="2.00" arrival="227.00" arrivalLane="c2s_1" arrivalPos="990.00" arrivalPosLat="0.00" arrivalSpeed="15.54" duration="148.00" routeLength="1986.69" waitingTime="0.00" waitingCount="0" stopTime="0.00" timeLoss="23.76" rerouteNo="1" devices="tripinfo_car_w2s_77 routing_car_w2s_77" vType="Car" speedFactor="1.16" vaporized=""/>
    <tripinfo id="car_e2s_54" depart="54.00" departLane="e2sep_1" departPos="3.60" departPosLat="0.00" departSpeed="13.90" departDelay="0.00" arrival="229.00" arrivalLane="c2s_1" arrivalPos="990.00" arrivalPosLat="0.00" arrivalSpeed="15.39" duration="175.00" routeLength="1996.47" waitingTime="27.00" waitingCount="2" stopTime="0.00" timeLoss="47.51" rerouteNo="1" devices="tripinfo_car_e2s_54 routing_car_e2s_54" vType="Car" speedFactor="1.13" vaporized=""/>
    <tripinfo id="car_w2e_80" depart="81.00" departLane="w2sep_1" departPos="3.60" departPosLat="0.00" departSpeed="13.90" departDelay="1.00" arrival="230.00" arrivalLane="c2e_1" arrivalPos="990.00" arrivalPosLat="0.00" arrivalSpeed="14.32" duration="149.00" routeLength="1997.01" waitingTime="0.00" waitingCount="0" stopTime="0.00" timeLoss="8.78" rerouteNo="1" devices="tripinfo_car_w2e_80 routing_car_w2e_80" vType="Car" speedFactor="1.03" vaporized=""/>
    <tripinfo id="car_e2w_94" depart="94.00" departLane="e2sep_1" departPos="3.60" departPosLat="0.00" departSpeed="13.90" departDelay="0.00" arrival="233.00" arrivalLane="c2w_1" arrivalPos="990.00" arrivalPosLat="0.00" arrivalSpeed="14.50" duration="139.00" routeLength="1997.01" waitingTime="0.00" waitingCount="0" stopTime="0.00" timeLoss="0.40" rerouteNo="1" devices="tripinfo_car_e2w_94 routing_car_e2w_94" vType="Car" speedFactor="1.04" vaporized=""/>
    <tripinfo id="car_n2s_62" depart="62.00" departLane="n2sep_1" departPos="3.60" departPosLat="0.00" departSpeed="13.90" departDelay="0.00" arrival="246.00" arrivalLane="c2s_1" arrivalPos="990.00" arrivalPosLat="0.00" arrivalSpeed="16.38" duration="184.00" routeLength="1997.01" waitingTime="46.00" waitingCount="1" stopTime="0.00" timeLoss="61.93" rerouteNo="1" devices="tripinfo_car_n2s_62 routing_car_n2s_62" vType="Car" speedFactor="1.18" vaporized=""/>
    <tripinfo id="car_s2e_50" depart="52.00" departLane="s2sep_1" departPos="3.60" departPosLat="0.00" departSpeed="13.90" departDelay="2.00" arrival="247.00" arrivalLane="c2e_1" arrivalPos="990.00" arrivalPosLat="0.00" arrivalSpeed="15.61" duration="195.00" routeLength="1986.69" waitingTime="52.00" waitingCount="1" stopTime="0.00" timeLoss="66.67" rerouteNo="1" devices="tripinfo_car_s2e_50 routing_car_s2e_50" vType="Car" speedFactor="1.12" vaporized=""/>
    <tripinfo id="car_n2w_54" depart="54.00" departLane="n2sep_1" departPos="3.60" departPosLat="0.00" departSpeed="13.90" departDelay="0.00" arrival="254.00" arrivalLane="c2w_1" arrivalPos="990.00" arrivalPosLat="0.00" arrivalSpeed="13.90" duration="200.00" routeLength="1986.69" waitingTime="47.00" waitingCount="1" stopTime="0.00" timeLoss="56.53" rerouteNo="1" devices="tripinfo_car_n2w_54 routing_car_n2w_54" vType="Car" speedFactor="1.00" vaporized=""/>
    <tripinfo id="car_n2w_76" depart="76.00" departLane="n2sep_1" departPos="3.60" departPosLat="0.00" departSpeed="13.90" departDelay="0.00" arrival="256.00" arrivalLane="c2w_1" arrivalPos="990.00" arrivalPosLat="0.00" arrivalSpeed="15.63" duration="180.00" routeLength="1986.69" waitingTime="38.00" waitingCount="1" stopTime="0.00" timeLoss="58.11" rerouteNo="1" devices="tripinfo_car_n2w_76 routing_car_n2w_76" vType="Car" speedFactor="1.18" vaporized=""/>
    <tripinfo id="bus_s2n_51" depart="55.00" departLane="s2sep_1" departPos="12.10" departPosLat="0.00" departSpeed="13.90" departDelay="4.00" arrival="260.00" arrivalLane="c2n_1" arrivalPos="990.00" arrivalPosLat="0.00" arrivalSpeed="13.90" duration="205.00" routeLength="1988.51" waitingTime="48.00" waitingCount="1" stopTime="0.00" timeLoss="61.57" rerouteNo="1" devices="tripinfo_bus_s2n_51 routing_bus_s2n_51" vType="Bus" speedFactor="1.00" vaporized=""/>
    <tripinfo id="car_n2s_85" depart="86.00" departLane="n2sep_1" departPos="3.60" departPosLat="0.00" departSpeed="13.90" departDelay="1.00" arrival="260.00" arrivalLane="c2s_1" arrivalPos="990.00" arrivalPosLat="0.00" arrivalSpeed="15.18" duration="174.00" routeLength="1997.01" waitingTime="21.00" waitingCount="1" stopTime="0.00" timeLoss="41.57" rerouteNo="1" devices="tripinfo_car_n2s_85 routing_car_n2s_85" vType="Car" speedFactor="1.09" vaporized=""/>
    <tripinfo id="car_s2e_67" depart="67.00" departLane="s2sep_1" departPos="3.60" departPosLat="0.00" departSpeed="13.90" departDelay="0.00" arrival="262.00" arrivalLane="c2e_1" arrivalPos="990.00" arrivalPosLat="0.00" arrivalSpeed="13.90" duration="195.00" routeLength="1986.69" waitingTime="37.00" waitingCount="1" stopTime="0.00" timeLoss="51.24" rerouteNo="1" devices="tripinfo_car_s2e_67 routing_car_s2e_67" vType="Car" speedFactor="1.00" vaporized=""/>
    <tripinfo id="car_n2w_84" depart="84.00" departLane="n2sep_1" departPos="3.60" departPosLat="0.00" departSpeed="13.90" departDelay="0.00" arrival="263.00" arrivalLane="c2w_1" arrivalPos="990.00" arrivalPosLat="0.00" arrivalSpeed="14.15" duration="179.00" routeLength="1986.69" waitingTime="22.00" waitingCount="1" stopTime="0.00" timeLoss="37.24" rerouteNo="1" devices="tripinfo_car_n2w_84 routing_car_n2w_84" vType="Car" speedFactor="1.02" vaporized=""/>
    <tripinfo id="car_s2n_73" depart="73.00" departLane="s2sep_1" departPos="3.60" departPosLat="0.00" departSpeed="13.90" departDelay="0.00" arrival="266.00" arrivalLane="c2n_1" arrivalPos="990.00" arrivalPosLat="0.00" arrivalSpeed="13.90" duration="193.00" routeLength="1997.01" waitingTime="32.00" waitingCount="1" stopTime="0.00" timeLoss="48.49" rerouteNo="1" devices="tripinfo_car_s2n_73 routing_car_s2n_73" vType="Car" speedFactor="1.00" vaporized=""/>
    <tripinfo id="car_n2s_107" depart="107.00" departLane="n2sep_1" departPos="3.60" departPosLat="0.00" departSpeed="13.90" departDelay="0.00" arrival="268.00" arrivalLane="c2s_1" arrivalPos="990.00" arrivalPosLat="0.00" arrivalSpeed="13.90" duration="161.00" routeLength="1997.01" waitingTime="1.00" waitingCount="1" stopTime="0.00" timeLoss="17.12" rerouteNo="1" devices="tripinfo_car_n2s_107 routing_car_n2s_107" vType="Car" speedFactor="1.00" vaporized=""/>
    <tripinfo id="car_s2e_138" depart="138.00" departLane="s2sep_1" departPos="3.60" departPosLat="0.00" departSpeed="13.90" departDelay="0.00" arrival="268.00" arrivalLane="c2e_1" arrivalPos="990.00" arrivalPosLat="0.00" arrivalSpeed="16.28" duration="130.00" routeLength="1986.69" waitingTime="0.00" waitingCount="0" stopTime="0.00" timeLoss="6.58" rerouteNo="1" devices="tripinfo_car_s2e_138 routing_car_s2e_138" vType="Car" speedFactor="1.17" vaporized=""/>
    <tripinfo id="car_s2n_90" depart="90.00" departLane="s2sep_1" departPos="3.60" departPosLat="0.00" departSpeed="13.90" departDelay="0.00" arrival="269.00" arrivalLane="c2n_1" arrivalPos="990.00" arrivalPosLat="0.00" arrivalSpeed="14.35" duration="179.00" routeLength="1997.01" waitingTime="19.00" waitingCount="1" stopTime="0.00" timeLoss="39.58" rerouteNo="1" devices="tripinfo_car_s2n_90 routing_car_s2n_90" vType="Car" speedFactor="1.04" vaporized=""/>
    <tripinfo id="car_n2s_133" depart="133.00" departLane="n2sep_1" departPos="3.60" departPosLat="0.00" departSpeed="13.90" departDelay="0.00" arrival="270.00" arrivalLane="c2s_1" arrivalPos="990.00" arrivalPosLat="0.00" arrivalSpeed="15.62" duration="137.00" routeLength="1997.01" waitingTime="0.00" waitingCount="0" stopTime="0.00" timeLoss="14.71" rerouteNo="1" devices="tripinfo_car_n2s_133 routing_car_n2s_133" vType="Car" speedFactor="1.18" vaporized=""/>
    <tripinfo id="car_s2n_101" depart="101.00" departLane="s2sep_1" departPos="3.60" departPosLat="0.00" departSpeed="13.90" departDelay="0.00" arrival="271.00" arrivalLane="c2n_1" arrivalPos="990.00" arrivalPosLat="0.00" arrivalSpeed="14.79" duration="170.00" routeLength="1997.01" waitingTime="13.00" waitingCount="1" stopTime="0.00" timeLoss="37.25" rerouteNo="1" devices="tripinfo_car_s2n_101 routing_car_s2n_101" vType="Car" speedFactor="1.09" vaporized=""/>
    <tripinfo id="car_n2w_117" depart="117.00" departLane="n2sep_1" departPos="3.60" departPosLat="0.00" departSpeed="13.90" departDelay="0.00" arrival="271.00" arrivalLane="c2w_1" arrivalPos="990.00" arrivalPosLat="0.00" arrivalSpeed="13.90" duration="154.00" routeLength="1986.69" waitingTime="0.00" waitingCount="0" stopTime="0.00" timeLoss="9.54" rerouteNo="1" devices="tripinfo_car_n2w_117 routing_car_n2w_117" vType="Car" speedFactor="1.00" vaporized=""/>
    <tripinfo id="car_s2w_124" depart="124.00" departLane="s2sep_1" departPos="3.60" departPosLat="0.00" departSpeed="13.90" departDelay="0.00" arrival="273.00" arrivalLane="c2w_1" arrivalPos="990.00" arrivalPosLat="0.00" arrivalSpeed="15.11" duration="149.00" routeLength="1996.47" waitingTime="4.00" waitingCount="1" stopTime="0.00" timeLoss="19.43" rerouteNo="1" devices="tripinfo_car_s2w_124 routing_car_s2w_124" vType="Car" speedFactor="1.12" vaporized=""/>
    <tripinfo id="car_s2n_102" depart="103.00" departLane="s2sep_1" departPos="3.60" departPosLat="0.00" departSpeed="13.90" departDelay="1.00" arrival="274.00" arrivalLane="c2n_1" arrivalPos="990.00" arrivalPosLat="0.00" arrivalSpeed="14.00" duration="171.00" routeLength="1997.01" waitingTime="7.00" waitingCount="1" stopTime="0.00" timeLoss="28.33" rerouteNo="1" devices="tripinfo_car_s2n_102 routing_car_s2n_102" vType="Car" speedFactor="1.01" vaporized=""/>
    <tripinfo id="car_n2e_110" depart="110.00" departLane="n2sep_1" departPos="3.60" departPosLat="0.00" departSpeed="13.90" departDelay="0.00" arrival="280.00" arrivalLane="c2e_1" arrivalPos="990.00" arrivalPosLat="0.00" arrivalSpeed="13.90" duration="170.00" routeLength="1996.47" waitingTime="13.00" waitingCount="1" stopTime="0.00" timeLoss="25.09" rerouteNo="1" devices="tripinfo_car_n2e_110 routing_car_n2e_110" vType="Car" speedFactor="1.00" vaporized=""/>
    <tripinfo id="car_n2e_112" depart="112.00" departLane="n2sep_1" departPos="3.60" departPosLat="0.00" departSpeed="13.90" departDelay="0.00" arrival="284.00" arrivalLane="c2e_1" arrivalPos="990.00" arrivalPosLat="0.00" arrivalSpeed="14.12" duration="172.00" routeLength="1996.47" waitingTime="12.00" waitingCount="1" stopTime="0.00" timeLoss="29.28" rerouteNo="1" devices="tripinfo_car_n2e_112 routing_car_n2e_112" vType="Car" speedFactor="1.02" vaporized=""/>
    <tripinfo id="car_s2w_141" depart="141.00" departLane="s2sep_1" departPos="3.60" departPosLat="0.00" departSpeed="13.90" departDelay="0.00" arrival="286.00" arrivalLane="c2w_1" arrivalPos="990.00" arrivalPosLat="0.00" arrivalSpeed="14.46" duration="145.00" routeLength="1996.47" waitingTime="0.00" waitingCount="0" stopTime="0.00" timeLoss="5.68" rerouteNo="1" devices="tripinfo_car_s2w_141 routing_car_s2w_141" vType="Car" speedFactor="1.04" vaporized=""/>
    <tripinfo id="car_n2e_145" depart="145.00" departLane="n2sep_1" departPos="3.60" departPosLat="0.00" departSpeed="13.90" departDelay="0.00" arrival="290.00" arrivalLane="c2e_1" arrivalPos="990.00" arrivalPosLat="0.00" arrivalSpeed="14.22" duration="145.00" routeLength="1996.47" waitingTime="0.00" waitingCount="0" stopTime="0.00" timeLoss="3.12" rerouteNo="1" devices="tripinfo_car_n2e_145 routing_car_n2e_145" vType="Car" speedFactor="1.02" vaporized=""/>
    <tripinfo id="car_w2s_114" depart="114.00" departLane="w2sep_1" departPos="3.60" departPosLat="0.00" departSpeed="13.90" departDelay="0.00" arrival="293.00" arrivalLane="c2s_1" arrivalPos="990.00" arrivalPosLat="0.00" arrivalSpeed="15.23" duration="179.00" routeLength="1986.69" waitingTime="37.00" waitingCount="1" stopTime="0.00" timeLoss="48.00" rerouteNo="1" devices="tripinfo_car_w2s_114 routing_car_w2s_114" vType="Car" speedFactor="1.10" vaporized=""/>
    <tripinfo id="car_w2s_120" depart="120.00" departLane="w2sep_1" departPos="3.60" departPosLat="0.00" departSpeed="13.90" departDelay="0.00" arrival="298.00" arrivalLane="c2s_1" arrivalPos="990.00" arrivalPosLat="0.00" arrivalSpeed="15.72" duration="178.00" routeLength="1986.69" waitingTime="30.00" waitingCount="1" stopTime="0.00" timeLoss="50.77" rerouteNo="1" devices="tripinfo_car_w2s_120 routing_car_w2s_120" vType="Car" speedFactor="1.13" vaporized=""/>
    <tripinfo id="car_e2n_110" depart="110.00" departLane="e2sep_1" departPos="3.60" departPosLat="0.00" departSpeed="13.90" departDelay="0.00" arrival="299.00" arrivalLane="c2n_1" arrivalPos="990.00" arrivalPosLat="0.00" arrivalSpeed="13.90" duration="189.00" routeLength="1986.69" waitingTime="36.00" waitingCount="1" stopTime="0.00" timeLoss="45.53" rerouteNo="1" devices="tripinfo_car_e2n_110 routing_car_e2n_110" vType="Car" speedFactor="1.00" vaporized=""/>
    <tripinfo id="car_w2e_118" depart="118.00" departLane="w2sep_1" departPos="3.60" departPosLat="0.00" departSpeed="13.90" departDelay="0.00" arrival="300.00" arrivalLane="c2e_1" arrivalPos="990.00" arrivalPosLat="0.00" arrivalSpeed="14.23" duration="182.00" routeLength="1997.01" waitingTime="30.00" waitingCount="1" stopTime="0.00" timeLoss="41.51" rerouteNo="1" devices="tripinfo_car_w2e_118 routing_car_w2e_118" vType="Car" speedFactor="1.02" vaporized=""/>
    <tripinfo id="car_e2n_111" depart="112.00" departLane="e2sep_1" departPos="3.60" departPosLat="0.00" departSpeed="13.90" departDelay="1.00" arrival="301.00" arrivalLane="c2n_1" arrivalPos="990.00" arrivalPosLat="0.00" arrivalSpeed="15.54" duration="189.00" routeLength="1986.69" waitingTime="35.00" waitingCount="1" stopTime="0.00" timeLoss="65.92" rerouteNo="1" devices="tripinfo_car_e2n_111 routing_car_e2n_111" vType="Car" speedFactor="1.17" vaporized=""/>
    <tripinfo id="car_e2n_117" depart="118.00" departLane="e2sep_1" departPos="3.60" departPosLat="0.00" departSpeed="13.90" departDelay="1.00" arrival="303.00" arrivalLane="c2n_1" arrivalPos="990.00" arrivalPosLat="0.00" arrivalSpeed="15.41" duration="185.00" routeLength="1986.69" waitingTime="32.00" waitingCount="1" stopTime="0.00" timeLoss="59.16" rerouteNo="1" devices="tripinfo_car_e2n_117 routing_car_e2n_117" vType="Car" speedFactor="1.14" vaporized=""/>
    <tripinfo id="car_e2w_114" depart="114.00" departLane="e2sep_1" departPos="3.60" departPosLat="0.00" departSpeed="13.90" departDelay="0.00" arrival="304.00" arrivalLane="c2w_1" arrivalPos="990.00" arrivalPosLat="0.00" arrivalSpeed="13.94" duration="190.00" routeLength="1997.01" waitingTime="33.00" waitingCount="1" stopTime="0.00" timeLoss="46.38" rerouteNo="1" devices="tripinfo_car_e2w_114 routing_car_e2w_114" vType="Car" speedFactor="1.00" vaporized=""/>
    <tripinfo id="car_w2s_122" depart="122.00" departLane="w2sep_1" departPos="3.60" departPosLat="0.00" departSpeed="13.90" departDelay="0.00" arrival="304.00" arrivalLane="c2s_1" arrivalPos="990.00" arrivalPosLat="0.00" arrivalSpeed="15.04" duration="182.00" routeLength="1986.69" waitingTime="29.00" waitingCount="1" stopTime="0.00" timeLoss="48.91" rerouteNo="1" devices="tripinfo_car_w2s_122 routing_car_w2s_122" vType="Car" speedFactor="1.08" vaporized=""/>
    <tripinfo id="car_w2e_142" depart="142.00" departLane="w2sep_1" departPos="3.60" departPosLat="0.00" departSpeed="13.90" departDelay="0.00" arrival="309.00" arrivalLane="c2e_1" arrivalPos="990.00" arrivalPosLat="0.00" arrivalSpeed="14.21" duration="167.00" routeLength="1997.01" waitingTime="11.00" waitingCount="1" stopTime="0.00" timeLoss="26.12" rerouteNo="1" devices="tripinfo_car_w2e_142 routing_car_w2e_142" vType="Car" speedFactor="1.02" vaporized=""/>
    <tripinfo id="car_e2n_131" depart="131.00" departLane="e2sep_1" departPos="3.60" departPosLat="0.00" departSpeed="13.90" departDelay="0.00" arrival="311.00" arrivalLane="c2n_1" arrivalPos="990.00" arrivalPosLat="0.00" arrivalSpeed="13.90" duration="180.00" routeLength="1986.69" waitingTime="20.00" waitingCount="1" stopTime="0.00" timeLoss="35.81" rerouteNo="1" devices="tripinfo_car_e2n_131 routing_car_e2n_131" vType="Car" speedFactor="1.00" vaporized=""/>
    <tripinfo id="car_e2n_138" depart="138.00" departLane="e2sep_1" departPos="3.60" departPosLat="0.00" departSpeed="13.90" departDelay="0.00" arrival="313.00" arrivalLane="c2n_1" arrivalPos="990.00" arrivalPosLat="0.00" arrivalSpeed="15.41" duration="175.00" routeLength="1986.69" waitingTime="20.00" waitingCount="1" stopTime="0.00" timeLoss="49.99" rerouteNo="1" devices="tripinfo_car_e2n_138 routing_car_e2n_138" vType="Car" speedFactor="1.15" vaporized=""/>
    <tripinfo id="bus_w2e_143" depart="144.00" departLane="w2sep_1" departPos="12.10" departPosLat="0.00" departSpeed="13.90" departDelay="1.00" arrival="315.00" arrivalLane="c2e_1" arrivalPos="990.00" arrivalPosLat="0.00" arrivalSpeed="13.88" duration="171.00" routeLength="1988.51" waitingTime="9.00" waitingCount="1" stopTime="0.00" timeLoss="27.31" rerouteNo="1" devices="tripinfo_bus_w2e_143 routing_bus_w2e_143" vType="Bus" speedFactor="1.00" vaporized=""/>
    <tripinfo id="car_e2s_115" depart="116.00" departLane="e2sep_1" departPos="3.60" departPosLat="0.00" departSpeed="13.90" departDelay="1.00" arrival="316.00" arrivalLane="c2s_1" arrivalPos="990.00" arrivalPosLat="0.00" arrivalSpeed="13.90" duration="200.00" routeLength="1996.47" waitingTime="39.00" waitingCount="2" stopTime="0.00" timeLoss="55.43" rerouteNo="1" devices="tripinfo_car_e2s_115 routing_car_e2s_115" vType="Car" speedFactor="1.00" vaporized=""/>
    <tripinfo id="bus_e2w_159" depart="160.00" departLane="e2sep_1" departPos="12.10" departPosLat="0.00" departSpeed="13.90" departDelay="1.00" arrival="318.00" arrivalLane="c2w_1" arrivalPos="990.00" arrivalPosLat="0.00" arrivalSpeed="13.90" duration="158.00" routeLength="1988.51" waitingTime="0.00" waitingCount="0" stopTime="0.00" timeLoss="14.17" rerouteNo="1" devices="tripinfo_bus_e2w_159 routing_bus_e2w_159" vType="Bus" speedFactor="1.00" vaporized=""/>
    <tripinfo id="car_e2s_129" depart="129.00" departLane="e2sep_1" departPos="3.60" departPosLat="0.00" departSpeed="13.90" departDelay="0.00" arrival="320.00" arrivalLane="c2s_1" arrivalPos="990.00" arrivalPosLat="0.00" arrivalSpeed="14.10" duration="191.00" routeLength="1996.47" waitingTime="28.00" waitingCount="2" stopTime="0.00" timeLoss="48.41" rerouteNo="1" devices="tripinfo_car_e2s_129 routing_car_e2s_129" vType="Car" speedFactor="1.02" vaporized=""/>
    <tripinfo id="car_e2w_162" depart="162.00" departLane="e2sep_1" departPos="3.60" departPosLat="0.00" departSpeed="13.90" departDelay="0.00" arrival="321.00" arrivalLane="c2w_1" arrivalPos="990.00" arrivalPosLat="0.00" arrivalSpeed="15.14" duration="159.00" routeLength="1997.01" waitingTime="0.00" waitingCount="0" stopTime="0.00" timeLoss="27.70" rerouteNo="1" devices="tripinfo_car_e2w_162 routing_car_e2w_162" vType="Car" speedFactor="1.10" vaporized=""/>
    <tripinfo id="car_w2e_177" depart="177.00" departLane="w2sep_1" departPos="3.60" departPosLat="0.00" departSpeed="13.90" departDelay="0.00" arrival="321.00" arrivalLane="c2e_1" arrivalPos="990.00" arrivalPosLat="0.00" arrivalSpeed="14.13" duration="144.00" routeLength="1997.01" waitingTime="0.00" waitingCount="0" stopTime="0.00" timeLoss="1.77" rerouteNo="1" devices="tripinfo_car_w2e_177 routing_car_w2e_177" vType="Car" speedFactor="1.02" vaporized=""/>
    <tripinfo id="car_w2e_182" depart="182.00" departLane="w2sep_1" departPos="3.60" departPosLat="0.00" departSpeed="13.90" departDelay="0.00" arrival="323.00" arrivalLane="c2e_1" arrivalPos="990.00" arrivalPosLat="0.00" arrivalSpeed="15.41" duration="141.00" routeLength="1997.01" waitingTime="0.00" waitingCount="0" stopTime="0.00" timeLoss="14.94" rerouteNo="1" devices="tripinfo_car_w2e_182 routing_car_w2e_182" vType="Car" speedFactor="1.15" vaporized=""/>
    <tripinfo id="car_e2s_138" depart="140.00" departLane="e2sep_1" departPos="3.60" departPosLat="0.00" departSpeed="13.90" departDelay="2.00" arrival="325.00" arrivalLane="c2s_1" arrivalPos="990.00" arrivalPosLat="0.00" arrivalSpeed="13.97" duration="185.00" routeLength="1996.47" waitingTime="18.00" waitingCount="2" stopTime="0.00" timeLoss="41.39" rerouteNo="1" devices="tripinfo_car_e2s_138 routing_car_e2s_138" vType="Car" speedFactor="1.01" vaporized=""/>
    <tripinfo id="car_e2n_176" depart="176.00" departLane="e2sep_1" departPos="3.60" departPosLat="0.00" departSpeed="13.90" departDelay="0.00" arrival="325.00" arrivalLane="c2n_1" arrivalPos="990.00" arrivalPosLat="0.00" arrivalSpeed="13.90" duration="149.00" routeLength="1986.69" waitingTime="0.00" waitingCount="0" stopTime="0.00" timeLoss="5.36" rerouteNo="1" devices="tripinfo_car_e2n_176 routing_car_e2n_176" vType="Car" speedFactor="1.00" vaporized=""/>
    <tripinfo id="car_e2s_158" depart="158.00" departLane="e2sep_1" departPos="3.60" departPosLat="0.00" departSpeed="13.90" departDelay="0.00" arrival="327.00" arrivalLane="c2s_1" arrivalPos="990.00" arrivalPosLat="0.00" arrivalSpeed="15.63" duration="169.00" routeLength="1996.47" waitingTime="11.00" waitingCount="2" stopTime="0.00" timeLoss="46.46" rerouteNo="1" devices="tripinfo_car_e2s_158 routing_car_e2s_158" vType="Car" speedFactor="1.18" vaporized=""/>
    <tripinfo id="car_e2n_181" depart="181.00" departLane="e2sep_1" departPos="3.60" departPosLat="0.00" departSpeed="13.90" departDelay="0.00" arrival="329.00" arrivalLane="c2n_1" arrivalPos="990.00" arrivalPosLat="0.00" arrivalSpeed="14.30" duration="148.00" routeLength="1986.69" waitingTime="0.00" waitingCount="0" stopTime="0.00" timeLoss="8.22" rerouteNo="1" devices="tripinfo_car_e2n_181 routing_car_e2n_181" vType="Car" speedFactor="1.03" vaporized=""/>
    <tripinfo id="car_w2n_108" depart="108.00" departLane="w2sep_1" departPos="3.60" departPosLat="0.00" departSpeed="13.90" departDelay="0.00" arrival="334.00" arrivalLane="c2n_1" arrivalPos="990.00" arrivalPosLat="0.00" arrivalSpeed="13.90" duration="226.00" routeLength="1996.47" waitingTime="62.00" waitingCount="2" stopTime="0.00" timeLoss="80.97" rerouteNo="1" devices="tripinfo_car_w2n_108 routing_car_w2n_108" vType="Car" speedFactor="1.00" vaporized=""/>
    <tripinfo id="bus_e2s_179" depart="179.00" departLane="e2sep_1" departPos="12.10" departPosLat="0.00" departSpeed="13.90" departDelay="0.00" arrival="335.00" arrivalLane="c2s_1" arrivalPos="990.00" arrivalPosLat="0.00" arrivalSpeed="13.90" duration="156.00" routeLength="1987.97" waitingTime="0.00" waitingCount="0" stopTime="0.00" timeLoss="11.82" rerouteNo="1" devices="tripinfo_bus_e2s_179 routing_bus_e2s_179" vType="Bus" speedFactor="1.00" vaporized=""/>
    <tripinfo id="bus_w2n_110" depart="111.00" departLane="w2sep_1" departPos="12.10" departPosLat="0.00" departSpeed="13.90" departDelay="1.00" arrival="338.00" arrivalLane="c2n_1" arrivalPos="990.00" arrivalPosLat="0.00" arrivalSpeed="13.84" duration="227.00" routeLength="1987.97" waitingTime="60.00" waitingCount="2" stopTime="0.00" timeLoss="82.89" rerouteNo="1" devices="tripinfo_bus_w2n_110 routing_bus_w2n_110" vType="Bus" speedFactor="1.00" vaporized=""/>
    <tripinfo id="car_e2s_190" depart="190.00" departLane="e2sep_1" departPos="3.60" departPosLat="0.00" departSpeed="13.90" departDelay="0.00" arrival="338.00" arrivalLane="c2s_1" arrivalPos="990.00" arrivalPosLat="0.00" arrivalSpeed="15.02" duration="148.00" routeLength="1996.47" waitingTime="0.00" waitingCount="0" stopTime="0.00" timeLoss="15.24" rerouteNo="1" devices="tripinfo_car_e2s_190 routing_car_e2s_190" vType="Car" speedFactor="1.09" vaporized=""/>
    <tripinfo id="car_w2n_148" depart="148.00" departLane="w2sep_1" departPos="3.60" departPosLat="0.00" departSpeed="13.90" departDelay="0.00" arrival="342.00" arrivalLane="c2n_1" arrivalPos="990.00" arrivalPosLat="0.00" arrivalSpeed="13.88" duration="194.00" routeLength="1996.47" waitingTime="25.00" waitingCount="2" stopTime="0.00" timeLoss="49.57" rerouteNo="1" devices="tripinfo_car_w2n_148 routing_car_w2n_148" vType="Car" speedFactor="1.00" vaporized=""/>
    <tripinfo id="car_n2w_161" depart="161.00" departLane="n2sep_1" departPos="3.60" departPosLat="0.00" departSpeed="13.90" departDelay="0.00" arrival="342.00" arrivalLane="c2w_1" arrivalPos="990.00" arrivalPosLat="0.00" arrivalSpeed="14.35" duration="181.00" routeLength="1986.69" waitingTime="32.00" waitingCount="1" stopTime="0.00" timeLoss="41.86" rerouteNo="1" devices="tripinfo_car_n2w_161 routing_car_n2w_161" vType="Car" speedFactor="1.03" vaporized=""/>
    <tripinfo id="car_n2s_169" depart="171.00" departLane="n2sep_1" departPos="3.60" departPosLat="0.00" departSpeed="13.90" departDelay="2.00" arrival="342.00" arrivalLane="c2s_1" arrivalPos="990.00" arrivalPosLat="0.00" arrivalSpeed="15.09" duration="171.00" routeLength="1997.01" waitingTime="26.00" waitingCount="1" stopTime="0.00" timeLoss="38.41" rerouteNo="1" devices="tripinfo_car_n2s_169 routing_car_n2s_169" vType="Car" speedFactor="1.09" vaporized=""/>
    <tripinfo id="car_s2e_183" depart="183.00" departLane="s2sep_1" departPos="3.60" departPosLat="0.00" departSpeed="13.90" departDelay="0.00" arrival="344.00" arrivalLane="c2e_1" arrivalPos="990.00" arrivalPosLat="0.00" arrivalSpeed="13.92" duration="161.00" routeLength="1986.69" waitingTime="8.00" waitingCount="1" stopTime="0.00" timeLoss="17.66" rerouteNo="1" devices="tripinfo_car_s2e_183 routing_car_s2e_183" vType="Car" speedFactor="1.00" vaporized=""/>
    <tripinfo id="car_w2n_156" depart="156.00" departLane="w2sep_1" departPos="3.60" departPosLat="0.00" departSpeed="13.90" departDelay="0.00" arrival="345.00" arrivalLane="c2n_1" arrivalPos="990.00" arrivalPosLat="0.00" arrivalSpeed="14.55" duration="189.00" routeLength="1996.47" waitingTime="24.00" waitingCount="1" stopTime="0.00" timeLoss="51.50" rerouteNo="1" devices="tripinfo_car_w2n_156 routing_car_w2n_156" vType="Car" speedFactor="1.06" vaporized=""/>
    <tripinfo id="car_s2e_198" depart="200.00" departLane="s2sep_1" departPos="3.60" departPosLat="0.00" departSpeed="13.90" departDelay="2.00" arrival="347.00" arrivalLane="c2e_1" arrivalPos="990.00" arrivalPosLat="0.00" arrivalSpeed="14.61" duration="147.00" routeLength="1986.69" waitingTime="0.00" waitingCount="0" stopTime="0.00" timeLoss="10.79" rerouteNo="1" devices="tripinfo_car_s2e_198 routing_car_s2e_198" vType="Car" speedFactor="1.06" vaporized=""/>
    <tripinfo id="car_n2w_202" depart="202.00" departLane="n2sep_1" departPos="3.60" departPosLat="0.00" departSpeed="13.90" departDelay="0.00" arrival="347.00" arrivalLane="c2w_1" arrivalPos="990.00" arrivalPosLat="0.00" arrivalSpeed="15.12" duration="145.00" routeLength="1986.69" waitingTime="0.00" waitingCount="0" stopTime="0.00" timeLoss="12.86" rerouteNo="1" devices="tripinfo_car_n2w_202 routing_car_n2w_202" vType="Car" speedFactor="1.09" vaporized=""/>
    <tripinfo id="car_s2n_201" depart="202.00" departLane="s2sep_1" departPos="3.60" departPosLat="0.00" departSpeed="13.90" departDelay="1.00" arrival="349.00" arrivalLane="c2n_1" arrivalPos="990.00" arrivalPosLat="0.00" arrivalSpeed="14.03" duration="147.00" routeLength="1997.01" waitingTime="0.00" waitingCount="0" stopTime="0.00" timeLoss="4.57" rerouteNo="1" devices="tripinfo_car_s2n_201 routing_car_s2n_201" vType="Car" speedFactor="1.01" vaporized=""/>
    <tripinfo id="car_n2s_183" depart="183.00" departLane="n2sep_1" departPos="3.60" departPosLat="0.00" departSpeed="13.90" departDelay="0.00" arrival="350.00" arrivalLane="c2s_1" arrivalPos="990.00" arrivalPosLat="0.00" arrivalSpeed="13.90" duration="167.00" routeLength="1997.01" waitingTime="11.00" waitingCount="1" stopTime="0.00" timeLoss="22.70" rerouteNo="1" devices="tripinfo_car_n2s_183 routing_car_n2s_183" vType="Car" speedFactor="1.00" vaporized=""/>
    <tripinfo id="car_n2e_169" depart="169.00" departLane="n2sep_1" departPos="3.60" departPosLat="0.00" departSpeed="13.90" departDelay="0.00" arrival="352.00" arrivalLane="c2e_1" arrivalPos="990.00" arrivalPosLat="0.00" arrivalSpeed="14.00" duration="183.00" routeLength="1996.47" waitingTime="23.00" waitingCount="2" stopTime="0.00" timeLoss="39.77" rerouteNo="1" devices="tripinfo_car_n2e_169 routing_car_n2e_169" vType="Car" speedFactor="1.01" vaporized=""/>
    <tripinfo id="car_s2w_155" depart="155.00" departLane="s2sep_1" departPos="3.60" departPosLat="0.00" departSpeed="13.90" departDelay="0.00" arrival="355.00" arrivalLane="c2w_1" arrivalPos="990.00" arrivalPosLat="0.00" arrivalSpeed="14.17" duration="200.00" routeLength="1996.47" waitingTime="41.00" waitingCount="2" stopTime="0.00" timeLoss="57.60" rerouteNo="1" devices="tripinfo_car_s2w_155 routing_car_s2w_155" vType="Car" speedFactor="1.02" vaporized=""/>
    <tripinfo id="car_n2e_186" depart="186.00" departLane="n2sep_1" departPos="3.60" departPosLat="0.00" departSpeed="13.90" departDelay="0.00" arrival="356.00" arrivalLane="c2e_1" arrivalPos="990.00" arrivalPosLat="0.00" arrivalSpeed="14.19" duration="170.00" routeLength="1996.47" waitingTime="7.00" waitingCount="1" stopTime="0.00" timeLoss="28.32" rerouteNo="1" devices="tripinfo_car_n2e_186 routing_car_n2e_186" vType="Car" speedFactor="1.02" vaporized=""/>
    <tripinfo id="car_n2e_191" depart="191.00" departLane="n2sep_1" departPos="3.60" departPosLat="0.00" departSpeed="13.90" departDelay="0.00" arrival="359.00" arrivalLane="c2e_1" arrivalPos="990.00" arrivalPosLat="0.00" arrivalSpeed="14.43" duration="168.00" routeLength="1996.47" waitingTime="5.00" waitingCount="1" stopTime="0.00" timeLoss="28.91" rerouteNo="1" devices="tripinfo_car_n2e_191 routing_car_n2e_191" vType="Car" speedFactor="1.04" vaporized=""/>
    <tripinfo id="car_n2s_213" depart="214.00" departLane="n2sep_1" departPos="3.60" departPosLat="0.00" departSpeed="13.90" departDelay="1.00" arrival="359.00" arrivalLane="c2s_1" arrivalPos="990.00" arrivalPosLat="0.00" arrivalSpeed="13.90" duration="145.00" routeLength="1997.01" waitingTime="0.00" waitingCount="0" stopTime="0.00" timeLoss="1.26" rerouteNo="1" devices="tripinfo_car_n2s_213 routing_car_n2s_213" vType="Car" speedFactor="1.00" vaporized=""/>
    <tripinfo id="car_s2w_169" depart="169.00" departLane="s2sep_1" departPos="3.60" departPosLat="0.00" departSpeed="13.90" departDelay="0.00" arrival="360.00" arrivalLane="c2w_1" arrivalPos="990.00" arrivalPosLat="0.00" arrivalSpeed="14.38" duration="191.00" routeLength="1996.47" waitingTime="28.00" waitingCount="2" stopTime="0.00" timeLoss="51.35" rerouteNo="1" devices="tripinfo_car_s2w_169 routing_car_s2w_169" vType="Car" speedFactor="1.03" vaporized=""/>
    <tripinfo id="car_s2w_184" depart="185.00" departLane="s2sep_1" departPos="3.60" departPosLat="0.00" departSpeed="13.90" departDelay="1.00" arrival="364.00" arrivalLane="c2w_1" arrivalPos="990.00" arrivalPosLat="0.00" arrivalSpeed="14.48" duration="179.00" routeLength="1996.47" waitingTime="14.00" waitingCount="2" stopTime="0.00" timeLoss="40.29" rerouteNo="1" devices="tripinfo_car_s2w_184 routing_car_s2w_184" vType="Car" speedFactor="1.04" vaporized=""/>
    <tripinfo id="car_s2e_214" depart="214.00" departLane="s2sep_1" departPos="3.60" departPosLat="0.00" departSpeed="13.90" departDelay="0.00" arrival="364.00" arrivalLane="c2e_1" arrivalPos="990.00" arrivalPosLat="0.00" arrivalSpeed="13.90" duration="150.00" routeLength="1986.69" waitingTime="0.00" waitingCount="0" stopTime="0.00" timeLoss="6.09" rerouteNo="1" devices="tripinfo_car_s2e_214 routing_car_s2e_214" vType="Car" speedFactor="1.00" vaporized=""/>
    <tripinfo id="car_s2w_198" depart="198.00" departLane="s2sep_1" departPos="3.60" departPosLat="0.00" departSpeed="13.90" departDelay="0.00" arrival="367.00" arrivalLane="c2w_1" arrivalPos="990.00" arrivalPosLat="0.00" arrivalSpeed="15.05" duration="169.00" routeLength="1996.47" waitingTime="5.00" waitingCount="2" stopTime="0.00" timeLoss="35.78" rerouteNo="1" devices="tripinfo_car_s2w_198 routing_car_s2w_198" vType="Car" speedFactor="1.09" vaporized=""/>
    <tripinfo id="car_n2e_212" depart="212.00" departLane="n2sep_1" departPos="3.60" departPosLat="0.00" departSpeed="13.90" departDelay="0.00" arrival="368.00" arrivalLane="c2e_1" arrivalPos="990.00" arrivalPosLat="0.00" arrivalSpeed="13.89" duration="156.00" routeLength="1996.47" waitingTime="0.00" waitingCount="0" stopTime="0.00" timeLoss="11.31" rerouteNo="1" devices="tripinfo_car_n2e_212 routing_car_n2e_212" vType="Car" speedFactor="1.00" vaporized=""/>
    <tripinfo id="car_s2w_209" depart="209.00" departLane="s2sep_1" departPos="3.60" departPosLat="0.00" departSpeed="13.90" departDelay="0.00" arrival="369.00" arrivalLane="c2w_1" arrivalPos="990.00" arrivalPosLat="0.00" arrivalSpeed="15.00" duration="160.00" routeLength="1996.47" waitingTime="2.00" waitingCount="1" stopTime="0.00" timeLoss="27.95" rerouteNo="1" devices="tripinfo_car_s2w_209 routing_car_s2w_209" vType="Car" speedFactor="1.10" vaporized=""/>
    <tripinfo id="bus_n2e_214" depart="217.00" departLane="n2sep_1" departPos="12.10" departPosLat="0.00" departSpeed="13.90" departDelay="3.00" arrival="372.00" arrivalLane="c2e_1" arrivalPos="990.00" arrivalPosLat="0.00" arrivalSpeed="13.81" duration="155.00" routeLength="1987.97" waitingTime="0.00" waitingCount="0" stopTime="0.00" timeLoss="10.71" rerouteNo="1" devices="tripinfo_bus_n2e_214 routing_bus_n2e_214" vType="Bus" speedFactor="1.00" vaporized=""/>
    <tripinfo id="car_n2e_219" depart="219.00" departLane="n2sep_1" departPos="3.60" departPosLat="0.00" departSpeed="13.90" departDelay="0.00" arrival="375.00" arrivalLane="c2e_1" arrivalPos="990.00" arrivalPosLat="0.00" arrivalSpeed="14.75" duration="156.00" routeLength="1996.47" waitingTime="0.00" waitingCount="0" stopTime="0.00" timeLoss="20.52" rerouteNo="1" devices="tripinfo_car_n2e_219 routing_car_n2e_219" vType="Car" speedFactor="1.07" vaporized=""/>
    <tripinfo id="car_n2e_220" depart="221.00" departLane="n2sep_1" departPos="3.60" departPosLat="0.00" departSpeed="13.90" departDelay="1.00" arrival="378.00" arrivalLane="c2e_1" arrivalPos="990.00" arrivalPosLat="0.00" arrivalSpeed="14.05" duration="157.00" routeLength="1996.47" waitingTime="0.00" waitingCount="0" stopTime="0.00" timeLoss="14.00" rerouteNo="1" devices="tripinfo_car_n2e_220 routing_car_n2e_220" vType="Car" speedFactor="1.01" vaporized=""/>
    <tripinfo id="car_e2n_204" depart="204.00" departLane="e2sep_1" departPos="3.60" departPosLat="0.00" departSpeed="13.90" departDelay="0.00" arrival="382.00" arrivalLane="c2n_1" arrivalPos="990.00" arrivalPosLat="0.00" arrivalSpeed="15.59" duration="178.00" routeLength="1986.69" waitingTime="39.00" waitingCount="1" stopTime="0.00" timeLoss="49.55" rerouteNo="1" devices="tripinfo_car_e2n_204 routing_car_e2n_204" vType="Car" speedFactor="1.12" vaporized=""/>
    <tripinfo id="car_w2s_185" depart="185.00" departLane="w2sep_1" departPos="3.60" departPosLat="0.00" departSpeed="13.90" departDelay="0.00" arrival="389.00" arrivalLane="c2s_1" arrivalPos="990.00" arrivalPosLat="0.00" arrivalSpeed="14.00" duration="204.00" routeLength="1986.69" waitingTime="51.00" waitingCount="1" stopTime="0.00" timeLoss="61.03" rerouteNo="1" devices="tripinfo_car_w2s_185 routing_car_w2s_185" vType="Car" speedFactor="1.01" vaporized=""/>
    <tripinfo id="car_w2e_187" depart="187.00" departLane="w2sep_1" departPos="3.60" departPosLat="0.00" departSpeed="13.90" departDelay="0.00" arrival="391.00" arrivalLane="c2e_1" arrivalPos="990.00" arrivalPosLat="0.00" arrivalSpeed="14.13" duration="204.00" routeLength="1997.01" waitingTime="49.00" waitingCount="1" stopTime="0.00" timeLoss="61.96" rerouteNo="1" devices="tripinfo_car_w2e_187 routing_car_w2e_187" vType="Car" speedFactor="1.02" vaporized=""/>
    <tripinfo id="car_e2n_230" depart="230.00" departLane="e2sep_1" departPos="3.60" departPosLat="0.00" departSpeed="13.90" departDelay="0.00" arrival="391.00" arrivalLane="c2n_1" arrivalPos="990.00" arrivalPosLat="0.00" arrivalSpeed="14.80" duration="161.00" routeLength="1986.69" waitingTime="12.00" waitingCount="1" stopTime="0.00" timeLoss="26.05" rerouteNo="1" devices="tripinfo_car_e2n_230 routing_car_e2n_230" vType="Car" speedFactor="1.06" vaporized=""/>
    <tripinfo id="car_e2s_211" depart="211.00" departLane="e2sep_1" departPos="3.60" departPosLat="0.00" departSpeed="13.90" departDelay="0.00" arrival="392.00" arrivalLane="c2s_1" arrivalPos="990.00" arrivalPosLat="0.00" arrivalSpeed="14.75" duration="181.00" routeLength="1996.47" waitingTime="29.00" waitingCount="1" stopTime="0.00" timeLoss="45.40" rerouteNo="1" devices="tripinfo_car_e2s_211 routing_car_e2s_211" vType="Car" speedFactor="1.07" vaporized=""/>
    <tripinfo id="car_e2w_216" depart="216.00" departLane="e2sep_1" departPos="3.60" departPosLat="0.00" departSpeed="13.90" departDelay="0.00" arrival="392.00" arrivalLane="c2w_1" arrivalPos="990.00" arrivalPosLat="0.00" arrivalSpeed="13.90" duration="176.00" routeLength="1997.01" waitingTime="21.00" waitingCount="1" stopTime="0.00" timeLoss="31.66" rerouteNo="1" devices="tripinfo_car_e2w_216 routing_car_e2w_216" vType="Car" speedFactor="1.00" vaporized=""/>
    <tripinfo id="car_e2s_228" depart="228.00" departLane="e2sep_1" departPos="3.60" departPosLat="0.00" departSpeed="13.90" departDelay="0.00" arrival="397.00" arrivalLane="c2s_1" arrivalPos="990.00" arrivalPosLat="0.00" arrivalSpeed="14.37" duration="169.00" routeLength="1996.47" waitingTime="11.00" waitingCount="1" stopTime="0.00" timeLoss="28.89" rerouteNo="1" devices="tripinfo_car_e2s_228 routing_car_e2s_228" vType="Car" speedFactor="1.03" vaporized=""/>
    <tripinfo id="car_e2w_232" depart="232.00" departLane="e2sep_1" departPos="3.60" departPosLat="0.00" departSpeed="13.90" departDelay="0.00" arrival="398.00" arrivalLane="c2w_1" arrivalPos="990.00" arrivalPosLat="0.00" arrivalSpeed="13.90" duration="166.00" routeLength="1997.01" waitingTime="7.00" waitingCount="1" stopTime="0.00" timeLoss="21.88" rerouteNo="1" devices="tripinfo_car_e2w_232 routing_car_e2w_232" vType="Car" speedFactor="1.00" vaporized=""/>
    <tripinfo id="car_e2w_235" depart="235.00" departLane="e2sep_1" departPos="3.60" departPosLat="0.00" departSpeed="13.90" departDelay="0.00" arrival="400.00" arrivalLane="c2w_1" arrivalPos="990.00" arrivalPosLat="0.00" arrivalSpeed="15.52" duration="165.00" routeLength="1997.01" waitingTime="7.00" waitingCount="1" stopTime="0.00" timeLoss="41.51" rerouteNo="1" devices="tripinfo_car_e2w_235 routing_car_e2w_235" vType="Car" speedFactor="1.17" vaporized=""/>
    <tripinfo id="car_e2n_235" depart="237.00" departLane="e2sep_1" departPos="3.60" departPosLat="0.00" departSpeed="13.90" departDelay="2.00" arrival="401.00" arrivalLane="c2n_1" arrivalPos="990.00" arrivalPosLat="0.00" arrivalSpeed="14.13" duration="164.00" routeLength="1986.69" waitingTime="5.00" waitingCount="1" stopTime="0.00" timeLoss="22.63" rerouteNo="1" devices="tripinfo_car_e2n_235 routing_car_e2n_235" vType="Car" speedFactor="1.02" vaporized=""/>
    <tripinfo id="car_e2w_255" depart="255.00" departLane="e2sep_1" departPos="3.60" departPosLat="0.00" departSpeed="13.90" departDelay="0.00" arrival="405.00" arrivalLane="c2w_1" arrivalPos="990.00" arrivalPosLat="0.00" arrivalSpeed="13.94" duration="150.00" routeLength="1997.01" waitingTime="0.00" waitingCount="0" stopTime="0.00" timeLoss="6.31" rerouteNo="1" devices="tripinfo_car_e2w_255 routing_car_e2w_255" vType="Car" speedFactor="1.00" vaporized=""/>
    <tripinfo id="car_e2n_261" depart="261.00" departLane="e2sep_1" departPos="3.60" departPosLat="0.00" departSpeed="13.90" departDelay="0.00" arrival="411.00" arrivalLane="c2n_1" arrivalPos="990.00" arrivalPosLat="0.00" arrivalSpeed="13.90" duration="150.00" routeLength="1986.69" waitingTime="0.00" waitingCount="0" stopTime="0.00" timeLoss="5.44" rerouteNo="1" devices="tripinfo_car_e2n_261 routing_car_e2n_261" vType="Car" speedFactor="1.00" vaporized=""/>
    <tripinfo id="car_e2s_265" depart="265.00" departLane="e2sep_1" departPos="3.60" departPosLat="0.00" departSpeed="13.90" departDelay="0.00" arrival="411.00" arrivalLane="c2s_1" arrivalPos="990.00" arrivalPosLat="0.00" arrivalSpeed="14.34" duration="146.00" routeLength="1996.47" waitingTime="0.00" waitingCount="0" stopTime="0.00" timeLoss="5.11" rerouteNo="1" devices="tripinfo_car_e2s_265 routing_car_e2s_265" vType="Car" speedFactor="1.03" vaporized=""/>
    <tripinfo id="car_e2s_266" depart="267.00" departLane="e2sep_1" departPos="3.60" departPosLat="0.00" departSpeed="13.90" departDelay="1.00" arrival="414.00" arrivalLane="c2s_1" arrivalPos="990.00" arrivalPosLat="0.00" arrivalSpeed="14.70" duration="147.00" routeLength="1996.47" waitingTime="0.00" waitingCount="0" stopTime="0.00" timeLoss="10.40" rerouteNo="1" devices="tripinfo_car_e2s_266 routing_car_e2s_266" vType="Car" speedFactor="1.06" vaporized=""/>
    <tripinfo id="car_w2n_158" depart="158.00" departLane="w2sep_1" departPos="3.60" departPosLat="0.00" departSpeed="13.90" departDelay="0.00" arrival="415.00" arrivalLane="c2n_1" arrivalPos="990.00" arrivalPosLat="0.00" arrivalSpeed="13.89" duration="257.00" routeLength="1996.47" waitingTime="82.00" waitingCount="3" stopTime="0.00" timeLoss="112.19" rerouteNo="1" devices="tripinfo_car_w2n_158 routing_car_w2n_158" vType="Car" speedFactor="1.00" vaporized=""/>
    <tripinfo id="car_w2n_191" depart="191.00" departLane="w2sep_1" departPos="3.60" departPosLat="0.00" departSpeed="13.90" departDelay="0.00" arrival="418.00" arrivalLane="c2n_1" arrivalPos="990.00" arrivalPosLat="0.00" arrivalSpeed="14.34" duration="227.00" routeLength="1996.47" waitingTime="57.00" waitingCount="2" stopTime="0.00" timeLoss="87.02" rerouteNo="1" devices="tripinfo_car_w2n_191 routing_car_w2n_191" vType="Car" speedFactor="1.04" vaporized=""/>
    <tripinfo id="car_n2w_240" depart="240.00" departLane="n2sep_1" departPos="3.60" departPosLat="0.00" departSpeed="13.90" departDelay="0.00" arrival="428.00" arrivalLane="c2w_1" arrivalPos="990.00" arrivalPosLat="0.00" arrivalSpeed="15.27" duration="188.00" routeLength="1986.69" waitingTime="47.00" waitingCount="1" stopTime="0.00" timeLoss="57.17" rerouteNo="1" devices="tripinfo_car_n2w_240 routing_car_n2w_240" vType="Car" speedFactor="1.10" vaporized=""/>
    <tripinfo id="car_s2e_253" depart="253.00" departLane="s2sep_1" departPos="3.60" departPosLat="0.00" departSpeed="13.90" departDelay="0.00" arrival="428.00" arrivalLane="c2e_1" arrivalPos="990.00" arrivalPosLat="0.00" arrivalSpeed="15.23" duration="175.00" routeLength="1986.69" waitingTime="34.00" waitingCount="1" stopTime="0.00" timeLoss="43.98" rerouteNo="1" devices="tripinfo_car_s2e_253 routing_car_s2e_253" vType="Car" speedFactor="1.10" vaporized=""/>
    <tripinfo id="car_n2s_263" depart="263.00" departLane="n2sep_1" departPos="3.60" departPosLat="0.00" departSpeed="13.90" departDelay="0.00" arrival="433.00" arrivalLane="c2s_1" arrivalPos="990.00" arrivalPosLat="0.00" arrivalSpeed="15.33" duration="170.00" routeLength="1997.01" waitingTime="27.00" waitingCount="1" stopTime="0.00" timeLoss="39.06" rerouteNo="1" devices="tripinfo_car_n2s_263 routing_car_n2s_263" vType="Car" speedFactor="1.10" vaporized=""/>
    <tripinfo id="car_n2w_245" depart="245.00" departLane="n2sep_1" departPos="3.60" departPosLat="0.00" departSpeed="13.90" departDelay="0.00" arrival="437.00" arrivalLane="c2w_1" arrivalPos="990.00" arrivalPosLat="0.00" arrivalSpeed="14.03" duration="192.00" routeLength="1986.69" waitingTime="38.00" waitingCount="1" stopTime="0.00" timeLoss="49.40" rerouteNo="1" devices="tripinfo_car_n2w_245 routing_car_n2w_245" vType="Car" speedFactor="1.01" vaporized=""/>
    <tripinfo id="car_s2n_254" depart="257.00" departLane="s2sep_1" departPos="3.60" departPosLat="0.00" departSpeed="13.90" departDelay="3.00" arrival="437.00" arrivalLane="c2n_1" arrivalPos="990.00" arrivalPosLat="0.00" arrivalSpeed="13.96" duration="180.00" routeLength="1997.01" waitingTime="25.00" waitingCount="1" stopTime="0.00" timeLoss="36.01" rerouteNo="1" devices="tripinfo_car_s2n_254 routing_car_s2n_254" vType="Car" speedFactor="1.00" vaporized=""/>
    <tripinfo id="car_s2e_265" depart="265.00" departLane="s2sep_1" departPos="3.60" departPosLat="0.00" departSpeed="13.90" departDelay="0.00" arrival="439.00" arrivalLane="c2e_1" arrivalPos="990.00" arrivalPosLat="0.00" arrivalSpeed="14.23" duration="174.00" routeLength="1986.69" waitingTime="20.00" waitingCount="1" stopTime="0.00" timeLoss="33.19" rerouteNo="1" devices="tripinfo_car_s2e_265 routing_car_s2e_265" vType="Car" speedFactor="1.02" vaporized=""/>
    <tripinfo id="car_s2w_254" depart="255.00" departLane="s2sep_1" departPos="3.60" departPosLat="0.00" departSpeed="13.90" departDelay="1.00" arrival="440.00" arrivalLane="c2w_1" arrivalPos="990.00" arrivalPosLat="0.00" arrivalSpeed="16.21" duration="185.00" routeLength="1996.47" waitingTime="43.00" waitingCount="2" stopTime="0.00" timeLoss="61.97" rerouteNo="1" devices="tripinfo_car_s2w_254 routing_car_s2w_254" vType="Car" speedFactor="1.18" vaporized=""/>
    <tripinfo id="car_s2n_279" depart="279.00" departLane="s2sep_1" departPos="3.60" departPosLat="0.00" departSpeed="13.90" departDelay="0.00" arrival="440.00" arrivalLane="c2n_1" arrivalPos="990.00" arrivalPosLat="0.00" arrivalSpeed="15.44" duration="161.00" routeLength="1997.01" waitingTime="10.00" waitingCount="1" stopTime="0.00" timeLoss="31.59" rerouteNo="1" devices="tripinfo_car_s2n_279 routing_car_s2n_279" vType="Car" speedFactor="1.12" vaporized=""/>
    <tripinfo id="car_n2s_281" depart="281.00" departLane="n2sep_1" departPos="3.60" departPosLat="0.00" departSpeed="13.90" departDelay="0.00" arrival="442.00" arrivalLane="c2s_1" arrivalPos="990.00" arrivalPosLat="0.00" arrivalSpeed="14.02" duration="161.00" routeLength="1997.01" waitingTime="5.00" waitingCount="1" stopTime="0.00" timeLoss="17.55" rerouteNo="1" devices="tripinfo_car_n2s_281 routing_car_n2s_281" vType="Car" speedFactor="1.01" vaporized=""/>
    <tripinfo id="car_s2n_298" depart="298.00" departLane="s2sep_1" departPos="3.60" departPosLat="0.00" departSpeed="13.90" departDelay="0.00" arrival="442.00" arrivalLane="c2n_1" arrivalPos="990.00" arrivalPosLat="0.00" arrivalSpeed="16.41" duration="144.00" routeLength="1997.01" waitingTime="2.00" waitingCount="1" stopTime="0.00" timeLoss="25.90" rerouteNo="1" devices="tripinfo_car_s2n_298 routing_car_s2n_298" vType="Car" speedFactor="1.23" vaporized=""/>
    <tripinfo id="car_s2e_276" depart="276.00" departLane="s2sep_1" departPos="3.60" departPosLat="0.00" departSpeed="13.90" departDelay="0.00" arrival="443.00" arrivalLane="c2e_1" arrivalPos="990.00" arrivalPosLat="0.00" arrivalSpeed="14.33" duration="167.00" routeLength="1986.69" waitingTime="11.00" waitingCount="1" stopTime="0.00" timeLoss="27.54" rerouteNo="1" devices="tripinfo_car_s2e_276 routing_car_s2e_276" vType="Car" speedFactor="1.03" vaporized=""/>
    <tripinfo id="car_n2s_290" depart="290.00" departLane="n2sep_1" departPos="3.60" departPosLat="0.00" departSpeed="13.90" departDelay="0.00" arrival="444.00" arrivalLane="c2s_1" arrivalPos="990.00" arrivalPosLat="0.00" arrivalSpeed="14.64" duration="154.00" routeLength="1997.01" waitingTime="1.00" waitingCount="1" stopTime="0.00" timeLoss="19.23" rerouteNo="1" devices="tripinfo_car_n2s_290 routing_car_n2s_290" vType="Car" speedFactor="1.07" vaporized=""/>
    <tripinfo id="car_n2s_309" depart="309.00" departLane="n2sep_1" departPos="3.60" departPosLat="0.00" departSpeed="13.90" departDelay="0.00" arrival="446.00" arrivalLane="c2s_1" arrivalPos="990.00" arrivalPosLat="0.00" arrivalSpeed="15.10" duration="137.00" routeLength="1997.01" waitingTime="0.00" waitingCount="0" stopTime="0.00" timeLoss="7.89" rerouteNo="1" devices="tripinfo_car_n2s_309 routing_car_n2s_309" vType="Car" speedFactor="1.11" vaporized=""/>
    <tripinfo id="car_s2w_259" depart="259.00" departLane="s2sep_1" departPos="3.60" departPosLat="0.00" departSpeed="13.90" departDelay="0.00" arrival="447.00" arrivalLane="c2w_1" arrivalPos="990.00" arrivalPosLat="0.00" arrivalSpeed="14.89" duration="188.00" routeLength="1996.47" waitingTime="34.00" waitingCount="2" stopTime="0.00" timeLoss="53.27" rerouteNo="1" devices="tripinfo_car_s2w_259 routing_car_s2w_259" vType="Car" speedFactor="1.07" vaporized=""/>
    <tripinfo id="car_s2w_290" depart="290.00" departLane="s2sep_1" departPos="3.60" departPosLat="0.00" departSpeed="13.90" departDelay="0.00" arrival="450.00" arrivalLane="c2w_1" arrivalPos="990.00" arrivalPosLat="0.00" arrivalSpeed="15.74" duration="160.00" routeLength="1996.47" waitingTime="9.00" waitingCount="2" stopTime="0.00" timeLoss="33.10" rerouteNo="1" devices="tripinfo_car_s2w_290 routing_car_s2w_290" vType="Car" speedFactor="1.14" vaporized=""/>
    <tripinfo id="car_s2e_299" depart="300.00" departLane="s2sep_1" departPos="3.60" departPosLat="0.00" departSpeed="13.90" departDelay="1.00" arrival="450.00" arrivalLane="c2e_1" arrivalPos="990.00" arrivalPosLat="0.00" arrivalSpeed="14.06" duration="150.00" routeLength="1986.69" waitingTime="0.00" waitingCount="0" stopTime="0.00" timeLoss="7.50" rerouteNo="1" devices="tripinfo_car_s2e_299 routing_car_s2e_299" vType="Car" speedFactor="1.01" vaporized=""/>
    <tripinfo id="car_s2e_308" depart="308.00" departLane="s2sep_1" departPos="3.60" departPosLat="0.00" departSpeed="13.90" departDelay="0.00" arrival="455.00" arrivalLane="c2e_1" arrivalPos="990.00" arrivalPosLat="0.00" arrivalSpeed="14.22" duration="147.00" routeLength="1986.69" waitingTime="0.00" waitingCount="0" stopTime="0.00" timeLoss="6.54" rerouteNo="1" devices="tripinfo_car_s2e_308 routing_car_s2e_308" vType="Car" speedFactor="1.02" vaporized=""/>
    <tripinfo id="car_s2w_316" depart="316.00" departLane="s2sep_1" departPos="3.60" departPosLat="0.00" departSpeed="13.90" departDelay="0.00" arrival="456.00" arrivalLane="c2w_1" arrivalPos="990.00" arrivalPosLat="0.00" arrivalSpeed="15.04" duration="140.00" routeLength="1996.47" waitingTime="0.00" waitingCount="0" stopTime="0.00" timeLoss="6.05" rerouteNo="1" devices="tripinfo_car_s2w_316 routing_car_s2w_316" vType="Car" speedFactor="1.08" vaporized=""/>
    <tripinfo id="car_n2e_252" depart="252.00" departLane="n2sep_1" departPos="3.60" departPosLat="0.00" departSpeed="13.90" departDelay="0.00" arrival="458.00" arrivalLane="c2e_1" arrivalPos="990.00" arrivalPosLat="0.00" arrivalSpeed="15.10" duration="206.00" routeLength="1996.47" waitingTime="51.00" waitingCount="2" stopTime="0.00" timeLoss="73.82" rerouteNo="1" devices="tripinfo_car_n2e_252 routing_car_n2e_252" vType="Car" speedFactor="1.10" vaporized=""/>
    <tripinfo id="car_n2e_269" depart="269.00" departLane="n2sep_1" departPos="3.60" departPosLat="0.00" departSpeed="13.90" departDelay="0.00" arrival="460.00" arrivalLane="c2e_1" arrivalPos="990.00" arrivalPosLat="0.00" arrivalSpeed="15.56" duration="191.00" routeLength="1996.47" waitingTime="37.00" waitingCount="2" stopTime="0.00" timeLoss="65.37" rerouteNo="1" devices="tripinfo_car_n2e_269 routing_car_n2e_269" vType="Car" speedFactor="1.15" vaporized=""/>
    <tripinfo id="bus_n2e_293" depart="293.00" departLane="n2sep_1" departPos="12.10" departPosLat="0.00" departSpeed="13.90" departDelay="0.00" arrival="467.00" arrivalLane="c2e_1" arrivalPos="990.00" arrivalPosLat="0.00" arrivalSpeed="13.89" duration="174.00" routeLength="1987.97" waitingTime="12.00" waitingCount="2" stopTime="0.00" timeLoss="29.63" rerouteNo="1" devices="tripinfo_bus_n2e_293 routing_bus_n2e_293" vType="Bus" speedFactor="1.00" vaporized=""/>
    <tripinfo id="car_w2e_282" depart="282.00" departLane="w2sep_1" departPos="3.60" departPosLat="0.00" departSpeed="13.90" departDelay="0.00" arrival="478.00" arrivalLane="c2e_1" arrivalPos="990.00" arrivalPosLat="0.00" arrivalSpeed="14.35" duration="196.00" routeLength="1997.01" waitingTime="46.00" waitingCount="1" stopTime="0.00" timeLoss="56.06" rerouteNo="1" devices="tripinfo_car_w2e_282 routing_car_w2e_282" vType="Car" speedFactor="1.03" vaporized=""/>
    <tripinfo id="car_e2n_277" depart="277.00" departLane="e2sep_1" departPos="3.60" departPosLat="0.00" departSpeed="13.90" departDelay="0.00" arrival="479.00" arrivalLane="c2n_1" arrivalPos="990.00" arrivalPosLat="0.00" arrivalSpeed="13.90" duration="202.00" routeLength="1986.69" waitingTime="49.00" waitingCount="1" stopTime="0.00" timeLoss="58.51" rerouteNo="1" devices="tripinfo_car_e2n_277 routing_car_e2n_277" vType="Car" speedFactor="1.00" vaporized=""/>
    <tripinfo id="car_w2s_291" depart="291.00" departLane="w2sep_1" departPos="3.60" departPosLat="0.00" departSpeed="13.90" departDelay="0.00" arrival="480.00" arrivalLane="c2s_1" arrivalPos="990.00" arrivalPosLat="0.00" arrivalSpeed="14.42" duration="189.00" routeLength="1986.69" waitingTime="38.00" waitingCount="1" stopTime="0.00" timeLoss="49.80" rerouteNo="1" devices="tripinfo_car_w2s_291 routing_car_w2s_291" vType="Car" speedFactor="1.04" vaporized=""/>
    <tripinfo id="car_w2s_301" depart="301.00" departLane="w2sep_1" departPos="3.60" departPosLat="0.00" departSpeed="13.90" departDelay="0.00" arrival="482.00" arrivalLane="c2s_1" arrivalPos="990.00" arrivalPosLat="0.00" arrivalSpeed="15.27" duration="181.00" routeLength="1986.69" waitingTime="35.00" waitingCount="1" stopTime="0.00" timeLoss="52.49" rerouteNo="1" devices="tripinfo_car_w2s_301 routing_car_w2s_301" vType="Car" speedFactor="1.12" vaporized=""/>
    <tripinfo id="car_e2n_308" depart="308.00" departLane="e2sep_1" departPos="3.60" departPosLat="0.00" departSpeed="13.90" departDelay="0.00" arrival="484.00" arrivalLane="c2n_1" arrivalPos="990.00" arrivalPosLat="0.00" arrivalSpeed="13.95" duration="176.00" routeLength="1986.69" waitingTime="19.00" waitingCount="1" stopTime="0.00" timeLoss="32.32" rerouteNo="1" devices="tripinfo_car_e2n_308 routing_car_e2n_308" vType="Car" speedFactor="1.00" vaporized=""/>
    <tripinfo id="car_e2n_314" depart="314.00" departLane="e2sep_1" departPos="3.60" departPosLat="0.00" departSpeed="13.90" departDelay="0.00" arrival="486.00" arrivalLane="c2n_1" arrivalPos="990.00" arrivalPosLat="0.00" arrivalSpeed="15.17" duration="172.00" routeLength="1986.69" waitingTime="19.00" waitingCount="1" stopTime="0.00" timeLoss="44.24" rerouteNo="1" devices="tripinfo_car_e2n_314 routing_car_e2n_314" vType="Car" speedFactor="1.13" vaporized=""/>
    <tripinfo id="car_e2n_323" depart="323.00" departLane="e2sep_1" departPos="3.60" departPosLat="0.00" departSpeed="13.90" departDelay="0.00" arrival="488.00" arrivalLane="c2n_1" arrivalPos="990.00" arrivalPosLat="0.00" arrivalSpeed="15.33" duration="165.00" routeLength="1986.69" waitingTime="15.00" waitingCount="1" stopTime="0.00" timeLoss="38.60" rerouteNo="1" devices="tripinfo_car_e2n_323 routing_car_e2n_323" vType="Car" speedFactor="1.14" vaporized=""/>
    <tripinfo id="car_w2s_311" depart="312.00" departLane="w2sep_1" departPos="3.60" departPosLat="0.00" departSpeed="13.90" departDelay="1.00" arrival="489.00" arrivalLane="c2s_1" arrivalPos="990.00" arrivalPosLat="0.00" arrivalSpeed="13.90" duration="177.00" routeLength="1986.69" waitingTime="18.00" waitingCount="1" stopTime="0.00" timeLoss="33.13" rerouteNo="1" devices="tripinfo_car_w2s_311 routing_car_w2s_311" vType="Car" speedFactor="1.00" vaporized=""/>
    <tripinfo id="car_e2w_341" depart="341.00" departLane="e2sep_1" departPos="3.60" departPosLat="0.00" departSpeed="13.90" departDelay="0.00" arrival="490.00" arrivalLane="c2w_1" arrivalPos="990.00" arrivalPosLat="0.00" arrivalSpeed="13.90" duration="149.00" routeLength="1997.01" waitingTime="0.00" waitingCount="0" stopTime="0.00" timeLoss="5.04" rerouteNo="1" devices="tripinfo_car_e2w_341 routing_car_e2w_341" vType="Car" speedFactor="1.00" vaporized=""/>
    <tripinfo id="car_w2e_334" depart="334.00" departLane="w2sep_1" departPos="3.60" departPosLat="0.00" departSpeed="13.90" departDelay="0.00" arrival="492.00" arrivalLane="c2e_1" arrivalPos="990.00" arrivalPosLat="0.00" arrivalSpeed="14.12" duration="158.00" routeLength="1997.01" waitingTime="0.00" waitingCount="0" stopTime="0.00" timeLoss="16.51" rerouteNo="1" devices="tripinfo_car_w2e_334 routing_car_w2e_334" vType="Car" speedFactor="1.02" vaporized=""/>
    <tripinfo id="car_w2n_303" depart="303.00" departLane="w2sep_1" departPos="3.60" departPosLat="0.00" departSpeed="13.90" departDelay="0.00" arrival="493.00" arrivalLane="c2n_1" arrivalPos="990.00" arrivalPosLat="0.00" arrivalSpeed="14.11" duration="190.00" routeLength="1996.47" waitingTime="30.00" waitingCount="2" stopTime="0.00" timeLoss="47.29" rerouteNo="1" devices="tripinfo_car_w2n_303 routing_car_w2n_303" vType="Car" speedFactor="1.02" vaporized=""/>
    <tripinfo id="car_w2s_332" depart="332.00" departLane="w2sep_1" departPos="3.60" departPosLat="0.00" departSpeed="13.90" departDelay="0.00" arrival="493.00" arrivalLane="c2s_1" arrivalPos="990.00" arrivalPosLat="0.00" arrivalSpeed="13.92" duration="161.00" routeLength="1986.69" waitingTime="0.00" waitingCount="0" stopTime="0.00" timeLoss="17.33" rerouteNo="1" devices="tripinfo_car_w2s_332 routing_car_w2s_332" vType="Car" speedFactor="1.00" vaporized=""/>
    <tripinfo id="car_w2e_356" depart="356.00" departLane="w2sep_1" departPos="3.60" departPosLat="0.00" departSpeed="13.90" departDelay="0.00" arrival="495.00" arrivalLane="c2e_1" arrivalPos="990.00" arrivalPosLat="0.00" arrivalSpeed="15.42" duration="139.00" routeLength="1997.01" waitingTime="0.00" waitingCount="0" stopTime="0.00" timeLoss="10.24" rerouteNo="1" devices="tripinfo_car_w2e_356 routing_car_w2e_356" vType="Car" speedFactor="1.12" vaporized=""/>
    <tripinfo id="car_e2n_354" depart="354.00" departLane="e2sep_1" departPos="3.60" departPosLat="0.00" departSpeed="13.90" departDelay="0.00" arrival="496.00" arrivalLane="c2n_1" arrivalPos="990.00" arrivalPosLat="0.00" arrivalSpeed="14.75" duration="142.00" routeLength="1986.69" waitingTime="0.00" waitingCount="0" stopTime="0.00" timeLoss="6.89" rerouteNo="1" devices="tripinfo_car_e2n_354 routing_car_e2n_354" vType="Car" speedFactor="1.06" vaporized=""/>
    <tripinfo id="car_w2n_310" depart="310.00" departLane="w2sep_1" departPos="3.60" departPosLat="0.00" departSpeed="13.90" departDelay="0.00" arrival="499.00" arrivalLane="c2n_1" arrivalPos="990.00" arrivalPosLat="0.00" arrivalSpeed="15.93" duration="189.00" routeLength="1996.47" waitingTime="29.00" waitingCount="2" stopTime="0.00" timeLoss="64.13" rerouteNo="1" devices="tripinfo_car_w2n_310 routing_car_w2n_310" vType="Car" speedFactor="1.16" vaporized=""/>
    <tripinfo id="car_w2s_360" depart="362.00" departLane="w2sep_1" departPos="3.60" departPosLat="0.00" departSpeed="13.90" departDelay="2.00" arrival="501.00" arrivalLane="c2s_1" arrivalPos="990.00" arrivalPosLat="0.00" arrivalSpeed="14.99" duration="139.00" routeLength="1986.69" waitingTime="0.00" waitingCount="0" stopTime="0.00" timeLoss="5.80" rerouteNo="1" devices="tripinfo_car_w2s_360 routing_car_w2s_360" vType="Car" speedFactor="1.08" vaporized=""/>
    <tripinfo id="car_w2n_339" depart="339.00" departLane="w2sep_1" departPos="3.60" departPosLat="0.00" departSpeed="13.90" departDelay="0.00" arrival="505.00" arrivalLane="c2n_1" arrivalPos="990.00" arrivalPosLat="0.00" arrivalSpeed="13.90" duration="166.00" routeLength="1996.47" waitingTime="3.00" waitingCount="1" stopTime="0.00" timeLoss="21.30" rerouteNo="1" devices="tripinfo_car_w2n_339 routing_car_w2n_339" vType="Car" speedFactor="1.00" vaporized=""/>
    <tripinfo id="car_w2n_360" depart="360.00" departLane="w2sep_1" departPos="3.60" departPosLat="0.00" departSpeed="13.90" departDelay="0.00" arrival="507.00" arrivalLane="c2n_1" arrivalPos="990.00" arrivalPosLat="0.00" arrivalSpeed="15.61" duration="147.00" routeLength="1996.47" waitingTime="0.00" waitingCount="0" stopTime="0.00" timeLoss="23.94" rerouteNo="1" devices="tripinfo_car_w2n_360 routing_car_w2n_360" vType="Car" speedFactor="1.18" vaporized=""/>
    <tripinfo id="car_w2n_363" depart="366.00" departLane="w2sep_1" departPos="3.60" departPosLat="0.00" departSpeed="13.90" departDelay="3.00" arrival="509.00" arrivalLane="c2n_1" arrivalPos="990.00" arrivalPosLat="0.00" arrivalSpeed="14.77" duration="143.00" routeLength="1996.47" waitingTime="0.00" waitingCount="0" stopTime="0.00" timeLoss="8.97" rerouteNo="1" devices="tripinfo_car_w2n_363 routing_car_w2n_363" vType="Car" speedFactor="1.08" vaporized=""/>
    <tripinfo id="car_w2e_362" depart="364.00" departLane="w2sep_1" departPos="3.60" departPosLat="0.00" departSpeed="13.90" departDelay="2.00" arrival="510.00" arrivalLane="c2e_1" arrivalPos="990.00" arrivalPosLat="0.00" arrivalSpeed="13.90" duration="146.00" routeLength="1997.01" waitingTime="0.00" waitingCount="0" stopTime="0.00" timeLoss="1.65" rerouteNo="1" devices="tripinfo_car_w2e_362 routing_car_w2e_362" vType="Car" speedFactor="1.00" vaporized=""/>
    <tripinfo id="car_s2e_361" depart="361.00" departLane="s2sep_1" departPos="3.60" departPosLat="0.00" departSpeed="13.90" departDelay="0.00" arrival="516.00" arrivalLane="c2e_1" arrivalPos="990.00" arrivalPosLat="1.00" arrivalSpeed="15.87" duration="155.00" routeLength="1986.69" waitingTime="18.00" waitingCount="1" stopTime="0.00" timeLoss="29.10" rerouteNo="1" devices="tripinfo_car_s2e_361 routing_car_s2e_361" vType="Car" speedFactor="1.14" vaporized=""/>
    <tripinfo id="car_e2s_371" depart="371.00" departLane="e2sep_1" departPos="3.60" departPosLat="0.00" departSpeed="13.90" departDelay="0.00" arrival="518.00" arrivalLane="c2s_1" arrivalPos="990.00" arrivalPosLat="0.00" arrivalSpeed="13.96" duration="147.00" routeLength="1996.47" waitingTime="0.00" waitingCount="0" stopTime="0.00" timeLoss="3.02" rerouteNo="1" devices="tripinfo_car_e2s_371 routing_car_e2s_371" vType="Car" speedFactor="1.00" vaporized=""/>
    <tripinfo id="amb_w2e_390" depart="390.00" departLane="w2sep_1" departPos="6.60" departPosLat="0.00" departSpeed="13.90" departDelay="0.00" arrival="518.00" arrivalLane="c2e_1" arrivalPos="990.00" arrivalPosLat="1.00" arrivalSpeed="18.61" duration="128.00" routeLength="1994.01" waitingTime="2.00" waitingCount="1" stopTime="0.00" timeLoss="31.65" rerouteNo="1" devices="tripinfo_amb_w2e_390 routing_amb_w2e_390 bluelight_amb_w2e_390" vType="Ambulance" speedFactor="1.50" vaporized="">
        <bluelight/>
    </tripinfo>
    <tripinfo id="car_n2s_331" depart="331.00" departLane="n2sep_1" departPos="3.60" departPosLat="0.00" departSpeed="13.90" departDelay="0.00" arrival="521.00" arrivalLane="c2s_1" arrivalPos="990.00" arrivalPosLat="0.00" arrivalSpeed="15.37" duration="190.00" routeLength="1997.01" waitingTime="47.00" waitingCount="1" stopTime="0.00" timeLoss="60.75" rerouteNo="1" devices="tripinfo_car_n2s_331 routing_car_n2s_331" vType="Car" speedFactor="1.12" vaporized=""/>
    <tripinfo id="car_s2n_368" depart="368.00" departLane="s2sep_1" departPos="3.60" departPosLat="0.00" departSpeed="13.90" departDelay="0.00" arrival="523.00" arrivalLane="c2n_1" arrivalPos="990.00" arrivalPosLat="0.00" arrivalSpeed="14.62" duration="155.00" routeLength="1997.01" waitingTime="7.00" waitingCount="1" stopTime="0.00" timeLoss="18.36" rerouteNo="1" devices="tripinfo_car_s2n_368 routing_car_s2n_368" vType="Car" speedFactor="1.05" vaporized=""/>
    <tripinfo id="car_n2s_334" depart="334.00" departLane="n2sep_1" departPos="3.60" departPosLat="0.00" departSpeed="13.90" departDelay="0.00" arrival="526.00" arrivalLane="c2s_1" arrivalPos="990.00" arrivalPosLat="0.00" arrivalSpeed="14.45" duration="192.00" routeLength="1997.01" waitingTime="40.00" waitingCount="1" stopTime="0.00" timeLoss="52.97" rerouteNo="1" devices="tripinfo_car_n2s_334 routing_car_n2s_334" vType="Car" speedFactor="1.04" vaporized=""/>
    <tripinfo id="car_n2w_340" depart="340.00" departLane="n2sep_1" departPos="3.60" departPosLat="0.00" departSpeed="13.90" departDelay="0.00" arrival="530.00" arrivalLane="c2w_1" arrivalPos="990.00" arrivalPosLat="0.00" arrivalSpeed="13.96" duration="190.00" routeLength="1986.69" waitingTime="34.00" waitingCount="1" stopTime="0.00" timeLoss="46.31" rerouteNo="1" devices="tripinfo_car_n2w_340 routing_car_n2w_340" vType="Car" speedFactor="1.00" vaporized=""/>
    <tripinfo id="car_n2s_360" depart="360.00" departLane="n2sep_1" departPos="3.60" departPosLat="0.00" departSpeed="13.90" departDelay="0.00" arrival="533.00" arrivalLane="c2s_1" arrivalPos="990.00" arrivalPosLat="0.00" arrivalSpeed="13.90" duration="173.00" routeLength="1997.01" waitingTime="15.00" waitingCount="1" stopTime="0.00" timeLoss="28.79" rerouteNo="1" devices="tripinfo_car_n2s_360 routing_car_n2s_360" vType="Car" speedFactor="1.00" vaporized=""/>
    <tripinfo id="car_n2w_371" depart="371.00" departLane="n2sep_1" departPos="3.60" departPosLat="0.00" departSpeed="13.90" departDelay="0.00" arrival="534.00" arrivalLane="c2w_1" arrivalPos="990.00" arrivalPosLat="0.00" arrivalSpeed="14.44" duration="163.00" routeLength="1986.69" waitingTime="8.00" waitingCount="1" stopTime="0.00" timeLoss="24.41" rerouteNo="1" devices="tripinfo_car_n2w_371 routing_car_n2w_371" vType="Car" speedFactor="1.04" vaporized=""/>
    <tripinfo id="car_s2e_376" depart="377.00" departLane="s2sep_1" departPos="3.60" departPosLat="0.00" departSpeed="13.90" departDelay="1.00" arrival="534.00" arrivalLane="c2e_1" arrivalPos="990.00" arrivalPosLat="1.00" arrivalSpeed="13.90" duration="157.00" routeLength="1986.69" waitingTime="0.00" waitingCount="0" stopTime="0.00" timeLoss="12.39" rerouteNo="1" devices="tripinfo_car_s2e_376 routing_car_s2e_376" vType="Car@car_s2e_376" speedFactor="1.00" vaporized=""/>
    <tripinfo id="car_n2e_391" depart="391.00" departLane="n2sep_1" departPos="3.60" departPosLat="0.00" departSpeed="13.90" departDelay="0.00" arrival="536.00" arrivalLane="c2e_1" arrivalPos="990.00" arrivalPosLat="0.00" arrivalSpeed="15.31" duration="145.00" routeLength="1996.47" waitingTime="1.00" waitingCount="1" stopTime="0.00" timeLoss="17.72" rerouteNo="1" devices="tripinfo_car_n2e_391 routing_car_n2e_391" vType="Car" speedFactor="1.14" vaporized=""/>
    <tripinfo id="car_n2s_372" depart="373.00" departLane="n2sep_1" departPos="3.60" departPosLat="0.00" departSpeed="13.90" departDelay="1.00" arrival="537.00" arrivalLane="c2s_1" arrivalPos="990.00" arrivalPosLat="0.00" arrivalSpeed="14.29" duration="164.00" routeLength="1997.01" waitingTime="5.00" waitingCount="1" stopTime="0.00" timeLoss="23.81" rerouteNo="1" devices="tripinfo_car_n2s_372 routing_car_n2s_372" vType="Car" speedFactor="1.03" vaporized=""/>
    <tripinfo id="car_n2w_376" depart="376.00" departLane="n2sep_1" departPos="3.60" departPosLat="0.00" departSpeed="13.90" departDelay="0.00" arrival="537.00" arrivalLane="c2w_1" arrivalPos="990.00" arrivalPosLat="0.00" arrivalSpeed="15.03" duration="161.00" routeLength="1986.69" waitingTime="4.00" waitingCount="1" stopTime="0.00" timeLoss="28.31" rerouteNo="1" devices="tripinfo_car_n2w_376 routing_car_n2w_376" vType="Car" speedFactor="1.09" vaporized=""/>
    <tripinfo id="car_n2s_396" depart="396.00" departLane="n2sep_1" departPos="3.60" departPosLat="0.00" departSpeed="13.90" departDelay="0.00" arrival="540.00" arrivalLane="c2s_1" arrivalPos="990.00" arrivalPosLat="0.00" arrivalSpeed="14.96" duration="144.00" routeLength="1997.01" waitingTime="0.00" waitingCount="0" stopTime="0.00" timeLoss="10.47" rerouteNo="1" devices="tripinfo_car_n2s_396 routing_car_n2s_396" vType="Car" speedFactor="1.08" vaporized=""/>
    <tripinfo id="car_s2n_406" depart="406.00" departLane="s2sep_1" departPos="3.60" departPosLat="0.00" departSpeed="13.90" departDelay="0.00" arrival="540.00" arrivalLane="c2n_1" arrivalPos="990.00" arrivalPosLat="0.00" arrivalSpeed="15.04" duration="134.00" routeLength="1997.01" waitingTime="0.00" waitingCount="0" stopTime="0.00" timeLoss="0.41" rerouteNo="1" devices="tripinfo_car_s2n_406 routing_car_s2n_406" vType="Car" speedFactor="1.08" vaporized=""/>
    <tripinfo id="car_s2w_340" depart="340.00" departLane="s2sep_1" departPos="3.60" departPosLat="0.00" departSpeed="13.90" departDelay="0.00" arrival="541.00" arrivalLane="c2w_1" arrivalPos="990.00" arrivalPosLat="0.00" arrivalSpeed="14.88" duration="201.00" routeLength="1996.47" waitingTime="49.00" waitingCount="2" stopTime="0.00" timeLoss="66.31" rerouteNo="1" devices="tripinfo_car_s2w_340 routing_car_s2w_340" vType="Car" speedFactor="1.07" vaporized=""/>
    <tripinfo id="car_s2n_410" depart="411.00" departLane="s2sep_1" departPos="3.60" departPosLat="0.00" departSpeed="13.90" departDelay="1.00" arrival="546.00" arrivalLane="c2n_1" arrivalPos="990.00" arrivalPosLat="0.00" arrivalSpeed="15.00" duration="135.00" routeLength="1997.01" waitingTime="0.00" waitingCount="0" stopTime="0.00" timeLoss="1.75" rerouteNo="1" devices="tripinfo_car_s2n_410 routing_car_s2n_410" vType="Car" speedFactor="1.08" vaporized=""/>
    <tripinfo id="car_s2w_375" depart="375.00" departLane="s2sep_1" departPos="3.60" departPosLat="0.00" departSpeed="13.90" departDelay="0.00" arrival="547.00" arrivalLane="c2w_1" arrivalPos="990.00" arrivalPosLat="0.00" arrivalSpeed="14.22" duration="172.00" routeLength="1996.47" waitingTime="14.00" waitingCount="2" stopTime="0.00" timeLoss="30.69" rerouteNo="1" devices="tripinfo_car_s2w_375 routing_car_s2w_375" vType="Car" speedFactor="1.02" vaporized=""/>
</tripinfos>
