<?xml version="1.0" encoding="UTF-8"?>

<!-- generated on Sat Apr 24 18:37:23 2021 by Eclipse SUMO Version 1.4.0
<configuration xmlns:xsi="http://www.w3.org/2001/XMLSchema-instance" xsi:noNamespaceSchemaLocation="http://sumo.dlr.de/xsd/sumoConfiguration.xsd">

    <input>
        <net-file value="sumofiles/junction.net.xml"/>
        <route-files value="sumofiles/junction_preemption_209.rou.xml"/>
        <additional-files value="sumofiles/junction.det.xml"/>
    </input>

    <output>
        <tripinfo-output value="sumofiles/output/tripinfo_preemption_209.xml"/>
    </output>

    <time>
        <begin value="0"/>
        <end value="10000"/>
        <step-length value="0.05"/>
    </time>

    <processing>
        <lateral-resolution value="0.1"/>
    </processing>

    <report>
        <no-warnings value="true"/>
        <error-log value="sumofiles/output/errorlog_preemption_209.log"/>
        <no-step-log value="true"/>
    </report>

    <traci_server>
        <remote-port value="40053"/>
    </traci_server>

    <gui_only>
        <gui-settings-file value="sumofiles/junction-gui.settings.xml"/>
        <tracker-interval value="0.05"/>
    </gui_only>

</configuration>
-->

<tripinfos xmlns:xsi="http://www.w3.org/2001/XMLSchema-instance" xsi:noNamespaceSchemaLocation="http://sumo.dlr.de/xsd/tripinfo_file.xsd">
    <tripinfo id="car_e2n_0" depart="0.00" departLane="e2sep_1" departPos="3.60" departPosLat="0.00" departSpeed="13.90" departDelay="0.00" arrival="139.30" arrivalLane="c2n_1" arrivalPos="990.00" arrivalPosLat="0.00" arrivalSpeed="14.73" duration="139.30" routeLength="1986.69" waitingTime="0.00" waitingCount="0" stopTime="0.00" timeLoss="3.74" rerouteNo="1" devices="tripinfo_car_e2n_0 routing_car_e2n_0" vType="Car" speedFactor="1.06" vaporized=""/>
    <tripinfo id="car_n2s_11" depart="11.00" departLane="n2sep_1" departPos="3.60" departPosLat="0.00" departSpeed="13.90" departDelay="0.00" arrival="160.40" arrivalLane="c2s_1" arrivalPos="990.00" arrivalPosLat="0.00" arrivalSpeed="15.05" duration="149.40" routeLength="1997.01" waitingTime="7.30" waitingCount="1" stopTime="0.00" timeLoss="16.67" rerouteNo="1" devices="tripinfo_car_n2s_11 routing_car_n2s_11" vType="Car" speedFactor="1.08" vaporized=""/>
    <tripinfo id="car_s2e_15" depart="15.00" departLane="s2sep_1" departPos="3.60" departPosLat="0.00" departSpeed="13.90" departDelay="0.00" arrival="162.55" arrivalLane="c2e_1" arrivalPos="990.00" arrivalPosLat="0.00" arrivalSpeed="14.54" duration="147.55" routeLength="1986.69" waitingTime="2.90" waitingCount="1" stopTime="0.00" timeLoss="10.19" rerouteNo="1" devices="tripinfo_car_s2e_15 routing_car_s2e_15" vType="Car" speedFactor="1.05" vaporized=""/>
    <tripinfo id="car_s2w_18" depart="18.00" departLane="s2sep_1" departPos="3.60" departPosLat="0.00" departSpeed="13.90" departDelay="0.00" arrival="167.10" arrivalLane="c2w_1" arrivalPos="990.00" arrivalPosLat="0.00" arrivalSpeed="14.04" duration="149.10" routeLength="1996.47" waitingTime="0.00" waitingCount="0" stopTime="0.00" timeLoss="6.27" rerouteNo="1" devices="tripinfo_car_s2w_18 routing_car_s2w_18" vType="Car" speedFactor="1.01" vaporized=""/>
    <tripinfo id="car_s2e_26" depart="26.00" departLane="s2sep_1" departPos="3.60" departPosLat="0.00" departSpeed="13.90" departDelay="0.00" arrival="170.15" arrivalLane="c2e_1" arrivalPos="990.00" arrivalPosLat="0.00" arrivalSpeed="14.32" duration="144.15" routeLength="1986.69" waitingTime="0.00" waitingCount="0" stopTime="0.00" timeLoss="4.73" rerouteNo="1" devices="tripinfo_car_s2e_26 routing_car_s2e_26" vType="Car" speedFactor="1.03" vaporized=""/>
    <tripinfo id="car_s2w_27" depart="27.40" departLane="s2sep_1" departPos="3.60" departPosLat="0.00" departSpeed="13.90" departDelay="0.40" arrival="170.25" arrivalLane="c2w_1" arrivalPos="990.00" arrivalPosLat="0.00" arrivalSpeed="15.08" duration="142.85" routeLength="1996.47" waitingTime="0.00" waitingCount="0" stopTime="0.00" timeLoss="10.51" rerouteNo="1" devices="tripinfo_car_s2w_27 routing_car_s2w_27" vType="Car" speedFactor="1.09" vaporized=""/>
    <tripinfo id="car_s2n_32" depart="32.00" departLane="s2sep_1" departPos="3.60" departPosLat="0.00" departSpeed="13.90" departDelay="0.00" arrival="176.85" arrivalLane="c2n_1" arrivalPos="990.00" arrivalPosLat="0.00" arrivalSpeed="13.90" duration="144.85" routeLength="1997.01" waitingTime="0.00" waitingCount="0" stopTime="0.00" timeLoss="1.15" rerouteNo="1" devices="tripinfo_car_s2n_32 routing_car_s2n_32" vType="Car" speedFactor="1.00" vaporized=""/>
    <tripinfo id="car_s2n_44" depart="44.00" departLane="s2sep_1" departPos="3.60" departPosLat="0.00" departSpeed="13.90" departDelay="0.00" arrival="179.40" arrivalLane="c2n_1" arrivalPos="990.00" arrivalPosLat="0.00" arrivalSpeed="15.84" duration="135.40" routeLength="1997.01" waitingTime="0.00" waitingCount="0" stopTime="0.00" timeLoss="11.33" rerouteNo="1" devices="tripinfo_car_s2n_44 routing_car_s2n_44" vType="Car" speedFactor="1.16" vaporized=""/>
    <tripinfo id="bus_s2e_34" depart="34.15" departLane="s2sep_1" departPos="12.10" departPosLat="0.00" departSpeed="13.90" departDelay="0.15" arrival="186.00" arrivalLane="c2e_1" arrivalPos="990.00" arrivalPosLat="0.00" arrivalSpeed="13.90" duration="151.85" routeLength="1978.19" waitingTime="0.00" waitingCount="0" stopTime="0.00" timeLoss="8.76" rerouteNo="1" devices="tripinfo_bus_s2e_34 routing_bus_s2e_34" vType="Bus" speedFactor="1.00" vaporized=""/>
    <tripinfo id="car_n2e_8" depart="8.00" departLane="n2sep_1" departPos="3.60" departPosLat="0.00" departSpeed="13.90" departDelay="0.00" arrival="189.40" arrivalLane="c2e_1" arrivalPos="990.00" arrivalPosLat="0.00" arrivalSpeed="14.66" duration="181.40" routeLength="1996.47" waitingTime="30.80" waitingCount="3" stopTime="0.00" timeLoss="45.23" rerouteNo="1" devices="tripinfo_car_n2e_8 routing_car_n2e_8" vType="Car" speedFactor="1.06" vaporized=""/>
    <tripinfo id="car_n2s_51" depart="51.00" departLane="n2sep_1" departPos="3.60" departPosLat="0.00" departSpeed="13.90" departDelay="0.00" arrival="190.15" arrivalLane="c2s_1" arrivalPos="990.00" arrivalPosLat="0.00" arrivalSpeed="15.16" duration="139.15" routeLength="1997.01" waitingTime="0.00" waitingCount="0" stopTime="0.00" timeLoss="7.38" rerouteNo="1" devices="tripinfo_car_n2s_51 routing_car_n2s_51" vType="Car" speedFactor="1.09" vaporized=""/>
    <tripinfo id="car_n2w_43" depart="43.00" departLane="n2sep_1" departPos="3.60" departPosLat="0.00" departSpeed="13.90" departDelay="0.00" arrival="190.20" arrivalLane="c2w_1" arrivalPos="990.00" arrivalPosLat="0.00" arrivalSpeed="13.90" duration="147.20" routeLength="1986.69" waitingTime="0.00" waitingCount="0" stopTime="0.00" timeLoss="3.52" rerouteNo="1" devices="tripinfo_car_n2w_43 routing_car_n2w_43" vType="Car" speedFactor="1.00" vaporized=""/>
    <tripinfo id="car_n2e_28" depart="28.00" departLane="n2sep_1" departPos="3.60" departPosLat="0.00" departSpeed="13.90" departDelay="0.00" arrival="193.20" arrivalLane="c2e_1" arrivalPos="990.00" arrivalPosLat="0.00" arrivalSpeed="14.24" duration="165.20" routeLength="1996.47" waitingTime="13.80" waitingCount="1" stopTime="0.00" timeLoss="24.58" rerouteNo="1" devices="tripinfo_car_n2e_28 routing_car_n2e_28" vType="Car" speedFactor="1.03" vaporized=""/>
    <tripinfo id="car_n2w_44" depart="44.45" departLane="n2sep_1" departPos="3.60" departPosLat="0.00" departSpeed="13.90" departDelay="0.45" arrival="195.50" arrivalLane="c2w_1" arrivalPos="990.00" arrivalPosLat="0.00" arrivalSpeed="13.90" duration="151.05" routeLength="1986.69" waitingTime="0.00" waitingCount="0" stopTime="0.00" timeLoss="7.35" rerouteNo="1" devices="tripinfo_car_n2w_44 routing_car_n2w_44" vType="Car" speedFactor="1.00" vaporized=""/>
    <tripinfo id="car_n2e_53" depart="54.10" departLane="n2sep_1" departPos="3.60" departPosLat="0.00" departSpeed="13.90" departDelay="1.10" arrival="196.10" arrivalLane="c2e_1" arrivalPos="990.00" arrivalPosLat="0.00" arrivalSpeed="15.48" duration="142.00" routeLength="1996.47" waitingTime="0.00" waitingCount="0" stopTime="0.00" timeLoss="13.46" rerouteNo="1" devices="tripinfo_car_n2e_53 routing_car_n2e_53" vType="Car" speedFactor="1.12" vaporized=""/>
    <tripinfo id="car_s2w_45" depart="45.25" departLane="s2sep_1" departPos="3.60" departPosLat="0.00" departSpeed="13.90" departDelay="0.25" arrival="199.35" arrivalLane="c2w_1" arrivalPos="990.00" arrivalPosLat="0.00" arrivalSpeed="14.13" duration="154.10" routeLength="1996.47" waitingTime="2.80" waitingCount="1" stopTime="0.00" timeLoss="12.35" rerouteNo="1" devices="tripinfo_car_s2w_45 routing_car_s2w_45" vType="Car" speedFactor="1.02" vaporized=""/>
    <tripinfo id="car_e2w_32" depart="32.00" departLane="e2sep_1" departPos="3.60" departPosLat="0.00" departSpeed="13.90" departDelay="0.00" arrival="205.55" arrivalLane="c2w_1" arrivalPos="990.00" arrivalPosLat="0.00" arrivalSpeed="15.61" duration="173.55" routeLength="1997.01" waitingTime="36.20" waitingCount="1" stopTime="0.00" timeLoss="45.60" rerouteNo="1" devices="tripinfo_car_e2w_32 routing_car_e2w_32" vType="Car" speedFactor="1.12" vaporized=""/>
    <tripinfo id="car_e2n_11" depart="11.00" departLane="e2sep_1" departPos="3.60" departPosLat="0.00" departSpeed="13.90" departDelay="0.00" arrival="208.55" arrivalLane="c2n_1" arrivalPos="990.00" arrivalPosLat="0.00" arrivalSpeed="14.32" duration="197.55" routeLength="1986.69" waitingTime="51.15" waitingCount="1" stopTime="0.00" timeLoss="58.14" rerouteNo="1" devices="tripinfo_car_e2n_11 routing_car_e2n_11" vType="Car" speedFactor="1.03" vaporized=""/>
    <tripinfo id="car_w2s_10" depart="10.00" departLane="w2sep_1" departPos="3.60" departPosLat="0.00" departSpeed="13.90" departDelay="0.00" arrival="209.95" arrivalLane="c2s_1" arrivalPos="990.00" arrivalPosLat="0.00" arrivalSpeed="14.04" duration="199.95" routeLength="1986.69" waitingTime="51.00" waitingCount="1" stopTime="0.00" timeLoss="57.75" rerouteNo="1" devices="tripinfo_car_w2s_10 routing_car_w2s_10" vType="Car" speedFactor="1.01" vaporized=""/>
    <tripinfo id="car_w2e_15" depart="15.00" departLane="w2sep_1" departPos="3.60" departPosLat="0.00" departSpeed="13.90" departDelay="0.00" arrival="212.85" arrivalLane="c2e_1" arrivalPos="990.00" arrivalPosLat="0.00" arrivalSpeed="13.90" duration="197.85" routeLength="1997.01" waitingTime="45.50" waitingCount="1" stopTime="0.00" timeLoss="54.17" rerouteNo="1" devices="tripinfo_car_w2e_15 routing_car_w2e_15" vType="Car" speedFactor="1.00" vaporized=""/>
    <tripinfo id="car_w2s_32" depart="32.00" departLane="w2sep_1" departPos="3.60" departPosLat="0.00" departSpeed="13.90" departDelay="0.00" arrival="213.75" arrivalLane="c2s_1" arrivalPos="990.00" arrivalPosLat="0.00" arrivalSpeed="14.53" duration="181.75" routeLength="1986.69" waitingTime="32.85" waitingCount="1" stopTime="0.00" timeLoss="44.54" rerouteNo="1" devices="tripinfo_car_w2s_32 routing_car_w2s_32" vType="Car" speedFactor="1.05" vaporized=""/>
    <tripinfo id="car_e2n_63" depart="63.00" departLane="e2sep_1" departPos="3.60" departPosLat="0.00" departSpeed="13.90" departDelay="0.00" arrival="215.90" arrivalLane="c2n_1" arrivalPos="990.00" arrivalPosLat="0.00" arrivalSpeed="13.90" duration="152.90" routeLength="1986.69" waitingTime="0.00" waitingCount="0" stopTime="0.00" timeLoss="9.26" rerouteNo="1" devices="tripinfo_car_e2n_63 routing_car_e2n_63" vType="Car" speedFactor="1.00" vaporized=""/>
    <tripinfo id="car_w2e_53" depart="53.00" departLane="w2sep_1" departPos="3.60" departPosLat="0.00" departSpeed="13.90" departDelay="0.00" arrival="217.30" arrivalLane="c2e_1" arrivalPos="990.00" arrivalPosLat="0.00" arrivalSpeed="14.54" duration="164.30" routeLength="1997.01" waitingTime="11.20" waitingCount="1" stopTime="0.00" timeLoss="27.09" rerouteNo="1" devices="tripinfo_car_w2e_53 routing_car_w2e_53" vType="Car" speedFactor="1.05" vaporized=""/>
    <tripinfo id="car_w2s_38" depart="38.00" departLane="w2sep_1" departPos="3.60" departPosLat="0.00" departSpeed="13.90" departDelay="0.00" arrival="217.35" arrivalLane="c2s_1" arrivalPos="990.00" arrivalPosLat="0.00" arrivalSpeed="14.51" duration="179.35" routeLength="1986.69" waitingTime="27.85" waitingCount="1" stopTime="0.00" timeLoss="41.99" rerouteNo="1" devices="tripinfo_car_w2s_38 routing_car_w2s_38" vType="Car" speedFactor="1.05" vaporized=""/>
    <tripinfo id="car_e2n_65" depart="65.00" departLane="e2sep_1" departPos="3.60" departPosLat="0.00" departSpeed="13.90" departDelay="0.00" arrival="217.95" arrivalLane="c2n_1" arrivalPos="990.00" arrivalPosLat="0.00" arrivalSpeed="15.19" duration="152.95" routeLength="1986.69" waitingTime="0.00" waitingCount="0" stopTime="0.00" timeLoss="25.99" rerouteNo="1" devices="tripinfo_car_e2n_65 routing_car_e2n_65" vType="Car" speedFactor="1.13" vaporized=""/>
    <tripinfo id="car_w2n_25" depart="25.00" departLane="w2sep_1" departPos="3.60" departPosLat="0.00" departSpeed="13.90" departDelay="0.00" arrival="220.40" arrivalLane="c2n_1" arrivalPos="990.00" arrivalPosLat="0.00" arrivalSpeed="14.85" duration="195.40" routeLength="1996.47" waitingTime="45.70" waitingCount="2" stopTime="0.00" timeLoss="62.07" rerouteNo="1" devices="tripinfo_car_w2n_25 routing_car_w2n_25" vType="Car" speedFactor="1.08" vaporized=""/>
    <tripinfo id="car_w2n_41" depart="41.00" departLane="w2sep_1" departPos="3.60" departPosLat="0.00" departSpeed="13.90" departDelay="0.00" arrival="225.00" arrivalLane="c2n_1" arrivalPos="990.00" arrivalPosLat="0.00" arrivalSpeed="13.89" duration="184.00" routeLength="1996.47" waitingTime="23.85" waitingCount="2" stopTime="0.00" timeLoss="39.69" rerouteNo="1" devices="tripinfo_car_w2n_41 routing_car_w2n_41" vType="Car" speedFactor="1.00" vaporized=""/>
    <tripinfo id="car_e2s_80" depart="80.00" departLane="e2sep_1" departPos="3.60" departPosLat="0.00" departSpeed="13.90" departDelay="0.00" arrival="225.30" arrivalLane="c2s_1" arrivalPos="990.00" arrivalPosLat="0.00" arrivalSpeed="14.17" duration="145.30" routeLength="1996.47" waitingTime="0.00" waitingCount="0" stopTime="0.00" timeLoss="3.77" rerouteNo="1" devices="tripinfo_car_e2s_80 routing_car_e2s_80" vType="Car" speedFactor="1.02" vaporized=""/>
    <tripinfo id="car_w2n_51" depart="51.00" departLane="w2sep_1" departPos="3.60" departPosLat="0.00" departSpeed="13.90" departDelay="0.00" arrival="228.40" arrivalLane="c2n_1" arrivalPos="990.00" arrivalPosLat="0.00" arrivalSpeed="14.00" duration="177.40" routeLength="1996.47" waitingTime="14.00" waitingCount="2" stopTime="0.00" timeLoss="34.53" rerouteNo="1" devices="tripinfo_car_w2n_51 routing_car_w2n_51" vType="Car" speedFactor="1.01" vaporized=""/>
    <tripinfo id="car_w2n_58" depart="58.00" departLane="w2sep_1" departPos="3.60" departPosLat="0.00" departSpeed="13.90" departDelay="0.00" arrival="231.80" arrivalLane="c2n_1" arrivalPos="990.00" arrivalPosLat="0.00" arrivalSpeed="13.86" duration="173.80" routeLength="1996.47" waitingTime="6.25" waitingCount="2" stopTime="0.00" timeLoss="29.48" rerouteNo="1" devices="tripinfo_car_w2n_58 routing_car_w2n_58" vType="Car" speedFactor="1.00" vaporized=""/>
    <tripinfo id="car_e2n_92" depart="92.00" departLane="e2sep_1" departPos="3.60" departPosLat="0.00" departSpeed="13.90" departDelay="0.00" arrival="233.85" arrivalLane="c2n_1" arrivalPos="990.00" arrivalPosLat="0.00" arrivalSpeed="14.83" duration="141.85" routeLength="1986.69" waitingTime="0.00" waitingCount="0" stopTime="0.00" timeLoss="11.48" rerouteNo="1" devices="tripinfo_car_e2n_92 routing_car_e2n_92" vType="Car" speedFactor="1.10" vaporized=""/>
    <tripinfo id="car_w2e_103" depart="103.00" departLane="w2sep_1" departPos="3.60" departPosLat="0.00" departSpeed="13.90" departDelay="0.00" arrival="235.35" arrivalLane="c2e_1" arrivalPos="990.00" arrivalPosLat="0.00" arrivalSpeed="15.18" duration="132.35" routeLength="1997.01" waitingTime="0.00" waitingCount="0" stopTime="0.00" timeLoss="0.78" rerouteNo="1" devices="tripinfo_car_w2e_103 routing_car_w2e_103" vType="Car" speedFactor="1.09" vaporized=""/>
    <tripinfo id="car_w2n_75" depart="75.00" departLane="w2sep_1" departPos="3.60" departPosLat="0.00" departSpeed="13.90" departDelay="0.00" arrival="237.30" arrivalLane="c2n_1" arrivalPos="990.00" arrivalPosLat="0.00" arrivalSpeed="13.94" duration="162.30" routeLength="1996.47" waitingTime="1.55" waitingCount="3" stopTime="0.00" timeLoss="18.74" rerouteNo="1" devices="tripinfo_car_w2n_75 routing_car_w2n_75" vType="Car" speedFactor="1.01" vaporized=""/>
    <tripinfo id="bus_w2n_93" depart="93.00" departLane="w2sep_1" departPos="12.10" departPosLat="0.00" departSpeed="13.90" departDelay="0.00" arrival="242.90" arrivalLane="c2n_1" arrivalPos="990.00" arrivalPosLat="0.00" arrivalSpeed="13.88" duration="149.90" routeLength="1987.97" waitingTime="0.00" waitingCount="0" stopTime="0.00" timeLoss="6.18" rerouteNo="1" devices="tripinfo_bus_w2n_93 routing_bus_w2n_93" vType="Bus" speedFactor="1.00" vaporized=""/>
    <tripinfo id="car_e2s_102" depart="102.00" departLane="e2sep_1" departPos="3.60" departPosLat="0.00" departSpeed="13.90" departDelay="0.00" arrival="247.15" arrivalLane="c2s_1" arrivalPos="990.00" arrivalPosLat="0.00" arrivalSpeed="14.15" duration="145.15" routeLength="1996.47" waitingTime="0.00" waitingCount="0" stopTime="0.00" timeLoss="3.39" rerouteNo="1" devices="tripinfo_car_e2s_102 routing_car_e2s_102" vType="Car" speedFactor="1.02" vaporized=""/>
    <tripinfo id="car_n2w_67" depart="67.00" departLane="n2sep_1" departPos="3.60" departPosLat="0.00" departSpeed="13.90" departDelay="0.00" arrival="247.40" arrivalLane="c2w_1" arrivalPos="990.00" arrivalPosLat="0.00" arrivalSpeed="16.38" duration="180.40" routeLength="1986.69" waitingTime="48.30" waitingCount="1" stopTime="0.00" timeLoss="58.51" rerouteNo="1" devices="tripinfo_car_n2w_67 routing_car_n2w_67" vType="Car" speedFactor="1.18" vaporized=""/>
    <tripinfo id="car_n2s_52" depart="52.35" departLane="n2sep_1" departPos="3.60" departPosLat="0.00" departSpeed="13.90" departDelay="0.35" arrival="254.35" arrivalLane="c2s_1" arrivalPos="990.00" arrivalPosLat="0.00" arrivalSpeed="14.26" duration="202.00" routeLength="1997.01" waitingTime="52.25" waitingCount="1" stopTime="0.00" timeLoss="62.00" rerouteNo="1" devices="tripinfo_car_n2s_52 routing_car_n2s_52" vType="Car" speedFactor="1.03" vaporized=""/>
    <tripinfo id="car_s2e_65" depart="65.00" departLane="s2sep_1" departPos="3.60" departPosLat="0.00" departSpeed="13.90" departDelay="0.00" arrival="255.65" arrivalLane="c2e_1" arrivalPos="990.00" arrivalPosLat="0.00" arrivalSpeed="13.90" duration="190.65" routeLength="1986.69" waitingTime="40.05" waitingCount="1" stopTime="0.00" timeLoss="46.98" rerouteNo="1" devices="tripinfo_car_s2e_65 routing_car_s2e_65" vType="Car" speedFactor="1.00" vaporized=""/>
    <tripinfo id="car_n2s_68" depart="68.25" departLane="n2sep_1" departPos="3.60" departPosLat="0.00" departSpeed="13.90" departDelay="0.25" arrival="256.40" arrivalLane="c2s_1" arrivalPos="990.00" arrivalPosLat="0.00" arrivalSpeed="15.51" duration="188.15" routeLength="1997.01" waitingTime="45.60" waitingCount="1" stopTime="0.00" timeLoss="63.67" rerouteNo="1" devices="tripinfo_car_n2s_68 routing_car_n2s_68" vType="Car" speedFactor="1.15" vaporized=""/>
    <tripinfo id="car_n2s_112" depart="112.00" departLane="n2sep_1" departPos="3.60" departPosLat="0.00" departSpeed="13.90" departDelay="0.00" arrival="259.25" arrivalLane="c2s_1" arrivalPos="990.00" arrivalPosLat="0.00" arrivalSpeed="15.02" duration="147.25" routeLength="1997.01" waitingTime="1.50" waitingCount="1" stopTime="0.00" timeLoss="15.21" rerouteNo="1" devices="tripinfo_car_n2s_112 routing_car_n2s_112" vType="Car" speedFactor="1.09" vaporized=""/>
    <tripinfo id="car_s2e_82" depart="82.00" departLane="s2sep_1" departPos="3.60" departPosLat="0.00" departSpeed="13.90" departDelay="0.00" arrival="260.15" arrivalLane="c2e_1" arrivalPos="990.00" arrivalPosLat="0.00" arrivalSpeed="13.89" duration="178.15" routeLength="1986.69" waitingTime="23.85" waitingCount="1" stopTime="0.00" timeLoss="34.51" rerouteNo="1" devices="tripinfo_car_s2e_82 routing_car_s2e_82" vType="Car" speedFactor="1.00" vaporized=""/>
    <tripinfo id="car_s2e_95" depart="95.00" departLane="s2sep_1" departPos="3.60" departPosLat="0.00" departSpeed="13.90" departDelay="0.00" arrival="262.05" arrivalLane="c2e_1" arrivalPos="990.00" arrivalPosLat="0.00" arrivalSpeed="15.31" duration="167.05" routeLength="1986.69" waitingTime="20.50" waitingCount="1" stopTime="0.00" timeLoss="43.00" rerouteNo="1" devices="tripinfo_car_s2e_95 routing_car_s2e_95" vType="Car" speedFactor="1.16" vaporized=""/>
    <tripinfo id="car_n2w_115" depart="115.00" departLane="n2sep_1" departPos="3.60" departPosLat="0.00" departSpeed="13.90" departDelay="0.00" arrival="264.35" arrivalLane="c2w_1" arrivalPos="990.00" arrivalPosLat="0.00" arrivalSpeed="13.90" duration="149.35" routeLength="1986.69" waitingTime="0.00" waitingCount="0" stopTime="0.00" timeLoss="5.65" rerouteNo="1" devices="tripinfo_car_n2w_115 routing_car_n2w_115" vType="Car" speedFactor="1.00" vaporized=""/>
    <tripinfo id="car_s2e_98" depart="98.00" departLane="s2sep_1" departPos="3.60" departPosLat="0.00" departSpeed="13.90" departDelay="0.00" arrival="265.00" arrivalLane="c2e_1" arrivalPos="990.00" arrivalPosLat="0.00" arrivalSpeed="14.25" duration="167.00" routeLength="1986.69" waitingTime="11.95" waitingCount="1" stopTime="0.00" timeLoss="27.57" rerouteNo="1" devices="tripinfo_car_s2e_98 routing_car_s2e_98" vType="Car" speedFactor="1.03" vaporized=""/>
    <tripinfo id="car_s2w_85" depart="85.00" departLane="s2sep_1" departPos="3.60" departPosLat="0.00" departSpeed="13.90" departDelay="0.00" arrival="266.15" arrivalLane="c2w_1" arrivalPos="990.00" arrivalPosLat="0.00" arrivalSpeed="15.48" duration="181.15" routeLength="1996.47" waitingTime="31.70" waitingCount="2" stopTime="0.00" timeLoss="58.81" rerouteNo="1" devices="tripinfo_car_s2w_85 routing_car_s2w_85" vType="Car" speedFactor="1.18" vaporized=""/>
    <tripinfo id="car_n2s_122" depart="122.00" departLane="n2sep_1" departPos="3.60" departPosLat="0.00" departSpeed="13.90" departDelay="0.00" arrival="267.30" arrivalLane="c2s_1" arrivalPos="990.00" arrivalPosLat="0.00" arrivalSpeed="13.90" duration="145.30" routeLength="1997.01" waitingTime="0.00" waitingCount="0" stopTime="0.00" timeLoss="1.62" rerouteNo="1" devices="tripinfo_car_n2s_122 routing_car_n2s_122" vType="Car" speedFactor="1.00" vaporized=""/>
    <tripinfo id="car_s2e_111" depart="111.00" departLane="s2sep_1" departPos="3.60" departPosLat="0.00" departSpeed="13.90" departDelay="0.00" arrival="267.70" arrivalLane="c2e_1" arrivalPos="990.00" arrivalPosLat="0.00" arrivalSpeed="14.38" duration="156.70" routeLength="1986.69" waitingTime="0.00" waitingCount="0" stopTime="0.00" timeLoss="18.97" rerouteNo="1" devices="tripinfo_car_s2e_111 routing_car_s2e_111" vType="Car" speedFactor="1.04" vaporized=""/>
    <tripinfo id="car_n2e_76" depart="76.00" departLane="n2sep_1" departPos="3.60" departPosLat="0.00" departSpeed="13.90" departDelay="0.00" arrival="269.50" arrivalLane="c2e_1" arrivalPos="990.00" arrivalPosLat="0.00" arrivalSpeed="15.41" duration="193.50" routeLength="1996.47" waitingTime="47.00" waitingCount="2" stopTime="0.00" timeLoss="70.34" rerouteNo="1" devices="tripinfo_car_n2e_76 routing_car_n2e_76" vType="Car" speedFactor="1.17" vaporized=""/>
    <tripinfo id="car_n2s_143" depart="143.00" departLane="n2sep_1" departPos="3.60" departPosLat="0.00" departSpeed="13.90" departDelay="0.00" arrival="272.30" arrivalLane="c2s_1" arrivalPos="990.00" arrivalPosLat="0.00" arrivalSpeed="16.37" duration="129.30" routeLength="1997.01" waitingTime="0.00" waitingCount="0" stopTime="0.00" timeLoss="7.39" rerouteNo="1" devices="tripinfo_car_n2s_143 routing_car_n2s_143" vType="Car" speedFactor="1.18" vaporized=""/>
    <tripinfo id="car_n2e_77" depart="77.25" departLane="n2sep_1" departPos="3.60" departPosLat="0.00" departSpeed="13.90" departDelay="0.25" arrival="273.25" arrivalLane="c2e_1" arrivalPos="990.00" arrivalPosLat="0.00" arrivalSpeed="13.88" duration="196.00" routeLength="1996.47" waitingTime="35.45" waitingCount="2" stopTime="0.00" timeLoss="51.66" rerouteNo="1" devices="tripinfo_car_n2e_77 routing_car_n2e_77" vType="Car" speedFactor="1.00" vaporized=""/>
    <tripinfo id="bus_s2n_133" depart="133.00" departLane="s2sep_1" departPos="12.10" departPosLat="0.00" departSpeed="13.90" departDelay="0.00" arrival="276.45" arrivalLane="c2n_1" arrivalPos="990.00" arrivalPosLat="0.00" arrivalSpeed="13.90" duration="143.45" routeLength="1988.51" waitingTime="0.00" waitingCount="0" stopTime="0.00" timeLoss="0.38" rerouteNo="1" devices="tripinfo_bus_s2n_133 routing_bus_s2n_133" vType="Bus" speedFactor="1.00" vaporized=""/>
    <tripinfo id="car_n2w_130" depart="130.00" departLane="n2sep_1" departPos="3.60" departPosLat="0.00" departSpeed="13.90" departDelay="0.00" arrival="277.65" arrivalLane="c2w_1" arrivalPos="990.00" arrivalPosLat="0.00" arrivalSpeed="13.90" duration="147.65" routeLength="1986.69" waitingTime="0.00" waitingCount="0" stopTime="0.00" timeLoss="4.00" rerouteNo="1" devices="tripinfo_car_n2w_130 routing_car_n2w_130" vType="Car" speedFactor="1.00" vaporized=""/>
    <tripinfo id="car_s2n_135" depart="135.00" departLane="s2sep_1" departPos="3.60" departPosLat="0.00" departSpeed="13.90" departDelay="0.00" arrival="279.45" arrivalLane="c2n_1" arrivalPos="990.00" arrivalPosLat="0.00" arrivalSpeed="14.89" duration="144.45" routeLength="1997.01" waitingTime="0.00" waitingCount="0" stopTime="0.00" timeLoss="11.70" rerouteNo="1" devices="tripinfo_car_s2n_135 routing_car_s2n_135" vType="Car" speedFactor="1.08" vaporized=""/>
    <tripinfo id="car_n2w_132" depart="132.00" departLane="n2sep_1" departPos="3.60" departPosLat="0.00" departSpeed="13.90" departDelay="0.00" arrival="281.35" arrivalLane="c2w_1" arrivalPos="990.00" arrivalPosLat="0.00" arrivalSpeed="14.20" duration="149.35" routeLength="1986.69" waitingTime="0.00" waitingCount="0" stopTime="0.00" timeLoss="8.98" rerouteNo="1" devices="tripinfo_car_n2w_132 routing_car_n2w_132" vType="Car" speedFactor="1.02" vaporized=""/>
    <tripinfo id="car_s2w_109" depart="109.00" departLane="s2sep_1" departPos="3.60" departPosLat="0.00" departSpeed="13.90" departDelay="0.00" arrival="284.80" arrivalLane="c2w_1" arrivalPos="990.00" arrivalPosLat="0.00" arrivalSpeed="14.39" duration="175.80" routeLength="1996.47" waitingTime="19.05" waitingCount="2" stopTime="0.00" timeLoss="36.73" rerouteNo="1" devices="tripinfo_car_s2w_109 routing_car_s2w_109" vType="Car" speedFactor="1.04" vaporized=""/>
    <tripinfo id="car_s2w_115" depart="115.00" departLane="s2sep_1" departPos="3.60" departPosLat="0.00" departSpeed="13.90" departDelay="0.00" arrival="289.55" arrivalLane="c2w_1" arrivalPos="990.00" arrivalPosLat="0.00" arrivalSpeed="13.89" duration="174.55" routeLength="1996.47" waitingTime="12.60" waitingCount="2" stopTime="0.00" timeLoss="30.22" rerouteNo="1" devices="tripinfo_car_s2w_115 routing_car_s2w_115" vType="Car" speedFactor="1.00" vaporized=""/>
    <tripinfo id="car_s2w_117" depart="117.00" departLane="s2sep_1" departPos="3.60" departPosLat="0.00" departSpeed="13.90" departDelay="0.00" arrival="293.25" arrivalLane="c2w_1" arrivalPos="990.00" arrivalPosLat="0.00" arrivalSpeed="13.88" duration="176.25" routeLength="1996.47" waitingTime="9.85" waitingCount="2" stopTime="0.00" timeLoss="31.91" rerouteNo="1" devices="tripinfo_car_s2w_117 routing_car_s2w_117" vType="Car" speedFactor="1.00" vaporized=""/>
    <tripinfo id="car_w2s_131" depart="132.50" departLane="w2sep_1" departPos="3.60" departPosLat="0.00" departSpeed="13.90" departDelay="1.50" arrival="298.60" arrivalLane="c2s_1" arrivalPos="990.00" arrivalPosLat="0.00" arrivalSpeed="15.88" duration="166.10" routeLength="1986.69" waitingTime="20.00" waitingCount="1" stopTime="0.00" timeLoss="40.34" rerouteNo="1" devices="tripinfo_car_w2s_131 routing_car_w2s_131" vType="Car" speedFactor="1.14" vaporized=""/>
    <tripinfo id="car_w2e_123" depart="123.00" departLane="w2sep_1" departPos="3.60" departPosLat="0.00" departSpeed="13.90" departDelay="0.00" arrival="299.55" arrivalLane="c2e_1" arrivalPos="990.00" arrivalPosLat="0.00" arrivalSpeed="14.13" duration="176.55" routeLength="1997.01" waitingTime="28.10" waitingCount="1" stopTime="0.00" timeLoss="35.25" rerouteNo="1" devices="tripinfo_car_w2e_123 routing_car_w2e_123" vType="Car" speedFactor="1.02" vaporized=""/>
    <tripinfo id="car_e2w_138" depart="138.00" departLane="e2sep_1" departPos="3.60" departPosLat="0.00" departSpeed="13.90" departDelay="0.00" arrival="300.05" arrivalLane="c2w_1" arrivalPos="990.00" arrivalPosLat="0.00" arrivalSpeed="14.12" duration="162.05" routeLength="1997.01" waitingTime="12.85" waitingCount="1" stopTime="0.00" timeLoss="20.59" rerouteNo="1" devices="tripinfo_car_e2w_138 routing_car_e2w_138" vType="Car" speedFactor="1.02" vaporized=""/>
    <tripinfo id="car_e2n_148" depart="148.00" departLane="e2sep_1" departPos="3.60" departPosLat="0.00" departSpeed="13.90" departDelay="0.00" arrival="300.30" arrivalLane="c2n_1" arrivalPos="990.00" arrivalPosLat="0.00" arrivalSpeed="14.46" duration="152.30" routeLength="1986.69" waitingTime="5.30" waitingCount="1" stopTime="0.00" timeLoss="14.14" rerouteNo="1" devices="tripinfo_car_e2n_148 routing_car_e2n_148" vType="Car" speedFactor="1.04" vaporized=""/>
    <tripinfo id="car_w2e_126" depart="126.00" departLane="w2sep_1" departPos="3.60" departPosLat="0.00" departSpeed="13.90" departDelay="0.00" arrival="302.00" arrivalLane="c2e_1" arrivalPos="990.00" arrivalPosLat="0.00" arrivalSpeed="15.01" duration="176.00" routeLength="1997.01" waitingTime="26.85" waitingCount="1" stopTime="0.00" timeLoss="44.90" rerouteNo="1" devices="tripinfo_car_w2e_126 routing_car_w2e_126" vType="Car" speedFactor="1.10" vaporized=""/>
    <tripinfo id="car_w2s_144" depart="144.00" departLane="w2sep_1" departPos="3.60" departPosLat="0.00" departSpeed="13.90" departDelay="0.00" arrival="304.60" arrivalLane="c2s_1" arrivalPos="990.00" arrivalPosLat="0.00" arrivalSpeed="16.04" duration="160.60" routeLength="1986.69" waitingTime="12.50" waitingCount="1" stopTime="0.00" timeLoss="36.16" rerouteNo="1" devices="tripinfo_car_w2s_144 routing_car_w2s_144" vType="Car" speedFactor="1.15" vaporized=""/>
    <tripinfo id="car_w2e_131" depart="131.00" departLane="w2sep_1" departPos="3.60" departPosLat="0.00" departSpeed="13.90" departDelay="0.00" arrival="307.00" arrivalLane="c2e_1" arrivalPos="990.00" arrivalPosLat="0.00" arrivalSpeed="13.90" duration="176.00" routeLength="1997.01" waitingTime="20.65" waitingCount="1" stopTime="0.00" timeLoss="32.30" rerouteNo="1" devices="tripinfo_car_w2e_131 routing_car_w2e_131" vType="Car" speedFactor="1.00" vaporized=""/>
    <tripinfo id="bus_e2n_149" depart="149.95" departLane="e2sep_1" departPos="12.10" departPosLat="0.00" departSpeed="13.90" departDelay="0.95" arrival="308.85" arrivalLane="c2n_1" arrivalPos="990.00" arrivalPosLat="0.00" arrivalSpeed="13.90" duration="158.90" routeLength="1978.19" waitingTime="1.95" waitingCount="1" stopTime="0.00" timeLoss="15.84" rerouteNo="1" devices="tripinfo_bus_e2n_149 routing_bus_e2n_149" vType="Bus" speedFactor="1.00" vaporized=""/>
    <tripinfo id="car_w2e_135" depart="135.00" departLane="w2sep_1" departPos="3.60" departPosLat="0.00" departSpeed="13.90" departDelay="0.00" arrival="308.95" arrivalLane="c2e_1" arrivalPos="990.00" arrivalPosLat="0.00" arrivalSpeed="15.13" duration="173.95" routeLength="1997.01" waitingTime="19.25" waitingCount="1" stopTime="0.00" timeLoss="47.01" rerouteNo="1" devices="tripinfo_car_w2e_135 routing_car_w2e_135" vType="Car" speedFactor="1.13" vaporized=""/>
    <tripinfo id="car_e2w_155" depart="155.00" departLane="e2sep_1" departPos="3.60" departPosLat="0.00" departSpeed="13.90" departDelay="0.00" arrival="310.10" arrivalLane="c2w_1" arrivalPos="990.00" arrivalPosLat="0.00" arrivalSpeed="13.90" duration="155.10" routeLength="1997.01" waitingTime="0.00" waitingCount="0" stopTime="0.00" timeLoss="11.41" rerouteNo="1" devices="tripinfo_car_e2w_155 routing_car_e2w_155" vType="Car" speedFactor="1.00" vaporized=""/>
    <tripinfo id="car_w2n_137" depart="137.00" departLane="w2sep_1" departPos="3.60" departPosLat="0.00" departSpeed="13.90" departDelay="0.00" arrival="311.55" arrivalLane="c2n_1" arrivalPos="990.00" arrivalPosLat="0.00" arrivalSpeed="15.26" duration="174.55" routeLength="1996.47" waitingTime="22.20" waitingCount="2" stopTime="0.00" timeLoss="45.59" rerouteNo="1" devices="tripinfo_car_w2n_137 routing_car_w2n_137" vType="Car" speedFactor="1.12" vaporized=""/>
    <tripinfo id="car_e2w_169" depart="169.00" departLane="e2sep_1" departPos="3.60" departPosLat="0.00" departSpeed="13.90" departDelay="0.00" arrival="312.30" arrivalLane="c2w_1" arrivalPos="990.00" arrivalPosLat="0.00" arrivalSpeed="14.97" duration="143.30" routeLength="1997.01" waitingTime="0.00" waitingCount="0" stopTime="0.00" timeLoss="12.95" rerouteNo="1" devices="tripinfo_car_e2w_169 routing_car_e2w_169" vType="Car" speedFactor="1.10" vaporized=""/>
    <tripinfo id="car_w2e_142" depart="142.00" departLane="w2sep_1" departPos="3.60" departPosLat="0.00" departSpeed="13.90" departDelay="0.00" arrival="313.00" arrivalLane="c2e_1" arrivalPos="990.00" arrivalPosLat="0.00" arrivalSpeed="13.89" duration="171.00" routeLength="1997.01" waitingTime="13.10" waitingCount="1" stopTime="0.00" timeLoss="27.32" rerouteNo="1" devices="tripinfo_car_w2e_142 routing_car_w2e_142" vType="Car" speedFactor="1.00" vaporized=""/>
    <tripinfo id="car_w2n_146" depart="146.00" departLane="w2sep_1" departPos="3.60" departPosLat="0.00" departSpeed="13.90" departDelay="0.00" arrival="313.50" arrivalLane="c2n_1" arrivalPos="990.00" arrivalPosLat="0.00" arrivalSpeed="15.67" duration="167.50" routeLength="1996.47" waitingTime="13.15" waitingCount="2" stopTime="0.00" timeLoss="44.33" rerouteNo="1" devices="tripinfo_car_w2n_146 routing_car_w2n_146" vType="Car" speedFactor="1.17" vaporized=""/>
    <tripinfo id="car_w2s_156" depart="156.00" departLane="w2sep_1" departPos="3.60" departPosLat="0.00" departSpeed="13.90" departDelay="0.00" arrival="314.85" arrivalLane="c2s_1" arrivalPos="990.00" arrivalPosLat="0.00" arrivalSpeed="14.17" duration="158.85" routeLength="1986.69" waitingTime="3.50" waitingCount="1" stopTime="0.00" timeLoss="17.98" rerouteNo="1" devices="tripinfo_car_w2s_156 routing_car_w2s_156" vType="Car" speedFactor="1.02" vaporized=""/>
    <tripinfo id="car_w2e_164" depart="164.00" departLane="w2sep_1" departPos="3.60" departPosLat="0.00" departSpeed="13.90" departDelay="0.00" arrival="318.25" arrivalLane="c2e_1" arrivalPos="990.00" arrivalPosLat="0.00" arrivalSpeed="13.90" duration="154.25" routeLength="1997.01" waitingTime="0.00" waitingCount="0" stopTime="0.00" timeLoss="10.57" rerouteNo="1" devices="tripinfo_car_w2e_164 routing_car_w2e_164" vType="Car" speedFactor="1.00" vaporized=""/>
    <tripinfo id="car_w2s_169" depart="169.00" departLane="w2sep_1" departPos="3.60" departPosLat="0.00" departSpeed="13.90" departDelay="0.00" arrival="319.15" arrivalLane="c2s_1" arrivalPos="990.00" arrivalPosLat="0.00" arrivalSpeed="14.34" duration="150.15" routeLength="1986.69" waitingTime="0.00" waitingCount="0" stopTime="0.00" timeLoss="11.02" rerouteNo="1" devices="tripinfo_car_w2s_169 routing_car_w2s_169" vType="Car" speedFactor="1.03" vaporized=""/>
    <tripinfo id="car_e2w_181" depart="181.00" departLane="e2sep_1" departPos="3.60" departPosLat="0.00" departSpeed="13.90" departDelay="0.00" arrival="320.45" arrivalLane="c2w_1" arrivalPos="990.00" arrivalPosLat="0.00" arrivalSpeed="14.38" duration="139.45" routeLength="1997.01" waitingTime="0.00" waitingCount="0" stopTime="0.00" timeLoss="0.55" rerouteNo="1" devices="tripinfo_car_e2w_181 routing_car_e2w_181" vType="Car" speedFactor="1.03" vaporized=""/>
    <tripinfo id="car_w2e_172" depart="172.00" departLane="w2sep_1" departPos="3.60" departPosLat="0.00" departSpeed="13.90" departDelay="0.00" arrival="320.55" arrivalLane="c2e_1" arrivalPos="990.00" arrivalPosLat="0.00" arrivalSpeed="14.82" duration="148.55" routeLength="1997.01" waitingTime="0.00" waitingCount="0" stopTime="0.00" timeLoss="16.35" rerouteNo="1" devices="tripinfo_car_w2e_172 routing_car_w2e_172" vType="Car" speedFactor="1.09" vaporized=""/>
    <tripinfo id="car_e2s_114" depart="114.00" departLane="e2sep_1" departPos="3.60" departPosLat="0.00" departSpeed="13.90" departDelay="0.00" arrival="324.70" arrivalLane="c2s_1" arrivalPos="990.00" arrivalPosLat="0.00" arrivalSpeed="14.04" duration="210.70" routeLength="1996.47" waitingTime="56.10" waitingCount="2" stopTime="0.00" timeLoss="67.85" rerouteNo="1" devices="tripinfo_car_e2s_114 routing_car_e2s_114" vType="Car" speedFactor="1.01" vaporized=""/>
    <tripinfo id="car_e2s_122" depart="122.00" departLane="e2sep_1" departPos="3.60" departPosLat="0.00" departSpeed="13.90" departDelay="0.00" arrival="326.60" arrivalLane="c2s_1" arrivalPos="990.00" arrivalPosLat="0.00" arrivalSpeed="15.47" duration="204.60" routeLength="1996.47" waitingTime="54.10" waitingCount="2" stopTime="0.00" timeLoss="81.12" rerouteNo="1" devices="tripinfo_car_e2s_122 routing_car_e2s_122" vType="Car" speedFactor="1.17" vaporized=""/>
    <tripinfo id="car_e2s_128" depart="128.00" departLane="e2sep_1" departPos="3.60" departPosLat="0.00" departSpeed="13.90" departDelay="0.00" arrival="331.00" arrivalLane="c2s_1" arrivalPos="990.00" arrivalPosLat="0.00" arrivalSpeed="13.94" duration="203.00" routeLength="1996.47" waitingTime="40.20" waitingCount="2" stopTime="0.00" timeLoss="59.14" rerouteNo="1" devices="tripinfo_car_e2s_128 routing_car_e2s_128" vType="Car" speedFactor="1.00" vaporized=""/>
    <tripinfo id="car_e2n_183" depart="183.00" departLane="e2sep_1" departPos="3.60" departPosLat="0.00" departSpeed="13.90" departDelay="0.00" arrival="331.75" arrivalLane="c2n_1" arrivalPos="990.00" arrivalPosLat="0.00" arrivalSpeed="13.90" duration="148.75" routeLength="1986.69" waitingTime="0.00" waitingCount="0" stopTime="0.00" timeLoss="5.09" rerouteNo="1" devices="tripinfo_car_e2n_183 routing_car_e2n_183" vType="Car" speedFactor="1.00" vaporized=""/>
    <tripinfo id="car_e2s_153" depart="153.00" departLane="e2sep_1" departPos="3.60" departPosLat="0.00" departSpeed="13.90" departDelay="0.00" arrival="334.10" arrivalLane="c2s_1" arrivalPos="990.00" arrivalPosLat="0.00" arrivalSpeed="14.16" duration="181.10" routeLength="1996.47" waitingTime="15.30" waitingCount="1" stopTime="0.00" timeLoss="40.00" rerouteNo="1" devices="tripinfo_car_e2s_153 routing_car_e2s_153" vType="Car" speedFactor="1.02" vaporized=""/>
    <tripinfo id="car_n2e_158" depart="158.00" departLane="n2sep_1" departPos="3.60" departPosLat="0.00" departSpeed="13.90" departDelay="0.00" arrival="344.15" arrivalLane="c2e_1" arrivalPos="990.00" arrivalPosLat="0.00" arrivalSpeed="14.67" duration="186.15" routeLength="1996.47" waitingTime="40.15" waitingCount="1" stopTime="0.00" timeLoss="49.43" rerouteNo="1" devices="tripinfo_car_n2e_158 routing_car_n2e_158" vType="Car" speedFactor="1.06" vaporized=""/>
    <tripinfo id="car_s2n_184" depart="184.00" departLane="s2sep_1" departPos="3.60" departPosLat="0.00" departSpeed="13.90" departDelay="0.00" arrival="344.65" arrivalLane="c2n_1" arrivalPos="990.00" arrivalPosLat="0.00" arrivalSpeed="14.13" duration="160.65" routeLength="1997.01" waitingTime="12.05" waitingCount="1" stopTime="0.00" timeLoss="19.36" rerouteNo="1" devices="tripinfo_car_s2n_184 routing_car_s2n_184" vType="Car" speedFactor="1.02" vaporized=""/>
    <tripinfo id="car_n2s_145" depart="145.00" departLane="n2sep_1" departPos="3.60" departPosLat="0.00" departSpeed="13.90" departDelay="0.00" arrival="345.50" arrivalLane="c2s_1" arrivalPos="990.00" arrivalPosLat="0.00" arrivalSpeed="13.97" duration="200.50" routeLength="1997.01" waitingTime="50.15" waitingCount="1" stopTime="0.00" timeLoss="57.55" rerouteNo="1" devices="tripinfo_car_n2s_145 routing_car_n2s_145" vType="Car" speedFactor="1.01" vaporized=""/>
    <tripinfo id="car_n2e_167" depart="167.00" departLane="n2sep_1" departPos="3.60" departPosLat="0.00" departSpeed="13.90" departDelay="0.00" arrival="346.25" arrivalLane="c2e_1" arrivalPos="990.00" arrivalPosLat="0.00" arrivalSpeed="15.89" duration="179.25" routeLength="1996.47" waitingTime="38.35" waitingCount="1" stopTime="0.00" timeLoss="56.88" rerouteNo="1" devices="tripinfo_car_n2e_167 routing_car_n2e_167" vType="Car" speedFactor="1.18" vaporized=""/>
    <tripinfo id="car_n2w_151" depart="151.00" departLane="n2sep_1" departPos="3.60" departPosLat="0.00" departSpeed="13.90" departDelay="0.00" arrival="346.45" arrivalLane="c2w_1" arrivalPos="990.00" arrivalPosLat="0.00" arrivalSpeed="14.21" duration="195.45" routeLength="1986.69" waitingTime="45.80" waitingCount="1" stopTime="0.00" timeLoss="54.88" rerouteNo="1" devices="tripinfo_car_n2w_151 routing_car_n2w_151" vType="Car" speedFactor="1.02" vaporized=""/>
    <tripinfo id="car_n2s_171" depart="171.00" departLane="n2sep_1" departPos="3.60" departPosLat="0.00" departSpeed="13.90" departDelay="0.00" arrival="350.50" arrivalLane="c2s_1" arrivalPos="990.00" arrivalPosLat="0.00" arrivalSpeed="14.00" duration="179.50" routeLength="1997.01" waitingTime="26.35" waitingCount="1" stopTime="0.00" timeLoss="36.87" rerouteNo="1" devices="tripinfo_car_n2s_171 routing_car_n2s_171" vType="Car" speedFactor="1.01" vaporized=""/>
    <tripinfo id="car_n2w_201" depart="201.00" departLane="n2sep_1" departPos="3.60" departPosLat="0.00" departSpeed="13.90" departDelay="0.00" arrival="352.25" arrivalLane="c2w_1" arrivalPos="990.00" arrivalPosLat="0.00" arrivalSpeed="14.49" duration="151.25" routeLength="1986.69" waitingTime="1.10" waitingCount="1" stopTime="0.00" timeLoss="13.46" rerouteNo="1" devices="tripinfo_car_n2w_201 routing_car_n2w_201" vType="Car" speedFactor="1.04" vaporized=""/>
    <tripinfo id="car_s2n_220" depart="220.00" departLane="s2sep_1" departPos="3.60" departPosLat="0.00" departSpeed="13.90" departDelay="0.00" arrival="352.65" arrivalLane="c2n_1" arrivalPos="990.00" arrivalPosLat="0.00" arrivalSpeed="15.12" duration="132.65" routeLength="1997.01" waitingTime="0.00" waitingCount="0" stopTime="0.00" timeLoss="0.60" rerouteNo="1" devices="tripinfo_car_s2n_220 routing_car_s2n_220" vType="Car" speedFactor="1.09" vaporized=""/>
    <tripinfo id="car_n2e_204" depart="204.00" departLane="n2sep_1" departPos="3.60" departPosLat="0.00" departSpeed="13.90" departDelay="0.00" arrival="353.05" arrivalLane="c2e_1" arrivalPos="990.00" arrivalPosLat="0.00" arrivalSpeed="14.00" duration="149.05" routeLength="1996.47" waitingTime="0.00" waitingCount="0" stopTime="0.00" timeLoss="5.75" rerouteNo="1" devices="tripinfo_car_n2e_204 routing_car_n2e_204" vType="Car" speedFactor="1.01" vaporized=""/>
    <tripinfo id="car_n2s_185" depart="185.00" departLane="n2sep_1" departPos="3.60" departPosLat="0.00" departSpeed="13.90" departDelay="0.00" arrival="353.70" arrivalLane="c2s_1" arrivalPos="990.00" arrivalPosLat="0.00" arrivalSpeed="14.27" duration="168.70" routeLength="1997.01" waitingTime="15.10" waitingCount="1" stopTime="0.00" timeLoss="29.23" rerouteNo="1" devices="tripinfo_car_n2s_185 routing_car_n2s_185" vType="Car" speedFactor="1.03" vaporized=""/>
    <tripinfo id="car_n2e_210" depart="210.45" departLane="n2sep_1" departPos="3.60" departPosLat="0.00" departSpeed="13.90" departDelay="0.45" arrival="356.65" arrivalLane="c2e_1" arrivalPos="990.00" arrivalPosLat="0.00" arrivalSpeed="15.13" duration="146.20" routeLength="1996.47" waitingTime="0.00" waitingCount="0" stopTime="0.00" timeLoss="14.03" rerouteNo="1" devices="tripinfo_car_n2e_210 routing_car_n2e_210" vType="Car" speedFactor="1.09" vaporized=""/>
    <tripinfo id="car_n2s_209" depart="209.00" departLane="n2sep_1" departPos="3.60" departPosLat="0.00" departSpeed="13.90" departDelay="0.00" arrival="357.20" arrivalLane="c2s_1" arrivalPos="990.00" arrivalPosLat="0.00" arrivalSpeed="14.10" duration="148.20" routeLength="1997.01" waitingTime="0.00" waitingCount="0" stopTime="0.00" timeLoss="6.89" rerouteNo="1" devices="tripinfo_car_n2s_209 routing_car_n2s_209" vType="Car" speedFactor="1.02" vaporized=""/>
    <tripinfo id="car_n2s_221" depart="221.00" departLane="n2sep_1" departPos="3.60" departPosLat="0.00" departSpeed="13.90" departDelay="0.00" arrival="359.25" arrivalLane="c2s_1" arrivalPos="990.00" arrivalPosLat="0.00" arrivalSpeed="15.09" duration="138.25" routeLength="1997.01" waitingTime="0.00" waitingCount="0" stopTime="0.00" timeLoss="10.13" rerouteNo="1" devices="tripinfo_car_n2s_221 routing_car_n2s_221" vType="Car" speedFactor="1.12" vaporized=""/>
    <tripinfo id="car_n2s_225" depart="225.00" departLane="n2sep_1" departPos="3.60" departPosLat="0.00" departSpeed="13.90" departDelay="0.00" arrival="361.50" arrivalLane="c2s_1" arrivalPos="990.00" arrivalPosLat="0.00" arrivalSpeed="14.96" duration="136.50" routeLength="1997.01" waitingTime="0.00" waitingCount="0" stopTime="0.00" timeLoss="5.54" rerouteNo="1" devices="tripinfo_car_n2s_225 routing_car_n2s_225" vType="Car" speedFactor="1.10" vaporized=""/>
    <tripinfo id="car_n2e_226" depart="226.35" departLane="n2sep_1" departPos="3.60" departPosLat="0.00" departSpeed="13.90" departDelay="0.35" arrival="367.90" arrivalLane="c2e_1" arrivalPos="990.00" arrivalPosLat="0.00" arrivalSpeed="14.80" duration="141.55" routeLength="1996.47" waitingTime="0.00" waitingCount="0" stopTime="0.00" timeLoss="6.02" rerouteNo="1" devices="tripinfo_car_n2e_226 routing_car_n2e_226" vType="Car" speedFactor="1.07" vaporized=""/>
    <tripinfo id="car_s2n_236" depart="236.00" departLane="s2sep_1" departPos="3.60" departPosLat="0.00" departSpeed="13.90" departDelay="0.00" arrival="370.30" arrivalLane="c2n_1" arrivalPos="990.00" arrivalPosLat="0.00" arrivalSpeed="14.91" duration="134.30" routeLength="1997.01" waitingTime="0.00" waitingCount="0" stopTime="0.00" timeLoss="0.37" rerouteNo="1" devices="tripinfo_car_s2n_236 routing_car_s2n_236" vType="Car" speedFactor="1.07" vaporized=""/>
    <tripinfo id="car_e2n_195" depart="195.00" departLane="e2sep_1" departPos="3.60" departPosLat="0.00" departSpeed="13.90" departDelay="0.00" arrival="381.85" arrivalLane="c2n_1" arrivalPos="990.00" arrivalPosLat="0.00" arrivalSpeed="15.95" duration="186.85" routeLength="1986.69" waitingTime="52.80" waitingCount="1" stopTime="0.00" timeLoss="61.65" rerouteNo="1" devices="tripinfo_car_e2n_195 routing_car_e2n_195" vType="Car" speedFactor="1.15" vaporized=""/>
    <tripinfo id="car_n2e_241" depart="241.00" departLane="n2sep_1" departPos="3.60" departPosLat="0.00" departSpeed="13.90" departDelay="0.00" arrival="386.75" arrivalLane="c2e_1" arrivalPos="990.00" arrivalPosLat="0.00" arrivalSpeed="14.09" duration="145.75" routeLength="1996.47" waitingTime="0.00" waitingCount="0" stopTime="0.00" timeLoss="3.40" rerouteNo="1" devices="tripinfo_car_n2e_241 routing_car_n2e_241" vType="Car" speedFactor="1.01" vaporized=""/>
    <tripinfo id="car_w2s_216" depart="216.00" departLane="w2sep_1" departPos="3.60" departPosLat="0.00" departSpeed="13.90" departDelay="0.00" arrival="389.25" arrivalLane="c2s_1" arrivalPos="990.00" arrivalPosLat="0.00" arrivalSpeed="14.69" duration="173.25" routeLength="1986.69" waitingTime="28.45" waitingCount="1" stopTime="0.00" timeLoss="37.29" rerouteNo="1" devices="tripinfo_car_w2s_216 routing_car_w2s_216" vType="Car" speedFactor="1.06" vaporized=""/>
    <tripinfo id="car_w2e_197" depart="197.00" departLane="w2sep_1" departPos="3.60" departPosLat="0.00" departSpeed="13.90" departDelay="0.00" arrival="392.10" arrivalLane="c2e_1" arrivalPos="990.00" arrivalPosLat="0.00" arrivalSpeed="13.90" duration="195.10" routeLength="1997.01" waitingTime="43.05" waitingCount="1" stopTime="0.00" timeLoss="51.41" rerouteNo="1" devices="tripinfo_car_w2e_197 routing_car_w2e_197" vType="Car" speedFactor="1.00" vaporized=""/>
    <tripinfo id="car_e2w_198" depart="198.00" departLane="e2sep_1" departPos="3.60" departPosLat="0.00" departSpeed="13.90" departDelay="0.00" arrival="392.65" arrivalLane="c2w_1" arrivalPos="990.00" arrivalPosLat="0.00" arrivalSpeed="13.92" duration="194.65" routeLength="1997.01" waitingTime="42.80" waitingCount="1" stopTime="0.00" timeLoss="51.21" rerouteNo="1" devices="tripinfo_car_e2w_198 routing_car_e2w_198" vType="Car" speedFactor="1.00" vaporized=""/>
    <tripinfo id="car_w2s_230" depart="230.00" departLane="w2sep_1" departPos="3.60" departPosLat="0.00" departSpeed="13.90" departDelay="0.00" arrival="396.45" arrivalLane="c2s_1" arrivalPos="990.00" arrivalPosLat="0.00" arrivalSpeed="13.90" duration="166.45" routeLength="1986.69" waitingTime="12.00" waitingCount="1" stopTime="0.00" timeLoss="22.77" rerouteNo="1" devices="tripinfo_car_w2s_230 routing_car_w2s_230" vType="Car" speedFactor="1.00" vaporized=""/>
    <tripinfo id="bus_e2w_210" depart="210.00" departLane="e2sep_1" departPos="12.10" departPosLat="0.00" departSpeed="13.90" departDelay="0.00" arrival="398.35" arrivalLane="c2w_1" arrivalPos="990.00" arrivalPosLat="0.00" arrivalSpeed="13.88" duration="188.35" routeLength="1988.51" waitingTime="32.10" waitingCount="1" stopTime="0.00" timeLoss="45.29" rerouteNo="1" devices="tripinfo_bus_e2w_210 routing_bus_e2w_210" vType="Bus" speedFactor="1.00" vaporized=""/>
    <tripinfo id="car_e2n_213" depart="214.50" departLane="e2sep_1" departPos="3.60" departPosLat="0.00" departSpeed="13.90" departDelay="1.50" arrival="398.75" arrivalLane="c2n_1" arrivalPos="990.00" arrivalPosLat="0.00" arrivalSpeed="14.50" duration="184.25" routeLength="1986.69" waitingTime="29.00" waitingCount="1" stopTime="0.00" timeLoss="46.56" rerouteNo="1" devices="tripinfo_car_e2n_213 routing_car_e2n_213" vType="Car" speedFactor="1.04" vaporized=""/>
    <tripinfo id="car_w2s_243" depart="243.00" departLane="w2sep_1" departPos="3.60" departPosLat="0.00" departSpeed="13.90" departDelay="0.00" arrival="399.00" arrivalLane="c2s_1" arrivalPos="990.00" arrivalPosLat="0.00" arrivalSpeed="14.63" duration="156.00" routeLength="1986.69" waitingTime="4.20" waitingCount="1" stopTime="0.00" timeLoss="21.06" rerouteNo="1" devices="tripinfo_car_w2s_243 routing_car_w2s_243" vType="Car" speedFactor="1.06" vaporized=""/>
    <tripinfo id="car_w2e_267" depart="267.00" departLane="w2sep_1" departPos="3.60" departPosLat="0.00" departSpeed="13.90" departDelay="0.00" arrival="399.00" arrivalLane="c2e_1" arrivalPos="990.00" arrivalPosLat="0.00" arrivalSpeed="15.24" duration="132.00" routeLength="1997.01" waitingTime="0.00" waitingCount="0" stopTime="0.00" timeLoss="0.97" rerouteNo="1" devices="tripinfo_car_w2e_267 routing_car_w2e_267" vType="Car" speedFactor="1.10" vaporized=""/>
    <tripinfo id="car_e2n_214" depart="216.30" departLane="e2sep_1" departPos="3.60" departPosLat="0.00" departSpeed="13.90" departDelay="2.30" arrival="401.70" arrivalLane="c2n_1" arrivalPos="990.00" arrivalPosLat="0.00" arrivalSpeed="15.07" duration="185.40" routeLength="1986.69" waitingTime="28.10" waitingCount="1" stopTime="0.00" timeLoss="53.71" rerouteNo="1" devices="tripinfo_car_e2n_214 routing_car_e2n_214" vType="Car" speedFactor="1.09" vaporized=""/>
    <tripinfo id="car_e2w_213" depart="213.00" departLane="e2sep_1" departPos="3.60" departPosLat="0.00" departSpeed="13.90" departDelay="0.00" arrival="401.85" arrivalLane="c2w_1" arrivalPos="990.00" arrivalPosLat="0.00" arrivalSpeed="14.37" duration="188.85" routeLength="1997.01" waitingTime="30.30" waitingCount="1" stopTime="0.00" timeLoss="50.40" rerouteNo="1" devices="tripinfo_car_e2w_213 routing_car_e2w_213" vType="Car" speedFactor="1.04" vaporized=""/>
    <tripinfo id="car_e2s_207" depart="207.00" departLane="e2sep_1" departPos="3.60" departPosLat="0.00" departSpeed="13.90" departDelay="0.00" arrival="402.45" arrivalLane="c2s_1" arrivalPos="990.00" arrivalPosLat="0.00" arrivalSpeed="14.17" duration="195.45" routeLength="1996.47" waitingTime="40.05" waitingCount="2" stopTime="0.00" timeLoss="54.21" rerouteNo="1" devices="tripinfo_car_e2s_207 routing_car_e2s_207" vType="Car" speedFactor="1.02" vaporized=""/>
    <tripinfo id="amb_w2e_300" depart="300.00" departLane="w2sep_1" departPos="6.60" departPosLat="0.00" departSpeed="13.90" departDelay="0.00" arrival="404.00" arrivalLane="c2e_1" arrivalPos="990.00" arrivalPosLat="-0.95" arrivalSpeed="20.80" duration="104.00" routeLength="1994.01" waitingTime="0.00" waitingCount="0" stopTime="0.00" timeLoss="8.37" rerouteNo="1" devices="tripinfo_amb_w2e_300 routing_amb_w2e_300 bluelight_amb_w2e_300 fcd_amb_w2e_300" vType="Ambulance" speedFactor="1.50" vaporized="">
        <example_device customValue1="0.00" customValue2="-1.00"/>
    </tripinfo>
    <tripinfo id="car_e2w_217" depart="218.05" departLane="e2sep_1" departPos="3.60" departPosLat="0.00" departSpeed="13.90" departDelay="1.05" arrival="406.25" arrivalLane="c2w_1" arrivalPos="990.00" arrivalPosLat="0.00" arrivalSpeed="14.03" duration="188.20" routeLength="1997.01" waitingTime="26.25" waitingCount="1" stopTime="0.00" timeLoss="45.91" rerouteNo="1" devices="tripinfo_car_e2w_217 routing_car_e2w_217" vType="Car" speedFactor="1.01" vaporized=""/>
    <tripinfo id="car_e2s_233" depart="233.30" departLane="e2sep_1" departPos="3.60" departPosLat="0.00" departSpeed="13.90" departDelay="0.30" arrival="408.90" arrivalLane="c2s_1" arrivalPos="990.00" arrivalPosLat="0.00" arrivalSpeed="13.90" duration="175.60" routeLength="1996.47" waitingTime="10.30" waitingCount="3" stopTime="0.00" timeLoss="31.26" rerouteNo="1" devices="tripinfo_car_e2s_233 routing_car_e2s_233" vType="Car" speedFactor="1.00" vaporized=""/>
    <tripinfo id="car_e2w_230" depart="230.00" departLane="e2sep_1" departPos="3.60" departPosLat="0.00" departSpeed="13.90" departDelay="0.00" arrival="410.25" arrivalLane="c2w_1" arrivalPos="990.00" arrivalPosLat="0.00" arrivalSpeed="13.88" duration="180.25" routeLength="1997.01" waitingTime="19.35" waitingCount="1" stopTime="0.00" timeLoss="36.58" rerouteNo="1" devices="tripinfo_car_e2w_230 routing_car_e2w_230" vType="Car" speedFactor="1.00" vaporized=""/>
    <tripinfo id="car_e2n_231" depart="231.45" departLane="e2sep_1" departPos="3.60" departPosLat="0.00" departSpeed="13.90" departDelay="0.45" arrival="410.30" arrivalLane="c2n_1" arrivalPos="990.00" arrivalPosLat="0.00" arrivalSpeed="13.90" duration="178.85" routeLength="1986.69" waitingTime="16.95" waitingCount="1" stopTime="0.00" timeLoss="35.18" rerouteNo="1" devices="tripinfo_car_e2n_231 routing_car_e2n_231" vType="Car" speedFactor="1.00" vaporized=""/>
    <tripinfo id="car_e2s_247" depart="247.00" departLane="e2sep_1" departPos="3.60" departPosLat="0.00" departSpeed="13.90" departDelay="0.00" arrival="413.00" arrivalLane="c2s_1" arrivalPos="990.00" arrivalPosLat="0.00" arrivalSpeed="13.89" duration="166.00" routeLength="1996.47" waitingTime="3.55" waitingCount="2" stopTime="0.00" timeLoss="21.68" rerouteNo="1" devices="tripinfo_car_e2s_247 routing_car_e2s_247" vType="Car" speedFactor="1.00" vaporized=""/>
    <tripinfo id="car_e2s_248" depart="248.45" departLane="e2sep_1" departPos="3.60" departPosLat="0.00" departSpeed="13.90" departDelay="0.45" arrival="414.80" arrivalLane="c2s_1" arrivalPos="990.00" arrivalPosLat="0.00" arrivalSpeed="15.33" duration="166.35" routeLength="1996.47" waitingTime="1.90" waitingCount="1" stopTime="0.00" timeLoss="42.89" rerouteNo="1" devices="tripinfo_car_e2s_248 routing_car_e2s_248" vType="Car" speedFactor="1.17" vaporized=""/>
    <tripinfo id="car_e2s_267" depart="267.00" departLane="e2sep_1" departPos="3.60" departPosLat="0.00" departSpeed="13.90" departDelay="0.00" arrival="417.00" arrivalLane="c2s_1" arrivalPos="990.00" arrivalPosLat="0.00" arrivalSpeed="14.91" duration="150.00" routeLength="1996.47" waitingTime="0.00" waitingCount="0" stopTime="0.00" timeLoss="18.28" rerouteNo="1" devices="tripinfo_car_e2s_267 routing_car_e2s_267" vType="Car" speedFactor="1.10" vaporized=""/>
    <tripinfo id="car_s2n_248" depart="248.00" departLane="s2sep_1" departPos="3.60" departPosLat="0.00" departSpeed="13.90" departDelay="0.00" arrival="449.70" arrivalLane="c2n_1" arrivalPos="990.00" arrivalPosLat="0.00" arrivalSpeed="14.13" duration="201.70" routeLength="1997.01" waitingTime="53.25" waitingCount="1" stopTime="0.00" timeLoss="60.39" rerouteNo="1" devices="tripinfo_car_s2n_248 routing_car_s2n_248" vType="Car" speedFactor="1.02" vaporized=""/>
    <tripinfo id="car_n2w_264" depart="264.00" departLane="n2sep_1" departPos="3.60" departPosLat="0.00" departSpeed="13.90" departDelay="0.00" arrival="450.15" arrivalLane="c2w_1" arrivalPos="990.00" arrivalPosLat="0.00" arrivalSpeed="14.03" duration="186.15" routeLength="1986.69" waitingTime="36.70" waitingCount="1" stopTime="0.00" timeLoss="43.77" rerouteNo="1" devices="tripinfo_car_n2w_264 routing_car_n2w_264" vType="Car" speedFactor="1.01" vaporized=""/>
    <tripinfo id="car_s2n_250" depart="250.00" departLane="s2sep_1" departPos="3.60" departPosLat="0.00" departSpeed="13.90" departDelay="0.00" arrival="452.15" arrivalLane="c2n_1" arrivalPos="990.00" arrivalPosLat="0.00" arrivalSpeed="15.04" duration="202.15" routeLength="1997.01" waitingTime="52.00" waitingCount="1" stopTime="0.00" timeLoss="71.32" rerouteNo="1" devices="tripinfo_car_s2n_250 routing_car_s2n_250" vType="Car" speedFactor="1.10" vaporized=""/>
    <tripinfo id="car_n2w_299" depart="299.00" departLane="n2sep_1" departPos="3.60" departPosLat="0.00" departSpeed="13.90" departDelay="0.00" arrival="452.85" arrivalLane="c2w_1" arrivalPos="990.00" arrivalPosLat="0.00" arrivalSpeed="14.75" duration="153.85" routeLength="1986.69" waitingTime="6.45" waitingCount="1" stopTime="0.00" timeLoss="19.68" rerouteNo="1" devices="tripinfo_car_n2w_299 routing_car_n2w_299" vType="Car" speedFactor="1.07" vaporized=""/>
    <tripinfo id="car_s2w_270" depart="270.00" departLane="s2sep_1" departPos="3.60" departPosLat="0.00" departSpeed="13.90" departDelay="0.00" arrival="454.75" arrivalLane="c2w_1" arrivalPos="990.00" arrivalPosLat="0.00" arrivalSpeed="15.65" duration="184.75" routeLength="1996.47" waitingTime="40.30" waitingCount="2" stopTime="0.00" timeLoss="62.14" rerouteNo="1" devices="tripinfo_car_s2w_270 routing_car_s2w_270" vType="Car" speedFactor="1.18" vaporized=""/>
    <tripinfo id="bus_s2n_296" depart="296.00" departLane="s2sep_1" departPos="12.10" departPosLat="0.00" departSpeed="13.90" departDelay="0.00" arrival="458.30" arrivalLane="c2n_1" arrivalPos="990.00" arrivalPosLat="0.00" arrivalSpeed="13.89" duration="162.30" routeLength="1988.51" waitingTime="6.45" waitingCount="1" stopTime="0.00" timeLoss="19.25" rerouteNo="1" devices="tripinfo_bus_s2n_296 routing_bus_s2n_296" vType="Bus" speedFactor="1.00" vaporized=""/>
    <tripinfo id="car_s2w_292" depart="292.00" departLane="s2sep_1" departPos="3.60" departPosLat="0.00" departSpeed="13.90" departDelay="0.00" arrival="459.50" arrivalLane="c2w_1" arrivalPos="990.00" arrivalPosLat="0.00" arrivalSpeed="13.96" duration="167.50" routeLength="1996.47" waitingTime="9.30" waitingCount="1" stopTime="0.00" timeLoss="23.82" rerouteNo="1" devices="tripinfo_car_s2w_292 routing_car_s2w_292" vType="Car" speedFactor="1.00" vaporized=""/>
    <tripinfo id="car_s2w_310" depart="310.00" departLane="s2sep_1" departPos="3.60" departPosLat="0.00" departSpeed="13.90" departDelay="0.00" arrival="462.65" arrivalLane="c2w_1" arrivalPos="990.00" arrivalPosLat="0.00" arrivalSpeed="14.17" duration="152.65" routeLength="1996.47" waitingTime="0.00" waitingCount="0" stopTime="0.00" timeLoss="11.64" rerouteNo="1" devices="tripinfo_car_s2w_310 routing_car_s2w_310" vType="Car" speedFactor="1.02" vaporized=""/>
    <tripinfo id="car_s2n_302" depart="302.00" departLane="s2sep_1" departPos="3.60" departPosLat="0.00" departSpeed="13.90" departDelay="0.00" arrival="462.85" arrivalLane="c2n_1" arrivalPos="990.00" arrivalPosLat="0.00" arrivalSpeed="13.89" duration="160.85" routeLength="1997.01" waitingTime="1.95" waitingCount="1" stopTime="0.00" timeLoss="17.17" rerouteNo="1" devices="tripinfo_car_s2n_302 routing_car_s2n_302" vType="Car" speedFactor="1.00" vaporized=""/>
    <tripinfo id="car_s2e_321" depart="321.00" departLane="s2sep_1" departPos="3.60" departPosLat="0.00" departSpeed="13.90" departDelay="0.00" arrival="464.25" arrivalLane="c2e_1" arrivalPos="990.00" arrivalPosLat="0.00" arrivalSpeed="14.35" duration="143.25" routeLength="1986.69" waitingTime="0.00" waitingCount="0" stopTime="0.00" timeLoss="4.07" rerouteNo="1" devices="tripinfo_car_s2e_321 routing_car_s2e_321" vType="Car" speedFactor="1.03" vaporized=""/>
</tripinfos>
