<?xml version="1.0" encoding="UTF-8"?>

<!-- generated on Sat Apr 24 18:22:29 2021 by Eclipse SUMO Version 1.4.0
<configuration xmlns:xsi="http://www.w3.org/2001/XMLSchema-instance" xsi:noNamespaceSchemaLocation="http://sumo.dlr.de/xsd/sumoConfiguration.xsd">

    <input>
        <net-file value="sumofiles/junction.net.xml"/>
        <route-files value="sumofiles/junction_preemption_150.rou.xml"/>
        <additional-files value="sumofiles/junction.det.xml"/>
    </input>

    <output>
        <tripinfo-output value="sumofiles/output/tripinfo_preemption_150.xml"/>
    </output>

    <time>
        <begin value="0"/>
        <end value="10000"/>
        <step-length value="0.05"/>
    </time>

    <processing>
        <lateral-resolution value="0.1"/>
    </processing>

    <report>
        <no-warnings value="true"/>
        <error-log value="sumofiles/output/errorlog_preemption_150.log"/>
        <no-step-log value="true"/>
    </report>

    <traci_server>
        <remote-port value="34137"/>
    </traci_server>

    <gui_only>
        <gui-settings-file value="sumofiles/junction-gui.settings.xml"/>
        <tracker-interval value="0.05"/>
    </gui_only>

</configuration>
-->

<tripinfos xmlns:xsi="http://www.w3.org/2001/XMLSchema-instance" xsi:noNamespaceSchemaLocation="http://sumo.dlr.de/xsd/tripinfo_file.xsd">
    <tripinfo id="car_s2n_24" depart="24.00" departLane="s2sep_1" departPos="3.60" departPosLat="0.00" departSpeed="13.90" departDelay="0.00" arrival="158.90" arrivalLane="c2n_1" arrivalPos="990.00" arrivalPosLat="0.00" arrivalSpeed="15.05" duration="134.90" routeLength="1997.01" waitingTime="0.00" waitingCount="0" stopTime="0.00" timeLoss="2.18" rerouteNo="1" devices="tripinfo_car_s2n_24 routing_car_s2n_24" vType="Car" speedFactor="1.08" vaporized=""/>
    <tripinfo id="car_n2e_1" depart="1.00" departLane="n2sep_1" departPos="3.60" departPosLat="0.00" departSpeed="13.90" departDelay="0.00" arrival="162.85" arrivalLane="c2e_1" arrivalPos="990.00" arrivalPosLat="0.00" arrivalSpeed="14.73" duration="161.85" routeLength="1996.47" waitingTime="17.75" waitingCount="1" stopTime="0.00" timeLoss="25.66" rerouteNo="1" devices="tripinfo_car_n2e_1 routing_car_n2e_1" vType="Car" speedFactor="1.06" vaporized=""/>
    <tripinfo id="car_n2s_24" depart="24.00" departLane="n2sep_1" departPos="3.60" departPosLat="0.00" departSpeed="13.90" departDelay="0.00" arrival="166.95" arrivalLane="c2s_1" arrivalPos="990.00" arrivalPosLat="0.00" arrivalSpeed="14.04" duration="142.95" routeLength="1997.01" waitingTime="0.00" waitingCount="0" stopTime="0.00" timeLoss="0.72" rerouteNo="1" devices="tripinfo_car_n2s_24 routing_car_n2s_24" vType="Car" speedFactor="1.01" vaporized=""/>
    <tripinfo id="car_n2e_4" depart="4.00" departLane="n2sep_1" departPos="3.60" departPosLat="0.00" departSpeed="13.90" departDelay="0.00" arrival="169.65" arrivalLane="c2e_1" arrivalPos="990.00" arrivalPosLat="0.00" arrivalSpeed="14.04" duration="165.65" routeLength="1996.47" waitingTime="11.90" waitingCount="1" stopTime="0.00" timeLoss="22.79" rerouteNo="1" devices="tripinfo_car_n2e_4 routing_car_n2e_4" vType="Car" speedFactor="1.01" vaporized=""/>
    <tripinfo id="car_n2w_28" depart="28.00" departLane="n2sep_1" departPos="3.60" departPosLat="0.00" departSpeed="13.90" departDelay="0.00" arrival="170.55" arrivalLane="c2w_1" arrivalPos="990.00" arrivalPosLat="0.00" arrivalSpeed="15.16" duration="142.55" routeLength="1986.69" waitingTime="0.00" waitingCount="0" stopTime="0.00" timeLoss="10.81" rerouteNo="1" devices="tripinfo_car_n2w_28 routing_car_n2w_28" vType="Car" speedFactor="1.09" vaporized=""/>
    <tripinfo id="car_s2n_30" depart="30.00" departLane="s2sep_1" departPos="3.60" departPosLat="0.00" departSpeed="13.90" departDelay="0.00" arrival="170.80" arrivalLane="c2n_1" arrivalPos="990.00" arrivalPosLat="0.00" arrivalSpeed="14.27" duration="140.80" routeLength="1997.01" waitingTime="0.00" waitingCount="0" stopTime="0.00" timeLoss="0.81" rerouteNo="1" devices="tripinfo_car_s2n_30 routing_car_s2n_30" vType="Car" speedFactor="1.03" vaporized=""/>
    <tripinfo id="car_n2s_25" depart="25.45" departLane="n2sep_1" departPos="3.60" departPosLat="0.00" departSpeed="13.90" departDelay="0.45" arrival="170.90" arrivalLane="c2s_1" arrivalPos="990.00" arrivalPosLat="0.00" arrivalSpeed="14.30" duration="145.45" routeLength="1997.01" waitingTime="0.00" waitingCount="0" stopTime="0.00" timeLoss="5.97" rerouteNo="1" devices="tripinfo_car_n2s_25 routing_car_n2s_25" vType="Car" speedFactor="1.03" vaporized=""/>
    <tripinfo id="car_n2e_10" depart="10.00" departLane="n2sep_1" departPos="3.60" departPosLat="0.00" departSpeed="13.90" departDelay="0.00" arrival="172.55" arrivalLane="c2e_1" arrivalPos="990.00" arrivalPosLat="0.00" arrivalSpeed="14.94" duration="162.55" routeLength="1996.47" waitingTime="11.35" waitingCount="2" stopTime="0.00" timeLoss="29.24" rerouteNo="1" devices="tripinfo_car_n2e_10 routing_car_n2e_10" vType="Car" speedFactor="1.08" vaporized=""/>
    <tripinfo id="car_s2w_1" depart="1.00" departLane="s2sep_1" departPos="3.60" departPosLat="0.00" departSpeed="13.90" departDelay="0.00" arrival="176.55" arrivalLane="c2w_1" arrivalPos="990.00" arrivalPosLat="0.00" arrivalSpeed="14.73" duration="175.55" routeLength="1996.47" waitingTime="27.10" waitingCount="2" stopTime="0.00" timeLoss="39.41" rerouteNo="1" devices="tripinfo_car_s2w_1 routing_car_s2w_1" vType="Car" speedFactor="1.06" vaporized=""/>
    <tripinfo id="car_n2e_16" depart="16.00" departLane="n2sep_1" departPos="3.60" departPosLat="0.00" departSpeed="13.90" departDelay="0.00" arrival="179.10" arrivalLane="c2e_1" arrivalPos="990.00" arrivalPosLat="0.00" arrivalSpeed="13.90" duration="163.10" routeLength="1996.47" waitingTime="2.10" waitingCount="1" stopTime="0.00" timeLoss="18.78" rerouteNo="1" devices="tripinfo_car_n2e_16 routing_car_n2e_16" vType="Car" speedFactor="1.00" vaporized=""/>
    <tripinfo id="car_n2w_47" depart="47.00" departLane="n2sep_1" departPos="3.60" departPosLat="0.00" departSpeed="13.90" departDelay="0.00" arrival="194.20" arrivalLane="c2w_1" arrivalPos="990.00" arrivalPosLat="0.00" arrivalSpeed="13.90" duration="147.20" routeLength="1986.69" waitingTime="0.00" waitingCount="0" stopTime="0.00" timeLoss="3.54" rerouteNo="1" devices="tripinfo_car_n2w_47 routing_car_n2w_47" vType="Car" speedFactor="1.00" vaporized=""/>
    <tripinfo id="car_s2e_48" depart="48.00" departLane="s2sep_1" departPos="3.60" departPosLat="0.00" departSpeed="13.90" departDelay="0.00" arrival="195.25" arrivalLane="c2e_1" arrivalPos="990.00" arrivalPosLat="0.00" arrivalSpeed="13.90" duration="147.25" routeLength="1986.69" waitingTime="0.00" waitingCount="0" stopTime="0.00" timeLoss="3.56" rerouteNo="1" devices="tripinfo_car_s2e_48 routing_car_s2e_48" vType="Car" speedFactor="1.00" vaporized=""/>
    <tripinfo id="car_n2e_49" depart="49.00" departLane="n2sep_1" departPos="3.60" departPosLat="0.00" departSpeed="13.90" departDelay="0.00" arrival="197.15" arrivalLane="c2e_1" arrivalPos="990.00" arrivalPosLat="0.00" arrivalSpeed="15.36" duration="148.15" routeLength="1996.47" waitingTime="0.00" waitingCount="0" stopTime="0.00" timeLoss="23.52" rerouteNo="1" devices="tripinfo_car_n2e_49 routing_car_n2e_49" vType="Car" speedFactor="1.16" vaporized=""/>
    <tripinfo id="car_e2n_32" depart="32.00" departLane="e2sep_1" departPos="3.60" departPosLat="0.00" departSpeed="13.90" departDelay="0.00" arrival="205.30" arrivalLane="c2n_1" arrivalPos="990.00" arrivalPosLat="0.00" arrivalSpeed="15.61" duration="173.30" routeLength="1986.69" waitingTime="35.95" waitingCount="1" stopTime="0.00" timeLoss="45.37" rerouteNo="1" devices="tripinfo_car_e2n_32 routing_car_e2n_32" vType="Car" speedFactor="1.12" vaporized=""/>
    <tripinfo id="car_e2w_22" depart="22.00" departLane="e2sep_1" departPos="3.60" departPosLat="0.00" departSpeed="13.90" departDelay="0.00" arrival="207.75" arrivalLane="c2w_1" arrivalPos="990.00" arrivalPosLat="0.00" arrivalSpeed="14.54" duration="185.75" routeLength="1997.01" waitingTime="41.05" waitingCount="1" stopTime="0.00" timeLoss="48.36" rerouteNo="1" devices="tripinfo_car_e2w_22 routing_car_e2w_22" vType="Car" speedFactor="1.05" vaporized=""/>
    <tripinfo id="car_w2e_12" depart="12.00" departLane="w2sep_1" departPos="3.60" departPosLat="0.00" departSpeed="13.90" departDelay="0.00" arrival="208.80" arrivalLane="c2e_1" arrivalPos="990.00" arrivalPosLat="0.00" arrivalSpeed="14.32" duration="196.80" routeLength="1997.01" waitingTime="50.60" waitingCount="1" stopTime="0.00" timeLoss="57.33" rerouteNo="1" devices="tripinfo_car_w2e_12 routing_car_w2e_12" vType="Car" speedFactor="1.03" vaporized=""/>
    <tripinfo id="car_w2s_31" depart="31.00" departLane="w2sep_1" departPos="3.60" departPosLat="0.00" departSpeed="13.90" departDelay="0.00" arrival="209.80" arrivalLane="c2s_1" arrivalPos="990.00" arrivalPosLat="0.00" arrivalSpeed="14.55" duration="178.80" routeLength="1986.69" waitingTime="32.85" waitingCount="1" stopTime="0.00" timeLoss="41.59" rerouteNo="1" devices="tripinfo_car_w2s_31 routing_car_w2s_31" vType="Car" speedFactor="1.05" vaporized=""/>
    <tripinfo id="car_e2w_44" depart="44.00" departLane="e2sep_1" departPos="3.60" departPosLat="0.00" departSpeed="13.90" departDelay="0.00" arrival="215.40" arrivalLane="c2w_1" arrivalPos="990.00" arrivalPosLat="0.00" arrivalSpeed="13.90" duration="171.40" routeLength="1997.01" waitingTime="18.00" waitingCount="1" stopTime="0.00" timeLoss="27.73" rerouteNo="1" devices="tripinfo_car_e2w_44 routing_car_e2w_44" vType="Car" speedFactor="1.00" vaporized=""/>
    <tripinfo id="car_w2e_48" depart="48.00" departLane="w2sep_1" departPos="3.60" departPosLat="0.00" departSpeed="13.90" departDelay="0.00" arrival="215.60" arrivalLane="c2e_1" arrivalPos="990.00" arrivalPosLat="0.00" arrivalSpeed="13.90" duration="167.60" routeLength="1997.01" waitingTime="13.25" waitingCount="1" stopTime="0.00" timeLoss="23.89" rerouteNo="1" devices="tripinfo_car_w2e_48 routing_car_w2e_48" vType="Car" speedFactor="1.00" vaporized=""/>
    <tripinfo id="car_w2n_45" depart="45.00" departLane="w2sep_1" departPos="3.60" departPosLat="0.00" departSpeed="13.90" departDelay="0.00" arrival="216.80" arrivalLane="c2n_1" arrivalPos="990.00" arrivalPosLat="0.00" arrivalSpeed="14.54" duration="171.80" routeLength="1996.47" waitingTime="22.35" waitingCount="2" stopTime="0.00" timeLoss="33.78" rerouteNo="1" devices="tripinfo_car_w2n_45 routing_car_w2n_45" vType="Car" speedFactor="1.05" vaporized=""/>
    <tripinfo id="car_e2w_60" depart="60.00" departLane="e2sep_1" departPos="3.60" departPosLat="0.00" departSpeed="13.90" departDelay="0.00" arrival="218.25" arrivalLane="c2w_1" arrivalPos="990.00" arrivalPosLat="0.00" arrivalSpeed="14.45" duration="158.25" routeLength="1997.01" waitingTime="4.75" waitingCount="1" stopTime="0.00" timeLoss="21.03" rerouteNo="1" devices="tripinfo_car_e2w_60 routing_car_e2w_60" vType="Car" speedFactor="1.05" vaporized=""/>
    <tripinfo id="car_w2e_60" depart="60.00" departLane="w2sep_1" departPos="3.60" departPosLat="0.00" departSpeed="13.90" departDelay="0.00" arrival="218.80" arrivalLane="c2e_1" arrivalPos="990.00" arrivalPosLat="0.00" arrivalSpeed="14.21" duration="158.80" routeLength="1997.01" waitingTime="4.85" waitingCount="1" stopTime="0.00" timeLoss="18.82" rerouteNo="1" devices="tripinfo_car_w2e_60 routing_car_w2e_60" vType="Car" speedFactor="1.03" vaporized=""/>
    <tripinfo id="car_w2n_64" depart="64.00" departLane="w2sep_1" departPos="3.60" departPosLat="0.00" departSpeed="13.90" departDelay="0.00" arrival="219.15" arrivalLane="c2n_1" arrivalPos="990.00" arrivalPosLat="0.00" arrivalSpeed="15.46" duration="155.15" routeLength="1996.47" waitingTime="4.10" waitingCount="2" stopTime="0.00" timeLoss="27.65" rerouteNo="1" devices="tripinfo_car_w2n_64 routing_car_w2n_64" vType="Car" speedFactor="1.13" vaporized=""/>
    <tripinfo id="car_e2s_53" depart="53.00" departLane="e2sep_1" departPos="3.60" departPosLat="0.00" departSpeed="13.90" departDelay="0.00" arrival="219.25" arrivalLane="c2s_1" arrivalPos="990.00" arrivalPosLat="0.00" arrivalSpeed="14.04" duration="166.25" routeLength="1996.47" waitingTime="11.95" waitingCount="2" stopTime="0.00" timeLoss="23.35" rerouteNo="1" devices="tripinfo_car_e2s_53 routing_car_e2s_53" vType="Car" speedFactor="1.01" vaporized=""/>
    <tripinfo id="car_e2s_56" depart="56.00" departLane="e2sep_1" departPos="3.60" departPosLat="0.00" departSpeed="13.90" departDelay="0.00" arrival="221.65" arrivalLane="c2s_1" arrivalPos="990.00" arrivalPosLat="0.00" arrivalSpeed="14.92" duration="165.65" routeLength="1996.47" waitingTime="9.75" waitingCount="2" stopTime="0.00" timeLoss="33.30" rerouteNo="1" devices="tripinfo_car_e2s_56 routing_car_e2s_56" vType="Car" speedFactor="1.09" vaporized=""/>
    <tripinfo id="car_e2s_70" depart="70.00" departLane="e2sep_1" departPos="3.60" departPosLat="0.00" departSpeed="13.90" departDelay="0.00" arrival="226.30" arrivalLane="c2s_1" arrivalPos="990.00" arrivalPosLat="0.00" arrivalSpeed="13.89" duration="156.30" routeLength="1996.47" waitingTime="0.45" waitingCount="1" stopTime="0.00" timeLoss="11.97" rerouteNo="1" devices="tripinfo_car_e2s_70 routing_car_e2s_70" vType="Car" speedFactor="1.00" vaporized=""/>
    <tripinfo id="car_e2s_72" depart="72.00" departLane="e2sep_1" departPos="3.60" departPosLat="0.00" departSpeed="13.90" departDelay="0.00" arrival="228.20" arrivalLane="c2s_1" arrivalPos="990.00" arrivalPosLat="0.00" arrivalSpeed="15.29" duration="156.20" routeLength="1996.47" waitingTime="0.00" waitingCount="0" stopTime="0.00" timeLoss="31.15" rerouteNo="1" devices="tripinfo_car_e2s_72 routing_car_e2s_72" vType="Car" speedFactor="1.15" vaporized=""/>
    <tripinfo id="car_e2w_97" depart="97.00" departLane="e2sep_1" departPos="3.60" departPosLat="0.00" departSpeed="13.90" departDelay="0.00" arrival="229.70" arrivalLane="c2w_1" arrivalPos="990.00" arrivalPosLat="0.00" arrivalSpeed="15.18" duration="132.70" routeLength="1997.01" waitingTime="0.00" waitingCount="0" stopTime="0.00" timeLoss="1.11" rerouteNo="1" devices="tripinfo_car_e2w_97 routing_car_e2w_97" vType="Car" speedFactor="1.09" vaporized=""/>
    <tripinfo id="car_w2e_87" depart="87.00" departLane="w2sep_1" departPos="3.60" departPosLat="0.00" departSpeed="13.90" departDelay="0.00" arrival="231.05" arrivalLane="c2e_1" arrivalPos="990.00" arrivalPosLat="0.00" arrivalSpeed="13.90" duration="144.05" routeLength="1997.01" waitingTime="0.00" waitingCount="0" stopTime="0.00" timeLoss="0.36" rerouteNo="1" devices="tripinfo_car_w2e_87 routing_car_w2e_87" vType="Car" speedFactor="1.00" vaporized=""/>
    <tripinfo id="car_w2e_95" depart="95.00" departLane="w2sep_1" departPos="3.60" departPosLat="0.00" departSpeed="13.90" departDelay="0.00" arrival="236.00" arrivalLane="c2e_1" arrivalPos="990.00" arrivalPosLat="0.00" arrivalSpeed="14.32" duration="141.00" routeLength="1997.01" waitingTime="0.00" waitingCount="0" stopTime="0.00" timeLoss="1.53" rerouteNo="1" devices="tripinfo_car_w2e_95 routing_car_w2e_95" vType="Car" speedFactor="1.03" vaporized=""/>
    <tripinfo id="car_w2e_99" depart="99.00" departLane="w2sep_1" departPos="3.60" departPosLat="0.00" departSpeed="13.90" departDelay="0.00" arrival="240.35" arrivalLane="c2e_1" arrivalPos="990.00" arrivalPosLat="0.00" arrivalSpeed="14.41" duration="141.35" routeLength="1997.01" waitingTime="0.00" waitingCount="0" stopTime="0.00" timeLoss="2.91" rerouteNo="1" devices="tripinfo_car_w2e_99 routing_car_w2e_99" vType="Car" speedFactor="1.04" vaporized=""/>
    <tripinfo id="car_n2w_71" depart="71.00" departLane="n2sep_1" departPos="3.60" departPosLat="0.00" departSpeed="13.90" departDelay="0.00" arrival="247.50" arrivalLane="c2w_1" arrivalPos="990.00" arrivalPosLat="0.00" arrivalSpeed="16.38" duration="176.50" routeLength="1986.69" waitingTime="44.90" waitingCount="1" stopTime="0.00" timeLoss="54.60" rerouteNo="1" devices="tripinfo_car_n2w_71 routing_car_n2w_71" vType="Car" speedFactor="1.18" vaporized=""/>
    <tripinfo id="car_s2n_61" depart="61.00" departLane="s2sep_1" departPos="3.60" departPosLat="0.00" departSpeed="13.90" departDelay="0.00" arrival="248.10" arrivalLane="c2n_1" arrivalPos="990.00" arrivalPosLat="0.00" arrivalSpeed="15.61" duration="187.10" routeLength="1997.01" waitingTime="51.45" waitingCount="1" stopTime="0.00" timeLoss="59.16" rerouteNo="1" devices="tripinfo_car_s2n_61 routing_car_s2n_61" vType="Car" speedFactor="1.12" vaporized=""/>
    <tripinfo id="bus_e2s_80" depart="80.00" departLane="e2sep_1" departPos="12.10" departPosLat="0.00" departSpeed="13.90" departDelay="0.00" arrival="248.50" arrivalLane="c2s_1" arrivalPos="990.00" arrivalPosLat="0.00" arrivalSpeed="13.90" duration="168.50" routeLength="1987.97" waitingTime="13.65" waitingCount="1" stopTime="0.00" timeLoss="24.78" rerouteNo="1" devices="tripinfo_bus_e2s_80 routing_bus_e2s_80" vType="Bus" speedFactor="1.00" vaporized=""/>
    <tripinfo id="car_s2n_88" depart="88.10" departLane="s2sep_1" departPos="3.60" departPosLat="0.00" departSpeed="13.90" departDelay="0.10" arrival="252.50" arrivalLane="c2n_1" arrivalPos="990.00" arrivalPosLat="0.00" arrivalSpeed="16.38" duration="164.40" routeLength="1997.01" waitingTime="20.50" waitingCount="1" stopTime="0.00" timeLoss="42.60" rerouteNo="1" devices="tripinfo_car_s2n_88 routing_car_s2n_88" vType="Car" speedFactor="1.18" vaporized=""/>
    <tripinfo id="car_e2s_88" depart="88.00" departLane="e2sep_1" departPos="3.60" departPosLat="0.00" departSpeed="13.90" departDelay="0.00" arrival="253.35" arrivalLane="c2s_1" arrivalPos="990.00" arrivalPosLat="0.00" arrivalSpeed="13.89" duration="165.35" routeLength="1996.47" waitingTime="7.80" waitingCount="1" stopTime="0.00" timeLoss="21.01" rerouteNo="1" devices="tripinfo_car_e2s_88 routing_car_e2s_88" vType="Car" speedFactor="1.00" vaporized=""/>
    <tripinfo id="car_s2n_93" depart="93.00" departLane="s2sep_1" departPos="3.60" departPosLat="0.00" departSpeed="13.90" departDelay="0.00" arrival="256.65" arrivalLane="c2n_1" arrivalPos="990.00" arrivalPosLat="0.00" arrivalSpeed="16.08" duration="163.65" routeLength="1997.01" waitingTime="19.65" waitingCount="1" stopTime="0.00" timeLoss="39.60" rerouteNo="1" devices="tripinfo_car_s2n_93 routing_car_s2n_93" vType="Car" speedFactor="1.16" vaporized=""/>
    <tripinfo id="car_n2s_53" depart="53.00" departLane="n2sep_1" departPos="3.60" departPosLat="0.00" departSpeed="13.90" departDelay="0.00" arrival="256.75" arrivalLane="c2s_1" arrivalPos="990.00" arrivalPosLat="0.00" arrivalSpeed="14.11" duration="203.75" routeLength="1997.01" waitingTime="52.55" waitingCount="1" stopTime="0.00" timeLoss="62.60" rerouteNo="1" devices="tripinfo_car_n2s_53 routing_car_n2s_53" vType="Car" speedFactor="1.02" vaporized=""/>
    <tripinfo id="car_s2e_61" depart="62.30" departLane="s2sep_1" departPos="3.60" departPosLat="0.00" departSpeed="13.90" departDelay="1.30" arrival="258.00" arrivalLane="c2e_1" arrivalPos="990.00" arrivalPosLat="0.00" arrivalSpeed="13.90" duration="195.70" routeLength="1986.69" waitingTime="42.70" waitingCount="1" stopTime="0.00" timeLoss="52.06" rerouteNo="1" devices="tripinfo_car_s2e_61 routing_car_s2e_61" vType="Car" speedFactor="1.00" vaporized=""/>
    <tripinfo id="car_n2w_87" depart="87.00" departLane="n2sep_1" departPos="3.60" departPosLat="0.00" departSpeed="13.90" departDelay="0.00" arrival="259.45" arrivalLane="c2w_1" arrivalPos="990.00" arrivalPosLat="0.00" arrivalSpeed="14.17" duration="172.45" routeLength="1986.69" waitingTime="21.30" waitingCount="1" stopTime="0.00" timeLoss="31.54" rerouteNo="1" devices="tripinfo_car_n2w_87 routing_car_n2w_87" vType="Car" speedFactor="1.02" vaporized=""/>
    <tripinfo id="car_n2w_91" depart="91.00" departLane="n2sep_1" departPos="3.60" departPosLat="0.00" departSpeed="13.90" departDelay="0.00" arrival="261.85" arrivalLane="c2w_1" arrivalPos="990.00" arrivalPosLat="0.00" arrivalSpeed="15.08" duration="170.85" routeLength="1986.69" waitingTime="20.35" waitingCount="1" stopTime="0.00" timeLoss="40.52" rerouteNo="1" devices="tripinfo_car_n2w_91 routing_car_n2w_91" vType="Car" speedFactor="1.10" vaporized=""/>
    <tripinfo id="car_s2e_85" depart="85.00" departLane="s2sep_1" departPos="3.60" departPosLat="0.00" departSpeed="13.90" departDelay="0.00" arrival="262.25" arrivalLane="c2e_1" arrivalPos="990.00" arrivalPosLat="0.00" arrivalSpeed="13.96" duration="177.25" routeLength="1986.69" waitingTime="22.30" waitingCount="1" stopTime="0.00" timeLoss="34.34" rerouteNo="1" devices="tripinfo_car_s2e_85 routing_car_s2e_85" vType="Car" speedFactor="1.01" vaporized=""/>
    <tripinfo id="car_n2s_109" depart="109.00" departLane="n2sep_1" departPos="3.60" departPosLat="0.00" departSpeed="13.90" departDelay="0.00" arrival="264.25" arrivalLane="c2s_1" arrivalPos="990.00" arrivalPosLat="0.00" arrivalSpeed="14.04" duration="155.25" routeLength="1997.01" waitingTime="1.05" waitingCount="1" stopTime="0.00" timeLoss="13.00" rerouteNo="1" devices="tripinfo_car_n2s_109 routing_car_n2s_109" vType="Car" speedFactor="1.01" vaporized=""/>
    <tripinfo id="car_s2n_95" depart="95.00" departLane="s2sep_1" departPos="3.60" departPosLat="0.00" departSpeed="13.90" departDelay="0.00" arrival="265.60" arrivalLane="c2n_1" arrivalPos="990.00" arrivalPosLat="0.00" arrivalSpeed="14.15" duration="170.60" routeLength="1997.01" waitingTime="15.90" waitingCount="1" stopTime="0.00" timeLoss="29.49" rerouteNo="1" devices="tripinfo_car_s2n_95 routing_car_s2n_95" vType="Car" speedFactor="1.02" vaporized=""/>
    <tripinfo id="car_n2s_116" depart="116.50" departLane="n2sep_1" departPos="3.60" departPosLat="0.00" departSpeed="13.90" departDelay="0.50" arrival="268.75" arrivalLane="c2s_1" arrivalPos="990.00" arrivalPosLat="0.00" arrivalSpeed="13.89" duration="152.25" routeLength="1997.01" waitingTime="0.00" waitingCount="0" stopTime="0.00" timeLoss="8.59" rerouteNo="1" devices="tripinfo_car_n2s_116 routing_car_n2s_116" vType="Car" speedFactor="1.00" vaporized=""/>
    <tripinfo id="car_n2e_115" depart="115.00" departLane="n2sep_1" departPos="3.60" departPosLat="0.00" departSpeed="13.90" departDelay="0.00" arrival="269.20" arrivalLane="c2e_1" arrivalPos="990.00" arrivalPosLat="0.00" arrivalSpeed="13.90" duration="154.20" routeLength="1996.47" waitingTime="2.15" waitingCount="1" stopTime="0.00" timeLoss="9.87" rerouteNo="1" devices="tripinfo_car_n2e_115 routing_car_n2e_115" vType="Car" speedFactor="1.00" vaporized=""/>
    <tripinfo id="car_s2w_63" depart="64.05" departLane="s2sep_1" departPos="3.60" departPosLat="0.00" departSpeed="13.90" departDelay="1.05" arrival="269.65" arrivalLane="c2w_1" arrivalPos="990.00" arrivalPosLat="0.00" arrivalSpeed="13.90" duration="205.60" routeLength="1996.47" waitingTime="47.05" waitingCount="2" stopTime="0.00" timeLoss="61.25" rerouteNo="1" devices="tripinfo_car_s2w_63 routing_car_s2w_63" vType="Car" speedFactor="1.00" vaporized=""/>
    <tripinfo id="car_n2s_128" depart="128.45" departLane="n2sep_1" departPos="3.60" departPosLat="0.00" departSpeed="13.90" departDelay="0.45" arrival="270.95" arrivalLane="c2s_1" arrivalPos="990.00" arrivalPosLat="0.00" arrivalSpeed="14.87" duration="142.50" routeLength="1997.01" waitingTime="0.00" waitingCount="0" stopTime="0.00" timeLoss="11.37" rerouteNo="1" devices="tripinfo_car_n2s_128 routing_car_n2s_128" vType="Car" speedFactor="1.10" vaporized=""/>
    <tripinfo id="car_n2e_123" depart="123.00" departLane="n2sep_1" departPos="3.60" departPosLat="0.00" departSpeed="13.90" departDelay="0.00" arrival="271.05" arrivalLane="c2e_1" arrivalPos="990.00" arrivalPosLat="0.00" arrivalSpeed="15.41" duration="148.05" routeLength="1996.47" waitingTime="0.00" waitingCount="0" stopTime="0.00" timeLoss="24.58" rerouteNo="1" devices="tripinfo_car_n2e_123 routing_car_n2e_123" vType="Car" speedFactor="1.17" vaporized=""/>
    <tripinfo id="car_s2w_86" depart="86.45" departLane="s2sep_1" departPos="3.60" departPosLat="0.00" departSpeed="13.90" departDelay="0.45" arrival="271.50" arrivalLane="c2w_1" arrivalPos="990.00" arrivalPosLat="0.00" arrivalSpeed="15.44" duration="185.05" routeLength="1996.47" waitingTime="29.25" waitingCount="3" stopTime="0.00" timeLoss="61.86" rerouteNo="1" devices="tripinfo_car_s2w_86 routing_car_s2w_86" vType="Car" speedFactor="1.17" vaporized=""/>
    <tripinfo id="car_s2n_138" depart="138.00" departLane="s2sep_1" departPos="3.60" departPosLat="0.00" departSpeed="13.90" departDelay="0.00" arrival="274.65" arrivalLane="c2n_1" arrivalPos="990.00" arrivalPosLat="0.00" arrivalSpeed="15.05" duration="136.65" routeLength="1997.01" waitingTime="0.00" waitingCount="0" stopTime="0.00" timeLoss="3.93" rerouteNo="1" devices="tripinfo_car_s2n_138 routing_car_s2n_138" vType="Car" speedFactor="1.08" vaporized=""/>
    <tripinfo id="car_n2w_136" depart="136.00" departLane="n2sep_1" departPos="3.60" departPosLat="0.00" departSpeed="13.90" departDelay="0.00" arrival="275.00" arrivalLane="c2w_1" arrivalPos="990.00" arrivalPosLat="0.00" arrivalSpeed="15.68" duration="139.00" routeLength="1986.69" waitingTime="0.00" waitingCount="0" stopTime="0.00" timeLoss="12.09" rerouteNo="1" devices="tripinfo_car_n2w_136 routing_car_n2w_136" vType="Car" speedFactor="1.13" vaporized=""/>
    <tripinfo id="car_s2e_130" depart="130.00" departLane="s2sep_1" departPos="3.60" departPosLat="0.00" departSpeed="13.90" departDelay="0.00" arrival="277.90" arrivalLane="c2e_1" arrivalPos="990.00" arrivalPosLat="0.00" arrivalSpeed="13.90" duration="147.90" routeLength="1986.69" waitingTime="0.00" waitingCount="0" stopTime="0.00" timeLoss="4.21" rerouteNo="1" devices="tripinfo_car_s2e_130 routing_car_s2e_130" vType="Car" speedFactor="1.00" vaporized=""/>
    <tripinfo id="car_s2e_149" depart="149.00" departLane="s2sep_1" departPos="3.60" departPosLat="0.00" departSpeed="13.90" departDelay="0.00" arrival="279.85" arrivalLane="c2e_1" arrivalPos="990.00" arrivalPosLat="0.00" arrivalSpeed="15.59" duration="130.85" routeLength="1986.69" waitingTime="0.00" waitingCount="0" stopTime="0.00" timeLoss="8.24" rerouteNo="1" devices="tripinfo_car_s2e_149 routing_car_s2e_149" vType="Car" speedFactor="1.17" vaporized=""/>
    <tripinfo id="car_s2w_133" depart="133.00" departLane="s2sep_1" departPos="3.60" departPosLat="0.00" departSpeed="13.90" departDelay="0.00" arrival="283.55" arrivalLane="c2w_1" arrivalPos="990.00" arrivalPosLat="0.00" arrivalSpeed="14.23" duration="150.55" routeLength="1996.47" waitingTime="0.00" waitingCount="0" stopTime="0.00" timeLoss="9.54" rerouteNo="1" devices="tripinfo_car_s2w_133 routing_car_s2w_133" vType="Car" speedFactor="1.02" vaporized=""/>
    <tripinfo id="car_n2e_127" depart="127.00" departLane="n2sep_1" departPos="3.60" departPosLat="0.00" departSpeed="13.90" departDelay="0.00" arrival="288.60" arrivalLane="c2e_1" arrivalPos="990.00" arrivalPosLat="0.00" arrivalSpeed="14.13" duration="161.60" routeLength="1996.47" waitingTime="10.75" waitingCount="1" stopTime="0.00" timeLoss="19.64" rerouteNo="1" devices="tripinfo_car_n2e_127 routing_car_n2e_127" vType="Car" speedFactor="1.02" vaporized=""/>
    <tripinfo id="car_n2e_132" depart="132.00" departLane="n2sep_1" departPos="3.60" departPosLat="0.00" departSpeed="13.90" departDelay="0.00" arrival="293.45" arrivalLane="c2e_1" arrivalPos="990.00" arrivalPosLat="0.00" arrivalSpeed="13.89" duration="161.45" routeLength="1996.47" waitingTime="4.90" waitingCount="1" stopTime="0.00" timeLoss="17.12" rerouteNo="1" devices="tripinfo_car_n2e_132 routing_car_n2e_132" vType="Car" speedFactor="1.00" vaporized=""/>
    <tripinfo id="car_e2w_106" depart="106.00" departLane="e2sep_1" departPos="3.60" departPosLat="0.00" departSpeed="13.90" departDelay="0.00" arrival="295.20" arrivalLane="c2w_1" arrivalPos="990.00" arrivalPosLat="0.00" arrivalSpeed="15.12" duration="189.20" routeLength="1997.01" waitingTime="49.75" waitingCount="1" stopTime="0.00" timeLoss="57.15" rerouteNo="1" devices="tripinfo_car_e2w_106 routing_car_e2w_106" vType="Car" speedFactor="1.09" vaporized=""/>
    <tripinfo id="car_n2e_146" depart="146.00" departLane="n2sep_1" departPos="3.60" departPosLat="0.00" departSpeed="13.90" departDelay="0.00" arrival="295.25" arrivalLane="c2e_1" arrivalPos="990.00" arrivalPosLat="0.00" arrivalSpeed="15.43" duration="149.25" routeLength="1996.47" waitingTime="1.40" waitingCount="1" stopTime="0.00" timeLoss="26.79" rerouteNo="1" devices="tripinfo_car_n2e_146 routing_car_n2e_146" vType="Car" speedFactor="1.18" vaporized=""/>
    <tripinfo id="car_w2s_100" depart="100.45" departLane="w2sep_1" departPos="3.60" departPosLat="0.00" departSpeed="13.90" departDelay="0.45" arrival="297.75" arrivalLane="c2s_1" arrivalPos="990.00" arrivalPosLat="0.00" arrivalSpeed="14.50" duration="197.30" routeLength="1986.69" waitingTime="49.00" waitingCount="1" stopTime="0.00" timeLoss="59.60" rerouteNo="1" devices="tripinfo_car_w2s_100 routing_car_w2s_100" vType="Car" speedFactor="1.04" vaporized=""/>
    <tripinfo id="car_e2n_132" depart="132.00" departLane="e2sep_1" departPos="3.60" departPosLat="0.00" departSpeed="13.90" departDelay="0.00" arrival="298.60" arrivalLane="c2n_1" arrivalPos="990.00" arrivalPosLat="0.00" arrivalSpeed="15.88" duration="166.60" routeLength="1986.69" waitingTime="21.45" waitingCount="1" stopTime="0.00" timeLoss="40.85" rerouteNo="1" devices="tripinfo_car_e2n_132 routing_car_e2n_132" vType="Car" speedFactor="1.14" vaporized=""/>
    <tripinfo id="car_w2e_119" depart="119.00" departLane="w2sep_1" departPos="3.60" departPosLat="0.00" departSpeed="13.90" departDelay="0.00" arrival="303.15" arrivalLane="c2e_1" arrivalPos="990.00" arrivalPosLat="0.00" arrivalSpeed="13.90" duration="184.15" routeLength="1997.01" waitingTime="31.90" waitingCount="1" stopTime="0.00" timeLoss="40.47" rerouteNo="1" devices="tripinfo_car_w2e_119 routing_car_w2e_119" vType="Car" speedFactor="1.00" vaporized=""/>
    <tripinfo id="car_e2w_118" depart="118.00" departLane="e2sep_1" departPos="3.60" departPosLat="0.00" departSpeed="13.90" departDelay="0.00" arrival="303.65" arrivalLane="c2w_1" arrivalPos="990.00" arrivalPosLat="0.00" arrivalSpeed="13.90" duration="185.65" routeLength="1997.01" waitingTime="32.85" waitingCount="1" stopTime="0.00" timeLoss="41.95" rerouteNo="1" devices="tripinfo_car_e2w_118 routing_car_e2w_118" vType="Car" speedFactor="1.00" vaporized=""/>
    <tripinfo id="car_w2s_142" depart="142.00" departLane="w2sep_1" departPos="3.60" departPosLat="0.00" departSpeed="13.90" departDelay="0.00" arrival="304.85" arrivalLane="c2s_1" arrivalPos="990.00" arrivalPosLat="0.00" arrivalSpeed="14.12" duration="162.85" routeLength="1986.69" waitingTime="11.05" waitingCount="1" stopTime="0.00" timeLoss="21.42" rerouteNo="1" devices="tripinfo_car_w2s_142 routing_car_w2s_142" vType="Car" speedFactor="1.02" vaporized=""/>
    <tripinfo id="car_w2e_151" depart="151.00" departLane="w2sep_1" departPos="3.60" departPosLat="0.00" departSpeed="13.90" departDelay="0.00" arrival="306.50" arrivalLane="c2e_1" arrivalPos="990.00" arrivalPosLat="0.00" arrivalSpeed="14.41" duration="155.50" routeLength="1997.01" waitingTime="4.40" waitingCount="1" stopTime="0.00" timeLoss="17.36" rerouteNo="1" devices="tripinfo_car_w2e_151 routing_car_w2e_151" vType="Car" speedFactor="1.04" vaporized=""/>
    <tripinfo id="car_e2w_130" depart="130.00" departLane="e2sep_1" departPos="3.60" departPosLat="0.00" departSpeed="13.90" departDelay="0.00" arrival="307.60" arrivalLane="c2w_1" arrivalPos="990.00" arrivalPosLat="0.00" arrivalSpeed="13.93" duration="177.60" routeLength="1997.01" waitingTime="22.15" waitingCount="1" stopTime="0.00" timeLoss="34.39" rerouteNo="1" devices="tripinfo_car_e2w_130 routing_car_e2w_130" vType="Car" speedFactor="1.00" vaporized=""/>
    <tripinfo id="car_w2s_153" depart="153.00" departLane="w2sep_1" departPos="3.60" departPosLat="0.00" departSpeed="13.90" departDelay="0.00" arrival="309.50" arrivalLane="c2s_1" arrivalPos="990.00" arrivalPosLat="0.00" arrivalSpeed="14.20" duration="156.50" routeLength="1986.69" waitingTime="1.30" waitingCount="1" stopTime="0.00" timeLoss="15.94" rerouteNo="1" devices="tripinfo_car_w2s_153 routing_car_w2s_153" vType="Car" speedFactor="1.02" vaporized=""/>
    <tripinfo id="car_e2n_143" depart="143.00" departLane="e2sep_1" departPos="3.60" departPosLat="0.00" departSpeed="13.90" departDelay="0.00" arrival="310.10" arrivalLane="c2n_1" arrivalPos="990.00" arrivalPosLat="0.00" arrivalSpeed="13.90" duration="167.10" routeLength="1986.69" waitingTime="10.85" waitingCount="1" stopTime="0.00" timeLoss="23.41" rerouteNo="1" devices="tripinfo_car_e2n_143 routing_car_e2n_143" vType="Car" speedFactor="1.00" vaporized=""/>
    <tripinfo id="car_e2s_141" depart="141.00" departLane="e2sep_1" departPos="3.60" departPosLat="0.00" departSpeed="13.90" departDelay="0.00" arrival="311.65" arrivalLane="c2s_1" arrivalPos="990.00" arrivalPosLat="0.00" arrivalSpeed="15.17" duration="170.65" routeLength="1996.47" waitingTime="23.05" waitingCount="2" stopTime="0.00" timeLoss="41.73" rerouteNo="1" devices="tripinfo_car_e2s_141 routing_car_e2s_141" vType="Car" speedFactor="1.12" vaporized=""/>
    <tripinfo id="car_e2n_160" depart="160.00" departLane="e2sep_1" departPos="3.60" departPosLat="0.00" departSpeed="13.90" departDelay="0.00" arrival="313.60" arrivalLane="c2n_1" arrivalPos="990.00" arrivalPosLat="0.00" arrivalSpeed="14.18" duration="153.60" routeLength="1986.69" waitingTime="0.00" waitingCount="0" stopTime="0.00" timeLoss="13.15" rerouteNo="1" devices="tripinfo_car_e2n_160 routing_car_e2n_160" vType="Car" speedFactor="1.02" vaporized=""/>
    <tripinfo id="car_w2n_147" depart="147.00" departLane="w2sep_1" departPos="3.60" departPosLat="0.00" departSpeed="13.90" departDelay="0.00" arrival="315.50" arrivalLane="c2n_1" arrivalPos="990.00" arrivalPosLat="0.00" arrivalSpeed="15.34" duration="168.50" routeLength="1996.47" waitingTime="17.50" waitingCount="2" stopTime="0.00" timeLoss="43.48" rerouteNo="1" devices="tripinfo_car_w2n_147 routing_car_w2n_147" vType="Car" speedFactor="1.15" vaporized=""/>
    <tripinfo id="car_e2w_181" depart="181.00" departLane="e2sep_1" departPos="3.60" departPosLat="0.00" departSpeed="13.90" departDelay="0.00" arrival="316.35" arrivalLane="c2w_1" arrivalPos="990.00" arrivalPosLat="0.00" arrivalSpeed="15.11" duration="135.35" routeLength="1997.01" waitingTime="0.00" waitingCount="0" stopTime="0.00" timeLoss="3.15" rerouteNo="1" devices="tripinfo_car_e2w_181 routing_car_e2w_181" vType="Car" speedFactor="1.09" vaporized=""/>
    <tripinfo id="car_w2n_170" depart="170.00" departLane="w2sep_1" departPos="3.60" departPosLat="0.00" departSpeed="13.90" departDelay="0.00" arrival="318.20" arrivalLane="c2n_1" arrivalPos="990.00" arrivalPosLat="0.00" arrivalSpeed="14.56" duration="148.20" routeLength="1996.47" waitingTime="0.00" waitingCount="0" stopTime="0.00" timeLoss="11.47" rerouteNo="1" devices="tripinfo_car_w2n_170 routing_car_w2n_170" vType="Car" speedFactor="1.06" vaporized=""/>
    <tripinfo id="car_e2s_175" depart="175.00" departLane="e2sep_1" departPos="3.60" departPosLat="0.00" departSpeed="13.90" departDelay="0.00" arrival="318.70" arrivalLane="c2s_1" arrivalPos="990.00" arrivalPosLat="0.00" arrivalSpeed="14.35" duration="143.70" routeLength="1996.47" waitingTime="0.00" waitingCount="0" stopTime="0.00" timeLoss="3.90" rerouteNo="1" devices="tripinfo_car_e2s_175 routing_car_e2s_175" vType="Car" speedFactor="1.03" vaporized=""/>
    <tripinfo id="car_e2s_176" depart="176.40" departLane="e2sep_1" departPos="3.60" departPosLat="0.00" departSpeed="13.90" departDelay="0.40" arrival="321.20" arrivalLane="c2s_1" arrivalPos="990.00" arrivalPosLat="0.00" arrivalSpeed="15.12" duration="144.80" routeLength="1996.47" waitingTime="0.00" waitingCount="0" stopTime="0.00" timeLoss="13.86" rerouteNo="1" devices="tripinfo_car_e2s_176 routing_car_e2s_176" vType="Car" speedFactor="1.10" vaporized=""/>
    <tripinfo id="car_w2n_182" depart="182.00" departLane="w2sep_1" departPos="3.60" departPosLat="0.00" departSpeed="13.90" departDelay="0.00" arrival="325.40" arrivalLane="c2n_1" arrivalPos="990.00" arrivalPosLat="0.00" arrivalSpeed="14.38" duration="143.40" routeLength="1996.47" waitingTime="0.00" waitingCount="0" stopTime="0.00" timeLoss="3.88" rerouteNo="1" devices="tripinfo_car_w2n_182 routing_car_w2n_182" vType="Car" speedFactor="1.03" vaporized=""/>
    <tripinfo id="car_w2e_185" depart="185.00" departLane="w2sep_1" departPos="3.60" departPosLat="0.00" departSpeed="13.90" departDelay="0.00" arrival="326.10" arrivalLane="c2e_1" arrivalPos="990.00" arrivalPosLat="0.00" arrivalSpeed="14.32" duration="141.10" routeLength="1997.01" waitingTime="0.00" waitingCount="0" stopTime="0.00" timeLoss="1.64" rerouteNo="1" devices="tripinfo_car_w2e_185 routing_car_w2e_185" vType="Car" speedFactor="1.03" vaporized=""/>
    <tripinfo id="car_s2n_171" depart="171.00" departLane="s2sep_1" departPos="3.60" departPosLat="0.00" departSpeed="13.90" departDelay="0.00" arrival="337.35" arrivalLane="c2n_1" arrivalPos="990.00" arrivalPosLat="0.00" arrivalSpeed="16.40" duration="166.35" routeLength="1997.01" waitingTime="31.10" waitingCount="1" stopTime="0.00" timeLoss="44.53" rerouteNo="1" devices="tripinfo_car_s2n_171 routing_car_s2n_171" vType="Car" speedFactor="1.18" vaporized=""/>
    <tripinfo id="car_n2s_149" depart="149.00" departLane="n2sep_1" departPos="3.60" departPosLat="0.00" departSpeed="13.90" departDelay="0.00" arrival="345.35" arrivalLane="c2s_1" arrivalPos="990.00" arrivalPosLat="0.00" arrivalSpeed="13.97" duration="196.35" routeLength="1997.01" waitingTime="46.30" waitingCount="1" stopTime="0.00" timeLoss="53.41" rerouteNo="1" devices="tripinfo_car_n2s_149 routing_car_n2s_149" vType="Car" speedFactor="1.01" vaporized=""/>
    <tripinfo id="car_s2e_163" depart="163.00" departLane="s2sep_1" departPos="3.60" departPosLat="0.00" departSpeed="13.90" departDelay="0.00" arrival="345.65" arrivalLane="c2e_1" arrivalPos="990.00" arrivalPosLat="0.00" arrivalSpeed="13.90" duration="182.65" routeLength="1986.69" waitingTime="31.95" waitingCount="1" stopTime="0.00" timeLoss="38.99" rerouteNo="1" devices="tripinfo_car_s2e_163 routing_car_s2e_163" vType="Car" speedFactor="1.00" vaporized=""/>
    <tripinfo id="car_s2n_184" depart="184.00" departLane="s2sep_1" departPos="3.60" departPosLat="0.00" departSpeed="13.90" departDelay="0.00" arrival="349.05" arrivalLane="c2n_1" arrivalPos="990.00" arrivalPosLat="0.00" arrivalSpeed="14.13" duration="165.05" routeLength="1997.01" waitingTime="14.00" waitingCount="1" stopTime="0.00" timeLoss="23.76" rerouteNo="1" devices="tripinfo_car_s2n_184 routing_car_s2n_184" vType="Car" speedFactor="1.02" vaporized=""/>
    <tripinfo id="car_n2w_178" depart="178.00" departLane="n2sep_1" departPos="3.60" departPosLat="0.00" departSpeed="13.90" departDelay="0.00" arrival="349.65" arrivalLane="c2w_1" arrivalPos="990.00" arrivalPosLat="0.00" arrivalSpeed="14.00" duration="171.65" routeLength="1986.69" waitingTime="19.15" waitingCount="1" stopTime="0.00" timeLoss="29.03" rerouteNo="1" devices="tripinfo_car_n2w_178 routing_car_n2w_178" vType="Car" speedFactor="1.01" vaporized=""/>
    <tripinfo id="car_n2s_170" depart="170.00" departLane="n2sep_1" departPos="3.60" departPosLat="0.00" departSpeed="13.90" departDelay="0.00" arrival="349.95" arrivalLane="c2s_1" arrivalPos="990.00" arrivalPosLat="0.00" arrivalSpeed="13.89" duration="179.95" routeLength="1997.01" waitingTime="24.20" waitingCount="1" stopTime="0.00" timeLoss="36.28" rerouteNo="1" devices="tripinfo_car_n2s_170 routing_car_n2s_170" vType="Car" speedFactor="1.00" vaporized=""/>
    <tripinfo id="car_s2n_189" depart="189.00" departLane="s2sep_1" departPos="3.60" departPosLat="0.00" departSpeed="13.90" departDelay="0.00" arrival="353.95" arrivalLane="c2n_1" arrivalPos="990.00" arrivalPosLat="0.00" arrivalSpeed="13.90" duration="164.95" routeLength="1997.01" waitingTime="8.85" waitingCount="1" stopTime="0.00" timeLoss="21.27" rerouteNo="1" devices="tripinfo_car_s2n_189 routing_car_s2n_189" vType="Car" speedFactor="1.00" vaporized=""/>
    <tripinfo id="bus_n2s_189" depart="189.00" departLane="n2sep_1" departPos="12.10" departPosLat="0.00" departSpeed="13.90" departDelay="0.00" arrival="355.10" arrivalLane="c2s_1" arrivalPos="990.00" arrivalPosLat="0.00" arrivalSpeed="13.87" duration="166.10" routeLength="1988.51" waitingTime="10.05" waitingCount="1" stopTime="0.00" timeLoss="23.05" rerouteNo="1" devices="tripinfo_bus_n2s_189 routing_bus_n2s_189" vType="Bus" speedFactor="1.00" vaporized=""/>
    <tripinfo id="car_n2e_168" depart="168.00" departLane="n2sep_1" departPos="3.60" departPosLat="0.00" departSpeed="13.90" departDelay="0.00" arrival="355.30" arrivalLane="c2e_1" arrivalPos="990.00" arrivalPosLat="0.00" arrivalSpeed="14.17" duration="187.30" routeLength="1996.47" waitingTime="34.55" waitingCount="2" stopTime="0.00" timeLoss="45.77" rerouteNo="1" devices="tripinfo_car_n2e_168 routing_car_n2e_168" vType="Car" speedFactor="1.02" vaporized=""/>
    <tripinfo id="car_s2n_203" depart="203.00" departLane="s2sep_1" departPos="3.60" departPosLat="0.00" departSpeed="13.90" departDelay="0.00" arrival="357.15" arrivalLane="c2n_1" arrivalPos="990.00" arrivalPosLat="0.00" arrivalSpeed="14.08" duration="154.15" routeLength="1997.01" waitingTime="0.00" waitingCount="0" stopTime="0.00" timeLoss="12.83" rerouteNo="1" devices="tripinfo_car_s2n_203 routing_car_s2n_203" vType="Car" speedFactor="1.02" vaporized=""/>
    <tripinfo id="car_n2w_222" depart="222.00" departLane="n2sep_1" departPos="3.60" departPosLat="0.00" departSpeed="13.90" departDelay="0.00" arrival="358.50" arrivalLane="c2w_1" arrivalPos="990.00" arrivalPosLat="0.00" arrivalSpeed="15.12" duration="136.50" routeLength="1986.69" waitingTime="0.00" waitingCount="0" stopTime="0.00" timeLoss="4.46" rerouteNo="1" devices="tripinfo_car_n2w_222 routing_car_n2w_222" vType="Car" speedFactor="1.09" vaporized=""/>
    <tripinfo id="car_n2s_203" depart="203.00" departLane="n2sep_1" departPos="3.60" departPosLat="0.00" departSpeed="13.90" departDelay="0.00" arrival="358.90" arrivalLane="c2s_1" arrivalPos="990.00" arrivalPosLat="0.00" arrivalSpeed="14.17" duration="155.90" routeLength="1997.01" waitingTime="0.00" waitingCount="0" stopTime="0.00" timeLoss="15.32" rerouteNo="1" devices="tripinfo_car_n2s_203 routing_car_n2s_203" vType="Car" speedFactor="1.02" vaporized=""/>
    <tripinfo id="car_n2e_183" depart="183.00" departLane="n2sep_1" departPos="3.60" departPosLat="0.00" departSpeed="13.90" departDelay="0.00" arrival="360.40" arrivalLane="c2e_1" arrivalPos="990.00" arrivalPosLat="0.00" arrivalSpeed="13.90" duration="177.40" routeLength="1996.47" waitingTime="17.55" waitingCount="2" stopTime="0.00" timeLoss="33.10" rerouteNo="1" devices="tripinfo_car_n2e_183 routing_car_n2e_183" vType="Car" speedFactor="1.00" vaporized=""/>
    <tripinfo id="car_n2e_192" depart="192.00" departLane="n2sep_1" departPos="3.60" departPosLat="0.00" departSpeed="13.90" departDelay="0.00" arrival="364.15" arrivalLane="c2e_1" arrivalPos="990.00" arrivalPosLat="0.00" arrivalSpeed="13.90" duration="172.15" routeLength="1996.47" waitingTime="6.35" waitingCount="2" stopTime="0.00" timeLoss="28.05" rerouteNo="1" devices="tripinfo_car_n2e_192 routing_car_n2e_192" vType="Car" speedFactor="1.00" vaporized=""/>
    <tripinfo id="car_s2e_230" depart="230.00" departLane="s2sep_1" departPos="3.60" departPosLat="0.00" departSpeed="13.90" departDelay="0.00" arrival="366.85" arrivalLane="c2e_1" arrivalPos="990.00" arrivalPosLat="0.00" arrivalSpeed="15.09" duration="136.85" routeLength="1986.69" waitingTime="0.00" waitingCount="0" stopTime="0.00" timeLoss="5.91" rerouteNo="1" devices="tripinfo_car_s2e_230 routing_car_s2e_230" vType="Car" speedFactor="1.10" vaporized=""/>
    <tripinfo id="car_n2s_232" depart="232.00" departLane="n2sep_1" departPos="3.60" departPosLat="0.00" departSpeed="13.90" departDelay="0.00" arrival="367.50" arrivalLane="c2s_1" arrivalPos="990.00" arrivalPosLat="0.00" arrivalSpeed="14.80" duration="135.50" routeLength="1997.01" waitingTime="0.00" waitingCount="0" stopTime="0.00" timeLoss="0.60" rerouteNo="1" devices="tripinfo_car_n2s_232 routing_car_n2s_232" vType="Car" speedFactor="1.07" vaporized=""/>
    <tripinfo id="bus_s2w_172" depart="172.65" departLane="s2sep_1" departPos="12.10" departPosLat="0.00" departSpeed="13.90" departDelay="0.65" arrival="378.50" arrivalLane="c2w_1" arrivalPos="990.00" arrivalPosLat="0.00" arrivalSpeed="13.90" duration="205.85" routeLength="1987.97" waitingTime="46.50" waitingCount="2" stopTime="0.00" timeLoss="62.12" rerouteNo="1" devices="tripinfo_bus_s2w_172 routing_bus_s2w_172" vType="Bus" speedFactor="1.00" vaporized=""/>
    <tripinfo id="car_w2s_188" depart="188.00" departLane="w2sep_1" departPos="3.60" departPosLat="0.00" departSpeed="13.90" departDelay="0.00" arrival="381.80" arrivalLane="c2s_1" arrivalPos="990.00" arrivalPosLat="0.00" arrivalSpeed="15.95" duration="193.80" routeLength="1986.69" waitingTime="54.15" waitingCount="1" stopTime="0.00" timeLoss="68.61" rerouteNo="1" devices="tripinfo_car_w2s_188 routing_car_w2s_188" vType="Car" speedFactor="1.15" vaporized=""/>
    <tripinfo id="car_s2w_219" depart="219.00" departLane="s2sep_1" departPos="3.60" departPosLat="0.00" departSpeed="13.90" departDelay="0.00" arrival="383.00" arrivalLane="c2w_1" arrivalPos="990.00" arrivalPosLat="0.00" arrivalSpeed="14.02" duration="164.00" routeLength="1996.47" waitingTime="7.50" waitingCount="1" stopTime="0.00" timeLoss="21.06" rerouteNo="1" devices="tripinfo_car_s2w_219 routing_car_s2w_219" vType="Car" speedFactor="1.01" vaporized=""/>
    <tripinfo id="car_e2w_204" depart="204.00" departLane="e2sep_1" departPos="3.60" departPosLat="0.00" departSpeed="13.90" departDelay="0.00" arrival="386.20" arrivalLane="c2w_1" arrivalPos="990.00" arrivalPosLat="0.00" arrivalSpeed="15.10" duration="182.20" routeLength="1997.01" waitingTime="41.75" waitingCount="1" stopTime="0.00" timeLoss="50.58" rerouteNo="1" devices="tripinfo_car_e2w_204 routing_car_e2w_204" vType="Car" speedFactor="1.09" vaporized=""/>
    <tripinfo id="car_w2e_194" depart="194.00" departLane="w2sep_1" departPos="3.60" departPosLat="0.00" departSpeed="13.90" departDelay="0.00" arrival="389.95" arrivalLane="c2e_1" arrivalPos="990.00" arrivalPosLat="0.00" arrivalSpeed="14.49" duration="195.95" routeLength="1997.01" waitingTime="49.35" waitingCount="1" stopTime="0.00" timeLoss="58.13" rerouteNo="1" devices="tripinfo_car_w2e_194 routing_car_w2e_194" vType="Car" speedFactor="1.04" vaporized=""/>
    <tripinfo id="car_e2w_244" depart="244.00" departLane="e2sep_1" departPos="3.60" departPosLat="0.00" departSpeed="13.90" departDelay="0.00" arrival="393.55" arrivalLane="c2w_1" arrivalPos="990.00" arrivalPosLat="0.00" arrivalSpeed="13.90" duration="149.55" routeLength="1997.01" waitingTime="0.00" waitingCount="0" stopTime="0.00" timeLoss="5.88" rerouteNo="1" devices="tripinfo_car_e2w_244 routing_car_e2w_244" vType="Car" speedFactor="1.00" vaporized=""/>
    <tripinfo id="car_w2s_197" depart="197.00" departLane="w2sep_1" departPos="3.60" departPosLat="0.00" departSpeed="13.90" departDelay="0.00" arrival="395.00" arrivalLane="c2s_1" arrivalPos="990.00" arrivalPosLat="0.00" arrivalSpeed="14.00" duration="198.00" routeLength="1986.69" waitingTime="44.65" waitingCount="1" stopTime="0.00" timeLoss="55.38" rerouteNo="1" devices="tripinfo_car_w2s_197 routing_car_w2s_197" vType="Car" speedFactor="1.01" vaporized=""/>
    <tripinfo id="car_e2w_251" depart="251.00" departLane="e2sep_1" departPos="3.60" departPosLat="0.00" departSpeed="13.90" departDelay="0.00" arrival="396.10" arrivalLane="c2w_1" arrivalPos="990.00" arrivalPosLat="0.00" arrivalSpeed="14.63" duration="145.10" routeLength="1997.01" waitingTime="0.00" waitingCount="0" stopTime="0.00" timeLoss="10.18" rerouteNo="1" devices="tripinfo_car_e2w_251 routing_car_e2w_251" vType="Car" speedFactor="1.06" vaporized=""/>
    <tripinfo id="car_e2s_209" depart="209.00" departLane="e2sep_1" departPos="3.60" departPosLat="0.00" departSpeed="13.90" departDelay="0.00" arrival="398.35" arrivalLane="c2s_1" arrivalPos="990.00" arrivalPosLat="0.00" arrivalSpeed="14.45" duration="189.35" routeLength="1996.47" waitingTime="36.95" waitingCount="2" stopTime="0.00" timeLoss="51.00" rerouteNo="1" devices="tripinfo_car_e2s_209 routing_car_e2s_209" vType="Car" speedFactor="1.04" vaporized=""/>
    <tripinfo id="car_e2s_217" depart="217.00" departLane="e2sep_1" departPos="3.60" departPosLat="0.00" departSpeed="13.90" departDelay="0.00" arrival="401.20" arrivalLane="c2s_1" arrivalPos="990.00" arrivalPosLat="0.00" arrivalSpeed="14.60" duration="184.20" routeLength="1996.47" waitingTime="29.70" waitingCount="2" stopTime="0.00" timeLoss="47.66" rerouteNo="1" devices="tripinfo_car_e2s_217 routing_car_e2s_217" vType="Car" speedFactor="1.06" vaporized=""/>
    <tripinfo id="car_e2n_251" depart="252.35" departLane="e2sep_1" departPos="3.60" departPosLat="0.00" departSpeed="13.90" departDelay="1.35" arrival="401.25" arrivalLane="c2n_1" arrivalPos="990.00" arrivalPosLat="0.00" arrivalSpeed="13.90" duration="148.90" routeLength="1986.69" waitingTime="0.00" waitingCount="0" stopTime="0.00" timeLoss="5.23" rerouteNo="1" devices="tripinfo_car_e2n_251 routing_car_e2n_251" vType="Car" speedFactor="1.00" vaporized=""/>
    <tripinfo id="car_e2s_227" depart="227.00" departLane="e2sep_1" departPos="3.60" departPosLat="0.00" departSpeed="13.90" departDelay="0.00" arrival="403.35" arrivalLane="c2s_1" arrivalPos="990.00" arrivalPosLat="0.00" arrivalSpeed="15.20" duration="176.35" routeLength="1996.47" waitingTime="22.10" waitingCount="1" stopTime="0.00" timeLoss="47.69" rerouteNo="1" devices="tripinfo_car_e2s_227 routing_car_e2s_227" vType="Car" speedFactor="1.12" vaporized=""/>
    <tripinfo id="car_e2n_257" depart="257.00" departLane="e2sep_1" departPos="3.60" departPosLat="0.00" departSpeed="13.90" departDelay="0.00" arrival="405.45" arrivalLane="c2n_1" arrivalPos="990.00" arrivalPosLat="0.00" arrivalSpeed="14.12" duration="148.45" routeLength="1986.69" waitingTime="0.00" waitingCount="0" stopTime="0.00" timeLoss="7.17" rerouteNo="1" devices="tripinfo_car_e2n_257 routing_car_e2n_257" vType="Car" speedFactor="1.02" vaporized=""/>
    <tripinfo id="amb_w2e_300" depart="300.00" departLane="w2sep_1" departPos="6.60" departPosLat="0.00" departSpeed="13.90" departDelay="0.00" arrival="405.70" arrivalLane="c2e_1" arrivalPos="990.00" arrivalPosLat="-0.95" arrivalSpeed="20.79" duration="105.70" routeLength="1994.01" waitingTime="0.00" waitingCount="0" stopTime="0.00" timeLoss="10.06" rerouteNo="1" devices="tripinfo_amb_w2e_300 routing_amb_w2e_300 bluelight_amb_w2e_300 fcd_amb_w2e_300" vType="Ambulance" speedFactor="1.50" vaporized="">
        <example_device customValue1="0.00" customValue2="-1.00"/>
    </tripinfo>
    <tripinfo id="car_w2e_274" depart="274.00" departLane="w2sep_1" departPos="3.60" departPosLat="0.00" departSpeed="13.90" departDelay="0.00" arrival="406.85" arrivalLane="c2e_1" arrivalPos="990.00" arrivalPosLat="1.10" arrivalSpeed="15.23" duration="132.85" routeLength="1997.01" waitingTime="0.00" waitingCount="0" stopTime="0.00" timeLoss="1.70" rerouteNo="1" devices="tripinfo_car_w2e_274 routing_car_w2e_274" vType="Car@car_w2e_274" speedFactor="1.10" vaporized=""/>
    <tripinfo id="car_w2n_205" depart="205.00" departLane="w2sep_1" departPos="3.60" departPosLat="0.00" departSpeed="13.90" departDelay="0.00" arrival="408.55" arrivalLane="c2n_1" arrivalPos="990.00" arrivalPosLat="0.00" arrivalSpeed="14.36" duration="203.55" routeLength="1996.47" waitingTime="48.70" waitingCount="3" stopTime="0.00" timeLoss="64.45" rerouteNo="1" devices="tripinfo_car_w2n_205 routing_car_w2n_205" vType="Car" speedFactor="1.04" vaporized=""/>
    <tripinfo id="car_w2n_211" depart="211.00" departLane="w2sep_1" departPos="3.60" departPosLat="0.00" departSpeed="13.90" departDelay="0.00" arrival="410.80" arrivalLane="c2n_1" arrivalPos="990.00" arrivalPosLat="0.00" arrivalSpeed="14.88" duration="199.80" routeLength="1996.47" waitingTime="45.20" waitingCount="2" stopTime="0.00" timeLoss="67.53" rerouteNo="1" devices="tripinfo_car_w2n_211 routing_car_w2n_211" vType="Car" speedFactor="1.09" vaporized=""/>
    <tripinfo id="car_w2n_238" depart="238.00" departLane="w2sep_1" departPos="3.60" departPosLat="0.00" departSpeed="13.90" departDelay="0.00" arrival="414.80" arrivalLane="c2n_1" arrivalPos="990.00" arrivalPosLat="0.00" arrivalSpeed="13.89" duration="176.80" routeLength="1996.47" waitingTime="12.75" waitingCount="2" stopTime="0.00" timeLoss="32.45" rerouteNo="1" devices="tripinfo_car_w2n_238 routing_car_w2n_238" vType="Car" speedFactor="1.00" vaporized=""/>
    <tripinfo id="car_w2n_244" depart="244.00" departLane="w2sep_1" departPos="3.60" departPosLat="0.00" departSpeed="13.90" departDelay="0.00" arrival="418.15" arrivalLane="c2n_1" arrivalPos="990.00" arrivalPosLat="0.00" arrivalSpeed="13.86" duration="174.15" routeLength="1996.47" waitingTime="8.00" waitingCount="1" stopTime="0.00" timeLoss="29.83" rerouteNo="1" devices="tripinfo_car_w2n_244 routing_car_w2n_244" vType="Car" speedFactor="1.00" vaporized=""/>
    <tripinfo id="car_w2n_259" depart="259.00" departLane="w2sep_1" departPos="3.60" departPosLat="0.00" departSpeed="13.90" departDelay="0.00" arrival="420.20" arrivalLane="c2n_1" arrivalPos="990.00" arrivalPosLat="0.00" arrivalSpeed="14.79" duration="161.20" routeLength="1996.47" waitingTime="7.75" waitingCount="1" stopTime="0.00" timeLoss="29.81" rerouteNo="1" devices="tripinfo_car_w2n_259 routing_car_w2n_259" vType="Car" speedFactor="1.10" vaporized=""/>
    <tripinfo id="car_w2n_271" depart="271.00" departLane="w2sep_1" departPos="3.60" departPosLat="0.00" departSpeed="13.90" departDelay="0.00" arrival="422.30" arrivalLane="c2n_1" arrivalPos="990.00" arrivalPosLat="0.00" arrivalSpeed="14.83" duration="151.30" routeLength="1996.47" waitingTime="0.00" waitingCount="0" stopTime="0.00" timeLoss="19.64" rerouteNo="1" devices="tripinfo_car_w2n_271 routing_car_w2n_271" vType="Car" speedFactor="1.10" vaporized=""/>
    <tripinfo id="car_e2s_290" depart="290.00" departLane="e2sep_1" departPos="3.60" departPosLat="0.00" departSpeed="13.90" departDelay="0.00" arrival="433.55" arrivalLane="c2s_1" arrivalPos="990.00" arrivalPosLat="0.00" arrivalSpeed="14.34" duration="143.55" routeLength="1996.47" waitingTime="0.00" waitingCount="0" stopTime="0.00" timeLoss="3.60" rerouteNo="1" devices="tripinfo_car_e2s_290 routing_car_e2s_290" vType="Car" speedFactor="1.03" vaporized=""/>
    <tripinfo id="car_n2s_256" depart="256.00" departLane="n2sep_1" departPos="3.60" departPosLat="0.00" departSpeed="13.90" departDelay="0.00" arrival="440.65" arrivalLane="c2s_1" arrivalPos="990.00" arrivalPosLat="0.00" arrivalSpeed="16.25" duration="184.65" routeLength="1997.01" waitingTime="46.25" waitingCount="1" stopTime="0.00" timeLoss="61.73" rerouteNo="1" devices="tripinfo_car_n2s_256 routing_car_n2s_256" vType="Car" speedFactor="1.17" vaporized=""/>
    <tripinfo id="car_s2e_275" depart="275.00" departLane="s2sep_1" departPos="3.60" departPosLat="0.00" departSpeed="13.90" departDelay="0.00" arrival="445.65" arrivalLane="c2e_1" arrivalPos="990.00" arrivalPosLat="0.00" arrivalSpeed="13.96" duration="170.65" routeLength="1986.69" waitingTime="20.55" waitingCount="1" stopTime="0.00" timeLoss="27.57" rerouteNo="1" devices="tripinfo_car_s2e_275 routing_car_s2e_275" vType="Car" speedFactor="1.00" vaporized=""/>
    <tripinfo id="car_n2w_240" depart="240.00" departLane="n2sep_1" departPos="3.60" departPosLat="0.00" departSpeed="13.90" departDelay="0.00" arrival="445.90" arrivalLane="c2w_1" arrivalPos="990.00" arrivalPosLat="0.00" arrivalSpeed="13.90" duration="205.90" routeLength="1986.69" waitingTime="55.35" waitingCount="1" stopTime="0.00" timeLoss="62.25" rerouteNo="1" devices="tripinfo_car_n2w_240 routing_car_n2w_240" vType="Car" speedFactor="1.00" vaporized=""/>
    <tripinfo id="car_n2w_250" depart="250.00" departLane="n2sep_1" departPos="3.60" departPosLat="0.00" departSpeed="13.90" departDelay="0.00" arrival="449.90" arrivalLane="c2w_1" arrivalPos="990.00" arrivalPosLat="0.00" arrivalSpeed="14.08" duration="199.90" routeLength="1986.69" waitingTime="47.00" waitingCount="1" stopTime="0.00" timeLoss="58.20" rerouteNo="1" devices="tripinfo_car_n2w_250 routing_car_n2w_250" vType="Car" speedFactor="1.01" vaporized=""/>
    <tripinfo id="car_s2e_281" depart="281.00" departLane="s2sep_1" departPos="3.60" departPosLat="0.00" departSpeed="13.90" departDelay="0.00" arrival="450.35" arrivalLane="c2e_1" arrivalPos="990.00" arrivalPosLat="0.00" arrivalSpeed="13.89" duration="169.35" routeLength="1986.69" waitingTime="14.85" waitingCount="1" stopTime="0.00" timeLoss="25.68" rerouteNo="1" devices="tripinfo_car_s2e_281 routing_car_s2e_281" vType="Car" speedFactor="1.00" vaporized=""/>
    <tripinfo id="car_n2s_259" depart="259.00" departLane="n2sep_1" departPos="3.60" departPosLat="0.00" departSpeed="13.90" departDelay="0.00" arrival="452.15" arrivalLane="c2s_1" arrivalPos="990.00" arrivalPosLat="0.00" arrivalSpeed="14.03" duration="193.15" routeLength="1997.01" waitingTime="39.85" waitingCount="1" stopTime="0.00" timeLoss="50.76" rerouteNo="1" devices="tripinfo_car_n2s_259 routing_car_n2s_259" vType="Car" speedFactor="1.01" vaporized=""/>
    <tripinfo id="car_s2e_288" depart="288.00" departLane="s2sep_1" departPos="3.60" departPosLat="0.00" departSpeed="13.90" departDelay="0.00" arrival="452.45" arrivalLane="c2e_1" arrivalPos="990.00" arrivalPosLat="0.00" arrivalSpeed="14.91" duration="164.45" routeLength="1986.69" waitingTime="13.75" waitingCount="1" stopTime="0.00" timeLoss="34.23" rerouteNo="1" devices="tripinfo_car_s2e_288 routing_car_s2e_288" vType="Car" speedFactor="1.10" vaporized=""/>
    <tripinfo id="car_n2e_274" depart="274.00" departLane="n2sep_1" departPos="3.60" departPosLat="0.00" departSpeed="13.90" departDelay="0.00" arrival="454.30" arrivalLane="c2e_1" arrivalPos="990.00" arrivalPosLat="0.00" arrivalSpeed="15.54" duration="180.30" routeLength="1996.47" waitingTime="34.80" waitingCount="2" stopTime="0.00" timeLoss="57.69" rerouteNo="1" devices="tripinfo_car_n2e_274 routing_car_n2e_274" vType="Car" speedFactor="1.18" vaporized=""/>
    <tripinfo id="car_n2s_280" depart="280.45" departLane="n2sep_1" departPos="3.60" departPosLat="0.00" departSpeed="13.90" departDelay="0.45" arrival="454.95" arrivalLane="c2s_1" arrivalPos="990.00" arrivalPosLat="0.00" arrivalSpeed="14.77" duration="174.50" routeLength="1997.01" waitingTime="20.05" waitingCount="1" stopTime="0.00" timeLoss="40.35" rerouteNo="1" devices="tripinfo_car_n2s_280 routing_car_n2s_280" vType="Car" speedFactor="1.07" vaporized=""/>
    <tripinfo id="car_n2w_279" depart="279.00" departLane="n2sep_1" departPos="3.60" departPosLat="0.00" departSpeed="13.90" departDelay="0.00" arrival="455.55" arrivalLane="c2w_1" arrivalPos="990.00" arrivalPosLat="0.00" arrivalSpeed="13.94" duration="176.55" routeLength="1986.69" waitingTime="20.95" waitingCount="1" stopTime="0.00" timeLoss="33.32" rerouteNo="1" devices="tripinfo_car_n2w_279 routing_car_n2w_279" vType="Car" speedFactor="1.00" vaporized=""/>
    <tripinfo id="car_n2e_303" depart="303.00" departLane="n2sep_1" departPos="3.60" departPosLat="0.00" departSpeed="13.90" departDelay="0.00" arrival="457.40" arrivalLane="c2e_1" arrivalPos="990.00" arrivalPosLat="0.00" arrivalSpeed="14.29" duration="154.40" routeLength="1996.47" waitingTime="2.45" waitingCount="1" stopTime="0.00" timeLoss="14.57" rerouteNo="1" devices="tripinfo_car_n2e_303 routing_car_n2e_303" vType="Car" speedFactor="1.03" vaporized=""/>
    <tripinfo id="car_n2s_295" depart="295.00" departLane="n2sep_1" departPos="3.60" departPosLat="0.00" departSpeed="13.90" departDelay="0.00" arrival="459.25" arrivalLane="c2s_1" arrivalPos="990.00" arrivalPosLat="0.00" arrivalSpeed="14.21" duration="164.25" routeLength="1997.01" waitingTime="8.90" waitingCount="1" stopTime="0.00" timeLoss="23.84" rerouteNo="1" devices="tripinfo_car_n2s_295 routing_car_n2s_295" vType="Car" speedFactor="1.02" vaporized=""/>
</tripinfos>
