<?xml version="1.0" encoding="UTF-8"?>

<!-- generated on Sat Apr 24 18:08:58 2021 by Eclipse SUMO Version 1.4.0
<configuration xmlns:xsi="http://www.w3.org/2001/XMLSchema-instance" xsi:noNamespaceSchemaLocation="http://sumo.dlr.de/xsd/sumoConfiguration.xsd">

    <input>
        <net-file value="sumofiles/junction.net.xml"/>
        <route-files value="sumofiles/junction_preemption_112.rou.xml"/>
        <additional-files value="sumofiles/junction.det.xml"/>
    </input>

    <output>
        <tripinfo-output value="sumofiles/output/tripinfo_preemption_112.xml"/>
    </output>

    <time>
        <begin value="0"/>
        <end value="10000"/>
        <step-length value="0.05"/>
    </time>

    <processing>
        <lateral-resolution value="0.1"/>
    </processing>

    <report>
        <no-warnings value="true"/>
        <error-log value="sumofiles/output/errorlog_preemption_112.log"/>
        <no-step-log value="true"/>
    </report>

    <traci_server>
        <remote-port value="51715"/>
    </traci_server>

    <gui_only>
        <gui-settings-file value="sumofiles/junction-gui.settings.xml"/>
        <tracker-interval value="0.05"/>
    </gui_only>

</configuration>
-->

<tripinfos xmlns:xsi="http://www.w3.org/2001/XMLSchema-instance" xsi:noNamespaceSchemaLocation="http://sumo.dlr.de/xsd/tripinfo_file.xsd">
    <tripinfo id="car_e2w_7" depart="7.00" departLane="e2sep_1" departPos="3.60" departPosLat="0.00" departSpeed="13.90" departDelay="0.00" arrival="142.70" arrivalLane="c2w_1" arrivalPos="990.00" arrivalPosLat="0.00" arrivalSpeed="14.73" duration="135.70" routeLength="1997.01" waitingTime="0.00" waitingCount="0" stopTime="0.00" timeLoss="0.13" rerouteNo="1" devices="tripinfo_car_e2w_7 routing_car_e2w_7" vType="Car" speedFactor="1.06" vaporized=""/>
    <tripinfo id="car_w2n_10" depart="10.00" departLane="w2sep_1" departPos="3.60" departPosLat="0.00" departSpeed="13.90" departDelay="0.00" arrival="156.25" arrivalLane="c2n_1" arrivalPos="990.00" arrivalPosLat="0.00" arrivalSpeed="14.32" duration="146.25" routeLength="1996.47" waitingTime="0.00" waitingCount="0" stopTime="0.00" timeLoss="6.17" rerouteNo="1" devices="tripinfo_car_w2n_10 routing_car_w2n_10" vType="Car" speedFactor="1.03" vaporized=""/>
    <tripinfo id="car_n2s_1" depart="1.00" departLane="n2sep_1" departPos="3.60" departPosLat="0.00" departSpeed="13.90" departDelay="0.00" arrival="161.75" arrivalLane="c2s_1" arrivalPos="990.00" arrivalPosLat="0.00" arrivalSpeed="14.73" duration="160.75" routeLength="1997.01" waitingTime="17.75" waitingCount="1" stopTime="0.00" timeLoss="25.20" rerouteNo="1" devices="tripinfo_car_n2s_1 routing_car_n2s_1" vType="Car" speedFactor="1.06" vaporized=""/>
    <tripinfo id="car_n2s_17" depart="17.00" departLane="n2sep_1" departPos="3.60" departPosLat="0.00" departSpeed="13.90" departDelay="0.00" arrival="166.60" arrivalLane="c2s_1" arrivalPos="990.00" arrivalPosLat="0.00" arrivalSpeed="14.53" duration="149.60" routeLength="1997.01" waitingTime="1.75" waitingCount="1" stopTime="0.00" timeLoss="12.21" rerouteNo="1" devices="tripinfo_car_n2s_17 routing_car_n2s_17" vType="Car" speedFactor="1.05" vaporized=""/>
    <tripinfo id="car_n2s_25" depart="25.00" departLane="n2sep_1" departPos="3.60" departPosLat="0.00" departSpeed="13.90" departDelay="0.00" arrival="170.20" arrivalLane="c2s_1" arrivalPos="990.00" arrivalPosLat="0.00" arrivalSpeed="14.51" duration="145.20" routeLength="1997.01" waitingTime="0.00" waitingCount="0" stopTime="0.00" timeLoss="7.80" rerouteNo="1" devices="tripinfo_car_n2s_25 routing_car_n2s_25" vType="Car" speedFactor="1.05" vaporized=""/>
    <tripinfo id="car_s2e_24" depart="24.00" departLane="s2sep_1" departPos="3.60" departPosLat="0.00" departSpeed="13.90" departDelay="0.00" arrival="173.45" arrivalLane="c2e_1" arrivalPos="990.00" arrivalPosLat="0.00" arrivalSpeed="13.90" duration="149.45" routeLength="1986.69" waitingTime="0.00" waitingCount="0" stopTime="0.00" timeLoss="5.78" rerouteNo="1" devices="tripinfo_car_s2e_24 routing_car_s2e_24" vType="Car" speedFactor="1.00" vaporized=""/>
    <tripinfo id="car_s2e_29" depart="29.00" departLane="s2sep_1" departPos="3.60" departPosLat="0.00" departSpeed="13.90" departDelay="0.00" arrival="175.35" arrivalLane="c2e_1" arrivalPos="990.00" arrivalPosLat="0.00" arrivalSpeed="15.36" duration="146.35" routeLength="1986.69" waitingTime="0.00" waitingCount="0" stopTime="0.00" timeLoss="22.31" rerouteNo="1" devices="tripinfo_car_s2e_29 routing_car_s2e_29" vType="Car" speedFactor="1.16" vaporized=""/>
    <tripinfo id="car_s2n_30" depart="30.30" departLane="s2sep_1" departPos="3.60" departPosLat="0.00" departSpeed="13.90" departDelay="0.30" arrival="175.95" arrivalLane="c2n_1" arrivalPos="990.00" arrivalPosLat="0.00" arrivalSpeed="14.15" duration="145.65" routeLength="1997.01" waitingTime="0.00" waitingCount="0" stopTime="0.00" timeLoss="4.50" rerouteNo="1" devices="tripinfo_car_s2n_30 routing_car_s2n_30" vType="Car" speedFactor="1.02" vaporized=""/>
    <tripinfo id="car_n2w_28" depart="28.00" departLane="n2sep_1" departPos="3.60" departPosLat="0.00" departSpeed="13.90" departDelay="0.00" arrival="176.15" arrivalLane="c2w_1" arrivalPos="990.00" arrivalPosLat="0.00" arrivalSpeed="13.90" duration="148.15" routeLength="1986.69" waitingTime="0.00" waitingCount="0" stopTime="0.00" timeLoss="4.49" rerouteNo="1" devices="tripinfo_car_n2w_28 routing_car_n2w_28" vType="Car" speedFactor="1.00" vaporized=""/>
    <tripinfo id="car_s2w_9" depart="9.00" departLane="s2sep_1" departPos="3.60" departPosLat="0.00" departSpeed="13.90" departDelay="0.00" arrival="178.60" arrivalLane="c2w_1" arrivalPos="990.00" arrivalPosLat="0.00" arrivalSpeed="14.83" duration="169.60" routeLength="1996.47" waitingTime="20.35" waitingCount="2" stopTime="0.00" timeLoss="36.30" rerouteNo="1" devices="tripinfo_car_s2w_9 routing_car_s2w_9" vType="Car" speedFactor="1.08" vaporized=""/>
    <tripinfo id="car_s2e_39" depart="40.40" departLane="s2sep_1" departPos="3.60" departPosLat="0.00" departSpeed="13.90" departDelay="1.40" arrival="179.15" arrivalLane="c2e_1" arrivalPos="990.00" arrivalPosLat="0.00" arrivalSpeed="15.57" duration="138.75" routeLength="1986.69" waitingTime="0.00" waitingCount="0" stopTime="0.00" timeLoss="10.81" rerouteNo="1" devices="tripinfo_car_s2e_39 routing_car_s2e_39" vType="Car" speedFactor="1.12" vaporized=""/>
    <tripinfo id="car_s2n_39" depart="39.00" departLane="s2sep_1" departPos="3.60" departPosLat="0.00" departSpeed="13.90" departDelay="0.00" arrival="179.55" arrivalLane="c2n_1" arrivalPos="990.00" arrivalPosLat="0.00" arrivalSpeed="14.52" duration="140.55" routeLength="1997.01" waitingTime="0.00" waitingCount="0" stopTime="0.00" timeLoss="3.33" rerouteNo="1" devices="tripinfo_car_s2n_39 routing_car_s2n_39" vType="Car" speedFactor="1.05" vaporized=""/>
    <tripinfo id="car_n2w_47" depart="47.00" departLane="n2sep_1" departPos="3.60" departPosLat="0.00" departSpeed="13.90" departDelay="0.00" arrival="180.95" arrivalLane="c2w_1" arrivalPos="990.00" arrivalPosLat="0.00" arrivalSpeed="15.45" duration="133.95" routeLength="1986.69" waitingTime="0.00" waitingCount="0" stopTime="0.00" timeLoss="7.03" rerouteNo="1" devices="tripinfo_car_n2w_47 routing_car_n2w_47" vType="Car" speedFactor="1.13" vaporized=""/>
    <tripinfo id="car_n2e_35" depart="35.00" departLane="n2sep_1" departPos="3.60" departPosLat="0.00" departSpeed="13.90" departDelay="0.00" arrival="187.80" arrivalLane="c2e_1" arrivalPos="990.00" arrivalPosLat="0.00" arrivalSpeed="14.27" duration="152.80" routeLength="1996.47" waitingTime="4.15" waitingCount="1" stopTime="0.00" timeLoss="12.17" rerouteNo="1" devices="tripinfo_car_n2e_35 routing_car_n2e_35" vType="Car" speedFactor="1.03" vaporized=""/>
    <tripinfo id="car_s2w_16" depart="16.00" departLane="s2sep_1" departPos="3.60" departPosLat="0.00" departSpeed="13.90" departDelay="0.00" arrival="190.20" arrivalLane="c2w_1" arrivalPos="990.00" arrivalPosLat="0.00" arrivalSpeed="13.90" duration="174.20" routeLength="1996.47" waitingTime="13.45" waitingCount="2" stopTime="0.00" timeLoss="29.86" rerouteNo="1" devices="tripinfo_car_s2w_16 routing_car_s2w_16" vType="Car" speedFactor="1.00" vaporized=""/>
    <tripinfo id="car_s2w_17" depart="17.45" departLane="s2sep_1" departPos="3.60" departPosLat="0.00" departSpeed="13.90" departDelay="0.45" arrival="194.05" arrivalLane="c2w_1" arrivalPos="990.00" arrivalPosLat="0.00" arrivalSpeed="14.02" duration="176.60" routeLength="1996.47" waitingTime="10.10" waitingCount="2" stopTime="0.00" timeLoss="33.75" rerouteNo="1" devices="tripinfo_car_s2w_17 routing_car_s2w_17" vType="Car" speedFactor="1.01" vaporized=""/>
    <tripinfo id="car_s2w_21" depart="21.00" departLane="s2sep_1" departPos="3.60" departPosLat="0.00" departSpeed="13.90" departDelay="0.00" arrival="196.70" arrivalLane="c2w_1" arrivalPos="990.00" arrivalPosLat="0.00" arrivalSpeed="14.42" duration="175.70" routeLength="1996.47" waitingTime="6.95" waitingCount="2" stopTime="0.00" timeLoss="37.85" rerouteNo="1" devices="tripinfo_car_s2w_21 routing_car_s2w_21" vType="Car" speedFactor="1.05" vaporized=""/>
    <tripinfo id="car_s2w_56" depart="56.00" departLane="s2sep_1" departPos="3.60" departPosLat="0.00" departSpeed="13.90" departDelay="0.00" arrival="198.55" arrivalLane="c2w_1" arrivalPos="990.00" arrivalPosLat="0.00" arrivalSpeed="15.45" duration="142.55" routeLength="1996.47" waitingTime="0.00" waitingCount="0" stopTime="0.00" timeLoss="19.36" rerouteNo="1" devices="tripinfo_car_s2w_56 routing_car_s2w_56" vType="Car" speedFactor="1.17" vaporized=""/>
    <tripinfo id="car_w2e_20" depart="21.40" departLane="w2sep_1" departPos="3.60" departPosLat="0.00" departSpeed="13.90" departDelay="1.40" arrival="207.05" arrivalLane="c2e_1" arrivalPos="990.00" arrivalPosLat="0.00" arrivalSpeed="15.16" duration="185.65" routeLength="1997.01" waitingTime="40.30" waitingCount="1" stopTime="0.00" timeLoss="53.90" rerouteNo="1" devices="tripinfo_car_w2e_20 routing_car_w2e_20" vType="Car" speedFactor="1.09" vaporized=""/>
    <tripinfo id="car_s2w_58" depart="58.00" departLane="s2sep_1" departPos="3.60" departPosLat="0.00" departSpeed="13.90" departDelay="0.00" arrival="208.00" arrivalLane="c2w_1" arrivalPos="990.00" arrivalPosLat="0.00" arrivalSpeed="13.90" duration="150.00" routeLength="1996.47" waitingTime="0.00" waitingCount="0" stopTime="0.00" timeLoss="5.68" rerouteNo="1" devices="tripinfo_car_s2w_58 routing_car_s2w_58" vType="Car" speedFactor="1.00" vaporized=""/>
    <tripinfo id="car_w2s_8" depart="8.00" departLane="w2sep_1" departPos="3.60" departPosLat="0.00" departSpeed="13.90" departDelay="0.00" arrival="209.90" arrivalLane="c2s_1" arrivalPos="990.00" arrivalPosLat="0.00" arrivalSpeed="14.04" duration="201.90" routeLength="1986.69" waitingTime="53.05" waitingCount="1" stopTime="0.00" timeLoss="59.72" rerouteNo="1" devices="tripinfo_car_w2s_8 routing_car_w2s_8" vType="Car" speedFactor="1.01" vaporized=""/>
    <tripinfo id="car_e2w_19" depart="19.00" departLane="e2sep_1" departPos="3.60" departPosLat="0.00" departSpeed="13.90" departDelay="0.00" arrival="210.40" arrivalLane="c2w_1" arrivalPos="990.00" arrivalPosLat="0.00" arrivalSpeed="14.81" duration="191.40" routeLength="1997.01" waitingTime="46.30" waitingCount="1" stopTime="0.00" timeLoss="58.68" rerouteNo="1" devices="tripinfo_car_e2w_19 routing_car_e2w_19" vType="Car" speedFactor="1.08" vaporized=""/>
    <tripinfo id="car_e2w_34" depart="34.00" departLane="e2sep_1" departPos="3.60" departPosLat="0.00" departSpeed="13.90" departDelay="0.00" arrival="212.80" arrivalLane="c2w_1" arrivalPos="990.00" arrivalPosLat="0.00" arrivalSpeed="14.93" duration="178.80" routeLength="1997.01" waitingTime="32.45" waitingCount="1" stopTime="0.00" timeLoss="47.04" rerouteNo="1" devices="tripinfo_car_e2w_34 routing_car_e2w_34" vType="Car" speedFactor="1.09" vaporized=""/>
    <tripinfo id="car_w2e_21" depart="23.10" departLane="w2sep_1" departPos="3.60" departPosLat="0.00" departSpeed="13.90" departDelay="2.10" arrival="214.10" arrivalLane="c2e_1" arrivalPos="990.00" arrivalPosLat="0.00" arrivalSpeed="14.27" duration="191.00" routeLength="1997.01" waitingTime="37.55" waitingCount="1" stopTime="0.00" timeLoss="51.01" rerouteNo="1" devices="tripinfo_car_w2e_21 routing_car_w2e_21" vType="Car" speedFactor="1.03" vaporized=""/>
    <tripinfo id="car_e2w_52" depart="52.00" departLane="e2sep_1" departPos="3.60" departPosLat="0.00" departSpeed="13.90" departDelay="0.00" arrival="214.75" arrivalLane="c2w_1" arrivalPos="990.00" arrivalPosLat="0.00" arrivalSpeed="15.46" duration="162.75" routeLength="1997.01" waitingTime="18.85" waitingCount="1" stopTime="0.00" timeLoss="38.30" rerouteNo="1" devices="tripinfo_car_e2w_52 routing_car_e2w_52" vType="Car" speedFactor="1.15" vaporized=""/>
    <tripinfo id="car_w2n_20" depart="20.00" departLane="w2sep_1" departPos="3.60" departPosLat="0.00" departSpeed="13.90" departDelay="0.00" arrival="215.50" arrivalLane="c2n_1" arrivalPos="990.00" arrivalPosLat="0.00" arrivalSpeed="14.32" duration="195.50" routeLength="1996.47" waitingTime="44.20" waitingCount="2" stopTime="0.00" timeLoss="55.42" rerouteNo="1" devices="tripinfo_car_w2n_20 routing_car_w2n_20" vType="Car" speedFactor="1.03" vaporized=""/>
    <tripinfo id="car_w2e_22" depart="24.95" departLane="w2sep_1" departPos="3.60" departPosLat="0.00" departSpeed="13.90" departDelay="2.95" arrival="216.35" arrivalLane="c2e_1" arrivalPos="990.00" arrivalPosLat="0.00" arrivalSpeed="15.27" duration="191.40" routeLength="1997.01" waitingTime="36.75" waitingCount="1" stopTime="0.00" timeLoss="63.44" rerouteNo="1" devices="tripinfo_car_w2e_22 routing_car_w2e_22" vType="Car" speedFactor="1.12" vaporized=""/>
    <tripinfo id="car_w2e_26" depart="26.70" departLane="w2sep_1" departPos="3.60" departPosLat="0.00" departSpeed="13.90" departDelay="0.70" arrival="221.20" arrivalLane="c2e_1" arrivalPos="990.00" arrivalPosLat="0.00" arrivalSpeed="13.90" duration="194.50" routeLength="1997.01" waitingTime="34.15" waitingCount="1" stopTime="0.00" timeLoss="50.84" rerouteNo="1" devices="tripinfo_car_w2e_26 routing_car_w2e_26" vType="Car" speedFactor="1.00" vaporized=""/>
    <tripinfo id="car_w2n_28" depart="28.60" departLane="w2sep_1" departPos="3.60" departPosLat="0.00" departSpeed="13.90" departDelay="0.60" arrival="221.25" arrivalLane="c2n_1" arrivalPos="990.00" arrivalPosLat="0.00" arrivalSpeed="13.90" duration="192.65" routeLength="1996.47" waitingTime="28.35" waitingCount="2" stopTime="0.00" timeLoss="48.30" rerouteNo="1" devices="tripinfo_car_w2n_28 routing_car_w2n_28" vType="Car" speedFactor="1.00" vaporized=""/>
    <tripinfo id="car_w2s_46" depart="46.00" departLane="w2sep_1" departPos="3.60" departPosLat="0.00" departSpeed="13.90" departDelay="0.00" arrival="223.55" arrivalLane="c2s_1" arrivalPos="990.00" arrivalPosLat="0.00" arrivalSpeed="13.90" duration="177.55" routeLength="1986.69" waitingTime="20.85" waitingCount="1" stopTime="0.00" timeLoss="33.89" rerouteNo="1" devices="tripinfo_car_w2s_46 routing_car_w2s_46" vType="Car" speedFactor="1.00" vaporized=""/>
    <tripinfo id="car_w2n_32" depart="32.00" departLane="w2sep_1" departPos="3.60" departPosLat="0.00" departSpeed="13.90" departDelay="0.00" arrival="224.80" arrivalLane="c2n_1" arrivalPos="990.00" arrivalPosLat="0.00" arrivalSpeed="14.01" duration="192.80" routeLength="1996.47" waitingTime="26.15" waitingCount="2" stopTime="0.00" timeLoss="49.90" rerouteNo="1" devices="tripinfo_car_w2n_32 routing_car_w2n_32" vType="Car" speedFactor="1.01" vaporized=""/>
    <tripinfo id="car_w2e_40" depart="40.00" departLane="w2sep_1" departPos="3.60" departPosLat="0.00" departSpeed="13.90" departDelay="0.00" arrival="224.80" arrivalLane="c2e_1" arrivalPos="990.00" arrivalPosLat="0.00" arrivalSpeed="13.87" duration="184.80" routeLength="1997.01" waitingTime="25.10" waitingCount="1" stopTime="0.00" timeLoss="41.11" rerouteNo="1" devices="tripinfo_car_w2e_40 routing_car_w2e_40" vType="Car" speedFactor="1.00" vaporized=""/>
    <tripinfo id="car_w2n_50" depart="50.00" departLane="w2sep_1" departPos="3.60" departPosLat="0.00" departSpeed="13.90" departDelay="0.00" arrival="228.25" arrivalLane="c2n_1" arrivalPos="990.00" arrivalPosLat="0.00" arrivalSpeed="13.87" duration="178.25" routeLength="1996.47" waitingTime="12.20" waitingCount="1" stopTime="0.00" timeLoss="33.90" rerouteNo="1" devices="tripinfo_car_w2n_50 routing_car_w2n_50" vType="Car" speedFactor="1.00" vaporized=""/>
    <tripinfo id="bus_w2e_56" depart="56.00" departLane="w2sep_1" departPos="12.10" departPosLat="0.00" departSpeed="13.90" departDelay="0.00" arrival="228.40" arrivalLane="c2e_1" arrivalPos="990.00" arrivalPosLat="0.00" arrivalSpeed="13.78" duration="172.40" routeLength="1988.51" waitingTime="12.55" waitingCount="1" stopTime="0.00" timeLoss="29.33" rerouteNo="1" devices="tripinfo_bus_w2e_56 routing_bus_w2e_56" vType="Bus" speedFactor="1.00" vaporized=""/>
    <tripinfo id="car_w2n_51" depart="51.50" departLane="w2sep_1" departPos="3.60" departPosLat="0.00" departSpeed="13.90" departDelay="0.50" arrival="230.00" arrivalLane="c2n_1" arrivalPos="990.00" arrivalPosLat="0.00" arrivalSpeed="15.32" duration="178.50" routeLength="1996.47" waitingTime="11.65" waitingCount="1" stopTime="0.00" timeLoss="56.03" rerouteNo="1" devices="tripinfo_car_w2n_51 routing_car_w2n_51" vType="Car" speedFactor="1.18" vaporized=""/>
    <tripinfo id="car_w2e_78" depart="78.00" departLane="w2sep_1" departPos="3.60" departPosLat="0.00" departSpeed="13.90" departDelay="0.00" arrival="230.75" arrivalLane="c2e_1" arrivalPos="990.00" arrivalPosLat="0.00" arrivalSpeed="15.45" duration="152.75" routeLength="1997.01" waitingTime="1.10" waitingCount="1" stopTime="0.00" timeLoss="28.71" rerouteNo="1" devices="tripinfo_car_w2e_78 routing_car_w2e_78" vType="Car" speedFactor="1.16" vaporized=""/>
    <tripinfo id="car_w2n_66" depart="66.00" departLane="w2sep_1" departPos="3.60" departPosLat="0.00" departSpeed="13.90" departDelay="0.00" arrival="232.80" arrivalLane="c2n_1" arrivalPos="990.00" arrivalPosLat="0.00" arrivalSpeed="14.09" duration="166.80" routeLength="1996.47" waitingTime="0.80" waitingCount="1" stopTime="0.00" timeLoss="25.28" rerouteNo="1" devices="tripinfo_car_w2n_66 routing_car_w2n_66" vType="Car" speedFactor="1.02" vaporized=""/>
    <tripinfo id="car_w2e_92" depart="92.00" departLane="w2sep_1" departPos="3.60" departPosLat="0.00" departSpeed="13.90" departDelay="0.00" arrival="233.55" arrivalLane="c2e_1" arrivalPos="990.00" arrivalPosLat="0.00" arrivalSpeed="14.41" duration="141.55" routeLength="1997.01" waitingTime="0.00" waitingCount="0" stopTime="0.00" timeLoss="3.83" rerouteNo="1" devices="tripinfo_car_w2e_92 routing_car_w2e_92" vType="Car" speedFactor="1.04" vaporized=""/>
    <tripinfo id="car_e2s_89" depart="89.00" departLane="e2sep_1" departPos="3.60" departPosLat="0.00" departSpeed="13.90" departDelay="0.00" arrival="234.05" arrivalLane="c2s_1" arrivalPos="990.00" arrivalPosLat="0.00" arrivalSpeed="14.42" duration="145.05" routeLength="1996.47" waitingTime="0.00" waitingCount="0" stopTime="0.00" timeLoss="5.98" rerouteNo="1" devices="tripinfo_car_e2s_89 routing_car_e2s_89" vType="Car" speedFactor="1.04" vaporized=""/>
    <tripinfo id="car_w2n_99" depart="99.00" departLane="w2sep_1" departPos="3.60" departPosLat="0.00" departSpeed="13.90" departDelay="0.00" arrival="236.80" arrivalLane="c2n_1" arrivalPos="990.00" arrivalPosLat="0.00" arrivalSpeed="15.10" duration="137.80" routeLength="1996.47" waitingTime="0.00" waitingCount="0" stopTime="0.00" timeLoss="5.13" rerouteNo="1" devices="tripinfo_car_w2n_99 routing_car_w2n_99" vType="Car" speedFactor="1.09" vaporized=""/>
    <tripinfo id="car_n2w_76" depart="76.00" departLane="n2sep_1" departPos="3.60" departPosLat="0.00" departSpeed="13.90" departDelay="0.00" arrival="245.10" arrivalLane="c2w_1" arrivalPos="990.00" arrivalPosLat="0.00" arrivalSpeed="16.40" duration="169.10" routeLength="1986.69" waitingTime="39.20" waitingCount="1" stopTime="0.00" timeLoss="47.31" rerouteNo="1" devices="tripinfo_car_n2w_76 routing_car_n2w_76" vType="Car" speedFactor="1.18" vaporized=""/>
    <tripinfo id="car_s2e_54" depart="54.00" departLane="s2sep_1" departPos="3.60" departPosLat="0.00" departSpeed="13.90" departDelay="0.00" arrival="255.30" arrivalLane="c2e_1" arrivalPos="990.00" arrivalPosLat="0.00" arrivalSpeed="13.97" duration="201.30" routeLength="1986.69" waitingTime="51.55" waitingCount="1" stopTime="0.00" timeLoss="58.36" rerouteNo="1" devices="tripinfo_car_s2e_54 routing_car_s2e_54" vType="Car" speedFactor="1.01" vaporized=""/>
    <tripinfo id="car_n2w_79" depart="79.00" departLane="n2sep_1" departPos="3.60" departPosLat="0.00" departSpeed="13.90" departDelay="0.00" arrival="256.50" arrivalLane="c2w_1" arrivalPos="990.00" arrivalPosLat="0.00" arrivalSpeed="14.32" duration="177.50" routeLength="1986.69" waitingTime="28.65" waitingCount="1" stopTime="0.00" timeLoss="38.08" rerouteNo="1" devices="tripinfo_car_n2w_79 routing_car_n2w_79" vType="Car" speedFactor="1.03" vaporized=""/>
    <tripinfo id="car_s2n_74" depart="74.00" departLane="s2sep_1" departPos="3.60" departPosLat="0.00" departSpeed="13.90" departDelay="0.00" arrival="257.85" arrivalLane="c2n_1" arrivalPos="990.00" arrivalPosLat="0.00" arrivalSpeed="13.90" duration="183.85" routeLength="1997.01" waitingTime="31.85" waitingCount="1" stopTime="0.00" timeLoss="40.14" rerouteNo="1" devices="tripinfo_car_s2n_74 routing_car_s2n_74" vType="Car" speedFactor="1.00" vaporized=""/>
    <tripinfo id="car_s2n_77" depart="77.00" departLane="s2sep_1" departPos="3.60" departPosLat="0.00" departSpeed="13.90" departDelay="0.00" arrival="260.05" arrivalLane="c2n_1" arrivalPos="990.00" arrivalPosLat="0.00" arrivalSpeed="14.97" duration="183.05" routeLength="1997.01" waitingTime="31.00" waitingCount="1" stopTime="0.00" timeLoss="52.70" rerouteNo="1" devices="tripinfo_car_s2n_77 routing_car_s2n_77" vType="Car" speedFactor="1.10" vaporized=""/>
    <tripinfo id="car_n2w_102" depart="102.00" departLane="n2sep_1" departPos="3.60" departPosLat="0.00" departSpeed="13.90" departDelay="0.00" arrival="261.70" arrivalLane="c2w_1" arrivalPos="990.00" arrivalPosLat="0.00" arrivalSpeed="14.04" duration="159.70" routeLength="1986.69" waitingTime="5.65" waitingCount="1" stopTime="0.00" timeLoss="17.46" rerouteNo="1" devices="tripinfo_car_n2w_102 routing_car_n2w_102" vType="Car" speedFactor="1.01" vaporized=""/>
    <tripinfo id="car_n2s_114" depart="114.00" departLane="n2sep_1" departPos="3.60" departPosLat="0.00" departSpeed="13.90" departDelay="0.00" arrival="262.40" arrivalLane="c2s_1" arrivalPos="990.00" arrivalPosLat="0.00" arrivalSpeed="13.90" duration="148.40" routeLength="1997.01" waitingTime="0.00" waitingCount="0" stopTime="0.00" timeLoss="4.70" rerouteNo="1" devices="tripinfo_car_n2s_114 routing_car_n2s_114" vType="Car" speedFactor="1.00" vaporized=""/>
    <tripinfo id="car_s2w_84" depart="84.00" departLane="s2sep_1" departPos="3.60" departPosLat="0.00" departSpeed="13.90" departDelay="0.00" arrival="265.75" arrivalLane="c2w_1" arrivalPos="990.00" arrivalPosLat="0.00" arrivalSpeed="14.14" duration="181.75" routeLength="1996.47" waitingTime="27.00" waitingCount="2" stopTime="0.00" timeLoss="39.97" rerouteNo="1" devices="tripinfo_car_s2w_84 routing_car_s2w_84" vType="Car" speedFactor="1.02" vaporized=""/>
    <tripinfo id="car_s2e_119" depart="119.00" departLane="s2sep_1" departPos="3.60" departPosLat="0.00" departSpeed="13.90" departDelay="0.00" arrival="266.70" arrivalLane="c2e_1" arrivalPos="990.00" arrivalPosLat="0.00" arrivalSpeed="13.90" duration="147.70" routeLength="1986.69" waitingTime="0.00" waitingCount="0" stopTime="0.00" timeLoss="4.00" rerouteNo="1" devices="tripinfo_car_s2e_119 routing_car_s2e_119" vType="Car" speedFactor="1.00" vaporized=""/>
    <tripinfo id="car_s2w_86" depart="86.00" departLane="s2sep_1" departPos="3.60" departPosLat="0.00" departSpeed="13.90" departDelay="0.00" arrival="268.00" arrivalLane="c2w_1" arrivalPos="990.00" arrivalPosLat="0.00" arrivalSpeed="14.88" duration="182.00" routeLength="1996.47" waitingTime="24.75" waitingCount="2" stopTime="0.00" timeLoss="49.84" rerouteNo="1" devices="tripinfo_car_s2w_86 routing_car_s2w_86" vType="Car" speedFactor="1.09" vaporized=""/>
    <tripinfo id="car_n2e_125" depart="125.00" departLane="n2sep_1" departPos="3.60" departPosLat="0.00" departSpeed="13.90" departDelay="0.00" arrival="272.90" arrivalLane="c2e_1" arrivalPos="990.00" arrivalPosLat="0.00" arrivalSpeed="13.94" duration="147.90" routeLength="1996.47" waitingTime="0.00" waitingCount="0" stopTime="0.00" timeLoss="4.02" rerouteNo="1" devices="tripinfo_car_n2e_125 routing_car_n2e_125" vType="Car" speedFactor="1.00" vaporized=""/>
    <tripinfo id="car_n2w_140" depart="140.00" departLane="n2sep_1" departPos="3.60" departPosLat="0.00" departSpeed="13.90" departDelay="0.00" arrival="273.10" arrivalLane="c2w_1" arrivalPos="990.00" arrivalPosLat="0.00" arrivalSpeed="15.55" duration="133.10" routeLength="1986.69" waitingTime="0.00" waitingCount="0" stopTime="0.00" timeLoss="4.75" rerouteNo="1" devices="tripinfo_car_n2w_140 routing_car_n2w_140" vType="Car" speedFactor="1.12" vaporized=""/>
    <tripinfo id="car_s2n_133" depart="133.00" departLane="s2sep_1" departPos="3.60" departPosLat="0.00" departSpeed="13.90" departDelay="0.00" arrival="277.00" arrivalLane="c2n_1" arrivalPos="990.00" arrivalPosLat="0.00" arrivalSpeed="13.90" duration="144.00" routeLength="1997.01" waitingTime="0.00" waitingCount="0" stopTime="0.00" timeLoss="0.31" rerouteNo="1" devices="tripinfo_car_s2n_133 routing_car_s2n_133" vType="Car" speedFactor="1.00" vaporized=""/>
    <tripinfo id="car_s2e_135" depart="135.00" departLane="s2sep_1" departPos="3.60" departPosLat="0.00" departSpeed="13.90" departDelay="0.00" arrival="282.25" arrivalLane="c2e_1" arrivalPos="990.00" arrivalPosLat="0.00" arrivalSpeed="14.23" duration="147.25" routeLength="1986.69" waitingTime="0.00" waitingCount="0" stopTime="0.00" timeLoss="6.91" rerouteNo="1" devices="tripinfo_car_s2e_135 routing_car_s2e_135" vType="Car" speedFactor="1.02" vaporized=""/>
    <tripinfo id="car_s2e_143" depart="143.00" departLane="s2sep_1" departPos="3.60" departPosLat="0.00" departSpeed="13.90" departDelay="0.00" arrival="284.20" arrivalLane="c2e_1" arrivalPos="990.00" arrivalPosLat="0.00" arrivalSpeed="15.67" duration="141.20" routeLength="1986.69" waitingTime="0.00" waitingCount="0" stopTime="0.00" timeLoss="19.28" rerouteNo="1" devices="tripinfo_car_s2e_143 routing_car_s2e_143" vType="Car" speedFactor="1.18" vaporized=""/>
    <tripinfo id="car_e2n_120" depart="120.00" departLane="e2sep_1" departPos="3.60" departPosLat="0.00" departSpeed="13.90" departDelay="0.00" arrival="290.70" arrivalLane="c2n_1" arrivalPos="990.00" arrivalPosLat="0.00" arrivalSpeed="16.25" duration="170.70" routeLength="1986.69" waitingTime="39.70" waitingCount="1" stopTime="0.00" timeLoss="47.80" rerouteNo="1" devices="tripinfo_car_e2n_120 routing_car_e2n_120" vType="Car" speedFactor="1.17" vaporized=""/>
    <tripinfo id="car_e2w_155" depart="155.00" departLane="e2sep_1" departPos="3.60" departPosLat="0.00" departSpeed="13.90" departDelay="0.00" arrival="294.90" arrivalLane="c2w_1" arrivalPos="990.00" arrivalPosLat="0.00" arrivalSpeed="16.29" duration="139.90" routeLength="1997.01" waitingTime="6.65" waitingCount="1" stopTime="0.00" timeLoss="17.27" rerouteNo="1" devices="tripinfo_car_e2w_155 routing_car_e2w_155" vType="Car" speedFactor="1.17" vaporized=""/>
    <tripinfo id="car_e2n_139" depart="139.00" departLane="e2sep_1" departPos="3.60" departPosLat="0.00" departSpeed="13.90" departDelay="0.00" arrival="298.60" arrivalLane="c2n_1" arrivalPos="990.00" arrivalPosLat="0.00" arrivalSpeed="15.05" duration="159.60" routeLength="1986.69" waitingTime="16.50" waitingCount="1" stopTime="0.00" timeLoss="26.86" rerouteNo="1" devices="tripinfo_car_e2n_139 routing_car_e2n_139" vType="Car" speedFactor="1.08" vaporized=""/>
    <tripinfo id="car_w2s_109" depart="109.00" departLane="w2sep_1" departPos="3.60" departPosLat="0.00" departSpeed="13.90" departDelay="0.00" arrival="300.65" arrivalLane="c2s_1" arrivalPos="990.00" arrivalPosLat="0.00" arrivalSpeed="13.90" duration="191.65" routeLength="1986.69" waitingTime="38.80" waitingCount="1" stopTime="0.00" timeLoss="47.95" rerouteNo="1" devices="tripinfo_car_w2s_109 routing_car_w2s_109" vType="Car" speedFactor="1.00" vaporized=""/>
    <tripinfo id="car_w2s_121" depart="121.00" departLane="w2sep_1" departPos="3.60" departPosLat="0.00" departSpeed="13.90" departDelay="0.00" arrival="304.50" arrivalLane="c2s_1" arrivalPos="990.00" arrivalPosLat="0.00" arrivalSpeed="14.11" duration="183.50" routeLength="1986.69" waitingTime="30.85" waitingCount="1" stopTime="0.00" timeLoss="42.19" rerouteNo="1" devices="tripinfo_car_w2s_121 routing_car_w2s_121" vType="Car" speedFactor="1.02" vaporized=""/>
    <tripinfo id="car_w2s_122" depart="122.45" departLane="w2sep_1" departPos="3.60" departPosLat="0.00" departSpeed="13.90" departDelay="0.45" arrival="306.70" arrivalLane="c2s_1" arrivalPos="990.00" arrivalPosLat="0.00" arrivalSpeed="14.90" duration="184.25" routeLength="1986.69" waitingTime="29.90" waitingCount="1" stopTime="0.00" timeLoss="53.14" rerouteNo="1" devices="tripinfo_car_w2s_122 routing_car_w2s_122" vType="Car" speedFactor="1.10" vaporized=""/>
    <tripinfo id="car_w2n_107" depart="107.00" departLane="w2sep_1" departPos="3.60" departPosLat="0.00" departSpeed="13.90" departDelay="0.00" arrival="308.35" arrivalLane="c2n_1" arrivalPos="990.00" arrivalPosLat="0.00" arrivalSpeed="13.90" duration="201.35" routeLength="1996.47" waitingTime="46.00" waitingCount="2" stopTime="0.00" timeLoss="57.02" rerouteNo="1" devices="tripinfo_car_w2n_107 routing_car_w2n_107" vType="Car" speedFactor="1.00" vaporized=""/>
    <tripinfo id="car_w2s_135" depart="135.00" departLane="w2sep_1" departPos="3.60" departPosLat="0.00" departSpeed="13.90" departDelay="0.00" arrival="308.70" arrivalLane="c2s_1" arrivalPos="990.00" arrivalPosLat="0.00" arrivalSpeed="15.33" duration="173.70" routeLength="1986.69" waitingTime="26.35" waitingCount="1" stopTime="0.00" timeLoss="47.94" rerouteNo="1" devices="tripinfo_car_w2s_135 routing_car_w2s_135" vType="Car" speedFactor="1.14" vaporized=""/>
    <tripinfo id="car_e2w_169" depart="169.00" departLane="e2sep_1" departPos="3.60" departPosLat="0.00" departSpeed="13.90" departDelay="0.00" arrival="310.15" arrivalLane="c2w_1" arrivalPos="990.00" arrivalPosLat="0.00" arrivalSpeed="14.22" duration="141.15" routeLength="1997.01" waitingTime="0.00" waitingCount="0" stopTime="0.00" timeLoss="0.68" rerouteNo="1" devices="tripinfo_car_e2w_169 routing_car_e2w_169" vType="Car" speedFactor="1.02" vaporized=""/>
    <tripinfo id="car_w2s_137" depart="137.00" departLane="w2sep_1" departPos="3.60" departPosLat="0.00" departSpeed="13.90" departDelay="0.00" arrival="310.75" arrivalLane="c2s_1" arrivalPos="990.00" arrivalPosLat="0.00" arrivalSpeed="15.28" duration="173.75" routeLength="1986.69" waitingTime="23.70" waitingCount="1" stopTime="0.00" timeLoss="46.82" rerouteNo="1" devices="tripinfo_car_w2s_137 routing_car_w2s_137" vType="Car" speedFactor="1.13" vaporized=""/>
    <tripinfo id="car_w2n_142" depart="142.00" departLane="w2sep_1" departPos="3.60" departPosLat="0.00" departSpeed="13.90" departDelay="0.00" arrival="314.50" arrivalLane="c2n_1" arrivalPos="990.00" arrivalPosLat="0.00" arrivalSpeed="14.12" duration="172.50" routeLength="1996.47" waitingTime="10.95" waitingCount="3" stopTime="0.00" timeLoss="30.41" rerouteNo="1" devices="tripinfo_car_w2n_142 routing_car_w2n_142" vType="Car" speedFactor="1.02" vaporized=""/>
    <tripinfo id="bus_w2s_139" depart="139.00" departLane="w2sep_1" departPos="12.10" departPosLat="0.00" departSpeed="13.90" departDelay="0.00" arrival="315.90" arrivalLane="c2s_1" arrivalPos="990.00" arrivalPosLat="0.00" arrivalSpeed="13.87" duration="176.90" routeLength="1978.19" waitingTime="17.35" waitingCount="1" stopTime="0.00" timeLoss="33.82" rerouteNo="1" devices="tripinfo_bus_w2s_139 routing_bus_w2s_139" vType="Bus" speedFactor="1.00" vaporized=""/>
    <tripinfo id="car_w2e_143" depart="143.55" departLane="w2sep_1" departPos="3.60" departPosLat="0.00" departSpeed="13.90" departDelay="0.55" arrival="316.25" arrivalLane="c2e_1" arrivalPos="990.00" arrivalPosLat="0.00" arrivalSpeed="13.90" duration="172.70" routeLength="1997.01" waitingTime="11.15" waitingCount="1" stopTime="0.00" timeLoss="29.03" rerouteNo="1" devices="tripinfo_car_w2e_143 routing_car_w2e_143" vType="Car" speedFactor="1.00" vaporized=""/>
    <tripinfo id="car_w2n_148" depart="148.00" departLane="w2sep_1" departPos="3.60" departPosLat="0.00" departSpeed="13.90" departDelay="0.00" arrival="316.45" arrivalLane="c2n_1" arrivalPos="990.00" arrivalPosLat="0.00" arrivalSpeed="15.41" duration="168.45" routeLength="1996.47" waitingTime="4.35" waitingCount="2" stopTime="0.00" timeLoss="43.46" rerouteNo="1" devices="tripinfo_car_w2n_148 routing_car_w2n_148" vType="Car" speedFactor="1.15" vaporized=""/>
    <tripinfo id="car_w2e_157" depart="157.00" departLane="w2sep_1" departPos="3.60" departPosLat="0.00" departSpeed="13.90" departDelay="0.00" arrival="319.35" arrivalLane="c2e_1" arrivalPos="990.00" arrivalPosLat="0.00" arrivalSpeed="14.39" duration="162.35" routeLength="1997.01" waitingTime="4.70" waitingCount="1" stopTime="0.00" timeLoss="24.20" rerouteNo="1" devices="tripinfo_car_w2e_157 routing_car_w2e_157" vType="Car" speedFactor="1.04" vaporized=""/>
    <tripinfo id="car_e2s_130" depart="130.00" departLane="e2sep_1" departPos="3.60" departPosLat="0.00" departSpeed="13.90" departDelay="0.00" arrival="321.85" arrivalLane="c2s_1" arrivalPos="990.00" arrivalPosLat="0.00" arrivalSpeed="13.90" duration="191.85" routeLength="1996.47" waitingTime="35.80" waitingCount="2" stopTime="0.00" timeLoss="47.52" rerouteNo="1" devices="tripinfo_car_e2s_130 routing_car_e2s_130" vType="Car" speedFactor="1.00" vaporized=""/>
    <tripinfo id="car_e2n_176" depart="176.00" departLane="e2sep_1" departPos="3.60" departPosLat="0.00" departSpeed="13.90" departDelay="0.00" arrival="324.95" arrivalLane="c2n_1" arrivalPos="990.00" arrivalPosLat="0.00" arrivalSpeed="13.90" duration="148.95" routeLength="1986.69" waitingTime="0.00" waitingCount="0" stopTime="0.00" timeLoss="5.28" rerouteNo="1" devices="tripinfo_car_e2n_176 routing_car_e2n_176" vType="Car" speedFactor="1.00" vaporized=""/>
    <tripinfo id="car_e2s_172" depart="172.00" departLane="e2sep_1" departPos="3.60" departPosLat="0.00" departSpeed="13.90" departDelay="0.00" arrival="325.80" arrivalLane="c2s_1" arrivalPos="990.00" arrivalPosLat="0.00" arrivalSpeed="13.88" duration="153.80" routeLength="1996.47" waitingTime="0.00" waitingCount="0" stopTime="0.00" timeLoss="9.47" rerouteNo="1" devices="tripinfo_car_e2s_172 routing_car_e2s_172" vType="Car" speedFactor="1.00" vaporized=""/>
    <tripinfo id="car_w2n_182" depart="182.00" departLane="w2sep_1" departPos="3.60" departPosLat="0.00" departSpeed="13.90" departDelay="0.00" arrival="327.15" arrivalLane="c2n_1" arrivalPos="990.00" arrivalPosLat="0.00" arrivalSpeed="14.96" duration="145.15" routeLength="1996.47" waitingTime="0.00" waitingCount="0" stopTime="0.00" timeLoss="14.21" rerouteNo="1" devices="tripinfo_car_w2n_182 routing_car_w2n_182" vType="Car" speedFactor="1.10" vaporized=""/>
    <tripinfo id="car_w2s_187" depart="187.00" departLane="w2sep_1" departPos="3.60" departPosLat="0.00" departSpeed="13.90" departDelay="0.00" arrival="328.00" arrivalLane="c2s_1" arrivalPos="990.00" arrivalPosLat="0.00" arrivalSpeed="14.77" duration="141.00" routeLength="1986.69" waitingTime="0.00" waitingCount="0" stopTime="0.00" timeLoss="8.81" rerouteNo="1" devices="tripinfo_car_w2s_187 routing_car_w2s_187" vType="Car" speedFactor="1.09" vaporized=""/>
    <tripinfo id="car_w2n_191" depart="191.00" departLane="w2sep_1" departPos="3.60" departPosLat="0.00" departSpeed="13.90" departDelay="0.00" arrival="339.05" arrivalLane="c2n_1" arrivalPos="990.00" arrivalPosLat="0.00" arrivalSpeed="13.90" duration="148.05" routeLength="1996.47" waitingTime="0.00" waitingCount="0" stopTime="0.00" timeLoss="3.74" rerouteNo="1" devices="tripinfo_car_w2n_191 routing_car_w2n_191" vType="Car" speedFactor="1.00" vaporized=""/>
    <tripinfo id="car_s2n_172" depart="172.00" departLane="s2sep_1" departPos="3.60" departPosLat="0.00" departSpeed="13.90" departDelay="0.00" arrival="345.00" arrivalLane="c2n_1" arrivalPos="990.00" arrivalPosLat="0.00" arrivalSpeed="14.17" duration="173.00" routeLength="1997.01" waitingTime="24.00" waitingCount="1" stopTime="0.00" timeLoss="32.08" rerouteNo="1" devices="tripinfo_car_s2n_172 routing_car_s2n_172" vType="Car" speedFactor="1.02" vaporized=""/>
    <tripinfo id="car_n2w_150" depart="150.00" departLane="n2sep_1" departPos="3.60" departPosLat="0.00" departSpeed="13.90" departDelay="0.00" arrival="345.25" arrivalLane="c2w_1" arrivalPos="990.00" arrivalPosLat="0.00" arrivalSpeed="13.97" duration="195.25" routeLength="1986.69" waitingTime="45.45" waitingCount="1" stopTime="0.00" timeLoss="52.33" rerouteNo="1" devices="tripinfo_car_n2w_150 routing_car_n2w_150" vType="Car" speedFactor="1.01" vaporized=""/>
    <tripinfo id="car_n2w_177" depart="177.00" departLane="n2sep_1" departPos="3.60" departPosLat="0.00" departSpeed="13.90" departDelay="0.00" arrival="347.10" arrivalLane="c2w_1" arrivalPos="990.00" arrivalPosLat="0.00" arrivalSpeed="15.53" duration="170.10" routeLength="1986.69" waitingTime="29.00" waitingCount="1" stopTime="0.00" timeLoss="48.33" rerouteNo="1" devices="tripinfo_car_n2w_177 routing_car_n2w_177" vType="Car" speedFactor="1.18" vaporized=""/>
    <tripinfo id="car_n2s_177" depart="178.25" departLane="n2sep_1" departPos="3.60" departPosLat="0.00" departSpeed="13.90" departDelay="1.25" arrival="347.90" arrivalLane="c2s_1" arrivalPos="990.00" arrivalPosLat="0.00" arrivalSpeed="14.35" duration="169.65" routeLength="1997.01" waitingTime="20.10" waitingCount="1" stopTime="0.00" timeLoss="30.50" rerouteNo="1" devices="tripinfo_car_n2s_177 routing_car_n2s_177" vType="Car" speedFactor="1.03" vaporized=""/>
    <tripinfo id="car_n2w_184" depart="184.00" departLane="n2sep_1" departPos="3.60" departPosLat="0.00" departSpeed="13.90" departDelay="0.00" arrival="353.00" arrivalLane="c2w_1" arrivalPos="990.00" arrivalPosLat="0.00" arrivalSpeed="14.00" duration="169.00" routeLength="1986.69" waitingTime="14.40" waitingCount="1" stopTime="0.00" timeLoss="26.35" rerouteNo="1" devices="tripinfo_car_n2w_184 routing_car_n2w_184" vType="Car" speedFactor="1.01" vaporized=""/>
    <tripinfo id="car_n2s_187" depart="187.00" departLane="n2sep_1" departPos="3.60" departPosLat="0.00" departSpeed="13.90" departDelay="0.00" arrival="353.10" arrivalLane="c2s_1" arrivalPos="990.00" arrivalPosLat="0.00" arrivalSpeed="14.37" duration="166.10" routeLength="1997.01" waitingTime="12.65" waitingCount="1" stopTime="0.00" timeLoss="27.22" rerouteNo="1" devices="tripinfo_car_n2s_187 routing_car_n2s_187" vType="Car" speedFactor="1.03" vaporized=""/>
    <tripinfo id="car_n2s_203" depart="203.00" departLane="n2sep_1" departPos="3.60" departPosLat="0.00" departSpeed="13.90" departDelay="0.00" arrival="358.20" arrivalLane="c2s_1" arrivalPos="990.00" arrivalPosLat="0.00" arrivalSpeed="13.92" duration="155.20" routeLength="1997.01" waitingTime="0.00" waitingCount="0" stopTime="0.00" timeLoss="11.77" rerouteNo="1" devices="tripinfo_car_n2s_203 routing_car_n2s_203" vType="Car" speedFactor="1.00" vaporized=""/>
    <tripinfo id="car_s2w_165" depart="165.00" departLane="s2sep_1" departPos="3.60" departPosLat="0.00" departSpeed="13.90" departDelay="0.00" arrival="358.40" arrivalLane="c2w_1" arrivalPos="990.00" arrivalPosLat="0.00" arrivalSpeed="14.20" duration="193.40" routeLength="1996.47" waitingTime="40.55" waitingCount="2" stopTime="0.00" timeLoss="52.18" rerouteNo="1" devices="tripinfo_car_s2w_165 routing_car_s2w_165" vType="Car" speedFactor="1.02" vaporized=""/>
    <tripinfo id="car_s2n_214" depart="215.45" departLane="s2sep_1" departPos="3.60" departPosLat="0.00" departSpeed="13.90" departDelay="1.45" arrival="359.65" arrivalLane="c2n_1" arrivalPos="990.00" arrivalPosLat="0.00" arrivalSpeed="14.13" duration="144.20" routeLength="1997.01" waitingTime="0.00" waitingCount="0" stopTime="0.00" timeLoss="2.86" rerouteNo="1" devices="tripinfo_car_s2n_214 routing_car_s2n_214" vType="Car" speedFactor="1.02" vaporized=""/>
    <tripinfo id="car_s2w_173" depart="173.45" departLane="s2sep_1" departPos="3.60" departPosLat="0.00" departSpeed="13.90" departDelay="0.45" arrival="361.45" arrivalLane="c2w_1" arrivalPos="990.00" arrivalPosLat="0.00" arrivalSpeed="14.60" duration="188.00" routeLength="1996.47" waitingTime="30.05" waitingCount="2" stopTime="0.00" timeLoss="51.29" rerouteNo="1" devices="tripinfo_car_s2w_173 routing_car_s2w_173" vType="Car" speedFactor="1.06" vaporized=""/>
    <tripinfo id="car_n2s_223" depart="223.00" departLane="n2sep_1" departPos="3.60" departPosLat="0.00" departSpeed="13.90" departDelay="0.00" arrival="362.90" arrivalLane="c2s_1" arrivalPos="990.00" arrivalPosLat="0.00" arrivalSpeed="14.42" duration="139.90" routeLength="1997.01" waitingTime="0.00" waitingCount="0" stopTime="0.00" timeLoss="1.46" rerouteNo="1" devices="tripinfo_car_n2s_223 routing_car_n2s_223" vType="Car" speedFactor="1.04" vaporized=""/>
    <tripinfo id="car_s2w_207" depart="207.00" departLane="s2sep_1" departPos="3.60" departPosLat="0.00" departSpeed="13.90" departDelay="0.00" arrival="366.15" arrivalLane="c2w_1" arrivalPos="990.00" arrivalPosLat="0.00" arrivalSpeed="14.49" duration="159.15" routeLength="1996.47" waitingTime="4.95" waitingCount="2" stopTime="0.00" timeLoss="20.72" rerouteNo="1" devices="tripinfo_car_s2w_207 routing_car_s2w_207" vType="Car" speedFactor="1.04" vaporized=""/>
    <tripinfo id="car_s2w_214" depart="214.00" departLane="s2sep_1" departPos="3.60" departPosLat="0.00" departSpeed="13.90" departDelay="0.00" arrival="370.70" arrivalLane="c2w_1" arrivalPos="990.00" arrivalPosLat="0.00" arrivalSpeed="14.20" duration="156.70" routeLength="1996.47" waitingTime="0.00" waitingCount="0" stopTime="0.00" timeLoss="15.47" rerouteNo="1" devices="tripinfo_car_s2w_214 routing_car_s2w_214" vType="Car" speedFactor="1.02" vaporized=""/>
    <tripinfo id="car_e2s_201" depart="201.00" departLane="e2sep_1" departPos="3.60" departPosLat="0.00" departSpeed="13.90" departDelay="0.00" arrival="386.65" arrivalLane="c2s_1" arrivalPos="990.00" arrivalPosLat="0.00" arrivalSpeed="15.95" duration="185.65" routeLength="1996.47" waitingTime="42.85" waitingCount="2" stopTime="0.00" timeLoss="59.91" rerouteNo="1" devices="tripinfo_car_e2s_201 routing_car_e2s_201" vType="Car" speedFactor="1.15" vaporized=""/>
    <tripinfo id="car_e2w_255" depart="255.00" departLane="e2sep_1" departPos="3.60" departPosLat="0.00" departSpeed="13.90" departDelay="0.00" arrival="388.05" arrivalLane="c2w_1" arrivalPos="990.00" arrivalPosLat="0.00" arrivalSpeed="15.12" duration="133.05" routeLength="1997.01" waitingTime="0.00" waitingCount="0" stopTime="0.00" timeLoss="0.97" rerouteNo="1" devices="tripinfo_car_e2w_255 routing_car_e2w_255" vType="Car" speedFactor="1.09" vaporized=""/>
    <tripinfo id="car_e2n_198" depart="198.00" departLane="e2sep_1" departPos="3.60" departPosLat="0.00" departSpeed="13.90" departDelay="0.00" arrival="388.55" arrivalLane="c2n_1" arrivalPos="990.00" arrivalPosLat="0.00" arrivalSpeed="14.32" duration="190.55" routeLength="1986.69" waitingTime="44.10" waitingCount="1" stopTime="0.00" timeLoss="51.15" rerouteNo="1" devices="tripinfo_car_e2n_198 routing_car_e2n_198" vType="Car" speedFactor="1.03" vaporized=""/>
    <tripinfo id="car_w2e_192" depart="192.50" departLane="w2sep_1" departPos="3.60" departPosLat="0.00" departSpeed="13.90" departDelay="0.50" arrival="389.55" arrivalLane="c2e_1" arrivalPos="990.00" arrivalPosLat="0.00" arrivalSpeed="14.13" duration="197.05" routeLength="1997.01" waitingTime="45.35" waitingCount="1" stopTime="0.00" timeLoss="55.74" rerouteNo="1" devices="tripinfo_car_w2e_192 routing_car_w2e_192" vType="Car" speedFactor="1.02" vaporized=""/>
    <tripinfo id="car_e2w_256" depart="256.30" departLane="e2sep_1" departPos="3.60" departPosLat="0.00" departSpeed="13.90" departDelay="0.30" arrival="391.40" arrivalLane="c2w_1" arrivalPos="990.00" arrivalPosLat="0.00" arrivalSpeed="15.53" duration="135.10" routeLength="1997.01" waitingTime="0.00" waitingCount="0" stopTime="0.00" timeLoss="6.98" rerouteNo="1" devices="tripinfo_car_e2w_256 routing_car_e2w_256" vType="Car" speedFactor="1.12" vaporized=""/>
    <tripinfo id="car_w2e_245" depart="245.00" departLane="w2sep_1" departPos="3.60" departPosLat="0.00" departSpeed="13.90" departDelay="0.00" arrival="392.05" arrivalLane="c2e_1" arrivalPos="990.00" arrivalPosLat="0.00" arrivalSpeed="14.97" duration="147.05" routeLength="1997.01" waitingTime="1.35" waitingCount="1" stopTime="0.00" timeLoss="15.35" rerouteNo="1" devices="tripinfo_car_w2e_245 routing_car_w2e_245" vType="Car" speedFactor="1.09" vaporized=""/>
    <tripinfo id="car_e2s_218" depart="218.00" departLane="e2sep_1" departPos="3.60" departPosLat="0.00" departSpeed="13.90" departDelay="0.00" arrival="392.95" arrivalLane="c2s_1" arrivalPos="990.00" arrivalPosLat="0.00" arrivalSpeed="15.18" duration="174.95" routeLength="1996.47" waitingTime="28.50" waitingCount="1" stopTime="0.00" timeLoss="42.75" rerouteNo="1" devices="tripinfo_car_e2s_218 routing_car_e2s_218" vType="Car" speedFactor="1.09" vaporized=""/>
    <tripinfo id="car_e2s_238" depart="238.00" departLane="e2sep_1" departPos="3.60" departPosLat="0.00" departSpeed="13.90" departDelay="0.00" arrival="398.60" arrivalLane="c2s_1" arrivalPos="990.00" arrivalPosLat="0.00" arrivalSpeed="14.50" duration="160.60" routeLength="1996.47" waitingTime="6.75" waitingCount="1" stopTime="0.00" timeLoss="22.25" rerouteNo="1" devices="tripinfo_car_e2s_238 routing_car_e2s_238" vType="Car" speedFactor="1.04" vaporized=""/>
    <tripinfo id="car_w2n_202" depart="202.00" departLane="w2sep_1" departPos="3.60" departPosLat="0.00" departSpeed="13.90" departDelay="0.00" arrival="400.10" arrivalLane="c2n_1" arrivalPos="990.00" arrivalPosLat="0.00" arrivalSpeed="13.90" duration="198.10" routeLength="1996.47" waitingTime="42.65" waitingCount="2" stopTime="0.00" timeLoss="53.77" rerouteNo="1" devices="tripinfo_car_w2n_202 routing_car_w2n_202" vType="Car" speedFactor="1.00" vaporized=""/>
    <tripinfo id="car_w2n_213" depart="213.00" departLane="w2sep_1" departPos="3.60" departPosLat="0.00" departSpeed="13.90" departDelay="0.00" arrival="404.15" arrivalLane="c2n_1" arrivalPos="990.00" arrivalPosLat="0.00" arrivalSpeed="13.98" duration="191.15" routeLength="1996.47" waitingTime="32.05" waitingCount="2" stopTime="0.00" timeLoss="47.84" rerouteNo="1" devices="tripinfo_car_w2n_213 routing_car_w2n_213" vType="Car" speedFactor="1.01" vaporized=""/>
    <tripinfo id="amb_w2e_300" depart="300.00" departLane="w2sep_1" departPos="6.60" departPosLat="0.00" departSpeed="13.90" departDelay="0.00" arrival="410.30" arrivalLane="c2e_1" arrivalPos="990.00" arrivalPosLat="-0.95" arrivalSpeed="20.85" duration="110.30" routeLength="1994.01" waitingTime="0.00" waitingCount="0" stopTime="0.00" timeLoss="14.66" rerouteNo="1" devices="tripinfo_amb_w2e_300 routing_amb_w2e_300 bluelight_amb_w2e_300 fcd_amb_w2e_300" vType="Ambulance" speedFactor="1.50" vaporized="">
        <example_device customValue1="0.00" customValue2="-1.00"/>
    </tripinfo>
    <tripinfo id="car_w2e_273" depart="273.00" departLane="w2sep_1" departPos="3.60" departPosLat="0.00" departSpeed="13.90" departDelay="0.00" arrival="416.80" arrivalLane="c2e_1" arrivalPos="990.00" arrivalPosLat="1.10" arrivalSpeed="13.90" duration="143.80" routeLength="1997.01" waitingTime="0.00" waitingCount="0" stopTime="0.00" timeLoss="0.10" rerouteNo="1" devices="tripinfo_car_w2e_273 routing_car_w2e_273" vType="Car@car_w2e_273" speedFactor="1.00" vaporized=""/>
    <tripinfo id="car_w2e_282" depart="282.00" departLane="w2sep_1" departPos="3.60" departPosLat="0.00" departSpeed="13.90" departDelay="0.00" arrival="422.80" arrivalLane="c2e_1" arrivalPos="990.00" arrivalPosLat="1.10" arrivalSpeed="14.80" duration="140.80" routeLength="1997.01" waitingTime="0.00" waitingCount="0" stopTime="0.00" timeLoss="5.85" rerouteNo="1" devices="tripinfo_car_w2e_282 routing_car_w2e_282" vType="Car@car_w2e_282" speedFactor="1.06" vaporized=""/>
    <tripinfo id="car_w2s_275" depart="275.00" departLane="w2sep_1" departPos="3.60" departPosLat="0.00" departSpeed="13.90" departDelay="0.00" arrival="424.50" arrivalLane="c2s_1" arrivalPos="990.00" arrivalPosLat="0.00" arrivalSpeed="13.90" duration="149.50" routeLength="1986.69" waitingTime="0.00" waitingCount="0" stopTime="0.00" timeLoss="5.80" rerouteNo="1" devices="tripinfo_car_w2s_275 routing_car_w2s_275" vType="Car" speedFactor="1.00" vaporized=""/>
    <tripinfo id="car_w2n_277" depart="277.00" departLane="w2sep_1" departPos="3.60" departPosLat="0.00" departSpeed="13.90" departDelay="0.00" arrival="426.95" arrivalLane="c2n_1" arrivalPos="990.00" arrivalPosLat="0.00" arrivalSpeed="14.09" duration="149.95" routeLength="1996.47" waitingTime="0.00" waitingCount="0" stopTime="0.00" timeLoss="7.59" rerouteNo="1" devices="tripinfo_car_w2n_277 routing_car_w2n_277" vType="Car" speedFactor="1.01" vaporized=""/>
    <tripinfo id="car_w2n_303" depart="303.00" departLane="w2sep_1" departPos="3.60" departPosLat="0.00" departSpeed="13.90" departDelay="0.00" arrival="438.55" arrivalLane="c2n_1" arrivalPos="990.00" arrivalPosLat="0.00" arrivalSpeed="15.24" duration="135.55" routeLength="1996.47" waitingTime="0.00" waitingCount="0" stopTime="0.00" timeLoss="3.90" rerouteNo="1" devices="tripinfo_car_w2n_303 routing_car_w2n_303" vType="Car" speedFactor="1.10" vaporized=""/>
    <tripinfo id="car_n2w_258" depart="258.00" departLane="n2sep_1" departPos="3.60" departPosLat="0.00" departSpeed="13.90" departDelay="0.00" arrival="445.10" arrivalLane="c2w_1" arrivalPos="990.00" arrivalPosLat="0.00" arrivalSpeed="15.25" duration="187.10" routeLength="1986.69" waitingTime="48.45" waitingCount="1" stopTime="0.00" timeLoss="56.17" rerouteNo="1" devices="tripinfo_car_n2w_258 routing_car_n2w_258" vType="Car" speedFactor="1.10" vaporized=""/>
    <tripinfo id="car_s2e_246" depart="246.00" departLane="s2sep_1" departPos="3.60" departPosLat="0.00" departSpeed="13.90" departDelay="0.00" arrival="450.60" arrivalLane="c2e_1" arrivalPos="990.00" arrivalPosLat="0.00" arrivalSpeed="14.04" duration="204.60" routeLength="1986.69" waitingTime="55.35" waitingCount="1" stopTime="0.00" timeLoss="62.34" rerouteNo="1" devices="tripinfo_car_s2e_246 routing_car_s2e_246" vType="Car" speedFactor="1.01" vaporized=""/>
    <tripinfo id="car_s2e_276" depart="276.00" departLane="s2sep_1" departPos="3.60" departPosLat="0.00" departSpeed="13.90" departDelay="0.00" arrival="453.30" arrivalLane="c2e_1" arrivalPos="990.00" arrivalPosLat="0.00" arrivalSpeed="14.77" duration="177.30" routeLength="1986.69" waitingTime="30.05" waitingCount="1" stopTime="0.00" timeLoss="43.34" rerouteNo="1" devices="tripinfo_car_s2e_276 routing_car_s2e_276" vType="Car" speedFactor="1.07" vaporized=""/>
    <tripinfo id="car_n2w_268" depart="268.00" departLane="n2sep_1" departPos="3.60" departPosLat="0.00" departSpeed="13.90" departDelay="0.00" arrival="454.45" arrivalLane="c2w_1" arrivalPos="990.00" arrivalPosLat="0.00" arrivalSpeed="13.90" duration="186.45" routeLength="1986.69" waitingTime="31.10" waitingCount="1" stopTime="0.00" timeLoss="42.79" rerouteNo="1" devices="tripinfo_car_n2w_268 routing_car_n2w_268" vType="Car" speedFactor="1.00" vaporized=""/>
    <tripinfo id="car_n2s_310" depart="310.00" departLane="n2sep_1" departPos="3.60" departPosLat="0.00" departSpeed="13.90" departDelay="0.00" arrival="455.15" arrivalLane="c2s_1" arrivalPos="990.00" arrivalPosLat="0.00" arrivalSpeed="13.94" duration="145.15" routeLength="1997.01" waitingTime="0.00" waitingCount="0" stopTime="0.00" timeLoss="1.94" rerouteNo="1" devices="tripinfo_car_n2s_310 routing_car_n2s_310" vType="Car" speedFactor="1.00" vaporized=""/>
    <tripinfo id="car_s2n_286" depart="286.00" departLane="s2sep_1" departPos="3.60" departPosLat="0.00" departSpeed="13.90" departDelay="0.00" arrival="455.80" arrivalLane="c2n_1" arrivalPos="990.00" arrivalPosLat="0.00" arrivalSpeed="13.90" duration="169.80" routeLength="1997.01" waitingTime="16.60" waitingCount="1" stopTime="0.00" timeLoss="26.12" rerouteNo="1" devices="tripinfo_car_s2n_286 routing_car_s2n_286" vType="Car" speedFactor="1.00" vaporized=""/>
    <tripinfo id="car_s2n_287" depart="287.45" departLane="s2sep_1" departPos="3.60" departPosLat="0.00" departSpeed="13.90" departDelay="0.45" arrival="457.65" arrivalLane="c2n_1" arrivalPos="990.00" arrivalPosLat="0.00" arrivalSpeed="15.42" duration="170.20" routeLength="1997.01" waitingTime="16.05" waitingCount="1" stopTime="0.00" timeLoss="47.29" rerouteNo="1" devices="tripinfo_car_s2n_287 routing_car_s2n_287" vType="Car" speedFactor="1.17" vaporized=""/>
    <tripinfo id="car_s2w_315" depart="315.45" departLane="s2sep_1" departPos="3.60" departPosLat="0.00" departSpeed="13.90" departDelay="0.45" arrival="458.10" arrivalLane="c2w_1" arrivalPos="990.00" arrivalPosLat="0.00" arrivalSpeed="15.29" duration="142.65" routeLength="1996.47" waitingTime="0.00" waitingCount="0" stopTime="0.00" timeLoss="11.81" rerouteNo="1" devices="tripinfo_car_s2w_315 routing_car_s2w_315" vType="Car" speedFactor="1.10" vaporized=""/>
    <tripinfo id="car_s2e_296" depart="296.00" departLane="s2sep_1" departPos="3.60" departPosLat="0.00" departSpeed="13.90" departDelay="0.00" arrival="458.50" arrivalLane="c2e_1" arrivalPos="990.00" arrivalPosLat="0.00" arrivalSpeed="15.26" duration="162.50" routeLength="1986.69" waitingTime="13.15" waitingCount="1" stopTime="0.00" timeLoss="31.72" rerouteNo="1" devices="tripinfo_car_s2e_296 routing_car_s2e_296" vType="Car" speedFactor="1.10" vaporized=""/>
    <tripinfo id="bus_s2n_290" depart="290.00" departLane="s2sep_1" departPos="12.10" departPosLat="0.00" departSpeed="13.90" departDelay="0.00" arrival="462.70" arrivalLane="c2n_1" arrivalPos="990.00" arrivalPosLat="0.00" arrivalSpeed="13.87" duration="172.70" routeLength="1988.51" waitingTime="14.60" waitingCount="1" stopTime="0.00" timeLoss="29.65" rerouteNo="1" devices="tripinfo_bus_s2n_290 routing_bus_s2n_290" vType="Bus" speedFactor="1.00" vaporized=""/>
    <tripinfo id="car_s2n_298" depart="298.00" departLane="s2sep_1" departPos="3.60" departPosLat="0.00" departSpeed="13.90" departDelay="0.00" arrival="467.15" arrivalLane="c2n_1" arrivalPos="990.00" arrivalPosLat="0.00" arrivalSpeed="14.01" duration="169.15" routeLength="1997.01" waitingTime="10.25" waitingCount="1" stopTime="0.00" timeLoss="26.77" rerouteNo="1" devices="tripinfo_car_s2n_298 routing_car_s2n_298" vType="Car" speedFactor="1.01" vaporized=""/>
    <tripinfo id="car_s2e_314" depart="314.00" departLane="s2sep_1" departPos="3.60" departPosLat="0.00" departSpeed="13.90" departDelay="0.00" arrival="468.75" arrivalLane="c2e_1" arrivalPos="990.00" arrivalPosLat="0.00" arrivalSpeed="13.90" duration="154.75" routeLength="1986.69" waitingTime="0.00" waitingCount="0" stopTime="0.00" timeLoss="11.06" rerouteNo="1" devices="tripinfo_car_s2e_314 routing_car_s2e_314" vType="Car" speedFactor="1.00" vaporized=""/>
    <tripinfo id="car_n2e_246" depart="246.00" departLane="n2sep_1" departPos="3.60" departPosLat="0.00" departSpeed="13.90" departDelay="0.00" arrival="471.50" arrivalLane="c2e_1" arrivalPos="990.00" arrivalPosLat="0.00" arrivalSpeed="14.57" duration="225.50" routeLength="1996.47" waitingTime="74.45" waitingCount="2" stopTime="0.00" timeLoss="88.96" rerouteNo="1" devices="tripinfo_car_n2e_246 routing_car_n2e_246" vType="Car" speedFactor="1.06" vaporized=""/>
</tripinfos>
