<?xml version="1.0" encoding="UTF-8"?>

<!-- generated on Sat Apr 24 18:17:51 2021 by Eclipse SUMO Version 1.4.0
<configuration xmlns:xsi="http://www.w3.org/2001/XMLSchema-instance" xsi:noNamespaceSchemaLocation="http://sumo.dlr.de/xsd/sumoConfiguration.xsd">

    <input>
        <net-file value="sumofiles/junction.net.xml"/>
        <route-files value="sumofiles/junction_preemption_39.rou.xml"/>
        <additional-files value="sumofiles/junction.det.xml"/>
    </input>

    <output>
        <tripinfo-output value="sumofiles/output/tripinfo_preemption_39.xml"/>
    </output>

    <time>
        <begin value="0"/>
        <end value="10000"/>
        <step-length value="0.05"/>
    </time>

    <processing>
        <lateral-resolution value="0.1"/>
    </processing>

    <report>
        <no-warnings value="true"/>
        <error-log value="sumofiles/output/errorlog_preemption_39.log"/>
        <no-step-log value="true"/>
    </report>

    <traci_server>
        <remote-port value="56341"/>
    </traci_server>

    <gui_only>
        <gui-settings-file value="sumofiles/junction-gui.settings.xml"/>
        <tracker-interval value="0.05"/>
    </gui_only>

</configuration>
-->

<tripinfos xmlns:xsi="http://www.w3.org/2001/XMLSchema-instance" xsi:noNamespaceSchemaLocation="http://sumo.dlr.de/xsd/tripinfo_file.xsd">
    <tripinfo id="car_w2n_1" depart="1.00" departLane="w2sep_1" departPos="3.60" departPosLat="0.00" departSpeed="13.90" departDelay="0.00" arrival="140.70" arrivalLane="c2n_1" arrivalPos="990.00" arrivalPosLat="0.00" arrivalSpeed="14.73" duration="139.70" routeLength="1996.47" waitingTime="0.00" waitingCount="0" stopTime="0.00" timeLoss="3.53" rerouteNo="1" devices="tripinfo_car_w2n_1 routing_car_w2n_1" vType="Car" speedFactor="1.06" vaporized=""/>
    <tripinfo id="car_w2e_5" depart="5.00" departLane="w2sep_1" departPos="3.60" departPosLat="0.00" departSpeed="13.90" departDelay="0.00" arrival="147.80" arrivalLane="c2e_1" arrivalPos="990.00" arrivalPosLat="0.00" arrivalSpeed="14.04" duration="142.80" routeLength="1997.01" waitingTime="0.00" waitingCount="0" stopTime="0.00" timeLoss="0.58" rerouteNo="1" devices="tripinfo_car_w2e_5 routing_car_w2e_5" vType="Car" speedFactor="1.01" vaporized=""/>
    <tripinfo id="car_w2n_7" depart="7.00" departLane="w2sep_1" departPos="3.60" departPosLat="0.00" departSpeed="13.90" departDelay="0.00" arrival="153.70" arrivalLane="c2n_1" arrivalPos="990.00" arrivalPosLat="0.00" arrivalSpeed="14.32" duration="146.70" routeLength="1996.47" waitingTime="0.00" waitingCount="0" stopTime="0.00" timeLoss="6.64" rerouteNo="1" devices="tripinfo_car_w2n_7 routing_car_w2n_7" vType="Car" speedFactor="1.03" vaporized=""/>
    <tripinfo id="car_e2s_7" depart="7.00" departLane="e2sep_1" departPos="3.60" departPosLat="0.00" departSpeed="13.90" departDelay="0.00" arrival="154.55" arrivalLane="c2s_1" arrivalPos="990.00" arrivalPosLat="0.00" arrivalSpeed="13.90" duration="147.55" routeLength="1996.47" waitingTime="0.00" waitingCount="0" stopTime="0.00" timeLoss="3.24" rerouteNo="1" devices="tripinfo_car_e2s_7 routing_car_e2s_7" vType="Car" speedFactor="1.00" vaporized=""/>
    <tripinfo id="car_s2e_6" depart="6.00" departLane="s2sep_1" departPos="3.60" departPosLat="0.00" departSpeed="13.90" departDelay="0.00" arrival="160.40" arrivalLane="c2e_1" arrivalPos="990.00" arrivalPosLat="0.00" arrivalSpeed="15.05" duration="154.40" routeLength="1986.69" waitingTime="14.05" waitingCount="1" stopTime="0.00" timeLoss="21.72" rerouteNo="1" devices="tripinfo_car_s2e_6 routing_car_s2e_6" vType="Car" speedFactor="1.08" vaporized=""/>
    <tripinfo id="car_n2w_2" depart="2.00" departLane="n2sep_1" departPos="3.60" departPosLat="0.00" departSpeed="13.90" departDelay="0.00" arrival="161.70" arrivalLane="c2w_1" arrivalPos="990.00" arrivalPosLat="0.00" arrivalSpeed="14.73" duration="159.70" routeLength="1986.69" waitingTime="16.75" waitingCount="1" stopTime="0.00" timeLoss="24.14" rerouteNo="1" devices="tripinfo_car_n2w_2 routing_car_n2w_2" vType="Car" speedFactor="1.06" vaporized=""/>
    <tripinfo id="car_s2w_11" depart="11.40" departLane="s2sep_1" departPos="3.60" departPosLat="0.00" departSpeed="13.90" departDelay="0.40" arrival="165.20" arrivalLane="c2w_1" arrivalPos="990.00" arrivalPosLat="0.00" arrivalSpeed="15.01" duration="153.80" routeLength="1996.47" waitingTime="4.60" waitingCount="1" stopTime="0.00" timeLoss="20.48" rerouteNo="1" devices="tripinfo_car_s2w_11 routing_car_s2w_11" vType="Car" speedFactor="1.08" vaporized=""/>
    <tripinfo id="car_s2e_10" depart="10.00" departLane="s2sep_1" departPos="3.60" departPosLat="0.00" departSpeed="13.90" departDelay="0.00" arrival="166.35" arrivalLane="c2e_1" arrivalPos="990.00" arrivalPosLat="0.00" arrivalSpeed="14.54" duration="156.35" routeLength="1986.69" waitingTime="8.35" waitingCount="1" stopTime="0.00" timeLoss="18.96" rerouteNo="1" devices="tripinfo_car_s2e_10 routing_car_s2e_10" vType="Car" speedFactor="1.05" vaporized=""/>
    <tripinfo id="bus_s2n_15" depart="15.00" departLane="s2sep_1" departPos="12.10" departPosLat="0.00" departSpeed="13.90" departDelay="0.00" arrival="172.80" arrivalLane="c2n_1" arrivalPos="990.00" arrivalPosLat="0.00" arrivalSpeed="13.90" duration="157.80" routeLength="1988.51" waitingTime="2.05" waitingCount="1" stopTime="0.00" timeLoss="14.71" rerouteNo="1" devices="tripinfo_bus_s2n_15 routing_bus_s2n_15" vType="Bus" speedFactor="1.00" vaporized=""/>
    <tripinfo id="car_n2s_37" depart="37.00" departLane="n2sep_1" departPos="3.60" departPosLat="0.00" departSpeed="13.90" departDelay="0.00" arrival="180.85" arrivalLane="c2s_1" arrivalPos="990.00" arrivalPosLat="0.00" arrivalSpeed="13.90" duration="143.85" routeLength="1997.01" waitingTime="0.00" waitingCount="0" stopTime="0.00" timeLoss="0.15" rerouteNo="1" devices="tripinfo_car_n2s_37 routing_car_n2s_37" vType="Car" speedFactor="1.00" vaporized=""/>
    <tripinfo id="car_s2e_54" depart="54.00" departLane="s2sep_1" departPos="3.60" departPosLat="0.00" departSpeed="13.90" departDelay="0.00" arrival="186.10" arrivalLane="c2e_1" arrivalPos="990.00" arrivalPosLat="0.00" arrivalSpeed="15.61" duration="132.10" routeLength="1986.69" waitingTime="0.00" waitingCount="0" stopTime="0.00" timeLoss="4.16" rerouteNo="1" devices="tripinfo_car_s2e_54 routing_car_s2e_54" vType="Car" speedFactor="1.12" vaporized=""/>
    <tripinfo id="car_n2s_39" depart="39.00" departLane="n2sep_1" departPos="3.60" departPosLat="0.00" departSpeed="13.90" departDelay="0.00" arrival="186.25" arrivalLane="c2s_1" arrivalPos="990.00" arrivalPosLat="0.00" arrivalSpeed="13.90" duration="147.25" routeLength="1997.01" waitingTime="0.00" waitingCount="0" stopTime="0.00" timeLoss="3.57" rerouteNo="1" devices="tripinfo_car_n2s_39 routing_car_n2s_39" vType="Car" speedFactor="1.00" vaporized=""/>
    <tripinfo id="car_n2s_50" depart="50.00" departLane="n2sep_1" departPos="3.60" departPosLat="0.00" departSpeed="13.90" departDelay="0.00" arrival="189.65" arrivalLane="c2s_1" arrivalPos="990.00" arrivalPosLat="0.00" arrivalSpeed="15.10" duration="139.65" routeLength="1997.01" waitingTime="0.00" waitingCount="0" stopTime="0.00" timeLoss="7.91" rerouteNo="1" devices="tripinfo_car_n2s_50 routing_car_n2s_50" vType="Car" speedFactor="1.09" vaporized=""/>
    <tripinfo id="car_n2w_43" depart="43.00" departLane="n2sep_1" departPos="3.60" departPosLat="0.00" departSpeed="13.90" departDelay="0.00" arrival="190.40" arrivalLane="c2w_1" arrivalPos="990.00" arrivalPosLat="0.00" arrivalSpeed="14.15" duration="147.40" routeLength="1986.69" waitingTime="0.00" waitingCount="0" stopTime="0.00" timeLoss="6.32" rerouteNo="1" devices="tripinfo_car_n2w_43 routing_car_n2w_43" vType="Car" speedFactor="1.02" vaporized=""/>
    <tripinfo id="bus_n2e_46" depart="46.00" departLane="n2sep_1" departPos="12.10" departPosLat="0.00" departSpeed="13.90" departDelay="0.00" arrival="197.75" arrivalLane="c2e_1" arrivalPos="990.00" arrivalPosLat="0.00" arrivalSpeed="13.90" duration="151.75" routeLength="1987.97" waitingTime="0.00" waitingCount="0" stopTime="0.00" timeLoss="8.05" rerouteNo="1" devices="tripinfo_bus_n2e_46 routing_bus_n2e_46" vType="Bus" speedFactor="1.00" vaporized=""/>
    <tripinfo id="car_e2n_16" depart="16.00" departLane="e2sep_1" departPos="3.60" departPosLat="0.00" departSpeed="13.90" departDelay="0.00" arrival="204.85" arrivalLane="c2n_1" arrivalPos="990.00" arrivalPosLat="0.00" arrivalSpeed="15.16" duration="188.85" routeLength="1986.69" waitingTime="49.20" waitingCount="1" stopTime="0.00" timeLoss="57.13" rerouteNo="1" devices="tripinfo_car_e2n_16 routing_car_e2n_16" vType="Car" speedFactor="1.09" vaporized=""/>
    <tripinfo id="car_s2w_57" depart="57.00" departLane="s2sep_1" departPos="3.60" departPosLat="0.00" departSpeed="13.90" departDelay="0.00" arrival="204.95" arrivalLane="c2w_1" arrivalPos="990.00" arrivalPosLat="0.00" arrivalSpeed="13.90" duration="147.95" routeLength="1996.47" waitingTime="0.00" waitingCount="0" stopTime="0.00" timeLoss="3.63" rerouteNo="1" devices="tripinfo_car_s2w_57 routing_car_s2w_57" vType="Car" speedFactor="1.00" vaporized=""/>
    <tripinfo id="car_w2s_26" depart="26.00" departLane="w2sep_1" departPos="3.60" departPosLat="0.00" departSpeed="13.90" departDelay="0.00" arrival="207.55" arrivalLane="c2s_1" arrivalPos="990.00" arrivalPosLat="0.00" arrivalSpeed="15.61" duration="181.55" routeLength="1986.69" waitingTime="36.25" waitingCount="1" stopTime="0.00" timeLoss="53.63" rerouteNo="1" devices="tripinfo_car_w2s_26 routing_car_w2s_26" vType="Car" speedFactor="1.12" vaporized=""/>
    <tripinfo id="car_w2e_11" depart="11.00" departLane="w2sep_1" departPos="3.60" departPosLat="0.00" departSpeed="13.90" departDelay="0.00" arrival="210.15" arrivalLane="c2e_1" arrivalPos="990.00" arrivalPosLat="0.00" arrivalSpeed="14.04" duration="199.15" routeLength="1997.01" waitingTime="48.15" waitingCount="1" stopTime="0.00" timeLoss="56.92" rerouteNo="1" devices="tripinfo_car_w2e_11 routing_car_w2e_11" vType="Car" speedFactor="1.01" vaporized=""/>
    <tripinfo id="car_e2n_20" depart="20.00" departLane="e2sep_1" departPos="3.60" departPosLat="0.00" departSpeed="13.90" departDelay="0.00" arrival="212.25" arrivalLane="c2n_1" arrivalPos="990.00" arrivalPosLat="0.00" arrivalSpeed="14.27" duration="192.25" routeLength="1986.69" waitingTime="42.25" waitingCount="1" stopTime="0.00" timeLoss="52.28" rerouteNo="1" devices="tripinfo_car_e2n_20 routing_car_e2n_20" vType="Car" speedFactor="1.03" vaporized=""/>
    <tripinfo id="car_e2w_22" depart="22.00" departLane="e2sep_1" departPos="3.60" departPosLat="0.00" departSpeed="13.90" departDelay="0.00" arrival="212.30" arrivalLane="c2w_1" arrivalPos="990.00" arrivalPosLat="0.00" arrivalSpeed="14.55" duration="190.30" routeLength="1997.01" waitingTime="40.35" waitingCount="1" stopTime="0.00" timeLoss="53.07" rerouteNo="1" devices="tripinfo_car_e2w_22 routing_car_e2w_22" vType="Car" speedFactor="1.05" vaporized=""/>
    <tripinfo id="car_w2e_15" depart="15.00" departLane="w2sep_1" departPos="3.60" departPosLat="0.00" departSpeed="13.90" departDelay="0.00" arrival="213.75" arrivalLane="c2e_1" arrivalPos="990.00" arrivalPosLat="0.00" arrivalSpeed="14.29" duration="198.75" routeLength="1997.01" waitingTime="45.90" waitingCount="1" stopTime="0.00" timeLoss="59.27" rerouteNo="1" devices="tripinfo_car_w2e_15 routing_car_w2e_15" vType="Car" speedFactor="1.03" vaporized=""/>
    <tripinfo id="car_e2w_42" depart="42.00" departLane="e2sep_1" departPos="3.60" departPosLat="0.00" departSpeed="13.90" departDelay="0.00" arrival="214.45" arrivalLane="c2w_1" arrivalPos="990.00" arrivalPosLat="0.00" arrivalSpeed="15.66" duration="172.45" routeLength="1997.01" waitingTime="23.05" waitingCount="1" stopTime="0.00" timeLoss="48.38" rerouteNo="1" devices="tripinfo_car_e2w_42 routing_car_e2w_42" vType="Car" speedFactor="1.16" vaporized=""/>
    <tripinfo id="car_e2s_32" depart="32.00" departLane="e2sep_1" departPos="3.60" departPosLat="0.00" departSpeed="13.90" departDelay="0.00" arrival="218.65" arrivalLane="c2s_1" arrivalPos="990.00" arrivalPosLat="0.00" arrivalSpeed="13.90" duration="186.65" routeLength="1996.47" waitingTime="31.00" waitingCount="2" stopTime="0.00" timeLoss="42.34" rerouteNo="1" devices="tripinfo_car_e2s_32 routing_car_e2s_32" vType="Car" speedFactor="1.00" vaporized=""/>
    <tripinfo id="car_e2w_67" depart="67.00" departLane="e2sep_1" departPos="3.60" departPosLat="0.00" departSpeed="13.90" departDelay="0.00" arrival="220.55" arrivalLane="c2w_1" arrivalPos="990.00" arrivalPosLat="0.00" arrivalSpeed="13.90" duration="153.55" routeLength="1997.01" waitingTime="0.00" waitingCount="0" stopTime="0.00" timeLoss="9.87" rerouteNo="1" devices="tripinfo_car_e2w_67 routing_car_e2w_67" vType="Car" speedFactor="1.00" vaporized=""/>
    <tripinfo id="car_e2s_33" depart="33.45" departLane="e2sep_1" departPos="3.60" departPosLat="0.00" departSpeed="13.90" departDelay="0.45" arrival="221.60" arrivalLane="c2s_1" arrivalPos="990.00" arrivalPosLat="0.00" arrivalSpeed="14.45" duration="188.15" routeLength="1996.47" waitingTime="28.45" waitingCount="2" stopTime="0.00" timeLoss="50.14" rerouteNo="1" devices="tripinfo_car_e2s_33 routing_car_e2s_33" vType="Car" speedFactor="1.05" vaporized=""/>
    <tripinfo id="car_e2w_73" depart="73.00" departLane="e2sep_1" departPos="3.60" departPosLat="0.00" departSpeed="13.90" departDelay="0.00" arrival="222.40" arrivalLane="c2w_1" arrivalPos="990.00" arrivalPosLat="0.00" arrivalSpeed="15.43" duration="149.40" routeLength="1997.01" waitingTime="0.00" waitingCount="0" stopTime="0.00" timeLoss="26.77" rerouteNo="1" devices="tripinfo_car_e2w_73 routing_car_e2w_73" vType="Car" speedFactor="1.17" vaporized=""/>
    <tripinfo id="car_e2n_76" depart="76.00" departLane="e2sep_1" departPos="3.60" departPosLat="0.00" departSpeed="13.90" departDelay="0.00" arrival="222.45" arrivalLane="c2n_1" arrivalPos="990.00" arrivalPosLat="0.00" arrivalSpeed="14.17" duration="146.45" routeLength="1986.69" waitingTime="0.00" waitingCount="0" stopTime="0.00" timeLoss="5.56" rerouteNo="1" devices="tripinfo_car_e2n_76 routing_car_e2n_76" vType="Car" speedFactor="1.02" vaporized=""/>
    <tripinfo id="car_e2s_36" depart="36.00" departLane="e2sep_1" departPos="3.60" departPosLat="0.00" departSpeed="13.90" departDelay="0.00" arrival="225.70" arrivalLane="c2s_1" arrivalPos="990.00" arrivalPosLat="0.00" arrivalSpeed="13.89" duration="189.70" routeLength="1996.47" waitingTime="23.45" waitingCount="1" stopTime="0.00" timeLoss="45.36" rerouteNo="1" devices="tripinfo_car_e2s_36 routing_car_e2s_36" vType="Car" speedFactor="1.00" vaporized=""/>
    <tripinfo id="car_e2s_52" depart="52.00" departLane="e2sep_1" departPos="3.60" departPosLat="0.00" departSpeed="13.90" departDelay="0.00" arrival="228.55" arrivalLane="c2s_1" arrivalPos="990.00" arrivalPosLat="0.00" arrivalSpeed="14.17" duration="176.55" routeLength="1996.47" waitingTime="12.90" waitingCount="1" stopTime="0.00" timeLoss="35.91" rerouteNo="1" devices="tripinfo_car_e2s_52 routing_car_e2s_52" vType="Car" speedFactor="1.03" vaporized=""/>
    <tripinfo id="bus_w2n_24" depart="24.00" departLane="w2sep_1" departPos="12.10" departPosLat="0.00" departSpeed="13.90" departDelay="0.00" arrival="230.65" arrivalLane="c2n_1" arrivalPos="990.00" arrivalPosLat="0.00" arrivalSpeed="13.90" duration="206.65" routeLength="1987.97" waitingTime="47.60" waitingCount="2" stopTime="0.00" timeLoss="62.93" rerouteNo="1" devices="tripinfo_bus_w2n_24 routing_bus_w2n_24" vType="Bus" speedFactor="1.00" vaporized=""/>
    <tripinfo id="car_e2w_98" depart="98.00" departLane="e2sep_1" departPos="3.60" departPosLat="0.00" departSpeed="13.90" departDelay="0.00" arrival="233.30" arrivalLane="c2w_1" arrivalPos="990.00" arrivalPosLat="0.00" arrivalSpeed="15.18" duration="135.30" routeLength="1997.01" waitingTime="0.00" waitingCount="0" stopTime="0.00" timeLoss="3.70" rerouteNo="1" devices="tripinfo_car_e2w_98 routing_car_e2w_98" vType="Car" speedFactor="1.09" vaporized=""/>
    <tripinfo id="bus_w2s_85" depart="85.00" departLane="w2sep_1" departPos="12.10" departPosLat="0.00" departSpeed="13.90" departDelay="0.00" arrival="234.75" arrivalLane="c2s_1" arrivalPos="990.00" arrivalPosLat="0.00" arrivalSpeed="13.88" duration="149.75" routeLength="1978.19" waitingTime="0.00" waitingCount="0" stopTime="0.00" timeLoss="6.69" rerouteNo="1" devices="tripinfo_bus_w2s_85 routing_bus_w2s_85" vType="Bus" speedFactor="1.00" vaporized=""/>
    <tripinfo id="car_w2n_50" depart="50.00" departLane="w2sep_1" departPos="3.60" departPosLat="0.00" departSpeed="13.90" departDelay="0.00" arrival="235.00" arrivalLane="c2n_1" arrivalPos="990.00" arrivalPosLat="0.00" arrivalSpeed="14.03" duration="185.00" routeLength="1996.47" waitingTime="22.30" waitingCount="2" stopTime="0.00" timeLoss="42.11" rerouteNo="1" devices="tripinfo_car_w2n_50 routing_car_w2n_50" vType="Car" speedFactor="1.01" vaporized=""/>
    <tripinfo id="car_e2s_54" depart="54.00" departLane="e2sep_1" departPos="3.60" departPosLat="0.00" departSpeed="13.90" departDelay="0.00" arrival="238.15" arrivalLane="c2s_1" arrivalPos="990.00" arrivalPosLat="0.00" arrivalSpeed="14.48" duration="184.15" routeLength="1996.47" waitingTime="17.05" waitingCount="2" stopTime="0.00" timeLoss="46.28" rerouteNo="1" devices="tripinfo_car_e2s_54 routing_car_e2s_54" vType="Car" speedFactor="1.05" vaporized=""/>
    <tripinfo id="car_e2n_92" depart="92.00" departLane="e2sep_1" departPos="3.60" departPosLat="0.00" departSpeed="13.90" departDelay="0.00" arrival="238.15" arrivalLane="c2n_1" arrivalPos="990.00" arrivalPosLat="0.00" arrivalSpeed="14.26" duration="146.15" routeLength="1986.69" waitingTime="0.00" waitingCount="0" stopTime="0.00" timeLoss="6.70" rerouteNo="1" devices="tripinfo_car_e2n_92 routing_car_e2n_92" vType="Car" speedFactor="1.03" vaporized=""/>
    <tripinfo id="car_e2s_56" depart="56.00" departLane="e2sep_1" departPos="3.60" departPosLat="0.00" departSpeed="13.90" departDelay="0.00" arrival="242.15" arrivalLane="c2s_1" arrivalPos="990.00" arrivalPosLat="0.00" arrivalSpeed="13.89" duration="186.15" routeLength="1996.47" waitingTime="12.85" waitingCount="2" stopTime="0.00" timeLoss="41.80" rerouteNo="1" devices="tripinfo_car_e2s_56 routing_car_e2s_56" vType="Car" speedFactor="1.00" vaporized=""/>
    <tripinfo id="car_w2n_79" depart="79.00" departLane="w2sep_1" departPos="3.60" departPosLat="0.00" departSpeed="13.90" departDelay="0.00" arrival="243.30" arrivalLane="c2n_1" arrivalPos="990.00" arrivalPosLat="0.00" arrivalSpeed="13.90" duration="164.30" routeLength="1996.47" waitingTime="5.10" waitingCount="1" stopTime="0.00" timeLoss="19.97" rerouteNo="1" devices="tripinfo_car_w2n_79 routing_car_w2n_79" vType="Car" speedFactor="1.00" vaporized=""/>
    <tripinfo id="car_e2s_90" depart="90.00" departLane="e2sep_1" departPos="3.60" departPosLat="0.00" departSpeed="13.90" departDelay="0.00" arrival="244.00" arrivalLane="c2s_1" arrivalPos="990.00" arrivalPosLat="0.00" arrivalSpeed="15.27" duration="154.00" routeLength="1996.47" waitingTime="2.95" waitingCount="1" stopTime="0.00" timeLoss="29.37" rerouteNo="1" devices="tripinfo_car_e2s_90 routing_car_e2s_90" vType="Car" speedFactor="1.16" vaporized=""/>
    <tripinfo id="car_w2n_104" depart="104.00" departLane="w2sep_1" departPos="3.60" departPosLat="0.00" departSpeed="13.90" departDelay="0.00" arrival="247.10" arrivalLane="c2n_1" arrivalPos="990.00" arrivalPosLat="0.00" arrivalSpeed="14.48" duration="143.10" routeLength="1996.47" waitingTime="0.00" waitingCount="0" stopTime="0.00" timeLoss="4.79" rerouteNo="1" devices="tripinfo_car_w2n_104 routing_car_w2n_104" vType="Car" speedFactor="1.04" vaporized=""/>
    <tripinfo id="car_n2w_68" depart="68.00" departLane="n2sep_1" departPos="3.60" departPosLat="0.00" departSpeed="13.90" departDelay="0.00" arrival="247.50" arrivalLane="c2w_1" arrivalPos="990.00" arrivalPosLat="0.00" arrivalSpeed="16.38" duration="179.50" routeLength="1986.69" waitingTime="47.65" waitingCount="1" stopTime="0.00" timeLoss="57.59" rerouteNo="1" devices="tripinfo_car_n2w_68 routing_car_n2w_68" vType="Car" speedFactor="1.18" vaporized=""/>
    <tripinfo id="car_n2s_61" depart="61.00" departLane="n2sep_1" departPos="3.60" departPosLat="0.00" departSpeed="13.90" departDelay="0.00" arrival="248.30" arrivalLane="c2s_1" arrivalPos="990.00" arrivalPosLat="0.00" arrivalSpeed="15.71" duration="187.30" routeLength="1997.01" waitingTime="51.65" waitingCount="1" stopTime="0.00" timeLoss="60.35" rerouteNo="1" devices="tripinfo_car_n2s_61 routing_car_n2s_61" vType="Car" speedFactor="1.13" vaporized=""/>
    <tripinfo id="car_n2s_71" depart="71.00" departLane="n2sep_1" departPos="3.60" departPosLat="0.00" departSpeed="13.90" departDelay="0.00" arrival="252.00" arrivalLane="c2s_1" arrivalPos="990.00" arrivalPosLat="0.00" arrivalSpeed="16.01" duration="181.00" routeLength="1997.01" waitingTime="44.05" waitingCount="1" stopTime="0.00" timeLoss="56.52" rerouteNo="1" devices="tripinfo_car_n2s_71 routing_car_n2s_71" vType="Car" speedFactor="1.15" vaporized=""/>
    <tripinfo id="car_s2w_86" depart="86.00" departLane="s2sep_1" departPos="3.60" departPosLat="0.00" departSpeed="13.90" departDelay="0.00" arrival="254.50" arrivalLane="c2w_1" arrivalPos="990.00" arrivalPosLat="0.00" arrivalSpeed="16.40" duration="168.50" routeLength="1996.47" waitingTime="32.45" waitingCount="2" stopTime="0.00" timeLoss="46.16" rerouteNo="1" devices="tripinfo_car_s2w_86 routing_car_s2w_86" vType="Car" speedFactor="1.18" vaporized=""/>
    <tripinfo id="car_s2e_75" depart="75.00" departLane="s2sep_1" departPos="3.60" departPosLat="0.00" departSpeed="13.90" departDelay="0.00" arrival="255.65" arrivalLane="c2e_1" arrivalPos="990.00" arrivalPosLat="0.00" arrivalSpeed="13.90" duration="180.65" routeLength="1986.69" waitingTime="29.95" waitingCount="1" stopTime="0.00" timeLoss="36.95" rerouteNo="1" devices="tripinfo_car_s2e_75 routing_car_s2e_75" vType="Car" speedFactor="1.00" vaporized=""/>
    <tripinfo id="car_s2e_88" depart="89.25" departLane="s2sep_1" departPos="3.60" departPosLat="0.00" departSpeed="13.90" departDelay="1.25" arrival="257.85" arrivalLane="c2e_1" arrivalPos="990.00" arrivalPosLat="0.00" arrivalSpeed="14.97" duration="168.60" routeLength="1986.69" waitingTime="15.85" waitingCount="1" stopTime="0.00" timeLoss="38.28" rerouteNo="1" devices="tripinfo_car_s2e_88 routing_car_s2e_88" vType="Car" speedFactor="1.10" vaporized=""/>
    <tripinfo id="car_s2n_96" depart="96.00" departLane="s2sep_1" departPos="3.60" departPosLat="0.00" departSpeed="13.90" departDelay="0.00" arrival="259.00" arrivalLane="c2n_1" arrivalPos="990.00" arrivalPosLat="0.00" arrivalSpeed="14.15" duration="163.00" routeLength="1997.01" waitingTime="11.70" waitingCount="1" stopTime="0.00" timeLoss="21.85" rerouteNo="1" devices="tripinfo_car_s2n_96 routing_car_s2n_96" vType="Car" speedFactor="1.02" vaporized=""/>
    <tripinfo id="car_n2s_73" depart="73.00" departLane="n2sep_1" departPos="3.60" departPosLat="0.00" departSpeed="13.90" departDelay="0.00" arrival="262.00" arrivalLane="c2s_1" arrivalPos="990.00" arrivalPosLat="0.00" arrivalSpeed="13.97" duration="189.00" routeLength="1997.01" waitingTime="35.00" waitingCount="1" stopTime="0.00" timeLoss="46.04" rerouteNo="1" devices="tripinfo_car_n2s_73 routing_car_n2s_73" vType="Car" speedFactor="1.01" vaporized=""/>
    <tripinfo id="car_n2w_126" depart="126.00" departLane="n2sep_1" departPos="3.60" departPosLat="0.00" departSpeed="13.90" departDelay="0.00" arrival="263.15" arrivalLane="c2w_1" arrivalPos="990.00" arrivalPosLat="0.00" arrivalSpeed="15.88" duration="137.15" routeLength="1986.69" waitingTime="0.00" waitingCount="0" stopTime="0.00" timeLoss="11.40" rerouteNo="1" devices="tripinfo_car_n2w_126 routing_car_n2w_126" vType="Car" speedFactor="1.14" vaporized=""/>
    <tripinfo id="car_s2n_104" depart="104.00" departLane="s2sep_1" departPos="3.60" departPosLat="0.00" departSpeed="13.90" departDelay="0.00" arrival="263.55" arrivalLane="c2n_1" arrivalPos="990.00" arrivalPosLat="0.00" arrivalSpeed="14.03" duration="159.55" routeLength="1997.01" waitingTime="4.75" waitingCount="1" stopTime="0.00" timeLoss="17.33" rerouteNo="1" devices="tripinfo_car_s2n_104 routing_car_s2n_104" vType="Car" speedFactor="1.01" vaporized=""/>
    <tripinfo id="car_s2e_105" depart="105.45" departLane="s2sep_1" departPos="3.60" departPosLat="0.00" departSpeed="13.90" departDelay="0.45" arrival="265.15" arrivalLane="c2e_1" arrivalPos="990.00" arrivalPosLat="0.00" arrivalSpeed="13.90" duration="159.70" routeLength="1986.69" waitingTime="1.90" waitingCount="1" stopTime="0.00" timeLoss="16.01" rerouteNo="1" devices="tripinfo_car_s2e_105 routing_car_s2e_105" vType="Car" speedFactor="1.00" vaporized=""/>
    <tripinfo id="car_s2e_117" depart="117.00" departLane="s2sep_1" departPos="3.60" departPosLat="0.00" departSpeed="13.90" departDelay="0.00" arrival="267.40" arrivalLane="c2e_1" arrivalPos="990.00" arrivalPosLat="0.00" arrivalSpeed="14.91" duration="150.40" routeLength="1986.69" waitingTime="0.00" waitingCount="0" stopTime="0.00" timeLoss="19.28" rerouteNo="1" devices="tripinfo_car_s2e_117 routing_car_s2e_117" vType="Car" speedFactor="1.10" vaporized=""/>
    <tripinfo id="car_n2e_103" depart="103.00" departLane="n2sep_1" departPos="3.60" departPosLat="0.00" departSpeed="13.90" departDelay="0.00" arrival="270.50" arrivalLane="c2e_1" arrivalPos="990.00" arrivalPosLat="0.00" arrivalSpeed="14.37" duration="167.50" routeLength="1996.47" waitingTime="13.00" waitingCount="3" stopTime="0.00" timeLoss="28.43" rerouteNo="1" devices="tripinfo_car_n2e_103 routing_car_n2e_103" vType="Car" speedFactor="1.04" vaporized=""/>
    <tripinfo id="car_n2w_133" depart="133.00" departLane="n2sep_1" departPos="3.60" departPosLat="0.00" departSpeed="13.90" departDelay="0.00" arrival="272.50" arrivalLane="c2w_1" arrivalPos="990.00" arrivalPosLat="0.00" arrivalSpeed="15.56" duration="139.50" routeLength="1986.69" waitingTime="0.00" waitingCount="0" stopTime="0.00" timeLoss="11.17" rerouteNo="1" devices="tripinfo_car_n2w_133 routing_car_n2w_133" vType="Car" speedFactor="1.12" vaporized=""/>
    <tripinfo id="car_n2e_119" depart="119.00" departLane="n2sep_1" departPos="3.60" departPosLat="0.00" departSpeed="13.90" departDelay="0.00" arrival="274.35" arrivalLane="c2e_1" arrivalPos="990.00" arrivalPosLat="0.00" arrivalSpeed="13.93" duration="155.35" routeLength="1996.47" waitingTime="0.00" waitingCount="0" stopTime="0.00" timeLoss="11.50" rerouteNo="1" devices="tripinfo_car_n2e_119 routing_car_n2e_119" vType="Car" speedFactor="1.00" vaporized=""/>
    <tripinfo id="car_n2e_120" depart="120.45" departLane="n2sep_1" departPos="3.60" departPosLat="0.00" departSpeed="13.90" departDelay="0.45" arrival="277.80" arrivalLane="c2e_1" arrivalPos="990.00" arrivalPosLat="0.00" arrivalSpeed="13.87" duration="157.35" routeLength="1996.47" waitingTime="0.00" waitingCount="0" stopTime="0.00" timeLoss="13.01" rerouteNo="1" devices="tripinfo_car_n2e_120 routing_car_n2e_120" vType="Car" speedFactor="1.00" vaporized=""/>
    <tripinfo id="car_n2e_128" depart="128.00" departLane="n2sep_1" departPos="3.60" departPosLat="0.00" departSpeed="13.90" departDelay="0.00" arrival="280.45" arrivalLane="c2e_1" arrivalPos="990.00" arrivalPosLat="0.00" arrivalSpeed="14.11" duration="152.45" routeLength="1996.47" waitingTime="0.00" waitingCount="0" stopTime="0.00" timeLoss="11.46" rerouteNo="1" devices="tripinfo_car_n2e_128 routing_car_n2e_128" vType="Car" speedFactor="1.02" vaporized=""/>
    <tripinfo id="car_n2s_138" depart="138.00" departLane="n2sep_1" departPos="3.60" departPosLat="0.00" departSpeed="13.90" departDelay="0.00" arrival="281.05" arrivalLane="c2s_1" arrivalPos="990.00" arrivalPosLat="0.00" arrivalSpeed="14.12" duration="143.05" routeLength="1997.01" waitingTime="0.00" waitingCount="0" stopTime="0.00" timeLoss="1.57" rerouteNo="1" devices="tripinfo_car_n2s_138 routing_car_n2s_138" vType="Car" speedFactor="1.02" vaporized=""/>
    <tripinfo id="car_n2e_130" depart="130.00" departLane="n2sep_1" departPos="3.60" departPosLat="0.00" departSpeed="13.90" departDelay="0.00" arrival="282.60" arrivalLane="c2e_1" arrivalPos="990.00" arrivalPosLat="0.00" arrivalSpeed="14.67" duration="152.60" routeLength="1996.47" waitingTime="0.00" waitingCount="0" stopTime="0.00" timeLoss="19.23" rerouteNo="1" devices="tripinfo_car_n2e_130 routing_car_n2e_130" vType="Car" speedFactor="1.08" vaporized=""/>
    <tripinfo id="car_n2e_146" depart="146.00" departLane="n2sep_1" departPos="3.60" departPosLat="0.00" departSpeed="13.90" departDelay="0.00" arrival="284.35" arrivalLane="c2e_1" arrivalPos="990.00" arrivalPosLat="0.00" arrivalSpeed="15.39" duration="138.35" routeLength="1996.47" waitingTime="0.00" waitingCount="0" stopTime="0.00" timeLoss="15.89" rerouteNo="1" devices="tripinfo_car_n2e_146 routing_car_n2e_146" vType="Car" speedFactor="1.18" vaporized=""/>
    <tripinfo id="bus_s2w_86" depart="87.65" departLane="s2sep_1" departPos="12.10" departPosLat="0.00" departSpeed="13.90" departDelay="1.65" arrival="288.95" arrivalLane="c2w_1" arrivalPos="990.00" arrivalPosLat="0.00" arrivalSpeed="13.90" duration="201.30" routeLength="1987.97" waitingTime="37.90" waitingCount="3" stopTime="0.00" timeLoss="57.60" rerouteNo="1" devices="tripinfo_bus_s2w_86 routing_bus_s2w_86" vType="Bus" speedFactor="1.00" vaporized=""/>
    <tripinfo id="car_s2w_112" depart="112.00" departLane="s2sep_1" departPos="3.60" departPosLat="0.00" departSpeed="13.90" departDelay="0.00" arrival="293.80" arrivalLane="c2w_1" arrivalPos="990.00" arrivalPosLat="0.00" arrivalSpeed="13.89" duration="181.80" routeLength="1996.47" waitingTime="16.80" waitingCount="2" stopTime="0.00" timeLoss="37.48" rerouteNo="1" devices="tripinfo_car_s2w_112 routing_car_s2w_112" vType="Car" speedFactor="1.00" vaporized=""/>
    <tripinfo id="car_w2s_104" depart="105.40" departLane="w2sep_1" departPos="3.60" departPosLat="0.00" departSpeed="13.90" departDelay="1.40" arrival="295.10" arrivalLane="c2s_1" arrivalPos="990.00" arrivalPosLat="0.00" arrivalSpeed="15.12" duration="189.70" routeLength="1986.69" waitingTime="46.15" waitingCount="1" stopTime="0.00" timeLoss="57.64" rerouteNo="1" devices="tripinfo_car_w2s_104 routing_car_w2s_104" vType="Car" speedFactor="1.09" vaporized=""/>
    <tripinfo id="car_s2w_113" depart="113.50" departLane="s2sep_1" departPos="3.60" departPosLat="0.00" departSpeed="13.90" departDelay="0.50" arrival="295.60" arrivalLane="c2w_1" arrivalPos="990.00" arrivalPosLat="0.00" arrivalSpeed="15.34" duration="182.10" routeLength="1996.47" waitingTime="15.85" waitingCount="2" stopTime="0.00" timeLoss="58.64" rerouteNo="1" devices="tripinfo_car_s2w_113 routing_car_s2w_113" vType="Car" speedFactor="1.17" vaporized=""/>
    <tripinfo id="car_s2w_140" depart="140.00" departLane="s2sep_1" departPos="3.60" departPosLat="0.00" departSpeed="13.90" departDelay="0.00" arrival="299.15" arrivalLane="c2w_1" arrivalPos="990.00" arrivalPosLat="0.00" arrivalSpeed="13.87" duration="159.15" routeLength="1996.47" waitingTime="0.00" waitingCount="0" stopTime="0.00" timeLoss="14.81" rerouteNo="1" devices="tripinfo_car_s2w_140 routing_car_s2w_140" vType="Car" speedFactor="1.00" vaporized=""/>
    <tripinfo id="car_e2n_119" depart="119.00" departLane="e2sep_1" departPos="3.60" departPosLat="0.00" departSpeed="13.90" departDelay="0.00" arrival="300.65" arrivalLane="c2n_1" arrivalPos="990.00" arrivalPosLat="0.00" arrivalSpeed="13.90" duration="181.65" routeLength="1986.69" waitingTime="30.85" waitingCount="1" stopTime="0.00" timeLoss="37.95" rerouteNo="1" devices="tripinfo_car_e2n_119 routing_car_e2n_119" vType="Car" speedFactor="1.00" vaporized=""/>
    <tripinfo id="car_w2n_129" depart="129.00" departLane="w2sep_1" departPos="3.60" departPosLat="0.00" departSpeed="13.90" departDelay="0.00" arrival="302.65" arrivalLane="c2n_1" arrivalPos="990.00" arrivalPosLat="0.00" arrivalSpeed="15.19" duration="173.65" routeLength="1996.47" waitingTime="28.50" waitingCount="1" stopTime="0.00" timeLoss="46.14" rerouteNo="1" devices="tripinfo_car_w2n_129 routing_car_w2n_129" vType="Car" speedFactor="1.13" vaporized=""/>
    <tripinfo id="car_w2e_111" depart="111.00" departLane="w2sep_1" departPos="3.60" departPosLat="0.00" departSpeed="13.90" departDelay="0.00" arrival="302.85" arrivalLane="c2e_1" arrivalPos="990.00" arrivalPosLat="0.00" arrivalSpeed="13.90" duration="191.85" routeLength="1997.01" waitingTime="39.50" waitingCount="1" stopTime="0.00" timeLoss="48.15" rerouteNo="1" devices="tripinfo_car_w2e_111 routing_car_w2e_111" vType="Car" speedFactor="1.00" vaporized=""/>
    <tripinfo id="car_w2e_116" depart="116.00" departLane="w2sep_1" departPos="3.60" departPosLat="0.00" departSpeed="13.90" departDelay="0.00" arrival="306.60" arrivalLane="c2e_1" arrivalPos="990.00" arrivalPosLat="0.00" arrivalSpeed="14.11" duration="190.60" routeLength="1997.01" waitingTime="36.35" waitingCount="1" stopTime="0.00" timeLoss="49.26" rerouteNo="1" devices="tripinfo_car_w2e_116 routing_car_w2e_116" vType="Car" speedFactor="1.02" vaporized=""/>
    <tripinfo id="car_w2e_160" depart="160.00" departLane="w2sep_1" departPos="3.60" departPosLat="0.00" departSpeed="13.90" departDelay="0.00" arrival="308.50" arrivalLane="c2e_1" arrivalPos="990.00" arrivalPosLat="0.00" arrivalSpeed="15.33" duration="148.50" routeLength="1997.01" waitingTime="2.00" waitingCount="1" stopTime="0.00" timeLoss="24.02" rerouteNo="1" devices="tripinfo_car_w2e_160 routing_car_w2e_160" vType="Car" speedFactor="1.15" vaporized=""/>
    <tripinfo id="car_e2s_108" depart="108.00" departLane="e2sep_1" departPos="3.60" departPosLat="0.00" departSpeed="13.90" departDelay="0.00" arrival="309.65" arrivalLane="c2s_1" arrivalPos="990.00" arrivalPosLat="0.00" arrivalSpeed="13.90" duration="201.65" routeLength="1996.47" waitingTime="46.55" waitingCount="2" stopTime="0.00" timeLoss="57.30" rerouteNo="1" devices="tripinfo_car_e2s_108 routing_car_e2s_108" vType="Car" speedFactor="1.00" vaporized=""/>
    <tripinfo id="car_e2n_170" depart="170.00" departLane="e2sep_1" departPos="3.60" departPosLat="0.00" departSpeed="13.90" departDelay="0.00" arrival="317.30" arrivalLane="c2n_1" arrivalPos="990.00" arrivalPosLat="0.00" arrivalSpeed="13.90" duration="147.30" routeLength="1986.69" waitingTime="0.00" waitingCount="0" stopTime="0.00" timeLoss="3.62" rerouteNo="1" devices="tripinfo_car_e2n_170 routing_car_e2n_170" vType="Car" speedFactor="1.00" vaporized=""/>
    <tripinfo id="car_e2w_183" depart="183.00" departLane="e2sep_1" departPos="3.60" departPosLat="0.00" departSpeed="13.90" departDelay="0.00" arrival="318.35" arrivalLane="c2w_1" arrivalPos="990.00" arrivalPosLat="0.00" arrivalSpeed="15.11" duration="135.35" routeLength="1997.01" waitingTime="0.00" waitingCount="0" stopTime="0.00" timeLoss="3.15" rerouteNo="1" devices="tripinfo_car_e2w_183 routing_car_e2w_183" vType="Car" speedFactor="1.09" vaporized=""/>
    <tripinfo id="car_w2e_175" depart="175.00" departLane="w2sep_1" departPos="3.60" departPosLat="0.00" departSpeed="13.90" departDelay="0.00" arrival="319.05" arrivalLane="c2e_1" arrivalPos="990.00" arrivalPosLat="0.00" arrivalSpeed="13.90" duration="144.05" routeLength="1997.01" waitingTime="0.00" waitingCount="0" stopTime="0.00" timeLoss="0.38" rerouteNo="1" devices="tripinfo_car_w2e_175 routing_car_w2e_175" vType="Car" speedFactor="1.00" vaporized=""/>
    <tripinfo id="car_e2n_181" depart="181.00" departLane="e2sep_1" departPos="3.60" departPosLat="0.00" departSpeed="13.90" departDelay="0.00" arrival="319.60" arrivalLane="c2n_1" arrivalPos="990.00" arrivalPosLat="0.00" arrivalSpeed="15.02" duration="138.60" routeLength="1986.69" waitingTime="0.00" waitingCount="0" stopTime="0.00" timeLoss="8.27" rerouteNo="1" devices="tripinfo_car_e2n_181 routing_car_e2n_181" vType="Car" speedFactor="1.10" vaporized=""/>
    <tripinfo id="car_e2w_189" depart="189.00" departLane="e2sep_1" departPos="3.60" departPosLat="0.00" departSpeed="13.90" departDelay="0.00" arrival="321.10" arrivalLane="c2w_1" arrivalPos="990.00" arrivalPosLat="0.00" arrivalSpeed="15.80" duration="132.10" routeLength="1997.01" waitingTime="0.00" waitingCount="0" stopTime="0.00" timeLoss="6.89" rerouteNo="1" devices="tripinfo_car_e2w_189 routing_car_e2w_189" vType="Car" speedFactor="1.15" vaporized=""/>
    <tripinfo id="car_w2e_181" depart="181.00" departLane="w2sep_1" departPos="3.60" departPosLat="0.00" departSpeed="13.90" departDelay="0.00" arrival="322.90" arrivalLane="c2e_1" arrivalPos="990.00" arrivalPosLat="0.00" arrivalSpeed="14.33" duration="141.90" routeLength="1997.01" waitingTime="0.00" waitingCount="0" stopTime="0.00" timeLoss="2.75" rerouteNo="1" devices="tripinfo_car_w2e_181 routing_car_w2e_181" vType="Car" speedFactor="1.03" vaporized=""/>
    <tripinfo id="car_n2s_162" depart="162.00" departLane="n2sep_1" departPos="3.60" departPosLat="0.00" departSpeed="13.90" departDelay="0.00" arrival="345.35" arrivalLane="c2s_1" arrivalPos="990.00" arrivalPosLat="0.00" arrivalSpeed="13.97" duration="183.35" routeLength="1997.01" waitingTime="33.35" waitingCount="1" stopTime="0.00" timeLoss="40.40" rerouteNo="1" devices="tripinfo_car_n2s_162 routing_car_n2s_162" vType="Car" speedFactor="1.01" vaporized=""/>
    <tripinfo id="car_n2s_169" depart="169.00" departLane="n2sep_1" departPos="3.60" departPosLat="0.00" departSpeed="13.90" departDelay="0.00" arrival="349.10" arrivalLane="c2s_1" arrivalPos="990.00" arrivalPosLat="0.00" arrivalSpeed="14.18" duration="180.10" routeLength="1997.01" waitingTime="28.00" waitingCount="1" stopTime="0.00" timeLoss="39.52" rerouteNo="1" devices="tripinfo_car_n2s_169 routing_car_n2s_169" vType="Car" speedFactor="1.02" vaporized=""/>
    <tripinfo id="bus_s2n_155" depart="155.00" departLane="s2sep_1" departPos="12.10" departPosLat="0.00" departSpeed="13.90" departDelay="0.00" arrival="349.20" arrivalLane="c2n_1" arrivalPos="990.00" arrivalPosLat="0.00" arrivalSpeed="13.90" duration="194.20" routeLength="1988.51" waitingTime="40.45" waitingCount="1" stopTime="0.00" timeLoss="51.13" rerouteNo="1" devices="tripinfo_bus_s2n_155 routing_bus_s2n_155" vType="Bus" speedFactor="1.00" vaporized=""/>
    <tripinfo id="car_s2n_163" depart="163.00" departLane="s2sep_1" departPos="3.60" departPosLat="0.00" departSpeed="13.90" departDelay="0.00" arrival="351.60" arrivalLane="c2n_1" arrivalPos="990.00" arrivalPosLat="0.00" arrivalSpeed="15.68" duration="188.60" routeLength="1997.01" waitingTime="39.55" waitingCount="1" stopTime="0.00" timeLoss="65.98" rerouteNo="1" devices="tripinfo_car_s2n_163 routing_car_s2n_163" vType="Car" speedFactor="1.17" vaporized=""/>
    <tripinfo id="car_n2w_183" depart="183.00" departLane="n2sep_1" departPos="3.60" departPosLat="0.00" departSpeed="13.90" departDelay="0.00" arrival="351.80" arrivalLane="c2w_1" arrivalPos="990.00" arrivalPosLat="0.00" arrivalSpeed="14.00" duration="168.80" routeLength="1986.69" waitingTime="15.20" waitingCount="1" stopTime="0.00" timeLoss="26.15" rerouteNo="1" devices="tripinfo_car_n2w_183 routing_car_n2w_183" vType="Car" speedFactor="1.01" vaporized=""/>
    <tripinfo id="car_n2s_172" depart="172.20" departLane="n2sep_1" departPos="3.60" departPosLat="0.00" departSpeed="13.90" departDelay="0.20" arrival="352.50" arrivalLane="c2s_1" arrivalPos="990.00" arrivalPosLat="0.00" arrivalSpeed="14.13" duration="180.30" routeLength="1997.01" waitingTime="22.00" waitingCount="1" stopTime="0.00" timeLoss="39.36" rerouteNo="1" devices="tripinfo_car_n2s_172 routing_car_n2s_172" vType="Car" speedFactor="1.02" vaporized=""/>
    <tripinfo id="car_s2n_180" depart="180.00" departLane="s2sep_1" departPos="3.60" departPosLat="0.00" departSpeed="13.90" departDelay="0.00" arrival="353.50" arrivalLane="c2n_1" arrivalPos="990.00" arrivalPosLat="0.00" arrivalSpeed="15.73" duration="173.50" routeLength="1997.01" waitingTime="27.65" waitingCount="1" stopTime="0.00" timeLoss="51.72" rerouteNo="1" devices="tripinfo_car_s2n_180 routing_car_s2n_180" vType="Car" speedFactor="1.18" vaporized=""/>
    <tripinfo id="car_n2s_189" depart="189.00" departLane="n2sep_1" departPos="3.60" departPosLat="0.00" departSpeed="13.90" departDelay="0.00" arrival="355.45" arrivalLane="c2s_1" arrivalPos="990.00" arrivalPosLat="0.00" arrivalSpeed="14.24" duration="166.45" routeLength="1997.01" waitingTime="12.00" waitingCount="1" stopTime="0.00" timeLoss="26.98" rerouteNo="1" devices="tripinfo_car_n2s_189 routing_car_n2s_189" vType="Car" speedFactor="1.03" vaporized=""/>
    <tripinfo id="car_s2e_214" depart="214.00" departLane="s2sep_1" departPos="3.60" departPosLat="0.00" departSpeed="13.90" departDelay="0.00" arrival="356.00" arrivalLane="c2e_1" arrivalPos="990.00" arrivalPosLat="0.00" arrivalSpeed="14.50" duration="142.00" routeLength="1986.69" waitingTime="0.00" waitingCount="0" stopTime="0.00" timeLoss="4.30" rerouteNo="1" devices="tripinfo_car_s2e_214 routing_car_s2e_214" vType="Car" speedFactor="1.04" vaporized=""/>
    <tripinfo id="car_s2n_187" depart="187.00" departLane="s2sep_1" departPos="3.60" departPosLat="0.00" departSpeed="13.90" departDelay="0.00" arrival="357.30" arrivalLane="c2n_1" arrivalPos="990.00" arrivalPosLat="0.00" arrivalSpeed="14.12" duration="170.30" routeLength="1997.01" waitingTime="12.40" waitingCount="1" stopTime="0.00" timeLoss="29.01" rerouteNo="1" devices="tripinfo_car_s2n_187 routing_car_s2n_187" vType="Car" speedFactor="1.02" vaporized=""/>
    <tripinfo id="car_n2w_191" depart="191.00" departLane="n2sep_1" departPos="3.60" departPosLat="0.00" departSpeed="13.90" departDelay="0.00" arrival="357.55" arrivalLane="c2w_1" arrivalPos="990.00" arrivalPosLat="0.00" arrivalSpeed="13.90" duration="166.55" routeLength="1986.69" waitingTime="8.30" waitingCount="1" stopTime="0.00" timeLoss="22.85" rerouteNo="1" devices="tripinfo_car_n2w_191 routing_car_n2w_191" vType="Car" speedFactor="1.00" vaporized=""/>
    <tripinfo id="car_s2n_217" depart="217.00" departLane="s2sep_1" departPos="3.60" departPosLat="0.00" departSpeed="13.90" departDelay="0.00" arrival="360.00" arrivalLane="c2n_1" arrivalPos="990.00" arrivalPosLat="0.00" arrivalSpeed="14.56" duration="143.00" routeLength="1997.01" waitingTime="0.00" waitingCount="0" stopTime="0.00" timeLoss="7.02" rerouteNo="1" devices="tripinfo_car_s2n_217 routing_car_s2n_217" vType="Car" speedFactor="1.06" vaporized=""/>
    <tripinfo id="car_n2w_209" depart="209.00" departLane="n2sep_1" departPos="3.60" departPosLat="0.00" departSpeed="13.90" departDelay="0.00" arrival="360.50" arrivalLane="c2w_1" arrivalPos="990.00" arrivalPosLat="0.00" arrivalSpeed="14.34" duration="151.50" routeLength="1986.69" waitingTime="0.00" waitingCount="0" stopTime="0.00" timeLoss="13.03" rerouteNo="1" devices="tripinfo_car_n2w_209 routing_car_n2w_209" vType="Car" speedFactor="1.04" vaporized=""/>
    <tripinfo id="car_n2e_170" depart="170.45" departLane="n2sep_1" departPos="3.60" departPosLat="0.00" departSpeed="13.90" departDelay="0.45" arrival="362.70" arrivalLane="c2e_1" arrivalPos="990.00" arrivalPosLat="0.00" arrivalSpeed="14.22" duration="192.25" routeLength="1996.47" waitingTime="36.65" waitingCount="2" stopTime="0.00" timeLoss="51.15" rerouteNo="1" devices="tripinfo_car_n2e_170 routing_car_n2e_170" vType="Car" speedFactor="1.02" vaporized=""/>
    <tripinfo id="car_s2w_166" depart="166.00" departLane="s2sep_1" departPos="3.60" departPosLat="0.00" departSpeed="13.90" departDelay="0.00" arrival="363.30" arrivalLane="c2w_1" arrivalPos="990.00" arrivalPosLat="0.00" arrivalSpeed="14.36" duration="197.30" routeLength="1996.47" waitingTime="41.30" waitingCount="2" stopTime="0.00" timeLoss="58.54" rerouteNo="1" devices="tripinfo_car_s2w_166 routing_car_s2w_166" vType="Car" speedFactor="1.04" vaporized=""/>
    <tripinfo id="car_n2e_174" depart="174.05" departLane="n2sep_1" departPos="3.60" departPosLat="0.00" departSpeed="13.90" departDelay="0.05" arrival="365.80" arrivalLane="c2e_1" arrivalPos="990.00" arrivalPosLat="0.00" arrivalSpeed="14.60" duration="191.75" routeLength="1996.47" waitingTime="30.95" waitingCount="2" stopTime="0.00" timeLoss="55.02" rerouteNo="1" devices="tripinfo_car_n2e_174 routing_car_n2e_174" vType="Car" speedFactor="1.06" vaporized=""/>
    <tripinfo id="car_s2w_183" depart="183.00" departLane="s2sep_1" departPos="3.60" departPosLat="0.00" departSpeed="13.90" departDelay="0.00" arrival="366.15" arrivalLane="c2w_1" arrivalPos="990.00" arrivalPosLat="0.00" arrivalSpeed="14.29" duration="183.15" routeLength="1996.47" waitingTime="24.05" waitingCount="2" stopTime="0.00" timeLoss="43.65" rerouteNo="1" devices="tripinfo_car_s2w_183 routing_car_s2w_183" vType="Car" speedFactor="1.03" vaporized=""/>
    <tripinfo id="car_s2w_204" depart="204.00" departLane="s2sep_1" departPos="3.60" departPosLat="0.00" departSpeed="13.90" departDelay="0.00" arrival="369.25" arrivalLane="c2w_1" arrivalPos="990.00" arrivalPosLat="0.00" arrivalSpeed="14.07" duration="165.25" routeLength="1996.47" waitingTime="7.30" waitingCount="1" stopTime="0.00" timeLoss="23.27" rerouteNo="1" devices="tripinfo_car_s2w_204 routing_car_s2w_204" vType="Car" speedFactor="1.02" vaporized=""/>
    <tripinfo id="car_s2e_232" depart="232.00" departLane="s2sep_1" departPos="3.60" departPosLat="0.00" departSpeed="13.90" departDelay="0.00" arrival="369.60" arrivalLane="c2e_1" arrivalPos="990.00" arrivalPosLat="0.00" arrivalSpeed="15.09" duration="137.60" routeLength="1986.69" waitingTime="0.00" waitingCount="0" stopTime="0.00" timeLoss="5.56" rerouteNo="1" devices="tripinfo_car_s2e_232 routing_car_s2e_232" vType="Car" speedFactor="1.09" vaporized=""/>
    <tripinfo id="car_s2w_223" depart="223.00" departLane="s2sep_1" departPos="3.60" departPosLat="0.00" departSpeed="13.90" departDelay="0.00" arrival="372.45" arrivalLane="c2w_1" arrivalPos="990.00" arrivalPosLat="0.00" arrivalSpeed="13.99" duration="149.45" routeLength="1996.47" waitingTime="0.00" waitingCount="0" stopTime="0.00" timeLoss="6.56" rerouteNo="1" devices="tripinfo_car_s2w_223 routing_car_s2w_223" vType="Car" speedFactor="1.01" vaporized=""/>
    <tripinfo id="car_s2w_235" depart="235.00" departLane="s2sep_1" departPos="3.60" departPosLat="0.00" departSpeed="13.90" departDelay="0.00" arrival="374.80" arrivalLane="c2w_1" arrivalPos="990.00" arrivalPosLat="0.00" arrivalSpeed="14.96" duration="139.80" routeLength="1996.47" waitingTime="0.00" waitingCount="0" stopTime="0.00" timeLoss="8.24" rerouteNo="1" devices="tripinfo_car_s2w_235 routing_car_s2w_235" vType="Car" speedFactor="1.10" vaporized=""/>
    <tripinfo id="car_n2e_241" depart="241.00" departLane="n2sep_1" departPos="3.60" departPosLat="0.00" departSpeed="13.90" departDelay="0.00" arrival="380.25" arrivalLane="c2e_1" arrivalPos="990.00" arrivalPosLat="0.00" arrivalSpeed="14.80" duration="139.25" routeLength="1996.47" waitingTime="0.00" waitingCount="0" stopTime="0.00" timeLoss="3.74" rerouteNo="1" devices="tripinfo_car_n2e_241 routing_car_n2e_241" vType="Car" speedFactor="1.07" vaporized=""/>
    <tripinfo id="car_e2w_202" depart="202.00" departLane="e2sep_1" departPos="3.60" departPosLat="0.00" departSpeed="13.90" departDelay="0.00" arrival="387.95" arrivalLane="c2w_1" arrivalPos="990.00" arrivalPosLat="0.00" arrivalSpeed="14.49" duration="185.95" routeLength="1997.01" waitingTime="40.80" waitingCount="1" stopTime="0.00" timeLoss="48.15" rerouteNo="1" devices="tripinfo_car_e2w_202 routing_car_e2w_202" vType="Car" speedFactor="1.04" vaporized=""/>
    <tripinfo id="car_w2s_186" depart="186.00" departLane="w2sep_1" departPos="3.60" departPosLat="0.00" departSpeed="13.90" departDelay="0.00" arrival="390.65" arrivalLane="c2s_1" arrivalPos="990.00" arrivalPosLat="0.00" arrivalSpeed="13.90" duration="204.65" routeLength="1986.69" waitingTime="53.65" waitingCount="1" stopTime="0.00" timeLoss="60.96" rerouteNo="1" devices="tripinfo_car_w2s_186 routing_car_w2s_186" vType="Car" speedFactor="1.00" vaporized=""/>
    <tripinfo id="car_e2n_204" depart="204.00" departLane="e2sep_1" departPos="3.60" departPosLat="0.00" departSpeed="13.90" departDelay="0.00" arrival="391.45" arrivalLane="c2n_1" arrivalPos="990.00" arrivalPosLat="0.00" arrivalSpeed="14.21" duration="187.45" routeLength="1986.69" waitingTime="36.80" waitingCount="1" stopTime="0.00" timeLoss="46.86" rerouteNo="1" devices="tripinfo_car_e2n_204 routing_car_e2n_204" vType="Car" speedFactor="1.02" vaporized=""/>
    <tripinfo id="car_w2e_207" depart="207.00" departLane="w2sep_1" departPos="3.60" departPosLat="0.00" departSpeed="13.90" departDelay="0.00" arrival="391.70" arrivalLane="c2e_1" arrivalPos="990.00" arrivalPosLat="0.00" arrivalSpeed="15.18" duration="184.70" routeLength="1997.01" waitingTime="35.65" waitingCount="1" stopTime="0.00" timeLoss="53.13" rerouteNo="1" devices="tripinfo_car_w2e_207 routing_car_w2e_207" vType="Car" speedFactor="1.09" vaporized=""/>
    <tripinfo id="car_w2s_202" depart="202.00" departLane="w2sep_1" departPos="3.60" departPosLat="0.00" departSpeed="13.90" departDelay="0.00" arrival="395.10" arrivalLane="c2s_1" arrivalPos="990.00" arrivalPosLat="0.00" arrivalSpeed="13.91" duration="193.10" routeLength="1986.69" waitingTime="39.00" waitingCount="1" stopTime="0.00" timeLoss="49.67" rerouteNo="1" devices="tripinfo_car_w2s_202 routing_car_w2s_202" vType="Car" speedFactor="1.00" vaporized=""/>
    <tripinfo id="car_e2w_241" depart="241.00" departLane="e2sep_1" departPos="3.60" departPosLat="0.00" departSpeed="13.90" departDelay="0.00" arrival="395.45" arrivalLane="c2w_1" arrivalPos="990.00" arrivalPosLat="0.00" arrivalSpeed="13.90" duration="154.45" routeLength="1997.01" waitingTime="0.95" waitingCount="1" stopTime="0.00" timeLoss="10.78" rerouteNo="1" devices="tripinfo_car_e2w_241 routing_car_e2w_241" vType="Car" speedFactor="1.00" vaporized=""/>
    <tripinfo id="car_w2e_215" depart="215.00" departLane="w2sep_1" departPos="3.60" departPosLat="0.00" departSpeed="13.90" departDelay="0.00" arrival="395.85" arrivalLane="c2e_1" arrivalPos="990.00" arrivalPosLat="0.00" arrivalSpeed="15.15" duration="180.85" routeLength="1997.01" waitingTime="34.10" waitingCount="1" stopTime="0.00" timeLoss="49.15" rerouteNo="1" devices="tripinfo_car_w2e_215 routing_car_w2e_215" vType="Car" speedFactor="1.09" vaporized=""/>
    <tripinfo id="car_e2n_241" depart="242.45" departLane="e2sep_1" departPos="3.60" departPosLat="0.00" departSpeed="13.90" departDelay="1.45" arrival="398.15" arrivalLane="c2n_1" arrivalPos="990.00" arrivalPosLat="0.00" arrivalSpeed="13.90" duration="155.70" routeLength="1986.69" waitingTime="0.00" waitingCount="0" stopTime="0.00" timeLoss="12.05" rerouteNo="1" devices="tripinfo_car_e2n_241 routing_car_e2n_241" vType="Car" speedFactor="1.00" vaporized=""/>
    <tripinfo id="car_w2s_203" depart="203.45" departLane="w2sep_1" departPos="3.60" departPosLat="0.00" departSpeed="13.90" departDelay="0.45" arrival="398.55" arrivalLane="c2s_1" arrivalPos="990.00" arrivalPosLat="0.00" arrivalSpeed="13.96" duration="195.10" routeLength="1986.69" waitingTime="36.50" waitingCount="1" stopTime="0.00" timeLoss="52.44" rerouteNo="1" devices="tripinfo_car_w2s_203 routing_car_w2s_203" vType="Car" speedFactor="1.01" vaporized=""/>
    <tripinfo id="car_w2s_234" depart="234.00" departLane="w2sep_1" departPos="3.60" departPosLat="0.00" departSpeed="13.90" departDelay="0.00" arrival="400.55" arrivalLane="c2s_1" arrivalPos="990.00" arrivalPosLat="0.00" arrivalSpeed="15.03" duration="166.55" routeLength="1986.69" waitingTime="18.85" waitingCount="1" stopTime="0.00" timeLoss="38.43" rerouteNo="1" devices="tripinfo_car_w2s_234 routing_car_w2s_234" vType="Car" speedFactor="1.12" vaporized=""/>
    <tripinfo id="bus_w2n_239" depart="239.00" departLane="w2sep_1" departPos="12.10" departPosLat="0.00" departSpeed="13.90" departDelay="0.00" arrival="404.10" arrivalLane="c2n_1" arrivalPos="990.00" arrivalPosLat="0.00" arrivalSpeed="13.88" duration="165.10" routeLength="1987.97" waitingTime="4.30" waitingCount="2" stopTime="0.00" timeLoss="21.37" rerouteNo="1" devices="tripinfo_bus_w2n_239 routing_bus_w2n_239" vType="Bus" speedFactor="1.00" vaporized=""/>
    <tripinfo id="bus_w2s_234" depart="235.75" departLane="w2sep_1" departPos="12.10" departPosLat="0.00" departSpeed="13.90" departDelay="1.75" arrival="407.10" arrivalLane="c2s_1" arrivalPos="990.00" arrivalPosLat="0.00" arrivalSpeed="13.89" duration="171.35" routeLength="1978.19" waitingTime="12.25" waitingCount="1" stopTime="0.00" timeLoss="28.30" rerouteNo="1" devices="tripinfo_bus_w2s_234 routing_bus_w2s_234" vType="Bus" speedFactor="1.00" vaporized=""/>
    <tripinfo id="car_w2n_243" depart="243.00" departLane="w2sep_1" departPos="3.60" departPosLat="0.00" departSpeed="13.90" departDelay="0.00" arrival="408.60" arrivalLane="c2n_1" arrivalPos="990.00" arrivalPosLat="0.00" arrivalSpeed="13.89" duration="165.60" routeLength="1996.47" waitingTime="3.15" waitingCount="1" stopTime="0.00" timeLoss="21.27" rerouteNo="1" devices="tripinfo_car_w2n_243 routing_car_w2n_243" vType="Car" speedFactor="1.00" vaporized=""/>
    <tripinfo id="car_w2e_273" depart="273.00" departLane="w2sep_1" departPos="3.60" departPosLat="0.00" departSpeed="13.90" departDelay="0.00" arrival="408.90" arrivalLane="c2e_1" arrivalPos="990.00" arrivalPosLat="0.00" arrivalSpeed="14.89" duration="135.90" routeLength="1997.01" waitingTime="0.00" waitingCount="0" stopTime="0.00" timeLoss="1.74" rerouteNo="1" devices="tripinfo_car_w2e_273 routing_car_w2e_273" vType="Car" speedFactor="1.07" vaporized=""/>
    <tripinfo id="car_w2s_252" depart="252.00" departLane="w2sep_1" departPos="3.60" departPosLat="0.00" departSpeed="13.90" departDelay="0.00" arrival="410.25" arrivalLane="c2s_1" arrivalPos="990.00" arrivalPosLat="0.00" arrivalSpeed="14.69" duration="158.25" routeLength="1986.69" waitingTime="0.00" waitingCount="0" stopTime="0.00" timeLoss="23.32" rerouteNo="1" devices="tripinfo_car_w2s_252 routing_car_w2s_252" vType="Car" speedFactor="1.06" vaporized=""/>
    <tripinfo id="car_w2n_245" depart="245.00" departLane="w2sep_1" departPos="3.60" departPosLat="0.00" departSpeed="13.90" departDelay="0.00" arrival="410.90" arrivalLane="c2n_1" arrivalPos="990.00" arrivalPosLat="0.00" arrivalSpeed="14.63" duration="165.90" routeLength="1996.47" waitingTime="3.00" waitingCount="1" stopTime="0.00" timeLoss="31.33" rerouteNo="1" devices="tripinfo_car_w2n_245 routing_car_w2n_245" vType="Car" speedFactor="1.07" vaporized=""/>
    <tripinfo id="car_w2s_269" depart="269.00" departLane="w2sep_1" departPos="3.60" departPosLat="0.00" departSpeed="13.90" departDelay="0.00" arrival="412.50" arrivalLane="c2s_1" arrivalPos="990.00" arrivalPosLat="0.00" arrivalSpeed="14.95" duration="143.50" routeLength="1986.69" waitingTime="0.00" waitingCount="0" stopTime="0.00" timeLoss="12.40" rerouteNo="1" devices="tripinfo_car_w2s_269 routing_car_w2s_269" vType="Car" speedFactor="1.10" vaporized=""/>
    <tripinfo id="car_w2n_263" depart="263.00" departLane="w2sep_1" departPos="3.60" departPosLat="0.00" departSpeed="13.90" departDelay="0.00" arrival="413.00" arrivalLane="c2n_1" arrivalPos="990.00" arrivalPosLat="0.00" arrivalSpeed="14.88" duration="150.00" routeLength="1996.47" waitingTime="0.00" waitingCount="0" stopTime="0.00" timeLoss="18.61" rerouteNo="1" devices="tripinfo_car_w2n_263 routing_car_w2n_263" vType="Car" speedFactor="1.10" vaporized=""/>
    <tripinfo id="amb_w2e_300" depart="300.70" departLane="w2sep_1" departPos="6.60" departPosLat="0.00" departSpeed="13.90" departDelay="0.70" arrival="414.45" arrivalLane="c2e_1" arrivalPos="990.00" arrivalPosLat="-0.95" arrivalSpeed="20.81" duration="113.75" routeLength="1994.01" waitingTime="0.00" waitingCount="0" stopTime="0.00" timeLoss="18.08" rerouteNo="1" devices="tripinfo_amb_w2e_300 routing_amb_w2e_300 bluelight_amb_w2e_300 fcd_amb_w2e_300" vType="Ambulance" speedFactor="1.50" vaporized="">
        <example_device customValue1="0.00" customValue2="-1.00"/>
    </tripinfo>
    <tripinfo id="car_e2s_268" depart="268.00" departLane="e2sep_1" departPos="3.60" departPosLat="0.00" departSpeed="13.90" departDelay="0.00" arrival="414.85" arrivalLane="c2s_1" arrivalPos="990.00" arrivalPosLat="0.00" arrivalSpeed="14.99" duration="146.85" routeLength="1996.47" waitingTime="3.95" waitingCount="1" stopTime="0.00" timeLoss="15.19" rerouteNo="1" devices="tripinfo_car_e2s_268 routing_car_e2s_268" vType="Car" speedFactor="1.10" vaporized=""/>
    <tripinfo id="car_w2e_295" depart="295.00" departLane="w2sep_1" departPos="3.60" departPosLat="0.00" departSpeed="13.90" departDelay="0.00" arrival="423.80" arrivalLane="c2e_1" arrivalPos="990.00" arrivalPosLat="1.10" arrivalSpeed="15.55" duration="128.80" routeLength="1997.01" waitingTime="0.00" waitingCount="0" stopTime="0.00" timeLoss="0.33" rerouteNo="1" devices="tripinfo_car_w2e_295 routing_car_w2e_295" vType="Car@car_w2e_295" speedFactor="1.12" vaporized=""/>
    <tripinfo id="car_e2s_292" depart="292.00" departLane="e2sep_1" departPos="3.60" departPosLat="0.00" departSpeed="13.90" departDelay="0.00" arrival="431.10" arrivalLane="c2s_1" arrivalPos="990.00" arrivalPosLat="0.00" arrivalSpeed="16.02" duration="139.10" routeLength="1996.47" waitingTime="5.55" waitingCount="1" stopTime="0.00" timeLoss="13.91" rerouteNo="1" devices="tripinfo_car_e2s_292 routing_car_e2s_292" vType="Car" speedFactor="1.15" vaporized=""/>
    <tripinfo id="car_w2n_299" depart="299.00" departLane="w2sep_1" departPos="3.60" departPosLat="0.00" departSpeed="13.90" departDelay="0.00" arrival="445.65" arrivalLane="c2n_1" arrivalPos="990.00" arrivalPosLat="0.00" arrivalSpeed="14.02" duration="146.65" routeLength="1996.47" waitingTime="0.00" waitingCount="0" stopTime="0.00" timeLoss="3.51" rerouteNo="1" devices="tripinfo_car_w2n_299 routing_car_w2n_299" vType="Car" speedFactor="1.01" vaporized=""/>
    <tripinfo id="car_n2s_258" depart="258.45" departLane="n2sep_1" departPos="3.60" departPosLat="0.00" departSpeed="13.90" departDelay="0.45" arrival="446.25" arrivalLane="c2s_1" arrivalPos="990.00" arrivalPosLat="0.00" arrivalSpeed="16.25" duration="187.80" routeLength="1997.01" waitingTime="47.10" waitingCount="1" stopTime="0.00" timeLoss="64.88" rerouteNo="1" devices="tripinfo_car_n2s_258 routing_car_n2s_258" vType="Car" speedFactor="1.17" vaporized=""/>
    <tripinfo id="car_s2e_260" depart="260.00" departLane="s2sep_1" departPos="3.60" departPosLat="0.00" departSpeed="13.90" departDelay="0.00" arrival="454.95" arrivalLane="c2e_1" arrivalPos="990.00" arrivalPosLat="0.00" arrivalSpeed="14.13" duration="194.95" routeLength="1986.69" waitingTime="46.50" waitingCount="1" stopTime="0.00" timeLoss="53.68" rerouteNo="1" devices="tripinfo_car_s2e_260 routing_car_s2e_260" vType="Car" speedFactor="1.02" vaporized=""/>
    <tripinfo id="car_s2n_265" depart="265.00" departLane="s2sep_1" departPos="3.60" departPosLat="0.00" departSpeed="13.90" departDelay="0.00" arrival="457.80" arrivalLane="c2n_1" arrivalPos="990.00" arrivalPosLat="0.00" arrivalSpeed="14.03" duration="192.80" routeLength="1997.01" waitingTime="41.50" waitingCount="1" stopTime="0.00" timeLoss="50.40" rerouteNo="1" devices="tripinfo_car_s2n_265 routing_car_s2n_265" vType="Car" speedFactor="1.01" vaporized=""/>
    <tripinfo id="bus_n2w_260" depart="260.85" departLane="n2sep_1" departPos="12.10" departPosLat="0.00" departSpeed="13.90" departDelay="0.85" arrival="461.80" arrivalLane="c2w_1" arrivalPos="990.00" arrivalPosLat="0.00" arrivalSpeed="13.90" duration="200.95" routeLength="1978.19" waitingTime="44.25" waitingCount="1" stopTime="0.00" timeLoss="57.88" rerouteNo="1" devices="tripinfo_bus_n2w_260 routing_bus_n2w_260" vType="Bus" speedFactor="1.00" vaporized=""/>
    <tripinfo id="bus_s2n_267" depart="267.10" departLane="s2sep_1" departPos="12.10" departPosLat="0.00" departSpeed="13.90" departDelay="0.10" arrival="463.80" arrivalLane="c2n_1" arrivalPos="990.00" arrivalPosLat="0.00" arrivalSpeed="13.88" duration="196.70" routeLength="1988.51" waitingTime="39.60" waitingCount="1" stopTime="0.00" timeLoss="53.63" rerouteNo="1" devices="tripinfo_bus_s2n_267 routing_bus_s2n_267" vType="Bus" speedFactor="1.00" vaporized=""/>
    <tripinfo id="car_n2w_277" depart="277.00" departLane="n2sep_1" departPos="3.60" departPosLat="0.00" departSpeed="13.90" departDelay="0.00" arrival="466.70" arrivalLane="c2w_1" arrivalPos="990.00" arrivalPosLat="0.00" arrivalSpeed="13.89" duration="189.70" routeLength="1986.69" waitingTime="31.35" waitingCount="1" stopTime="0.00" timeLoss="46.02" rerouteNo="1" devices="tripinfo_car_n2w_277 routing_car_n2w_277" vType="Car" speedFactor="1.00" vaporized=""/>
    <tripinfo id="car_n2s_294" depart="294.00" departLane="n2sep_1" departPos="3.60" departPosLat="0.00" departSpeed="13.90" departDelay="0.00" arrival="467.90" arrivalLane="c2s_1" arrivalPos="990.00" arrivalPosLat="0.00" arrivalSpeed="13.90" duration="173.90" routeLength="1997.01" waitingTime="16.70" waitingCount="1" stopTime="0.00" timeLoss="30.21" rerouteNo="1" devices="tripinfo_car_n2s_294 routing_car_n2s_294" vType="Car" speedFactor="1.00" vaporized=""/>
    <tripinfo id="car_s2n_269" depart="270.60" departLane="s2sep_1" departPos="3.60" departPosLat="0.00" departSpeed="13.90" departDelay="1.60" arrival="468.20" arrivalLane="c2n_1" arrivalPos="990.00" arrivalPosLat="0.00" arrivalSpeed="13.95" duration="197.60" routeLength="1997.01" waitingTime="35.20" waitingCount="1" stopTime="0.00" timeLoss="54.53" rerouteNo="1" devices="tripinfo_car_s2n_269 routing_car_s2n_269" vType="Car" speedFactor="1.00" vaporized=""/>
    <tripinfo id="car_n2w_282" depart="282.00" departLane="n2sep_1" departPos="3.60" departPosLat="0.00" departSpeed="13.90" departDelay="0.00" arrival="468.80" arrivalLane="c2w_1" arrivalPos="990.00" arrivalPosLat="0.00" arrivalSpeed="14.90" duration="186.80" routeLength="1986.69" waitingTime="30.55" waitingCount="1" stopTime="0.00" timeLoss="56.56" rerouteNo="1" devices="tripinfo_car_n2w_282 routing_car_n2w_282" vType="Car" speedFactor="1.10" vaporized=""/>
    <tripinfo id="car_s2n_272" depart="272.45" departLane="s2sep_1" departPos="3.60" departPosLat="0.00" departSpeed="13.90" departDelay="0.45" arrival="471.50" arrivalLane="c2n_1" arrivalPos="990.00" arrivalPosLat="0.00" arrivalSpeed="13.90" duration="199.05" routeLength="1997.01" waitingTime="33.60" waitingCount="1" stopTime="0.00" timeLoss="55.83" rerouteNo="1" devices="tripinfo_car_s2n_272 routing_car_s2n_272" vType="Car" speedFactor="1.00" vaporized=""/>
    <tripinfo id="car_n2w_309" depart="309.00" departLane="n2sep_1" departPos="3.60" departPosLat="0.00" departSpeed="13.90" departDelay="0.00" arrival="472.20" arrivalLane="c2w_1" arrivalPos="990.00" arrivalPosLat="0.00" arrivalSpeed="14.03" duration="163.20" routeLength="1986.69" waitingTime="3.20" waitingCount="1" stopTime="0.00" timeLoss="21.18" rerouteNo="1" devices="tripinfo_car_n2w_309 routing_car_n2w_309" vType="Car" speedFactor="1.01" vaporized=""/>
</tripinfos>
