<?xml version="1.0" encoding="UTF-8"?>

<!-- generated on Sat Apr 24 18:11:57 2021 by Eclipse SUMO Version 1.4.0
<configuration xmlns:xsi="http://www.w3.org/2001/XMLSchema-instance" xsi:noNamespaceSchemaLocation="http://sumo.dlr.de/xsd/sumoConfiguration.xsd">

    <input>
        <net-file value="sumofiles/junction.net.xml"/>
        <route-files value="sumofiles/junction_preemption_116.rou.xml"/>
        <additional-files value="sumofiles/junction.det.xml"/>
    </input>

    <output>
        <tripinfo-output value="sumofiles/output/tripinfo_preemption_116.xml"/>
    </output>

    <time>
        <begin value="0"/>
        <end value="10000"/>
        <step-length value="0.05"/>
    </time>

    <processing>
        <lateral-resolution value="0.1"/>
    </processing>

    <report>
        <no-warnings value="true"/>
        <error-log value="sumofiles/output/errorlog_preemption_116.log"/>
        <no-step-log value="true"/>
    </report>

    <traci_server>
        <remote-port value="39163"/>
    </traci_server>

    <gui_only>
        <gui-settings-file value="sumofiles/junction-gui.settings.xml"/>
        <tracker-interval value="0.05"/>
    </gui_only>

</configuration>
-->

<tripinfos xmlns:xsi="http://www.w3.org/2001/XMLSchema-instance" xsi:noNamespaceSchemaLocation="http://sumo.dlr.de/xsd/tripinfo_file.xsd">
    <tripinfo id="car_w2n_9" depart="9.00" departLane="w2sep_1" departPos="3.60" departPosLat="0.00" departSpeed="13.90" departDelay="0.00" arrival="149.00" arrivalLane="c2n_1" arrivalPos="990.00" arrivalPosLat="0.00" arrivalSpeed="15.05" duration="140.00" routeLength="1996.47" waitingTime="0.00" waitingCount="0" stopTime="0.00" timeLoss="6.67" rerouteNo="1" devices="tripinfo_car_w2n_9 routing_car_w2n_9" vType="Car" speedFactor="1.08" vaporized=""/>
    <tripinfo id="car_e2w_8" depart="8.00" departLane="e2sep_1" departPos="3.60" departPosLat="0.00" departSpeed="13.90" departDelay="0.00" arrival="150.25" arrivalLane="c2w_1" arrivalPos="990.00" arrivalPosLat="0.00" arrivalSpeed="14.04" duration="142.25" routeLength="1997.01" waitingTime="0.00" waitingCount="0" stopTime="0.00" timeLoss="0.05" rerouteNo="1" devices="tripinfo_car_e2w_8 routing_car_e2w_8" vType="Car" speedFactor="1.01" vaporized=""/>
    <tripinfo id="car_s2n_7" depart="7.35" departLane="s2sep_1" departPos="3.60" departPosLat="0.00" departSpeed="13.90" departDelay="0.35" arrival="161.90" arrivalLane="c2n_1" arrivalPos="990.00" arrivalPosLat="0.00" arrivalSpeed="14.73" duration="154.55" routeLength="1997.01" waitingTime="8.85" waitingCount="1" stopTime="0.00" timeLoss="18.97" rerouteNo="1" devices="tripinfo_car_s2n_7 routing_car_s2n_7" vType="Car" speedFactor="1.06" vaporized=""/>
    <tripinfo id="car_n2w_18" depart="18.00" departLane="n2sep_1" departPos="3.60" departPosLat="0.00" departSpeed="13.90" departDelay="0.00" arrival="162.60" arrivalLane="c2w_1" arrivalPos="990.00" arrivalPosLat="0.00" arrivalSpeed="14.54" duration="144.60" routeLength="1986.69" waitingTime="0.00" waitingCount="0" stopTime="0.00" timeLoss="7.21" rerouteNo="1" devices="tripinfo_car_n2w_18 routing_car_n2w_18" vType="Car" speedFactor="1.05" vaporized=""/>
    <tripinfo id="car_s2w_6" depart="6.00" departLane="s2sep_1" departPos="3.60" departPosLat="0.00" departSpeed="13.90" departDelay="0.00" arrival="166.30" arrivalLane="c2w_1" arrivalPos="990.00" arrivalPosLat="0.00" arrivalSpeed="14.70" duration="160.30" routeLength="1996.47" waitingTime="12.75" waitingCount="1" stopTime="0.00" timeLoss="24.14" rerouteNo="1" devices="tripinfo_car_s2w_6 routing_car_s2w_6" vType="Car" speedFactor="1.06" vaporized=""/>
    <tripinfo id="car_s2e_23" depart="23.00" departLane="s2sep_1" departPos="3.60" departPosLat="0.00" departSpeed="13.90" departDelay="0.00" arrival="166.60" arrivalLane="c2e_1" arrivalPos="990.00" arrivalPosLat="0.00" arrivalSpeed="14.32" duration="143.60" routeLength="1986.69" waitingTime="0.00" waitingCount="0" stopTime="0.00" timeLoss="4.14" rerouteNo="1" devices="tripinfo_car_s2e_23 routing_car_s2e_23" vType="Car" speedFactor="1.03" vaporized=""/>
    <tripinfo id="car_n2e_18" depart="19.40" departLane="n2sep_1" departPos="3.60" departPosLat="0.00" departSpeed="13.90" departDelay="1.40" arrival="171.80" arrivalLane="c2e_1" arrivalPos="990.00" arrivalPosLat="0.00" arrivalSpeed="14.04" duration="152.40" routeLength="1996.47" waitingTime="0.00" waitingCount="0" stopTime="0.00" timeLoss="9.53" rerouteNo="1" devices="tripinfo_car_n2e_18 routing_car_n2e_18" vType="Car" speedFactor="1.01" vaporized=""/>
    <tripinfo id="car_n2s_46" depart="46.00" departLane="n2sep_1" departPos="3.60" departPosLat="0.00" departSpeed="13.90" departDelay="0.00" arrival="174.25" arrivalLane="c2s_1" arrivalPos="990.00" arrivalPosLat="0.00" arrivalSpeed="15.61" duration="128.25" routeLength="1997.01" waitingTime="0.00" waitingCount="0" stopTime="0.00" timeLoss="0.29" rerouteNo="1" devices="tripinfo_car_n2s_46 routing_car_n2s_46" vType="Car" speedFactor="1.12" vaporized=""/>
    <tripinfo id="car_s2w_40" depart="40.00" departLane="s2sep_1" departPos="3.60" departPosLat="0.00" departSpeed="13.90" departDelay="0.00" arrival="181.45" arrivalLane="c2w_1" arrivalPos="990.00" arrivalPosLat="0.00" arrivalSpeed="14.55" duration="141.45" routeLength="1996.47" waitingTime="0.00" waitingCount="0" stopTime="0.00" timeLoss="3.60" rerouteNo="1" devices="tripinfo_car_s2w_40 routing_car_s2w_40" vType="Car" speedFactor="1.05" vaporized=""/>
    <tripinfo id="car_n2e_47" depart="47.30" departLane="n2sep_1" departPos="3.60" departPosLat="0.00" departSpeed="13.90" departDelay="0.30" arrival="197.55" arrivalLane="c2e_1" arrivalPos="990.00" arrivalPosLat="0.00" arrivalSpeed="13.90" duration="150.25" routeLength="1996.47" waitingTime="0.00" waitingCount="0" stopTime="0.00" timeLoss="5.94" rerouteNo="1" devices="tripinfo_car_n2e_47 routing_car_n2e_47" vType="Car" speedFactor="1.00" vaporized=""/>
    <tripinfo id="car_n2e_48" depart="49.05" departLane="n2sep_1" departPos="3.60" departPosLat="0.00" departSpeed="13.90" departDelay="1.05" arrival="200.55" arrivalLane="c2e_1" arrivalPos="990.00" arrivalPosLat="0.00" arrivalSpeed="14.45" duration="151.50" routeLength="1996.47" waitingTime="0.00" waitingCount="0" stopTime="0.00" timeLoss="13.49" rerouteNo="1" devices="tripinfo_car_n2e_48 routing_car_n2e_48" vType="Car" speedFactor="1.05" vaporized=""/>
    <tripinfo id="car_e2n_11" depart="11.00" departLane="e2sep_1" departPos="3.60" departPosLat="0.00" departSpeed="13.90" departDelay="0.00" arrival="208.55" arrivalLane="c2n_1" arrivalPos="990.00" arrivalPosLat="0.00" arrivalSpeed="14.32" duration="197.55" routeLength="1986.69" waitingTime="49.15" waitingCount="1" stopTime="0.00" timeLoss="58.13" rerouteNo="1" devices="tripinfo_car_e2n_11 routing_car_e2n_11" vType="Car" speedFactor="1.03" vaporized=""/>
    <tripinfo id="car_e2n_35" depart="35.00" departLane="e2sep_1" departPos="3.60" departPosLat="0.00" departSpeed="13.90" departDelay="0.00" arrival="212.65" arrivalLane="c2n_1" arrivalPos="990.00" arrivalPosLat="0.00" arrivalSpeed="15.14" duration="177.65" routeLength="1986.69" waitingTime="33.70" waitingCount="1" stopTime="0.00" timeLoss="45.92" rerouteNo="1" devices="tripinfo_car_e2n_35 routing_car_e2n_35" vType="Car" speedFactor="1.09" vaporized=""/>
    <tripinfo id="car_e2w_13" depart="13.00" departLane="e2sep_1" departPos="3.60" departPosLat="0.00" departSpeed="13.90" departDelay="0.00" arrival="212.80" arrivalLane="c2w_1" arrivalPos="990.00" arrivalPosLat="0.00" arrivalSpeed="13.90" duration="199.80" routeLength="1997.01" waitingTime="45.80" waitingCount="1" stopTime="0.00" timeLoss="56.12" rerouteNo="1" devices="tripinfo_car_e2w_13 routing_car_e2w_13" vType="Car" speedFactor="1.00" vaporized=""/>
    <tripinfo id="bus_w2s_15" depart="15.00" departLane="w2sep_1" departPos="12.10" departPosLat="0.00" departSpeed="13.90" departDelay="0.00" arrival="213.90" arrivalLane="c2s_1" arrivalPos="990.00" arrivalPosLat="0.00" arrivalSpeed="13.90" duration="198.90" routeLength="1978.19" waitingTime="45.55" waitingCount="1" stopTime="0.00" timeLoss="55.86" rerouteNo="1" devices="tripinfo_bus_w2s_15 routing_bus_w2s_15" vType="Bus" speedFactor="1.00" vaporized=""/>
    <tripinfo id="car_e2w_23" depart="23.00" departLane="e2sep_1" departPos="3.60" departPosLat="0.00" departSpeed="13.90" departDelay="0.00" arrival="215.20" arrivalLane="c2w_1" arrivalPos="990.00" arrivalPosLat="0.00" arrivalSpeed="14.81" duration="192.20" routeLength="1997.01" waitingTime="43.60" waitingCount="1" stopTime="0.00" timeLoss="59.49" rerouteNo="1" devices="tripinfo_car_e2w_23 routing_car_e2w_23" vType="Car" speedFactor="1.08" vaporized=""/>
    <tripinfo id="car_e2s_56" depart="56.00" departLane="e2sep_1" departPos="3.60" departPosLat="0.00" departSpeed="13.90" departDelay="0.00" arrival="216.35" arrivalLane="c2s_1" arrivalPos="990.00" arrivalPosLat="0.00" arrivalSpeed="15.58" duration="160.35" routeLength="1996.47" waitingTime="14.35" waitingCount="2" stopTime="0.00" timeLoss="35.76" rerouteNo="1" devices="tripinfo_car_e2s_56 routing_car_e2s_56" vType="Car" speedFactor="1.16" vaporized=""/>
    <tripinfo id="car_e2w_37" depart="37.00" departLane="e2sep_1" departPos="3.60" departPosLat="0.00" departSpeed="13.90" departDelay="0.00" arrival="219.15" arrivalLane="c2w_1" arrivalPos="990.00" arrivalPosLat="0.00" arrivalSpeed="14.25" duration="182.15" routeLength="1997.01" waitingTime="28.35" waitingCount="1" stopTime="0.00" timeLoss="42.12" rerouteNo="1" devices="tripinfo_car_e2w_37 routing_car_e2w_37" vType="Car" speedFactor="1.03" vaporized=""/>
    <tripinfo id="car_w2e_77" depart="77.00" departLane="w2sep_1" departPos="3.60" departPosLat="0.00" departSpeed="13.90" departDelay="0.00" arrival="221.10" arrivalLane="c2e_1" arrivalPos="990.00" arrivalPosLat="0.00" arrivalSpeed="13.90" duration="144.10" routeLength="1997.01" waitingTime="0.00" waitingCount="0" stopTime="0.00" timeLoss="0.43" rerouteNo="1" devices="tripinfo_car_w2e_77 routing_car_w2e_77" vType="Car" speedFactor="1.00" vaporized=""/>
    <tripinfo id="bus_w2n_51" depart="51.00" departLane="w2sep_1" departPos="12.10" departPosLat="0.00" departSpeed="13.90" departDelay="0.00" arrival="225.65" arrivalLane="c2n_1" arrivalPos="990.00" arrivalPosLat="0.00" arrivalSpeed="13.90" duration="174.65" routeLength="1987.97" waitingTime="15.80" waitingCount="2" stopTime="0.00" timeLoss="30.95" rerouteNo="1" devices="tripinfo_bus_w2n_51 routing_bus_w2n_51" vType="Bus" speedFactor="1.00" vaporized=""/>
    <tripinfo id="car_w2n_52" depart="52.45" departLane="w2sep_1" departPos="3.60" departPosLat="0.00" departSpeed="13.90" departDelay="0.45" arrival="230.50" arrivalLane="c2n_1" arrivalPos="990.00" arrivalPosLat="0.00" arrivalSpeed="13.89" duration="178.05" routeLength="1996.47" waitingTime="12.10" waitingCount="2" stopTime="0.00" timeLoss="33.71" rerouteNo="1" devices="tripinfo_car_w2n_52 routing_car_w2n_52" vType="Car" speedFactor="1.00" vaporized=""/>
    <tripinfo id="car_e2w_88" depart="88.00" departLane="e2sep_1" departPos="3.60" departPosLat="0.00" departSpeed="13.90" departDelay="0.00" arrival="231.35" arrivalLane="c2w_1" arrivalPos="990.00" arrivalPosLat="0.00" arrivalSpeed="13.97" duration="143.35" routeLength="1997.01" waitingTime="0.00" waitingCount="0" stopTime="0.00" timeLoss="0.40" rerouteNo="1" devices="tripinfo_car_e2w_88 routing_car_e2w_88" vType="Car" speedFactor="1.01" vaporized=""/>
    <tripinfo id="car_w2n_102" depart="102.00" departLane="w2sep_1" departPos="3.60" departPosLat="0.00" departSpeed="13.90" departDelay="0.00" arrival="233.10" arrivalLane="c2n_1" arrivalPos="990.00" arrivalPosLat="0.00" arrivalSpeed="15.87" duration="131.10" routeLength="1996.47" waitingTime="0.00" waitingCount="0" stopTime="0.00" timeLoss="6.49" rerouteNo="1" devices="tripinfo_car_w2n_102 routing_car_w2n_102" vType="Car" speedFactor="1.16" vaporized=""/>
    <tripinfo id="car_w2s_91" depart="91.00" departLane="w2sep_1" departPos="3.60" departPosLat="0.00" departSpeed="13.90" departDelay="0.00" arrival="238.25" arrivalLane="c2s_1" arrivalPos="990.00" arrivalPosLat="0.00" arrivalSpeed="13.90" duration="147.25" routeLength="1986.69" waitingTime="0.00" waitingCount="0" stopTime="0.00" timeLoss="3.57" rerouteNo="1" devices="tripinfo_car_w2s_91 routing_car_w2s_91" vType="Car" speedFactor="1.00" vaporized=""/>
    <tripinfo id="car_n2w_76" depart="76.00" departLane="n2sep_1" departPos="3.60" departPosLat="0.00" departSpeed="13.90" departDelay="0.00" arrival="252.55" arrivalLane="c2w_1" arrivalPos="990.00" arrivalPosLat="0.00" arrivalSpeed="15.61" duration="176.55" routeLength="1986.69" waitingTime="38.10" waitingCount="1" stopTime="0.00" timeLoss="48.62" rerouteNo="1" devices="tripinfo_car_n2w_76 routing_car_n2w_76" vType="Car" speedFactor="1.12" vaporized=""/>
    <tripinfo id="car_s2e_52" depart="52.00" departLane="s2sep_1" departPos="3.60" departPosLat="0.00" departSpeed="13.90" departDelay="0.00" arrival="255.65" arrivalLane="c2e_1" arrivalPos="990.00" arrivalPosLat="0.00" arrivalSpeed="13.90" duration="203.65" routeLength="1986.69" waitingTime="53.25" waitingCount="1" stopTime="0.00" timeLoss="59.96" rerouteNo="1" devices="tripinfo_car_s2e_52 routing_car_s2e_52" vType="Car" speedFactor="1.00" vaporized=""/>
    <tripinfo id="car_n2s_53" depart="53.00" departLane="n2sep_1" departPos="3.60" departPosLat="0.00" departSpeed="13.90" departDelay="0.00" arrival="255.75" arrivalLane="c2s_1" arrivalPos="990.00" arrivalPosLat="0.00" arrivalSpeed="13.90" duration="202.75" routeLength="1997.01" waitingTime="50.45" waitingCount="1" stopTime="0.00" timeLoss="59.07" rerouteNo="1" devices="tripinfo_car_n2s_53 routing_car_n2s_53" vType="Car" speedFactor="1.00" vaporized=""/>
    <tripinfo id="car_s2n_60" depart="60.00" departLane="s2sep_1" departPos="3.60" departPosLat="0.00" departSpeed="13.90" departDelay="0.00" arrival="256.55" arrivalLane="c2n_1" arrivalPos="990.00" arrivalPosLat="0.00" arrivalSpeed="14.15" duration="196.55" routeLength="1997.01" waitingTime="46.95" waitingCount="1" stopTime="0.00" timeLoss="55.44" rerouteNo="1" devices="tripinfo_car_s2n_60 routing_car_s2n_60" vType="Car" speedFactor="1.02" vaporized=""/>
    <tripinfo id="car_n2s_65" depart="65.00" departLane="n2sep_1" departPos="3.60" departPosLat="0.00" departSpeed="13.90" departDelay="0.00" arrival="258.10" arrivalLane="c2s_1" arrivalPos="990.00" arrivalPosLat="0.00" arrivalSpeed="14.89" duration="193.10" routeLength="1997.01" waitingTime="42.20" waitingCount="1" stopTime="0.00" timeLoss="61.34" rerouteNo="1" devices="tripinfo_car_n2s_65 routing_car_n2s_65" vType="Car" speedFactor="1.09" vaporized=""/>
    <tripinfo id="car_n2w_100" depart="100.00" departLane="n2sep_1" departPos="3.60" departPosLat="0.00" departSpeed="13.90" departDelay="0.00" arrival="258.75" arrivalLane="c2w_1" arrivalPos="990.00" arrivalPosLat="0.00" arrivalSpeed="15.32" duration="158.75" routeLength="1986.69" waitingTime="9.60" waitingCount="1" stopTime="0.00" timeLoss="28.41" rerouteNo="1" devices="tripinfo_car_n2w_100 routing_car_n2w_100" vType="Car" speedFactor="1.10" vaporized=""/>
    <tripinfo id="car_s2e_71" depart="71.00" departLane="s2sep_1" departPos="3.60" departPosLat="0.00" departSpeed="13.90" departDelay="0.00" arrival="259.90" arrivalLane="c2e_1" arrivalPos="990.00" arrivalPosLat="0.00" arrivalSpeed="14.25" duration="188.90" routeLength="1986.69" waitingTime="37.65" waitingCount="1" stopTime="0.00" timeLoss="48.91" rerouteNo="1" devices="tripinfo_car_s2e_71 routing_car_s2e_71" vType="Car" speedFactor="1.03" vaporized=""/>
    <tripinfo id="car_n2s_89" depart="89.00" departLane="n2sep_1" departPos="3.60" departPosLat="0.00" departSpeed="13.90" departDelay="0.00" arrival="260.00" arrivalLane="c2s_1" arrivalPos="990.00" arrivalPosLat="0.00" arrivalSpeed="15.58" duration="171.00" routeLength="1997.01" waitingTime="28.80" waitingCount="1" stopTime="0.00" timeLoss="48.36" rerouteNo="1" devices="tripinfo_car_n2s_89 routing_car_n2s_89" vType="Car" speedFactor="1.17" vaporized=""/>
    <tripinfo id="car_s2e_74" depart="74.00" departLane="s2sep_1" departPos="3.60" departPosLat="0.00" departSpeed="13.90" departDelay="0.00" arrival="263.05" arrivalLane="c2e_1" arrivalPos="990.00" arrivalPosLat="0.00" arrivalSpeed="14.49" duration="189.05" routeLength="1986.69" waitingTime="35.65" waitingCount="1" stopTime="0.00" timeLoss="51.81" rerouteNo="1" devices="tripinfo_car_s2e_74 routing_car_s2e_74" vType="Car" speedFactor="1.05" vaporized=""/>
    <tripinfo id="car_s2e_85" depart="86.50" departLane="s2sep_1" departPos="3.60" departPosLat="0.00" departSpeed="13.90" departDelay="1.50" arrival="264.90" arrivalLane="c2e_1" arrivalPos="990.00" arrivalPosLat="0.00" arrivalSpeed="15.60" duration="178.40" routeLength="1986.69" waitingTime="22.00" waitingCount="1" stopTime="0.00" timeLoss="56.49" rerouteNo="1" devices="tripinfo_car_s2e_85 routing_car_s2e_85" vType="Car" speedFactor="1.18" vaporized=""/>
    <tripinfo id="car_s2e_86" depart="88.20" departLane="s2sep_1" departPos="3.60" departPosLat="0.00" departSpeed="13.90" departDelay="2.20" arrival="266.90" arrivalLane="c2e_1" arrivalPos="990.00" arrivalPosLat="0.00" arrivalSpeed="15.52" duration="178.70" routeLength="1986.69" waitingTime="21.30" waitingCount="1" stopTime="0.00" timeLoss="54.27" rerouteNo="1" devices="tripinfo_car_s2e_86 routing_car_s2e_86" vType="Car" speedFactor="1.15" vaporized=""/>
    <tripinfo id="car_s2w_79" depart="79.00" departLane="s2sep_1" departPos="3.60" departPosLat="0.00" departSpeed="13.90" departDelay="0.00" arrival="268.20" arrivalLane="c2w_1" arrivalPos="990.00" arrivalPosLat="0.00" arrivalSpeed="13.90" duration="189.20" routeLength="1996.47" waitingTime="32.95" waitingCount="2" stopTime="0.00" timeLoss="44.89" rerouteNo="1" devices="tripinfo_car_s2w_79 routing_car_s2w_79" vType="Car" speedFactor="1.00" vaporized=""/>
    <tripinfo id="car_s2w_82" depart="82.00" departLane="s2sep_1" departPos="3.60" departPosLat="0.00" departSpeed="13.90" departDelay="0.00" arrival="270.25" arrivalLane="c2w_1" arrivalPos="990.00" arrivalPosLat="0.00" arrivalSpeed="15.20" duration="188.25" routeLength="1996.47" waitingTime="31.05" waitingCount="2" stopTime="0.00" timeLoss="60.73" rerouteNo="1" devices="tripinfo_car_s2w_82 routing_car_s2w_82" vType="Car" speedFactor="1.13" vaporized=""/>
    <tripinfo id="car_s2e_93" depart="93.00" departLane="s2sep_1" departPos="3.60" departPosLat="0.00" departSpeed="13.90" departDelay="0.00" arrival="270.85" arrivalLane="c2e_1" arrivalPos="990.00" arrivalPosLat="0.00" arrivalSpeed="14.16" duration="177.85" routeLength="1986.69" waitingTime="19.00" waitingCount="1" stopTime="0.00" timeLoss="36.93" rerouteNo="1" devices="tripinfo_car_s2e_93 routing_car_s2e_93" vType="Car" speedFactor="1.02" vaporized=""/>
    <tripinfo id="car_s2e_105" depart="105.00" departLane="s2sep_1" departPos="3.60" departPosLat="0.00" departSpeed="13.90" departDelay="0.00" arrival="273.10" arrivalLane="c2e_1" arrivalPos="990.00" arrivalPosLat="0.00" arrivalSpeed="14.88" duration="168.10" routeLength="1986.69" waitingTime="9.70" waitingCount="1" stopTime="0.00" timeLoss="36.54" rerouteNo="1" devices="tripinfo_car_s2e_105 routing_car_s2e_105" vType="Car" speedFactor="1.09" vaporized=""/>
    <tripinfo id="car_s2w_85" depart="85.00" departLane="s2sep_1" departPos="3.60" departPosLat="0.00" departSpeed="13.90" departDelay="0.00" arrival="274.60" arrivalLane="c2w_1" arrivalPos="990.00" arrivalPosLat="0.00" arrivalSpeed="13.89" duration="189.60" routeLength="1996.47" waitingTime="25.25" waitingCount="2" stopTime="0.00" timeLoss="45.28" rerouteNo="1" devices="tripinfo_car_s2w_85 routing_car_s2w_85" vType="Car" speedFactor="1.00" vaporized=""/>
    <tripinfo id="car_s2w_99" depart="99.00" departLane="s2sep_1" departPos="3.60" departPosLat="0.00" departSpeed="13.90" departDelay="0.00" arrival="276.40" arrivalLane="c2w_1" arrivalPos="990.00" arrivalPosLat="0.00" arrivalSpeed="15.42" duration="177.40" routeLength="1996.47" waitingTime="16.85" waitingCount="2" stopTime="0.00" timeLoss="55.04" rerouteNo="1" devices="tripinfo_car_s2w_99 routing_car_s2w_99" vType="Car" speedFactor="1.18" vaporized=""/>
    <tripinfo id="car_n2e_62" depart="62.00" departLane="n2sep_1" departPos="3.60" departPosLat="0.00" departSpeed="13.90" departDelay="0.00" arrival="276.90" arrivalLane="c2e_1" arrivalPos="990.00" arrivalPosLat="0.00" arrivalSpeed="14.02" duration="214.90" routeLength="1996.47" waitingTime="58.50" waitingCount="2" stopTime="0.00" timeLoss="72.03" rerouteNo="1" devices="tripinfo_car_n2e_62 routing_car_n2e_62" vType="Car" speedFactor="1.01" vaporized=""/>
    <tripinfo id="car_s2n_135" depart="135.00" departLane="s2sep_1" departPos="3.60" departPosLat="0.00" departSpeed="13.90" departDelay="0.00" arrival="277.00" arrivalLane="c2n_1" arrivalPos="990.00" arrivalPosLat="0.00" arrivalSpeed="14.13" duration="142.00" routeLength="1997.01" waitingTime="0.00" waitingCount="0" stopTime="0.00" timeLoss="0.68" rerouteNo="1" devices="tripinfo_car_s2n_135 routing_car_s2n_135" vType="Car" speedFactor="1.02" vaporized=""/>
    <tripinfo id="car_s2w_103" depart="103.00" departLane="s2sep_1" departPos="3.60" departPosLat="0.00" departSpeed="13.90" departDelay="0.00" arrival="279.35" arrivalLane="c2w_1" arrivalPos="990.00" arrivalPosLat="0.00" arrivalSpeed="14.25" duration="176.35" routeLength="1996.47" waitingTime="11.25" waitingCount="2" stopTime="0.00" timeLoss="36.28" rerouteNo="1" devices="tripinfo_car_s2w_103 routing_car_s2w_103" vType="Car" speedFactor="1.03" vaporized=""/>
    <tripinfo id="car_n2e_98" depart="98.00" departLane="n2sep_1" departPos="3.60" departPosLat="0.00" departSpeed="13.90" departDelay="0.00" arrival="282.30" arrivalLane="c2e_1" arrivalPos="990.00" arrivalPosLat="0.00" arrivalSpeed="13.90" duration="184.30" routeLength="1996.47" waitingTime="23.05" waitingCount="3" stopTime="0.00" timeLoss="39.98" rerouteNo="1" devices="tripinfo_car_n2e_98 routing_car_n2e_98" vType="Car" speedFactor="1.00" vaporized=""/>
    <tripinfo id="car_n2e_111" depart="111.00" departLane="n2sep_1" departPos="3.60" departPosLat="0.00" departSpeed="13.90" departDelay="0.00" arrival="285.15" arrivalLane="c2e_1" arrivalPos="990.00" arrivalPosLat="0.00" arrivalSpeed="14.40" duration="174.15" routeLength="1996.47" waitingTime="11.75" waitingCount="1" stopTime="0.00" timeLoss="35.83" rerouteNo="1" devices="tripinfo_car_n2e_111 routing_car_n2e_111" vType="Car" speedFactor="1.04" vaporized=""/>
    <tripinfo id="car_n2e_123" depart="123.00" departLane="n2sep_1" departPos="3.60" departPosLat="0.00" departSpeed="13.90" departDelay="0.00" arrival="289.40" arrivalLane="c2e_1" arrivalPos="990.00" arrivalPosLat="0.00" arrivalSpeed="13.89" duration="166.40" routeLength="1996.47" waitingTime="5.80" waitingCount="1" stopTime="0.00" timeLoss="22.05" rerouteNo="1" devices="tripinfo_car_n2e_123 routing_car_n2e_123" vType="Car" speedFactor="1.00" vaporized=""/>
    <tripinfo id="car_n2e_147" depart="147.00" departLane="n2sep_1" departPos="3.60" departPosLat="0.00" departSpeed="13.90" departDelay="0.00" arrival="295.45" arrivalLane="c2e_1" arrivalPos="990.00" arrivalPosLat="0.00" arrivalSpeed="13.90" duration="148.45" routeLength="1996.47" waitingTime="0.00" waitingCount="0" stopTime="0.00" timeLoss="4.11" rerouteNo="1" devices="tripinfo_car_n2e_147 routing_car_n2e_147" vType="Car" speedFactor="1.00" vaporized=""/>
    <tripinfo id="car_w2e_114" depart="114.00" departLane="w2sep_1" departPos="3.60" departPosLat="0.00" departSpeed="13.90" departDelay="0.00" arrival="297.90" arrivalLane="c2e_1" arrivalPos="990.00" arrivalPosLat="0.00" arrivalSpeed="14.90" duration="183.90" routeLength="1997.01" waitingTime="41.45" waitingCount="1" stopTime="0.00" timeLoss="51.84" rerouteNo="1" devices="tripinfo_car_w2e_114 routing_car_w2e_114" vType="Car" speedFactor="1.09" vaporized=""/>
    <tripinfo id="car_e2n_105" depart="105.00" departLane="e2sep_1" departPos="3.60" departPosLat="0.00" departSpeed="13.90" departDelay="0.00" arrival="299.40" arrivalLane="c2n_1" arrivalPos="990.00" arrivalPosLat="0.00" arrivalSpeed="14.15" duration="194.40" routeLength="1986.69" waitingTime="46.40" waitingCount="1" stopTime="0.00" timeLoss="53.30" rerouteNo="1" devices="tripinfo_car_e2n_105 routing_car_e2n_105" vType="Car" speedFactor="1.02" vaporized=""/>
    <tripinfo id="car_w2e_130" depart="130.00" departLane="w2sep_1" departPos="3.60" departPosLat="0.00" departSpeed="13.90" departDelay="0.00" arrival="299.85" arrivalLane="c2e_1" arrivalPos="990.00" arrivalPosLat="0.00" arrivalSpeed="15.63" duration="169.85" routeLength="1997.01" waitingTime="30.40" waitingCount="1" stopTime="0.00" timeLoss="46.94" rerouteNo="1" devices="tripinfo_car_w2e_130 routing_car_w2e_130" vType="Car" speedFactor="1.17" vaporized=""/>
    <tripinfo id="car_e2w_108" depart="108.00" departLane="e2sep_1" departPos="3.60" departPosLat="0.00" departSpeed="13.90" departDelay="0.00" arrival="300.30" arrivalLane="c2w_1" arrivalPos="990.00" arrivalPosLat="0.00" arrivalSpeed="14.42" duration="192.30" routeLength="1997.01" waitingTime="43.70" waitingCount="1" stopTime="0.00" timeLoss="53.83" rerouteNo="1" devices="tripinfo_car_e2w_108 routing_car_e2w_108" vType="Car" speedFactor="1.04" vaporized=""/>
    <tripinfo id="car_e2n_163" depart="163.00" departLane="e2sep_1" departPos="3.60" departPosLat="0.00" departSpeed="13.90" departDelay="0.00" arrival="301.35" arrivalLane="c2n_1" arrivalPos="990.00" arrivalPosLat="0.00" arrivalSpeed="15.67" duration="138.35" routeLength="1986.69" waitingTime="0.00" waitingCount="0" stopTime="0.00" timeLoss="16.42" rerouteNo="1" devices="tripinfo_car_e2n_163 routing_car_e2n_163" vType="Car" speedFactor="1.18" vaporized=""/>
    <tripinfo id="car_w2s_142" depart="142.00" departLane="w2sep_1" departPos="3.60" departPosLat="0.00" departSpeed="13.90" departDelay="0.00" arrival="304.95" arrivalLane="c2s_1" arrivalPos="990.00" arrivalPosLat="0.00" arrivalSpeed="13.94" duration="162.95" routeLength="1986.69" waitingTime="10.00" waitingCount="1" stopTime="0.00" timeLoss="19.73" rerouteNo="1" devices="tripinfo_car_w2s_142 routing_car_w2s_142" vType="Car" speedFactor="1.00" vaporized=""/>
    <tripinfo id="car_w2n_137" depart="137.00" departLane="w2sep_1" departPos="3.60" departPosLat="0.00" departSpeed="13.90" departDelay="0.00" arrival="305.60" arrivalLane="c2n_1" arrivalPos="990.00" arrivalPosLat="0.00" arrivalSpeed="15.21" duration="168.60" routeLength="1996.47" waitingTime="24.10" waitingCount="2" stopTime="0.00" timeLoss="36.91" rerouteNo="1" devices="tripinfo_car_w2n_137 routing_car_w2n_137" vType="Car" speedFactor="1.10" vaporized=""/>
    <tripinfo id="car_e2w_115" depart="115.00" departLane="e2sep_1" departPos="3.60" departPosLat="0.00" departSpeed="13.90" departDelay="0.00" arrival="305.80" arrivalLane="c2w_1" arrivalPos="990.00" arrivalPosLat="0.00" arrivalSpeed="14.04" duration="190.80" routeLength="1997.01" waitingTime="37.45" waitingCount="1" stopTime="0.00" timeLoss="48.55" rerouteNo="1" devices="tripinfo_car_e2w_115 routing_car_e2w_115" vType="Car" speedFactor="1.01" vaporized=""/>
    <tripinfo id="car_w2s_163" depart="163.00" departLane="w2sep_1" departPos="3.60" departPosLat="0.00" departSpeed="13.90" departDelay="0.00" arrival="311.20" arrivalLane="c2s_1" arrivalPos="990.00" arrivalPosLat="0.00" arrivalSpeed="13.90" duration="148.20" routeLength="1986.69" waitingTime="0.00" waitingCount="0" stopTime="0.00" timeLoss="4.57" rerouteNo="1" devices="tripinfo_car_w2s_163 routing_car_w2s_163" vType="Car" speedFactor="1.00" vaporized=""/>
    <tripinfo id="car_e2s_119" depart="119.00" departLane="e2sep_1" departPos="3.60" departPosLat="0.00" departSpeed="13.90" departDelay="0.00" arrival="315.60" arrivalLane="c2s_1" arrivalPos="990.00" arrivalPosLat="0.00" arrivalSpeed="13.89" duration="196.60" routeLength="1996.47" waitingTime="38.65" waitingCount="2" stopTime="0.00" timeLoss="52.24" rerouteNo="1" devices="tripinfo_car_e2s_119 routing_car_e2s_119" vType="Car" speedFactor="1.00" vaporized=""/>
    <tripinfo id="car_e2s_128" depart="128.00" departLane="e2sep_1" departPos="3.60" departPosLat="0.00" departSpeed="13.90" departDelay="0.00" arrival="319.20" arrivalLane="c2s_1" arrivalPos="990.00" arrivalPosLat="0.00" arrivalSpeed="13.87" duration="191.20" routeLength="1996.47" waitingTime="30.35" waitingCount="2" stopTime="0.00" timeLoss="46.87" rerouteNo="1" devices="tripinfo_car_e2s_128 routing_car_e2s_128" vType="Car" speedFactor="1.00" vaporized=""/>
    <tripinfo id="car_e2s_129" depart="129.45" departLane="e2sep_1" departPos="3.60" departPosLat="0.00" departSpeed="13.90" departDelay="0.45" arrival="322.45" arrivalLane="c2s_1" arrivalPos="990.00" arrivalPosLat="0.00" arrivalSpeed="13.86" duration="193.00" routeLength="1996.47" waitingTime="25.40" waitingCount="2" stopTime="0.00" timeLoss="48.67" rerouteNo="1" devices="tripinfo_car_e2s_129 routing_car_e2s_129" vType="Car" speedFactor="1.00" vaporized=""/>
    <tripinfo id="car_e2n_176" depart="176.00" departLane="e2sep_1" departPos="3.60" departPosLat="0.00" departSpeed="13.90" departDelay="0.00" arrival="322.60" arrivalLane="c2n_1" arrivalPos="990.00" arrivalPosLat="0.00" arrivalSpeed="13.97" duration="146.60" routeLength="1986.69" waitingTime="0.00" waitingCount="0" stopTime="0.00" timeLoss="3.67" rerouteNo="1" devices="tripinfo_car_e2n_176 routing_car_e2n_176" vType="Car" speedFactor="1.01" vaporized=""/>
    <tripinfo id="car_e2s_148" depart="148.00" departLane="e2sep_1" departPos="3.60" departPosLat="0.00" departSpeed="13.90" departDelay="0.00" arrival="325.10" arrivalLane="c2s_1" arrivalPos="990.00" arrivalPosLat="0.00" arrivalSpeed="14.10" duration="177.10" routeLength="1996.47" waitingTime="11.30" waitingCount="2" stopTime="0.00" timeLoss="36.08" rerouteNo="1" devices="tripinfo_car_e2s_148 routing_car_e2s_148" vType="Car" speedFactor="1.02" vaporized=""/>
    <tripinfo id="car_w2e_189" depart="189.00" departLane="w2sep_1" departPos="3.60" departPosLat="0.00" departSpeed="13.90" departDelay="0.00" arrival="325.85" arrivalLane="c2e_1" arrivalPos="990.00" arrivalPosLat="0.00" arrivalSpeed="14.67" duration="136.85" routeLength="1997.01" waitingTime="0.00" waitingCount="0" stopTime="0.00" timeLoss="0.74" rerouteNo="1" devices="tripinfo_car_w2e_189 routing_car_w2e_189" vType="Car" speedFactor="1.06" vaporized=""/>
    <tripinfo id="car_e2w_185" depart="185.00" departLane="e2sep_1" departPos="3.60" departPosLat="0.00" departSpeed="13.90" departDelay="0.00" arrival="326.15" arrivalLane="c2w_1" arrivalPos="990.00" arrivalPosLat="0.00" arrivalSpeed="14.21" duration="141.15" routeLength="1997.01" waitingTime="0.00" waitingCount="0" stopTime="0.00" timeLoss="0.58" rerouteNo="1" devices="tripinfo_car_e2w_185 routing_car_e2w_185" vType="Car" speedFactor="1.02" vaporized=""/>
    <tripinfo id="car_e2s_149" depart="149.40" departLane="e2sep_1" departPos="3.60" departPosLat="0.00" departSpeed="13.90" departDelay="0.40" arrival="327.20" arrivalLane="c2s_1" arrivalPos="990.00" arrivalPosLat="0.00" arrivalSpeed="14.65" duration="177.80" routeLength="1996.47" waitingTime="9.75" waitingCount="2" stopTime="0.00" timeLoss="44.46" rerouteNo="1" devices="tripinfo_car_e2s_149 routing_car_e2s_149" vType="Car" speedFactor="1.08" vaporized=""/>
    <tripinfo id="car_w2n_183" depart="183.00" departLane="w2sep_1" departPos="3.60" departPosLat="0.00" departSpeed="13.90" departDelay="0.00" arrival="328.75" arrivalLane="c2n_1" arrivalPos="990.00" arrivalPosLat="0.00" arrivalSpeed="14.45" duration="145.75" routeLength="1996.47" waitingTime="0.00" waitingCount="0" stopTime="0.00" timeLoss="6.98" rerouteNo="1" devices="tripinfo_car_w2n_183 routing_car_w2n_183" vType="Car" speedFactor="1.04" vaporized=""/>
    <tripinfo id="car_n2w_148" depart="148.45" departLane="n2sep_1" departPos="3.60" departPosLat="0.00" departSpeed="13.90" departDelay="0.45" arrival="337.10" arrivalLane="c2w_1" arrivalPos="990.00" arrivalPosLat="0.00" arrivalSpeed="15.88" duration="188.65" routeLength="1986.69" waitingTime="46.55" waitingCount="1" stopTime="0.00" timeLoss="62.91" rerouteNo="1" devices="tripinfo_car_n2w_148 routing_car_n2w_148" vType="Car" speedFactor="1.14" vaporized=""/>
    <tripinfo id="car_s2e_181" depart="181.00" departLane="s2sep_1" departPos="3.60" departPosLat="0.00" departSpeed="13.90" departDelay="0.00" arrival="337.85" arrivalLane="c2e_1" arrivalPos="990.00" arrivalPosLat="0.00" arrivalSpeed="16.29" duration="156.85" routeLength="1986.69" waitingTime="24.55" waitingCount="1" stopTime="0.00" timeLoss="34.26" rerouteNo="1" devices="tripinfo_car_s2e_181 routing_car_s2e_181" vType="Car" speedFactor="1.17" vaporized=""/>
    <tripinfo id="car_n2s_150" depart="151.85" departLane="n2sep_1" departPos="3.60" departPosLat="0.00" departSpeed="13.90" departDelay="1.85" arrival="340.45" arrivalLane="c2s_1" arrivalPos="990.00" arrivalPosLat="0.00" arrivalSpeed="15.56" duration="188.60" routeLength="1997.01" waitingTime="43.30" waitingCount="1" stopTime="0.00" timeLoss="60.23" rerouteNo="1" devices="tripinfo_car_n2s_150 routing_car_n2s_150" vType="Car" speedFactor="1.12" vaporized=""/>
    <tripinfo id="car_n2w_175" depart="175.00" departLane="n2sep_1" departPos="3.60" departPosLat="0.00" departSpeed="13.90" departDelay="0.00" arrival="341.95" arrivalLane="c2w_1" arrivalPos="990.00" arrivalPosLat="0.00" arrivalSpeed="16.04" duration="166.95" routeLength="1986.69" waitingTime="30.85" waitingCount="1" stopTime="0.00" timeLoss="42.50" rerouteNo="1" devices="tripinfo_car_n2w_175 routing_car_n2w_175" vType="Car" speedFactor="1.15" vaporized=""/>
    <tripinfo id="car_s2e_195" depart="195.00" departLane="s2sep_1" departPos="3.60" departPosLat="0.00" departSpeed="13.90" departDelay="0.00" arrival="342.75" arrivalLane="c2e_1" arrivalPos="990.00" arrivalPosLat="0.00" arrivalSpeed="16.39" duration="147.75" routeLength="1986.69" waitingTime="8.25" waitingCount="1" stopTime="0.00" timeLoss="25.96" rerouteNo="1" devices="tripinfo_car_s2e_195 routing_car_s2e_195" vType="Car" speedFactor="1.18" vaporized=""/>
    <tripinfo id="car_s2n_143" depart="143.00" departLane="s2sep_1" departPos="3.60" departPosLat="0.00" departSpeed="13.90" departDelay="0.00" arrival="345.75" arrivalLane="c2n_1" arrivalPos="990.00" arrivalPosLat="0.00" arrivalSpeed="13.90" duration="202.75" routeLength="1997.01" waitingTime="52.60" waitingCount="1" stopTime="0.00" timeLoss="59.07" rerouteNo="1" devices="tripinfo_car_s2n_143 routing_car_s2n_143" vType="Car" speedFactor="1.00" vaporized=""/>
    <tripinfo id="car_n2e_149" depart="150.10" departLane="n2sep_1" departPos="3.60" departPosLat="0.00" departSpeed="13.90" departDelay="1.10" arrival="349.60" arrivalLane="c2e_1" arrivalPos="990.00" arrivalPosLat="0.00" arrivalSpeed="15.73" duration="199.50" routeLength="1996.47" waitingTime="51.80" waitingCount="2" stopTime="0.00" timeLoss="71.98" rerouteNo="1" devices="tripinfo_car_n2e_149 routing_car_n2e_149" vType="Car" speedFactor="1.13" vaporized=""/>
    <tripinfo id="car_s2n_188" depart="188.00" departLane="s2sep_1" departPos="3.60" departPosLat="0.00" departSpeed="13.90" departDelay="0.00" arrival="350.00" arrivalLane="c2n_1" arrivalPos="990.00" arrivalPosLat="0.00" arrivalSpeed="14.16" duration="162.00" routeLength="1997.01" waitingTime="8.90" waitingCount="1" stopTime="0.00" timeLoss="21.07" rerouteNo="1" devices="tripinfo_car_s2n_188 routing_car_s2n_188" vType="Car" speedFactor="1.02" vaporized=""/>
    <tripinfo id="car_s2n_202" depart="202.00" departLane="s2sep_1" departPos="3.60" departPosLat="0.00" departSpeed="13.90" departDelay="0.00" arrival="352.25" arrivalLane="c2n_1" arrivalPos="990.00" arrivalPosLat="0.00" arrivalSpeed="15.01" duration="150.25" routeLength="1997.01" waitingTime="3.50" waitingCount="1" stopTime="0.00" timeLoss="19.89" rerouteNo="1" devices="tripinfo_car_s2n_202 routing_car_s2n_202" vType="Car" speedFactor="1.10" vaporized=""/>
    <tripinfo id="car_n2s_187" depart="187.00" departLane="n2sep_1" departPos="3.60" departPosLat="0.00" departSpeed="13.90" departDelay="0.00" arrival="352.35" arrivalLane="c2s_1" arrivalPos="990.00" arrivalPosLat="0.00" arrivalSpeed="13.90" duration="165.35" routeLength="1997.01" waitingTime="11.25" waitingCount="1" stopTime="0.00" timeLoss="21.64" rerouteNo="1" devices="tripinfo_car_n2s_187 routing_car_n2s_187" vType="Car" speedFactor="1.00" vaporized=""/>
    <tripinfo id="car_s2w_152" depart="152.00" departLane="s2sep_1" departPos="3.60" departPosLat="0.00" departSpeed="13.90" departDelay="0.00" arrival="355.80" arrivalLane="c2w_1" arrivalPos="990.00" arrivalPosLat="0.00" arrivalSpeed="14.12" duration="203.80" routeLength="1996.47" waitingTime="50.75" waitingCount="2" stopTime="0.00" timeLoss="61.69" rerouteNo="1" devices="tripinfo_car_s2w_152 routing_car_s2w_152" vType="Car" speedFactor="1.02" vaporized=""/>
    <tripinfo id="car_n2s_207" depart="207.00" departLane="n2sep_1" departPos="3.60" departPosLat="0.00" departSpeed="13.90" departDelay="0.00" arrival="356.30" arrivalLane="c2s_1" arrivalPos="990.00" arrivalPosLat="0.00" arrivalSpeed="13.98" duration="149.30" routeLength="1997.01" waitingTime="0.00" waitingCount="0" stopTime="0.00" timeLoss="6.67" rerouteNo="1" devices="tripinfo_car_n2s_207 routing_car_n2s_207" vType="Car" speedFactor="1.01" vaporized=""/>
    <tripinfo id="car_s2w_185" depart="185.00" departLane="s2sep_1" departPos="3.60" departPosLat="0.00" departSpeed="13.90" departDelay="0.00" arrival="359.85" arrivalLane="c2w_1" arrivalPos="990.00" arrivalPosLat="0.00" arrivalSpeed="14.20" duration="174.85" routeLength="1996.47" waitingTime="17.80" waitingCount="2" stopTime="0.00" timeLoss="33.75" rerouteNo="1" devices="tripinfo_car_s2w_185 routing_car_s2w_185" vType="Car" speedFactor="1.02" vaporized=""/>
    <tripinfo id="car_s2n_221" depart="221.00" departLane="s2sep_1" departPos="3.60" departPosLat="0.00" departSpeed="13.90" departDelay="0.00" arrival="361.05" arrivalLane="c2n_1" arrivalPos="990.00" arrivalPosLat="0.00" arrivalSpeed="14.32" duration="140.05" routeLength="1997.01" waitingTime="0.00" waitingCount="0" stopTime="0.00" timeLoss="0.59" rerouteNo="1" devices="tripinfo_car_s2n_221 routing_car_s2n_221" vType="Car" speedFactor="1.03" vaporized=""/>
    <tripinfo id="car_n2e_221" depart="221.00" departLane="n2sep_1" departPos="3.60" departPosLat="0.00" departSpeed="13.90" departDelay="0.00" arrival="366.35" arrivalLane="c2e_1" arrivalPos="990.00" arrivalPosLat="0.00" arrivalSpeed="14.13" duration="145.35" routeLength="1996.47" waitingTime="0.00" waitingCount="0" stopTime="0.00" timeLoss="3.43" rerouteNo="1" devices="tripinfo_car_n2e_221 routing_car_n2e_221" vType="Car" speedFactor="1.02" vaporized=""/>
    <tripinfo id="car_e2w_190" depart="190.00" departLane="e2sep_1" departPos="3.60" departPosLat="0.00" departSpeed="13.90" departDelay="0.00" arrival="390.70" arrivalLane="c2w_1" arrivalPos="990.00" arrivalPosLat="0.00" arrivalSpeed="13.90" duration="200.70" routeLength="1997.01" waitingTime="49.70" waitingCount="1" stopTime="0.00" timeLoss="57.02" rerouteNo="1" devices="tripinfo_car_e2w_190 routing_car_e2w_190" vType="Car" speedFactor="1.00" vaporized=""/>
    <tripinfo id="car_e2n_201" depart="201.00" departLane="e2sep_1" departPos="3.60" departPosLat="0.00" departSpeed="13.90" departDelay="0.00" arrival="390.75" arrivalLane="c2n_1" arrivalPos="990.00" arrivalPosLat="0.00" arrivalSpeed="14.35" duration="189.75" routeLength="1986.69" waitingTime="41.85" waitingCount="1" stopTime="0.00" timeLoss="50.60" rerouteNo="1" devices="tripinfo_car_e2n_201 routing_car_e2n_201" vType="Car" speedFactor="1.03" vaporized=""/>
    <tripinfo id="car_e2w_212" depart="212.00" departLane="e2sep_1" departPos="3.60" departPosLat="0.00" departSpeed="13.90" departDelay="0.00" arrival="393.15" arrivalLane="c2w_1" arrivalPos="990.00" arrivalPosLat="0.00" arrivalSpeed="14.88" duration="181.15" routeLength="1997.01" waitingTime="35.20" waitingCount="1" stopTime="0.00" timeLoss="48.93" rerouteNo="1" devices="tripinfo_car_e2w_212 routing_car_e2w_212" vType="Car" speedFactor="1.09" vaporized=""/>
    <tripinfo id="bus_w2e_199" depart="199.00" departLane="w2sep_1" departPos="12.10" departPosLat="0.00" departSpeed="13.90" departDelay="0.00" arrival="394.20" arrivalLane="c2e_1" arrivalPos="990.00" arrivalPosLat="0.00" arrivalSpeed="13.90" duration="195.20" routeLength="1988.51" waitingTime="41.45" waitingCount="1" stopTime="0.00" timeLoss="52.13" rerouteNo="1" devices="tripinfo_bus_w2e_199 routing_bus_w2e_199" vType="Bus" speedFactor="1.00" vaporized=""/>
    <tripinfo id="car_w2s_221" depart="221.00" departLane="w2sep_1" departPos="3.60" departPosLat="0.00" departSpeed="13.90" departDelay="0.00" arrival="395.40" arrivalLane="c2s_1" arrivalPos="990.00" arrivalPosLat="0.00" arrivalSpeed="13.90" duration="174.40" routeLength="1986.69" waitingTime="20.60" waitingCount="1" stopTime="0.00" timeLoss="30.74" rerouteNo="1" devices="tripinfo_car_w2s_221 routing_car_w2s_221" vType="Car" speedFactor="1.00" vaporized=""/>
    <tripinfo id="car_w2e_227" depart="227.00" departLane="w2sep_1" departPos="3.60" departPosLat="0.00" departSpeed="13.90" departDelay="0.00" arrival="396.70" arrivalLane="c2e_1" arrivalPos="990.00" arrivalPosLat="0.00" arrivalSpeed="15.49" duration="169.70" routeLength="1997.01" waitingTime="19.95" waitingCount="1" stopTime="0.00" timeLoss="44.52" rerouteNo="1" devices="tripinfo_car_w2e_227 routing_car_w2e_227" vType="Car" speedFactor="1.15" vaporized=""/>
    <tripinfo id="car_e2w_229" depart="229.00" departLane="e2sep_1" departPos="3.60" departPosLat="0.00" departSpeed="13.90" departDelay="0.00" arrival="398.40" arrivalLane="c2w_1" arrivalPos="990.00" arrivalPosLat="0.00" arrivalSpeed="13.90" duration="169.40" routeLength="1997.01" waitingTime="14.15" waitingCount="1" stopTime="0.00" timeLoss="25.69" rerouteNo="1" devices="tripinfo_car_e2w_229 routing_car_e2w_229" vType="Car" speedFactor="1.00" vaporized=""/>
    <tripinfo id="car_e2n_249" depart="249.00" departLane="e2sep_1" departPos="3.60" departPosLat="0.00" departSpeed="13.90" departDelay="0.00" arrival="399.05" arrivalLane="c2n_1" arrivalPos="990.00" arrivalPosLat="0.00" arrivalSpeed="14.04" duration="150.05" routeLength="1986.69" waitingTime="0.00" waitingCount="0" stopTime="0.00" timeLoss="7.79" rerouteNo="1" devices="tripinfo_car_e2n_249 routing_car_e2n_249" vType="Car" speedFactor="1.01" vaporized=""/>
    <tripinfo id="car_w2e_237" depart="237.00" departLane="w2sep_1" departPos="3.60" departPosLat="0.00" departSpeed="13.90" departDelay="0.00" arrival="400.40" arrivalLane="c2e_1" arrivalPos="990.00" arrivalPosLat="0.00" arrivalSpeed="14.47" duration="163.40" routeLength="1997.01" waitingTime="10.70" waitingCount="1" stopTime="0.00" timeLoss="25.59" rerouteNo="1" devices="tripinfo_car_w2e_237 routing_car_w2e_237" vType="Car" speedFactor="1.04" vaporized=""/>
    <tripinfo id="car_w2s_230" depart="230.00" departLane="w2sep_1" departPos="3.60" departPosLat="0.00" departSpeed="13.90" departDelay="0.00" arrival="400.65" arrivalLane="c2s_1" arrivalPos="990.00" arrivalPosLat="0.00" arrivalSpeed="13.92" duration="170.65" routeLength="1986.69" waitingTime="13.90" waitingCount="1" stopTime="0.00" timeLoss="27.23" rerouteNo="1" devices="tripinfo_car_w2s_230 routing_car_w2s_230" vType="Car" speedFactor="1.00" vaporized=""/>
    <tripinfo id="car_w2n_243" depart="243.00" departLane="w2sep_1" departPos="3.60" departPosLat="0.00" departSpeed="13.90" departDelay="0.00" arrival="402.55" arrivalLane="c2n_1" arrivalPos="990.00" arrivalPosLat="0.00" arrivalSpeed="14.39" duration="159.55" routeLength="1996.47" waitingTime="7.90" waitingCount="1" stopTime="0.00" timeLoss="20.44" rerouteNo="1" devices="tripinfo_car_w2n_243 routing_car_w2n_243" vType="Car" speedFactor="1.04" vaporized=""/>
    <tripinfo id="car_w2s_238" depart="238.40" departLane="w2sep_1" departPos="3.60" departPosLat="0.00" departSpeed="13.90" departDelay="0.40" arrival="404.55" arrivalLane="c2s_1" arrivalPos="990.00" arrivalPosLat="0.00" arrivalSpeed="14.11" duration="166.15" routeLength="1986.69" waitingTime="7.45" waitingCount="1" stopTime="0.00" timeLoss="24.84" rerouteNo="1" devices="tripinfo_car_w2s_238 routing_car_w2s_238" vType="Car" speedFactor="1.02" vaporized=""/>
    <tripinfo id="car_w2n_247" depart="248.55" departLane="w2sep_1" departPos="3.60" departPosLat="0.00" departSpeed="13.90" departDelay="1.55" arrival="404.95" arrivalLane="c2n_1" arrivalPos="990.00" arrivalPosLat="0.00" arrivalSpeed="14.93" duration="156.40" routeLength="1996.47" waitingTime="0.50" waitingCount="1" stopTime="0.00" timeLoss="24.08" rerouteNo="1" devices="tripinfo_car_w2n_247 routing_car_w2n_247" vType="Car" speedFactor="1.09" vaporized=""/>
    <tripinfo id="bus_w2e_245" depart="245.05" departLane="w2sep_1" departPos="12.10" departPosLat="0.00" departSpeed="13.90" departDelay="0.05" arrival="407.40" arrivalLane="c2e_1" arrivalPos="990.00" arrivalPosLat="0.00" arrivalSpeed="13.89" duration="162.35" routeLength="1988.51" waitingTime="2.25" waitingCount="1" stopTime="0.00" timeLoss="19.28" rerouteNo="1" devices="tripinfo_bus_w2e_245 routing_bus_w2e_245" vType="Bus" speedFactor="1.00" vaporized=""/>
    <tripinfo id="car_w2s_245" depart="246.75" departLane="w2sep_1" departPos="3.60" departPosLat="0.00" departSpeed="13.90" departDelay="1.75" arrival="408.15" arrivalLane="c2s_1" arrivalPos="990.00" arrivalPosLat="0.00" arrivalSpeed="14.47" duration="161.40" routeLength="1986.69" waitingTime="0.00" waitingCount="0" stopTime="0.00" timeLoss="23.72" rerouteNo="1" devices="tripinfo_car_w2s_245 routing_car_w2s_245" vType="Car" speedFactor="1.04" vaporized=""/>
    <tripinfo id="car_w2e_251" depart="251.00" departLane="w2sep_1" departPos="3.60" departPosLat="0.00" departSpeed="13.90" departDelay="0.00" arrival="410.30" arrivalLane="c2e_1" arrivalPos="990.00" arrivalPosLat="0.00" arrivalSpeed="14.94" duration="159.30" routeLength="1997.01" waitingTime="0.00" waitingCount="0" stopTime="0.00" timeLoss="27.23" rerouteNo="1" devices="tripinfo_car_w2e_251 routing_car_w2e_251" vType="Car" speedFactor="1.09" vaporized=""/>
    <tripinfo id="bus_e2n_265" depart="265.00" departLane="e2sep_1" departPos="12.10" departPosLat="0.00" departSpeed="13.90" departDelay="0.00" arrival="414.10" arrivalLane="c2n_1" arrivalPos="990.00" arrivalPosLat="0.00" arrivalSpeed="13.90" duration="149.10" routeLength="1978.19" waitingTime="0.00" waitingCount="0" stopTime="0.00" timeLoss="6.04" rerouteNo="1" devices="tripinfo_bus_e2n_265 routing_bus_e2n_265" vType="Bus" speedFactor="1.00" vaporized=""/>
    <tripinfo id="car_w2e_256" depart="256.00" departLane="w2sep_1" departPos="3.60" departPosLat="0.00" departSpeed="13.90" departDelay="0.00" arrival="415.00" arrivalLane="c2e_1" arrivalPos="990.00" arrivalPosLat="0.00" arrivalSpeed="13.89" duration="159.00" routeLength="1997.01" waitingTime="0.00" waitingCount="0" stopTime="0.00" timeLoss="15.32" rerouteNo="1" devices="tripinfo_car_w2e_256 routing_car_w2e_256" vType="Car" speedFactor="1.00" vaporized=""/>
    <tripinfo id="car_w2s_256" depart="257.70" departLane="w2sep_1" departPos="3.60" departPosLat="0.00" departSpeed="13.90" departDelay="1.70" arrival="416.00" arrivalLane="c2s_1" arrivalPos="990.00" arrivalPosLat="0.00" arrivalSpeed="13.90" duration="158.30" routeLength="1986.69" waitingTime="0.00" waitingCount="0" stopTime="0.00" timeLoss="14.60" rerouteNo="1" devices="tripinfo_car_w2s_256 routing_car_w2s_256" vType="Car" speedFactor="1.00" vaporized=""/>
    <tripinfo id="car_w2e_281" depart="281.00" departLane="w2sep_1" departPos="3.60" departPosLat="0.00" departSpeed="13.90" departDelay="0.00" arrival="417.20" arrivalLane="c2e_1" arrivalPos="990.00" arrivalPosLat="0.00" arrivalSpeed="14.89" duration="136.20" routeLength="1997.01" waitingTime="0.00" waitingCount="0" stopTime="0.00" timeLoss="5.15" rerouteNo="1" devices="tripinfo_car_w2e_281 routing_car_w2e_281" vType="Car" speedFactor="1.10" vaporized=""/>
    <tripinfo id="car_e2s_213" depart="213.30" departLane="e2sep_1" departPos="3.60" departPosLat="0.00" departSpeed="13.90" departDelay="0.30" arrival="421.00" arrivalLane="c2s_1" arrivalPos="990.00" arrivalPosLat="0.00" arrivalSpeed="14.37" duration="207.70" routeLength="1996.47" waitingTime="54.60" waitingCount="3" stopTime="0.00" timeLoss="68.20" rerouteNo="1" devices="tripinfo_car_e2s_213 routing_car_e2s_213" vType="Car" speedFactor="1.03" vaporized=""/>
    <tripinfo id="car_w2n_254" depart="254.00" departLane="w2sep_1" departPos="3.60" departPosLat="0.00" departSpeed="13.90" departDelay="0.00" arrival="421.00" arrivalLane="c2n_1" arrivalPos="990.00" arrivalPosLat="0.00" arrivalSpeed="13.90" duration="167.00" routeLength="1996.47" waitingTime="10.40" waitingCount="1" stopTime="0.00" timeLoss="22.68" rerouteNo="1" devices="tripinfo_car_w2n_254 routing_car_w2n_254" vType="Car" speedFactor="1.00" vaporized=""/>
    <tripinfo id="amb_w2e_300" depart="300.00" departLane="w2sep_1" departPos="6.60" departPosLat="0.00" departSpeed="13.90" departDelay="0.00" arrival="421.60" arrivalLane="c2e_1" arrivalPos="990.00" arrivalPosLat="-0.95" arrivalSpeed="20.75" duration="121.60" routeLength="1994.01" waitingTime="0.00" waitingCount="0" stopTime="0.00" timeLoss="25.96" rerouteNo="1" devices="tripinfo_amb_w2e_300 routing_amb_w2e_300 bluelight_amb_w2e_300 fcd_amb_w2e_300" vType="Ambulance" speedFactor="1.50" vaporized="">
        <example_device customValue1="0.00" customValue2="-1.00"/>
    </tripinfo>
    <tripinfo id="car_e2s_237" depart="237.00" departLane="e2sep_1" departPos="3.60" departPosLat="0.00" departSpeed="13.90" departDelay="0.00" arrival="426.05" arrivalLane="c2s_1" arrivalPos="990.00" arrivalPosLat="0.00" arrivalSpeed="13.99" duration="189.05" routeLength="1996.47" waitingTime="30.50" waitingCount="2" stopTime="0.00" timeLoss="45.72" rerouteNo="1" devices="tripinfo_car_e2s_237 routing_car_e2s_237" vType="Car" speedFactor="1.01" vaporized=""/>
    <tripinfo id="car_w2e_295" depart="295.45" departLane="w2sep_1" departPos="3.60" departPosLat="0.00" departSpeed="13.90" departDelay="0.45" arrival="439.25" arrivalLane="c2e_1" arrivalPos="990.00" arrivalPosLat="1.10" arrivalSpeed="14.89" duration="143.80" routeLength="1997.01" waitingTime="0.00" waitingCount="0" stopTime="0.00" timeLoss="9.61" rerouteNo="1" devices="tripinfo_car_w2e_295 routing_car_w2e_295" vType="Car@car_w2e_295" speedFactor="1.07" vaporized=""/>
    <tripinfo id="bus_w2s_294" depart="294.00" departLane="w2sep_1" departPos="12.10" departPosLat="0.00" departSpeed="13.90" departDelay="0.00" arrival="442.65" arrivalLane="c2s_1" arrivalPos="990.00" arrivalPosLat="0.00" arrivalSpeed="13.90" duration="148.65" routeLength="1978.19" waitingTime="0.00" waitingCount="0" stopTime="0.00" timeLoss="5.58" rerouteNo="1" devices="tripinfo_bus_w2s_294 routing_bus_w2s_294" vType="Bus" speedFactor="1.00" vaporized=""/>
    <tripinfo id="car_e2n_279" depart="279.00" departLane="e2sep_1" departPos="3.60" departPosLat="0.00" departSpeed="13.90" departDelay="0.00" arrival="442.85" arrivalLane="c2n_1" arrivalPos="990.00" arrivalPosLat="0.00" arrivalSpeed="15.27" duration="163.85" routeLength="1986.69" waitingTime="26.00" waitingCount="1" stopTime="0.00" timeLoss="33.09" rerouteNo="1" devices="tripinfo_car_e2n_279 routing_car_e2n_279" vType="Car" speedFactor="1.10" vaporized=""/>
    <tripinfo id="car_w2e_312" depart="312.00" departLane="w2sep_1" departPos="3.60" departPosLat="0.00" departSpeed="13.90" departDelay="0.00" arrival="448.20" arrivalLane="c2e_1" arrivalPos="990.00" arrivalPosLat="0.00" arrivalSpeed="14.75" duration="136.20" routeLength="1997.01" waitingTime="0.00" waitingCount="0" stopTime="0.00" timeLoss="0.75" rerouteNo="1" devices="tripinfo_car_w2e_312 routing_car_w2e_312" vType="Car" speedFactor="1.06" vaporized=""/>
    <tripinfo id="car_w2n_296" depart="297.20" departLane="w2sep_1" departPos="3.60" departPosLat="0.00" departSpeed="13.90" departDelay="1.20" arrival="452.05" arrivalLane="c2n_1" arrivalPos="990.00" arrivalPosLat="0.00" arrivalSpeed="13.90" duration="154.85" routeLength="1996.47" waitingTime="0.00" waitingCount="0" stopTime="0.00" timeLoss="10.54" rerouteNo="1" devices="tripinfo_car_w2n_296 routing_car_w2n_296" vType="Car" speedFactor="1.00" vaporized=""/>
    <tripinfo id="car_e2s_279" depart="280.30" departLane="e2sep_1" departPos="3.60" departPosLat="0.00" departSpeed="13.90" departDelay="1.30" arrival="454.90" arrivalLane="c2s_1" arrivalPos="990.00" arrivalPosLat="0.00" arrivalSpeed="14.03" duration="174.60" routeLength="1996.47" waitingTime="19.55" waitingCount="2" stopTime="0.00" timeLoss="31.57" rerouteNo="1" devices="tripinfo_car_e2s_279 routing_car_e2s_279" vType="Car" speedFactor="1.01" vaporized=""/>
    <tripinfo id="car_e2s_283" depart="283.00" departLane="e2sep_1" departPos="3.60" departPosLat="0.00" departSpeed="13.90" departDelay="0.00" arrival="456.80" arrivalLane="c2s_1" arrivalPos="990.00" arrivalPosLat="0.00" arrivalSpeed="15.56" duration="173.80" routeLength="1996.47" waitingTime="17.60" waitingCount="2" stopTime="0.00" timeLoss="51.17" rerouteNo="1" devices="tripinfo_car_e2s_283 routing_car_e2s_283" vType="Car" speedFactor="1.18" vaporized=""/>
    <tripinfo id="car_e2s_293" depart="293.00" departLane="e2sep_1" departPos="3.60" departPosLat="0.00" departSpeed="13.90" departDelay="0.00" arrival="461.55" arrivalLane="c2s_1" arrivalPos="990.00" arrivalPosLat="0.00" arrivalSpeed="13.94" duration="168.55" routeLength="1996.47" waitingTime="7.60" waitingCount="1" stopTime="0.00" timeLoss="24.67" rerouteNo="1" devices="tripinfo_car_e2s_293 routing_car_e2s_293" vType="Car" speedFactor="1.00" vaporized=""/>
    <tripinfo id="car_e2s_315" depart="315.00" departLane="e2sep_1" departPos="3.60" departPosLat="0.00" departSpeed="13.90" departDelay="0.00" arrival="463.45" arrivalLane="c2s_1" arrivalPos="990.00" arrivalPosLat="0.00" arrivalSpeed="15.29" duration="148.45" routeLength="1996.47" waitingTime="0.00" waitingCount="0" stopTime="0.00" timeLoss="23.23" rerouteNo="1" devices="tripinfo_car_e2s_315 routing_car_e2s_315" vType="Car" speedFactor="1.15" vaporized=""/>
    <tripinfo id="bus_w2n_314" depart="314.00" departLane="w2sep_1" departPos="12.10" departPosLat="0.00" departSpeed="13.90" departDelay="0.00" arrival="464.40" arrivalLane="c2n_1" arrivalPos="990.00" arrivalPosLat="0.00" arrivalSpeed="13.90" duration="150.40" routeLength="1987.97" waitingTime="0.00" waitingCount="0" stopTime="0.00" timeLoss="6.69" rerouteNo="1" devices="tripinfo_bus_w2n_314 routing_bus_w2n_314" vType="Bus" speedFactor="1.00" vaporized=""/>
    <tripinfo id="car_s2e_237" depart="237.00" departLane="s2sep_1" departPos="3.60" departPosLat="0.00" departSpeed="13.90" departDelay="0.00" arrival="464.60" arrivalLane="c2e_1" arrivalPos="990.00" arrivalPosLat="0.00" arrivalSpeed="14.21" duration="227.60" routeLength="1986.69" waitingTime="80.15" waitingCount="1" stopTime="0.00" timeLoss="87.06" rerouteNo="1" devices="tripinfo_car_s2e_237 routing_car_s2e_237" vType="Car" speedFactor="1.02" vaporized=""/>
    <tripinfo id="car_n2s_242" depart="242.00" departLane="n2sep_1" departPos="3.60" departPosLat="0.00" departSpeed="13.90" departDelay="0.00" arrival="465.75" arrivalLane="c2s_1" arrivalPos="990.00" arrivalPosLat="0.00" arrivalSpeed="14.91" duration="223.75" routeLength="1997.01" waitingTime="79.55" waitingCount="1" stopTime="0.00" timeLoss="92.14" rerouteNo="1" devices="tripinfo_car_n2s_242 routing_car_n2s_242" vType="Car" speedFactor="1.09" vaporized=""/>
    <tripinfo id="car_s2n_247" depart="247.00" departLane="s2sep_1" departPos="3.60" departPosLat="0.00" departSpeed="13.90" departDelay="0.00" arrival="467.80" arrivalLane="c2n_1" arrivalPos="990.00" arrivalPosLat="0.00" arrivalSpeed="14.62" duration="220.80" routeLength="1997.01" waitingTime="72.85" waitingCount="1" stopTime="0.00" timeLoss="84.86" rerouteNo="1" devices="tripinfo_car_s2n_247 routing_car_s2n_247" vType="Car" speedFactor="1.06" vaporized=""/>
    <tripinfo id="car_n2s_251" depart="252.30" departLane="n2sep_1" departPos="3.60" departPosLat="0.00" departSpeed="13.90" departDelay="1.30" arrival="468.00" arrivalLane="c2s_1" arrivalPos="990.00" arrivalPosLat="0.00" arrivalSpeed="14.96" duration="215.70" routeLength="1997.01" waitingTime="67.90" waitingCount="1" stopTime="0.00" timeLoss="84.73" rerouteNo="1" devices="tripinfo_car_n2s_251 routing_car_n2s_251" vType="Car" speedFactor="1.10" vaporized=""/>
    <tripinfo id="car_s2e_261" depart="261.00" departLane="s2sep_1" departPos="3.60" departPosLat="0.00" departSpeed="13.90" departDelay="0.00" arrival="470.60" arrivalLane="c2e_1" arrivalPos="990.00" arrivalPosLat="0.00" arrivalSpeed="14.09" duration="209.60" routeLength="1986.69" waitingTime="57.25" waitingCount="1" stopTime="0.00" timeLoss="67.94" rerouteNo="1" devices="tripinfo_car_s2e_261 routing_car_s2e_261" vType="Car" speedFactor="1.01" vaporized=""/>
    <tripinfo id="car_n2s_254" depart="254.00" departLane="n2sep_1" departPos="3.60" departPosLat="0.00" departSpeed="13.90" departDelay="0.00" arrival="472.50" arrivalLane="c2s_1" arrivalPos="990.00" arrivalPosLat="0.00" arrivalSpeed="13.89" duration="218.50" routeLength="1997.01" waitingTime="61.90" waitingCount="1" stopTime="0.00" timeLoss="74.80" rerouteNo="1" devices="tripinfo_car_n2s_254 routing_car_n2s_254" vType="Car" speedFactor="1.00" vaporized=""/>
    <tripinfo id="car_s2e_270" depart="270.00" departLane="s2sep_1" departPos="3.60" departPosLat="0.00" departSpeed="13.90" departDelay="0.00" arrival="474.00" arrivalLane="c2e_1" arrivalPos="990.00" arrivalPosLat="0.00" arrivalSpeed="14.34" duration="204.00" routeLength="1986.69" waitingTime="50.80" waitingCount="1" stopTime="0.00" timeLoss="65.12" rerouteNo="1" devices="tripinfo_car_s2e_270 routing_car_s2e_270" vType="Car" speedFactor="1.03" vaporized=""/>
    <tripinfo id="car_n2s_257" depart="257.00" departLane="n2sep_1" departPos="3.60" departPosLat="0.00" departSpeed="13.90" departDelay="0.00" arrival="474.80" arrivalLane="c2s_1" arrivalPos="990.00" arrivalPosLat="0.00" arrivalSpeed="14.65" duration="217.80" routeLength="1997.01" waitingTime="60.95" waitingCount="1" stopTime="0.00" timeLoss="83.87" rerouteNo="1" devices="tripinfo_car_n2s_257 routing_car_n2s_257" vType="Car" speedFactor="1.07" vaporized=""/>
    <tripinfo id="car_n2w_272" depart="272.00" departLane="n2sep_1" departPos="3.60" departPosLat="0.00" departSpeed="13.90" departDelay="0.00" arrival="474.80" arrivalLane="c2w_1" arrivalPos="990.00" arrivalPosLat="0.00" arrivalSpeed="13.90" duration="202.80" routeLength="1986.69" waitingTime="47.95" waitingCount="1" stopTime="0.00" timeLoss="59.14" rerouteNo="1" devices="tripinfo_car_n2w_272 routing_car_n2w_272" vType="Car" speedFactor="1.00" vaporized=""/>
    <tripinfo id="car_s2n_285" depart="285.00" departLane="s2sep_1" departPos="3.60" departPosLat="0.00" departSpeed="13.90" departDelay="0.00" arrival="475.10" arrivalLane="c2n_1" arrivalPos="990.00" arrivalPosLat="0.00" arrivalSpeed="13.96" duration="190.10" routeLength="1997.01" waitingTime="35.00" waitingCount="1" stopTime="0.00" timeLoss="47.06" rerouteNo="1" devices="tripinfo_car_s2n_285 routing_car_s2n_285" vType="Car" speedFactor="1.00" vaporized=""/>
    <tripinfo id="car_s2e_319" depart="319.45" departLane="s2sep_1" departPos="3.60" departPosLat="0.00" departSpeed="13.90" departDelay="0.45" arrival="476.15" arrivalLane="c2e_1" arrivalPos="990.00" arrivalPosLat="0.00" arrivalSpeed="15.15" duration="156.70" routeLength="1986.69" waitingTime="1.35" waitingCount="1" stopTime="0.00" timeLoss="28.23" rerouteNo="1" devices="tripinfo_car_s2e_319 routing_car_s2e_319" vType="Car" speedFactor="1.12" vaporized=""/>
    <tripinfo id="car_n2w_278" depart="278.00" departLane="n2sep_1" departPos="3.60" departPosLat="0.00" departSpeed="13.90" departDelay="0.00" arrival="476.70" arrivalLane="c2w_1" arrivalPos="990.00" arrivalPosLat="0.00" arrivalSpeed="15.45" duration="198.70" routeLength="1986.69" waitingTime="45.45" waitingCount="1" stopTime="0.00" timeLoss="75.77" rerouteNo="1" devices="tripinfo_car_n2w_278 routing_car_n2w_278" vType="Car" speedFactor="1.17" vaporized=""/>
    <tripinfo id="car_s2n_332" depart="332.00" departLane="s2sep_1" departPos="3.60" departPosLat="0.00" departSpeed="13.90" departDelay="0.00" arrival="478.50" arrivalLane="c2n_1" arrivalPos="990.00" arrivalPosLat="0.00" arrivalSpeed="14.80" duration="146.50" routeLength="1997.01" waitingTime="0.00" waitingCount="0" stopTime="0.00" timeLoss="12.01" rerouteNo="1" devices="tripinfo_car_s2n_332 routing_car_s2n_332" vType="Car" speedFactor="1.07" vaporized=""/>
    <tripinfo id="bus_n2s_272" depart="274.05" departLane="n2sep_1" departPos="12.10" departPosLat="0.00" departSpeed="13.90" departDelay="2.05" arrival="479.40" arrivalLane="c2s_1" arrivalPos="990.00" arrivalPosLat="0.00" arrivalSpeed="13.85" duration="205.35" routeLength="1988.51" waitingTime="46.65" waitingCount="1" stopTime="0.00" timeLoss="62.25" rerouteNo="1" devices="tripinfo_bus_n2s_272 routing_bus_n2s_272" vType="Bus" speedFactor="1.00" vaporized=""/>
    <tripinfo id="car_s2e_324" depart="324.00" departLane="s2sep_1" departPos="3.60" departPosLat="0.00" departSpeed="13.90" departDelay="0.00" arrival="479.80" arrivalLane="c2e_1" arrivalPos="990.00" arrivalPosLat="0.00" arrivalSpeed="14.32" duration="155.80" routeLength="1986.69" waitingTime="0.00" waitingCount="0" stopTime="0.00" timeLoss="16.61" rerouteNo="1" devices="tripinfo_car_s2e_324 routing_car_s2e_324" vType="Car" speedFactor="1.03" vaporized=""/>
    <tripinfo id="car_s2e_344" depart="344.00" departLane="s2sep_1" departPos="3.60" departPosLat="0.00" departSpeed="13.90" departDelay="0.00" arrival="481.55" arrivalLane="c2e_1" arrivalPos="990.00" arrivalPosLat="0.00" arrivalSpeed="15.87" duration="137.55" routeLength="1986.69" waitingTime="0.00" waitingCount="0" stopTime="0.00" timeLoss="20.37" rerouteNo="1" devices="tripinfo_car_s2e_344 routing_car_s2e_344" vType="Car" speedFactor="1.23" vaporized=""/>
    <tripinfo id="car_n2s_299" depart="299.00" departLane="n2sep_1" departPos="3.60" departPosLat="0.00" departSpeed="13.90" departDelay="0.00" arrival="482.05" arrivalLane="c2s_1" arrivalPos="990.00" arrivalPosLat="0.00" arrivalSpeed="15.04" duration="183.05" routeLength="1997.01" waitingTime="31.85" waitingCount="1" stopTime="0.00" timeLoss="52.80" rerouteNo="1" devices="tripinfo_car_n2s_299 routing_car_n2s_299" vType="Car" speedFactor="1.10" vaporized=""/>
    <tripinfo id="car_n2e_251" depart="251.00" departLane="n2sep_1" departPos="3.60" departPosLat="0.00" departSpeed="13.90" departDelay="0.00" arrival="483.80" arrivalLane="c2e_1" arrivalPos="990.00" arrivalPosLat="0.00" arrivalSpeed="15.28" duration="232.80" routeLength="1996.47" waitingTime="87.85" waitingCount="2" stopTime="0.00" timeLoss="104.10" rerouteNo="1" devices="tripinfo_car_n2e_251 routing_car_n2e_251" vType="Car" speedFactor="1.12" vaporized=""/>
</tripinfos>
