%!PS-Adobe-3.0 EPSF-3.0
%%Creator: (MATLAB, The Mathworks, Inc. Version 9.9.0.1524771 \(R2020b\) Update 2. Operating System: Linux)
%%Title: ../pictures/visualize_control/I_2_L_17_Q_1_LTI_COST_EN.eps
%%CreationDate: 2021-01-27T14:28:56
%%Pages: (atend)
%%BoundingBox:    39     0   551   277
%%LanguageLevel: 3
%%EndComments
%%BeginProlog
%%BeginResource: procset (Apache XML Graphics Std ProcSet) 1.2 0
%%Version: 1.2 0
%%Copyright: (Copyright 2001-2003,2010 The Apache Software Foundation. License terms: http://www.apache.org/licenses/LICENSE-2.0)
/bd{bind def}bind def
/ld{load def}bd
/GR/grestore ld
/GS/gsave ld
/RM/rmoveto ld
/C/curveto ld
/t/show ld
/L/lineto ld
/ML/setmiterlimit ld
/CT/concat ld
/f/fill ld
/N/newpath ld
/S/stroke ld
/CC/setcmykcolor ld
/A/ashow ld
/cp/closepath ld
/RC/setrgbcolor ld
/LJ/setlinejoin ld
/GC/setgray ld
/LW/setlinewidth ld
/M/moveto ld
/re {4 2 roll M
1 index 0 rlineto
0 exch rlineto
neg 0 rlineto
cp } bd
/_ctm matrix def
/_tm matrix def
/BT { _ctm currentmatrix pop matrix _tm copy pop 0 0 moveto } bd
/ET { _ctm setmatrix } bd
/iTm { _ctm setmatrix _tm concat } bd
/Tm { _tm astore pop iTm 0 0 moveto } bd
/ux 0.0 def
/uy 0.0 def
/F {
  /Tp exch def
  /Tf exch def
  Tf findfont Tp scalefont setfont
  /cf Tf def  /cs Tp def
} bd
/ULS {currentpoint /uy exch def /ux exch def} bd
/ULE {
  /Tcx currentpoint pop def
  gsave
  newpath
  cf findfont cs scalefont dup
  /FontMatrix get 0 get /Ts exch def /FontInfo get dup
  /UnderlinePosition get Ts mul /To exch def
  /UnderlineThickness get Ts mul /Tt exch def
  ux uy To add moveto  Tcx uy To add lineto
  Tt setlinewidth stroke
  grestore
} bd
/OLE {
  /Tcx currentpoint pop def
  gsave
  newpath
  cf findfont cs scalefont dup
  /FontMatrix get 0 get /Ts exch def /FontInfo get dup
  /UnderlinePosition get Ts mul /To exch def
  /UnderlineThickness get Ts mul /Tt exch def
  ux uy To add cs add moveto Tcx uy To add cs add lineto
  Tt setlinewidth stroke
  grestore
} bd
/SOE {
  /Tcx currentpoint pop def
  gsave
  newpath
  cf findfont cs scalefont dup
  /FontMatrix get 0 get /Ts exch def /FontInfo get dup
  /UnderlinePosition get Ts mul /To exch def
  /UnderlineThickness get Ts mul /Tt exch def
  ux uy To add cs 10 mul 26 idiv add moveto Tcx uy To add cs 10 mul 26 idiv add lineto
  Tt setlinewidth stroke
  grestore
} bd
/QT {
/Y22 exch store
/X22 exch store
/Y21 exch store
/X21 exch store
currentpoint
/Y21 load 2 mul add 3 div exch
/X21 load 2 mul add 3 div exch
/X21 load 2 mul /X22 load add 3 div
/Y21 load 2 mul /Y22 load add 3 div
/X22 load /Y22 load curveto
} bd
/SSPD {
dup length /d exch dict def
{
/v exch def
/k exch def
currentpagedevice k known {
/cpdv currentpagedevice k get def
v cpdv ne {
/upd false def
/nullv v type /nulltype eq def
/nullcpdv cpdv type /nulltype eq def
nullv nullcpdv or
{
/upd true def
} {
/sametype v type cpdv type eq def
sametype {
v type /arraytype eq {
/vlen v length def
/cpdvlen cpdv length def
vlen cpdvlen eq {
0 1 vlen 1 sub {
/i exch def
/obj v i get def
/cpdobj cpdv i get def
obj cpdobj ne {
/upd true def
exit
} if
} for
} {
/upd true def
} ifelse
} {
v type /dicttype eq {
v {
/dv exch def
/dk exch def
/cpddv cpdv dk get def
dv cpddv ne {
/upd true def
exit
} if
} forall
} {
/upd true def
} ifelse
} ifelse
} if
} ifelse
upd true eq {
d k v put
} if
} if
} if
} forall
d length 0 gt {
d setpagedevice
} if
} bd
/RE { % /NewFontName [NewEncodingArray] /FontName RE -
  findfont dup length dict begin
  {
    1 index /FID ne
    {def} {pop pop} ifelse
  } forall
  /Encoding exch def
  /FontName 1 index def
  currentdict definefont pop
  end
} bind def
%%EndResource
%%BeginResource: procset (Apache XML Graphics EPS ProcSet) 1.0 0
%%Version: 1.0 0
%%Copyright: (Copyright 2002-2003 The Apache Software Foundation. License terms: http://www.apache.org/licenses/LICENSE-2.0)
/BeginEPSF { %def
/b4_Inc_state save def         % Save state for cleanup
/dict_count countdictstack def % Count objects on dict stack
/op_count count 1 sub def      % Count objects on operand stack
userdict begin                 % Push userdict on dict stack
/showpage { } def              % Redefine showpage, { } = null proc
0 setgray 0 setlinecap         % Prepare graphics state
1 setlinewidth 0 setlinejoin
10 setmiterlimit [ ] 0 setdash newpath
/languagelevel where           % If level not equal to 1 then
{pop languagelevel             % set strokeadjust and
1 ne                           % overprint to their defaults.
{false setstrokeadjust false setoverprint
} if
} if
} bd
/EndEPSF { %def
count op_count sub {pop} repeat            % Clean up stacks
countdictstack dict_count sub {end} repeat
b4_Inc_state restore
} bd
%%EndResource
%FOPBeginFontDict
%%IncludeResource: font Courier-Oblique
%%IncludeResource: font Courier-BoldOblique
%%IncludeResource: font Courier-Bold
%%IncludeResource: font ZapfDingbats
%%IncludeResource: font Symbol
%%IncludeResource: font Helvetica
%%IncludeResource: font Helvetica-Oblique
%%IncludeResource: font Helvetica-Bold
%%IncludeResource: font Helvetica-BoldOblique
%%IncludeResource: font Times-Roman
%%IncludeResource: font Times-Italic
%%IncludeResource: font Times-Bold
%%IncludeResource: font Times-BoldItalic
%%IncludeResource: font Courier
%FOPEndFontDict
%%BeginResource: encoding WinAnsiEncoding
/WinAnsiEncoding [
/.notdef /.notdef /.notdef /.notdef /.notdef
/.notdef /.notdef /.notdef /.notdef /.notdef
/.notdef /.notdef /.notdef /.notdef /.notdef
/.notdef /.notdef /.notdef /.notdef /.notdef
/.notdef /.notdef /.notdef /.notdef /.notdef
/.notdef /.notdef /.notdef /.notdef /.notdef
/.notdef /.notdef /space /exclam /quotedbl
/numbersign /dollar /percent /ampersand /quotesingle
/parenleft /parenright /asterisk /plus /comma
/hyphen /period /slash /zero /one
/two /three /four /five /six
/seven /eight /nine /colon /semicolon
/less /equal /greater /question /at
/A /B /C /D /E
/F /G /H /I /J
/K /L /M /N /O
/P /Q /R /S /T
/U /V /W /X /Y
/Z /bracketleft /backslash /bracketright /asciicircum
/underscore /quoteleft /a /b /c
/d /e /f /g /h
/i /j /k /l /m
/n /o /p /q /r
/s /t /u /v /w
/x /y /z /braceleft /bar
/braceright /asciitilde /bullet /Euro /bullet
/quotesinglbase /florin /quotedblbase /ellipsis /dagger
/daggerdbl /circumflex /perthousand /Scaron /guilsinglleft
/OE /bullet /Zcaron /bullet /bullet
/quoteleft /quoteright /quotedblleft /quotedblright /bullet
/endash /emdash /asciitilde /trademark /scaron
/guilsinglright /oe /bullet /zcaron /Ydieresis
/space /exclamdown /cent /sterling /currency
/yen /brokenbar /section /dieresis /copyright
/ordfeminine /guillemotleft /logicalnot /sfthyphen /registered
/macron /degree /plusminus /twosuperior /threesuperior
/acute /mu /paragraph /middot /cedilla
/onesuperior /ordmasculine /guillemotright /onequarter /onehalf
/threequarters /questiondown /Agrave /Aacute /Acircumflex
/Atilde /Adieresis /Aring /AE /Ccedilla
/Egrave /Eacute /Ecircumflex /Edieresis /Igrave
/Iacute /Icircumflex /Idieresis /Eth /Ntilde
/Ograve /Oacute /Ocircumflex /Otilde /Odieresis
/multiply /Oslash /Ugrave /Uacute /Ucircumflex
/Udieresis /Yacute /Thorn /germandbls /agrave
/aacute /acircumflex /atilde /adieresis /aring
/ae /ccedilla /egrave /eacute /ecircumflex
/edieresis /igrave /iacute /icircumflex /idieresis
/eth /ntilde /ograve /oacute /ocircumflex
/otilde /odieresis /divide /oslash /ugrave
/uacute /ucircumflex /udieresis /yacute /thorn
/ydieresis
] def
%%EndResource
%FOPBeginFontReencode
/Courier-Oblique findfont
dup length dict begin
  {1 index /FID ne {def} {pop pop} ifelse} forall
  /Encoding WinAnsiEncoding def
  currentdict
end
/Courier-Oblique exch definefont pop
/Courier-BoldOblique findfont
dup length dict begin
  {1 index /FID ne {def} {pop pop} ifelse} forall
  /Encoding WinAnsiEncoding def
  currentdict
end
/Courier-BoldOblique exch definefont pop
/Courier-Bold findfont
dup length dict begin
  {1 index /FID ne {def} {pop pop} ifelse} forall
  /Encoding WinAnsiEncoding def
  currentdict
end
/Courier-Bold exch definefont pop
/Helvetica findfont
dup length dict begin
  {1 index /FID ne {def} {pop pop} ifelse} forall
  /Encoding WinAnsiEncoding def
  currentdict
end
/Helvetica exch definefont pop
/Helvetica-Oblique findfont
dup length dict begin
  {1 index /FID ne {def} {pop pop} ifelse} forall
  /Encoding WinAnsiEncoding def
  currentdict
end
/Helvetica-Oblique exch definefont pop
/Helvetica-Bold findfont
dup length dict begin
  {1 index /FID ne {def} {pop pop} ifelse} forall
  /Encoding WinAnsiEncoding def
  currentdict
end
/Helvetica-Bold exch definefont pop
/Helvetica-BoldOblique findfont
dup length dict begin
  {1 index /FID ne {def} {pop pop} ifelse} forall
  /Encoding WinAnsiEncoding def
  currentdict
end
/Helvetica-BoldOblique exch definefont pop
/Times-Roman findfont
dup length dict begin
  {1 index /FID ne {def} {pop pop} ifelse} forall
  /Encoding WinAnsiEncoding def
  currentdict
end
/Times-Roman exch definefont pop
/Times-Italic findfont
dup length dict begin
  {1 index /FID ne {def} {pop pop} ifelse} forall
  /Encoding WinAnsiEncoding def
  currentdict
end
/Times-Italic exch definefont pop
/Times-Bold findfont
dup length dict begin
  {1 index /FID ne {def} {pop pop} ifelse} forall
  /Encoding WinAnsiEncoding def
  currentdict
end
/Times-Bold exch definefont pop
/Times-BoldItalic findfont
dup length dict begin
  {1 index /FID ne {def} {pop pop} ifelse} forall
  /Encoding WinAnsiEncoding def
  currentdict
end
/Times-BoldItalic exch definefont pop
/Courier findfont
dup length dict begin
  {1 index /FID ne {def} {pop pop} ifelse} forall
  /Encoding WinAnsiEncoding def
  currentdict
end
/Courier exch definefont pop
%FOPEndFontReencode
%%EndProlog
%%Page: 1 1
%%PageBoundingBox: 0 0 608 295
%%BeginPageSetup
[1 0 0 -1 0 295] CT
%%EndPageSetup
GS
[0.75 0 0 0.75 0 0.25] CT
1 GC
N
0 0 810 393 re
f
GR
GS
[0.75 0 0 0.75 0 0.25] CT
1 GC
N
0 0 810 393 re
f
GR
GS
[0.75 0 0 0.75 0 0.25] CT
1 GC
N
105 345 M
733 345 L
733 29 L
105 29 L
cp
f
GR
GS
[0.75 0 0 0.75 0 0.25] CT
0.873 GC
1 LJ
0.667 LW
N
105 345 M
105 29 L
S
GR
GS
[0.75 0 0 0.75 0 0.25] CT
0.873 GC
1 LJ
0.667 LW
N
164.858 345 M
164.858 29 L
S
GR
GS
[0.75 0 0 0.75 0 0.25] CT
0.873 GC
1 LJ
0.667 LW
N
224.717 345 M
224.717 29 L
S
GR
GS
[0.75 0 0 0.75 0 0.25] CT
0.873 GC
1 LJ
0.667 LW
N
284.575 345 M
284.575 29 L
S
GR
GS
[0.75 0 0 0.75 0 0.25] CT
0.873 GC
1 LJ
0.667 LW
N
344.434 345 M
344.434 29 L
S
GR
GS
[0.75 0 0 0.75 0 0.25] CT
0.873 GC
1 LJ
0.667 LW
N
404.292 345 M
404.292 29 L
S
GR
GS
[0.75 0 0 0.75 0 0.25] CT
0.873 GC
1 LJ
0.667 LW
N
464.15 345 M
464.15 29 L
S
GR
GS
[0.75 0 0 0.75 0 0.25] CT
0.873 GC
1 LJ
0.667 LW
N
524.009 345 M
524.009 29 L
S
GR
GS
[0.75 0 0 0.75 0 0.25] CT
0.873 GC
1 LJ
0.667 LW
N
583.867 345 M
583.867 29 L
S
GR
GS
[0.75 0 0 0.75 0 0.25] CT
0.873 GC
1 LJ
0.667 LW
N
643.725 345 M
643.725 29 L
S
GR
GS
[0.75 0 0 0.75 0 0.25] CT
0.873 GC
1 LJ
0.667 LW
N
703.584 345 M
703.584 29 L
S
GR
GS
[0.75 0 0 0.75 0 0.25] CT
0.873 GC
1 LJ
0.667 LW
N
733 345 M
105 345 L
S
GR
GS
[0.75 0 0 0.75 0 0.25] CT
0.873 GC
1 LJ
0.667 LW
N
733 299.857 M
105 299.857 L
S
GR
GS
[0.75 0 0 0.75 0 0.25] CT
0.873 GC
1 LJ
0.667 LW
N
733 254.714 M
105 254.714 L
S
GR
GS
[0.75 0 0 0.75 0 0.25] CT
0.873 GC
1 LJ
0.667 LW
N
733 209.571 M
105 209.571 L
S
GR
GS
[0.75 0 0 0.75 0 0.25] CT
0.873 GC
1 LJ
0.667 LW
N
733 164.429 M
105 164.429 L
S
GR
GS
[0.75 0 0 0.75 0 0.25] CT
0.873 GC
1 LJ
0.667 LW
N
733 119.286 M
105 119.286 L
S
GR
GS
[0.75 0 0 0.75 0 0.25] CT
0.873 GC
1 LJ
0.667 LW
N
733 74.143 M
105 74.143 L
S
GR
GS
[0.75 0 0 0.75 0 0.25] CT
0.873 GC
1 LJ
0.667 LW
N
733 29 M
105 29 L
S
GR
GS
[0.75 0 0 0.75 0 0.25] CT
0.149 GC
2 setlinecap
1 LJ
0.667 LW
N
105 345 M
733 345 L
S
GR
GS
[0.75 0 0 0.75 0 0.25] CT
0.149 GC
2 setlinecap
1 LJ
0.667 LW
N
105 345 M
105 338.72 L
S
GR
GS
[0.75 0 0 0.75 0 0.25] CT
0.149 GC
2 setlinecap
1 LJ
0.667 LW
N
164.858 345 M
164.858 338.72 L
S
GR
GS
[0.75 0 0 0.75 0 0.25] CT
0.149 GC
2 setlinecap
1 LJ
0.667 LW
N
224.717 345 M
224.717 338.72 L
S
GR
GS
[0.75 0 0 0.75 0 0.25] CT
0.149 GC
2 setlinecap
1 LJ
0.667 LW
N
284.575 345 M
284.575 338.72 L
S
GR
GS
[0.75 0 0 0.75 0 0.25] CT
0.149 GC
2 setlinecap
1 LJ
0.667 LW
N
344.434 345 M
344.434 338.72 L
S
GR
GS
[0.75 0 0 0.75 0 0.25] CT
0.149 GC
2 setlinecap
1 LJ
0.667 LW
N
404.292 345 M
404.292 338.72 L
S
GR
GS
[0.75 0 0 0.75 0 0.25] CT
0.149 GC
2 setlinecap
1 LJ
0.667 LW
N
464.15 345 M
464.15 338.72 L
S
GR
GS
[0.75 0 0 0.75 0 0.25] CT
0.149 GC
2 setlinecap
1 LJ
0.667 LW
N
524.009 345 M
524.009 338.72 L
S
GR
GS
[0.75 0 0 0.75 0 0.25] CT
0.149 GC
2 setlinecap
1 LJ
0.667 LW
N
583.867 345 M
583.867 338.72 L
S
GR
GS
[0.75 0 0 0.75 0 0.25] CT
0.149 GC
2 setlinecap
1 LJ
0.667 LW
N
643.725 345 M
643.725 338.72 L
S
GR
GS
[0.75 0 0 0.75 0 0.25] CT
0.149 GC
2 setlinecap
1 LJ
0.667 LW
N
703.584 345 M
703.584 338.72 L
S
GR
GS
[0.75 0 0 0.75 78.75 263.00001] CT
0.149 GC
/Helvetica 13.333 F
GS
[1 0 0 1 0 0] CT
-4.5 13 moveto 
1 -1 scale
(0) t 
GR
GR
GS
[0.75 0 0 0.75 123.64379 263.00001] CT
0.149 GC
/Helvetica 13.333 F
GS
[1 0 0 1 0 0] CT
-4.5 13 moveto 
1 -1 scale
(5) t 
GR
GR
GS
[0.75 0 0 0.75 168.53759 263.00001] CT
0.149 GC
/Helvetica 13.333 F
GS
[1 0 0 1 0 0] CT
-8.5 13 moveto 
1 -1 scale
(10) t 
GR
GR
GS
[0.75 0 0 0.75 213.43137 263.00001] CT
0.149 GC
/Helvetica 13.333 F
GS
[1 0 0 1 0 0] CT
-8.5 13 moveto 
1 -1 scale
(15) t 
GR
GR
GS
[0.75 0 0 0.75 258.32517 263.00001] CT
0.149 GC
/Helvetica 13.333 F
GS
[1 0 0 1 0 0] CT
-8.5 13 moveto 
1 -1 scale
(20) t 
GR
GR
GS
[0.75 0 0 0.75 303.21895 263.00001] CT
0.149 GC
/Helvetica 13.333 F
GS
[1 0 0 1 0 0] CT
-8.5 13 moveto 
1 -1 scale
(25) t 
GR
GR
GS
[0.75 0 0 0.75 348.11275 263.00001] CT
0.149 GC
/Helvetica 13.333 F
GS
[1 0 0 1 0 0] CT
-8.5 13 moveto 
1 -1 scale
(30) t 
GR
GR
GS
[0.75 0 0 0.75 393.00655 263.00001] CT
0.149 GC
/Helvetica 13.333 F
GS
[1 0 0 1 0 0] CT
-8.5 13 moveto 
1 -1 scale
(35) t 
GR
GR
GS
[0.75 0 0 0.75 437.90034 263.00001] CT
0.149 GC
/Helvetica 13.333 F
GS
[1 0 0 1 0 0] CT
-8.5 13 moveto 
1 -1 scale
(40) t 
GR
GR
GS
[0.75 0 0 0.75 482.7941 263.00001] CT
0.149 GC
/Helvetica 13.333 F
GS
[1 0 0 1 0 0] CT
-8.5 13 moveto 
1 -1 scale
(45) t 
GR
GR
GS
[0.75 0 0 0.75 527.6879 263.00001] CT
0.149 GC
/Helvetica 13.333 F
GS
[1 0 0 1 0 0] CT
-8.5 13 moveto 
1 -1 scale
(50) t 
GR
GR
GS
[0.75 0 0 0.75 314.25023 277] CT
0.149 GC
N
-21.423 15.175 M
-21.423 14.878 -21.36 14.628 QT
-19.907 8.878 L
-22.016 8.878 L
-22.219 8.878 -22.219 8.612 QT
-22.141 8.175 -21.954 8.175 QT
-19.735 8.175 L
-18.938 4.909 L
-18.86 4.644 -18.626 4.464 QT
-18.391 4.284 -18.094 4.284 QT
-17.844 4.284 -17.673 4.433 QT
-17.501 4.581 -17.501 4.831 QT
-17.501 4.894 -17.509 4.925 QT
-17.516 4.956 -17.516 5.003 QT
-18.313 8.175 L
-16.266 8.175 L
-16.048 8.175 -16.048 8.441 QT
-16.063 8.487 -16.094 8.605 QT
-16.126 8.722 -16.173 8.8 QT
-16.219 8.878 -16.313 8.878 QT
-18.501 8.878 L
-19.938 14.659 L
-20.079 15.222 -20.079 15.644 QT
-20.079 16.503 -19.485 16.503 QT
-18.61 16.503 -17.93 15.675 QT
-17.251 14.847 -16.891 13.862 QT
-16.813 13.737 -16.735 13.737 QT
-16.501 13.737 L
-16.423 13.737 -16.368 13.792 QT
-16.313 13.847 -16.313 13.925 QT
-16.313 13.956 -16.344 13.972 QT
-16.782 15.191 -17.618 16.105 QT
-18.454 17.019 -19.548 17.019 QT
-20.329 17.019 -20.876 16.503 QT
-21.423 15.987 -21.423 15.175 QT
cp
f
GR
GS
[0.75 0 0 0.75 314.25023 277] CT
0.149 GC
N
-14.966 19.847 M
-14.966 17.55 L
-14.966 17.441 -14.841 17.441 QT
-14.669 17.441 L
-14.591 17.441 -14.56 17.55 QT
-14.169 19.581 -12.685 19.581 QT
-12.013 19.581 -11.568 19.284 QT
-11.122 18.987 -11.122 18.362 QT
-11.122 17.909 -11.474 17.589 QT
-11.825 17.269 -12.294 17.159 QT
-13.232 16.972 L
-13.7 16.862 -14.091 16.651 QT
-14.482 16.441 -14.724 16.089 QT
-14.966 15.737 -14.966 15.269 QT
-14.966 14.659 -14.646 14.269 QT
-14.325 13.878 -13.802 13.698 QT
-13.278 13.519 -12.685 13.519 QT
-11.966 13.519 -11.435 13.909 QT
-11.028 13.566 L
-11.028 13.519 -10.95 13.519 QT
-10.857 13.519 L
-10.81 13.519 -10.778 13.558 QT
-10.747 13.597 -10.747 13.644 QT
-10.747 15.472 L
-10.747 15.597 -10.857 15.597 QT
-11.028 15.597 L
-11.153 15.597 -11.153 15.472 QT
-11.153 14.737 -11.56 14.292 QT
-11.966 13.847 -12.7 13.847 QT
-13.325 13.847 -13.786 14.081 QT
-14.247 14.316 -14.247 14.878 QT
-14.247 15.269 -13.911 15.519 QT
-13.575 15.769 -13.138 15.878 QT
-12.185 16.066 L
-11.716 16.175 -11.302 16.433 QT
-10.888 16.691 -10.646 17.089 QT
-10.403 17.487 -10.403 17.987 QT
-10.403 18.487 -10.575 18.862 QT
-10.747 19.237 -11.06 19.48 QT
-11.372 19.722 -11.794 19.839 QT
-12.216 19.956 -12.685 19.956 QT
-13.56 19.956 -14.169 19.362 QT
-14.685 19.925 L
-14.685 19.956 -14.763 19.956 QT
-14.841 19.956 L
-14.966 19.956 -14.966 19.847 QT
cp
f
GR
GS
[0.75 0 0 0.75 314.25023 277] CT
0.149 GC
N
-9.475 19.8 M
-9.475 19.3 L
-9.006 19.3 -8.694 19.23 QT
-8.381 19.159 -8.381 18.862 QT
-8.381 15.034 L
-8.381 14.503 -8.592 14.378 QT
-8.803 14.253 -9.413 14.253 QT
-9.413 13.769 L
-7.397 13.612 L
-7.397 18.862 L
-7.397 19.159 -7.131 19.23 QT
-6.866 19.3 -6.428 19.3 QT
-6.428 19.8 L
-9.475 19.8 L
cp
-8.881 11.206 M
-8.881 10.894 -8.655 10.667 QT
-8.428 10.441 -8.116 10.441 QT
-7.928 10.441 -7.741 10.542 QT
-7.553 10.644 -7.452 10.823 QT
-7.35 11.003 -7.35 11.206 QT
-7.35 11.503 -7.584 11.737 QT
-7.819 11.972 -8.116 11.972 QT
-8.428 11.972 -8.655 11.737 QT
-8.881 11.503 -8.881 11.206 QT
cp
f
GR
GS
[0.75 0 0 0.75 314.25023 277] CT
0.149 GC
N
-5.633 20.894 M
-5.633 20.394 -5.274 20.019 QT
-4.914 19.644 -4.414 19.487 QT
-4.695 19.284 -4.836 18.964 QT
-4.977 18.644 -4.977 18.269 QT
-4.977 17.612 -4.57 17.112 QT
-5.211 16.487 -5.211 15.675 QT
-5.211 15.237 -5.024 14.855 QT
-4.836 14.472 -4.5 14.191 QT
-4.164 13.909 -3.75 13.761 QT
-3.336 13.612 -2.914 13.612 QT
-2.086 13.612 -1.414 14.097 QT
-1.133 13.784 -0.735 13.62 QT
-0.336 13.456 0.086 13.456 QT
0.383 13.456 0.57 13.675 QT
0.758 13.894 0.758 14.191 QT
0.758 14.362 0.633 14.487 QT
0.508 14.612 0.336 14.612 QT
0.164 14.612 0.031 14.487 QT
-0.102 14.362 -0.102 14.191 QT
-0.102 13.925 0.07 13.831 QT
-0.664 13.831 -1.18 14.331 QT
-0.93 14.581 -0.774 14.948 QT
-0.617 15.316 -0.617 15.675 QT
-0.617 16.269 -0.945 16.745 QT
-1.274 17.222 -1.813 17.48 QT
-2.352 17.737 -2.914 17.737 QT
-3.68 17.737 -4.32 17.331 QT
-4.508 17.597 -4.508 17.941 QT
-4.508 18.316 -4.266 18.589 QT
-4.024 18.862 -3.664 18.862 QT
-2.508 18.862 L
-1.68 18.862 -1.008 19.011 QT
-0.336 19.159 0.117 19.612 QT
0.57 20.066 0.57 20.894 QT
0.57 21.503 0.055 21.909 QT
-0.461 22.316 -1.188 22.503 QT
-1.914 22.691 -2.524 22.691 QT
-3.149 22.691 -3.875 22.503 QT
-4.602 22.316 -5.117 21.909 QT
-5.633 21.503 -5.633 20.894 QT
cp
-4.852 20.894 M
-4.852 21.362 -4.469 21.683 QT
-4.086 22.003 -3.547 22.159 QT
-3.008 22.316 -2.524 22.316 QT
-2.055 22.316 -1.516 22.159 QT
-0.977 22.003 -0.594 21.683 QT
-0.211 21.362 -0.211 20.894 QT
-0.211 20.159 -0.883 19.948 QT
-1.555 19.737 -2.508 19.737 QT
-3.664 19.737 L
-3.977 19.737 -4.25 19.886 QT
-4.524 20.034 -4.688 20.316 QT
-4.852 20.597 -4.852 20.894 QT
cp
-2.914 17.362 M
-1.727 17.362 -1.727 15.675 QT
-1.727 14.941 -1.977 14.464 QT
-2.227 13.987 -2.914 13.987 QT
-3.602 13.987 -3.852 14.464 QT
-4.102 14.941 -4.102 15.675 QT
-4.102 16.128 -4.008 16.511 QT
-3.914 16.894 -3.656 17.128 QT
-3.399 17.362 -2.914 17.362 QT
cp
f
GR
GS
[0.75 0 0 0.75 314.25023 277] CT
0.149 GC
N
4.53 21.8 M
4.53 1.8 L
7.265 1.8 L
7.265 2.597 L
5.343 2.597 L
5.343 21.003 L
7.265 21.003 L
7.265 21.8 L
4.53 21.8 L
cp
f
GR
GS
[0.75 0 0 0.75 314.25023 277] CT
0.149 GC
N
9.461 15.581 M
10.008 16.503 11.617 16.503 QT
12.32 16.503 12.961 16.261 QT
13.601 16.019 14.015 15.542 QT
14.43 15.066 14.43 14.378 QT
14.43 13.862 14.055 13.526 QT
13.68 13.191 13.148 13.081 QT
12.07 12.862 L
11.32 12.675 10.844 12.167 QT
10.367 11.659 10.367 10.941 QT
10.367 10.05 10.851 9.37 QT
11.336 8.691 12.125 8.323 QT
12.914 7.956 13.758 7.956 QT
14.664 7.956 15.383 8.394 QT
16.101 8.831 16.101 9.675 QT
16.101 10.144 15.844 10.495 QT
15.586 10.847 15.133 10.847 QT
14.867 10.847 14.68 10.675 QT
14.492 10.503 14.492 10.237 QT
14.492 10.003 14.617 9.784 QT
14.742 9.566 14.969 9.433 QT
15.195 9.3 15.43 9.3 QT
15.242 8.862 14.758 8.667 QT
14.273 8.472 13.726 8.472 QT
13.211 8.472 12.703 8.683 QT
12.195 8.894 11.89 9.284 QT
11.586 9.675 11.586 10.222 QT
11.586 10.581 11.836 10.855 QT
12.086 11.128 12.461 11.237 QT
13.633 11.472 L
14.18 11.597 14.648 11.894 QT
15.117 12.191 15.383 12.644 QT
15.648 13.097 15.648 13.691 QT
15.648 14.425 15.234 15.151 QT
14.82 15.878 14.211 16.3 QT
13.148 17.019 11.601 17.019 QT
10.539 17.019 9.648 16.534 QT
8.758 16.05 8.758 15.081 QT
8.758 14.534 9.078 14.128 QT
9.398 13.722 9.945 13.722 QT
10.273 13.722 10.492 13.917 QT
10.711 14.112 10.711 14.441 QT
10.711 14.894 10.367 15.237 QT
10.023 15.581 9.57 15.581 QT
9.461 15.581 L
cp
f
GR
GS
[0.75 0 0 0.75 314.25023 277] CT
0.149 GC
N
17.539 21.8 M
17.539 21.003 L
19.492 21.003 L
19.492 2.597 L
17.539 2.597 L
17.539 1.8 L
20.289 1.8 L
20.289 21.8 L
17.539 21.8 L
cp
f
GR
GS
[0.75 0 0 0.75 0 0.25] CT
0.149 GC
2 setlinecap
1 LJ
0.667 LW
N
105 345 M
105 29 L
S
GR
GS
[0.75 0 0 0.75 0 0.25] CT
0.149 GC
2 setlinecap
1 LJ
0.667 LW
N
105 345 M
111.28 345 L
S
GR
GS
[0.75 0 0 0.75 0 0.25] CT
0.149 GC
2 setlinecap
1 LJ
0.667 LW
N
105 299.857 M
111.28 299.857 L
S
GR
GS
[0.75 0 0 0.75 0 0.25] CT
0.149 GC
2 setlinecap
1 LJ
0.667 LW
N
105 254.714 M
111.28 254.714 L
S
GR
GS
[0.75 0 0 0.75 0 0.25] CT
0.149 GC
2 setlinecap
1 LJ
0.667 LW
N
105 209.571 M
111.28 209.571 L
S
GR
GS
[0.75 0 0 0.75 0 0.25] CT
0.149 GC
2 setlinecap
1 LJ
0.667 LW
N
105 164.429 M
111.28 164.429 L
S
GR
GS
[0.75 0 0 0.75 0 0.25] CT
0.149 GC
2 setlinecap
1 LJ
0.667 LW
N
105 119.286 M
111.28 119.286 L
S
GR
GS
[0.75 0 0 0.75 0 0.25] CT
0.149 GC
2 setlinecap
1 LJ
0.667 LW
N
105 74.143 M
111.28 74.143 L
S
GR
GS
[0.75 0 0 0.75 0 0.25] CT
0.149 GC
2 setlinecap
1 LJ
0.667 LW
N
105 29 M
111.28 29 L
S
GR
GS
[0.75 0 0 0.75 74.75 259] CT
0.149 GC
/Helvetica 13.333 F
GS
[1 0 0 1 0 0] CT
-9 4.5 moveto 
1 -1 scale
(0) t 
GR
GR
GS
[0.75 0 0 0.75 74.75 225.14286] CT
0.149 GC
/Helvetica 13.333 F
GS
[1 0 0 1 0 0] CT
-22 4.5 moveto 
1 -1 scale
(0.2) t 
GR
GR
GS
[0.75 0 0 0.75 74.75 191.28571] CT
0.149 GC
/Helvetica 13.333 F
GS
[1 0 0 1 0 0] CT
-22 4.5 moveto 
1 -1 scale
(0.4) t 
GR
GR
GS
[0.75 0 0 0.75 74.75 157.42857] CT
0.149 GC
/Helvetica 13.333 F
GS
[1 0 0 1 0 0] CT
-22 4.5 moveto 
1 -1 scale
(0.6) t 
GR
GR
GS
[0.75 0 0 0.75 74.75 123.57143] CT
0.149 GC
/Helvetica 13.333 F
GS
[1 0 0 1 0 0] CT
-22 4.5 moveto 
1 -1 scale
(0.8) t 
GR
GR
GS
[0.75 0 0 0.75 74.75 89.71428] CT
0.149 GC
/Helvetica 13.333 F
GS
[1 0 0 1 0 0] CT
-9 4.5 moveto 
1 -1 scale
(1) t 
GR
GR
GS
[0.75 0 0 0.75 74.75 55.85713] CT
0.149 GC
/Helvetica 13.333 F
GS
[1 0 0 1 0 0] CT
-22 4.5 moveto 
1 -1 scale
(1.2) t 
GR
GR
GS
[0.75 0 0 0.75 74.75 22] CT
0.149 GC
/Helvetica 13.333 F
GS
[1 0 0 1 0 0] CT
-22 4.5 moveto 
1 -1 scale
(1.4) t 
GR
GR
GS
[0 -0.75 0.75 0 55.25 140.49989] CT
0.149 GC
N
-4.335 -8.403 M
-4.132 -7.841 -3.608 -7.559 QT
-3.085 -7.278 -2.46 -7.278 QT
-1.835 -7.278 -1.257 -7.716 QT
-0.679 -8.153 -0.273 -8.802 QT
0.134 -9.45 0.29 -10.106 QT
2.649 -19.559 L
2.681 -19.638 2.681 -19.677 QT
2.681 -19.716 2.696 -19.763 QT
2.696 -19.981 2.54 -20.028 QT
2.009 -20.153 0.399 -20.153 QT
0.196 -20.153 0.196 -20.419 QT
0.227 -20.575 0.251 -20.669 QT
0.274 -20.763 0.345 -20.809 QT
0.415 -20.856 0.54 -20.856 QT
5.962 -20.856 L
6.149 -20.856 6.149 -20.606 QT
6.071 -20.153 5.899 -20.153 QT
5.196 -20.153 4.837 -20.052 QT
4.477 -19.95 4.337 -19.481 QT
1.977 -10.028 L
1.743 -9.091 1.056 -8.349 QT
0.368 -7.606 -0.577 -7.184 QT
-1.523 -6.763 -2.476 -6.763 QT
-3.538 -6.763 -4.335 -7.349 QT
-5.132 -7.934 -5.132 -8.934 QT
-5.132 -9.606 -4.773 -10.083 QT
-4.413 -10.559 -3.741 -10.559 QT
-3.366 -10.559 -3.108 -10.325 QT
-2.851 -10.091 -2.851 -9.716 QT
-2.851 -9.184 -3.249 -8.786 QT
-3.648 -8.388 -4.179 -8.388 QT
-4.288 -8.388 -4.335 -8.403 QT
cp
f
GR
GS
[0.75 0 0 0.75 0 0.25] CT
0 0.447 0.741 RC
1 LJ
2.667 LW
N
105 119.286 M
111.343 130.676 L
117.687 141.602 L
124.03 152.078 L
130.374 162.118 L
136.717 171.735 L
143.061 180.943 L
149.404 189.756 L
155.747 198.186 L
162.091 206.245 L
168.434 213.947 L
174.778 221.302 L
181.121 228.324 L
187.465 235.023 L
193.808 241.411 L
200.152 247.499 L
206.495 253.297 L
212.838 258.815 L
219.182 264.065 L
225.525 269.056 L
231.869 273.797 L
238.212 278.299 L
244.556 282.57 L
250.899 286.619 L
257.242 290.456 L
263.586 294.088 L
269.929 297.524 L
276.273 300.772 L
282.616 303.84 L
288.96 306.735 L
295.303 309.464 L
301.646 312.036 L
307.99 314.457 L
314.333 316.733 L
320.677 318.872 L
327.02 320.879 L
333.364 322.76 L
339.707 324.523 L
346.051 326.172 L
352.394 327.713 L
358.737 329.151 L
365.081 330.492 L
371.424 331.741 L
377.768 332.902 L
384.111 333.98 L
390.455 331.346 L
396.798 326.665 L
403.141 321.105 L
409.485 315.187 L
415.828 309.113 L
422.172 302.428 L
428.515 295.627 L
434.859 288.181 L
441.202 280.542 L
447.545 276.104 L
453.889 267.611 L
460.232 259.235 L
466.576 250.742 L
472.919 240.814 L
479.263 230.505 L
485.606 221.867 L
491.949 209.614 L
498.293 199.513 L
504.636 186.847 L
510.98 176.874 L
517.323 166.694 L
523.667 157.379 L
530.01 145.929 L
536.354 138.423 L
542.697 135.423 L
549.04 120.259 L
555.384 112.673 L
561.727 106.253 L
568.071 100.32 L
574.414 94.122 L
580.758 88.165 L
587.101 80.376 L
593.444 79.732 L
599.788 74.117 L
606.131 72.58 L
612.475 68.903 L
618.818 66.981 L
625.162 67.664 L
631.505 64.345 L
637.848 63.319 L
644.192 63.733 L
650.535 62.394 L
656.879 61.884 L
663.222 62.732 L
669.566 61.985 L
675.909 61.585 L
682.253 61.757 L
688.596 64.663 L
694.939 64.317 L
701.283 63.642 L
707.626 65.344 L
713.97 65.258 L
720.313 65.533 L
726.657 65.445 L
733 66.073 L
S
GR
GS
[0.75 0 0 0.75 0 0.25] CT
0.851 0.325 0.098 RC
[8 8] 0 setdash
2 LJ
2.667 LW
N
105 345 M
111.343 345 L
117.687 345 L
124.03 345 L
130.374 345 L
136.717 345 L
143.061 345 L
149.404 345 L
155.747 345 L
162.091 345 L
168.434 345 L
174.778 345 L
181.121 345 L
187.465 345 L
193.808 345 L
200.152 345 L
206.495 345 L
212.838 345 L
219.182 345 L
225.525 345 L
231.869 345 L
238.212 345 L
244.556 345 L
250.899 345 L
257.242 345 L
263.586 345 L
269.929 345 L
276.273 345 L
282.616 345 L
288.96 345 L
295.303 345 L
301.646 345 L
307.99 345 L
314.333 345 L
320.677 345 L
327.02 345 L
333.364 345 L
339.707 345 L
346.051 345 L
352.394 345 L
358.737 344.825 L
365.081 343.937 L
371.424 341.914 L
377.768 339.172 L
384.111 335.519 L
390.455 331.346 L
396.798 326.665 L
403.141 321.105 L
409.485 315.187 L
415.828 309.113 L
422.172 302.428 L
428.515 295.627 L
434.859 288.181 L
441.202 280.542 L
447.545 276.104 L
453.889 267.611 L
460.232 259.235 L
466.576 250.742 L
472.919 240.814 L
479.263 230.505 L
485.606 221.867 L
491.949 209.614 L
498.293 199.513 L
504.636 186.847 L
510.98 176.874 L
517.323 166.694 L
523.667 157.379 L
530.01 145.929 L
536.354 138.423 L
542.697 135.423 L
549.04 120.259 L
555.384 112.673 L
561.727 106.253 L
568.071 100.32 L
574.414 94.122 L
580.758 88.165 L
587.101 80.376 L
593.444 79.732 L
599.788 74.117 L
606.131 72.58 L
612.475 68.903 L
618.818 66.981 L
625.162 67.664 L
631.505 64.345 L
637.848 63.319 L
644.192 63.733 L
650.535 62.394 L
656.879 61.884 L
663.222 62.732 L
669.566 61.985 L
675.909 61.585 L
682.253 61.757 L
688.596 64.663 L
694.939 64.317 L
701.283 63.642 L
707.626 65.344 L
713.97 65.258 L
720.313 65.533 L
726.657 65.445 L
733 66.073 L
S
GR
GS
[0.75 0 0 0.75 0 0.25] CT
0.929 0.694 0.125 RC
[8 8] 0 setdash
2 LJ
2.667 LW
N
105 119.286 M
111.343 130.676 L
117.687 141.602 L
124.03 152.078 L
130.374 162.118 L
136.717 171.735 L
143.061 180.943 L
149.404 189.756 L
155.747 198.186 L
162.091 206.245 L
168.434 213.947 L
174.778 221.302 L
181.121 228.324 L
187.465 235.023 L
193.808 241.411 L
200.152 247.499 L
206.495 253.297 L
212.838 258.815 L
219.182 264.065 L
225.525 269.056 L
231.869 273.797 L
238.212 278.299 L
244.556 282.57 L
250.899 286.619 L
257.242 290.456 L
263.586 294.088 L
269.929 297.524 L
276.273 300.772 L
282.616 303.84 L
288.96 306.735 L
295.303 309.464 L
301.646 312.036 L
307.99 314.457 L
314.333 316.733 L
320.677 318.872 L
327.02 320.879 L
333.364 322.76 L
339.707 324.523 L
346.051 326.172 L
352.394 327.713 L
358.737 329.151 L
365.081 330.492 L
371.424 331.741 L
377.768 332.902 L
384.111 333.98 L
390.455 334.98 L
396.798 335.906 L
403.141 336.763 L
409.485 337.553 L
415.828 338.282 L
422.172 338.952 L
428.515 339.568 L
434.859 340.133 L
441.202 340.649 L
447.545 341.121 L
453.889 341.551 L
460.232 341.942 L
466.576 342.297 L
472.919 342.618 L
479.263 342.908 L
485.606 343.168 L
491.949 343.402 L
498.293 343.612 L
504.636 343.799 L
510.98 343.965 L
517.323 344.113 L
523.667 344.243 L
530.01 344.357 L
536.354 344.457 L
542.697 344.544 L
549.04 344.62 L
555.384 344.685 L
561.727 344.741 L
568.071 344.789 L
574.414 344.829 L
580.758 344.863 L
587.101 344.891 L
593.444 344.915 L
599.788 344.934 L
606.131 344.95 L
612.475 344.962 L
618.818 344.972 L
625.162 344.98 L
631.505 344.986 L
637.848 344.99 L
644.192 344.993 L
650.535 344.996 L
656.879 344.997 L
663.222 344.998 L
669.566 344.999 L
675.909 345 L
682.253 345 L
688.596 345 L
694.939 345 L
701.283 345 L
707.626 345 L
713.97 345 L
720.313 345 L
726.657 345 L
733 345 L
S
GR
GS
[0.75 0 0 0.75 0 0.25] CT
1 GC
N
315 117 M
315 40 L
116 40 L
116 117 L
cp
f
GR
GS
[0.75 0 0 0.75 122.14204 40.75] CT
N
4.984 5.019 M
3.766 5.019 2.781 4.394 QT
1.797 3.769 1.234 2.714 QT
0.672 1.659 0.672 0.487 QT
0.672 -0.7 1.227 -1.786 QT
1.781 -2.872 2.773 -3.52 QT
3.766 -4.169 4.984 -4.169 QT
6.156 -4.169 7.117 -3.708 QT
8.078 -3.247 8.078 -2.2 QT
8.078 -1.809 7.797 -1.52 QT
7.516 -1.231 7.125 -1.231 QT
6.719 -1.231 6.438 -1.52 QT
6.156 -1.809 6.156 -2.2 QT
6.156 -2.559 6.383 -2.817 QT
6.609 -3.075 6.938 -3.138 QT
6.25 -3.575 5 -3.575 QT
4.047 -3.575 3.461 -2.942 QT
2.875 -2.309 2.641 -1.372 QT
2.406 -0.434 2.406 0.487 QT
2.406 1.456 2.695 2.355 QT
2.984 3.253 3.625 3.847 QT
4.266 4.441 5.219 4.441 QT
6.172 4.441 6.836 3.855 QT
7.5 3.269 7.75 2.331 QT
7.75 2.222 7.906 2.222 QT
8.141 2.222 L
8.203 2.222 8.25 2.276 QT
8.297 2.331 8.297 2.394 QT
8.297 2.456 L
8 3.644 7.102 4.331 QT
6.203 5.019 4.984 5.019 QT
cp
f
GR
GS
[0.75 0 0 0.75 122.14204 40.75] CT
N
13.889 5.019 M
12.686 5.019 11.662 4.409 QT
10.639 3.8 10.045 2.776 QT
9.451 1.753 9.451 0.534 QT
9.451 -0.372 9.78 -1.224 QT
10.108 -2.075 10.717 -2.747 QT
11.326 -3.419 12.131 -3.794 QT
12.936 -4.169 13.889 -4.169 QT
15.123 -4.169 16.131 -3.52 QT
17.139 -2.872 17.725 -1.778 QT
18.311 -0.684 18.311 0.534 QT
18.311 1.737 17.717 2.769 QT
17.123 3.8 16.1 4.409 QT
15.076 5.019 13.889 5.019 QT
cp
13.889 4.441 M
15.498 4.441 16.03 3.276 QT
16.561 2.112 16.561 0.316 QT
16.561 -0.684 16.459 -1.349 QT
16.358 -2.013 15.983 -2.544 QT
15.764 -2.872 15.42 -3.122 QT
15.076 -3.372 14.686 -3.505 QT
14.295 -3.638 13.889 -3.638 QT
13.264 -3.638 12.701 -3.356 QT
12.139 -3.075 11.764 -2.544 QT
11.405 -1.981 11.303 -1.302 QT
11.201 -0.622 11.201 0.316 QT
11.201 1.441 11.397 2.331 QT
11.592 3.222 12.178 3.831 QT
12.764 4.441 13.889 4.441 QT
cp
f
GR
GS
[0.75 0 0 0.75 122.14204 40.75] CT
N
19.561 4.862 M
19.561 1.597 L
19.561 1.441 19.733 1.441 QT
19.967 1.441 L
20.092 1.441 20.123 1.597 QT
20.686 4.503 22.826 4.503 QT
23.78 4.503 24.412 4.073 QT
25.045 3.644 25.045 2.737 QT
25.045 2.097 24.553 1.644 QT
24.061 1.191 23.373 1.019 QT
22.03 0.753 L
21.358 0.612 20.811 0.308 QT
20.264 0.003 19.912 -0.497 QT
19.561 -0.997 19.561 -1.669 QT
19.561 -2.544 20.022 -3.106 QT
20.483 -3.669 21.225 -3.919 QT
21.967 -4.169 22.826 -4.169 QT
23.858 -4.169 24.608 -3.622 QT
25.186 -4.122 L
25.186 -4.169 25.28 -4.169 QT
25.436 -4.169 L
25.498 -4.169 25.545 -4.114 QT
25.592 -4.059 25.592 -3.997 QT
25.592 -1.388 L
25.592 -1.2 25.436 -1.2 QT
25.186 -1.2 L
25.014 -1.2 25.014 -1.388 QT
25.014 -2.434 24.436 -3.067 QT
23.858 -3.7 22.811 -3.7 QT
21.905 -3.7 21.248 -3.364 QT
20.592 -3.028 20.592 -2.216 QT
20.592 -1.669 21.061 -1.309 QT
21.53 -0.95 22.17 -0.794 QT
23.53 -0.544 L
24.217 -0.388 24.803 -0.013 QT
25.389 0.362 25.74 0.925 QT
26.092 1.487 26.092 2.206 QT
26.092 2.925 25.842 3.456 QT
25.592 3.987 25.147 4.339 QT
24.701 4.691 24.092 4.855 QT
23.483 5.019 22.826 5.019 QT
21.576 5.019 20.686 4.191 QT
19.951 4.972 L
19.951 5.019 19.842 5.019 QT
19.733 5.019 L
19.561 5.019 19.561 4.862 QT
cp
f
GR
GS
[0.75 0 0 0.75 122.14204 40.75] CT
N
28.825 2.394 M
28.825 -3.122 L
27.153 -3.122 L
27.153 -3.638 L
28.465 -3.638 29.082 -4.856 QT
29.7 -6.075 29.7 -7.513 QT
30.278 -7.513 L
30.278 -3.825 L
33.09 -3.825 L
33.09 -3.122 L
30.278 -3.122 L
30.278 2.362 L
30.278 3.191 30.551 3.816 QT
30.825 4.441 31.559 4.441 QT
32.231 4.441 32.536 3.776 QT
32.84 3.112 32.84 2.362 QT
32.84 1.175 L
33.418 1.175 L
33.418 2.394 L
33.418 3.019 33.192 3.628 QT
32.965 4.237 32.512 4.628 QT
32.059 5.019 31.418 5.019 QT
30.215 5.019 29.52 4.3 QT
28.825 3.581 28.825 2.394 QT
cp
f
GR
GS
[0.75 0 0 0.75 122.14204 40.75] CT
N
41.863 4.8 M
41.863 4.097 L
42.535 4.097 42.98 3.987 QT
43.425 3.878 43.425 3.456 QT
43.425 -3.122 L
41.894 -3.122 L
41.894 -3.825 L
43.425 -3.825 L
43.425 -6.216 L
43.425 -6.856 43.691 -7.419 QT
43.957 -7.981 44.41 -8.403 QT
44.863 -8.825 45.457 -9.067 QT
46.05 -9.309 46.675 -9.309 QT
47.363 -9.309 47.902 -8.903 QT
48.441 -8.497 48.441 -7.841 QT
48.441 -7.45 48.183 -7.192 QT
47.925 -6.934 47.535 -6.934 QT
47.16 -6.934 46.894 -7.192 QT
46.629 -7.45 46.629 -7.841 QT
46.629 -8.466 47.16 -8.684 QT
46.832 -8.778 46.582 -8.778 QT
46.004 -8.778 45.589 -8.364 QT
45.175 -7.95 44.964 -7.356 QT
44.754 -6.763 44.754 -6.184 QT
44.754 -3.825 L
47.066 -3.825 L
47.066 -3.122 L
44.832 -3.122 L
44.832 3.456 L
44.832 3.878 45.418 3.987 QT
46.004 4.097 46.754 4.097 QT
46.754 4.8 L
41.863 4.8 L
cp
f
GR
GS
[0.75 0 0 0.75 122.14204 40.75] CT
N
49.49 2.409 M
49.49 -1.997 L
49.49 -2.528 49.333 -2.77 QT
49.177 -3.013 48.872 -3.067 QT
48.568 -3.122 47.927 -3.122 QT
47.927 -3.825 L
50.958 -4.044 L
50.958 2.409 L
50.958 3.191 51.068 3.628 QT
51.177 4.066 51.544 4.284 QT
51.912 4.503 52.708 4.503 QT
53.787 4.503 54.419 3.605 QT
55.052 2.706 55.052 1.55 QT
55.052 -1.997 L
55.052 -2.528 54.888 -2.77 QT
54.724 -3.013 54.427 -3.067 QT
54.13 -3.122 53.49 -3.122 QT
53.49 -3.825 L
56.521 -4.044 L
56.521 2.987 L
56.521 3.503 56.677 3.745 QT
56.833 3.987 57.138 4.042 QT
57.443 4.097 58.083 4.097 QT
58.083 4.8 L
55.115 5.019 L
55.115 3.331 L
54.74 4.081 54.076 4.55 QT
53.412 5.019 52.615 5.019 QT
51.177 5.019 50.333 4.409 QT
49.49 3.8 49.49 2.409 QT
cp
f
GR
GS
[0.75 0 0 0.75 122.14204 40.75] CT
N
59.038 4.8 M
59.038 4.097 L
59.726 4.097 60.163 3.987 QT
60.601 3.878 60.601 3.456 QT
60.601 -1.997 L
60.601 -2.528 60.445 -2.77 QT
60.288 -3.013 59.984 -3.067 QT
59.679 -3.122 59.038 -3.122 QT
59.038 -3.825 L
61.945 -4.044 L
61.945 -2.091 L
62.335 -2.95 63.124 -3.497 QT
63.913 -4.044 64.835 -4.044 QT
66.226 -4.044 66.929 -3.38 QT
67.632 -2.716 67.632 -1.341 QT
67.632 3.456 L
67.632 3.878 68.07 3.987 QT
68.507 4.097 69.195 4.097 QT
69.195 4.8 L
64.601 4.8 L
64.601 4.097 L
65.288 4.097 65.726 3.987 QT
66.163 3.878 66.163 3.456 QT
66.163 -1.278 L
66.163 -2.263 65.882 -2.895 QT
65.601 -3.528 64.726 -3.528 QT
63.57 -3.528 62.82 -2.599 QT
62.07 -1.669 62.07 -0.481 QT
62.07 3.456 L
62.07 3.878 62.507 3.987 QT
62.945 4.097 63.616 4.097 QT
63.616 4.8 L
59.038 4.8 L
cp
f
GR
GS
[0.75 0 0 0.75 122.14204 40.75] CT
N
74.54 5.019 M
73.321 5.019 72.337 4.394 QT
71.353 3.769 70.79 2.714 QT
70.228 1.659 70.228 0.487 QT
70.228 -0.7 70.782 -1.786 QT
71.337 -2.872 72.329 -3.52 QT
73.321 -4.169 74.54 -4.169 QT
75.712 -4.169 76.673 -3.708 QT
77.634 -3.247 77.634 -2.2 QT
77.634 -1.809 77.353 -1.52 QT
77.071 -1.231 76.681 -1.231 QT
76.274 -1.231 75.993 -1.52 QT
75.712 -1.809 75.712 -2.2 QT
75.712 -2.559 75.939 -2.817 QT
76.165 -3.075 76.493 -3.138 QT
75.806 -3.575 74.556 -3.575 QT
73.603 -3.575 73.017 -2.942 QT
72.431 -2.309 72.196 -1.372 QT
71.962 -0.434 71.962 0.487 QT
71.962 1.456 72.251 2.355 QT
72.54 3.253 73.181 3.847 QT
73.821 4.441 74.774 4.441 QT
75.728 4.441 76.392 3.855 QT
77.056 3.269 77.306 2.331 QT
77.306 2.222 77.462 2.222 QT
77.696 2.222 L
77.759 2.222 77.806 2.276 QT
77.853 2.331 77.853 2.394 QT
77.853 2.456 L
77.556 3.644 76.657 4.331 QT
75.759 5.019 74.54 5.019 QT
cp
f
GR
GS
[0.75 0 0 0.75 122.14204 40.75] CT
N
80.491 2.394 M
80.491 -3.122 L
78.82 -3.122 L
78.82 -3.638 L
80.132 -3.638 80.749 -4.856 QT
81.366 -6.075 81.366 -7.513 QT
81.945 -7.513 L
81.945 -3.825 L
84.757 -3.825 L
84.757 -3.122 L
81.945 -3.122 L
81.945 2.362 L
81.945 3.191 82.218 3.816 QT
82.491 4.441 83.226 4.441 QT
83.898 4.441 84.202 3.776 QT
84.507 3.112 84.507 2.362 QT
84.507 1.175 L
85.085 1.175 L
85.085 2.394 L
85.085 3.019 84.859 3.628 QT
84.632 4.237 84.179 4.628 QT
83.726 5.019 83.085 5.019 QT
81.882 5.019 81.187 4.3 QT
80.491 3.581 80.491 2.394 QT
cp
f
GR
GS
[0.75 0 0 0.75 122.14204 40.75] CT
N
86.832 4.8 M
86.832 4.097 L
87.519 4.097 87.957 3.987 QT
88.394 3.878 88.394 3.456 QT
88.394 -1.997 L
88.394 -2.763 88.097 -2.942 QT
87.801 -3.122 86.926 -3.122 QT
86.926 -3.825 L
89.801 -4.044 L
89.801 3.456 L
89.801 3.878 90.183 3.987 QT
90.566 4.097 91.207 4.097 QT
91.207 4.8 L
86.832 4.8 L
cp
87.691 -7.481 M
87.691 -7.919 88.019 -8.247 QT
88.347 -8.575 88.785 -8.575 QT
89.066 -8.575 89.332 -8.434 QT
89.597 -8.294 89.738 -8.028 QT
89.879 -7.763 89.879 -7.481 QT
89.879 -7.044 89.551 -6.716 QT
89.222 -6.388 88.785 -6.388 QT
88.347 -6.388 88.019 -6.716 QT
87.691 -7.044 87.691 -7.481 QT
cp
f
GR
GS
[0.75 0 0 0.75 122.14204 40.75] CT
N
96.778 5.019 M
95.575 5.019 94.551 4.409 QT
93.528 3.8 92.934 2.776 QT
92.34 1.753 92.34 0.534 QT
92.34 -0.372 92.669 -1.224 QT
92.997 -2.075 93.606 -2.747 QT
94.215 -3.419 95.02 -3.794 QT
95.825 -4.169 96.778 -4.169 QT
98.012 -4.169 99.02 -3.52 QT
100.028 -2.872 100.614 -1.778 QT
101.2 -0.684 101.2 0.534 QT
101.2 1.737 100.606 2.769 QT
100.012 3.8 98.989 4.409 QT
97.965 5.019 96.778 5.019 QT
cp
96.778 4.441 M
98.387 4.441 98.919 3.276 QT
99.45 2.112 99.45 0.316 QT
99.45 -0.684 99.348 -1.349 QT
99.247 -2.013 98.872 -2.544 QT
98.653 -2.872 98.309 -3.122 QT
97.965 -3.372 97.575 -3.505 QT
97.184 -3.638 96.778 -3.638 QT
96.153 -3.638 95.59 -3.356 QT
95.028 -3.075 94.653 -2.544 QT
94.294 -1.981 94.192 -1.302 QT
94.09 -0.622 94.09 0.316 QT
94.09 1.441 94.286 2.331 QT
94.481 3.222 95.067 3.831 QT
95.653 4.441 96.778 4.441 QT
cp
f
GR
GS
[0.75 0 0 0.75 122.14204 40.75] CT
N
102.372 4.8 M
102.372 4.097 L
103.059 4.097 103.497 3.987 QT
103.934 3.878 103.934 3.456 QT
103.934 -1.997 L
103.934 -2.528 103.778 -2.77 QT
103.622 -3.013 103.317 -3.067 QT
103.012 -3.122 102.372 -3.122 QT
102.372 -3.825 L
105.278 -4.044 L
105.278 -2.091 L
105.669 -2.95 106.458 -3.497 QT
107.247 -4.044 108.169 -4.044 QT
109.559 -4.044 110.262 -3.38 QT
110.965 -2.716 110.965 -1.341 QT
110.965 3.456 L
110.965 3.878 111.403 3.987 QT
111.84 4.097 112.528 4.097 QT
112.528 4.8 L
107.934 4.8 L
107.934 4.097 L
108.622 4.097 109.059 3.987 QT
109.497 3.878 109.497 3.456 QT
109.497 -1.278 L
109.497 -2.263 109.215 -2.895 QT
108.934 -3.528 108.059 -3.528 QT
106.903 -3.528 106.153 -2.599 QT
105.403 -1.669 105.403 -0.481 QT
105.403 3.456 L
105.403 3.878 105.84 3.987 QT
106.278 4.097 106.95 4.097 QT
106.95 4.8 L
102.372 4.8 L
cp
f
GR
GS
[0.75 0 0 0.75 0 0.25] CT
0 0.447 0.741 RC
1 LJ
2.667 LW
N
119.988 54 M
159.865 54 L
S
GR
GS
[0.75 0 0 0.75 122.14204 59.125] CT
N
4.891 5.019 M
3.703 5.019 2.727 4.378 QT
1.75 3.737 1.211 2.698 QT
0.672 1.659 0.672 0.487 QT
0.672 -0.731 1.258 -1.77 QT
1.844 -2.809 2.859 -3.427 QT
3.875 -4.044 5.094 -4.044 QT
5.828 -4.044 6.484 -3.731 QT
7.141 -3.419 7.625 -2.872 QT
7.625 -7.044 L
7.625 -7.575 7.461 -7.817 QT
7.297 -8.059 7 -8.106 QT
6.703 -8.153 6.063 -8.153 QT
6.063 -8.856 L
9.031 -9.075 L
9.031 2.987 L
9.031 3.503 9.188 3.745 QT
9.344 3.987 9.641 4.042 QT
9.938 4.097 10.578 4.097 QT
10.578 4.8 L
7.563 5.019 L
7.563 3.769 L
7.047 4.362 6.328 4.691 QT
5.609 5.019 4.891 5.019 QT
cp
2.844 3.066 M
3.188 3.722 3.758 4.112 QT
4.328 4.503 5 4.503 QT
5.828 4.503 6.523 4.019 QT
7.219 3.534 7.563 2.784 QT
7.563 -2.013 L
7.328 -2.45 6.969 -2.802 QT
6.609 -3.153 6.164 -3.341 QT
5.719 -3.528 5.219 -3.528 QT
4.188 -3.528 3.547 -2.934 QT
2.906 -2.341 2.656 -1.419 QT
2.406 -0.497 2.406 0.503 QT
2.406 1.3 2.484 1.894 QT
2.563 2.487 2.844 3.066 QT
cp
f
GR
GS
[0.75 0 0 0.75 122.14204 59.125] CT
N
16.096 5.019 M
14.877 5.019 13.853 4.378 QT
12.83 3.737 12.252 2.675 QT
11.674 1.612 11.674 0.409 QT
11.674 -0.763 12.205 -1.817 QT
12.736 -2.872 13.689 -3.52 QT
14.642 -4.169 15.814 -4.169 QT
16.721 -4.169 17.4 -3.856 QT
18.08 -3.544 18.525 -2.997 QT
18.971 -2.45 19.189 -1.708 QT
19.408 -0.966 19.408 -0.091 QT
19.408 0.175 19.205 0.175 QT
13.424 0.175 L
13.424 0.394 L
13.424 2.05 14.088 3.245 QT
14.752 4.441 16.267 4.441 QT
16.877 4.441 17.4 4.167 QT
17.924 3.894 18.314 3.401 QT
18.705 2.909 18.83 2.362 QT
18.861 2.284 18.916 2.23 QT
18.971 2.175 19.033 2.175 QT
19.205 2.175 L
19.408 2.175 19.408 2.441 QT
19.127 3.566 18.189 4.292 QT
17.252 5.019 16.096 5.019 QT
cp
13.439 -0.325 M
18.002 -0.325 L
18.002 -1.075 17.791 -1.841 QT
17.58 -2.606 17.088 -3.122 QT
16.596 -3.638 15.814 -3.638 QT
14.674 -3.638 14.056 -2.575 QT
13.439 -1.513 13.439 -0.325 QT
cp
f
GR
GS
[0.75 0 0 0.75 122.14204 59.125] CT
N
24.984 5.019 M
23.766 5.019 22.781 4.394 QT
21.797 3.769 21.234 2.714 QT
20.672 1.659 20.672 0.487 QT
20.672 -0.7 21.227 -1.786 QT
21.781 -2.872 22.773 -3.52 QT
23.766 -4.169 24.984 -4.169 QT
26.156 -4.169 27.117 -3.708 QT
28.078 -3.247 28.078 -2.2 QT
28.078 -1.809 27.797 -1.52 QT
27.516 -1.231 27.125 -1.231 QT
26.719 -1.231 26.438 -1.52 QT
26.156 -1.809 26.156 -2.2 QT
26.156 -2.559 26.383 -2.817 QT
26.609 -3.075 26.938 -3.138 QT
26.25 -3.575 25 -3.575 QT
24.047 -3.575 23.461 -2.942 QT
22.875 -2.309 22.641 -1.372 QT
22.406 -0.434 22.406 0.487 QT
22.406 1.456 22.695 2.355 QT
22.984 3.253 23.625 3.847 QT
24.266 4.441 25.219 4.441 QT
26.172 4.441 26.836 3.855 QT
27.5 3.269 27.75 2.331 QT
27.75 2.222 27.906 2.222 QT
28.141 2.222 L
28.203 2.222 28.25 2.276 QT
28.297 2.331 28.297 2.394 QT
28.297 2.456 L
28 3.644 27.102 4.331 QT
26.203 5.019 24.984 5.019 QT
cp
f
GR
GS
[0.75 0 0 0.75 122.14204 59.125] CT
N
33.873 5.019 M
32.655 5.019 31.631 4.378 QT
30.608 3.737 30.03 2.675 QT
29.451 1.612 29.451 0.409 QT
29.451 -0.763 29.983 -1.817 QT
30.514 -2.872 31.467 -3.52 QT
32.42 -4.169 33.592 -4.169 QT
34.498 -4.169 35.178 -3.856 QT
35.858 -3.544 36.303 -2.997 QT
36.748 -2.45 36.967 -1.708 QT
37.186 -0.966 37.186 -0.091 QT
37.186 0.175 36.983 0.175 QT
31.201 0.175 L
31.201 0.394 L
31.201 2.05 31.865 3.245 QT
32.53 4.441 34.045 4.441 QT
34.655 4.441 35.178 4.167 QT
35.701 3.894 36.092 3.401 QT
36.483 2.909 36.608 2.362 QT
36.639 2.284 36.694 2.23 QT
36.748 2.175 36.811 2.175 QT
36.983 2.175 L
37.186 2.175 37.186 2.441 QT
36.905 3.566 35.967 4.292 QT
35.03 5.019 33.873 5.019 QT
cp
31.217 -0.325 M
35.78 -0.325 L
35.78 -1.075 35.569 -1.841 QT
35.358 -2.606 34.865 -3.122 QT
34.373 -3.638 33.592 -3.638 QT
32.451 -3.638 31.834 -2.575 QT
31.217 -1.513 31.217 -0.325 QT
cp
f
GR
GS
[0.75 0 0 0.75 122.14204 59.125] CT
N
38.387 4.8 M
38.387 4.097 L
39.075 4.097 39.512 3.987 QT
39.95 3.878 39.95 3.456 QT
39.95 -7.044 L
39.95 -7.575 39.793 -7.817 QT
39.637 -8.059 39.332 -8.106 QT
39.028 -8.153 38.387 -8.153 QT
38.387 -8.856 L
41.356 -9.075 L
41.356 3.456 L
41.356 3.878 41.801 3.987 QT
42.247 4.097 42.918 4.097 QT
42.918 4.8 L
38.387 4.8 L
cp
f
GR
GS
[0.75 0 0 0.75 122.14204 59.125] CT
N
48.318 5.019 M
47.099 5.019 46.076 4.378 QT
45.052 3.737 44.474 2.675 QT
43.896 1.612 43.896 0.409 QT
43.896 -0.763 44.427 -1.817 QT
44.958 -2.872 45.911 -3.52 QT
46.865 -4.169 48.036 -4.169 QT
48.943 -4.169 49.622 -3.856 QT
50.302 -3.544 50.747 -2.997 QT
51.193 -2.45 51.411 -1.708 QT
51.63 -0.966 51.63 -0.091 QT
51.63 0.175 51.427 0.175 QT
45.646 0.175 L
45.646 0.394 L
45.646 2.05 46.31 3.245 QT
46.974 4.441 48.49 4.441 QT
49.099 4.441 49.622 4.167 QT
50.146 3.894 50.536 3.401 QT
50.927 2.909 51.052 2.362 QT
51.083 2.284 51.138 2.23 QT
51.193 2.175 51.255 2.175 QT
51.427 2.175 L
51.63 2.175 51.63 2.441 QT
51.349 3.566 50.411 4.292 QT
49.474 5.019 48.318 5.019 QT
cp
45.661 -0.325 M
50.224 -0.325 L
50.224 -1.075 50.013 -1.841 QT
49.802 -2.606 49.31 -3.122 QT
48.818 -3.638 48.036 -3.638 QT
46.896 -3.638 46.279 -2.575 QT
45.661 -1.513 45.661 -0.325 QT
cp
f
GR
GS
[0.75 0 0 0.75 122.14204 59.125] CT
N
52.738 4.8 M
52.738 4.097 L
53.425 4.097 53.863 3.987 QT
54.3 3.878 54.3 3.456 QT
54.3 -1.997 L
54.3 -2.528 54.144 -2.77 QT
53.988 -3.013 53.683 -3.067 QT
53.379 -3.122 52.738 -3.122 QT
52.738 -3.825 L
55.597 -4.044 L
55.597 -2.091 L
55.925 -2.95 56.519 -3.497 QT
57.113 -4.044 57.972 -4.044 QT
58.566 -4.044 59.035 -3.692 QT
59.504 -3.341 59.504 -2.763 QT
59.504 -2.403 59.246 -2.13 QT
58.988 -1.856 58.597 -1.856 QT
58.222 -1.856 57.964 -2.122 QT
57.707 -2.388 57.707 -2.763 QT
57.707 -3.294 58.082 -3.528 QT
57.972 -3.528 L
57.16 -3.528 56.644 -2.942 QT
56.129 -2.356 55.918 -1.481 QT
55.707 -0.606 55.707 0.175 QT
55.707 3.456 L
55.707 4.097 57.644 4.097 QT
57.644 4.8 L
52.738 4.8 L
cp
f
GR
GS
[0.75 0 0 0.75 122.14204 59.125] CT
N
60.852 2.831 M
60.852 1.644 61.79 0.894 QT
62.727 0.144 64.04 -0.161 QT
65.352 -0.466 66.54 -0.466 QT
66.54 -1.278 L
66.54 -1.856 66.29 -2.403 QT
66.04 -2.95 65.556 -3.294 QT
65.071 -3.638 64.493 -3.638 QT
63.165 -3.638 62.477 -3.044 QT
62.852 -3.044 63.102 -2.755 QT
63.352 -2.466 63.352 -2.091 QT
63.352 -1.684 63.071 -1.403 QT
62.79 -1.122 62.399 -1.122 QT
61.993 -1.122 61.712 -1.403 QT
61.431 -1.684 61.431 -2.091 QT
61.431 -3.138 62.392 -3.653 QT
63.352 -4.169 64.493 -4.169 QT
65.306 -4.169 66.126 -3.817 QT
66.946 -3.466 67.47 -2.825 QT
67.993 -2.184 67.993 -1.325 QT
67.993 3.175 L
67.993 3.566 68.157 3.894 QT
68.321 4.222 68.681 4.222 QT
69.009 4.222 69.173 3.894 QT
69.337 3.566 69.337 3.175 QT
69.337 1.894 L
69.915 1.894 L
69.915 3.175 L
69.915 3.628 69.681 4.034 QT
69.446 4.441 69.056 4.683 QT
68.665 4.925 68.196 4.925 QT
67.618 4.925 67.188 4.464 QT
66.759 4.003 66.712 3.378 QT
66.352 4.128 65.626 4.573 QT
64.899 5.019 64.087 5.019 QT
63.321 5.019 62.579 4.8 QT
61.837 4.581 61.345 4.097 QT
60.852 3.612 60.852 2.831 QT
cp
62.477 2.831 M
62.477 3.534 62.993 4.019 QT
63.509 4.503 64.212 4.503 QT
64.868 4.503 65.392 4.175 QT
65.915 3.847 66.227 3.292 QT
66.54 2.737 66.54 2.128 QT
66.54 0.05 L
65.634 0.05 64.681 0.347 QT
63.727 0.644 63.102 1.276 QT
62.477 1.909 62.477 2.831 QT
cp
f
GR
GS
[0.75 0 0 0.75 122.14204 59.125] CT
N
72.103 2.394 M
72.103 -3.122 L
70.431 -3.122 L
70.431 -3.638 L
71.743 -3.638 72.36 -4.856 QT
72.978 -6.075 72.978 -7.513 QT
73.556 -7.513 L
73.556 -3.825 L
76.368 -3.825 L
76.368 -3.122 L
73.556 -3.122 L
73.556 2.362 L
73.556 3.191 73.829 3.816 QT
74.103 4.441 74.837 4.441 QT
75.509 4.441 75.813 3.776 QT
76.118 3.112 76.118 2.362 QT
76.118 1.175 L
76.696 1.175 L
76.696 2.394 L
76.696 3.019 76.47 3.628 QT
76.243 4.237 75.79 4.628 QT
75.337 5.019 74.696 5.019 QT
73.493 5.019 72.798 4.3 QT
72.103 3.581 72.103 2.394 QT
cp
f
GR
GS
[0.75 0 0 0.75 122.14204 59.125] CT
N
78.443 4.8 M
78.443 4.097 L
79.13 4.097 79.568 3.987 QT
80.005 3.878 80.005 3.456 QT
80.005 -1.997 L
80.005 -2.763 79.708 -2.942 QT
79.412 -3.122 78.537 -3.122 QT
78.537 -3.825 L
81.412 -4.044 L
81.412 3.456 L
81.412 3.878 81.794 3.987 QT
82.177 4.097 82.818 4.097 QT
82.818 4.8 L
78.443 4.8 L
cp
79.302 -7.481 M
79.302 -7.919 79.63 -8.247 QT
79.958 -8.575 80.396 -8.575 QT
80.677 -8.575 80.943 -8.434 QT
81.208 -8.294 81.349 -8.028 QT
81.49 -7.763 81.49 -7.481 QT
81.49 -7.044 81.162 -6.716 QT
80.833 -6.388 80.396 -6.388 QT
79.958 -6.388 79.63 -6.716 QT
79.302 -7.044 79.302 -7.481 QT
cp
f
GR
GS
[0.75 0 0 0.75 122.14204 59.125] CT
N
88.389 5.019 M
87.186 5.019 86.162 4.409 QT
85.139 3.8 84.545 2.776 QT
83.952 1.753 83.952 0.534 QT
83.952 -0.372 84.28 -1.224 QT
84.608 -2.075 85.217 -2.747 QT
85.827 -3.419 86.631 -3.794 QT
87.436 -4.169 88.389 -4.169 QT
89.623 -4.169 90.631 -3.52 QT
91.639 -2.872 92.225 -1.778 QT
92.811 -0.684 92.811 0.534 QT
92.811 1.737 92.217 2.769 QT
91.623 3.8 90.6 4.409 QT
89.577 5.019 88.389 5.019 QT
cp
88.389 4.441 M
89.998 4.441 90.53 3.276 QT
91.061 2.112 91.061 0.316 QT
91.061 -0.684 90.959 -1.349 QT
90.858 -2.013 90.483 -2.544 QT
90.264 -2.872 89.92 -3.122 QT
89.577 -3.372 89.186 -3.505 QT
88.795 -3.638 88.389 -3.638 QT
87.764 -3.638 87.202 -3.356 QT
86.639 -3.075 86.264 -2.544 QT
85.905 -1.981 85.803 -1.302 QT
85.702 -0.622 85.702 0.316 QT
85.702 1.441 85.897 2.331 QT
86.092 3.222 86.678 3.831 QT
87.264 4.441 88.389 4.441 QT
cp
f
GR
GS
[0.75 0 0 0.75 122.14204 59.125] CT
N
93.983 4.8 M
93.983 4.097 L
94.67 4.097 95.108 3.987 QT
95.545 3.878 95.545 3.456 QT
95.545 -1.997 L
95.545 -2.528 95.389 -2.77 QT
95.233 -3.013 94.928 -3.067 QT
94.623 -3.122 93.983 -3.122 QT
93.983 -3.825 L
96.889 -4.044 L
96.889 -2.091 L
97.28 -2.95 98.069 -3.497 QT
98.858 -4.044 99.78 -4.044 QT
101.17 -4.044 101.873 -3.38 QT
102.577 -2.716 102.577 -1.341 QT
102.577 3.456 L
102.577 3.878 103.014 3.987 QT
103.452 4.097 104.139 4.097 QT
104.139 4.8 L
99.545 4.8 L
99.545 4.097 L
100.233 4.097 100.67 3.987 QT
101.108 3.878 101.108 3.456 QT
101.108 -1.278 L
101.108 -2.263 100.827 -2.895 QT
100.545 -3.528 99.67 -3.528 QT
98.514 -3.528 97.764 -2.599 QT
97.014 -1.669 97.014 -0.481 QT
97.014 3.456 L
97.014 3.878 97.452 3.987 QT
97.889 4.097 98.561 4.097 QT
98.561 4.8 L
93.983 4.8 L
cp
f
GR
GS
[0.75 0 0 0.75 122.14204 59.125] CT
N
116.151 5.019 M
114.932 5.019 113.948 4.394 QT
112.964 3.769 112.401 2.714 QT
111.839 1.659 111.839 0.487 QT
111.839 -0.7 112.393 -1.786 QT
112.948 -2.872 113.94 -3.52 QT
114.932 -4.169 116.151 -4.169 QT
117.323 -4.169 118.284 -3.708 QT
119.245 -3.247 119.245 -2.2 QT
119.245 -1.809 118.964 -1.52 QT
118.682 -1.231 118.292 -1.231 QT
117.886 -1.231 117.604 -1.52 QT
117.323 -1.809 117.323 -2.2 QT
117.323 -2.559 117.55 -2.817 QT
117.776 -3.075 118.104 -3.138 QT
117.417 -3.575 116.167 -3.575 QT
115.214 -3.575 114.628 -2.942 QT
114.042 -2.309 113.807 -1.372 QT
113.573 -0.434 113.573 0.487 QT
113.573 1.456 113.862 2.355 QT
114.151 3.253 114.792 3.847 QT
115.432 4.441 116.386 4.441 QT
117.339 4.441 118.003 3.855 QT
118.667 3.269 118.917 2.331 QT
118.917 2.222 119.073 2.222 QT
119.307 2.222 L
119.37 2.222 119.417 2.276 QT
119.464 2.331 119.464 2.394 QT
119.464 2.456 L
119.167 3.644 118.268 4.331 QT
117.37 5.019 116.151 5.019 QT
cp
f
GR
GS
[0.75 0 0 0.75 122.14204 59.125] CT
N
125.056 5.019 M
123.853 5.019 122.829 4.409 QT
121.806 3.8 121.212 2.776 QT
120.618 1.753 120.618 0.534 QT
120.618 -0.372 120.946 -1.224 QT
121.274 -2.075 121.884 -2.747 QT
122.493 -3.419 123.298 -3.794 QT
124.103 -4.169 125.056 -4.169 QT
126.29 -4.169 127.298 -3.52 QT
128.306 -2.872 128.892 -1.778 QT
129.478 -0.684 129.478 0.534 QT
129.478 1.737 128.884 2.769 QT
128.29 3.8 127.267 4.409 QT
126.243 5.019 125.056 5.019 QT
cp
125.056 4.441 M
126.665 4.441 127.196 3.276 QT
127.728 2.112 127.728 0.316 QT
127.728 -0.684 127.626 -1.349 QT
127.524 -2.013 127.149 -2.544 QT
126.931 -2.872 126.587 -3.122 QT
126.243 -3.372 125.853 -3.505 QT
125.462 -3.638 125.056 -3.638 QT
124.431 -3.638 123.868 -3.356 QT
123.306 -3.075 122.931 -2.544 QT
122.571 -1.981 122.47 -1.302 QT
122.368 -0.622 122.368 0.316 QT
122.368 1.441 122.564 2.331 QT
122.759 3.222 123.345 3.831 QT
123.931 4.441 125.056 4.441 QT
cp
f
GR
GS
[0.75 0 0 0.75 122.14204 59.125] CT
N
130.728 4.862 M
130.728 1.597 L
130.728 1.441 130.9 1.441 QT
131.134 1.441 L
131.259 1.441 131.29 1.597 QT
131.853 4.503 133.993 4.503 QT
134.946 4.503 135.579 4.073 QT
136.212 3.644 136.212 2.737 QT
136.212 2.097 135.72 1.644 QT
135.228 1.191 134.54 1.019 QT
133.196 0.753 L
132.525 0.612 131.978 0.308 QT
131.431 0.003 131.079 -0.497 QT
130.728 -0.997 130.728 -1.669 QT
130.728 -2.544 131.189 -3.106 QT
131.65 -3.669 132.392 -3.919 QT
133.134 -4.169 133.993 -4.169 QT
135.025 -4.169 135.775 -3.622 QT
136.353 -4.122 L
136.353 -4.169 136.446 -4.169 QT
136.603 -4.169 L
136.665 -4.169 136.712 -4.114 QT
136.759 -4.059 136.759 -3.997 QT
136.759 -1.388 L
136.759 -1.2 136.603 -1.2 QT
136.353 -1.2 L
136.181 -1.2 136.181 -1.388 QT
136.181 -2.434 135.603 -3.067 QT
135.025 -3.7 133.978 -3.7 QT
133.071 -3.7 132.415 -3.364 QT
131.759 -3.028 131.759 -2.216 QT
131.759 -1.669 132.228 -1.309 QT
132.696 -0.95 133.337 -0.794 QT
134.696 -0.544 L
135.384 -0.388 135.97 -0.013 QT
136.556 0.362 136.907 0.925 QT
137.259 1.487 137.259 2.206 QT
137.259 2.925 137.009 3.456 QT
136.759 3.987 136.314 4.339 QT
135.868 4.691 135.259 4.855 QT
134.65 5.019 133.993 5.019 QT
132.743 5.019 131.853 4.191 QT
131.118 4.972 L
131.118 5.019 131.009 5.019 QT
130.9 5.019 L
130.728 5.019 130.728 4.862 QT
cp
f
GR
GS
[0.75 0 0 0.75 122.14204 59.125] CT
N
139.992 2.394 M
139.992 -3.122 L
138.32 -3.122 L
138.32 -3.638 L
139.632 -3.638 140.249 -4.856 QT
140.867 -6.075 140.867 -7.513 QT
141.445 -7.513 L
141.445 -3.825 L
144.257 -3.825 L
144.257 -3.122 L
141.445 -3.122 L
141.445 2.362 L
141.445 3.191 141.718 3.816 QT
141.992 4.441 142.726 4.441 QT
143.398 4.441 143.702 3.776 QT
144.007 3.112 144.007 2.362 QT
144.007 1.175 L
144.585 1.175 L
144.585 2.394 L
144.585 3.019 144.359 3.628 QT
144.132 4.237 143.679 4.628 QT
143.226 5.019 142.585 5.019 QT
141.382 5.019 140.687 4.3 QT
139.992 3.581 139.992 2.394 QT
cp
f
GR
GS
[0.75 0 0 0.75 0 0.25] CT
0.851 0.325 0.098 RC
[8 8] 0 setdash
2 LJ
2.667 LW
N
119.988 78.5 M
159.865 78.5 L
S
GR
GS
[0.75 0 0 0.75 122.14204 77.5] CT
N
4.984 5.019 M
3.766 5.019 2.742 4.378 QT
1.719 3.737 1.141 2.675 QT
0.563 1.612 0.563 0.409 QT
0.563 -0.763 1.094 -1.817 QT
1.625 -2.872 2.578 -3.52 QT
3.531 -4.169 4.703 -4.169 QT
5.609 -4.169 6.289 -3.856 QT
6.969 -3.544 7.414 -2.997 QT
7.859 -2.45 8.078 -1.708 QT
8.297 -0.966 8.297 -0.091 QT
8.297 0.175 8.094 0.175 QT
2.313 0.175 L
2.313 0.394 L
2.313 2.05 2.977 3.245 QT
3.641 4.441 5.156 4.441 QT
5.766 4.441 6.289 4.167 QT
6.813 3.894 7.203 3.401 QT
7.594 2.909 7.719 2.362 QT
7.75 2.284 7.805 2.23 QT
7.859 2.175 7.922 2.175 QT
8.094 2.175 L
8.297 2.175 8.297 2.441 QT
8.016 3.566 7.078 4.292 QT
6.141 5.019 4.984 5.019 QT
cp
2.328 -0.325 M
6.891 -0.325 L
6.891 -1.075 6.68 -1.841 QT
6.469 -2.606 5.977 -3.122 QT
5.484 -3.638 4.703 -3.638 QT
3.563 -3.638 2.945 -2.575 QT
2.328 -1.513 2.328 -0.325 QT
cp
f
GR
GS
[0.75 0 0 0.75 122.14204 77.5] CT
N
9.686 2.831 M
9.686 1.644 10.623 0.894 QT
11.561 0.144 12.873 -0.161 QT
14.186 -0.466 15.373 -0.466 QT
15.373 -1.278 L
15.373 -1.856 15.123 -2.403 QT
14.873 -2.95 14.389 -3.294 QT
13.905 -3.638 13.326 -3.638 QT
11.998 -3.638 11.311 -3.044 QT
11.686 -3.044 11.936 -2.755 QT
12.186 -2.466 12.186 -2.091 QT
12.186 -1.684 11.905 -1.403 QT
11.623 -1.122 11.233 -1.122 QT
10.826 -1.122 10.545 -1.403 QT
10.264 -1.684 10.264 -2.091 QT
10.264 -3.138 11.225 -3.653 QT
12.186 -4.169 13.326 -4.169 QT
14.139 -4.169 14.959 -3.817 QT
15.78 -3.466 16.303 -2.825 QT
16.826 -2.184 16.826 -1.325 QT
16.826 3.175 L
16.826 3.566 16.99 3.894 QT
17.155 4.222 17.514 4.222 QT
17.842 4.222 18.006 3.894 QT
18.17 3.566 18.17 3.175 QT
18.17 1.894 L
18.748 1.894 L
18.748 3.175 L
18.748 3.628 18.514 4.034 QT
18.28 4.441 17.889 4.683 QT
17.498 4.925 17.03 4.925 QT
16.451 4.925 16.022 4.464 QT
15.592 4.003 15.545 3.378 QT
15.186 4.128 14.459 4.573 QT
13.733 5.019 12.92 5.019 QT
12.155 5.019 11.412 4.8 QT
10.67 4.581 10.178 4.097 QT
9.686 3.612 9.686 2.831 QT
cp
11.311 2.831 M
11.311 3.534 11.826 4.019 QT
12.342 4.503 13.045 4.503 QT
13.701 4.503 14.225 4.175 QT
14.748 3.847 15.061 3.292 QT
15.373 2.737 15.373 2.128 QT
15.373 0.05 L
14.467 0.05 13.514 0.347 QT
12.561 0.644 11.936 1.276 QT
11.311 1.909 11.311 2.831 QT
cp
f
GR
GS
[0.75 0 0 0.75 122.14204 77.5] CT
N
19.405 4.8 M
19.405 4.097 L
20.092 4.097 20.53 3.987 QT
20.967 3.878 20.967 3.456 QT
20.967 -1.997 L
20.967 -2.528 20.811 -2.77 QT
20.655 -3.013 20.35 -3.067 QT
20.045 -3.122 19.405 -3.122 QT
19.405 -3.825 L
22.264 -4.044 L
22.264 -2.091 L
22.592 -2.95 23.186 -3.497 QT
23.78 -4.044 24.639 -4.044 QT
25.233 -4.044 25.701 -3.692 QT
26.17 -3.341 26.17 -2.763 QT
26.17 -2.403 25.912 -2.13 QT
25.655 -1.856 25.264 -1.856 QT
24.889 -1.856 24.631 -2.122 QT
24.373 -2.388 24.373 -2.763 QT
24.373 -3.294 24.748 -3.528 QT
24.639 -3.528 L
23.826 -3.528 23.311 -2.942 QT
22.795 -2.356 22.584 -1.481 QT
22.373 -0.606 22.373 0.175 QT
22.373 3.456 L
22.373 4.097 24.311 4.097 QT
24.311 4.8 L
19.405 4.8 L
cp
f
GR
GS
[0.75 0 0 0.75 122.14204 77.5] CT
N
27.332 4.8 M
27.332 4.097 L
28.019 4.097 28.457 3.987 QT
28.894 3.878 28.894 3.456 QT
28.894 -7.044 L
28.894 -7.575 28.738 -7.817 QT
28.582 -8.059 28.277 -8.106 QT
27.972 -8.153 27.332 -8.153 QT
27.332 -8.856 L
30.3 -9.075 L
30.3 3.456 L
30.3 3.878 30.746 3.987 QT
31.191 4.097 31.863 4.097 QT
31.863 4.8 L
27.332 4.8 L
cp
f
GR
GS
[0.75 0 0 0.75 122.14204 77.5] CT
N
33.653 8.081 M
34.043 8.378 34.497 8.378 QT
35.762 8.378 36.559 6.487 QT
37.247 4.8 L
34.247 -2.544 L
34.059 -2.919 33.676 -3.02 QT
33.293 -3.122 32.653 -3.122 QT
32.653 -3.825 L
36.856 -3.825 L
36.856 -3.122 L
35.762 -3.122 35.762 -2.638 QT
35.762 -2.559 35.778 -2.528 QT
37.997 2.941 L
39.997 -1.981 L
40.059 -2.138 40.059 -2.325 QT
40.059 -2.559 39.926 -2.739 QT
39.793 -2.919 39.583 -3.02 QT
39.372 -3.122 39.122 -3.122 QT
39.122 -3.825 L
42.434 -3.825 L
42.434 -3.122 L
41.825 -3.122 41.356 -2.841 QT
40.887 -2.559 40.637 -1.997 QT
37.184 6.487 L
36.903 7.128 36.536 7.667 QT
36.168 8.206 35.645 8.558 QT
35.122 8.909 34.497 8.909 QT
33.762 8.909 33.208 8.425 QT
32.653 7.941 32.653 7.222 QT
32.653 6.847 32.911 6.597 QT
33.168 6.347 33.543 6.347 QT
33.793 6.347 33.997 6.456 QT
34.2 6.566 34.309 6.761 QT
34.418 6.956 34.418 7.222 QT
34.418 7.55 34.2 7.8 QT
33.981 8.05 33.653 8.081 QT
cp
f
GR
GS
[0.75 0 0 0.75 122.14204 77.5] CT
N
51.547 2.394 M
51.547 -3.122 L
49.875 -3.122 L
49.875 -3.638 L
51.188 -3.638 51.805 -4.856 QT
52.422 -6.075 52.422 -7.513 QT
53 -7.513 L
53 -3.825 L
55.813 -3.825 L
55.813 -3.122 L
53 -3.122 L
53 2.362 L
53 3.191 53.274 3.816 QT
53.547 4.441 54.281 4.441 QT
54.953 4.441 55.258 3.776 QT
55.563 3.112 55.563 2.362 QT
55.563 1.175 L
56.141 1.175 L
56.141 2.394 L
56.141 3.019 55.914 3.628 QT
55.688 4.237 55.234 4.628 QT
54.781 5.019 54.141 5.019 QT
52.938 5.019 52.242 4.3 QT
51.547 3.581 51.547 2.394 QT
cp
f
GR
GS
[0.75 0 0 0.75 122.14204 77.5] CT
N
57.794 4.8 M
57.794 4.097 L
58.481 4.097 58.919 3.987 QT
59.356 3.878 59.356 3.456 QT
59.356 -1.997 L
59.356 -2.528 59.2 -2.77 QT
59.044 -3.013 58.739 -3.067 QT
58.434 -3.122 57.794 -3.122 QT
57.794 -3.825 L
60.653 -4.044 L
60.653 -2.091 L
60.981 -2.95 61.575 -3.497 QT
62.169 -4.044 63.028 -4.044 QT
63.622 -4.044 64.09 -3.692 QT
64.559 -3.341 64.559 -2.763 QT
64.559 -2.403 64.301 -2.13 QT
64.044 -1.856 63.653 -1.856 QT
63.278 -1.856 63.02 -2.122 QT
62.762 -2.388 62.762 -2.763 QT
62.762 -3.294 63.137 -3.528 QT
63.028 -3.528 L
62.215 -3.528 61.7 -2.942 QT
61.184 -2.356 60.973 -1.481 QT
60.762 -0.606 60.762 0.175 QT
60.762 3.456 L
60.762 4.097 62.7 4.097 QT
62.7 4.8 L
57.794 4.8 L
cp
f
GR
GS
[0.75 0 0 0.75 122.14204 77.5] CT
N
65.721 4.8 M
65.721 4.097 L
66.408 4.097 66.846 3.987 QT
67.283 3.878 67.283 3.456 QT
67.283 -1.997 L
67.283 -2.763 66.986 -2.942 QT
66.689 -3.122 65.814 -3.122 QT
65.814 -3.825 L
68.689 -4.044 L
68.689 3.456 L
68.689 3.878 69.072 3.987 QT
69.455 4.097 70.096 4.097 QT
70.096 4.8 L
65.721 4.8 L
cp
66.58 -7.481 M
66.58 -7.919 66.908 -8.247 QT
67.236 -8.575 67.674 -8.575 QT
67.955 -8.575 68.221 -8.434 QT
68.486 -8.294 68.627 -8.028 QT
68.767 -7.763 68.767 -7.481 QT
68.767 -7.044 68.439 -6.716 QT
68.111 -6.388 67.674 -6.388 QT
67.236 -6.388 66.908 -6.716 QT
66.58 -7.044 66.58 -7.481 QT
cp
f
GR
GS
[0.75 0 0 0.75 122.14204 77.5] CT
N
71.229 6.362 M
71.229 5.644 71.745 5.112 QT
72.261 4.581 72.979 4.362 QT
72.573 4.05 72.362 3.597 QT
72.151 3.144 72.151 2.628 QT
72.151 1.691 72.745 0.956 QT
71.823 0.066 71.823 -1.106 QT
71.823 -1.731 72.096 -2.278 QT
72.37 -2.825 72.846 -3.224 QT
73.323 -3.622 73.909 -3.833 QT
74.495 -4.044 75.104 -4.044 QT
76.307 -4.044 77.245 -3.341 QT
77.667 -3.778 78.221 -4.02 QT
78.776 -4.263 79.386 -4.263 QT
79.823 -4.263 80.096 -3.958 QT
80.37 -3.653 80.37 -3.216 QT
80.37 -2.981 80.182 -2.794 QT
79.995 -2.606 79.745 -2.606 QT
79.495 -2.606 79.307 -2.794 QT
79.12 -2.981 79.12 -3.216 QT
79.12 -3.591 79.37 -3.731 QT
78.339 -3.731 77.589 -3.028 QT
77.948 -2.669 78.167 -2.145 QT
78.386 -1.622 78.386 -1.106 QT
78.386 -0.247 77.917 0.433 QT
77.448 1.112 76.682 1.487 QT
75.917 1.862 75.104 1.862 QT
74.011 1.862 73.104 1.269 QT
72.823 1.659 72.823 2.144 QT
72.823 2.675 73.175 3.066 QT
73.526 3.456 74.042 3.456 QT
75.682 3.456 L
76.886 3.456 77.839 3.675 QT
78.792 3.894 79.44 4.534 QT
80.089 5.175 80.089 6.362 QT
80.089 7.237 79.346 7.823 QT
78.604 8.409 77.573 8.667 QT
76.542 8.925 75.667 8.925 QT
74.776 8.925 73.745 8.667 QT
72.714 8.409 71.971 7.823 QT
71.229 7.237 71.229 6.362 QT
cp
72.354 6.362 M
72.354 7.034 72.901 7.487 QT
73.448 7.941 74.214 8.159 QT
74.979 8.378 75.667 8.378 QT
76.339 8.378 77.112 8.159 QT
77.886 7.941 78.425 7.487 QT
78.964 7.034 78.964 6.362 QT
78.964 5.316 78.011 5.011 QT
77.057 4.706 75.682 4.706 QT
74.042 4.706 L
73.589 4.706 73.206 4.925 QT
72.823 5.144 72.589 5.542 QT
72.354 5.941 72.354 6.362 QT
cp
75.104 1.316 M
76.807 1.316 76.807 -1.106 QT
76.807 -2.138 76.448 -2.817 QT
76.089 -3.497 75.104 -3.497 QT
74.136 -3.497 73.776 -2.817 QT
73.417 -2.138 73.417 -1.106 QT
73.417 -0.434 73.55 0.105 QT
73.682 0.644 74.057 0.98 QT
74.432 1.316 75.104 1.316 QT
cp
f
GR
GS
[0.75 0 0 0.75 122.14204 77.5] CT
N
81.229 6.362 M
81.229 5.644 81.745 5.112 QT
82.261 4.581 82.979 4.362 QT
82.573 4.05 82.362 3.597 QT
82.151 3.144 82.151 2.628 QT
82.151 1.691 82.745 0.956 QT
81.823 0.066 81.823 -1.106 QT
81.823 -1.731 82.097 -2.278 QT
82.37 -2.825 82.847 -3.224 QT
83.323 -3.622 83.909 -3.833 QT
84.495 -4.044 85.104 -4.044 QT
86.307 -4.044 87.245 -3.341 QT
87.667 -3.778 88.222 -4.02 QT
88.776 -4.263 89.386 -4.263 QT
89.823 -4.263 90.097 -3.958 QT
90.37 -3.653 90.37 -3.216 QT
90.37 -2.981 90.182 -2.794 QT
89.995 -2.606 89.745 -2.606 QT
89.495 -2.606 89.307 -2.794 QT
89.12 -2.981 89.12 -3.216 QT
89.12 -3.591 89.37 -3.731 QT
88.339 -3.731 87.589 -3.028 QT
87.948 -2.669 88.167 -2.145 QT
88.386 -1.622 88.386 -1.106 QT
88.386 -0.247 87.917 0.433 QT
87.448 1.112 86.682 1.487 QT
85.917 1.862 85.104 1.862 QT
84.011 1.862 83.104 1.269 QT
82.823 1.659 82.823 2.144 QT
82.823 2.675 83.175 3.066 QT
83.526 3.456 84.042 3.456 QT
85.682 3.456 L
86.886 3.456 87.839 3.675 QT
88.792 3.894 89.44 4.534 QT
90.089 5.175 90.089 6.362 QT
90.089 7.237 89.347 7.823 QT
88.604 8.409 87.573 8.667 QT
86.542 8.925 85.667 8.925 QT
84.776 8.925 83.745 8.667 QT
82.714 8.409 81.972 7.823 QT
81.229 7.237 81.229 6.362 QT
cp
82.354 6.362 M
82.354 7.034 82.901 7.487 QT
83.448 7.941 84.214 8.159 QT
84.979 8.378 85.667 8.378 QT
86.339 8.378 87.112 8.159 QT
87.886 7.941 88.425 7.487 QT
88.964 7.034 88.964 6.362 QT
88.964 5.316 88.011 5.011 QT
87.057 4.706 85.682 4.706 QT
84.042 4.706 L
83.589 4.706 83.206 4.925 QT
82.823 5.144 82.589 5.542 QT
82.354 5.941 82.354 6.362 QT
cp
85.104 1.316 M
86.807 1.316 86.807 -1.106 QT
86.807 -2.138 86.448 -2.817 QT
86.089 -3.497 85.104 -3.497 QT
84.136 -3.497 83.776 -2.817 QT
83.417 -2.138 83.417 -1.106 QT
83.417 -0.434 83.55 0.105 QT
83.682 0.644 84.057 0.98 QT
84.432 1.316 85.104 1.316 QT
cp
f
GR
GS
[0.75 0 0 0.75 122.14204 77.5] CT
N
95.651 5.019 M
94.432 5.019 93.409 4.378 QT
92.386 3.737 91.807 2.675 QT
91.229 1.612 91.229 0.409 QT
91.229 -0.763 91.761 -1.817 QT
92.292 -2.872 93.245 -3.52 QT
94.198 -4.169 95.37 -4.169 QT
96.276 -4.169 96.956 -3.856 QT
97.636 -3.544 98.081 -2.997 QT
98.526 -2.45 98.745 -1.708 QT
98.964 -0.966 98.964 -0.091 QT
98.964 0.175 98.761 0.175 QT
92.979 0.175 L
92.979 0.394 L
92.979 2.05 93.643 3.245 QT
94.307 4.441 95.823 4.441 QT
96.432 4.441 96.956 4.167 QT
97.479 3.894 97.87 3.401 QT
98.261 2.909 98.386 2.362 QT
98.417 2.284 98.472 2.23 QT
98.526 2.175 98.589 2.175 QT
98.761 2.175 L
98.964 2.175 98.964 2.441 QT
98.682 3.566 97.745 4.292 QT
96.807 5.019 95.651 5.019 QT
cp
92.995 -0.325 M
97.557 -0.325 L
97.557 -1.075 97.347 -1.841 QT
97.136 -2.606 96.643 -3.122 QT
96.151 -3.638 95.37 -3.638 QT
94.229 -3.638 93.612 -2.575 QT
92.995 -1.513 92.995 -0.325 QT
cp
f
GR
GS
[0.75 0 0 0.75 122.14204 77.5] CT
N
100.071 4.8 M
100.071 4.097 L
100.759 4.097 101.196 3.987 QT
101.634 3.878 101.634 3.456 QT
101.634 -1.997 L
101.634 -2.528 101.478 -2.77 QT
101.321 -3.013 101.017 -3.067 QT
100.712 -3.122 100.071 -3.122 QT
100.071 -3.825 L
102.931 -4.044 L
102.931 -2.091 L
103.259 -2.95 103.853 -3.497 QT
104.446 -4.044 105.306 -4.044 QT
105.9 -4.044 106.368 -3.692 QT
106.837 -3.341 106.837 -2.763 QT
106.837 -2.403 106.579 -2.13 QT
106.321 -1.856 105.931 -1.856 QT
105.556 -1.856 105.298 -2.122 QT
105.04 -2.388 105.04 -2.763 QT
105.04 -3.294 105.415 -3.528 QT
105.306 -3.528 L
104.493 -3.528 103.978 -2.942 QT
103.462 -2.356 103.251 -1.481 QT
103.04 -0.606 103.04 0.175 QT
103.04 3.456 L
103.04 4.097 104.978 4.097 QT
104.978 4.8 L
100.071 4.8 L
cp
f
GR
GS
[0.75 0 0 0.75 122.14204 77.5] CT
N
119.04 5.019 M
117.821 5.019 116.837 4.394 QT
115.853 3.769 115.29 2.714 QT
114.728 1.659 114.728 0.487 QT
114.728 -0.7 115.282 -1.786 QT
115.837 -2.872 116.829 -3.52 QT
117.821 -4.169 119.04 -4.169 QT
120.212 -4.169 121.173 -3.708 QT
122.134 -3.247 122.134 -2.2 QT
122.134 -1.809 121.853 -1.52 QT
121.571 -1.231 121.181 -1.231 QT
120.775 -1.231 120.493 -1.52 QT
120.212 -1.809 120.212 -2.2 QT
120.212 -2.559 120.439 -2.817 QT
120.665 -3.075 120.993 -3.138 QT
120.306 -3.575 119.056 -3.575 QT
118.103 -3.575 117.517 -2.942 QT
116.931 -2.309 116.696 -1.372 QT
116.462 -0.434 116.462 0.487 QT
116.462 1.456 116.751 2.355 QT
117.04 3.253 117.681 3.847 QT
118.321 4.441 119.275 4.441 QT
120.228 4.441 120.892 3.855 QT
121.556 3.269 121.806 2.331 QT
121.806 2.222 121.962 2.222 QT
122.196 2.222 L
122.259 2.222 122.306 2.276 QT
122.353 2.331 122.353 2.394 QT
122.353 2.456 L
122.056 3.644 121.157 4.331 QT
120.259 5.019 119.04 5.019 QT
cp
f
GR
GS
[0.75 0 0 0.75 122.14204 77.5] CT
N
127.945 5.019 M
126.742 5.019 125.718 4.409 QT
124.695 3.8 124.101 2.776 QT
123.507 1.753 123.507 0.534 QT
123.507 -0.372 123.835 -1.224 QT
124.163 -2.075 124.773 -2.747 QT
125.382 -3.419 126.187 -3.794 QT
126.992 -4.169 127.945 -4.169 QT
129.179 -4.169 130.187 -3.52 QT
131.195 -2.872 131.781 -1.778 QT
132.367 -0.684 132.367 0.534 QT
132.367 1.737 131.773 2.769 QT
131.179 3.8 130.156 4.409 QT
129.132 5.019 127.945 5.019 QT
cp
127.945 4.441 M
129.554 4.441 130.085 3.276 QT
130.617 2.112 130.617 0.316 QT
130.617 -0.684 130.515 -1.349 QT
130.413 -2.013 130.038 -2.544 QT
129.82 -2.872 129.476 -3.122 QT
129.132 -3.372 128.742 -3.505 QT
128.351 -3.638 127.945 -3.638 QT
127.32 -3.638 126.757 -3.356 QT
126.195 -3.075 125.82 -2.544 QT
125.46 -1.981 125.359 -1.302 QT
125.257 -0.622 125.257 0.316 QT
125.257 1.441 125.452 2.331 QT
125.648 3.222 126.234 3.831 QT
126.82 4.441 127.945 4.441 QT
cp
f
GR
GS
[0.75 0 0 0.75 122.14204 77.5] CT
N
133.617 4.862 M
133.617 1.597 L
133.617 1.441 133.788 1.441 QT
134.023 1.441 L
134.148 1.441 134.179 1.597 QT
134.742 4.503 136.882 4.503 QT
137.835 4.503 138.468 4.073 QT
139.101 3.644 139.101 2.737 QT
139.101 2.097 138.609 1.644 QT
138.117 1.191 137.429 1.019 QT
136.085 0.753 L
135.413 0.612 134.867 0.308 QT
134.32 0.003 133.968 -0.497 QT
133.617 -0.997 133.617 -1.669 QT
133.617 -2.544 134.077 -3.106 QT
134.538 -3.669 135.281 -3.919 QT
136.023 -4.169 136.882 -4.169 QT
137.913 -4.169 138.663 -3.622 QT
139.242 -4.122 L
139.242 -4.169 139.335 -4.169 QT
139.492 -4.169 L
139.554 -4.169 139.601 -4.114 QT
139.648 -4.059 139.648 -3.997 QT
139.648 -1.388 L
139.648 -1.2 139.492 -1.2 QT
139.242 -1.2 L
139.07 -1.2 139.07 -1.388 QT
139.07 -2.434 138.492 -3.067 QT
137.913 -3.7 136.867 -3.7 QT
135.96 -3.7 135.304 -3.364 QT
134.648 -3.028 134.648 -2.216 QT
134.648 -1.669 135.117 -1.309 QT
135.585 -0.95 136.226 -0.794 QT
137.585 -0.544 L
138.273 -0.388 138.859 -0.013 QT
139.445 0.362 139.796 0.925 QT
140.148 1.487 140.148 2.206 QT
140.148 2.925 139.898 3.456 QT
139.648 3.987 139.202 4.339 QT
138.757 4.691 138.148 4.855 QT
137.538 5.019 136.882 5.019 QT
135.632 5.019 134.742 4.191 QT
134.007 4.972 L
134.007 5.019 133.898 5.019 QT
133.788 5.019 L
133.617 5.019 133.617 4.862 QT
cp
f
GR
GS
[0.75 0 0 0.75 122.14204 77.5] CT
N
142.88 2.394 M
142.88 -3.122 L
141.209 -3.122 L
141.209 -3.638 L
142.521 -3.638 143.138 -4.856 QT
143.755 -6.075 143.755 -7.513 QT
144.334 -7.513 L
144.334 -3.825 L
147.146 -3.825 L
147.146 -3.122 L
144.334 -3.122 L
144.334 2.362 L
144.334 3.191 144.607 3.816 QT
144.88 4.441 145.615 4.441 QT
146.287 4.441 146.591 3.776 QT
146.896 3.112 146.896 2.362 QT
146.896 1.175 L
147.474 1.175 L
147.474 2.394 L
147.474 3.019 147.248 3.628 QT
147.021 4.237 146.568 4.628 QT
146.115 5.019 145.474 5.019 QT
144.271 5.019 143.576 4.3 QT
142.88 3.581 142.88 2.394 QT
cp
f
GR
GS
[0.75 0 0 0.75 0 0.25] CT
0.929 0.694 0.125 RC
[8 8] 0 setdash
2 LJ
2.667 LW
N
119.988 103 M
159.865 103 L
S
GR
GS
[0.75 0 0 0.75 0 0.25] CT
0.149 GC
10.0 ML
0.667 LW
N
116 117 M
116 40 L
315 40 L
315 117 L
cp
S
GR
%%Trailer
%%Pages: 1
%%EOF
