<?xml version="1.0" encoding="UTF-8"?>

<!-- generated on Sat Apr 24 18:28:14 2021 by Eclipse SUMO Version 1.4.0
<configuration xmlns:xsi="http://www.w3.org/2001/XMLSchema-instance" xsi:noNamespaceSchemaLocation="http://sumo.dlr.de/xsd/sumoConfiguration.xsd">

    <input>
        <net-file value="sumofiles/junction.net.xml"/>
        <route-files value="sumofiles/junction_preemption_177.rou.xml"/>
        <additional-files value="sumofiles/junction.det.xml"/>
    </input>

    <output>
        <tripinfo-output value="sumofiles/output/tripinfo_preemption_177.xml"/>
    </output>

    <time>
        <begin value="0"/>
        <end value="10000"/>
        <step-length value="0.05"/>
    </time>

    <processing>
        <lateral-resolution value="0.1"/>
    </processing>

    <report>
        <no-warnings value="true"/>
        <error-log value="sumofiles/output/errorlog_preemption_177.log"/>
        <no-step-log value="true"/>
    </report>

    <traci_server>
        <remote-port value="53429"/>
    </traci_server>

    <gui_only>
        <gui-settings-file value="sumofiles/junction-gui.settings.xml"/>
        <tracker-interval value="0.05"/>
    </gui_only>

</configuration>
-->

<tripinfos xmlns:xsi="http://www.w3.org/2001/XMLSchema-instance" xsi:noNamespaceSchemaLocation="http://sumo.dlr.de/xsd/tripinfo_file.xsd">
    <tripinfo id="car_e2n_2" depart="2.00" departLane="e2sep_1" departPos="3.60" departPosLat="0.00" departSpeed="13.90" departDelay="0.00" arrival="141.30" arrivalLane="c2n_1" arrivalPos="990.00" arrivalPosLat="0.00" arrivalSpeed="14.73" duration="139.30" routeLength="1986.69" waitingTime="0.00" waitingCount="0" stopTime="0.00" timeLoss="3.74" rerouteNo="1" devices="tripinfo_car_e2n_2 routing_car_e2n_2" vType="Car" speedFactor="1.06" vaporized=""/>
    <tripinfo id="car_e2w_3" depart="3.35" departLane="e2sep_1" departPos="3.60" departPosLat="0.00" departSpeed="13.90" departDelay="0.35" arrival="142.85" arrivalLane="c2w_1" arrivalPos="990.00" arrivalPosLat="0.00" arrivalSpeed="14.73" duration="139.50" routeLength="1997.01" waitingTime="0.00" waitingCount="0" stopTime="0.00" timeLoss="3.93" rerouteNo="1" devices="tripinfo_car_e2w_3 routing_car_e2w_3" vType="Car" speedFactor="1.06" vaporized=""/>
    <tripinfo id="car_w2s_7" depart="7.00" departLane="w2sep_1" departPos="3.60" departPosLat="0.00" departSpeed="13.90" departDelay="0.00" arrival="143.50" arrivalLane="c2s_1" arrivalPos="990.00" arrivalPosLat="0.00" arrivalSpeed="15.05" duration="136.50" routeLength="1986.69" waitingTime="0.00" waitingCount="0" stopTime="0.00" timeLoss="3.80" rerouteNo="1" devices="tripinfo_car_w2s_7 routing_car_w2s_7" vType="Car" speedFactor="1.08" vaporized=""/>
    <tripinfo id="car_n2s_19" depart="19.00" departLane="n2sep_1" departPos="3.60" departPosLat="0.00" departSpeed="13.90" departDelay="0.00" arrival="162.25" arrivalLane="c2s_1" arrivalPos="990.00" arrivalPosLat="0.00" arrivalSpeed="14.54" duration="143.25" routeLength="1997.01" waitingTime="0.00" waitingCount="0" stopTime="0.00" timeLoss="5.86" rerouteNo="1" devices="tripinfo_car_n2s_19 routing_car_n2s_19" vType="Car" speedFactor="1.05" vaporized=""/>
    <tripinfo id="car_s2n_12" depart="12.00" departLane="s2sep_1" departPos="3.60" departPosLat="0.00" departSpeed="13.90" departDelay="0.00" arrival="165.70" arrivalLane="c2n_1" arrivalPos="990.00" arrivalPosLat="0.00" arrivalSpeed="13.90" duration="153.70" routeLength="1997.01" waitingTime="2.95" waitingCount="1" stopTime="0.00" timeLoss="10.03" rerouteNo="1" devices="tripinfo_car_s2n_12 routing_car_s2n_12" vType="Car" speedFactor="1.00" vaporized=""/>
    <tripinfo id="car_n2e_21" depart="21.00" departLane="n2sep_1" departPos="3.60" departPosLat="0.00" departSpeed="13.90" departDelay="0.00" arrival="168.80" arrivalLane="c2e_1" arrivalPos="990.00" arrivalPosLat="0.00" arrivalSpeed="14.04" duration="147.80" routeLength="1996.47" waitingTime="0.00" waitingCount="0" stopTime="0.00" timeLoss="4.95" rerouteNo="1" devices="tripinfo_car_n2e_21 routing_car_n2e_21" vType="Car" speedFactor="1.01" vaporized=""/>
    <tripinfo id="car_n2w_26" depart="26.00" departLane="n2sep_1" departPos="3.60" departPosLat="0.00" departSpeed="13.90" departDelay="0.00" arrival="171.15" arrivalLane="c2w_1" arrivalPos="990.00" arrivalPosLat="0.00" arrivalSpeed="14.27" duration="145.15" routeLength="1986.69" waitingTime="0.00" waitingCount="0" stopTime="0.00" timeLoss="5.18" rerouteNo="1" devices="tripinfo_car_n2w_26 routing_car_n2w_26" vType="Car" speedFactor="1.03" vaporized=""/>
    <tripinfo id="car_s2e_38" depart="38.00" departLane="s2sep_1" departPos="3.60" departPosLat="0.00" departSpeed="13.90" departDelay="0.00" arrival="185.25" arrivalLane="c2e_1" arrivalPos="990.00" arrivalPosLat="0.00" arrivalSpeed="13.90" duration="147.25" routeLength="1986.69" waitingTime="0.00" waitingCount="0" stopTime="0.00" timeLoss="3.61" rerouteNo="1" devices="tripinfo_car_s2e_38 routing_car_s2e_38" vType="Car" speedFactor="1.00" vaporized=""/>
    <tripinfo id="car_s2n_45" depart="45.00" departLane="s2sep_1" departPos="3.60" departPosLat="0.00" departSpeed="13.90" departDelay="0.00" arrival="189.40" arrivalLane="c2n_1" arrivalPos="990.00" arrivalPosLat="0.00" arrivalSpeed="13.90" duration="144.40" routeLength="1997.01" waitingTime="0.00" waitingCount="0" stopTime="0.00" timeLoss="0.70" rerouteNo="1" devices="tripinfo_car_s2n_45 routing_car_s2n_45" vType="Car" speedFactor="1.00" vaporized=""/>
    <tripinfo id="car_s2w_54" depart="54.00" departLane="s2sep_1" departPos="3.60" departPosLat="0.00" departSpeed="13.90" departDelay="0.00" arrival="191.45" arrivalLane="c2w_1" arrivalPos="990.00" arrivalPosLat="0.00" arrivalSpeed="15.16" duration="137.45" routeLength="1996.47" waitingTime="0.00" waitingCount="0" stopTime="0.00" timeLoss="5.12" rerouteNo="1" devices="tripinfo_car_s2w_54 routing_car_s2w_54" vType="Car" speedFactor="1.09" vaporized=""/>
    <tripinfo id="car_n2e_49" depart="49.00" departLane="n2sep_1" departPos="3.60" departPosLat="0.00" departSpeed="13.90" departDelay="0.00" arrival="194.30" arrivalLane="c2e_1" arrivalPos="990.00" arrivalPosLat="0.00" arrivalSpeed="14.15" duration="145.30" routeLength="1996.47" waitingTime="0.00" waitingCount="0" stopTime="0.00" timeLoss="3.56" rerouteNo="1" devices="tripinfo_car_n2e_49 routing_car_n2e_49" vType="Car" speedFactor="1.02" vaporized=""/>
    <tripinfo id="car_n2e_60" depart="60.00" departLane="n2sep_1" departPos="3.60" departPosLat="0.00" departSpeed="13.90" departDelay="0.00" arrival="198.75" arrivalLane="c2e_1" arrivalPos="990.00" arrivalPosLat="0.00" arrivalSpeed="15.59" duration="138.75" routeLength="1996.47" waitingTime="0.00" waitingCount="0" stopTime="0.00" timeLoss="10.24" rerouteNo="1" devices="tripinfo_car_n2e_60 routing_car_n2e_60" vType="Car" speedFactor="1.12" vaporized=""/>
    <tripinfo id="car_w2s_48" depart="48.00" departLane="w2sep_1" departPos="3.60" departPosLat="0.00" departSpeed="13.90" departDelay="0.00" arrival="205.65" arrivalLane="c2s_1" arrivalPos="990.00" arrivalPosLat="0.00" arrivalSpeed="16.10" duration="157.65" routeLength="1986.69" waitingTime="14.45" waitingCount="1" stopTime="0.00" timeLoss="33.61" rerouteNo="1" devices="tripinfo_car_w2s_48 routing_car_w2s_48" vType="Car" speedFactor="1.16" vaporized=""/>
    <tripinfo id="car_w2e_22" depart="22.00" departLane="w2sep_1" departPos="3.60" departPosLat="0.00" departSpeed="13.90" departDelay="0.00" arrival="208.95" arrivalLane="c2e_1" arrivalPos="990.00" arrivalPosLat="0.00" arrivalSpeed="14.32" duration="186.95" routeLength="1997.01" waitingTime="40.00" waitingCount="1" stopTime="0.00" timeLoss="47.47" rerouteNo="1" devices="tripinfo_car_w2e_22 routing_car_w2e_22" vType="Car" speedFactor="1.03" vaporized=""/>
    <tripinfo id="car_e2n_4" depart="5.05" departLane="e2sep_1" departPos="3.60" departPosLat="0.00" departSpeed="13.90" departDelay="1.05" arrival="209.95" arrivalLane="c2n_1" arrivalPos="990.00" arrivalPosLat="0.00" arrivalSpeed="14.04" duration="204.90" routeLength="1986.69" waitingTime="53.05" waitingCount="1" stopTime="0.00" timeLoss="62.70" rerouteNo="1" devices="tripinfo_car_e2n_4 routing_car_e2n_4" vType="Car" speedFactor="1.01" vaporized=""/>
    <tripinfo id="car_e2w_8" depart="8.00" departLane="e2sep_1" departPos="3.60" departPosLat="0.00" departSpeed="13.90" departDelay="0.00" arrival="210.80" arrivalLane="c2w_1" arrivalPos="990.00" arrivalPosLat="0.00" arrivalSpeed="14.32" duration="202.80" routeLength="1997.01" waitingTime="51.15" waitingCount="1" stopTime="0.00" timeLoss="63.32" rerouteNo="1" devices="tripinfo_car_e2w_8 routing_car_e2w_8" vType="Car" speedFactor="1.03" vaporized=""/>
    <tripinfo id="car_w2e_36" depart="36.40" departLane="w2sep_1" departPos="3.60" departPosLat="0.00" departSpeed="13.90" departDelay="0.40" arrival="211.25" arrivalLane="c2e_1" arrivalPos="990.00" arrivalPosLat="0.00" arrivalSpeed="15.30" duration="174.85" routeLength="1997.01" waitingTime="26.60" waitingCount="1" stopTime="0.00" timeLoss="46.87" rerouteNo="1" devices="tripinfo_car_w2e_36 routing_car_w2e_36" vType="Car" speedFactor="1.12" vaporized=""/>
    <tripinfo id="car_w2e_71" depart="71.00" departLane="w2sep_1" departPos="3.60" departPosLat="0.00" departSpeed="13.90" departDelay="0.00" arrival="213.45" arrivalLane="c2e_1" arrivalPos="990.00" arrivalPosLat="0.00" arrivalSpeed="15.68" duration="142.45" routeLength="1997.01" waitingTime="2.20" waitingCount="1" stopTime="0.00" timeLoss="17.98" rerouteNo="1" devices="tripinfo_car_w2e_71 routing_car_w2e_71" vType="Car" speedFactor="1.15" vaporized=""/>
    <tripinfo id="car_e2w_43" depart="43.00" departLane="e2sep_1" departPos="3.60" departPosLat="0.00" departSpeed="13.90" departDelay="0.00" arrival="214.55" arrivalLane="c2w_1" arrivalPos="990.00" arrivalPosLat="0.00" arrivalSpeed="14.51" duration="171.55" routeLength="1997.01" waitingTime="21.95" waitingCount="1" stopTime="0.00" timeLoss="34.15" rerouteNo="1" devices="tripinfo_car_e2w_43 routing_car_e2w_43" vType="Car" speedFactor="1.05" vaporized=""/>
    <tripinfo id="car_w2s_56" depart="56.00" departLane="w2sep_1" departPos="3.60" departPosLat="0.00" departSpeed="13.90" departDelay="0.00" arrival="216.25" arrivalLane="c2s_1" arrivalPos="990.00" arrivalPosLat="0.00" arrivalSpeed="14.27" duration="160.25" routeLength="1986.69" waitingTime="8.70" waitingCount="1" stopTime="0.00" timeLoss="20.25" rerouteNo="1" devices="tripinfo_car_w2s_56 routing_car_w2s_56" vType="Car" speedFactor="1.03" vaporized=""/>
    <tripinfo id="car_e2w_80" depart="80.00" departLane="e2sep_1" departPos="3.60" departPosLat="0.00" departSpeed="13.90" departDelay="0.00" arrival="217.60" arrivalLane="c2w_1" arrivalPos="990.00" arrivalPosLat="0.00" arrivalSpeed="16.27" duration="137.60" routeLength="1997.01" waitingTime="0.00" waitingCount="0" stopTime="0.00" timeLoss="15.79" rerouteNo="1" devices="tripinfo_car_e2w_80 routing_car_e2w_80" vType="Car" speedFactor="1.18" vaporized=""/>
    <tripinfo id="car_e2n_43" depart="44.40" departLane="e2sep_1" departPos="3.60" departPosLat="0.00" departSpeed="13.90" departDelay="1.40" arrival="217.85" arrivalLane="c2n_1" arrivalPos="990.00" arrivalPosLat="0.00" arrivalSpeed="13.90" duration="173.45" routeLength="1986.69" waitingTime="17.35" waitingCount="1" stopTime="0.00" timeLoss="29.76" rerouteNo="1" devices="tripinfo_car_e2n_43 routing_car_e2n_43" vType="Car" speedFactor="1.00" vaporized=""/>
    <tripinfo id="car_w2s_82" depart="82.00" departLane="w2sep_1" departPos="3.60" departPosLat="0.00" departSpeed="13.90" departDelay="0.00" arrival="218.25" arrivalLane="c2s_1" arrivalPos="990.00" arrivalPosLat="0.00" arrivalSpeed="15.54" duration="136.25" routeLength="1986.69" waitingTime="0.00" waitingCount="0" stopTime="0.00" timeLoss="12.23" rerouteNo="1" devices="tripinfo_car_w2s_82 routing_car_w2s_82" vType="Car" speedFactor="1.16" vaporized=""/>
    <tripinfo id="car_e2s_21" depart="21.00" departLane="e2sep_1" departPos="3.60" departPosLat="0.00" departSpeed="13.90" departDelay="0.00" arrival="221.60" arrivalLane="c2s_1" arrivalPos="990.00" arrivalPosLat="0.00" arrivalSpeed="15.00" duration="200.60" routeLength="1996.47" waitingTime="53.95" waitingCount="2" stopTime="0.00" timeLoss="67.28" rerouteNo="1" devices="tripinfo_car_e2s_21 routing_car_e2s_21" vType="Car" speedFactor="1.08" vaporized=""/>
    <tripinfo id="car_e2n_63" depart="63.00" departLane="e2sep_1" departPos="3.60" departPosLat="0.00" departSpeed="13.90" departDelay="0.00" arrival="222.10" arrivalLane="c2n_1" arrivalPos="990.00" arrivalPosLat="0.00" arrivalSpeed="13.89" duration="159.10" routeLength="1986.69" waitingTime="1.50" waitingCount="1" stopTime="0.00" timeLoss="15.42" rerouteNo="1" devices="tripinfo_car_e2n_63 routing_car_e2n_63" vType="Car" speedFactor="1.00" vaporized=""/>
    <tripinfo id="car_e2n_68" depart="68.00" departLane="e2sep_1" departPos="3.60" departPosLat="0.00" departSpeed="13.90" departDelay="0.00" arrival="224.05" arrivalLane="c2n_1" arrivalPos="990.00" arrivalPosLat="0.00" arrivalSpeed="15.11" duration="156.05" routeLength="1986.69" waitingTime="0.70" waitingCount="1" stopTime="0.00" timeLoss="29.11" rerouteNo="1" devices="tripinfo_car_e2n_68 routing_car_e2n_68" vType="Car" speedFactor="1.13" vaporized=""/>
    <tripinfo id="car_e2n_77" depart="77.00" departLane="e2sep_1" departPos="3.60" departPosLat="0.00" departSpeed="13.90" departDelay="0.00" arrival="227.85" arrivalLane="c2n_1" arrivalPos="990.00" arrivalPosLat="0.00" arrivalSpeed="13.88" duration="150.85" routeLength="1986.69" waitingTime="0.00" waitingCount="0" stopTime="0.00" timeLoss="7.15" rerouteNo="1" devices="tripinfo_car_e2n_77 routing_car_e2n_77" vType="Car" speedFactor="1.00" vaporized=""/>
    <tripinfo id="car_e2s_68" depart="69.30" departLane="e2sep_1" departPos="3.60" departPosLat="0.00" departSpeed="13.90" departDelay="1.30" arrival="228.20" arrivalLane="c2s_1" arrivalPos="990.00" arrivalPosLat="0.00" arrivalSpeed="13.90" duration="158.90" routeLength="1996.47" waitingTime="4.10" waitingCount="1" stopTime="0.00" timeLoss="14.59" rerouteNo="1" devices="tripinfo_car_e2s_68 routing_car_e2s_68" vType="Car" speedFactor="1.00" vaporized=""/>
    <tripinfo id="car_e2s_70" depart="71.05" departLane="e2sep_1" departPos="3.60" departPosLat="0.00" departSpeed="13.90" departDelay="1.05" arrival="230.05" arrivalLane="c2s_1" arrivalPos="990.00" arrivalPosLat="0.00" arrivalSpeed="15.48" duration="159.00" routeLength="1996.47" waitingTime="1.80" waitingCount="1" stopTime="0.00" timeLoss="36.53" rerouteNo="1" devices="tripinfo_car_e2s_70 routing_car_e2s_70" vType="Car" speedFactor="1.18" vaporized=""/>
    <tripinfo id="car_e2s_81" depart="81.30" departLane="e2sep_1" departPos="3.60" departPosLat="0.00" departSpeed="13.90" departDelay="0.30" arrival="232.30" arrivalLane="c2s_1" arrivalPos="990.00" arrivalPosLat="0.00" arrivalSpeed="15.03" duration="151.00" routeLength="1996.47" waitingTime="0.00" waitingCount="0" stopTime="0.00" timeLoss="20.06" rerouteNo="1" devices="tripinfo_car_e2s_81 routing_car_e2s_81" vType="Car" speedFactor="1.10" vaporized=""/>
    <tripinfo id="car_e2n_89" depart="89.00" departLane="e2sep_1" departPos="3.60" departPosLat="0.00" departSpeed="13.90" departDelay="0.00" arrival="232.55" arrivalLane="c2n_1" arrivalPos="990.00" arrivalPosLat="0.00" arrivalSpeed="14.42" duration="143.55" routeLength="1986.69" waitingTime="0.00" waitingCount="0" stopTime="0.00" timeLoss="5.13" rerouteNo="1" devices="tripinfo_car_e2n_89 routing_car_e2n_89" vType="Car" speedFactor="1.04" vaporized=""/>
    <tripinfo id="car_w2n_25" depart="25.00" departLane="w2sep_1" departPos="3.60" departPosLat="0.00" departSpeed="13.90" departDelay="0.00" arrival="235.80" arrivalLane="c2n_1" arrivalPos="990.00" arrivalPosLat="0.00" arrivalSpeed="15.09" duration="210.80" routeLength="1996.47" waitingTime="62.25" waitingCount="3" stopTime="0.00" timeLoss="78.46" rerouteNo="1" devices="tripinfo_car_w2n_25 routing_car_w2n_25" vType="Car" speedFactor="1.09" vaporized=""/>
    <tripinfo id="car_e2w_91" depart="91.00" departLane="e2sep_1" departPos="3.60" departPosLat="0.00" departSpeed="13.90" departDelay="0.00" arrival="235.80" arrivalLane="c2w_1" arrivalPos="990.00" arrivalPosLat="0.00" arrivalSpeed="14.04" duration="144.80" routeLength="1997.01" waitingTime="0.00" waitingCount="0" stopTime="0.00" timeLoss="2.58" rerouteNo="1" devices="tripinfo_car_e2w_91 routing_car_e2w_91" vType="Car" speedFactor="1.01" vaporized=""/>
    <tripinfo id="car_w2n_35" depart="35.00" departLane="w2sep_1" departPos="3.60" departPosLat="0.00" departSpeed="13.90" departDelay="0.00" arrival="240.80" arrivalLane="c2n_1" arrivalPos="990.00" arrivalPosLat="0.00" arrivalSpeed="14.55" duration="205.80" routeLength="1996.47" waitingTime="52.50" waitingCount="2" stopTime="0.00" timeLoss="67.96" rerouteNo="1" devices="tripinfo_car_w2n_35 routing_car_w2n_35" vType="Car" speedFactor="1.05" vaporized=""/>
    <tripinfo id="car_w2s_95" depart="95.00" departLane="w2sep_1" departPos="3.60" departPosLat="0.00" departSpeed="13.90" departDelay="0.00" arrival="242.50" arrivalLane="c2s_1" arrivalPos="990.00" arrivalPosLat="0.00" arrivalSpeed="13.90" duration="147.50" routeLength="1986.69" waitingTime="0.00" waitingCount="0" stopTime="0.00" timeLoss="3.85" rerouteNo="1" devices="tripinfo_car_w2s_95 routing_car_w2s_95" vType="Car" speedFactor="1.00" vaporized=""/>
    <tripinfo id="car_w2n_46" depart="46.00" departLane="w2sep_1" departPos="3.60" departPosLat="0.00" departSpeed="13.90" departDelay="0.00" arrival="246.45" arrivalLane="c2n_1" arrivalPos="990.00" arrivalPosLat="0.00" arrivalSpeed="13.90" duration="200.45" routeLength="1996.47" waitingTime="37.30" waitingCount="2" stopTime="0.00" timeLoss="56.13" rerouteNo="1" devices="tripinfo_car_w2n_46 routing_car_w2n_46" vType="Car" speedFactor="1.00" vaporized=""/>
    <tripinfo id="car_w2n_75" depart="75.00" departLane="w2sep_1" departPos="3.60" departPosLat="0.00" departSpeed="13.90" departDelay="0.00" arrival="248.30" arrivalLane="c2n_1" arrivalPos="990.00" arrivalPosLat="0.00" arrivalSpeed="15.42" duration="173.30" routeLength="1996.47" waitingTime="20.70" waitingCount="1" stopTime="0.00" timeLoss="50.12" rerouteNo="1" devices="tripinfo_car_w2n_75 routing_car_w2n_75" vType="Car" speedFactor="1.17" vaporized=""/>
    <tripinfo id="car_w2n_89" depart="89.00" departLane="w2sep_1" departPos="3.60" departPosLat="0.00" departSpeed="13.90" departDelay="0.00" arrival="250.60" arrivalLane="c2n_1" arrivalPos="990.00" arrivalPosLat="0.00" arrivalSpeed="14.92" duration="161.60" routeLength="1996.47" waitingTime="11.20" waitingCount="1" stopTime="0.00" timeLoss="29.41" rerouteNo="1" devices="tripinfo_car_w2n_89 routing_car_w2n_89" vType="Car" speedFactor="1.09" vaporized=""/>
    <tripinfo id="car_s2e_89" depart="90.50" departLane="s2sep_1" departPos="3.60" departPosLat="0.00" departSpeed="13.90" departDelay="1.50" arrival="252.35" arrivalLane="c2e_1" arrivalPos="990.00" arrivalPosLat="0.00" arrivalSpeed="15.12" duration="161.85" routeLength="1986.69" waitingTime="14.60" waitingCount="1" stopTime="0.00" timeLoss="29.79" rerouteNo="1" devices="tripinfo_car_s2e_89 routing_car_s2e_89" vType="Car" speedFactor="1.09" vaporized=""/>
    <tripinfo id="car_n2s_58" depart="58.00" departLane="n2sep_1" departPos="3.60" departPosLat="0.00" departSpeed="13.90" departDelay="0.00" arrival="254.80" arrivalLane="c2s_1" arrivalPos="990.00" arrivalPosLat="0.00" arrivalSpeed="14.55" duration="196.80" routeLength="1997.01" waitingTime="50.00" waitingCount="1" stopTime="0.00" timeLoss="59.55" rerouteNo="1" devices="tripinfo_car_n2s_58 routing_car_n2s_58" vType="Car" speedFactor="1.05" vaporized=""/>
    <tripinfo id="car_s2n_83" depart="83.00" departLane="s2sep_1" departPos="3.60" departPosLat="0.00" departSpeed="13.90" departDelay="0.00" arrival="254.80" arrivalLane="c2n_1" arrivalPos="990.00" arrivalPosLat="0.00" arrivalSpeed="14.31" duration="171.80" routeLength="1997.01" waitingTime="23.85" waitingCount="1" stopTime="0.00" timeLoss="32.37" rerouteNo="1" devices="tripinfo_car_s2n_83 routing_car_s2n_83" vType="Car" speedFactor="1.03" vaporized=""/>
    <tripinfo id="car_n2w_52" depart="52.00" departLane="n2sep_1" departPos="3.60" departPosLat="0.00" departSpeed="13.90" departDelay="0.00" arrival="254.95" arrivalLane="c2w_1" arrivalPos="990.00" arrivalPosLat="0.00" arrivalSpeed="14.04" duration="202.95" routeLength="1986.69" waitingTime="52.60" waitingCount="1" stopTime="0.00" timeLoss="60.74" rerouteNo="1" devices="tripinfo_car_n2w_52 routing_car_n2w_52" vType="Car" speedFactor="1.01" vaporized=""/>
    <tripinfo id="car_s2n_125" depart="125.00" departLane="s2sep_1" departPos="3.60" departPosLat="0.00" departSpeed="13.90" departDelay="0.00" arrival="259.05" arrivalLane="c2n_1" arrivalPos="990.00" arrivalPosLat="0.00" arrivalSpeed="15.54" duration="134.05" routeLength="1997.01" waitingTime="0.00" waitingCount="0" stopTime="0.00" timeLoss="5.69" rerouteNo="1" devices="tripinfo_car_s2n_125 routing_car_s2n_125" vType="Car" speedFactor="1.12" vaporized=""/>
    <tripinfo id="car_n2w_67" depart="67.00" departLane="n2sep_1" departPos="3.60" departPosLat="0.00" departSpeed="13.90" departDelay="0.00" arrival="261.15" arrivalLane="c2w_1" arrivalPos="990.00" arrivalPosLat="0.00" arrivalSpeed="13.90" duration="194.15" routeLength="1986.69" waitingTime="39.85" waitingCount="1" stopTime="0.00" timeLoss="50.46" rerouteNo="1" devices="tripinfo_car_n2w_67 routing_car_n2w_67" vType="Car" speedFactor="1.00" vaporized=""/>
    <tripinfo id="car_s2e_103" depart="103.00" departLane="s2sep_1" departPos="3.60" departPosLat="0.00" departSpeed="13.90" departDelay="0.00" arrival="261.15" arrivalLane="c2e_1" arrivalPos="990.00" arrivalPosLat="0.00" arrivalSpeed="13.90" duration="158.15" routeLength="1986.69" waitingTime="3.95" waitingCount="1" stopTime="0.00" timeLoss="14.47" rerouteNo="1" devices="tripinfo_car_s2e_103 routing_car_s2e_103" vType="Car" speedFactor="1.00" vaporized=""/>
    <tripinfo id="car_s2e_122" depart="122.00" departLane="s2sep_1" departPos="3.60" departPosLat="0.00" departSpeed="13.90" departDelay="0.00" arrival="263.55" arrivalLane="c2e_1" arrivalPos="990.00" arrivalPosLat="0.00" arrivalSpeed="14.81" duration="141.55" routeLength="1986.69" waitingTime="0.00" waitingCount="0" stopTime="0.00" timeLoss="8.82" rerouteNo="1" devices="tripinfo_car_s2e_122 routing_car_s2e_122" vType="Car" speedFactor="1.08" vaporized=""/>
    <tripinfo id="car_n2w_80" depart="80.00" departLane="n2sep_1" departPos="3.60" departPosLat="0.00" departSpeed="13.90" departDelay="0.00" arrival="264.55" arrivalLane="c2w_1" arrivalPos="990.00" arrivalPosLat="0.00" arrivalSpeed="14.13" duration="184.55" routeLength="1986.69" waitingTime="29.50" waitingCount="1" stopTime="0.00" timeLoss="43.66" rerouteNo="1" devices="tripinfo_car_n2w_80 routing_car_n2w_80" vType="Car" speedFactor="1.02" vaporized=""/>
    <tripinfo id="car_n2s_96" depart="96.00" departLane="n2sep_1" departPos="3.60" departPosLat="0.00" departSpeed="13.90" departDelay="0.00" arrival="267.05" arrivalLane="c2s_1" arrivalPos="990.00" arrivalPosLat="0.00" arrivalSpeed="13.90" duration="171.05" routeLength="1997.01" waitingTime="13.60" waitingCount="1" stopTime="0.00" timeLoss="27.37" rerouteNo="1" devices="tripinfo_car_n2s_96 routing_car_n2s_96" vType="Car" speedFactor="1.00" vaporized=""/>
    <tripinfo id="car_n2w_93" depart="93.00" departLane="n2sep_1" departPos="3.60" departPosLat="0.00" departSpeed="13.90" departDelay="0.00" arrival="268.30" arrivalLane="c2w_1" arrivalPos="990.00" arrivalPosLat="0.00" arrivalSpeed="13.88" duration="175.30" routeLength="1986.69" waitingTime="16.40" waitingCount="1" stopTime="0.00" timeLoss="31.64" rerouteNo="1" devices="tripinfo_car_n2w_93 routing_car_n2w_93" vType="Car" speedFactor="1.00" vaporized=""/>
    <tripinfo id="car_n2s_98" depart="98.00" departLane="n2sep_1" departPos="3.60" departPosLat="0.00" departSpeed="13.90" departDelay="0.00" arrival="268.90" arrivalLane="c2s_1" arrivalPos="990.00" arrivalPosLat="0.00" arrivalSpeed="15.42" duration="170.90" routeLength="1997.01" waitingTime="13.05" waitingCount="1" stopTime="0.00" timeLoss="47.99" rerouteNo="1" devices="tripinfo_car_n2s_98 routing_car_n2s_98" vType="Car" speedFactor="1.17" vaporized=""/>
    <tripinfo id="car_n2e_80" depart="81.40" departLane="n2sep_1" departPos="3.60" departPosLat="0.00" departSpeed="13.90" departDelay="1.40" arrival="269.70" arrivalLane="c2e_1" arrivalPos="990.00" arrivalPosLat="0.00" arrivalSpeed="13.90" duration="188.30" routeLength="1996.47" waitingTime="30.20" waitingCount="2" stopTime="0.00" timeLoss="43.95" rerouteNo="1" devices="tripinfo_car_n2e_80 routing_car_n2e_80" vType="Car" speedFactor="1.00" vaporized=""/>
    <tripinfo id="car_n2e_102" depart="102.00" departLane="n2sep_1" departPos="3.60" departPosLat="0.00" departSpeed="13.90" departDelay="0.00" arrival="271.90" arrivalLane="c2e_1" arrivalPos="990.00" arrivalPosLat="0.00" arrivalSpeed="14.89" duration="169.90" routeLength="1996.47" waitingTime="12.40" waitingCount="2" stopTime="0.00" timeLoss="38.18" rerouteNo="1" devices="tripinfo_car_n2e_102 routing_car_n2e_102" vType="Car" speedFactor="1.10" vaporized=""/>
    <tripinfo id="car_s2w_71" depart="71.00" departLane="s2sep_1" departPos="3.60" departPosLat="0.00" departSpeed="13.90" departDelay="0.00" arrival="272.45" arrivalLane="c2w_1" arrivalPos="990.00" arrivalPosLat="0.00" arrivalSpeed="13.96" duration="201.45" routeLength="1996.47" waitingTime="45.85" waitingCount="2" stopTime="0.00" timeLoss="57.88" rerouteNo="1" devices="tripinfo_car_s2w_71 routing_car_s2w_71" vType="Car" speedFactor="1.01" vaporized=""/>
    <tripinfo id="car_n2e_132" depart="132.00" departLane="n2sep_1" departPos="3.60" departPosLat="0.00" departSpeed="13.90" departDelay="0.00" arrival="273.85" arrivalLane="c2e_1" arrivalPos="990.00" arrivalPosLat="0.00" arrivalSpeed="15.42" duration="141.85" routeLength="1996.47" waitingTime="0.00" waitingCount="0" stopTime="0.00" timeLoss="16.82" rerouteNo="1" devices="tripinfo_car_n2e_132 routing_car_n2e_132" vType="Car" speedFactor="1.15" vaporized=""/>
    <tripinfo id="car_s2w_86" depart="86.00" departLane="s2sep_1" departPos="3.60" departPosLat="0.00" departSpeed="13.90" departDelay="0.00" arrival="275.80" arrivalLane="c2w_1" arrivalPos="990.00" arrivalPosLat="0.00" arrivalSpeed="14.11" duration="189.80" routeLength="1996.47" waitingTime="30.25" waitingCount="2" stopTime="0.00" timeLoss="48.02" rerouteNo="1" devices="tripinfo_car_s2w_86 routing_car_s2w_86" vType="Car" speedFactor="1.02" vaporized=""/>
    <tripinfo id="car_s2n_137" depart="137.00" departLane="s2sep_1" departPos="3.60" departPosLat="0.00" departSpeed="13.90" departDelay="0.00" arrival="277.75" arrivalLane="c2n_1" arrivalPos="990.00" arrivalPosLat="0.00" arrivalSpeed="14.22" duration="140.75" routeLength="1997.01" waitingTime="0.00" waitingCount="0" stopTime="0.00" timeLoss="0.30" rerouteNo="1" devices="tripinfo_car_s2n_137 routing_car_s2n_137" vType="Car" speedFactor="1.02" vaporized=""/>
    <tripinfo id="car_s2w_89" depart="89.00" departLane="s2sep_1" departPos="3.60" departPosLat="0.00" departSpeed="13.90" departDelay="0.00" arrival="278.45" arrivalLane="c2w_1" arrivalPos="990.00" arrivalPosLat="0.00" arrivalSpeed="14.37" duration="189.45" routeLength="1996.47" waitingTime="26.30" waitingCount="2" stopTime="0.00" timeLoss="51.14" rerouteNo="1" devices="tripinfo_car_s2w_89 routing_car_s2w_89" vType="Car" speedFactor="1.04" vaporized=""/>
    <tripinfo id="car_s2w_132" depart="132.00" departLane="s2sep_1" departPos="3.60" departPosLat="0.00" departSpeed="13.90" departDelay="0.00" arrival="280.30" arrivalLane="c2w_1" arrivalPos="990.00" arrivalPosLat="0.00" arrivalSpeed="15.44" duration="148.30" routeLength="1996.47" waitingTime="1.90" waitingCount="1" stopTime="0.00" timeLoss="25.11" rerouteNo="1" devices="tripinfo_car_s2w_132 routing_car_s2w_132" vType="Car" speedFactor="1.17" vaporized=""/>
    <tripinfo id="car_n2w_139" depart="139.00" departLane="n2sep_1" departPos="3.60" departPosLat="0.00" departSpeed="13.90" departDelay="0.00" arrival="286.80" arrivalLane="c2w_1" arrivalPos="990.00" arrivalPosLat="0.00" arrivalSpeed="13.90" duration="147.80" routeLength="1986.69" waitingTime="0.00" waitingCount="0" stopTime="0.00" timeLoss="4.12" rerouteNo="1" devices="tripinfo_car_n2w_139 routing_car_n2w_139" vType="Car" speedFactor="1.00" vaporized=""/>
    <tripinfo id="car_n2e_145" depart="145.00" departLane="n2sep_1" departPos="3.60" departPosLat="0.00" departSpeed="13.90" departDelay="0.00" arrival="293.10" arrivalLane="c2e_1" arrivalPos="990.00" arrivalPosLat="0.00" arrivalSpeed="13.90" duration="148.10" routeLength="1996.47" waitingTime="0.00" waitingCount="0" stopTime="0.00" timeLoss="3.79" rerouteNo="1" devices="tripinfo_car_n2e_145 routing_car_n2e_145" vType="Car" speedFactor="1.00" vaporized=""/>
    <tripinfo id="car_e2n_147" depart="147.00" departLane="e2sep_1" departPos="3.60" departPosLat="0.00" departSpeed="13.90" departDelay="0.00" arrival="296.70" arrivalLane="c2n_1" arrivalPos="990.00" arrivalPosLat="0.00" arrivalSpeed="16.40" duration="149.70" routeLength="1986.69" waitingTime="8.45" waitingCount="1" stopTime="0.00" timeLoss="27.93" rerouteNo="1" devices="tripinfo_car_e2n_147 routing_car_e2n_147" vType="Car" speedFactor="1.18" vaporized=""/>
    <tripinfo id="car_e2w_99" depart="99.00" departLane="e2sep_1" departPos="3.60" departPosLat="0.00" departSpeed="13.90" departDelay="0.00" arrival="299.65" arrivalLane="c2w_1" arrivalPos="990.00" arrivalPosLat="0.00" arrivalSpeed="14.13" duration="200.65" routeLength="1997.01" waitingTime="52.25" waitingCount="1" stopTime="0.00" timeLoss="59.35" rerouteNo="1" devices="tripinfo_car_e2w_99 routing_car_e2w_99" vType="Car" speedFactor="1.02" vaporized=""/>
    <tripinfo id="car_w2s_97" depart="97.00" departLane="w2sep_1" departPos="3.60" departPosLat="0.00" departSpeed="13.90" departDelay="0.00" arrival="300.65" arrivalLane="c2s_1" arrivalPos="990.00" arrivalPosLat="0.00" arrivalSpeed="13.90" duration="203.65" routeLength="1986.69" waitingTime="50.80" waitingCount="1" stopTime="0.00" timeLoss="59.96" rerouteNo="1" devices="tripinfo_car_w2s_97 routing_car_w2s_97" vType="Car" speedFactor="1.00" vaporized=""/>
    <tripinfo id="car_w2s_117" depart="117.00" departLane="w2sep_1" departPos="3.60" departPosLat="0.00" departSpeed="13.90" departDelay="0.00" arrival="302.60" arrivalLane="c2s_1" arrivalPos="990.00" arrivalPosLat="0.00" arrivalSpeed="15.26" duration="185.60" routeLength="1986.69" waitingTime="42.15" waitingCount="1" stopTime="0.00" timeLoss="59.87" rerouteNo="1" devices="tripinfo_car_w2s_117 routing_car_w2s_117" vType="Car" speedFactor="1.14" vaporized=""/>
    <tripinfo id="car_w2e_103" depart="103.00" departLane="w2sep_1" departPos="3.60" departPosLat="0.00" departSpeed="13.90" departDelay="0.00" arrival="302.80" arrivalLane="c2e_1" arrivalPos="990.00" arrivalPosLat="0.00" arrivalSpeed="13.94" duration="199.80" routeLength="1997.01" waitingTime="47.35" waitingCount="1" stopTime="0.00" timeLoss="56.58" rerouteNo="1" devices="tripinfo_car_w2e_103 routing_car_w2e_103" vType="Car" speedFactor="1.00" vaporized=""/>
    <tripinfo id="car_e2w_126" depart="126.00" departLane="e2sep_1" departPos="3.60" departPosLat="0.00" departSpeed="13.90" departDelay="0.00" arrival="304.00" arrivalLane="c2w_1" arrivalPos="990.00" arrivalPosLat="0.00" arrivalSpeed="14.11" duration="178.00" routeLength="1997.01" waitingTime="25.75" waitingCount="1" stopTime="0.00" timeLoss="36.55" rerouteNo="1" devices="tripinfo_car_e2w_126 routing_car_e2w_126" vType="Car" speedFactor="1.02" vaporized=""/>
    <tripinfo id="car_e2w_142" depart="142.00" departLane="e2sep_1" departPos="3.60" departPosLat="0.00" departSpeed="13.90" departDelay="0.00" arrival="306.70" arrivalLane="c2w_1" arrivalPos="990.00" arrivalPosLat="0.00" arrivalSpeed="14.55" duration="164.70" routeLength="1997.01" waitingTime="9.10" waitingCount="1" stopTime="0.00" timeLoss="28.60" rerouteNo="1" devices="tripinfo_car_e2w_142 routing_car_e2w_142" vType="Car" speedFactor="1.06" vaporized=""/>
    <tripinfo id="car_w2e_119" depart="119.00" departLane="w2sep_1" departPos="3.60" departPosLat="0.00" departSpeed="13.90" departDelay="0.00" arrival="307.00" arrivalLane="c2e_1" arrivalPos="990.00" arrivalPosLat="0.00" arrivalSpeed="14.21" duration="188.00" routeLength="1997.01" waitingTime="35.20" waitingCount="1" stopTime="0.00" timeLoss="47.60" rerouteNo="1" devices="tripinfo_car_w2e_119 routing_car_w2e_119" vType="Car" speedFactor="1.02" vaporized=""/>
    <tripinfo id="car_w2e_128" depart="128.00" departLane="w2sep_1" departPos="3.60" departPosLat="0.00" departSpeed="13.90" departDelay="0.00" arrival="308.85" arrivalLane="c2e_1" arrivalPos="990.00" arrivalPosLat="0.00" arrivalSpeed="15.56" duration="180.85" routeLength="1997.01" waitingTime="34.50" waitingCount="1" stopTime="0.00" timeLoss="58.93" rerouteNo="1" devices="tripinfo_car_w2e_128 routing_car_w2e_128" vType="Car" speedFactor="1.18" vaporized=""/>
    <tripinfo id="car_w2s_135" depart="135.00" departLane="w2sep_1" departPos="3.60" departPosLat="0.00" departSpeed="13.90" departDelay="0.00" arrival="309.40" arrivalLane="c2s_1" arrivalPos="990.00" arrivalPosLat="0.00" arrivalSpeed="14.45" duration="174.40" routeLength="1986.69" waitingTime="23.30" waitingCount="1" stopTime="0.00" timeLoss="36.25" rerouteNo="1" devices="tripinfo_car_w2s_135 routing_car_w2s_135" vType="Car" speedFactor="1.04" vaporized=""/>
    <tripinfo id="car_w2n_106" depart="106.00" departLane="w2sep_1" departPos="3.60" departPosLat="0.00" departSpeed="13.90" departDelay="0.00" arrival="310.60" arrivalLane="c2n_1" arrivalPos="990.00" arrivalPosLat="0.00" arrivalSpeed="13.90" duration="204.60" routeLength="1996.47" waitingTime="47.45" waitingCount="2" stopTime="0.00" timeLoss="60.29" rerouteNo="1" devices="tripinfo_car_w2n_106 routing_car_w2n_106" vType="Car" speedFactor="1.00" vaporized=""/>
    <tripinfo id="car_w2s_161" depart="161.00" departLane="w2sep_1" departPos="3.60" departPosLat="0.00" departSpeed="13.90" departDelay="0.00" arrival="313.75" arrivalLane="c2s_1" arrivalPos="990.00" arrivalPosLat="0.00" arrivalSpeed="14.37" duration="152.75" routeLength="1986.69" waitingTime="0.00" waitingCount="0" stopTime="0.00" timeLoss="13.86" rerouteNo="1" devices="tripinfo_car_w2s_161 routing_car_w2s_161" vType="Car" speedFactor="1.03" vaporized=""/>
    <tripinfo id="car_w2e_162" depart="162.40" departLane="w2sep_1" departPos="3.60" departPosLat="0.00" departSpeed="13.90" departDelay="0.40" arrival="316.20" arrivalLane="c2e_1" arrivalPos="990.00" arrivalPosLat="0.00" arrivalSpeed="13.90" duration="153.80" routeLength="1997.01" waitingTime="0.00" waitingCount="0" stopTime="0.00" timeLoss="10.12" rerouteNo="1" devices="tripinfo_car_w2e_162 routing_car_w2e_162" vType="Car" speedFactor="1.00" vaporized=""/>
    <tripinfo id="car_e2n_167" depart="167.45" departLane="e2sep_1" departPos="3.60" departPosLat="0.00" departSpeed="13.90" departDelay="0.45" arrival="317.70" arrivalLane="c2n_1" arrivalPos="990.00" arrivalPosLat="0.00" arrivalSpeed="13.92" duration="150.25" routeLength="1986.69" waitingTime="0.00" waitingCount="0" stopTime="0.00" timeLoss="6.84" rerouteNo="1" devices="tripinfo_car_e2n_167 routing_car_e2n_167" vType="Car" speedFactor="1.00" vaporized=""/>
    <tripinfo id="car_w2s_163" depart="164.20" departLane="w2sep_1" departPos="3.60" departPosLat="0.00" departSpeed="13.90" departDelay="1.20" arrival="318.45" arrivalLane="c2s_1" arrivalPos="990.00" arrivalPosLat="0.00" arrivalSpeed="14.13" duration="154.25" routeLength="1986.69" waitingTime="0.00" waitingCount="0" stopTime="0.00" timeLoss="12.94" rerouteNo="1" devices="tripinfo_car_w2s_163 routing_car_w2s_163" vType="Car" speedFactor="1.02" vaporized=""/>
    <tripinfo id="car_e2s_121" depart="121.00" departLane="e2sep_1" departPos="3.60" departPosLat="0.00" departSpeed="13.90" departDelay="0.00" arrival="320.50" arrivalLane="c2s_1" arrivalPos="990.00" arrivalPosLat="0.00" arrivalSpeed="15.23" duration="199.50" routeLength="1996.47" waitingTime="53.25" waitingCount="2" stopTime="0.00" timeLoss="71.97" rerouteNo="1" devices="tripinfo_car_e2s_121 routing_car_e2s_121" vType="Car" speedFactor="1.13" vaporized=""/>
    <tripinfo id="car_w2n_155" depart="155.00" departLane="w2sep_1" departPos="3.60" departPosLat="0.00" departSpeed="13.90" departDelay="0.00" arrival="321.70" arrivalLane="c2n_1" arrivalPos="990.00" arrivalPosLat="0.00" arrivalSpeed="13.98" duration="166.70" routeLength="1996.47" waitingTime="7.65" waitingCount="2" stopTime="0.00" timeLoss="23.44" rerouteNo="1" devices="tripinfo_car_w2n_155 routing_car_w2n_155" vType="Car" speedFactor="1.01" vaporized=""/>
    <tripinfo id="car_w2n_165" depart="166.05" departLane="w2sep_1" departPos="3.60" departPosLat="0.00" departSpeed="13.90" departDelay="1.05" arrival="323.60" arrivalLane="c2n_1" arrivalPos="990.00" arrivalPosLat="0.00" arrivalSpeed="15.24" duration="157.55" routeLength="1996.47" waitingTime="0.00" waitingCount="0" stopTime="0.00" timeLoss="31.82" rerouteNo="1" devices="tripinfo_car_w2n_165 routing_car_w2n_165" vType="Car" speedFactor="1.15" vaporized=""/>
    <tripinfo id="car_e2s_127" depart="127.45" departLane="e2sep_1" departPos="3.60" departPosLat="0.00" departSpeed="13.90" departDelay="0.45" arrival="325.30" arrivalLane="c2s_1" arrivalPos="990.00" arrivalPosLat="0.00" arrivalSpeed="13.89" duration="197.85" routeLength="1996.47" waitingTime="36.45" waitingCount="2" stopTime="0.00" timeLoss="53.50" rerouteNo="1" devices="tripinfo_car_e2s_127 routing_car_e2s_127" vType="Car" speedFactor="1.00" vaporized=""/>
    <tripinfo id="car_w2n_171" depart="171.00" departLane="w2sep_1" departPos="3.60" departPosLat="0.00" departSpeed="13.90" departDelay="0.00" arrival="327.15" arrivalLane="c2n_1" arrivalPos="990.00" arrivalPosLat="0.00" arrivalSpeed="13.97" duration="156.15" routeLength="1996.47" waitingTime="0.00" waitingCount="0" stopTime="0.00" timeLoss="12.81" rerouteNo="1" devices="tripinfo_car_w2n_171 routing_car_w2n_171" vType="Car" speedFactor="1.01" vaporized=""/>
    <tripinfo id="car_e2s_132" depart="132.00" departLane="e2sep_1" departPos="3.60" departPosLat="0.00" departSpeed="13.90" departDelay="0.00" arrival="328.85" arrivalLane="c2s_1" arrivalPos="990.00" arrivalPosLat="0.00" arrivalSpeed="13.94" duration="196.85" routeLength="1996.47" waitingTime="31.70" waitingCount="2" stopTime="0.00" timeLoss="53.27" rerouteNo="1" devices="tripinfo_car_e2s_132 routing_car_e2s_132" vType="Car" speedFactor="1.01" vaporized=""/>
    <tripinfo id="car_w2n_178" depart="178.00" departLane="w2sep_1" departPos="3.60" departPosLat="0.00" departSpeed="13.90" departDelay="0.00" arrival="330.05" arrivalLane="c2n_1" arrivalPos="990.00" arrivalPosLat="0.00" arrivalSpeed="14.05" duration="152.05" routeLength="1996.47" waitingTime="0.00" waitingCount="0" stopTime="0.00" timeLoss="10.10" rerouteNo="1" devices="tripinfo_car_w2n_178 routing_car_w2n_178" vType="Car" speedFactor="1.02" vaporized=""/>
    <tripinfo id="car_e2s_137" depart="137.00" departLane="e2sep_1" departPos="3.60" departPosLat="0.00" departSpeed="13.90" departDelay="0.00" arrival="331.75" arrivalLane="c2s_1" arrivalPos="990.00" arrivalPosLat="0.00" arrivalSpeed="14.12" duration="194.75" routeLength="1996.47" waitingTime="28.75" waitingCount="2" stopTime="0.00" timeLoss="53.54" rerouteNo="1" devices="tripinfo_car_e2s_137 routing_car_e2s_137" vType="Car" speedFactor="1.02" vaporized=""/>
    <tripinfo id="car_e2s_139" depart="139.00" departLane="e2sep_1" departPos="3.60" departPosLat="0.00" departSpeed="13.90" departDelay="0.00" arrival="334.60" arrivalLane="c2s_1" arrivalPos="990.00" arrivalPosLat="0.00" arrivalSpeed="14.09" duration="195.60" routeLength="1996.47" waitingTime="26.15" waitingCount="2" stopTime="0.00" timeLoss="54.04" rerouteNo="1" devices="tripinfo_car_e2s_139 routing_car_e2s_139" vType="Car" speedFactor="1.02" vaporized=""/>
    <tripinfo id="car_w2n_198" depart="198.00" departLane="w2sep_1" departPos="3.60" departPosLat="0.00" departSpeed="13.90" departDelay="0.00" arrival="334.65" arrivalLane="c2n_1" arrivalPos="990.00" arrivalPosLat="0.00" arrivalSpeed="15.15" duration="136.65" routeLength="1996.47" waitingTime="0.00" waitingCount="0" stopTime="0.00" timeLoss="4.38" rerouteNo="1" devices="tripinfo_car_w2n_198 routing_car_w2n_198" vType="Car" speedFactor="1.09" vaporized=""/>
    <tripinfo id="car_e2s_166" depart="166.00" departLane="e2sep_1" departPos="3.60" departPosLat="0.00" departSpeed="13.90" departDelay="0.00" arrival="337.70" arrivalLane="c2s_1" arrivalPos="990.00" arrivalPosLat="0.00" arrivalSpeed="13.85" duration="171.70" routeLength="1996.47" waitingTime="11.15" waitingCount="1" stopTime="0.00" timeLoss="27.36" rerouteNo="1" devices="tripinfo_car_e2s_166 routing_car_e2s_166" vType="Car" speedFactor="1.00" vaporized=""/>
    <tripinfo id="car_s2n_153" depart="153.40" departLane="s2sep_1" departPos="3.60" departPosLat="0.00" departSpeed="13.90" departDelay="0.40" arrival="341.70" arrivalLane="c2n_1" arrivalPos="990.00" arrivalPosLat="0.00" arrivalSpeed="15.32" duration="188.30" routeLength="1997.01" waitingTime="43.90" waitingCount="1" stopTime="0.00" timeLoss="57.95" rerouteNo="1" devices="tripinfo_car_s2n_153 routing_car_s2n_153" vType="Car" speedFactor="1.10" vaporized=""/>
    <tripinfo id="car_s2e_152" depart="152.00" departLane="s2sep_1" departPos="3.60" departPosLat="0.00" departSpeed="13.90" departDelay="0.00" arrival="343.45" arrivalLane="c2e_1" arrivalPos="990.00" arrivalPosLat="0.00" arrivalSpeed="14.35" duration="191.45" routeLength="1986.69" waitingTime="45.25" waitingCount="1" stopTime="0.00" timeLoss="52.30" rerouteNo="1" devices="tripinfo_car_s2e_152 routing_car_s2e_152" vType="Car" speedFactor="1.03" vaporized=""/>
    <tripinfo id="car_n2s_163" depart="163.00" departLane="n2sep_1" departPos="3.60" departPosLat="0.00" departSpeed="13.90" departDelay="0.00" arrival="344.10" arrivalLane="c2s_1" arrivalPos="990.00" arrivalPosLat="0.00" arrivalSpeed="14.32" duration="181.10" routeLength="1997.01" waitingTime="33.95" waitingCount="1" stopTime="0.00" timeLoss="41.63" rerouteNo="1" devices="tripinfo_car_n2s_163 routing_car_n2s_163" vType="Car" speedFactor="1.03" vaporized=""/>
    <tripinfo id="car_n2s_178" depart="178.00" departLane="n2sep_1" departPos="3.60" departPosLat="0.00" departSpeed="13.90" departDelay="0.00" arrival="346.65" arrivalLane="c2s_1" arrivalPos="990.00" arrivalPosLat="0.00" arrivalSpeed="15.00" duration="168.65" routeLength="1997.01" waitingTime="21.60" waitingCount="1" stopTime="0.00" timeLoss="37.08" rerouteNo="1" devices="tripinfo_car_n2s_178 routing_car_n2s_178" vType="Car" speedFactor="1.09" vaporized=""/>
    <tripinfo id="car_n2w_179" depart="179.35" departLane="n2sep_1" departPos="3.60" departPosLat="0.00" departSpeed="13.90" departDelay="0.35" arrival="347.60" arrivalLane="c2w_1" arrivalPos="990.00" arrivalPosLat="0.00" arrivalSpeed="14.42" duration="168.25" routeLength="1986.69" waitingTime="18.20" waitingCount="1" stopTime="0.00" timeLoss="29.82" rerouteNo="1" devices="tripinfo_car_n2w_179 routing_car_n2w_179" vType="Car" speedFactor="1.04" vaporized=""/>
    <tripinfo id="car_s2e_168" depart="168.00" departLane="s2sep_1" departPos="3.60" departPosLat="0.00" departSpeed="13.90" departDelay="0.00" arrival="348.50" arrivalLane="c2e_1" arrivalPos="990.00" arrivalPosLat="0.00" arrivalSpeed="14.49" duration="180.50" routeLength="1986.69" waitingTime="31.65" waitingCount="1" stopTime="0.00" timeLoss="42.71" rerouteNo="1" devices="tripinfo_car_s2e_168 routing_car_s2e_168" vType="Car" speedFactor="1.04" vaporized=""/>
    <tripinfo id="car_n2w_199" depart="199.00" departLane="n2sep_1" departPos="3.60" departPosLat="0.00" departSpeed="13.90" departDelay="0.00" arrival="353.30" arrivalLane="c2w_1" arrivalPos="990.00" arrivalPosLat="0.00" arrivalSpeed="14.04" duration="154.30" routeLength="1986.69" waitingTime="0.00" waitingCount="0" stopTime="0.00" timeLoss="12.04" rerouteNo="1" devices="tripinfo_car_n2w_199 routing_car_n2w_199" vType="Car" speedFactor="1.01" vaporized=""/>
    <tripinfo id="car_n2e_173" depart="173.00" departLane="n2sep_1" departPos="3.60" departPosLat="0.00" departSpeed="13.90" departDelay="0.00" arrival="353.45" arrivalLane="c2e_1" arrivalPos="990.00" arrivalPosLat="0.00" arrivalSpeed="14.20" duration="180.45" routeLength="1996.47" waitingTime="26.70" waitingCount="2" stopTime="0.00" timeLoss="39.25" rerouteNo="1" devices="tripinfo_car_n2e_173 routing_car_n2e_173" vType="Car" speedFactor="1.02" vaporized=""/>
    <tripinfo id="car_s2n_221" depart="221.00" departLane="s2sep_1" departPos="3.60" departPosLat="0.00" departSpeed="13.90" departDelay="0.00" arrival="355.50" arrivalLane="c2n_1" arrivalPos="990.00" arrivalPosLat="0.00" arrivalSpeed="14.91" duration="134.50" routeLength="1997.01" waitingTime="0.00" waitingCount="0" stopTime="0.00" timeLoss="0.53" rerouteNo="1" devices="tripinfo_car_s2n_221 routing_car_s2n_221" vType="Car" speedFactor="1.07" vaporized=""/>
    <tripinfo id="car_s2w_157" depart="157.00" departLane="s2sep_1" departPos="3.60" departPosLat="0.00" departSpeed="13.90" departDelay="0.00" arrival="355.70" arrivalLane="c2w_1" arrivalPos="990.00" arrivalPosLat="0.00" arrivalSpeed="14.87" duration="198.70" routeLength="1996.47" waitingTime="45.85" waitingCount="2" stopTime="0.00" timeLoss="65.91" rerouteNo="1" devices="tripinfo_car_s2w_157 routing_car_s2w_157" vType="Car" speedFactor="1.09" vaporized=""/>
    <tripinfo id="car_n2e_183" depart="183.00" departLane="n2sep_1" departPos="3.60" departPosLat="0.00" departSpeed="13.90" departDelay="0.00" arrival="356.65" arrivalLane="c2e_1" arrivalPos="990.00" arrivalPosLat="0.00" arrivalSpeed="14.45" duration="173.65" routeLength="1996.47" waitingTime="15.90" waitingCount="2" stopTime="0.00" timeLoss="35.32" rerouteNo="1" devices="tripinfo_car_n2e_183 routing_car_n2e_183" vType="Car" speedFactor="1.04" vaporized=""/>
    <tripinfo id="car_n2e_205" depart="205.00" departLane="n2sep_1" departPos="3.60" departPosLat="0.00" departSpeed="13.90" departDelay="0.00" arrival="358.95" arrivalLane="c2e_1" arrivalPos="990.00" arrivalPosLat="0.00" arrivalSpeed="15.29" duration="153.95" routeLength="1996.47" waitingTime="2.10" waitingCount="1" stopTime="0.00" timeLoss="25.26" rerouteNo="1" devices="tripinfo_car_n2e_205 routing_car_n2e_205" vType="Car" speedFactor="1.12" vaporized=""/>
    <tripinfo id="car_n2w_214" depart="214.00" departLane="n2sep_1" departPos="3.60" departPosLat="0.00" departSpeed="13.90" departDelay="0.00" arrival="362.10" arrivalLane="c2w_1" arrivalPos="990.00" arrivalPosLat="0.00" arrivalSpeed="13.90" duration="148.10" routeLength="1986.69" waitingTime="0.00" waitingCount="0" stopTime="0.00" timeLoss="4.42" rerouteNo="1" devices="tripinfo_car_n2w_214 routing_car_n2w_214" vType="Car" speedFactor="1.00" vaporized=""/>
    <tripinfo id="car_s2n_224" depart="224.00" departLane="s2sep_1" departPos="3.60" departPosLat="0.00" departSpeed="13.90" departDelay="0.00" arrival="364.55" arrivalLane="c2n_1" arrivalPos="990.00" arrivalPosLat="0.00" arrivalSpeed="14.38" duration="140.55" routeLength="1997.01" waitingTime="0.00" waitingCount="0" stopTime="0.00" timeLoss="1.67" rerouteNo="1" devices="tripinfo_car_s2n_224 routing_car_s2n_224" vType="Car" speedFactor="1.03" vaporized=""/>
    <tripinfo id="bus_n2w_219" depart="219.00" departLane="n2sep_1" departPos="12.10" departPosLat="0.00" departSpeed="13.90" departDelay="0.00" arrival="369.05" arrivalLane="c2w_1" arrivalPos="990.00" arrivalPosLat="0.00" arrivalSpeed="13.89" duration="150.05" routeLength="1978.19" waitingTime="0.00" waitingCount="0" stopTime="0.00" timeLoss="6.99" rerouteNo="1" devices="tripinfo_bus_n2w_219 routing_bus_n2w_219" vType="Bus" speedFactor="1.00" vaporized=""/>
    <tripinfo id="car_s2n_225" depart="225.45" departLane="s2sep_1" departPos="3.60" departPosLat="0.00" departSpeed="13.90" departDelay="0.45" arrival="372.20" arrivalLane="c2n_1" arrivalPos="990.00" arrivalPosLat="0.00" arrivalSpeed="13.90" duration="146.75" routeLength="1997.01" waitingTime="0.00" waitingCount="0" stopTime="0.00" timeLoss="3.08" rerouteNo="1" devices="tripinfo_car_s2n_225 routing_car_s2n_225" vType="Car" speedFactor="1.00" vaporized=""/>
    <tripinfo id="car_n2w_222" depart="222.00" departLane="n2sep_1" departPos="3.60" departPosLat="0.00" departSpeed="13.90" departDelay="0.00" arrival="373.25" arrivalLane="c2w_1" arrivalPos="990.00" arrivalPosLat="0.00" arrivalSpeed="14.08" duration="151.25" routeLength="1986.69" waitingTime="0.00" waitingCount="0" stopTime="0.00" timeLoss="9.57" rerouteNo="1" devices="tripinfo_car_n2w_222 routing_car_n2w_222" vType="Car" speedFactor="1.01" vaporized=""/>
    <tripinfo id="car_s2w_208" depart="208.00" departLane="s2sep_1" departPos="3.60" departPosLat="0.00" departSpeed="13.90" departDelay="0.00" arrival="375.45" arrivalLane="c2w_1" arrivalPos="990.00" arrivalPosLat="0.00" arrivalSpeed="14.90" duration="167.45" routeLength="1996.47" waitingTime="15.00" waitingCount="2" stopTime="0.00" timeLoss="35.88" rerouteNo="1" devices="tripinfo_car_s2w_208 routing_car_s2w_208" vType="Car" speedFactor="1.10" vaporized=""/>
    <tripinfo id="car_s2w_244" depart="244.00" departLane="s2sep_1" departPos="3.60" departPosLat="0.00" departSpeed="13.90" departDelay="0.00" arrival="377.35" arrivalLane="c2w_1" arrivalPos="990.00" arrivalPosLat="0.00" arrivalSpeed="15.62" duration="133.35" routeLength="1996.47" waitingTime="0.00" waitingCount="0" stopTime="0.00" timeLoss="10.70" rerouteNo="1" devices="tripinfo_car_s2w_244 routing_car_s2w_244" vType="Car" speedFactor="1.18" vaporized=""/>
    <tripinfo id="car_w2e_199" depart="199.30" departLane="w2sep_1" departPos="3.60" departPosLat="0.00" departSpeed="13.90" departDelay="0.30" arrival="386.95" arrivalLane="c2e_1" arrivalPos="990.00" arrivalPosLat="0.00" arrivalSpeed="14.69" duration="187.65" routeLength="1997.01" waitingTime="42.45" waitingCount="1" stopTime="0.00" timeLoss="51.71" rerouteNo="1" devices="tripinfo_car_w2e_199 routing_car_w2e_199" vType="Car" speedFactor="1.06" vaporized=""/>
    <tripinfo id="car_w2s_227" depart="227.00" departLane="w2sep_1" departPos="3.60" departPosLat="0.00" departSpeed="13.90" departDelay="0.00" arrival="387.20" arrivalLane="c2s_1" arrivalPos="990.00" arrivalPosLat="0.00" arrivalSpeed="16.25" duration="160.20" routeLength="1986.69" waitingTime="17.70" waitingCount="1" stopTime="0.00" timeLoss="37.31" rerouteNo="1" devices="tripinfo_car_w2s_227 routing_car_w2s_227" vType="Car" speedFactor="1.17" vaporized=""/>
    <tripinfo id="car_w2e_204" depart="204.00" departLane="w2sep_1" departPos="3.60" departPosLat="0.00" departSpeed="13.90" departDelay="0.00" arrival="390.30" arrivalLane="c2e_1" arrivalPos="990.00" arrivalPosLat="0.00" arrivalSpeed="15.07" duration="186.30" routeLength="1997.01" waitingTime="40.45" waitingCount="1" stopTime="0.00" timeLoss="54.22" rerouteNo="1" devices="tripinfo_car_w2e_204 routing_car_w2e_204" vType="Car" speedFactor="1.09" vaporized=""/>
    <tripinfo id="car_e2n_217" depart="217.00" departLane="e2sep_1" departPos="3.60" departPosLat="0.00" departSpeed="13.90" departDelay="0.00" arrival="390.70" arrivalLane="c2n_1" arrivalPos="990.00" arrivalPosLat="0.00" arrivalSpeed="13.90" duration="173.70" routeLength="1986.69" waitingTime="21.50" waitingCount="1" stopTime="0.00" timeLoss="30.00" rerouteNo="1" devices="tripinfo_car_e2n_217 routing_car_e2n_217" vType="Car" speedFactor="1.00" vaporized=""/>
    <tripinfo id="car_e2w_235" depart="235.00" departLane="e2sep_1" departPos="3.60" departPosLat="0.00" departSpeed="13.90" departDelay="0.00" arrival="391.75" arrivalLane="c2w_1" arrivalPos="990.00" arrivalPosLat="0.00" arrivalSpeed="14.13" duration="156.75" routeLength="1997.01" waitingTime="6.95" waitingCount="1" stopTime="0.00" timeLoss="15.41" rerouteNo="1" devices="tripinfo_car_e2w_235 routing_car_e2w_235" vType="Car" speedFactor="1.02" vaporized=""/>
    <tripinfo id="car_w2e_225" depart="225.00" departLane="w2sep_1" departPos="3.60" departPosLat="0.00" departSpeed="13.90" departDelay="0.00" arrival="393.90" arrivalLane="c2e_1" arrivalPos="990.00" arrivalPosLat="0.00" arrivalSpeed="14.77" duration="168.90" routeLength="1997.01" waitingTime="18.40" waitingCount="1" stopTime="0.00" timeLoss="33.96" rerouteNo="1" devices="tripinfo_car_w2e_225 routing_car_w2e_225" vType="Car" speedFactor="1.06" vaporized=""/>
    <tripinfo id="car_e2n_247" depart="247.00" departLane="e2sep_1" departPos="3.60" departPosLat="0.00" departSpeed="13.90" departDelay="0.00" arrival="395.85" arrivalLane="c2n_1" arrivalPos="990.00" arrivalPosLat="0.00" arrivalSpeed="13.96" duration="148.85" routeLength="1986.69" waitingTime="0.00" waitingCount="0" stopTime="0.00" timeLoss="5.76" rerouteNo="1" devices="tripinfo_car_e2n_247 routing_car_e2n_247" vType="Car" speedFactor="1.00" vaporized=""/>
    <tripinfo id="car_w2e_236" depart="236.45" departLane="w2sep_1" departPos="3.60" departPosLat="0.00" departSpeed="13.90" departDelay="0.45" arrival="398.40" arrivalLane="c2e_1" arrivalPos="990.00" arrivalPosLat="0.00" arrivalSpeed="15.26" duration="161.95" routeLength="1997.01" waitingTime="9.55" waitingCount="1" stopTime="0.00" timeLoss="31.13" rerouteNo="1" devices="tripinfo_car_w2e_236 routing_car_w2e_236" vType="Car" speedFactor="1.10" vaporized=""/>
    <tripinfo id="car_e2w_256" depart="256.00" departLane="e2sep_1" departPos="3.60" departPosLat="0.00" departSpeed="13.90" departDelay="0.00" arrival="400.55" arrivalLane="c2w_1" arrivalPos="990.00" arrivalPosLat="0.00" arrivalSpeed="13.90" duration="144.55" routeLength="1997.01" waitingTime="0.00" waitingCount="0" stopTime="0.00" timeLoss="0.86" rerouteNo="1" devices="tripinfo_car_e2w_256 routing_car_e2w_256" vType="Car" speedFactor="1.00" vaporized=""/>
    <tripinfo id="car_w2n_214" depart="214.00" departLane="w2sep_1" departPos="3.60" departPosLat="0.00" departSpeed="13.90" departDelay="0.00" arrival="401.95" arrivalLane="c2n_1" arrivalPos="990.00" arrivalPosLat="0.00" arrivalSpeed="14.80" duration="187.95" routeLength="1996.47" waitingTime="40.55" waitingCount="2" stopTime="0.00" timeLoss="52.45" rerouteNo="1" devices="tripinfo_car_w2n_214 routing_car_w2n_214" vType="Car" speedFactor="1.07" vaporized=""/>
    <tripinfo id="car_e2w_265" depart="265.00" departLane="e2sep_1" departPos="3.60" departPosLat="0.00" departSpeed="13.90" departDelay="0.00" arrival="402.45" arrivalLane="c2w_1" arrivalPos="990.00" arrivalPosLat="0.00" arrivalSpeed="15.31" duration="137.45" routeLength="1997.01" waitingTime="0.00" waitingCount="0" stopTime="0.00" timeLoss="12.82" rerouteNo="1" devices="tripinfo_car_e2w_265 routing_car_e2w_265" vType="Car" speedFactor="1.15" vaporized=""/>
    <tripinfo id="bus_w2s_235" depart="235.00" departLane="w2sep_1" departPos="12.10" departPosLat="0.00" departSpeed="13.90" departDelay="0.00" arrival="402.55" arrivalLane="c2s_1" arrivalPos="990.00" arrivalPosLat="0.00" arrivalSpeed="13.90" duration="167.55" routeLength="1978.19" waitingTime="10.80" waitingCount="1" stopTime="0.00" timeLoss="24.47" rerouteNo="1" devices="tripinfo_bus_w2s_235 routing_bus_w2s_235" vType="Bus" speedFactor="1.00" vaporized=""/>
    <tripinfo id="car_w2e_238" depart="238.15" departLane="w2sep_1" departPos="3.60" departPosLat="0.00" departSpeed="13.90" departDelay="0.15" arrival="406.05" arrivalLane="c2e_1" arrivalPos="990.00" arrivalPosLat="0.00" arrivalSpeed="14.02" duration="167.90" routeLength="1997.01" waitingTime="7.35" waitingCount="1" stopTime="0.00" timeLoss="25.50" rerouteNo="1" devices="tripinfo_car_w2e_238 routing_car_w2e_238" vType="Car" speedFactor="1.01" vaporized=""/>
    <tripinfo id="car_w2e_256" depart="256.00" departLane="w2sep_1" departPos="3.60" departPosLat="0.00" departSpeed="13.90" departDelay="0.00" arrival="408.65" arrivalLane="c2e_1" arrivalPos="990.00" arrivalPosLat="0.00" arrivalSpeed="14.72" duration="152.65" routeLength="1997.01" waitingTime="0.00" waitingCount="0" stopTime="0.00" timeLoss="18.48" rerouteNo="1" devices="tripinfo_car_w2e_256 routing_car_w2e_256" vType="Car" speedFactor="1.07" vaporized=""/>
    <tripinfo id="car_w2n_221" depart="221.00" departLane="w2sep_1" departPos="3.60" departPosLat="0.00" departSpeed="13.90" departDelay="0.00" arrival="409.00" arrivalLane="c2n_1" arrivalPos="990.00" arrivalPosLat="0.00" arrivalSpeed="13.90" duration="188.00" routeLength="1996.47" waitingTime="29.35" waitingCount="2" stopTime="0.00" timeLoss="43.67" rerouteNo="1" devices="tripinfo_car_w2n_221 routing_car_w2n_221" vType="Car" speedFactor="1.00" vaporized=""/>
    <tripinfo id="car_w2e_258" depart="258.00" departLane="w2sep_1" departPos="3.60" departPosLat="0.00" departSpeed="13.90" departDelay="0.00" arrival="410.95" arrivalLane="c2e_1" arrivalPos="990.00" arrivalPosLat="0.00" arrivalSpeed="15.05" duration="152.95" routeLength="1997.01" waitingTime="0.00" waitingCount="0" stopTime="0.00" timeLoss="22.68" rerouteNo="1" devices="tripinfo_car_w2e_258 routing_car_w2e_258" vType="Car" speedFactor="1.10" vaporized=""/>
    <tripinfo id="car_w2n_240" depart="240.00" departLane="w2sep_1" departPos="3.60" departPosLat="0.00" departSpeed="13.90" departDelay="0.00" arrival="411.25" arrivalLane="c2n_1" arrivalPos="990.00" arrivalPosLat="0.00" arrivalSpeed="14.91" duration="171.25" routeLength="1996.47" waitingTime="7.25" waitingCount="1" stopTime="0.00" timeLoss="39.59" rerouteNo="1" devices="tripinfo_car_w2n_240 routing_car_w2n_240" vType="Car" speedFactor="1.10" vaporized=""/>
    <tripinfo id="car_e2s_214" depart="214.00" departLane="e2sep_1" departPos="3.60" departPosLat="0.00" departSpeed="13.90" departDelay="0.00" arrival="413.90" arrivalLane="c2s_1" arrivalPos="990.00" arrivalPosLat="0.00" arrivalSpeed="13.90" duration="199.90" routeLength="1996.47" waitingTime="44.60" waitingCount="2" stopTime="0.00" timeLoss="55.59" rerouteNo="1" devices="tripinfo_car_e2s_214 routing_car_e2s_214" vType="Car" speedFactor="1.00" vaporized=""/>
    <tripinfo id="car_w2e_259" depart="259.45" departLane="w2sep_1" departPos="3.60" departPosLat="0.00" departSpeed="13.90" departDelay="0.45" arrival="414.15" arrivalLane="c2e_1" arrivalPos="990.00" arrivalPosLat="1.10" arrivalSpeed="14.29" duration="154.70" routeLength="1997.01" waitingTime="0.00" waitingCount="0" stopTime="0.00" timeLoss="15.37" rerouteNo="1" devices="tripinfo_car_w2e_259 routing_car_w2e_259" vType="Car@car_w2e_259" speedFactor="1.03" vaporized=""/>
    <tripinfo id="car_w2n_260" depart="261.25" departLane="w2sep_1" departPos="3.60" departPosLat="0.00" departSpeed="13.90" departDelay="1.25" arrival="414.60" arrivalLane="c2n_1" arrivalPos="990.00" arrivalPosLat="0.00" arrivalSpeed="14.19" duration="153.35" routeLength="1996.47" waitingTime="0.00" waitingCount="0" stopTime="0.00" timeLoss="12.30" rerouteNo="1" devices="tripinfo_car_w2n_260 routing_car_w2n_260" vType="Car" speedFactor="1.02" vaporized=""/>
    <tripinfo id="amb_w2e_300" depart="300.00" departLane="w2sep_1" departPos="6.60" departPosLat="0.00" departSpeed="13.90" departDelay="0.00" arrival="415.60" arrivalLane="c2e_1" arrivalPos="990.00" arrivalPosLat="0.95" arrivalSpeed="16.91" duration="115.60" routeLength="1994.01" waitingTime="0.00" waitingCount="0" stopTime="0.00" timeLoss="19.94" rerouteNo="1" devices="tripinfo_amb_w2e_300 routing_amb_w2e_300 bluelight_amb_w2e_300 fcd_amb_w2e_300" vType="Ambulance" speedFactor="1.50" vaporized="">
        <example_device customValue1="0.00" customValue2="-1.00"/>
    </tripinfo>
    <tripinfo id="car_w2n_283" depart="283.00" departLane="w2sep_1" departPos="3.60" departPosLat="0.00" departSpeed="13.90" departDelay="0.00" arrival="422.10" arrivalLane="c2n_1" arrivalPos="990.00" arrivalPosLat="0.00" arrivalSpeed="14.85" duration="139.10" routeLength="1996.47" waitingTime="0.00" waitingCount="0" stopTime="0.00" timeLoss="3.99" rerouteNo="1" devices="tripinfo_car_w2n_283 routing_car_w2n_283" vType="Car" speedFactor="1.07" vaporized=""/>
    <tripinfo id="car_w2n_284" depart="284.35" departLane="w2sep_1" departPos="3.60" departPosLat="0.00" departSpeed="13.90" departDelay="0.35" arrival="424.60" arrivalLane="c2n_1" arrivalPos="990.00" arrivalPosLat="0.00" arrivalSpeed="15.66" duration="140.25" routeLength="1996.47" waitingTime="0.00" waitingCount="0" stopTime="0.00" timeLoss="13.90" rerouteNo="1" devices="tripinfo_car_w2n_284 routing_car_w2n_284" vType="Car" speedFactor="1.14" vaporized=""/>
    <tripinfo id="car_w2e_285" depart="286.00" departLane="w2sep_1" departPos="3.60" departPosLat="0.00" departSpeed="13.90" departDelay="1.00" arrival="427.35" arrivalLane="c2e_1" arrivalPos="990.00" arrivalPosLat="-1.10" arrivalSpeed="14.42" duration="141.35" routeLength="1997.01" waitingTime="0.00" waitingCount="0" stopTime="0.00" timeLoss="2.82" rerouteNo="1" devices="tripinfo_car_w2e_285 routing_car_w2e_285" vType="Car@car_w2e_285" speedFactor="1.04" vaporized=""/>
    <tripinfo id="car_e2s_279" depart="279.00" departLane="e2sep_1" departPos="3.60" departPosLat="0.00" departSpeed="13.90" departDelay="0.00" arrival="436.60" arrivalLane="c2s_1" arrivalPos="990.00" arrivalPosLat="0.00" arrivalSpeed="14.35" duration="157.60" routeLength="1996.47" waitingTime="10.40" waitingCount="1" stopTime="0.00" timeLoss="17.79" rerouteNo="1" devices="tripinfo_car_e2s_279 routing_car_e2s_279" vType="Car" speedFactor="1.03" vaporized=""/>
    <tripinfo id="car_e2n_288" depart="288.00" departLane="e2sep_1" departPos="3.60" departPosLat="0.00" departSpeed="13.90" departDelay="0.00" arrival="436.85" arrivalLane="c2n_1" arrivalPos="990.00" arrivalPosLat="0.00" arrivalSpeed="14.06" duration="148.85" routeLength="1986.69" waitingTime="0.00" waitingCount="0" stopTime="0.00" timeLoss="6.82" rerouteNo="1" devices="tripinfo_car_e2n_288 routing_car_e2n_288" vType="Car" speedFactor="1.01" vaporized=""/>
    <tripinfo id="car_w2n_294" depart="294.00" departLane="w2sep_1" departPos="3.60" departPosLat="0.00" departSpeed="13.90" departDelay="0.00" arrival="439.00" arrivalLane="c2n_1" arrivalPos="990.00" arrivalPosLat="0.00" arrivalSpeed="15.17" duration="145.00" routeLength="1996.47" waitingTime="1.35" waitingCount="1" stopTime="0.00" timeLoss="16.10" rerouteNo="1" devices="tripinfo_car_w2n_294 routing_car_w2n_294" vType="Car" speedFactor="1.12" vaporized=""/>
    <tripinfo id="car_s2n_240" depart="240.00" departLane="s2sep_1" departPos="3.60" departPosLat="0.00" departSpeed="13.90" departDelay="0.00" arrival="448.80" arrivalLane="c2n_1" arrivalPos="990.00" arrivalPosLat="0.00" arrivalSpeed="15.23" duration="208.80" routeLength="1997.01" waitingTime="70.30" waitingCount="1" stopTime="0.00" timeLoss="77.68" rerouteNo="1" devices="tripinfo_car_s2n_240 routing_car_s2n_240" vType="Car" speedFactor="1.10" vaporized=""/>
    <tripinfo id="car_n2w_299" depart="299.00" departLane="n2sep_1" departPos="3.60" departPosLat="0.00" departSpeed="13.90" departDelay="0.00" arrival="453.55" arrivalLane="c2w_1" arrivalPos="990.00" arrivalPosLat="0.00" arrivalSpeed="14.11" duration="154.55" routeLength="1986.69" waitingTime="5.95" waitingCount="1" stopTime="0.00" timeLoss="13.06" rerouteNo="1" devices="tripinfo_car_n2w_299 routing_car_n2w_299" vType="Car" speedFactor="1.02" vaporized=""/>
    <tripinfo id="car_s2e_263" depart="263.00" departLane="s2sep_1" departPos="3.60" departPosLat="0.00" departSpeed="13.90" departDelay="0.00" arrival="455.15" arrivalLane="c2e_1" arrivalPos="990.00" arrivalPosLat="0.00" arrivalSpeed="14.75" duration="192.15" routeLength="1986.69" waitingTime="46.70" waitingCount="1" stopTime="0.00" timeLoss="56.73" rerouteNo="1" devices="tripinfo_car_s2e_263 routing_car_s2e_263" vType="Car" speedFactor="1.06" vaporized=""/>
    <tripinfo id="car_n2w_320" depart="320.00" departLane="n2sep_1" departPos="3.60" departPosLat="0.00" departSpeed="13.90" departDelay="0.00" arrival="455.65" arrivalLane="c2w_1" arrivalPos="990.00" arrivalPosLat="0.00" arrivalSpeed="15.38" duration="135.65" routeLength="1986.69" waitingTime="0.00" waitingCount="0" stopTime="0.00" timeLoss="9.72" rerouteNo="1" devices="tripinfo_car_n2w_320 routing_car_n2w_320" vType="Car" speedFactor="1.14" vaporized=""/>
    <tripinfo id="car_s2n_252" depart="252.00" departLane="s2sep_1" departPos="3.60" departPosLat="0.00" departSpeed="13.90" departDelay="0.00" arrival="457.40" arrivalLane="c2n_1" arrivalPos="990.00" arrivalPosLat="0.00" arrivalSpeed="13.94" duration="205.40" routeLength="1997.01" waitingTime="53.05" waitingCount="1" stopTime="0.00" timeLoss="62.14" rerouteNo="1" devices="tripinfo_car_s2n_252 routing_car_s2n_252" vType="Car" speedFactor="1.00" vaporized=""/>
    <tripinfo id="car_s2n_274" depart="274.00" departLane="s2sep_1" departPos="3.60" departPosLat="0.00" departSpeed="13.90" departDelay="0.00" arrival="459.50" arrivalLane="c2n_1" arrivalPos="990.00" arrivalPosLat="0.00" arrivalSpeed="15.11" duration="185.50" routeLength="1997.01" waitingTime="36.35" waitingCount="1" stopTime="0.00" timeLoss="57.02" rerouteNo="1" devices="tripinfo_car_s2n_274 routing_car_s2n_274" vType="Car" speedFactor="1.12" vaporized=""/>
    <tripinfo id="car_s2w_265" depart="265.00" departLane="s2sep_1" departPos="3.60" departPosLat="0.00" departSpeed="13.90" departDelay="0.00" arrival="461.35" arrivalLane="c2w_1" arrivalPos="990.00" arrivalPosLat="0.00" arrivalSpeed="14.35" duration="196.35" routeLength="1996.47" waitingTime="43.05" waitingCount="2" stopTime="0.00" timeLoss="56.54" rerouteNo="1" devices="tripinfo_car_s2w_265 routing_car_s2w_265" vType="Car" speedFactor="1.03" vaporized=""/>
    <tripinfo id="car_s2e_276" depart="276.00" departLane="s2sep_1" departPos="3.60" departPosLat="0.00" departSpeed="13.90" departDelay="0.00" arrival="463.45" arrivalLane="c2e_1" arrivalPos="990.00" arrivalPosLat="0.00" arrivalSpeed="14.02" duration="187.45" routeLength="1986.69" waitingTime="32.20" waitingCount="1" stopTime="0.00" timeLoss="44.98" rerouteNo="1" devices="tripinfo_car_s2e_276 routing_car_s2e_276" vType="Car" speedFactor="1.01" vaporized=""/>
    <tripinfo id="car_s2n_299" depart="299.00" departLane="s2sep_1" departPos="3.60" departPosLat="0.00" departSpeed="13.90" departDelay="0.00" arrival="465.70" arrivalLane="c2n_1" arrivalPos="990.00" arrivalPosLat="0.00" arrivalSpeed="13.95" duration="166.70" routeLength="1997.01" waitingTime="11.00" waitingCount="1" stopTime="0.00" timeLoss="23.56" rerouteNo="1" devices="tripinfo_car_s2n_299 routing_car_s2n_299" vType="Car" speedFactor="1.00" vaporized=""/>
    <tripinfo id="car_s2e_315" depart="315.00" departLane="s2sep_1" departPos="3.60" departPosLat="0.00" departSpeed="13.90" departDelay="0.00" arrival="466.00" arrivalLane="c2e_1" arrivalPos="990.00" arrivalPosLat="0.00" arrivalSpeed="14.86" duration="151.00" routeLength="1986.69" waitingTime="0.10" waitingCount="1" stopTime="0.00" timeLoss="18.29" rerouteNo="1" devices="tripinfo_car_s2e_315 routing_car_s2e_315" vType="Car" speedFactor="1.08" vaporized=""/>
    <tripinfo id="car_s2w_266" depart="266.55" departLane="s2sep_1" departPos="3.60" departPosLat="0.00" departSpeed="13.90" departDelay="0.55" arrival="466.65" arrivalLane="c2w_1" arrivalPos="990.00" arrivalPosLat="0.00" arrivalSpeed="13.90" duration="200.10" routeLength="1996.47" waitingTime="38.40" waitingCount="2" stopTime="0.00" timeLoss="55.76" rerouteNo="1" devices="tripinfo_car_s2w_266 routing_car_s2w_266" vType="Car" speedFactor="1.00" vaporized=""/>
    <tripinfo id="car_n2e_285" depart="285.00" departLane="n2sep_1" departPos="3.60" departPosLat="0.00" departSpeed="13.90" departDelay="0.00" arrival="467.80" arrivalLane="c2e_1" arrivalPos="990.00" arrivalPosLat="0.00" arrivalSpeed="16.00" duration="182.80" routeLength="1996.47" waitingTime="45.90" waitingCount="2" stopTime="0.00" timeLoss="65.06" rerouteNo="1" devices="tripinfo_car_n2e_285 routing_car_n2e_285" vType="Car" speedFactor="1.23" vaporized=""/>
    <tripinfo id="car_s2w_303" depart="303.00" departLane="s2sep_1" departPos="3.60" departPosLat="0.00" departSpeed="13.90" departDelay="0.00" arrival="469.75" arrivalLane="c2w_1" arrivalPos="990.00" arrivalPosLat="0.00" arrivalSpeed="14.17" duration="166.75" routeLength="1996.47" waitingTime="3.30" waitingCount="1" stopTime="0.00" timeLoss="25.76" rerouteNo="1" devices="tripinfo_car_s2w_303 routing_car_s2w_303" vType="Car" speedFactor="1.02" vaporized=""/>
    <tripinfo id="car_s2n_326" depart="326.00" departLane="s2sep_1" departPos="3.60" departPosLat="0.00" departSpeed="13.90" departDelay="0.00" arrival="471.20" arrivalLane="c2n_1" arrivalPos="990.00" arrivalPosLat="0.00" arrivalSpeed="13.93" duration="145.20" routeLength="1997.01" waitingTime="0.00" waitingCount="0" stopTime="0.00" timeLoss="1.82" rerouteNo="1" devices="tripinfo_car_s2n_326 routing_car_s2n_326" vType="Car" speedFactor="1.00" vaporized=""/>
    <tripinfo id="car_s2w_308" depart="308.00" departLane="s2sep_1" departPos="3.60" departPosLat="0.00" departSpeed="13.90" departDelay="0.00" arrival="471.60" arrivalLane="c2w_1" arrivalPos="990.00" arrivalPosLat="0.00" arrivalSpeed="15.36" duration="163.60" routeLength="1996.47" waitingTime="2.65" waitingCount="1" stopTime="0.00" timeLoss="39.65" rerouteNo="1" devices="tripinfo_car_s2w_308 routing_car_s2w_308" vType="Car" speedFactor="1.16" vaporized=""/>
    <tripinfo id="car_n2e_314" depart="314.00" departLane="n2sep_1" departPos="3.60" departPosLat="0.00" departSpeed="13.90" departDelay="0.00" arrival="473.35" arrivalLane="c2e_1" arrivalPos="990.00" arrivalPosLat="0.00" arrivalSpeed="15.69" duration="159.35" routeLength="1996.47" waitingTime="15.50" waitingCount="2" stopTime="0.00" timeLoss="31.50" rerouteNo="1" devices="tripinfo_car_n2e_314 routing_car_n2e_314" vType="Car" speedFactor="1.13" vaporized=""/>
</tripinfos>
