<?xml version="1.0" encoding="UTF-8"?>

<!-- generated on Sat Apr 24 18:27:52 2021 by Eclipse SUMO Version 1.4.0
<configuration xmlns:xsi="http://www.w3.org/2001/XMLSchema-instance" xsi:noNamespaceSchemaLocation="http://sumo.dlr.de/xsd/sumoConfiguration.xsd">

    <input>
        <net-file value="sumofiles/junction.net.xml"/>
        <route-files value="sumofiles/junction_preemption_135.rou.xml"/>
        <additional-files value="sumofiles/junction.det.xml"/>
    </input>

    <output>
        <tripinfo-output value="sumofiles/output/tripinfo_preemption_135.xml"/>
    </output>

    <time>
        <begin value="0"/>
        <end value="10000"/>
        <step-length value="0.05"/>
    </time>

    <processing>
        <lateral-resolution value="0.1"/>
    </processing>

    <report>
        <no-warnings value="true"/>
        <error-log value="sumofiles/output/errorlog_preemption_135.log"/>
        <no-step-log value="true"/>
    </report>

    <traci_server>
        <remote-port value="42771"/>
    </traci_server>

    <gui_only>
        <gui-settings-file value="sumofiles/junction-gui.settings.xml"/>
        <tracker-interval value="0.05"/>
    </gui_only>

</configuration>
-->

<tripinfos xmlns:xsi="http://www.w3.org/2001/XMLSchema-instance" xsi:noNamespaceSchemaLocation="http://sumo.dlr.de/xsd/tripinfo_file.xsd">
    <tripinfo id="car_s2e_6" depart="6.00" departLane="s2sep_1" departPos="3.60" departPosLat="0.00" departSpeed="13.90" departDelay="0.00" arrival="161.70" arrivalLane="c2e_1" arrivalPos="990.00" arrivalPosLat="0.00" arrivalSpeed="14.73" duration="155.70" routeLength="1986.69" waitingTime="12.75" waitingCount="1" stopTime="0.00" timeLoss="20.14" rerouteNo="1" devices="tripinfo_car_s2e_6 routing_car_s2e_6" vType="Car" speedFactor="1.06" vaporized=""/>
    <tripinfo id="car_n2s_2" depart="2.00" departLane="n2sep_1" departPos="3.60" departPosLat="0.00" departSpeed="13.90" departDelay="0.00" arrival="161.75" arrivalLane="c2s_1" arrivalPos="990.00" arrivalPosLat="0.00" arrivalSpeed="14.73" duration="159.75" routeLength="1997.01" waitingTime="16.75" waitingCount="1" stopTime="0.00" timeLoss="24.20" rerouteNo="1" devices="tripinfo_car_n2s_2 routing_car_n2s_2" vType="Car" speedFactor="1.06" vaporized=""/>
    <tripinfo id="car_s2n_28" depart="28.00" departLane="s2sep_1" departPos="3.60" departPosLat="0.00" departSpeed="13.90" departDelay="0.00" arrival="165.95" arrivalLane="c2n_1" arrivalPos="990.00" arrivalPosLat="0.00" arrivalSpeed="14.55" duration="137.95" routeLength="1997.01" waitingTime="0.00" waitingCount="0" stopTime="0.00" timeLoss="0.72" rerouteNo="1" devices="tripinfo_car_s2n_28 routing_car_s2n_28" vType="Car" speedFactor="1.05" vaporized=""/>
    <tripinfo id="car_n2e_21" depart="21.00" departLane="n2sep_1" departPos="3.60" departPosLat="0.00" departSpeed="13.90" departDelay="0.00" arrival="167.80" arrivalLane="c2e_1" arrivalPos="990.00" arrivalPosLat="0.00" arrivalSpeed="15.05" duration="146.80" routeLength="1996.47" waitingTime="0.85" waitingCount="1" stopTime="0.00" timeLoss="13.49" rerouteNo="1" devices="tripinfo_car_n2e_21 routing_car_n2e_21" vType="Car" speedFactor="1.08" vaporized=""/>
    <tripinfo id="car_n2s_19" depart="19.00" departLane="n2sep_1" departPos="3.60" departPosLat="0.00" departSpeed="13.90" departDelay="0.00" arrival="168.25" arrivalLane="c2s_1" arrivalPos="990.00" arrivalPosLat="0.00" arrivalSpeed="14.04" duration="149.25" routeLength="1997.01" waitingTime="0.00" waitingCount="0" stopTime="0.00" timeLoss="7.03" rerouteNo="1" devices="tripinfo_car_n2s_19 routing_car_n2s_19" vType="Car" speedFactor="1.01" vaporized=""/>
    <tripinfo id="car_n2s_38" depart="38.00" departLane="n2sep_1" departPos="3.60" departPosLat="0.00" departSpeed="13.90" departDelay="0.00" arrival="176.00" arrivalLane="c2s_1" arrivalPos="990.00" arrivalPosLat="0.00" arrivalSpeed="14.54" duration="138.00" routeLength="1997.01" waitingTime="0.00" waitingCount="0" stopTime="0.00" timeLoss="0.60" rerouteNo="1" devices="tripinfo_car_n2s_38 routing_car_n2s_38" vType="Car" speedFactor="1.05" vaporized=""/>
    <tripinfo id="car_s2w_43" depart="43.00" departLane="s2sep_1" departPos="3.60" departPosLat="0.00" departSpeed="13.90" departDelay="0.00" arrival="178.10" arrivalLane="c2w_1" arrivalPos="990.00" arrivalPosLat="0.00" arrivalSpeed="16.10" duration="135.10" routeLength="1996.47" waitingTime="0.00" waitingCount="0" stopTime="0.00" timeLoss="10.50" rerouteNo="1" devices="tripinfo_car_s2w_43 routing_car_s2w_43" vType="Car" speedFactor="1.16" vaporized=""/>
    <tripinfo id="car_s2n_38" depart="38.00" departLane="s2sep_1" departPos="3.60" departPosLat="0.00" departSpeed="13.90" departDelay="0.00" arrival="181.95" arrivalLane="c2n_1" arrivalPos="990.00" arrivalPosLat="0.00" arrivalSpeed="13.90" duration="143.95" routeLength="1997.01" waitingTime="0.00" waitingCount="0" stopTime="0.00" timeLoss="0.26" rerouteNo="1" devices="tripinfo_car_s2n_38 routing_car_s2n_38" vType="Car" speedFactor="1.00" vaporized=""/>
    <tripinfo id="car_n2s_39" depart="39.40" departLane="n2sep_1" departPos="3.60" departPosLat="0.00" departSpeed="13.90" departDelay="0.40" arrival="185.30" arrivalLane="c2s_1" arrivalPos="990.00" arrivalPosLat="0.00" arrivalSpeed="13.90" duration="145.90" routeLength="1997.01" waitingTime="0.00" waitingCount="0" stopTime="0.00" timeLoss="2.22" rerouteNo="1" devices="tripinfo_car_n2s_39 routing_car_n2s_39" vType="Car" speedFactor="1.00" vaporized=""/>
    <tripinfo id="car_n2e_46" depart="47.45" departLane="n2sep_1" departPos="3.60" departPosLat="0.00" departSpeed="13.90" departDelay="1.45" arrival="189.80" arrivalLane="c2e_1" arrivalPos="990.00" arrivalPosLat="0.00" arrivalSpeed="15.16" duration="142.35" routeLength="1996.47" waitingTime="0.00" waitingCount="0" stopTime="0.00" timeLoss="10.03" rerouteNo="1" devices="tripinfo_car_n2e_46 routing_car_n2e_46" vType="Car" speedFactor="1.09" vaporized=""/>
    <tripinfo id="car_n2w_46" depart="46.00" departLane="n2sep_1" departPos="3.60" departPosLat="0.00" departSpeed="13.90" departDelay="0.00" arrival="192.75" arrivalLane="c2w_1" arrivalPos="990.00" arrivalPosLat="0.00" arrivalSpeed="14.04" duration="146.75" routeLength="1986.69" waitingTime="0.00" waitingCount="0" stopTime="0.00" timeLoss="4.54" rerouteNo="1" devices="tripinfo_car_n2w_46 routing_car_n2w_46" vType="Car" speedFactor="1.01" vaporized=""/>
    <tripinfo id="car_n2w_56" depart="56.00" departLane="n2sep_1" departPos="3.60" departPosLat="0.00" departSpeed="13.90" departDelay="0.00" arrival="194.90" arrivalLane="c2w_1" arrivalPos="990.00" arrivalPosLat="0.00" arrivalSpeed="15.20" duration="138.90" routeLength="1986.69" waitingTime="0.00" waitingCount="0" stopTime="0.00" timeLoss="10.98" rerouteNo="1" devices="tripinfo_car_n2w_56 routing_car_n2w_56" vType="Car" speedFactor="1.12" vaporized=""/>
    <tripinfo id="car_w2e_15" depart="15.00" departLane="w2sep_1" departPos="3.60" departPosLat="0.00" departSpeed="13.90" departDelay="0.00" arrival="207.50" arrivalLane="c2e_1" arrivalPos="990.00" arrivalPosLat="0.00" arrivalSpeed="15.05" duration="192.50" routeLength="1997.01" waitingTime="50.70" waitingCount="1" stopTime="0.00" timeLoss="59.80" rerouteNo="1" devices="tripinfo_car_w2e_15 routing_car_w2e_15" vType="Car" speedFactor="1.08" vaporized=""/>
    <tripinfo id="car_e2n_16" depart="16.00" departLane="e2sep_1" departPos="3.60" departPosLat="0.00" departSpeed="13.90" departDelay="0.00" arrival="208.60" arrivalLane="c2n_1" arrivalPos="990.00" arrivalPosLat="0.00" arrivalSpeed="14.32" duration="192.60" routeLength="1986.69" waitingTime="46.20" waitingCount="1" stopTime="0.00" timeLoss="53.15" rerouteNo="1" devices="tripinfo_car_e2n_16 routing_car_e2n_16" vType="Car" speedFactor="1.03" vaporized=""/>
    <tripinfo id="car_w2s_7" depart="7.00" departLane="w2sep_1" departPos="3.60" departPosLat="0.00" departSpeed="13.90" departDelay="0.00" arrival="209.90" arrivalLane="c2s_1" arrivalPos="990.00" arrivalPosLat="0.00" arrivalSpeed="14.04" duration="202.90" routeLength="1986.69" waitingTime="54.10" waitingCount="1" stopTime="0.00" timeLoss="60.74" rerouteNo="1" devices="tripinfo_car_w2s_7 routing_car_w2s_7" vType="Car" speedFactor="1.01" vaporized=""/>
    <tripinfo id="car_w2e_31" depart="31.00" departLane="w2sep_1" departPos="3.60" departPosLat="0.00" departSpeed="13.90" departDelay="0.00" arrival="210.60" arrivalLane="c2e_1" arrivalPos="990.00" arrivalPosLat="0.00" arrivalSpeed="15.52" duration="179.60" routeLength="1997.01" waitingTime="38.30" waitingCount="1" stopTime="0.00" timeLoss="51.64" rerouteNo="1" devices="tripinfo_car_w2e_31 routing_car_w2e_31" vType="Car" speedFactor="1.12" vaporized=""/>
    <tripinfo id="car_e2w_26" depart="26.00" departLane="e2sep_1" departPos="3.60" departPosLat="0.00" departSpeed="13.90" departDelay="0.00" arrival="213.10" arrivalLane="c2w_1" arrivalPos="990.00" arrivalPosLat="0.00" arrivalSpeed="14.32" duration="187.10" routeLength="1997.01" waitingTime="36.60" waitingCount="1" stopTime="0.00" timeLoss="47.65" rerouteNo="1" devices="tripinfo_car_e2w_26 routing_car_e2w_26" vType="Car" speedFactor="1.03" vaporized=""/>
    <tripinfo id="car_e2n_18" depart="18.00" departLane="e2sep_1" departPos="3.60" departPosLat="0.00" departSpeed="13.90" departDelay="0.00" arrival="214.50" arrivalLane="c2n_1" arrivalPos="990.00" arrivalPosLat="0.00" arrivalSpeed="13.90" duration="196.50" routeLength="1986.69" waitingTime="41.55" waitingCount="1" stopTime="0.00" timeLoss="52.84" rerouteNo="1" devices="tripinfo_car_e2n_18 routing_car_e2n_18" vType="Car" speedFactor="1.00" vaporized=""/>
    <tripinfo id="car_e2w_28" depart="28.00" departLane="e2sep_1" departPos="3.60" departPosLat="0.00" departSpeed="13.90" departDelay="0.00" arrival="215.80" arrivalLane="c2w_1" arrivalPos="990.00" arrivalPosLat="0.00" arrivalSpeed="15.02" duration="187.80" routeLength="1997.01" waitingTime="35.70" waitingCount="1" stopTime="0.00" timeLoss="56.08" rerouteNo="1" devices="tripinfo_car_e2w_28 routing_car_e2w_28" vType="Car" speedFactor="1.09" vaporized=""/>
    <tripinfo id="car_w2e_51" depart="51.00" departLane="w2sep_1" departPos="3.60" departPosLat="0.00" departSpeed="13.90" departDelay="0.00" arrival="216.65" arrivalLane="c2e_1" arrivalPos="990.00" arrivalPosLat="0.00" arrivalSpeed="14.26" duration="165.65" routeLength="1997.01" waitingTime="13.80" waitingCount="1" stopTime="0.00" timeLoss="25.64" rerouteNo="1" devices="tripinfo_car_w2e_51 routing_car_w2e_51" vType="Car" speedFactor="1.03" vaporized=""/>
    <tripinfo id="car_w2e_74" depart="74.00" departLane="w2sep_1" departPos="3.60" departPosLat="0.00" departSpeed="13.90" departDelay="0.00" arrival="218.55" arrivalLane="c2e_1" arrivalPos="990.00" arrivalPosLat="0.00" arrivalSpeed="15.64" duration="144.55" routeLength="1997.01" waitingTime="0.00" waitingCount="0" stopTime="0.00" timeLoss="22.64" rerouteNo="1" devices="tripinfo_car_w2e_74 routing_car_w2e_74" vType="Car" speedFactor="1.18" vaporized=""/>
    <tripinfo id="car_e2s_18" depart="19.65" departLane="e2sep_1" departPos="3.60" departPosLat="0.00" departSpeed="13.90" departDelay="1.65" arrival="220.35" arrivalLane="c2s_1" arrivalPos="990.00" arrivalPosLat="0.00" arrivalSpeed="14.54" duration="200.70" routeLength="1996.47" waitingTime="46.15" waitingCount="2" stopTime="0.00" timeLoss="62.67" rerouteNo="1" devices="tripinfo_car_e2s_18 routing_car_e2s_18" vType="Car" speedFactor="1.05" vaporized=""/>
    <tripinfo id="car_w2e_78" depart="78.00" departLane="w2sep_1" departPos="3.60" departPosLat="0.00" departSpeed="13.90" departDelay="0.00" arrival="220.55" arrivalLane="c2e_1" arrivalPos="990.00" arrivalPosLat="0.00" arrivalSpeed="15.72" duration="142.55" routeLength="1997.01" waitingTime="0.00" waitingCount="0" stopTime="0.00" timeLoss="19.92" rerouteNo="1" devices="tripinfo_car_w2e_78 routing_car_w2e_78" vType="Car" speedFactor="1.17" vaporized=""/>
    <tripinfo id="car_e2w_33" depart="33.00" departLane="e2sep_1" departPos="3.60" departPosLat="0.00" departSpeed="13.90" departDelay="0.00" arrival="221.15" arrivalLane="c2w_1" arrivalPos="990.00" arrivalPosLat="0.00" arrivalSpeed="13.90" duration="188.15" routeLength="1997.01" waitingTime="29.40" waitingCount="1" stopTime="0.00" timeLoss="44.44" rerouteNo="1" devices="tripinfo_car_e2w_33 routing_car_e2w_33" vType="Car" speedFactor="1.00" vaporized=""/>
    <tripinfo id="car_w2n_40" depart="40.00" departLane="w2sep_1" departPos="3.60" departPosLat="0.00" departSpeed="13.90" departDelay="0.00" arrival="222.15" arrivalLane="c2n_1" arrivalPos="990.00" arrivalPosLat="0.00" arrivalSpeed="13.90" duration="182.15" routeLength="1996.47" waitingTime="26.55" waitingCount="2" stopTime="0.00" timeLoss="37.80" rerouteNo="1" devices="tripinfo_car_w2n_40 routing_car_w2n_40" vType="Car" speedFactor="1.00" vaporized=""/>
    <tripinfo id="car_e2s_28" depart="29.50" departLane="e2sep_1" departPos="3.60" departPosLat="0.00" departSpeed="13.90" departDelay="1.50" arrival="225.35" arrivalLane="c2s_1" arrivalPos="990.00" arrivalPosLat="0.00" arrivalSpeed="14.26" duration="195.85" routeLength="1996.47" waitingTime="36.65" waitingCount="2" stopTime="0.00" timeLoss="55.23" rerouteNo="1" devices="tripinfo_car_e2s_28 routing_car_e2s_28" vType="Car" speedFactor="1.03" vaporized=""/>
    <tripinfo id="car_e2s_45" depart="45.00" departLane="e2sep_1" departPos="3.60" departPosLat="0.00" departSpeed="13.90" departDelay="0.00" arrival="229.35" arrivalLane="c2s_1" arrivalPos="990.00" arrivalPosLat="0.00" arrivalSpeed="14.13" duration="184.35" routeLength="1996.47" waitingTime="22.75" waitingCount="2" stopTime="0.00" timeLoss="42.59" rerouteNo="1" devices="tripinfo_car_e2s_45 routing_car_e2s_45" vType="Car" speedFactor="1.02" vaporized=""/>
    <tripinfo id="car_e2n_82" depart="82.00" departLane="e2sep_1" departPos="3.60" departPosLat="0.00" departSpeed="13.90" departDelay="0.00" arrival="229.80" arrivalLane="c2n_1" arrivalPos="990.00" arrivalPosLat="0.00" arrivalSpeed="13.90" duration="147.80" routeLength="1986.69" waitingTime="0.00" waitingCount="0" stopTime="0.00" timeLoss="4.13" rerouteNo="1" devices="tripinfo_car_e2n_82 routing_car_e2n_82" vType="Car" speedFactor="1.00" vaporized=""/>
    <tripinfo id="car_e2s_52" depart="52.00" departLane="e2sep_1" departPos="3.60" departPosLat="0.00" departSpeed="13.90" departDelay="0.00" arrival="232.15" arrivalLane="c2s_1" arrivalPos="990.00" arrivalPosLat="0.00" arrivalSpeed="14.45" duration="180.15" routeLength="1996.47" waitingTime="17.95" waitingCount="2" stopTime="0.00" timeLoss="42.29" rerouteNo="1" devices="tripinfo_car_e2s_52 routing_car_e2s_52" vType="Car" speedFactor="1.05" vaporized=""/>
    <tripinfo id="car_w2n_79" depart="79.25" departLane="w2sep_1" departPos="3.60" departPosLat="0.00" departSpeed="13.90" departDelay="0.25" arrival="234.35" arrivalLane="c2n_1" arrivalPos="990.00" arrivalPosLat="0.00" arrivalSpeed="13.89" duration="155.10" routeLength="1996.47" waitingTime="1.60" waitingCount="1" stopTime="0.00" timeLoss="10.75" rerouteNo="1" devices="tripinfo_car_w2n_79 routing_car_w2n_79" vType="Car" speedFactor="1.00" vaporized=""/>
    <tripinfo id="car_e2s_61" depart="61.00" departLane="e2sep_1" departPos="3.60" departPosLat="0.00" departSpeed="13.90" departDelay="0.00" arrival="235.90" arrivalLane="c2s_1" arrivalPos="990.00" arrivalPosLat="0.00" arrivalSpeed="13.88" duration="174.90" routeLength="1996.47" waitingTime="6.95" waitingCount="2" stopTime="0.00" timeLoss="30.56" rerouteNo="1" devices="tripinfo_car_e2s_61 routing_car_e2s_61" vType="Car" speedFactor="1.00" vaporized=""/>
    <tripinfo id="car_e2s_75" depart="75.00" departLane="e2sep_1" departPos="3.60" departPosLat="0.00" departSpeed="13.90" departDelay="0.00" arrival="237.75" arrivalLane="c2s_1" arrivalPos="990.00" arrivalPosLat="0.00" arrivalSpeed="15.22" duration="162.75" routeLength="1996.47" waitingTime="3.25" waitingCount="1" stopTime="0.00" timeLoss="37.72" rerouteNo="1" devices="tripinfo_car_e2s_75 routing_car_e2s_75" vType="Car" speedFactor="1.15" vaporized=""/>
    <tripinfo id="car_e2s_85" depart="85.00" departLane="e2sep_1" departPos="3.60" departPosLat="0.00" departSpeed="13.90" departDelay="0.00" arrival="239.55" arrivalLane="c2s_1" arrivalPos="990.00" arrivalPosLat="0.00" arrivalSpeed="15.51" duration="154.55" routeLength="1996.47" waitingTime="0.00" waitingCount="0" stopTime="0.00" timeLoss="32.20" rerouteNo="1" devices="tripinfo_car_e2s_85 routing_car_e2s_85" vType="Car" speedFactor="1.18" vaporized=""/>
    <tripinfo id="car_e2s_89" depart="89.00" departLane="e2sep_1" departPos="3.60" departPosLat="0.00" departSpeed="13.90" departDelay="0.00" arrival="242.35" arrivalLane="c2s_1" arrivalPos="990.00" arrivalPosLat="0.00" arrivalSpeed="14.23" duration="153.35" routeLength="1996.47" waitingTime="0.00" waitingCount="0" stopTime="0.00" timeLoss="13.27" rerouteNo="1" devices="tripinfo_car_e2s_89 routing_car_e2s_89" vType="Car" speedFactor="1.03" vaporized=""/>
    <tripinfo id="car_s2n_64" depart="64.00" departLane="s2sep_1" departPos="3.60" departPosLat="0.00" departSpeed="13.90" departDelay="0.00" arrival="247.70" arrivalLane="c2n_1" arrivalPos="990.00" arrivalPosLat="0.00" arrivalSpeed="15.73" duration="183.70" routeLength="1997.01" waitingTime="49.25" waitingCount="1" stopTime="0.00" timeLoss="56.77" rerouteNo="1" devices="tripinfo_car_s2n_64 routing_car_s2n_64" vType="Car" speedFactor="1.13" vaporized=""/>
    <tripinfo id="car_n2w_62" depart="62.00" departLane="n2sep_1" departPos="3.60" departPosLat="0.00" departSpeed="13.90" departDelay="0.00" arrival="255.65" arrivalLane="c2w_1" arrivalPos="990.00" arrivalPosLat="0.00" arrivalSpeed="13.90" duration="193.65" routeLength="1986.69" waitingTime="42.90" waitingCount="1" stopTime="0.00" timeLoss="49.96" rerouteNo="1" devices="tripinfo_car_n2w_62 routing_car_n2w_62" vType="Car" speedFactor="1.00" vaporized=""/>
    <tripinfo id="car_n2w_89" depart="89.00" departLane="n2sep_1" departPos="3.60" departPosLat="0.00" departSpeed="13.90" departDelay="0.00" arrival="257.55" arrivalLane="c2w_1" arrivalPos="990.00" arrivalPosLat="0.00" arrivalSpeed="15.36" duration="168.55" routeLength="1986.69" waitingTime="25.10" waitingCount="1" stopTime="0.00" timeLoss="44.50" rerouteNo="1" devices="tripinfo_car_n2w_89 routing_car_n2w_89" vType="Car" speedFactor="1.16" vaporized=""/>
    <tripinfo id="car_s2e_77" depart="77.00" departLane="s2sep_1" departPos="3.60" departPosLat="0.00" departSpeed="13.90" departDelay="0.00" arrival="257.60" arrivalLane="c2e_1" arrivalPos="990.00" arrivalPosLat="0.00" arrivalSpeed="13.97" duration="180.60" routeLength="1986.69" waitingTime="29.20" waitingCount="1" stopTime="0.00" timeLoss="37.69" rerouteNo="1" devices="tripinfo_car_s2e_77 routing_car_s2e_77" vType="Car" speedFactor="1.01" vaporized=""/>
    <tripinfo id="car_n2s_102" depart="102.00" departLane="n2sep_1" departPos="3.60" departPosLat="0.00" departSpeed="13.90" departDelay="0.00" arrival="259.45" arrivalLane="c2s_1" arrivalPos="990.00" arrivalPosLat="0.00" arrivalSpeed="14.04" duration="157.45" routeLength="1997.01" waitingTime="5.65" waitingCount="1" stopTime="0.00" timeLoss="15.20" rerouteNo="1" devices="tripinfo_car_n2s_102 routing_car_n2s_102" vType="Car" speedFactor="1.01" vaporized=""/>
    <tripinfo id="car_s2e_97" depart="97.00" departLane="s2sep_1" departPos="3.60" departPosLat="0.00" departSpeed="13.90" departDelay="0.00" arrival="260.00" arrivalLane="c2e_1" arrivalPos="990.00" arrivalPosLat="0.00" arrivalSpeed="14.93" duration="163.00" routeLength="1986.69" waitingTime="15.50" waitingCount="1" stopTime="0.00" timeLoss="31.39" rerouteNo="1" devices="tripinfo_car_s2e_97 routing_car_s2e_97" vType="Car" speedFactor="1.09" vaporized=""/>
    <tripinfo id="car_s2e_110" depart="110.45" departLane="s2sep_1" departPos="3.60" departPosLat="0.00" departSpeed="13.90" departDelay="0.45" arrival="261.90" arrivalLane="c2e_1" arrivalPos="990.00" arrivalPosLat="0.00" arrivalSpeed="15.58" duration="151.45" routeLength="1986.69" waitingTime="0.00" waitingCount="0" stopTime="0.00" timeLoss="28.54" rerouteNo="1" devices="tripinfo_car_s2e_110 routing_car_s2e_110" vType="Car" speedFactor="1.17" vaporized=""/>
    <tripinfo id="car_s2n_109" depart="109.00" departLane="s2sep_1" departPos="3.60" departPosLat="0.00" departSpeed="13.90" departDelay="0.00" arrival="262.35" arrivalLane="c2n_1" arrivalPos="990.00" arrivalPosLat="0.00" arrivalSpeed="13.90" duration="153.35" routeLength="1997.01" waitingTime="0.00" waitingCount="0" stopTime="0.00" timeLoss="9.64" rerouteNo="1" devices="tripinfo_car_s2n_109 routing_car_s2n_109" vType="Car" speedFactor="1.00" vaporized=""/>
    <tripinfo id="car_n2w_104" depart="104.00" departLane="n2sep_1" departPos="3.60" departPosLat="0.00" departSpeed="13.90" departDelay="0.00" arrival="263.50" arrivalLane="c2w_1" arrivalPos="990.00" arrivalPosLat="0.00" arrivalSpeed="13.90" duration="159.50" routeLength="1986.69" waitingTime="2.60" waitingCount="1" stopTime="0.00" timeLoss="15.81" rerouteNo="1" devices="tripinfo_car_n2w_104 routing_car_n2w_104" vType="Car" speedFactor="1.00" vaporized=""/>
    <tripinfo id="car_s2w_85" depart="85.00" departLane="s2sep_1" departPos="3.60" departPosLat="0.00" departSpeed="13.90" departDelay="0.00" arrival="265.65" arrivalLane="c2w_1" arrivalPos="990.00" arrivalPosLat="0.00" arrivalSpeed="14.94" duration="180.65" routeLength="1996.47" waitingTime="31.00" waitingCount="2" stopTime="0.00" timeLoss="49.72" rerouteNo="1" devices="tripinfo_car_s2w_85 routing_car_s2w_85" vType="Car" speedFactor="1.10" vaporized=""/>
    <tripinfo id="car_s2e_111" depart="112.10" departLane="s2sep_1" departPos="3.60" departPosLat="0.00" departSpeed="13.90" departDelay="1.10" arrival="267.10" arrivalLane="c2e_1" arrivalPos="990.00" arrivalPosLat="0.00" arrivalSpeed="14.13" duration="155.00" routeLength="1986.69" waitingTime="0.00" waitingCount="0" stopTime="0.00" timeLoss="13.73" rerouteNo="1" devices="tripinfo_car_s2e_111 routing_car_s2e_111" vType="Car" speedFactor="1.02" vaporized=""/>
    <tripinfo id="car_s2n_114" depart="114.00" departLane="s2sep_1" departPos="3.60" departPosLat="0.00" departSpeed="13.90" departDelay="0.00" arrival="269.15" arrivalLane="c2n_1" arrivalPos="990.00" arrivalPosLat="0.00" arrivalSpeed="13.94" duration="155.15" routeLength="1997.01" waitingTime="0.00" waitingCount="0" stopTime="0.00" timeLoss="11.93" rerouteNo="1" devices="tripinfo_car_s2n_114 routing_car_s2n_114" vType="Car" speedFactor="1.00" vaporized=""/>
    <tripinfo id="car_n2w_126" depart="126.00" departLane="n2sep_1" departPos="3.60" departPosLat="0.00" departSpeed="13.90" departDelay="0.00" arrival="271.00" arrivalLane="c2w_1" arrivalPos="990.00" arrivalPosLat="0.00" arrivalSpeed="14.22" duration="145.00" routeLength="1986.69" waitingTime="0.00" waitingCount="0" stopTime="0.00" timeLoss="4.64" rerouteNo="1" devices="tripinfo_car_n2w_126 routing_car_n2w_126" vType="Car" speedFactor="1.02" vaporized=""/>
    <tripinfo id="car_n2e_72" depart="72.00" departLane="n2sep_1" departPos="3.60" departPosLat="0.00" departSpeed="13.90" departDelay="0.00" arrival="272.75" arrivalLane="c2e_1" arrivalPos="990.00" arrivalPosLat="0.00" arrivalSpeed="13.90" duration="200.75" routeLength="1996.47" waitingTime="44.55" waitingCount="2" stopTime="0.00" timeLoss="56.40" rerouteNo="1" devices="tripinfo_car_n2e_72 routing_car_n2e_72" vType="Car" speedFactor="1.00" vaporized=""/>
    <tripinfo id="car_n2w_133" depart="133.00" departLane="n2sep_1" departPos="3.60" departPosLat="0.00" departSpeed="13.90" departDelay="0.00" arrival="273.65" arrivalLane="c2w_1" arrivalPos="990.00" arrivalPosLat="0.00" arrivalSpeed="14.90" duration="140.65" routeLength="1986.69" waitingTime="0.00" waitingCount="0" stopTime="0.00" timeLoss="7.93" rerouteNo="1" devices="tripinfo_car_n2w_133 routing_car_n2w_133" vType="Car" speedFactor="1.08" vaporized=""/>
    <tripinfo id="car_s2w_134" depart="134.00" departLane="s2sep_1" departPos="3.60" departPosLat="0.00" departSpeed="13.90" departDelay="0.00" arrival="276.00" arrivalLane="c2w_1" arrivalPos="990.00" arrivalPosLat="0.00" arrivalSpeed="15.29" duration="142.00" routeLength="1996.47" waitingTime="0.00" waitingCount="0" stopTime="0.00" timeLoss="13.04" rerouteNo="1" devices="tripinfo_car_s2w_134 routing_car_s2w_134" vType="Car" speedFactor="1.12" vaporized=""/>
    <tripinfo id="car_n2e_79" depart="79.00" departLane="n2sep_1" departPos="3.60" departPosLat="0.00" departSpeed="13.90" departDelay="0.00" arrival="276.05" arrivalLane="c2e_1" arrivalPos="990.00" arrivalPosLat="0.00" arrivalSpeed="14.13" duration="197.05" routeLength="1996.47" waitingTime="38.45" waitingCount="2" stopTime="0.00" timeLoss="55.53" rerouteNo="1" devices="tripinfo_car_n2e_79 routing_car_n2e_79" vType="Car" speedFactor="1.02" vaporized=""/>
    <tripinfo id="car_n2e_147" depart="147.00" departLane="n2sep_1" departPos="3.60" departPosLat="0.00" departSpeed="13.90" departDelay="0.00" arrival="277.90" arrivalLane="c2e_1" arrivalPos="990.00" arrivalPosLat="0.00" arrivalSpeed="15.52" duration="130.90" routeLength="1996.47" waitingTime="0.00" waitingCount="0" stopTime="0.00" timeLoss="8.44" rerouteNo="1" devices="tripinfo_car_n2e_147 routing_car_n2e_147" vType="Car" speedFactor="1.18" vaporized=""/>
    <tripinfo id="car_e2n_97" depart="97.00" departLane="e2sep_1" departPos="3.60" departPosLat="0.00" departSpeed="13.90" departDelay="0.00" arrival="299.40" arrivalLane="c2n_1" arrivalPos="990.00" arrivalPosLat="0.00" arrivalSpeed="14.15" duration="202.40" routeLength="1986.69" waitingTime="54.40" waitingCount="1" stopTime="0.00" timeLoss="61.28" rerouteNo="1" devices="tripinfo_car_e2n_97 routing_car_e2n_97" vType="Car" speedFactor="1.02" vaporized=""/>
    <tripinfo id="car_w2e_105" depart="105.00" departLane="w2sep_1" departPos="3.60" departPosLat="0.00" departSpeed="13.90" departDelay="0.00" arrival="300.70" arrivalLane="c2e_1" arrivalPos="990.00" arrivalPosLat="0.00" arrivalSpeed="13.90" duration="195.70" routeLength="1997.01" waitingTime="45.15" waitingCount="1" stopTime="0.00" timeLoss="52.03" rerouteNo="1" devices="tripinfo_car_w2e_105 routing_car_w2e_105" vType="Car" speedFactor="1.00" vaporized=""/>
    <tripinfo id="car_e2w_99" depart="100.20" departLane="e2sep_1" departPos="3.60" departPosLat="0.00" departSpeed="13.90" departDelay="1.20" arrival="302.20" arrivalLane="c2w_1" arrivalPos="990.00" arrivalPosLat="0.00" arrivalSpeed="14.50" duration="202.00" routeLength="1997.01" waitingTime="50.05" waitingCount="1" stopTime="0.00" timeLoss="64.29" rerouteNo="1" devices="tripinfo_car_e2w_99 routing_car_e2w_99" vType="Car" speedFactor="1.04" vaporized=""/>
    <tripinfo id="car_w2s_107" depart="107.00" departLane="w2sep_1" departPos="3.60" departPosLat="0.00" departSpeed="13.90" departDelay="0.00" arrival="302.95" arrivalLane="c2s_1" arrivalPos="990.00" arrivalPosLat="0.00" arrivalSpeed="13.90" duration="195.95" routeLength="1986.69" waitingTime="41.90" waitingCount="1" stopTime="0.00" timeLoss="52.27" rerouteNo="1" devices="tripinfo_car_w2s_107 routing_car_w2s_107" vType="Car" speedFactor="1.00" vaporized=""/>
    <tripinfo id="car_e2n_98" depart="98.45" departLane="e2sep_1" departPos="3.60" departPosLat="0.00" departSpeed="13.90" departDelay="0.45" arrival="303.10" arrivalLane="c2n_1" arrivalPos="990.00" arrivalPosLat="0.00" arrivalSpeed="14.40" duration="204.65" routeLength="1986.69" waitingTime="51.85" waitingCount="1" stopTime="0.00" timeLoss="66.23" rerouteNo="1" devices="tripinfo_car_e2n_98 routing_car_e2n_98" vType="Car" speedFactor="1.04" vaporized=""/>
    <tripinfo id="car_e2n_101" depart="102.05" departLane="e2sep_1" departPos="3.60" departPosLat="0.00" departSpeed="13.90" departDelay="1.05" arrival="305.65" arrivalLane="c2n_1" arrivalPos="990.00" arrivalPosLat="0.00" arrivalSpeed="14.94" duration="203.60" routeLength="1986.69" waitingTime="49.00" waitingCount="1" stopTime="0.00" timeLoss="71.58" rerouteNo="1" devices="tripinfo_car_e2n_101 routing_car_e2n_101" vType="Car" speedFactor="1.09" vaporized=""/>
    <tripinfo id="car_w2e_117" depart="117.00" departLane="w2sep_1" departPos="3.60" departPosLat="0.00" departSpeed="13.90" departDelay="0.00" arrival="305.95" arrivalLane="c2e_1" arrivalPos="990.00" arrivalPosLat="0.00" arrivalSpeed="13.90" duration="188.95" routeLength="1997.01" waitingTime="34.60" waitingCount="1" stopTime="0.00" timeLoss="45.27" rerouteNo="1" devices="tripinfo_car_w2e_117 routing_car_w2e_117" vType="Car" speedFactor="1.00" vaporized=""/>
    <tripinfo id="car_w2s_162" depart="162.00" departLane="w2sep_1" departPos="3.60" departPosLat="0.00" departSpeed="13.90" departDelay="0.00" arrival="307.50" arrivalLane="c2s_1" arrivalPos="990.00" arrivalPosLat="0.00" arrivalSpeed="14.45" duration="145.50" routeLength="1986.69" waitingTime="0.00" waitingCount="0" stopTime="0.00" timeLoss="7.38" rerouteNo="1" devices="tripinfo_car_w2s_162 routing_car_w2s_162" vType="Car" speedFactor="1.04" vaporized=""/>
    <tripinfo id="car_e2n_125" depart="125.00" departLane="e2sep_1" departPos="3.60" departPosLat="0.00" departSpeed="13.90" departDelay="0.00" arrival="307.80" arrivalLane="c2n_1" arrivalPos="990.00" arrivalPosLat="0.00" arrivalSpeed="15.47" duration="182.80" routeLength="1986.69" waitingTime="30.95" waitingCount="1" stopTime="0.00" timeLoss="57.04" rerouteNo="1" devices="tripinfo_car_e2n_125 routing_car_e2n_125" vType="Car" speedFactor="1.14" vaporized=""/>
    <tripinfo id="car_w2e_151" depart="151.00" departLane="w2sep_1" departPos="3.60" departPosLat="0.00" departSpeed="13.90" departDelay="0.00" arrival="307.85" arrivalLane="c2e_1" arrivalPos="990.00" arrivalPosLat="0.00" arrivalSpeed="15.30" duration="156.85" routeLength="1997.01" waitingTime="9.25" waitingCount="1" stopTime="0.00" timeLoss="32.38" rerouteNo="1" devices="tripinfo_car_w2e_151 routing_car_w2e_151" vType="Car" speedFactor="1.15" vaporized=""/>
    <tripinfo id="car_e2w_123" depart="123.00" departLane="e2sep_1" departPos="3.60" departPosLat="0.00" departSpeed="13.90" departDelay="0.00" arrival="309.95" arrivalLane="c2w_1" arrivalPos="990.00" arrivalPosLat="0.00" arrivalSpeed="13.90" duration="186.95" routeLength="1997.01" waitingTime="31.55" waitingCount="1" stopTime="0.00" timeLoss="43.26" rerouteNo="1" devices="tripinfo_car_e2w_123 routing_car_e2w_123" vType="Car" speedFactor="1.00" vaporized=""/>
    <tripinfo id="car_e2s_129" depart="129.00" departLane="e2sep_1" departPos="3.60" departPosLat="0.00" departSpeed="13.90" departDelay="0.00" arrival="309.95" arrivalLane="c2s_1" arrivalPos="990.00" arrivalPosLat="0.00" arrivalSpeed="15.48" duration="180.95" routeLength="1996.47" waitingTime="33.40" waitingCount="2" stopTime="0.00" timeLoss="53.40" rerouteNo="1" devices="tripinfo_car_e2s_129 routing_car_e2s_129" vType="Car" speedFactor="1.13" vaporized=""/>
    <tripinfo id="car_w2n_112" depart="112.00" departLane="w2sep_1" departPos="3.60" departPosLat="0.00" departSpeed="13.90" departDelay="0.00" arrival="311.00" arrivalLane="c2n_1" arrivalPos="990.00" arrivalPosLat="0.00" arrivalSpeed="15.17" duration="199.00" routeLength="1996.47" waitingTime="49.10" waitingCount="2" stopTime="0.00" timeLoss="67.31" rerouteNo="1" devices="tripinfo_car_w2n_112 routing_car_w2n_112" vType="Car" speedFactor="1.10" vaporized=""/>
    <tripinfo id="bus_w2e_166" depart="166.00" departLane="w2sep_1" departPos="12.10" departPosLat="0.00" departSpeed="13.90" departDelay="0.00" arrival="312.75" arrivalLane="c2e_1" arrivalPos="990.00" arrivalPosLat="0.00" arrivalSpeed="13.86" duration="146.75" routeLength="1988.51" waitingTime="0.00" waitingCount="0" stopTime="0.00" timeLoss="3.66" rerouteNo="1" devices="tripinfo_bus_w2e_166 routing_bus_w2e_166" vType="Bus" speedFactor="1.00" vaporized=""/>
    <tripinfo id="car_e2w_178" depart="178.00" departLane="e2sep_1" departPos="3.60" departPosLat="0.00" departSpeed="13.90" departDelay="0.00" arrival="315.40" arrivalLane="c2w_1" arrivalPos="990.00" arrivalPosLat="0.00" arrivalSpeed="14.67" duration="137.40" routeLength="1997.01" waitingTime="0.00" waitingCount="0" stopTime="0.00" timeLoss="1.27" rerouteNo="1" devices="tripinfo_car_e2w_178 routing_car_e2w_178" vType="Car" speedFactor="1.06" vaporized=""/>
    <tripinfo id="car_w2s_172" depart="172.00" departLane="w2sep_1" departPos="3.60" departPosLat="0.00" departSpeed="13.90" departDelay="0.00" arrival="319.60" arrivalLane="c2s_1" arrivalPos="990.00" arrivalPosLat="0.00" arrivalSpeed="14.17" duration="147.60" routeLength="1986.69" waitingTime="0.00" waitingCount="0" stopTime="0.00" timeLoss="6.72" rerouteNo="1" devices="tripinfo_car_w2s_172 routing_car_w2s_172" vType="Car" speedFactor="1.02" vaporized=""/>
    <tripinfo id="car_w2n_143" depart="143.00" departLane="w2sep_1" departPos="3.60" departPosLat="0.00" departSpeed="13.90" departDelay="0.00" arrival="321.05" arrivalLane="c2n_1" arrivalPos="990.00" arrivalPosLat="0.00" arrivalSpeed="14.12" duration="178.05" routeLength="1996.47" waitingTime="19.50" waitingCount="3" stopTime="0.00" timeLoss="35.97" rerouteNo="1" devices="tripinfo_car_w2n_143 routing_car_w2n_143" vType="Car" speedFactor="1.02" vaporized=""/>
    <tripinfo id="car_w2s_182" depart="182.00" departLane="w2sep_1" departPos="3.60" departPosLat="0.00" departSpeed="13.90" departDelay="0.00" arrival="321.50" arrivalLane="c2s_1" arrivalPos="990.00" arrivalPosLat="0.00" arrivalSpeed="15.63" duration="139.50" routeLength="1986.69" waitingTime="0.00" waitingCount="0" stopTime="0.00" timeLoss="17.72" rerouteNo="1" devices="tripinfo_car_w2s_182 routing_car_w2s_182" vType="Car" speedFactor="1.18" vaporized=""/>
    <tripinfo id="car_e2w_192" depart="192.00" departLane="e2sep_1" departPos="3.60" departPosLat="0.00" departSpeed="13.90" departDelay="0.00" arrival="325.40" arrivalLane="c2w_1" arrivalPos="990.00" arrivalPosLat="0.00" arrivalSpeed="15.11" duration="133.40" routeLength="1997.01" waitingTime="0.00" waitingCount="0" stopTime="0.00" timeLoss="1.20" rerouteNo="1" devices="tripinfo_car_e2w_192 routing_car_e2w_192" vType="Car" speedFactor="1.09" vaporized=""/>
    <tripinfo id="car_e2n_179" depart="179.35" departLane="e2sep_1" departPos="3.60" departPosLat="0.00" departSpeed="13.90" departDelay="0.35" arrival="328.60" arrivalLane="c2n_1" arrivalPos="990.00" arrivalPosLat="0.00" arrivalSpeed="13.90" duration="149.25" routeLength="1986.69" waitingTime="0.00" waitingCount="0" stopTime="0.00" timeLoss="5.59" rerouteNo="1" devices="tripinfo_car_e2n_179 routing_car_e2n_179" vType="Car" speedFactor="1.00" vaporized=""/>
    <tripinfo id="car_w2e_188" depart="188.00" departLane="w2sep_1" departPos="3.60" departPosLat="0.00" departSpeed="13.90" departDelay="0.00" arrival="331.55" arrivalLane="c2e_1" arrivalPos="990.00" arrivalPosLat="0.00" arrivalSpeed="14.00" duration="143.55" routeLength="1997.01" waitingTime="0.00" waitingCount="0" stopTime="0.00" timeLoss="0.91" rerouteNo="1" devices="tripinfo_car_w2e_188 routing_car_w2e_188" vType="Car" speedFactor="1.01" vaporized=""/>
    <tripinfo id="car_w2n_167" depart="167.50" departLane="w2sep_1" departPos="3.60" departPosLat="0.00" departSpeed="13.90" departDelay="0.50" arrival="334.90" arrivalLane="c2n_1" arrivalPos="990.00" arrivalPosLat="0.00" arrivalSpeed="13.90" duration="167.40" routeLength="1996.47" waitingTime="8.00" waitingCount="2" stopTime="0.00" timeLoss="23.08" rerouteNo="1" devices="tripinfo_car_w2n_167 routing_car_w2n_167" vType="Car" speedFactor="1.00" vaporized=""/>
    <tripinfo id="car_n2w_161" depart="161.00" departLane="n2sep_1" departPos="3.60" departPosLat="0.00" departSpeed="13.90" departDelay="0.00" arrival="335.65" arrivalLane="c2w_1" arrivalPos="990.00" arrivalPosLat="0.00" arrivalSpeed="16.29" duration="174.65" routeLength="1986.69" waitingTime="43.90" waitingCount="1" stopTime="0.00" timeLoss="52.02" rerouteNo="1" devices="tripinfo_car_n2w_161 routing_car_n2w_161" vType="Car" speedFactor="1.17" vaporized=""/>
    <tripinfo id="car_w2n_183" depart="183.25" departLane="w2sep_1" departPos="3.60" departPosLat="0.00" departSpeed="13.90" departDelay="0.25" arrival="338.00" arrivalLane="c2n_1" arrivalPos="990.00" arrivalPosLat="0.00" arrivalSpeed="14.29" duration="154.75" routeLength="1996.47" waitingTime="2.25" waitingCount="1" stopTime="0.00" timeLoss="14.98" rerouteNo="1" devices="tripinfo_car_w2n_183 routing_car_w2n_183" vType="Car" speedFactor="1.03" vaporized=""/>
    <tripinfo id="car_n2s_183" depart="183.00" departLane="n2sep_1" departPos="3.60" departPosLat="0.00" departSpeed="13.90" departDelay="0.00" arrival="341.35" arrivalLane="c2s_1" arrivalPos="990.00" arrivalPosLat="0.00" arrivalSpeed="15.32" duration="158.35" routeLength="1997.01" waitingTime="19.05" waitingCount="1" stopTime="0.00" timeLoss="27.99" rerouteNo="1" devices="tripinfo_car_n2s_183 routing_car_n2s_183" vType="Car" speedFactor="1.10" vaporized=""/>
    <tripinfo id="car_s2e_144" depart="144.00" departLane="s2sep_1" departPos="3.60" departPosLat="0.00" departSpeed="13.90" departDelay="0.00" arrival="345.70" arrivalLane="c2e_1" arrivalPos="990.00" arrivalPosLat="0.00" arrivalSpeed="13.90" duration="201.70" routeLength="1986.69" waitingTime="51.25" waitingCount="1" stopTime="0.00" timeLoss="58.05" rerouteNo="1" devices="tripinfo_car_s2e_144 routing_car_s2e_144" vType="Car" speedFactor="1.00" vaporized=""/>
    <tripinfo id="car_s2n_165" depart="165.00" departLane="s2sep_1" departPos="3.60" departPosLat="0.00" departSpeed="13.90" departDelay="0.00" arrival="348.70" arrivalLane="c2n_1" arrivalPos="990.00" arrivalPosLat="0.00" arrivalSpeed="14.22" duration="183.70" routeLength="1997.01" waitingTime="31.60" waitingCount="1" stopTime="0.00" timeLoss="43.26" rerouteNo="1" devices="tripinfo_car_s2n_165 routing_car_s2n_165" vType="Car" speedFactor="1.02" vaporized=""/>
    <tripinfo id="car_s2e_163" depart="163.00" departLane="s2sep_1" departPos="3.60" departPosLat="0.00" departSpeed="13.90" departDelay="0.00" arrival="349.35" arrivalLane="c2e_1" arrivalPos="990.00" arrivalPosLat="0.00" arrivalSpeed="14.18" duration="186.35" routeLength="1986.69" waitingTime="34.25" waitingCount="1" stopTime="0.00" timeLoss="45.79" rerouteNo="1" devices="tripinfo_car_s2e_163 routing_car_s2e_163" vType="Car" speedFactor="1.02" vaporized=""/>
    <tripinfo id="car_s2w_151" depart="151.00" departLane="s2sep_1" departPos="3.60" departPosLat="0.00" departSpeed="13.90" departDelay="0.00" arrival="350.35" arrivalLane="c2w_1" arrivalPos="990.00" arrivalPosLat="0.00" arrivalSpeed="13.97" duration="199.35" routeLength="1996.47" waitingTime="44.80" waitingCount="2" stopTime="0.00" timeLoss="55.76" rerouteNo="1" devices="tripinfo_car_s2w_151 routing_car_s2w_151" vType="Car" speedFactor="1.01" vaporized=""/>
    <tripinfo id="car_s2e_198" depart="198.00" departLane="s2sep_1" departPos="3.60" departPosLat="0.00" departSpeed="13.90" departDelay="0.00" arrival="354.05" arrivalLane="c2e_1" arrivalPos="990.00" arrivalPosLat="0.00" arrivalSpeed="13.89" duration="156.05" routeLength="1986.69" waitingTime="0.00" waitingCount="0" stopTime="0.00" timeLoss="12.38" rerouteNo="1" devices="tripinfo_car_s2e_198 routing_car_s2e_198" vType="Car" speedFactor="1.00" vaporized=""/>
    <tripinfo id="car_s2e_209" depart="209.00" departLane="s2sep_1" departPos="3.60" departPosLat="0.00" departSpeed="13.90" departDelay="0.00" arrival="358.30" arrivalLane="c2e_1" arrivalPos="990.00" arrivalPosLat="0.00" arrivalSpeed="13.89" duration="149.30" routeLength="1986.69" waitingTime="0.00" waitingCount="0" stopTime="0.00" timeLoss="5.65" rerouteNo="1" devices="tripinfo_car_s2e_209 routing_car_s2e_209" vType="Car" speedFactor="1.00" vaporized=""/>
    <tripinfo id="car_s2w_221" depart="221.00" departLane="s2sep_1" departPos="3.60" departPosLat="0.00" departSpeed="13.90" departDelay="0.00" arrival="363.15" arrivalLane="c2w_1" arrivalPos="990.00" arrivalPosLat="0.00" arrivalSpeed="14.49" duration="142.15" routeLength="1996.47" waitingTime="0.00" waitingCount="0" stopTime="0.00" timeLoss="3.74" rerouteNo="1" devices="tripinfo_car_s2w_221 routing_car_s2w_221" vType="Car" speedFactor="1.04" vaporized=""/>
    <tripinfo id="car_n2e_234" depart="234.00" departLane="n2sep_1" departPos="3.60" departPosLat="0.00" departSpeed="13.90" departDelay="0.00" arrival="370.00" arrivalLane="c2e_1" arrivalPos="990.00" arrivalPosLat="0.00" arrivalSpeed="15.18" duration="136.00" routeLength="1996.47" waitingTime="0.00" waitingCount="0" stopTime="0.00" timeLoss="3.83" rerouteNo="1" devices="tripinfo_car_n2e_234 routing_car_n2e_234" vType="Car" speedFactor="1.09" vaporized=""/>
    <tripinfo id="car_s2w_237" depart="237.00" departLane="s2sep_1" departPos="3.60" departPosLat="0.00" departSpeed="13.90" departDelay="0.00" arrival="381.60" arrivalLane="c2w_1" arrivalPos="990.00" arrivalPosLat="0.00" arrivalSpeed="14.50" duration="144.60" routeLength="1996.47" waitingTime="0.00" waitingCount="0" stopTime="0.00" timeLoss="6.27" rerouteNo="1" devices="tripinfo_car_s2w_237 routing_car_s2w_237" vType="Car" speedFactor="1.04" vaporized=""/>
    <tripinfo id="car_e2n_194" depart="194.00" departLane="e2sep_1" departPos="3.60" departPosLat="0.00" departSpeed="13.90" departDelay="0.00" arrival="388.30" arrivalLane="c2n_1" arrivalPos="990.00" arrivalPosLat="0.00" arrivalSpeed="14.38" duration="194.30" routeLength="1986.69" waitingTime="47.15" waitingCount="1" stopTime="0.00" timeLoss="55.42" rerouteNo="1" devices="tripinfo_car_e2n_194 routing_car_e2n_194" vType="Car" speedFactor="1.03" vaporized=""/>
    <tripinfo id="car_w2e_228" depart="228.00" departLane="w2sep_1" departPos="3.60" departPosLat="0.00" departSpeed="13.90" departDelay="0.00" arrival="389.25" arrivalLane="c2e_1" arrivalPos="990.00" arrivalPosLat="0.00" arrivalSpeed="14.21" duration="161.25" routeLength="1997.01" waitingTime="13.40" waitingCount="1" stopTime="0.00" timeLoss="20.65" rerouteNo="1" devices="tripinfo_car_w2e_228 routing_car_w2e_228" vType="Car" speedFactor="1.02" vaporized=""/>
    <tripinfo id="car_w2n_208" depart="208.00" departLane="w2sep_1" departPos="3.60" departPosLat="0.00" departSpeed="13.90" departDelay="0.00" arrival="390.80" arrivalLane="c2n_1" arrivalPos="990.00" arrivalPosLat="0.00" arrivalSpeed="15.71" duration="182.80" routeLength="1996.47" waitingTime="43.15" waitingCount="2" stopTime="0.00" timeLoss="57.04" rerouteNo="1" devices="tripinfo_car_w2n_208 routing_car_w2n_208" vType="Car" speedFactor="1.15" vaporized=""/>
    <tripinfo id="car_e2w_218" depart="218.00" departLane="e2sep_1" departPos="3.60" departPosLat="0.00" departSpeed="13.90" departDelay="0.00" arrival="392.85" arrivalLane="c2w_1" arrivalPos="990.00" arrivalPosLat="0.00" arrivalSpeed="13.92" duration="174.85" routeLength="1997.01" waitingTime="22.90" waitingCount="1" stopTime="0.00" timeLoss="31.42" rerouteNo="1" devices="tripinfo_car_e2w_218 routing_car_e2w_218" vType="Car" speedFactor="1.00" vaporized=""/>
    <tripinfo id="car_w2e_230" depart="230.00" departLane="w2sep_1" departPos="3.60" departPosLat="0.00" departSpeed="13.90" departDelay="0.00" arrival="393.80" arrivalLane="c2e_1" arrivalPos="990.00" arrivalPosLat="0.00" arrivalSpeed="14.12" duration="163.80" routeLength="1997.01" waitingTime="10.15" waitingCount="1" stopTime="0.00" timeLoss="22.46" rerouteNo="1" devices="tripinfo_car_w2e_230 routing_car_w2e_230" vType="Car" speedFactor="1.02" vaporized=""/>
    <tripinfo id="car_e2s_200" depart="200.00" departLane="e2sep_1" departPos="3.60" departPosLat="0.00" departSpeed="13.90" departDelay="0.00" arrival="394.35" arrivalLane="c2s_1" arrivalPos="990.00" arrivalPosLat="0.00" arrivalSpeed="14.13" duration="194.35" routeLength="1996.47" waitingTime="41.20" waitingCount="2" stopTime="0.00" timeLoss="52.40" rerouteNo="1" devices="tripinfo_car_e2s_200 routing_car_e2s_200" vType="Car" speedFactor="1.02" vaporized=""/>
    <tripinfo id="car_w2n_251" depart="251.00" departLane="w2sep_1" departPos="3.60" departPosLat="0.00" departSpeed="13.90" departDelay="0.00" arrival="395.50" arrivalLane="c2n_1" arrivalPos="990.00" arrivalPosLat="0.00" arrivalSpeed="15.11" duration="144.50" routeLength="1996.47" waitingTime="1.30" waitingCount="1" stopTime="0.00" timeLoss="11.84" rerouteNo="1" devices="tripinfo_car_w2n_251 routing_car_w2n_251" vType="Car" speedFactor="1.09" vaporized=""/>
    <tripinfo id="car_e2w_246" depart="246.00" departLane="e2sep_1" departPos="3.60" departPosLat="0.00" departSpeed="13.90" departDelay="0.00" arrival="396.85" arrivalLane="c2w_1" arrivalPos="990.00" arrivalPosLat="0.00" arrivalSpeed="14.02" duration="150.85" routeLength="1997.01" waitingTime="0.00" waitingCount="0" stopTime="0.00" timeLoss="8.55" rerouteNo="1" devices="tripinfo_car_e2w_246 routing_car_e2w_246" vType="Car" speedFactor="1.01" vaporized=""/>
    <tripinfo id="car_w2s_260" depart="260.00" departLane="w2sep_1" departPos="3.60" departPosLat="0.00" departSpeed="13.90" departDelay="0.00" arrival="397.25" arrivalLane="c2s_1" arrivalPos="990.00" arrivalPosLat="0.00" arrivalSpeed="15.14" duration="137.25" routeLength="1986.69" waitingTime="0.00" waitingCount="0" stopTime="0.00" timeLoss="6.28" rerouteNo="1" devices="tripinfo_car_w2s_260 routing_car_w2s_260" vType="Car" speedFactor="1.10" vaporized=""/>
    <tripinfo id="car_e2s_207" depart="207.00" departLane="e2sep_1" departPos="3.60" departPosLat="0.00" departSpeed="13.90" departDelay="0.00" arrival="403.50" arrivalLane="c2s_1" arrivalPos="990.00" arrivalPosLat="0.00" arrivalSpeed="14.32" duration="196.50" routeLength="1996.47" waitingTime="39.60" waitingCount="2" stopTime="0.00" timeLoss="56.42" rerouteNo="1" devices="tripinfo_car_e2s_207 routing_car_e2s_207" vType="Car" speedFactor="1.03" vaporized=""/>
    <tripinfo id="car_w2n_264" depart="264.00" departLane="w2sep_1" departPos="3.60" departPosLat="0.00" departSpeed="13.90" departDelay="0.00" arrival="404.10" arrivalLane="c2n_1" arrivalPos="990.00" arrivalPosLat="0.00" arrivalSpeed="14.80" duration="140.10" routeLength="1996.47" waitingTime="0.00" waitingCount="0" stopTime="0.00" timeLoss="4.56" rerouteNo="1" devices="tripinfo_car_w2n_264 routing_car_w2n_264" vType="Car" speedFactor="1.07" vaporized=""/>
    <tripinfo id="car_e2s_227" depart="227.00" departLane="e2sep_1" departPos="3.60" departPosLat="0.00" departSpeed="13.90" departDelay="0.00" arrival="408.40" arrivalLane="c2s_1" arrivalPos="990.00" arrivalPosLat="0.00" arrivalSpeed="13.99" duration="181.40" routeLength="1996.47" waitingTime="18.50" waitingCount="2" stopTime="0.00" timeLoss="38.06" rerouteNo="1" devices="tripinfo_car_e2s_227 routing_car_e2s_227" vType="Car" speedFactor="1.01" vaporized=""/>
    <tripinfo id="car_e2s_235" depart="235.00" departLane="e2sep_1" departPos="3.60" departPosLat="0.00" departSpeed="13.90" departDelay="0.00" arrival="411.30" arrivalLane="c2s_1" arrivalPos="990.00" arrivalPosLat="0.00" arrivalSpeed="14.34" duration="176.30" routeLength="1996.47" waitingTime="11.35" waitingCount="2" stopTime="0.00" timeLoss="37.24" rerouteNo="1" devices="tripinfo_car_e2s_235 routing_car_e2s_235" vType="Car" speedFactor="1.04" vaporized=""/>
    <tripinfo id="car_w2s_272" depart="272.00" departLane="w2sep_1" departPos="3.60" departPosLat="0.00" departSpeed="13.90" departDelay="0.00" arrival="413.80" arrivalLane="c2s_1" arrivalPos="990.00" arrivalPosLat="0.00" arrivalSpeed="14.72" duration="141.80" routeLength="1986.69" waitingTime="0.00" waitingCount="0" stopTime="0.00" timeLoss="7.84" rerouteNo="1" devices="tripinfo_car_w2s_272 routing_car_w2s_272" vType="Car" speedFactor="1.07" vaporized=""/>
    <tripinfo id="car_e2w_270" depart="270.00" departLane="e2sep_1" departPos="3.60" departPosLat="0.00" departSpeed="13.90" departDelay="0.00" arrival="414.35" arrivalLane="c2w_1" arrivalPos="990.00" arrivalPosLat="0.00" arrivalSpeed="13.90" duration="144.35" routeLength="1997.01" waitingTime="0.00" waitingCount="0" stopTime="0.00" timeLoss="0.66" rerouteNo="1" devices="tripinfo_car_e2w_270 routing_car_e2w_270" vType="Car" speedFactor="1.00" vaporized=""/>
    <tripinfo id="amb_w2e_300" depart="301.60" departLane="w2sep_1" departPos="6.60" departPosLat="0.00" departSpeed="13.90" departDelay="1.60" arrival="415.00" arrivalLane="c2e_1" arrivalPos="990.00" arrivalPosLat="-0.95" arrivalSpeed="20.85" duration="113.40" routeLength="1994.01" waitingTime="0.00" waitingCount="0" stopTime="0.00" timeLoss="17.75" rerouteNo="1" devices="tripinfo_amb_w2e_300 routing_amb_w2e_300 bluelight_amb_w2e_300 fcd_amb_w2e_300" vType="Ambulance" speedFactor="1.50" vaporized="">
        <example_device customValue1="0.00" customValue2="-1.00"/>
    </tripinfo>
    <tripinfo id="car_e2s_264" depart="264.00" departLane="e2sep_1" departPos="3.60" departPosLat="0.00" departSpeed="13.90" departDelay="0.00" arrival="419.10" arrivalLane="c2s_1" arrivalPos="990.00" arrivalPosLat="0.00" arrivalSpeed="13.90" duration="155.10" routeLength="1996.47" waitingTime="2.45" waitingCount="1" stopTime="0.00" timeLoss="10.74" rerouteNo="1" devices="tripinfo_car_e2s_264 routing_car_e2s_264" vType="Car" speedFactor="1.00" vaporized=""/>
    <tripinfo id="car_w2s_285" depart="286.45" departLane="w2sep_1" departPos="3.60" departPosLat="0.00" departSpeed="13.90" departDelay="1.45" arrival="424.10" arrivalLane="c2s_1" arrivalPos="990.00" arrivalPosLat="0.00" arrivalSpeed="16.23" duration="137.65" routeLength="1986.69" waitingTime="0.00" waitingCount="0" stopTime="0.00" timeLoss="14.72" rerouteNo="1" devices="tripinfo_car_w2s_285 routing_car_w2s_285" vType="Car" speedFactor="1.17" vaporized=""/>
    <tripinfo id="car_w2e_285" depart="285.00" departLane="w2sep_1" departPos="3.60" departPosLat="0.00" departSpeed="13.90" departDelay="0.00" arrival="428.80" arrivalLane="c2e_1" arrivalPos="990.00" arrivalPosLat="1.10" arrivalSpeed="13.90" duration="143.80" routeLength="1997.01" waitingTime="0.00" waitingCount="0" stopTime="0.00" timeLoss="0.10" rerouteNo="1" devices="tripinfo_car_w2e_285 routing_car_w2e_285" vType="Car@car_w2e_285" speedFactor="1.00" vaporized=""/>
    <tripinfo id="car_e2s_289" depart="289.00" departLane="e2sep_1" departPos="3.60" departPosLat="0.00" departSpeed="13.90" departDelay="0.00" arrival="441.35" arrivalLane="c2s_1" arrivalPos="990.00" arrivalPosLat="0.00" arrivalSpeed="14.03" duration="152.35" routeLength="1996.47" waitingTime="1.75" waitingCount="1" stopTime="0.00" timeLoss="9.31" rerouteNo="1" devices="tripinfo_car_e2s_289 routing_car_e2s_289" vType="Car" speedFactor="1.01" vaporized=""/>
    <tripinfo id="car_w2n_295" depart="295.00" departLane="w2sep_1" departPos="3.60" departPosLat="0.00" departSpeed="13.90" departDelay="0.00" arrival="442.20" arrivalLane="c2n_1" arrivalPos="990.00" arrivalPosLat="0.00" arrivalSpeed="13.96" duration="147.20" routeLength="1996.47" waitingTime="0.00" waitingCount="0" stopTime="0.00" timeLoss="3.51" rerouteNo="1" devices="tripinfo_car_w2n_295 routing_car_w2n_295" vType="Car" speedFactor="1.00" vaporized=""/>
    <tripinfo id="car_w2n_300" depart="300.00" departLane="w2sep_1" departPos="3.60" departPosLat="0.00" departSpeed="13.90" departDelay="0.00" arrival="444.85" arrivalLane="c2n_1" arrivalPos="990.00" arrivalPosLat="0.00" arrivalSpeed="14.73" duration="144.85" routeLength="1996.47" waitingTime="0.00" waitingCount="0" stopTime="0.00" timeLoss="10.07" rerouteNo="1" devices="tripinfo_car_w2n_300 routing_car_w2n_300" vType="Car" speedFactor="1.07" vaporized=""/>
    <tripinfo id="car_w2n_302" depart="305.05" departLane="w2sep_1" departPos="3.60" departPosLat="0.00" departSpeed="13.90" departDelay="3.05" arrival="447.20" arrivalLane="c2n_1" arrivalPos="990.00" arrivalPosLat="0.00" arrivalSpeed="15.07" duration="142.15" routeLength="1996.47" waitingTime="0.00" waitingCount="0" stopTime="0.00" timeLoss="11.30" rerouteNo="1" devices="tripinfo_car_w2n_302 routing_car_w2n_302" vType="Car" speedFactor="1.10" vaporized=""/>
    <tripinfo id="car_e2s_307" depart="307.00" departLane="e2sep_1" departPos="3.60" departPosLat="0.00" departSpeed="13.90" departDelay="0.00" arrival="450.75" arrivalLane="c2s_1" arrivalPos="990.00" arrivalPosLat="0.00" arrivalSpeed="14.34" duration="143.75" routeLength="1996.47" waitingTime="0.00" waitingCount="0" stopTime="0.00" timeLoss="3.82" rerouteNo="1" devices="tripinfo_car_e2s_307 routing_car_e2s_307" vType="Car" speedFactor="1.03" vaporized=""/>
    <tripinfo id="car_n2w_239" depart="239.00" departLane="n2sep_1" departPos="3.60" departPosLat="0.00" departSpeed="13.90" departDelay="0.00" arrival="452.00" arrivalLane="c2w_1" arrivalPos="990.00" arrivalPosLat="0.00" arrivalSpeed="15.16" duration="213.00" routeLength="1986.69" waitingTime="73.45" waitingCount="1" stopTime="0.00" timeLoss="81.29" rerouteNo="1" devices="tripinfo_car_n2w_239 routing_car_n2w_239" vType="Car" speedFactor="1.09" vaporized=""/>
    <tripinfo id="car_n2s_251" depart="251.00" departLane="n2sep_1" departPos="3.60" departPosLat="0.00" departSpeed="13.90" departDelay="0.00" arrival="455.35" arrivalLane="c2s_1" arrivalPos="990.00" arrivalPosLat="0.00" arrivalSpeed="15.57" duration="204.35" routeLength="1997.01" waitingTime="64.55" waitingCount="1" stopTime="0.00" timeLoss="76.26" rerouteNo="1" devices="tripinfo_car_n2s_251 routing_car_n2s_251" vType="Car" speedFactor="1.12" vaporized=""/>
    <tripinfo id="car_n2w_245" depart="245.00" departLane="n2sep_1" departPos="3.60" departPosLat="0.00" departSpeed="13.90" departDelay="0.00" arrival="457.80" arrivalLane="c2w_1" arrivalPos="990.00" arrivalPosLat="0.00" arrivalSpeed="14.69" duration="212.80" routeLength="1986.69" waitingTime="66.45" waitingCount="1" stopTime="0.00" timeLoss="76.86" rerouteNo="1" devices="tripinfo_car_n2w_245 routing_car_n2w_245" vType="Car" speedFactor="1.06" vaporized=""/>
    <tripinfo id="bus_s2e_234" depart="234.00" departLane="s2sep_1" departPos="12.10" departPosLat="0.00" departSpeed="13.90" departDelay="0.00" arrival="461.10" arrivalLane="c2e_1" arrivalPos="990.00" arrivalPosLat="0.00" arrivalSpeed="13.90" duration="227.10" routeLength="1978.19" waitingTime="73.95" waitingCount="1" stopTime="0.00" timeLoss="84.03" rerouteNo="1" devices="tripinfo_bus_s2e_234 routing_bus_s2e_234" vType="Bus" speedFactor="1.00" vaporized=""/>
    <tripinfo id="car_s2n_275" depart="275.00" departLane="s2sep_1" departPos="3.60" departPosLat="0.00" departSpeed="13.90" departDelay="0.00" arrival="462.45" arrivalLane="c2n_1" arrivalPos="990.00" arrivalPosLat="0.00" arrivalSpeed="14.38" duration="187.45" routeLength="1997.01" waitingTime="35.50" waitingCount="1" stopTime="0.00" timeLoss="48.55" rerouteNo="1" devices="tripinfo_car_s2n_275 routing_car_s2n_275" vType="Car" speedFactor="1.03" vaporized=""/>
    <tripinfo id="car_n2s_274" depart="274.00" departLane="n2sep_1" departPos="3.60" departPosLat="0.00" departSpeed="13.90" departDelay="0.00" arrival="464.00" arrivalLane="c2s_1" arrivalPos="990.00" arrivalPosLat="0.00" arrivalSpeed="14.09" duration="190.00" routeLength="1997.01" waitingTime="37.30" waitingCount="1" stopTime="0.00" timeLoss="48.29" rerouteNo="1" devices="tripinfo_car_n2s_274 routing_car_n2s_274" vType="Car" speedFactor="1.01" vaporized=""/>
    <tripinfo id="car_s2n_292" depart="292.00" departLane="s2sep_1" departPos="3.60" departPosLat="0.00" departSpeed="13.90" departDelay="0.00" arrival="465.15" arrivalLane="c2n_1" arrivalPos="990.00" arrivalPosLat="0.00" arrivalSpeed="15.08" duration="173.15" routeLength="1997.01" waitingTime="24.90" waitingCount="1" stopTime="0.00" timeLoss="42.01" rerouteNo="1" devices="tripinfo_car_s2n_292 routing_car_s2n_292" vType="Car" speedFactor="1.10" vaporized=""/>
    <tripinfo id="car_s2e_271" depart="271.00" departLane="s2sep_1" departPos="3.60" departPosLat="0.00" departSpeed="13.90" departDelay="0.00" arrival="465.95" arrivalLane="c2e_1" arrivalPos="990.00" arrivalPosLat="0.00" arrivalSpeed="13.89" duration="194.95" routeLength="1986.69" waitingTime="37.15" waitingCount="1" stopTime="0.00" timeLoss="51.30" rerouteNo="1" devices="tripinfo_car_s2e_271 routing_car_s2e_271" vType="Car" speedFactor="1.00" vaporized=""/>
    <tripinfo id="bus_n2s_274" depart="276.00" departLane="n2sep_1" departPos="12.10" departPosLat="0.00" departSpeed="13.90" departDelay="2.00" arrival="469.20" arrivalLane="c2s_1" arrivalPos="990.00" arrivalPosLat="0.00" arrivalSpeed="13.87" duration="193.20" routeLength="1988.51" waitingTime="35.40" waitingCount="1" stopTime="0.00" timeLoss="50.14" rerouteNo="1" devices="tripinfo_bus_n2s_274 routing_bus_n2s_274" vType="Bus" speedFactor="1.00" vaporized=""/>
    <tripinfo id="car_n2w_287" depart="287.00" departLane="n2sep_1" departPos="3.60" departPosLat="0.00" departSpeed="13.90" departDelay="0.00" arrival="469.80" arrivalLane="c2w_1" arrivalPos="990.00" arrivalPosLat="0.00" arrivalSpeed="14.13" duration="182.80" routeLength="1986.69" waitingTime="27.95" waitingCount="1" stopTime="0.00" timeLoss="41.50" rerouteNo="1" devices="tripinfo_car_n2w_287 routing_car_n2w_287" vType="Car" speedFactor="1.02" vaporized=""/>
    <tripinfo id="car_s2e_301" depart="301.00" departLane="s2sep_1" departPos="3.60" departPosLat="0.00" departSpeed="13.90" departDelay="0.00" arrival="470.40" arrivalLane="c2e_1" arrivalPos="990.00" arrivalPosLat="0.00" arrivalSpeed="13.89" duration="169.40" routeLength="1986.69" waitingTime="11.55" waitingCount="1" stopTime="0.00" timeLoss="25.74" rerouteNo="1" devices="tripinfo_car_s2e_301 routing_car_s2e_301" vType="Car" speedFactor="1.00" vaporized=""/>
    <tripinfo id="car_s2n_309" depart="309.00" departLane="s2sep_1" departPos="3.60" departPosLat="0.00" departSpeed="13.90" departDelay="0.00" arrival="470.40" arrivalLane="c2n_1" arrivalPos="990.00" arrivalPosLat="0.00" arrivalSpeed="14.22" duration="161.40" routeLength="1997.01" waitingTime="6.30" waitingCount="1" stopTime="0.00" timeLoss="20.99" rerouteNo="1" devices="tripinfo_car_s2n_309 routing_car_s2n_309" vType="Car" speedFactor="1.02" vaporized=""/>
    <tripinfo id="car_n2s_293" depart="293.00" departLane="n2sep_1" departPos="3.60" departPosLat="0.00" departSpeed="13.90" departDelay="0.00" arrival="471.55" arrivalLane="c2s_1" arrivalPos="990.00" arrivalPosLat="0.00" arrivalSpeed="15.68" duration="178.55" routeLength="1997.01" waitingTime="22.85" waitingCount="1" stopTime="0.00" timeLoss="56.49" rerouteNo="1" devices="tripinfo_car_n2s_293 routing_car_n2s_293" vType="Car" speedFactor="1.18" vaporized=""/>
    <tripinfo id="car_s2n_316" depart="316.00" departLane="s2sep_1" departPos="3.60" departPosLat="0.00" departSpeed="13.90" departDelay="0.00" arrival="472.60" arrivalLane="c2n_1" arrivalPos="990.00" arrivalPosLat="0.00" arrivalSpeed="15.18" duration="156.60" routeLength="1997.01" waitingTime="5.05" waitingCount="1" stopTime="0.00" timeLoss="28.12" rerouteNo="1" devices="tripinfo_car_s2n_316 routing_car_s2n_316" vType="Car" speedFactor="1.12" vaporized=""/>
    <tripinfo id="car_s2e_320" depart="320.00" departLane="s2sep_1" departPos="3.60" departPosLat="0.00" departSpeed="13.90" departDelay="0.00" arrival="474.25" arrivalLane="c2e_1" arrivalPos="990.00" arrivalPosLat="0.00" arrivalSpeed="14.32" duration="154.25" routeLength="1986.69" waitingTime="0.00" waitingCount="0" stopTime="0.00" timeLoss="15.10" rerouteNo="1" devices="tripinfo_car_s2e_320 routing_car_s2e_320" vType="Car" speedFactor="1.03" vaporized=""/>
    <tripinfo id="car_s2n_343" depart="343.00" departLane="s2sep_1" departPos="3.60" departPosLat="0.00" departSpeed="13.90" departDelay="0.00" arrival="475.00" arrivalLane="c2n_1" arrivalPos="990.00" arrivalPosLat="0.00" arrivalSpeed="15.32" duration="132.00" routeLength="1997.01" waitingTime="0.00" waitingCount="0" stopTime="0.00" timeLoss="3.65" rerouteNo="1" devices="tripinfo_car_s2n_343 routing_car_s2n_343" vType="Car" speedFactor="1.12" vaporized=""/>
    <tripinfo id="car_n2w_297" depart="297.00" departLane="n2sep_1" departPos="3.60" departPosLat="0.00" departSpeed="13.90" departDelay="0.00" arrival="475.65" arrivalLane="c2w_1" arrivalPos="990.00" arrivalPosLat="0.00" arrivalSpeed="13.94" duration="178.65" routeLength="1986.69" waitingTime="19.00" waitingCount="1" stopTime="0.00" timeLoss="35.43" rerouteNo="1" devices="tripinfo_car_n2w_297 routing_car_n2w_297" vType="Car" speedFactor="1.00" vaporized=""/>
    <tripinfo id="car_n2e_289" depart="289.00" departLane="n2sep_1" departPos="3.60" departPosLat="0.00" departSpeed="13.90" departDelay="0.00" arrival="477.95" arrivalLane="c2e_1" arrivalPos="990.00" arrivalPosLat="0.00" arrivalSpeed="15.23" duration="188.95" routeLength="1996.47" waitingTime="39.70" waitingCount="3" stopTime="0.00" timeLoss="57.58" rerouteNo="1" devices="tripinfo_car_n2e_289 routing_car_n2e_289" vType="Car" speedFactor="1.10" vaporized=""/>
</tripinfos>
