%!PS-Adobe-3.0 EPSF-3.0
%%Creator: (MATLAB, The Mathworks, Inc. Version 9.9.0.1524771 \(R2020b\) Update 2. Operating System: Linux)
%%Title: ../pictures/evaluate_models/AVGALL_VEH_X_RMSE.eps
%%CreationDate: 2021-05-13T10:47:12
%%Pages: (atend)
%%BoundingBox:     1     2   428   425
%%LanguageLevel: 3
%%EndComments
%%BeginProlog
%%BeginResource: procset (Apache XML Graphics Std ProcSet) 1.2 0
%%Version: 1.2 0
%%Copyright: (Copyright 2001-2003,2010 The Apache Software Foundation. License terms: http://www.apache.org/licenses/LICENSE-2.0)
/bd{bind def}bind def
/ld{load def}bd
/GR/grestore ld
/GS/gsave ld
/RM/rmoveto ld
/C/curveto ld
/t/show ld
/L/lineto ld
/ML/setmiterlimit ld
/CT/concat ld
/f/fill ld
/N/newpath ld
/S/stroke ld
/CC/setcmykcolor ld
/A/ashow ld
/cp/closepath ld
/RC/setrgbcolor ld
/LJ/setlinejoin ld
/GC/setgray ld
/LW/setlinewidth ld
/M/moveto ld
/re {4 2 roll M
1 index 0 rlineto
0 exch rlineto
neg 0 rlineto
cp } bd
/_ctm matrix def
/_tm matrix def
/BT { _ctm currentmatrix pop matrix _tm copy pop 0 0 moveto } bd
/ET { _ctm setmatrix } bd
/iTm { _ctm setmatrix _tm concat } bd
/Tm { _tm astore pop iTm 0 0 moveto } bd
/ux 0.0 def
/uy 0.0 def
/F {
  /Tp exch def
  /Tf exch def
  Tf findfont Tp scalefont setfont
  /cf Tf def  /cs Tp def
} bd
/ULS {currentpoint /uy exch def /ux exch def} bd
/ULE {
  /Tcx currentpoint pop def
  gsave
  newpath
  cf findfont cs scalefont dup
  /FontMatrix get 0 get /Ts exch def /FontInfo get dup
  /UnderlinePosition get Ts mul /To exch def
  /UnderlineThickness get Ts mul /Tt exch def
  ux uy To add moveto  Tcx uy To add lineto
  Tt setlinewidth stroke
  grestore
} bd
/OLE {
  /Tcx currentpoint pop def
  gsave
  newpath
  cf findfont cs scalefont dup
  /FontMatrix get 0 get /Ts exch def /FontInfo get dup
  /UnderlinePosition get Ts mul /To exch def
  /UnderlineThickness get Ts mul /Tt exch def
  ux uy To add cs add moveto Tcx uy To add cs add lineto
  Tt setlinewidth stroke
  grestore
} bd
/SOE {
  /Tcx currentpoint pop def
  gsave
  newpath
  cf findfont cs scalefont dup
  /FontMatrix get 0 get /Ts exch def /FontInfo get dup
  /UnderlinePosition get Ts mul /To exch def
  /UnderlineThickness get Ts mul /Tt exch def
  ux uy To add cs 10 mul 26 idiv add moveto Tcx uy To add cs 10 mul 26 idiv add lineto
  Tt setlinewidth stroke
  grestore
} bd
/QT {
/Y22 exch store
/X22 exch store
/Y21 exch store
/X21 exch store
currentpoint
/Y21 load 2 mul add 3 div exch
/X21 load 2 mul add 3 div exch
/X21 load 2 mul /X22 load add 3 div
/Y21 load 2 mul /Y22 load add 3 div
/X22 load /Y22 load curveto
} bd
/SSPD {
dup length /d exch dict def
{
/v exch def
/k exch def
currentpagedevice k known {
/cpdv currentpagedevice k get def
v cpdv ne {
/upd false def
/nullv v type /nulltype eq def
/nullcpdv cpdv type /nulltype eq def
nullv nullcpdv or
{
/upd true def
} {
/sametype v type cpdv type eq def
sametype {
v type /arraytype eq {
/vlen v length def
/cpdvlen cpdv length def
vlen cpdvlen eq {
0 1 vlen 1 sub {
/i exch def
/obj v i get def
/cpdobj cpdv i get def
obj cpdobj ne {
/upd true def
exit
} if
} for
} {
/upd true def
} ifelse
} {
v type /dicttype eq {
v {
/dv exch def
/dk exch def
/cpddv cpdv dk get def
dv cpddv ne {
/upd true def
exit
} if
} forall
} {
/upd true def
} ifelse
} ifelse
} if
} ifelse
upd true eq {
d k v put
} if
} if
} if
} forall
d length 0 gt {
d setpagedevice
} if
} bd
/RE { % /NewFontName [NewEncodingArray] /FontName RE -
  findfont dup length dict begin
  {
    1 index /FID ne
    {def} {pop pop} ifelse
  } forall
  /Encoding exch def
  /FontName 1 index def
  currentdict definefont pop
  end
} bind def
%%EndResource
%%BeginResource: procset (Apache XML Graphics EPS ProcSet) 1.0 0
%%Version: 1.0 0
%%Copyright: (Copyright 2002-2003 The Apache Software Foundation. License terms: http://www.apache.org/licenses/LICENSE-2.0)
/BeginEPSF { %def
/b4_Inc_state save def         % Save state for cleanup
/dict_count countdictstack def % Count objects on dict stack
/op_count count 1 sub def      % Count objects on operand stack
userdict begin                 % Push userdict on dict stack
/showpage { } def              % Redefine showpage, { } = null proc
0 setgray 0 setlinecap         % Prepare graphics state
1 setlinewidth 0 setlinejoin
10 setmiterlimit [ ] 0 setdash newpath
/languagelevel where           % If level not equal to 1 then
{pop languagelevel             % set strokeadjust and
1 ne                           % overprint to their defaults.
{false setstrokeadjust false setoverprint
} if
} if
} bd
/EndEPSF { %def
count op_count sub {pop} repeat            % Clean up stacks
countdictstack dict_count sub {end} repeat
b4_Inc_state restore
} bd
%%EndResource
%FOPBeginFontDict
%%IncludeResource: font Courier-Oblique
%%IncludeResource: font Courier-BoldOblique
%%IncludeResource: font Courier-Bold
%%IncludeResource: font ZapfDingbats
%%IncludeResource: font Symbol
%%IncludeResource: font Helvetica
%%IncludeResource: font Helvetica-Oblique
%%IncludeResource: font Helvetica-Bold
%%IncludeResource: font Helvetica-BoldOblique
%%IncludeResource: font Times-Roman
%%IncludeResource: font Times-Italic
%%IncludeResource: font Times-Bold
%%IncludeResource: font Times-BoldItalic
%%IncludeResource: font Courier
%FOPEndFontDict
%%BeginResource: encoding WinAnsiEncoding
/WinAnsiEncoding [
/.notdef /.notdef /.notdef /.notdef /.notdef
/.notdef /.notdef /.notdef /.notdef /.notdef
/.notdef /.notdef /.notdef /.notdef /.notdef
/.notdef /.notdef /.notdef /.notdef /.notdef
/.notdef /.notdef /.notdef /.notdef /.notdef
/.notdef /.notdef /.notdef /.notdef /.notdef
/.notdef /.notdef /space /exclam /quotedbl
/numbersign /dollar /percent /ampersand /quotesingle
/parenleft /parenright /asterisk /plus /comma
/hyphen /period /slash /zero /one
/two /three /four /five /six
/seven /eight /nine /colon /semicolon
/less /equal /greater /question /at
/A /B /C /D /E
/F /G /H /I /J
/K /L /M /N /O
/P /Q /R /S /T
/U /V /W /X /Y
/Z /bracketleft /backslash /bracketright /asciicircum
/underscore /quoteleft /a /b /c
/d /e /f /g /h
/i /j /k /l /m
/n /o /p /q /r
/s /t /u /v /w
/x /y /z /braceleft /bar
/braceright /asciitilde /bullet /Euro /bullet
/quotesinglbase /florin /quotedblbase /ellipsis /dagger
/daggerdbl /circumflex /perthousand /Scaron /guilsinglleft
/OE /bullet /Zcaron /bullet /bullet
/quoteleft /quoteright /quotedblleft /quotedblright /bullet
/endash /emdash /asciitilde /trademark /scaron
/guilsinglright /oe /bullet /zcaron /Ydieresis
/space /exclamdown /cent /sterling /currency
/yen /brokenbar /section /dieresis /copyright
/ordfeminine /guillemotleft /logicalnot /sfthyphen /registered
/macron /degree /plusminus /twosuperior /threesuperior
/acute /mu /paragraph /middot /cedilla
/onesuperior /ordmasculine /guillemotright /onequarter /onehalf
/threequarters /questiondown /Agrave /Aacute /Acircumflex
/Atilde /Adieresis /Aring /AE /Ccedilla
/Egrave /Eacute /Ecircumflex /Edieresis /Igrave
/Iacute /Icircumflex /Idieresis /Eth /Ntilde
/Ograve /Oacute /Ocircumflex /Otilde /Odieresis
/multiply /Oslash /Ugrave /Uacute /Ucircumflex
/Udieresis /Yacute /Thorn /germandbls /agrave
/aacute /acircumflex /atilde /adieresis /aring
/ae /ccedilla /egrave /eacute /ecircumflex
/edieresis /igrave /iacute /icircumflex /idieresis
/eth /ntilde /ograve /oacute /ocircumflex
/otilde /odieresis /divide /oslash /ugrave
/uacute /ucircumflex /udieresis /yacute /thorn
/ydieresis
] def
%%EndResource
%FOPBeginFontReencode
/Courier-Oblique findfont
dup length dict begin
  {1 index /FID ne {def} {pop pop} ifelse} forall
  /Encoding WinAnsiEncoding def
  currentdict
end
/Courier-Oblique exch definefont pop
/Courier-BoldOblique findfont
dup length dict begin
  {1 index /FID ne {def} {pop pop} ifelse} forall
  /Encoding WinAnsiEncoding def
  currentdict
end
/Courier-BoldOblique exch definefont pop
/Courier-Bold findfont
dup length dict begin
  {1 index /FID ne {def} {pop pop} ifelse} forall
  /Encoding WinAnsiEncoding def
  currentdict
end
/Courier-Bold exch definefont pop
/Helvetica findfont
dup length dict begin
  {1 index /FID ne {def} {pop pop} ifelse} forall
  /Encoding WinAnsiEncoding def
  currentdict
end
/Helvetica exch definefont pop
/Helvetica-Oblique findfont
dup length dict begin
  {1 index /FID ne {def} {pop pop} ifelse} forall
  /Encoding WinAnsiEncoding def
  currentdict
end
/Helvetica-Oblique exch definefont pop
/Helvetica-Bold findfont
dup length dict begin
  {1 index /FID ne {def} {pop pop} ifelse} forall
  /Encoding WinAnsiEncoding def
  currentdict
end
/Helvetica-Bold exch definefont pop
/Helvetica-BoldOblique findfont
dup length dict begin
  {1 index /FID ne {def} {pop pop} ifelse} forall
  /Encoding WinAnsiEncoding def
  currentdict
end
/Helvetica-BoldOblique exch definefont pop
/Times-Roman findfont
dup length dict begin
  {1 index /FID ne {def} {pop pop} ifelse} forall
  /Encoding WinAnsiEncoding def
  currentdict
end
/Times-Roman exch definefont pop
/Times-Italic findfont
dup length dict begin
  {1 index /FID ne {def} {pop pop} ifelse} forall
  /Encoding WinAnsiEncoding def
  currentdict
end
/Times-Italic exch definefont pop
/Times-Bold findfont
dup length dict begin
  {1 index /FID ne {def} {pop pop} ifelse} forall
  /Encoding WinAnsiEncoding def
  currentdict
end
/Times-Bold exch definefont pop
/Times-BoldItalic findfont
dup length dict begin
  {1 index /FID ne {def} {pop pop} ifelse} forall
  /Encoding WinAnsiEncoding def
  currentdict
end
/Times-BoldItalic exch definefont pop
/Courier findfont
dup length dict begin
  {1 index /FID ne {def} {pop pop} ifelse} forall
  /Encoding WinAnsiEncoding def
  currentdict
end
/Courier exch definefont pop
%FOPEndFontReencode
%%EndProlog
%%Page: 1 1
%%PageBoundingBox: 0 0 428 428
%%BeginPageSetup
[1 0 0 -1 0 428] CT
%%EndPageSetup
GS
[0.71287 0 0 0.71287 0 0.27722] CT
1 GC
N
0 0 600 600 re
f
GR
GS
[0.71287 0 0 0.71287 0 0.27722] CT
1 GC
N
0 0 600 600 re
f
GR
GS
[0.71287 0 0 0.71287 0 0.27722] CT
1 GC
N
71 562 M
600 562 L
600 14 L
71 14 L
cp
f
GR
GS
[0.71287 0 0 0.71287 0 0.27722] CT
0.873 GC
1 LJ
0.701 LW
N
159.167 562 M
159.167 14 L
S
GR
GS
[0.71287 0 0 0.71287 0 0.27722] CT
0.873 GC
1 LJ
0.701 LW
N
335.5 562 M
335.5 14 L
S
GR
GS
[0.71287 0 0 0.71287 0 0.27722] CT
0.873 GC
1 LJ
0.701 LW
N
511.833 562 M
511.833 14 L
S
GR
GS
[0.71287 0 0 0.71287 0 0.27722] CT
0.873 GC
1 LJ
0.701 LW
N
600 547.921 M
71 547.921 L
S
GR
GS
[0.71287 0 0 0.71287 0 0.27722] CT
0.873 GC
1 LJ
0.701 LW
N
600 459.115 M
71 459.115 L
S
GR
GS
[0.71287 0 0 0.71287 0 0.27722] CT
0.873 GC
1 LJ
0.701 LW
N
600 370.308 M
71 370.308 L
S
GR
GS
[0.71287 0 0 0.71287 0 0.27722] CT
0.873 GC
1 LJ
0.701 LW
N
600 281.502 M
71 281.502 L
S
GR
GS
[0.71287 0 0 0.71287 0 0.27722] CT
0.873 GC
1 LJ
0.701 LW
N
600 192.696 M
71 192.696 L
S
GR
GS
[0.71287 0 0 0.71287 0 0.27722] CT
0.873 GC
1 LJ
0.701 LW
N
600 103.889 M
71 103.889 L
S
GR
GS
[0.71287 0 0 0.71287 0 0.27722] CT
0.873 GC
1 LJ
0.701 LW
N
600 15.083 M
71 15.083 L
S
GR
GS
[0.71287 0 0 0.71287 0 0.27722] CT
0.149 GC
2 setlinecap
1 LJ
0.701 LW
N
71 562 M
600 562 L
S
GR
GS
[0.71287 0 0 0.71287 0 0.27722] CT
0.149 GC
2 setlinecap
1 LJ
0.701 LW
N
71 14 M
600 14 L
S
GR
GS
[0.71287 0 0 0.71287 0 0.27722] CT
0.149 GC
2 setlinecap
1 LJ
0.701 LW
N
159.167 562 M
159.167 556.52 L
S
GR
GS
[0.71287 0 0 0.71287 0 0.27722] CT
0.149 GC
2 setlinecap
1 LJ
0.701 LW
N
335.5 562 M
335.5 556.52 L
S
GR
GS
[0.71287 0 0 0.71287 0 0.27722] CT
0.149 GC
2 setlinecap
1 LJ
0.701 LW
N
511.833 562 M
511.833 556.52 L
S
GR
GS
[0.71287 0 0 0.71287 0 0.27722] CT
0.149 GC
2 setlinecap
1 LJ
0.701 LW
N
159.167 14 M
159.167 19.48 L
S
GR
GS
[0.71287 0 0 0.71287 0 0.27722] CT
0.149 GC
2 setlinecap
1 LJ
0.701 LW
N
335.5 14 M
335.5 19.48 L
S
GR
GS
[0.71287 0 0 0.71287 0 0.27722] CT
0.149 GC
2 setlinecap
1 LJ
0.701 LW
N
511.833 14 M
511.833 19.48 L
S
GR
GS
[0.71287 0 0 0.71287 113.46535 406.51087] CT
0.149 GC
N
-25.135 21.21 M
-25.135 20.335 L
-22.432 20.335 -22.432 19.538 QT
-22.432 5.804 L
-22.432 5.007 -25.135 5.007 QT
-25.135 4.132 L
-17.401 4.132 L
-17.401 5.007 L
-20.104 5.007 -20.104 5.804 QT
-20.104 19.538 L
-20.104 20.335 -17.401 20.335 QT
-17.401 21.21 L
-25.135 21.21 L
cp
f
GR
GS
[0.71287 0 0 0.71287 113.46535 406.51087] CT
0.149 GC
N
-15.83 21.21 M
-15.83 20.335 L
-13.252 20.335 -13.252 19.538 QT
-13.252 5.804 L
-13.252 5.007 -15.83 5.007 QT
-15.83 4.132 L
-6.611 4.132 L
-4.908 4.132 -3.486 4.874 QT
-2.064 5.616 -1.064 6.843 QT
-0.064 8.069 0.475 9.632 QT
1.014 11.194 1.014 12.835 QT
1.014 14.429 0.467 15.921 QT
-0.08 17.413 -1.111 18.616 QT
-2.142 19.819 -3.556 20.515 QT
-4.971 21.21 -6.611 21.21 QT
-15.83 21.21 L
cp
-11.002 19.538 M
-11.002 20.069 -10.697 20.202 QT
-10.392 20.335 -9.736 20.335 QT
-7.252 20.335 L
-5.971 20.335 -4.822 19.78 QT
-3.674 19.226 -2.908 18.226 QT
-2.127 17.179 -1.853 15.882 QT
-1.58 14.585 -1.58 12.835 QT
-1.58 11.022 -1.853 9.655 QT
-2.127 8.288 -2.908 7.21 QT
-3.658 6.147 -4.806 5.577 QT
-5.955 5.007 -7.252 5.007 QT
-9.736 5.007 L
-10.189 5.007 -10.439 5.046 QT
-10.689 5.085 -10.846 5.265 QT
-11.002 5.444 -11.002 5.804 QT
-11.002 19.538 L
cp
f
GR
GS
[0.71287 0 0 0.71287 113.46535 406.51087] CT
0.149 GC
N
3.505 21.21 M
3.505 20.335 L
6.083 20.335 6.083 18.851 QT
6.083 5.804 L
6.083 5.007 3.505 5.007 QT
3.505 4.132 L
8.24 4.132 L
8.536 4.132 8.63 4.413 QT
14.083 18.554 L
19.521 4.413 L
19.63 4.132 19.927 4.132 QT
24.646 4.132 L
24.646 5.007 L
22.083 5.007 22.083 5.804 QT
22.083 19.538 L
22.083 20.335 24.646 20.335 QT
24.646 21.21 L
17.38 21.21 L
17.38 20.335 L
19.958 20.335 19.958 19.538 QT
19.958 4.991 L
13.802 20.929 L
13.693 21.21 13.38 21.21 QT
13.068 21.21 12.958 20.929 QT
6.88 5.179 L
6.88 18.851 L
6.88 20.335 9.458 20.335 QT
9.458 21.21 L
3.505 21.21 L
cp
f
GR
GS
[0.71287 0 0 0.71287 239.16832 406.51087] CT
0.149 GC
N
-30.045 21.21 M
-30.045 20.335 L
-27.342 20.335 -27.342 19.538 QT
-27.342 5.804 L
-27.342 5.007 -30.045 5.007 QT
-30.045 4.132 L
-22.311 4.132 L
-22.311 5.007 L
-25.014 5.007 -25.014 5.804 QT
-25.014 19.538 L
-25.014 20.335 -22.311 20.335 QT
-22.311 21.21 L
-30.045 21.21 L
cp
f
GR
GS
[0.71287 0 0 0.71287 239.16832 406.51087] CT
0.149 GC
N
-20.226 21.21 M
-20.226 20.335 L
-17.523 20.335 -17.523 19.538 QT
-17.523 5.804 L
-17.523 5.007 -20.226 5.007 QT
-20.226 4.132 L
-12.491 4.132 L
-12.491 5.007 L
-15.194 5.007 -15.194 5.804 QT
-15.194 19.538 L
-15.194 20.335 -12.491 20.335 QT
-12.491 21.21 L
-20.226 21.21 L
cp
f
GR
GS
[0.71287 0 0 0.71287 239.16832 406.51087] CT
0.149 GC
N
-10.92 21.21 M
-10.92 20.335 L
-8.342 20.335 -8.342 19.538 QT
-8.342 5.804 L
-8.342 5.007 -10.92 5.007 QT
-10.92 4.132 L
-1.701 4.132 L
0.002 4.132 1.424 4.874 QT
2.845 5.616 3.845 6.843 QT
4.845 8.069 5.385 9.632 QT
5.924 11.194 5.924 12.835 QT
5.924 14.429 5.377 15.921 QT
4.83 17.413 3.799 18.616 QT
2.767 19.819 1.353 20.515 QT
-0.061 21.21 -1.701 21.21 QT
-10.92 21.21 L
cp
-6.092 19.538 M
-6.092 20.069 -5.787 20.202 QT
-5.483 20.335 -4.826 20.335 QT
-2.342 20.335 L
-1.061 20.335 0.088 19.78 QT
1.236 19.226 2.002 18.226 QT
2.783 17.179 3.056 15.882 QT
3.33 14.585 3.33 12.835 QT
3.33 11.022 3.056 9.655 QT
2.783 8.288 2.002 7.21 QT
1.252 6.147 0.103 5.577 QT
-1.045 5.007 -2.342 5.007 QT
-4.826 5.007 L
-5.28 5.007 -5.53 5.046 QT
-5.78 5.085 -5.936 5.265 QT
-6.092 5.444 -6.092 5.804 QT
-6.092 19.538 L
cp
f
GR
GS
[0.71287 0 0 0.71287 239.16832 406.51087] CT
0.149 GC
N
8.415 21.21 M
8.415 20.335 L
10.993 20.335 10.993 18.851 QT
10.993 5.804 L
10.993 5.007 8.415 5.007 QT
8.415 4.132 L
13.149 4.132 L
13.446 4.132 13.54 4.413 QT
18.993 18.554 L
24.431 4.413 L
24.54 4.132 24.837 4.132 QT
29.556 4.132 L
29.556 5.007 L
26.993 5.007 26.993 5.804 QT
26.993 19.538 L
26.993 20.335 29.556 20.335 QT
29.556 21.21 L
22.29 21.21 L
22.29 20.335 L
24.868 20.335 24.868 19.538 QT
24.868 4.991 L
18.712 20.929 L
18.602 21.21 18.29 21.21 QT
17.977 21.21 17.868 20.929 QT
11.79 5.179 L
11.79 18.851 L
11.79 20.335 14.368 20.335 QT
14.368 21.21 L
8.415 21.21 L
cp
f
GR
GS
[0.71287 0 0 0.71287 364.8713 406.51087] CT
0.149 GC
N
-38.162 21.21 M
-38.162 20.335 L
-35.583 20.335 -35.583 19.538 QT
-35.583 5.804 L
-35.583 5.007 -38.162 5.007 QT
-38.162 4.132 L
-30.052 4.132 L
-30.052 5.007 L
-33.255 5.007 -33.255 5.804 QT
-33.255 19.538 L
-33.255 20.069 -32.951 20.202 QT
-32.646 20.335 -31.974 20.335 QT
-30.052 20.335 L
-28.177 20.335 -27.169 19.647 QT
-26.162 18.96 -25.74 17.78 QT
-25.318 16.601 -25.099 14.647 QT
-24.38 14.647 L
-25.068 21.21 L
-38.162 21.21 L
cp
f
GR
GS
[0.71287 0 0 0.71287 364.8713 406.51087] CT
0.149 GC
N
-13.412 21.757 M
-15.802 21.757 -17.701 20.491 QT
-19.599 19.226 -20.669 17.132 QT
-21.74 15.038 -21.74 12.741 QT
-21.74 11.022 -21.122 9.351 QT
-20.505 7.679 -19.404 6.39 QT
-18.302 5.101 -16.747 4.343 QT
-15.193 3.585 -13.412 3.585 QT
-11.646 3.585 -10.091 4.351 QT
-8.537 5.116 -7.427 6.421 QT
-6.318 7.726 -5.716 9.351 QT
-5.115 10.976 -5.115 12.741 QT
-5.115 14.46 -5.716 16.093 QT
-6.318 17.726 -7.474 19.022 QT
-8.63 20.319 -10.177 21.038 QT
-9.693 22.147 -9.193 22.765 QT
-8.693 23.382 -7.802 23.382 QT
-6.865 23.382 -6.193 22.733 QT
-5.521 22.085 -5.521 21.163 QT
-5.521 21.069 -5.427 20.999 QT
-5.333 20.929 -5.255 20.929 QT
-4.974 20.929 -4.974 21.257 QT
-4.974 23.054 -5.677 24.554 QT
-6.38 26.054 -7.974 26.054 QT
-8.849 26.054 -9.427 25.624 QT
-10.005 25.194 -10.302 24.53 QT
-10.599 23.866 -10.771 22.983 QT
-10.943 22.101 -11.068 21.382 QT
-12.177 21.757 -13.412 21.757 QT
cp
-13.412 21.038 M
-12.287 21.038 -11.24 20.46 QT
-11.474 19.397 -11.958 18.757 QT
-12.443 18.116 -13.412 18.116 QT
-14.021 18.116 -14.435 18.561 QT
-14.849 19.007 -14.849 19.585 QT
-14.849 20.226 -14.451 20.632 QT
-14.052 21.038 -13.412 21.038 QT
cp
-15.49 19.585 M
-15.49 19.038 -15.224 18.546 QT
-14.958 18.054 -14.474 17.757 QT
-13.99 17.46 -13.412 17.46 QT
-12.333 17.46 -11.701 18.163 QT
-11.068 18.866 -10.568 20.069 QT
-9.74 19.444 -9.177 18.593 QT
-8.615 17.741 -8.302 16.811 QT
-7.99 15.882 -7.849 14.835 QT
-7.708 13.788 -7.708 12.741 QT
-7.708 11.007 -8.06 9.483 QT
-8.412 7.96 -9.24 6.726 QT
-9.958 5.647 -11.068 4.983 QT
-12.177 4.319 -13.412 4.319 QT
-14.677 4.319 -15.779 4.968 QT
-16.88 5.616 -17.615 6.726 QT
-18.474 7.976 -18.81 9.499 QT
-19.146 11.022 -19.146 12.741 QT
-19.146 15.397 -18.24 17.577 QT
-17.333 19.757 -15.224 20.663 QT
-15.49 20.147 -15.49 19.585 QT
cp
f
GR
GS
[0.71287 0 0 0.71287 364.8713 406.51087] CT
0.149 GC
N
-2.679 21.21 M
-2.679 20.335 L
-0.101 20.335 -0.101 19.538 QT
-0.101 5.804 L
-0.101 5.007 -2.679 5.007 QT
-2.679 4.132 L
6.54 4.132 L
8.243 4.132 9.665 4.874 QT
11.087 5.616 12.087 6.843 QT
13.087 8.069 13.626 9.632 QT
14.165 11.194 14.165 12.835 QT
14.165 14.429 13.618 15.921 QT
13.071 17.413 12.04 18.616 QT
11.009 19.819 9.595 20.515 QT
8.181 21.21 6.54 21.21 QT
-2.679 21.21 L
cp
2.149 19.538 M
2.149 20.069 2.454 20.202 QT
2.759 20.335 3.415 20.335 QT
5.899 20.335 L
7.181 20.335 8.329 19.78 QT
9.477 19.226 10.243 18.226 QT
11.024 17.179 11.298 15.882 QT
11.571 14.585 11.571 12.835 QT
11.571 11.022 11.298 9.655 QT
11.024 8.288 10.243 7.21 QT
9.493 6.147 8.345 5.577 QT
7.196 5.007 5.899 5.007 QT
3.415 5.007 L
2.962 5.007 2.712 5.046 QT
2.462 5.085 2.306 5.265 QT
2.149 5.444 2.149 5.804 QT
2.149 19.538 L
cp
f
GR
GS
[0.71287 0 0 0.71287 364.8713 406.51087] CT
0.149 GC
N
16.656 21.21 M
16.656 20.335 L
19.234 20.335 19.234 18.851 QT
19.234 5.804 L
19.234 5.007 16.656 5.007 QT
16.656 4.132 L
21.391 4.132 L
21.688 4.132 21.781 4.413 QT
27.234 18.554 L
32.672 4.413 L
32.781 4.132 33.078 4.132 QT
37.797 4.132 L
37.797 5.007 L
35.234 5.007 35.234 5.804 QT
35.234 19.538 L
35.234 20.335 37.797 20.335 QT
37.797 21.21 L
30.531 21.21 L
30.531 20.335 L
33.109 20.335 33.109 19.538 QT
33.109 4.991 L
26.953 20.929 L
26.844 21.21 26.531 21.21 QT
26.219 21.21 26.109 20.929 QT
20.031 5.179 L
20.031 18.851 L
20.031 20.335 22.609 20.335 QT
22.609 21.21 L
16.656 21.21 L
cp
f
GR
GS
[0.71287 0 0 0.71287 0 0.27722] CT
0.149 GC
2 setlinecap
1 LJ
0.701 LW
N
71 562 M
71 14 L
S
GR
GS
[0.71287 0 0 0.71287 0 0.27722] CT
0.149 GC
2 setlinecap
1 LJ
0.701 LW
N
600 562 M
600 14 L
S
GR
GS
[0.71287 0 0 0.71287 0 0.27722] CT
0.149 GC
2 setlinecap
1 LJ
0.701 LW
N
71 547.921 M
76.48 547.921 L
S
GR
GS
[0.71287 0 0 0.71287 0 0.27722] CT
0.149 GC
2 setlinecap
1 LJ
0.701 LW
N
71 459.115 M
76.48 459.115 L
S
GR
GS
[0.71287 0 0 0.71287 0 0.27722] CT
0.149 GC
2 setlinecap
1 LJ
0.701 LW
N
71 370.308 M
76.48 370.308 L
S
GR
GS
[0.71287 0 0 0.71287 0 0.27722] CT
0.149 GC
2 setlinecap
1 LJ
0.701 LW
N
71 281.502 M
76.48 281.502 L
S
GR
GS
[0.71287 0 0 0.71287 0 0.27722] CT
0.149 GC
2 setlinecap
1 LJ
0.701 LW
N
71 192.696 M
76.48 192.696 L
S
GR
GS
[0.71287 0 0 0.71287 0 0.27722] CT
0.149 GC
2 setlinecap
1 LJ
0.701 LW
N
71 103.889 M
76.48 103.889 L
S
GR
GS
[0.71287 0 0 0.71287 0 0.27722] CT
0.149 GC
2 setlinecap
1 LJ
0.701 LW
N
71 15.083 M
76.48 15.083 L
S
GR
GS
[0.71287 0 0 0.71287 0 0.27722] CT
0.149 GC
2 setlinecap
1 LJ
0.701 LW
N
600 547.921 M
594.52 547.921 L
S
GR
GS
[0.71287 0 0 0.71287 0 0.27722] CT
0.149 GC
2 setlinecap
1 LJ
0.701 LW
N
600 459.115 M
594.52 459.115 L
S
GR
GS
[0.71287 0 0 0.71287 0 0.27722] CT
0.149 GC
2 setlinecap
1 LJ
0.701 LW
N
600 370.308 M
594.52 370.308 L
S
GR
GS
[0.71287 0 0 0.71287 0 0.27722] CT
0.149 GC
2 setlinecap
1 LJ
0.701 LW
N
600 281.502 M
594.52 281.502 L
S
GR
GS
[0.71287 0 0 0.71287 0 0.27722] CT
0.149 GC
2 setlinecap
1 LJ
0.701 LW
N
600 192.696 M
594.52 192.696 L
S
GR
GS
[0.71287 0 0 0.71287 0 0.27722] CT
0.149 GC
2 setlinecap
1 LJ
0.701 LW
N
600 103.889 M
594.52 103.889 L
S
GR
GS
[0.71287 0 0 0.71287 0 0.27722] CT
0.149 GC
2 setlinecap
1 LJ
0.701 LW
N
600 15.083 M
594.52 15.083 L
S
GR
GS
[0.71287 0 0 0.71287 45.01386 390.8743] CT
0.149 GC
N
-6.375 6.607 M
-9.438 6.607 -10.539 4.083 QT
-11.641 1.56 -11.641 -1.909 QT
-11.641 -4.081 -11.25 -6.003 QT
-10.859 -7.924 -9.68 -9.26 QT
-8.5 -10.596 -6.375 -10.596 QT
-4.734 -10.596 -3.68 -9.792 QT
-2.625 -8.987 -2.078 -7.706 QT
-1.531 -6.424 -1.328 -4.971 QT
-1.125 -3.518 -1.125 -1.909 QT
-1.125 0.232 -1.523 2.107 QT
-1.922 3.982 -3.078 5.294 QT
-4.234 6.607 -6.375 6.607 QT
cp
-6.375 5.966 M
-4.984 5.966 -4.297 4.536 QT
-3.609 3.107 -3.453 1.372 QT
-3.297 -0.362 -3.297 -2.315 QT
-3.297 -4.19 -3.453 -5.776 QT
-3.609 -7.362 -4.289 -8.651 QT
-4.969 -9.94 -6.375 -9.94 QT
-7.797 -9.94 -8.477 -8.651 QT
-9.156 -7.362 -9.313 -5.776 QT
-9.469 -4.19 -9.469 -2.315 QT
-9.469 -0.924 -9.406 0.31 QT
-9.344 1.544 -9.047 2.857 QT
-8.75 4.169 -8.102 5.068 QT
-7.453 5.966 -6.375 5.966 QT
cp
f
GR
GS
[0.71287 0 0 0.71287 45.01386 327.56682] CT
0.149 GC
N
-10.453 3.216 M
-10.203 3.951 -9.672 4.544 QT
-9.141 5.138 -8.414 5.474 QT
-7.688 5.81 -6.906 5.81 QT
-5.094 5.81 -4.406 4.411 QT
-3.719 3.013 -3.719 1.013 QT
-3.719 0.138 -3.75 -0.456 QT
-3.781 -1.049 -3.922 -1.596 QT
-4.156 -2.471 -4.734 -3.128 QT
-5.313 -3.784 -6.156 -3.784 QT
-7 -3.784 -7.602 -3.534 QT
-8.203 -3.284 -8.586 -2.94 QT
-8.969 -2.596 -9.258 -2.214 QT
-9.547 -1.831 -9.625 -1.815 QT
-9.906 -1.815 L
-9.969 -1.815 -10.055 -1.893 QT
-10.141 -1.971 -10.141 -2.049 QT
-10.141 -10.393 L
-10.141 -10.456 -10.063 -10.526 QT
-9.984 -10.596 -9.906 -10.596 QT
-9.828 -10.596 L
-8.141 -9.784 -6.25 -9.784 QT
-4.391 -9.784 -2.672 -10.596 QT
-2.609 -10.596 L
-2.516 -10.596 -2.445 -10.534 QT
-2.375 -10.471 -2.375 -10.393 QT
-2.375 -10.159 L
-2.375 -10.034 -2.422 -10.034 QT
-3.281 -8.909 -4.563 -8.276 QT
-5.844 -7.643 -7.234 -7.643 QT
-8.234 -7.643 -9.281 -7.924 QT
-9.281 -3.19 L
-8.453 -3.862 -7.797 -4.151 QT
-7.141 -4.44 -6.125 -4.44 QT
-4.75 -4.44 -3.656 -3.643 QT
-2.563 -2.846 -1.977 -1.573 QT
-1.391 -0.299 -1.391 1.029 QT
-1.391 2.529 -2.133 3.81 QT
-2.875 5.091 -4.141 5.849 QT
-5.406 6.607 -6.906 6.607 QT
-8.125 6.607 -9.164 5.974 QT
-10.203 5.341 -10.789 4.263 QT
-11.375 3.185 -11.375 1.982 QT
-11.375 1.419 -11.008 1.068 QT
-10.641 0.716 -10.094 0.716 QT
-9.547 0.716 -9.172 1.076 QT
-8.797 1.435 -8.797 1.982 QT
-8.797 2.513 -9.172 2.888 QT
-9.547 3.263 -10.094 3.263 QT
-10.188 3.263 -10.297 3.247 QT
-10.406 3.232 -10.453 3.216 QT
cp
f
GR
GS
[0.71287 0 0 0.71287 45.01386 264.25935] CT
0.149 GC
N
-22.938 6.06 M
-22.938 5.185 L
-19.813 5.185 -19.813 4.388 QT
-19.813 -8.737 L
-21.094 -8.112 -23.078 -8.112 QT
-23.078 -8.987 L
-20.016 -8.987 -18.453 -10.596 QT
-18.094 -10.596 L
-18.016 -10.596 -17.938 -10.526 QT
-17.859 -10.456 -17.859 -10.378 QT
-17.859 4.388 L
-17.859 5.185 -14.734 5.185 QT
-14.734 6.06 L
-22.938 6.06 L
cp
f
GR
GS
[0.71287 0 0 0.71287 45.01386 264.25935] CT
0.149 GC
N
/f-10226075{-6.375 6.607 M
-9.438 6.607 -10.539 4.083 QT
-11.641 1.56 -11.641 -1.909 QT
-11.641 -4.081 -11.25 -6.003 QT
-10.859 -7.924 -9.68 -9.26 QT
-8.5 -10.596 -6.375 -10.596 QT
-4.734 -10.596 -3.68 -9.792 QT
-2.625 -8.987 -2.078 -7.706 QT
-1.531 -6.424 -1.328 -4.971 QT
-1.125 -3.518 -1.125 -1.909 QT
-1.125 0.232 -1.523 2.107 QT
-1.922 3.982 -3.078 5.294 QT
-4.234 6.607 -6.375 6.607 QT
cp
-6.375 5.966 M
-4.984 5.966 -4.297 4.536 QT
-3.609 3.107 -3.453 1.372 QT
-3.297 -0.362 -3.297 -2.315 QT
-3.297 -4.19 -3.453 -5.776 QT
-3.609 -7.362 -4.289 -8.651 QT
-4.969 -9.94 -6.375 -9.94 QT
-7.797 -9.94 -8.477 -8.651 QT
-9.156 -7.362 -9.313 -5.776 QT
-9.469 -4.19 -9.469 -2.315 QT
-9.469 -0.924 -9.406 0.31 QT
-9.344 1.544 -9.047 2.857 QT
-8.75 4.169 -8.102 5.068 QT
-7.453 5.966 -6.375 5.966 QT
cp}def
f-10226075
f
GR
GS
[0.71287 0 0 0.71287 45.01386 200.95188] CT
0.149 GC
N
/f-990308300{-22.938 6.06 M
-22.938 5.185 L
-19.813 5.185 -19.813 4.388 QT
-19.813 -8.737 L
-21.094 -8.112 -23.078 -8.112 QT
-23.078 -8.987 L
-20.016 -8.987 -18.453 -10.596 QT
-18.094 -10.596 L
-18.016 -10.596 -17.938 -10.526 QT
-17.859 -10.456 -17.859 -10.378 QT
-17.859 4.388 L
-17.859 5.185 -14.734 5.185 QT
-14.734 6.06 L
-22.938 6.06 L
cp}def
f-990308300
f
GR
GS
[0.71287 0 0 0.71287 45.01386 200.95188] CT
0.149 GC
N
/f1480815407{-10.453 3.216 M
-10.203 3.951 -9.672 4.544 QT
-9.141 5.138 -8.414 5.474 QT
-7.688 5.81 -6.906 5.81 QT
-5.094 5.81 -4.406 4.411 QT
-3.719 3.013 -3.719 1.013 QT
-3.719 0.138 -3.75 -0.456 QT
-3.781 -1.049 -3.922 -1.596 QT
-4.156 -2.471 -4.734 -3.128 QT
-5.313 -3.784 -6.156 -3.784 QT
-7 -3.784 -7.602 -3.534 QT
-8.203 -3.284 -8.586 -2.94 QT
-8.969 -2.596 -9.258 -2.214 QT
-9.547 -1.831 -9.625 -1.815 QT
-9.906 -1.815 L
-9.969 -1.815 -10.055 -1.893 QT
-10.141 -1.971 -10.141 -2.049 QT
-10.141 -10.393 L
-10.141 -10.456 -10.063 -10.526 QT
-9.984 -10.596 -9.906 -10.596 QT
-9.828 -10.596 L
-8.141 -9.784 -6.25 -9.784 QT
-4.391 -9.784 -2.672 -10.596 QT
-2.609 -10.596 L
-2.516 -10.596 -2.445 -10.534 QT
-2.375 -10.471 -2.375 -10.393 QT
-2.375 -10.159 L
-2.375 -10.034 -2.422 -10.034 QT
-3.281 -8.909 -4.563 -8.276 QT
-5.844 -7.643 -7.234 -7.643 QT
-8.234 -7.643 -9.281 -7.924 QT
-9.281 -3.19 L
-8.453 -3.862 -7.797 -4.151 QT
-7.141 -4.44 -6.125 -4.44 QT
-4.75 -4.44 -3.656 -3.643 QT
-2.563 -2.846 -1.977 -1.573 QT
-1.391 -0.299 -1.391 1.029 QT
-1.391 2.529 -2.133 3.81 QT
-2.875 5.091 -4.141 5.849 QT
-5.406 6.607 -6.906 6.607 QT
-8.125 6.607 -9.164 5.974 QT
-10.203 5.341 -10.789 4.263 QT
-11.375 3.185 -11.375 1.982 QT
-11.375 1.419 -11.008 1.068 QT
-10.641 0.716 -10.094 0.716 QT
-9.547 0.716 -9.172 1.076 QT
-8.797 1.435 -8.797 1.982 QT
-8.797 2.513 -9.172 2.888 QT
-9.547 3.263 -10.094 3.263 QT
-10.188 3.263 -10.297 3.247 QT
-10.406 3.232 -10.453 3.216 QT
cp}def
f1480815407
f
GR
GS
[0.71287 0 0 0.71287 45.01386 137.64441] CT
0.149 GC
N
/f-1357527344{-24 6.06 M
-24 5.388 L
-24 5.326 -23.953 5.247 QT
-20.078 0.951 L
-19.188 -0.003 -18.641 -0.643 QT
-18.094 -1.284 -17.555 -2.128 QT
-17.016 -2.971 -16.711 -3.846 QT
-16.406 -4.721 -16.406 -5.69 QT
-16.406 -6.721 -16.781 -7.659 QT
-17.156 -8.596 -17.906 -9.151 QT
-18.656 -9.706 -19.719 -9.706 QT
-20.813 -9.706 -21.68 -9.057 QT
-22.547 -8.409 -22.891 -7.362 QT
-22.797 -7.393 -22.625 -7.393 QT
-22.063 -7.393 -21.664 -7.018 QT
-21.266 -6.643 -21.266 -6.034 QT
-21.266 -5.471 -21.664 -5.073 QT
-22.063 -4.674 -22.625 -4.674 QT
-23.219 -4.674 -23.609 -5.081 QT
-24 -5.487 -24 -6.034 QT
-24 -6.971 -23.649 -7.799 QT
-23.297 -8.628 -22.633 -9.268 QT
-21.969 -9.909 -21.133 -10.253 QT
-20.297 -10.596 -19.359 -10.596 QT
-17.922 -10.596 -16.688 -9.987 QT
-15.453 -9.378 -14.734 -8.276 QT
-14.016 -7.174 -14.016 -5.69 QT
-14.016 -4.612 -14.492 -3.635 QT
-14.969 -2.659 -15.711 -1.854 QT
-16.453 -1.049 -17.617 -0.042 QT
-18.781 0.966 -19.141 1.31 QT
-21.984 4.029 L
-19.578 4.029 L
-17.797 4.029 -16.609 3.997 QT
-15.422 3.966 -15.344 3.904 QT
-15.063 3.591 -14.75 1.607 QT
-14.016 1.607 L
-14.734 6.06 L
-24 6.06 L
cp}def
f-1357527344
f
GR
GS
[0.71287 0 0 0.71287 45.01386 137.64441] CT
0.149 GC
N
f-10226075
f
GR
GS
[0.71287 0 0 0.71287 45.01386 74.33694] CT
0.149 GC
N
f-1357527344
f
GR
GS
[0.71287 0 0 0.71287 45.01386 74.33694] CT
0.149 GC
N
f1480815407
f
GR
GS
[0.71287 0 0 0.71287 45.01386 11.02947] CT
0.149 GC
N
/f1391180885{-22.875 4.138 M
-22.281 4.982 -21.297 5.396 QT
-20.313 5.81 -19.172 5.81 QT
-17.719 5.81 -17.109 4.576 QT
-16.5 3.341 -16.5 1.763 QT
-16.5 1.06 -16.625 0.349 QT
-16.75 -0.362 -17.055 -0.971 QT
-17.359 -1.581 -17.891 -1.948 QT
-18.422 -2.315 -19.188 -2.315 QT
-20.859 -2.315 L
-21.078 -2.315 -21.078 -2.549 QT
-21.078 -2.768 L
-21.078 -2.956 -20.859 -2.956 QT
-19.469 -3.065 L
-18.594 -3.065 -18.016 -3.729 QT
-17.438 -4.393 -17.172 -5.339 QT
-16.906 -6.284 -16.906 -7.143 QT
-16.906 -8.331 -17.461 -9.104 QT
-18.016 -9.878 -19.172 -9.878 QT
-20.125 -9.878 -20.992 -9.51 QT
-21.859 -9.143 -22.375 -8.424 QT
-22.313 -8.424 -22.281 -8.432 QT
-22.25 -8.44 -22.203 -8.44 QT
-21.641 -8.44 -21.258 -8.049 QT
-20.875 -7.659 -20.875 -7.112 QT
-20.875 -6.581 -21.258 -6.19 QT
-21.641 -5.799 -22.203 -5.799 QT
-22.75 -5.799 -23.141 -6.19 QT
-23.531 -6.581 -23.531 -7.112 QT
-23.531 -8.19 -22.883 -8.979 QT
-22.234 -9.768 -21.219 -10.182 QT
-20.203 -10.596 -19.172 -10.596 QT
-18.406 -10.596 -17.57 -10.37 QT
-16.734 -10.143 -16.047 -9.721 QT
-15.359 -9.299 -14.93 -8.635 QT
-14.5 -7.971 -14.5 -7.143 QT
-14.5 -6.081 -14.969 -5.19 QT
-15.438 -4.299 -16.258 -3.651 QT
-17.078 -3.003 -18.047 -2.69 QT
-16.969 -2.487 -15.992 -1.878 QT
-15.016 -1.268 -14.422 -0.315 QT
-13.828 0.638 -13.828 1.732 QT
-13.828 3.122 -14.586 4.24 QT
-15.344 5.357 -16.57 5.982 QT
-17.797 6.607 -19.172 6.607 QT
-20.344 6.607 -21.524 6.161 QT
-22.703 5.716 -23.453 4.826 QT
-24.203 3.935 -24.203 2.685 QT
-24.203 2.076 -23.789 1.654 QT
-23.375 1.232 -22.75 1.232 QT
-22.344 1.232 -22.008 1.427 QT
-21.672 1.622 -21.484 1.958 QT
-21.297 2.294 -21.297 2.685 QT
-21.297 3.294 -21.727 3.716 QT
-22.156 4.138 -22.75 4.138 QT
-22.875 4.138 L
cp}def
f1391180885
f
GR
GS
[0.71287 0 0 0.71287 45.01386 11.02947] CT
0.149 GC
N
f-10226075
f
GR
GS
[0 -0.71287 0.71287 0 24.0138 205.58398] CT
0.149 GC
N
/f-1388916577{-84.451 -9.999 M
-84.451 -10.983 L
-81.576 -10.983 -81.576 -11.874 QT
-81.576 -27.249 L
-81.576 -28.14 -84.451 -28.14 QT
-84.451 -29.124 L
-75.67 -29.124 L
-74.092 -29.124 -72.365 -28.562 QT
-70.639 -27.999 -69.475 -26.835 QT
-68.311 -25.671 -68.311 -24.062 QT
-68.311 -22.874 -69.014 -21.952 QT
-69.717 -21.03 -70.819 -20.413 QT
-71.92 -19.796 -73.076 -19.515 QT
-71.811 -19.077 -70.865 -18.124 QT
-69.92 -17.171 -69.733 -15.937 QT
-69.342 -13.452 L
-69.061 -11.765 -68.764 -10.937 QT
-68.467 -10.108 -67.436 -10.108 QT
-66.561 -10.108 -66.131 -10.921 QT
-65.701 -11.733 -65.701 -12.687 QT
-65.701 -12.796 -65.615 -12.866 QT
-65.529 -12.937 -65.42 -12.937 QT
-65.17 -12.937 L
-64.889 -12.937 -64.889 -12.577 QT
-64.889 -11.812 -65.194 -11.077 QT
-65.498 -10.343 -66.061 -9.866 QT
-66.623 -9.39 -67.404 -9.39 QT
-69.436 -9.39 -70.889 -10.39 QT
-72.342 -11.39 -72.342 -13.343 QT
-72.342 -15.827 L
-72.342 -17.218 -73.311 -18.218 QT
-74.279 -19.218 -75.701 -19.218 QT
-79.061 -19.218 L
-79.061 -11.874 L
-79.061 -10.983 -76.17 -10.983 QT
-76.17 -9.999 L
-84.451 -9.999 L
cp
-79.061 -19.937 M
-76.061 -19.937 L
-73.733 -19.937 -72.522 -20.874 QT
-71.311 -21.812 -71.311 -24.062 QT
-71.311 -26.28 -72.514 -27.21 QT
-73.717 -28.14 -76.061 -28.14 QT
-77.639 -28.14 L
-78.139 -28.14 -78.42 -28.101 QT
-78.701 -28.062 -78.881 -27.866 QT
-79.061 -27.671 -79.061 -27.249 QT
-79.061 -19.937 L
cp}def
f-1388916577
f
GR
GS
[0 -0.71287 0.71287 0 24.0138 205.58398] CT
0.149 GC
N
/f940733388{-63.959 -9.999 M
-63.959 -10.983 L
-61.068 -10.983 -61.068 -12.64 QT
-61.068 -27.249 L
-61.068 -28.14 -63.959 -28.14 QT
-63.959 -29.124 L
-58.662 -29.124 L
-58.318 -29.124 -58.209 -28.812 QT
-52.115 -12.968 L
-46.021 -28.812 L
-45.912 -29.124 -45.568 -29.124 QT
-40.271 -29.124 L
-40.271 -28.14 L
-43.162 -28.14 -43.162 -27.249 QT
-43.162 -11.874 L
-43.162 -10.983 -40.271 -10.983 QT
-40.271 -9.999 L
-48.428 -9.999 L
-48.428 -10.983 L
-45.537 -10.983 -45.537 -11.874 QT
-45.537 -28.171 L
-52.428 -10.312 L
-52.553 -9.999 -52.896 -9.999 QT
-53.256 -9.999 -53.381 -10.312 QT
-60.178 -27.952 L
-60.178 -12.64 L
-60.178 -10.983 -57.303 -10.983 QT
-57.303 -9.999 L
-63.959 -9.999 L
cp}def
f940733388
f
GR
GS
[0 -0.71287 0.71287 0 24.0138 205.58398] CT
0.149 GC
N
/f-1460726707{-37.905 -9.608 M
-37.905 -16.14 L
-37.905 -16.358 -37.67 -16.358 QT
-37.327 -16.358 L
-37.233 -16.358 -37.17 -16.288 QT
-37.108 -16.218 -37.108 -16.14 QT
-37.108 -13.39 -35.405 -11.882 QT
-33.702 -10.374 -30.936 -10.374 QT
-29.967 -10.374 -29.147 -10.929 QT
-28.327 -11.483 -27.866 -12.398 QT
-27.405 -13.312 -27.405 -14.28 QT
-27.405 -15.124 -27.748 -15.929 QT
-28.092 -16.733 -28.733 -17.319 QT
-29.373 -17.905 -30.186 -18.093 QT
-33.827 -18.983 L
-35.623 -19.468 -36.764 -20.944 QT
-37.905 -22.421 -37.905 -24.28 QT
-37.905 -25.718 -37.17 -26.991 QT
-36.436 -28.265 -35.186 -29.007 QT
-33.936 -29.749 -32.483 -29.749 QT
-29.686 -29.749 -28.03 -27.843 QT
-26.873 -29.655 L
-26.795 -29.749 -26.686 -29.749 QT
-26.498 -29.749 L
-26.405 -29.749 -26.334 -29.687 QT
-26.264 -29.624 -26.264 -29.515 QT
-26.264 -23.015 L
-26.264 -22.765 -26.498 -22.765 QT
-26.827 -22.765 L
-27.077 -22.765 -27.077 -23.015 QT
-27.077 -23.733 -27.319 -24.577 QT
-27.561 -25.421 -27.983 -26.202 QT
-28.405 -26.983 -28.905 -27.468 QT
-30.248 -28.843 -32.483 -28.843 QT
-33.436 -28.843 -34.241 -28.358 QT
-35.045 -27.874 -35.53 -27.038 QT
-36.014 -26.202 -36.014 -25.28 QT
-36.014 -24.077 -35.264 -23.101 QT
-34.514 -22.124 -33.311 -21.812 QT
-29.686 -20.921 L
-28.78 -20.702 -27.975 -20.14 QT
-27.17 -19.577 -26.639 -18.819 QT
-26.108 -18.062 -25.811 -17.14 QT
-25.514 -16.218 -25.514 -15.233 QT
-25.514 -13.718 -26.209 -12.374 QT
-26.905 -11.03 -28.17 -10.21 QT
-29.436 -9.39 -30.936 -9.39 QT
-31.873 -9.39 -32.842 -9.593 QT
-33.811 -9.796 -34.631 -10.218 QT
-35.452 -10.64 -36.123 -11.312 QT
-37.295 -9.468 L
-37.373 -9.39 -37.498 -9.39 QT
-37.67 -9.39 L
-37.905 -9.39 -37.905 -9.608 QT
cp}def
f-1460726707
f
GR
GS
[0 -0.71287 0.71287 0 24.0138 205.58398] CT
0.149 GC
N
/f1592823393{-10.736 -3.046 M
-12.298 -4.28 -13.423 -5.874 QT
-14.548 -7.468 -15.267 -9.273 QT
-15.986 -11.077 -16.345 -13.046 QT
-16.704 -15.015 -16.704 -16.999 QT
-16.704 -19.015 -16.345 -20.983 QT
-15.986 -22.952 -15.259 -24.765 QT
-14.533 -26.577 -13.392 -28.163 QT
-12.251 -29.749 -10.736 -30.952 QT
-10.736 -30.999 -10.611 -30.999 QT
-10.345 -30.999 L
-10.267 -30.999 -10.197 -30.921 QT
-10.126 -30.843 -10.126 -30.749 QT
-10.126 -30.624 -10.173 -30.577 QT
-11.548 -29.233 -12.454 -27.702 QT
-13.361 -26.171 -13.915 -24.444 QT
-14.47 -22.718 -14.72 -20.866 QT
-14.97 -19.015 -14.97 -16.999 QT
-14.97 -8.093 -10.204 -3.483 QT
-10.126 -3.39 -10.126 -3.249 QT
-10.126 -3.171 -10.204 -3.085 QT
-10.283 -2.999 -10.345 -2.999 QT
-10.611 -2.999 L
-10.736 -2.999 -10.736 -3.046 QT
cp}def
f1592823393
f
GR
GS
[0 -0.71287 0.71287 0 24.0138 205.58398] CT
0.149 GC
N
/f866791023{-7.106 -9.999 M
-7.341 -9.999 -7.341 -10.218 QT
-7.325 -10.249 -7.317 -10.265 QT
-7.309 -10.28 -7.309 -10.312 QT
2.331 -29.749 L
2.456 -30.046 2.831 -30.046 QT
3.222 -30.046 L
3.597 -30.046 3.722 -29.749 QT
13.363 -10.312 L
13.378 -10.28 13.386 -10.265 QT
13.394 -10.249 13.394 -10.218 QT
13.394 -9.999 13.159 -9.999 QT
-7.106 -9.999 L
cp
-5.262 -12.249 M
9.488 -12.249 L
2.128 -27.108 L
-5.262 -12.249 L
cp}def
f866791023
f
GR
GS
[0 -0.71287 0.71287 0 24.0138 205.58398] CT
0.149 GC
N
/f-1377661566{15.133 -9.999 M
15.133 -11.421 L
17.524 -11.421 17.774 -11.687 QT
21.555 -15.968 L
17.352 -20.999 L
15.274 -20.999 L
15.274 -22.421 L
21.868 -22.421 L
21.868 -20.999 L
20.852 -20.999 L
23.368 -18.015 L
25.805 -20.78 L
25.805 -20.89 25.399 -20.944 QT
24.993 -20.999 24.758 -20.999 QT
24.758 -22.421 L
30.337 -22.421 L
30.337 -20.999 L
27.962 -20.999 27.712 -20.749 QT
24.305 -16.89 L
28.837 -11.421 L
30.93 -11.421 L
30.93 -9.999 L
24.321 -9.999 L
24.321 -11.421 L
25.368 -11.421 L
22.477 -14.843 L
19.68 -11.655 L
19.68 -11.562 20.087 -11.491 QT
20.493 -11.421 20.743 -11.421 QT
20.743 -9.999 L
15.133 -9.999 L
cp}def
f-1377661566
f
GR
GS
[0 -0.71287 0.71287 0 24.0138 205.58398] CT
0.149 GC
N
/f1777108675{33.194 -2.999 M
32.96 -2.999 32.96 -3.249 QT
32.96 -3.374 33.007 -3.421 QT
37.788 -8.093 37.788 -16.999 QT
37.788 -25.905 33.069 -30.515 QT
32.96 -30.593 32.96 -30.749 QT
32.96 -30.843 33.03 -30.921 QT
33.101 -30.999 33.194 -30.999 QT
33.46 -30.999 L
33.538 -30.999 33.601 -30.952 QT
35.601 -29.358 36.944 -27.093 QT
38.288 -24.827 38.913 -22.257 QT
39.538 -19.687 39.538 -16.999 QT
39.538 -15.015 39.202 -13.093 QT
38.866 -11.171 38.132 -9.304 QT
37.398 -7.437 36.28 -5.858 QT
35.163 -4.28 33.601 -3.046 QT
33.538 -2.999 33.46 -2.999 QT
33.194 -2.999 L
cp}def
f1777108675
f
GR
GS
[0 -0.71287 0.71287 0 24.0138 205.58398] CT
0.149 GC
N
/f-51373297{50.125 -2.999 M
50.125 -30.999 L
53.953 -30.999 L
53.953 -29.874 L
51.25 -29.874 L
51.25 -4.124 L
53.953 -4.124 L
53.953 -2.999 L
50.125 -2.999 L
cp}def
f-51373297
f
GR
GS
[0 -0.71287 0.71287 0 24.0138 205.58398] CT
0.149 GC
N
/f1225810329{55.356 -9.999 M
55.356 -10.983 L
56.325 -10.983 56.934 -11.132 QT
57.543 -11.28 57.543 -11.874 QT
57.543 -19.515 L
57.543 -20.265 57.325 -20.601 QT
57.106 -20.937 56.676 -21.015 QT
56.246 -21.093 55.356 -21.093 QT
55.356 -22.077 L
59.418 -22.374 L
59.418 -19.64 L
59.981 -20.843 61.082 -21.608 QT
62.184 -22.374 63.481 -22.374 QT
66.715 -22.374 67.278 -19.749 QT
67.825 -20.921 68.91 -21.648 QT
69.996 -22.374 71.278 -22.374 QT
72.543 -22.374 73.41 -21.96 QT
74.278 -21.546 74.715 -20.71 QT
75.153 -19.874 75.153 -18.593 QT
75.153 -11.874 L
75.153 -11.28 75.778 -11.132 QT
76.403 -10.983 77.34 -10.983 QT
77.34 -9.999 L
70.934 -9.999 L
70.934 -10.983 L
71.887 -10.983 72.504 -11.132 QT
73.121 -11.28 73.121 -11.874 QT
73.121 -18.515 L
73.121 -19.921 72.723 -20.788 QT
72.325 -21.655 71.106 -21.655 QT
69.481 -21.655 68.434 -20.351 QT
67.387 -19.046 67.387 -17.39 QT
67.387 -11.874 L
67.387 -11.28 67.996 -11.132 QT
68.606 -10.983 69.575 -10.983 QT
69.575 -9.999 L
63.153 -9.999 L
63.153 -10.983 L
64.106 -10.983 64.723 -11.132 QT
65.34 -11.28 65.34 -11.874 QT
65.34 -18.515 L
65.34 -19.89 64.942 -20.773 QT
64.543 -21.655 63.325 -21.655 QT
61.7 -21.655 60.653 -20.351 QT
59.606 -19.046 59.606 -17.39 QT
59.606 -11.874 L
59.606 -11.28 60.215 -11.132 QT
60.825 -10.983 61.778 -10.983 QT
61.778 -9.999 L
55.356 -9.999 L
cp}def
f1225810329
f
GR
GS
[0 -0.71287 0.71287 0 24.0138 205.58398] CT
0.149 GC
N
/f628642076{78.283 -2.999 M
78.283 -4.124 L
81.017 -4.124 L
81.017 -29.874 L
78.283 -29.874 L
78.283 -30.999 L
82.127 -30.999 L
82.127 -2.999 L
78.283 -2.999 L
cp}def
f628642076
f
GR
GS
[0.71287 0 0 0.71287 0 0.27722] CT
[10 6] 0 setdash
2 LJ
0.701 LW
N
71 103.889 M
600 103.889 L
S
GR
GS
[0.71287 0 0 0.71287 0 0.27722] CT
0.749 GC
1 LJ
0.701 LW
N
71 82.229 M
600 82.229 L
S
GR
GS
[0.71287 0 0 0.71287 0 0.27722] CT
0.749 GC
1 LJ
0.701 LW
N
71 38.909 M
600 38.909 L
S
GR
GS
[0.71287 0 0 0.71287 0 0.27722] CT
[10 6] 0 setdash
2 LJ
0.701 LW
N
159.167 287.369 M
159.167 128.441 L
S
GR
GS
[0.71287 0 0 0.71287 0 0.27722] CT
[10 6] 0 setdash
2 LJ
0.701 LW
N
335.5 259.547 M
335.5 124.639 L
S
GR
GS
[0.71287 0 0 0.71287 0 0.27722] CT
[10 6] 0 setdash
2 LJ
0.701 LW
N
511.833 364.183 M
511.833 290.339 L
S
GR
GS
[0.71287 0 0 0.71287 0 0.27722] CT
[10 6] 0 setdash
2 LJ
0.701 LW
N
159.167 526.706 M
159.167 450.316 L
S
GR
GS
[0.71287 0 0 0.71287 0 0.27722] CT
[10 6] 0 setdash
2 LJ
0.701 LW
N
335.5 537.091 M
335.5 474.523 L
S
GR
GS
[0.71287 0 0 0.71287 0 0.27722] CT
[10 6] 0 setdash
2 LJ
0.701 LW
N
511.833 526.662 M
511.833 487.27 L
S
GR
GS
[0.71287 0 0 0.71287 0 0.27722] CT
1 LJ
0.701 LW
N
139.329 128.441 M
179.004 128.441 L
S
GR
GS
[0.71287 0 0 0.71287 0 0.27722] CT
1 LJ
0.701 LW
N
315.663 124.639 M
355.337 124.639 L
S
GR
GS
[0.71287 0 0 0.71287 0 0.27722] CT
1 LJ
0.701 LW
N
491.996 290.339 M
531.671 290.339 L
S
GR
GS
[0.71287 0 0 0.71287 0 0.27722] CT
1 LJ
0.701 LW
N
139.329 526.706 M
179.004 526.706 L
S
GR
GS
[0.71287 0 0 0.71287 0 0.27722] CT
1 LJ
0.701 LW
N
315.663 537.091 M
355.337 537.091 L
S
GR
GS
[0.71287 0 0 0.71287 0 0.27722] CT
1 LJ
0.701 LW
N
491.996 526.662 M
531.671 526.662 L
S
GR
GS
[0.71287 0 0 0.71287 0 0.27722] CT
0 0 1 RC
1 LJ
0.701 LW
N
139.329 381.062 M
119.492 345.921 L
119.492 287.369 L
198.842 287.369 L
198.842 345.921 L
179.004 381.062 L
198.842 416.202 L
198.842 450.316 L
119.492 450.316 L
119.492 416.202 L
139.329 381.062 L
S
GR
GS
[0.71287 0 0 0.71287 0 0.27722] CT
0 0 1 RC
1 LJ
0.701 LW
N
315.663 392.014 M
295.825 345.653 L
295.825 259.547 L
375.175 259.547 L
375.175 345.653 L
355.337 392.014 L
375.175 438.375 L
375.175 474.523 L
295.825 474.523 L
295.825 438.375 L
315.663 392.014 L
S
GR
GS
[0.71287 0 0 0.71287 0 0.27722] CT
0 0 1 RC
1 LJ
0.701 LW
N
491.996 433.956 M
472.158 407.411 L
472.158 364.183 L
551.508 364.183 L
551.508 407.411 L
531.671 433.956 L
551.508 460.501 L
551.508 487.27 L
472.158 487.27 L
472.158 460.501 L
491.996 433.956 L
S
GR
GS
[0.71287 0 0 0.71287 0 0.27722] CT
1 0 0 RC
1 LJ
0.701 LW
N
139.329 381.062 M
179.004 381.062 L
S
GR
GS
[0.71287 0 0 0.71287 0 0.27722] CT
1 0 0 RC
1 LJ
0.701 LW
N
315.663 392.014 M
355.337 392.014 L
S
GR
GS
[0.71287 0 0 0.71287 0 0.27722] CT
1 0 0 RC
1 LJ
0.701 LW
N
491.996 433.956 M
531.671 433.956 L
S
GR
GS
[0.71287 0 0 0.71287 113.46535 28.0144] CT
1 0 0 RC
10.0 ML
0.701 LW
N
0 -5 M
0 5 L
-5 0 M
5 0 L
S
GR
GS
[0.71287 0 0 0.71287 239.16832 28.0144] CT
1 0 0 RC
10.0 ML
0.701 LW
N
0 -5 M
0 5 L
-5 0 M
5 0 L
S
GR
GS
[0.71287 0 0 0.71287 364.8713 96.63964] CT
1 0 0 RC
10.0 ML
0.701 LW
N
0 -5 M
0 5 L
-5 0 M
5 0 L
S
GR
GS
[0.71287 0 0 0.71287 364.8713 28.0144] CT
1 0 0 RC
10.0 ML
0.701 LW
N
0 -5 M
0 5 L
-5 0 M
5 0 L
S
GR
%%Trailer
%%Pages: 1
%%EOF
