<?xml version="1.0" encoding="UTF-8"?>
<svg viewBox="0 0 524.40942 744.09448" xmlns="http://www.w3.org/2000/svg" xmlns:xlink="http://www.w3.org/1999/xlink">
 <g transform="matrix(4.9859 0 0 4.9859 -1552.8 -1873.1)">
  <g id="a" transform="translate(14.508 -2.7766)">
   <path d="m335.97 451.57c-9.2149-4.9938-15.477-14.751-15.477-25.962 1e-5 -10.853 5.8692-20.344 14.605-25.469" fill="none" stroke="#000" stroke-dashoffset="5" stroke-linecap="round" stroke-linejoin="round" stroke-width=".98361"/>
   <path d="m365.47 400.48c8.4234 5.198 14.041 14.512 14.041 25.13l1e-5 1e-5c-1e-5 10.976-6.0023 20.558-14.901 25.641" fill="none" stroke="#000" stroke-dashoffset="5" stroke-linecap="round" stroke-linejoin="round" stroke-width=".98361"/>
  </g>
  <use transform="matrix(1.32 0 0 1.32 -116.64 -135.38)" width="744.09448" height="1052.3622" xlink:href="#a"/>
  <use transform="matrix(1.6479 0 0 1.6479 -236.17 -274.12)" width="744.09448" height="1052.3622" xlink:href="#a"/>
  <path d="m365 422.36v80" fill="none" stroke="#000" stroke-linecap="round" stroke-width="5"/>
  <path transform="translate(-7.5,-7.5)" d="m380 429.86a7.5 7.5 0 1 1 -15 0 7.5 7.5 0 1 1 15 0z" fill-rule="evenodd"/>
 </g>
</svg>
