<?xml version="1.0" encoding="UTF-8"?>

<!-- generated on Sat Apr 24 18:17:37 2021 by Eclipse SUMO Version 1.4.0
<configuration xmlns:xsi="http://www.w3.org/2001/XMLSchema-instance" xsi:noNamespaceSchemaLocation="http://sumo.dlr.de/xsd/sumoConfiguration.xsd">

    <input>
        <net-file value="sumofiles/junction.net.xml"/>
        <route-files value="sumofiles/junction_preemption_123.rou.xml"/>
        <additional-files value="sumofiles/junction.det.xml"/>
    </input>

    <output>
        <tripinfo-output value="sumofiles/output/tripinfo_preemption_123.xml"/>
    </output>

    <time>
        <begin value="0"/>
        <end value="10000"/>
        <step-length value="0.05"/>
    </time>

    <processing>
        <lateral-resolution value="0.1"/>
    </processing>

    <report>
        <no-warnings value="true"/>
        <error-log value="sumofiles/output/errorlog_preemption_123.log"/>
        <no-step-log value="true"/>
    </report>

    <traci_server>
        <remote-port value="49353"/>
    </traci_server>

    <gui_only>
        <gui-settings-file value="sumofiles/junction-gui.settings.xml"/>
        <tracker-interval value="0.05"/>
    </gui_only>

</configuration>
-->

<tripinfos xmlns:xsi="http://www.w3.org/2001/XMLSchema-instance" xsi:noNamespaceSchemaLocation="http://sumo.dlr.de/xsd/tripinfo_file.xsd">
    <tripinfo id="car_w2n_1" depart="1.00" departLane="w2sep_1" departPos="3.60" departPosLat="0.00" departSpeed="13.90" departDelay="0.00" arrival="140.70" arrivalLane="c2n_1" arrivalPos="990.00" arrivalPosLat="0.00" arrivalSpeed="14.73" duration="139.70" routeLength="1996.47" waitingTime="0.00" waitingCount="0" stopTime="0.00" timeLoss="3.53" rerouteNo="1" devices="tripinfo_car_w2n_1 routing_car_w2n_1" vType="Car" speedFactor="1.06" vaporized=""/>
    <tripinfo id="car_e2w_9" depart="9.00" departLane="e2sep_1" departPos="3.60" departPosLat="0.00" departSpeed="13.90" departDelay="0.00" arrival="151.25" arrivalLane="c2w_1" arrivalPos="990.00" arrivalPosLat="0.00" arrivalSpeed="14.04" duration="142.25" routeLength="1997.01" waitingTime="0.00" waitingCount="0" stopTime="0.00" timeLoss="0.05" rerouteNo="1" devices="tripinfo_car_e2w_9 routing_car_e2w_9" vType="Car" speedFactor="1.01" vaporized=""/>
    <tripinfo id="car_n2s_13" depart="13.00" departLane="n2sep_1" departPos="3.60" departPosLat="0.00" departSpeed="13.90" departDelay="0.00" arrival="160.40" arrivalLane="c2s_1" arrivalPos="990.00" arrivalPosLat="0.00" arrivalSpeed="15.05" duration="147.40" routeLength="1997.01" waitingTime="7.05" waitingCount="1" stopTime="0.00" timeLoss="14.67" rerouteNo="1" devices="tripinfo_car_n2s_13 routing_car_n2s_13" vType="Car" speedFactor="1.08" vaporized=""/>
    <tripinfo id="car_w2n_15" depart="15.00" departLane="w2sep_1" departPos="3.60" departPosLat="0.00" departSpeed="13.90" departDelay="0.00" arrival="162.60" arrivalLane="c2n_1" arrivalPos="990.00" arrivalPosLat="0.00" arrivalSpeed="13.90" duration="147.60" routeLength="1996.47" waitingTime="0.00" waitingCount="0" stopTime="0.00" timeLoss="3.27" rerouteNo="1" devices="tripinfo_car_w2n_15 routing_car_w2n_15" vType="Car" speedFactor="1.00" vaporized=""/>
    <tripinfo id="car_s2n_3" depart="3.00" departLane="s2sep_1" departPos="3.60" departPosLat="0.00" departSpeed="13.90" departDelay="0.00" arrival="165.35" arrivalLane="c2n_1" arrivalPos="990.00" arrivalPosLat="0.00" arrivalSpeed="14.61" duration="162.35" routeLength="1997.01" waitingTime="15.75" waitingCount="1" stopTime="0.00" timeLoss="26.81" rerouteNo="1" devices="tripinfo_car_s2n_3 routing_car_s2n_3" vType="Car" speedFactor="1.06" vaporized=""/>
    <tripinfo id="car_n2w_14" depart="14.35" departLane="n2sep_1" departPos="3.60" departPosLat="0.00" departSpeed="13.90" departDelay="0.35" arrival="165.95" arrivalLane="c2w_1" arrivalPos="990.00" arrivalPosLat="0.00" arrivalSpeed="14.32" duration="151.60" routeLength="1986.69" waitingTime="2.00" waitingCount="1" stopTime="0.00" timeLoss="12.17" rerouteNo="1" devices="tripinfo_car_n2w_14 routing_car_n2w_14" vType="Car" speedFactor="1.03" vaporized=""/>
    <tripinfo id="car_s2w_20" depart="20.00" departLane="s2sep_1" departPos="3.60" departPosLat="0.00" departSpeed="13.90" departDelay="0.00" arrival="170.35" arrivalLane="c2w_1" arrivalPos="990.00" arrivalPosLat="0.00" arrivalSpeed="14.31" duration="150.35" routeLength="1996.47" waitingTime="0.15" waitingCount="1" stopTime="0.00" timeLoss="10.26" rerouteNo="1" devices="tripinfo_car_s2w_20 routing_car_s2w_20" vType="Car" speedFactor="1.03" vaporized=""/>
    <tripinfo id="car_s2e_33" depart="33.00" departLane="s2sep_1" departPos="3.60" departPosLat="0.00" departSpeed="13.90" departDelay="0.00" arrival="176.75" arrivalLane="c2e_1" arrivalPos="990.00" arrivalPosLat="0.00" arrivalSpeed="14.27" duration="143.75" routeLength="1986.69" waitingTime="0.00" waitingCount="0" stopTime="0.00" timeLoss="3.77" rerouteNo="1" devices="tripinfo_car_s2e_33 routing_car_s2e_33" vType="Car" speedFactor="1.03" vaporized=""/>
    <tripinfo id="car_n2s_38" depart="38.00" departLane="n2sep_1" departPos="3.60" departPosLat="0.00" departSpeed="13.90" departDelay="0.00" arrival="181.85" arrivalLane="c2s_1" arrivalPos="990.00" arrivalPosLat="0.00" arrivalSpeed="13.90" duration="143.85" routeLength="1997.01" waitingTime="0.00" waitingCount="0" stopTime="0.00" timeLoss="0.18" rerouteNo="1" devices="tripinfo_car_n2s_38 routing_car_n2s_38" vType="Car" speedFactor="1.00" vaporized=""/>
    <tripinfo id="car_s2e_44" depart="44.00" departLane="s2sep_1" departPos="3.60" departPosLat="0.00" departSpeed="13.90" departDelay="0.00" arrival="191.35" arrivalLane="c2e_1" arrivalPos="990.00" arrivalPosLat="0.00" arrivalSpeed="13.90" duration="147.35" routeLength="1986.69" waitingTime="0.00" waitingCount="0" stopTime="0.00" timeLoss="3.68" rerouteNo="1" devices="tripinfo_car_s2e_44 routing_car_s2e_44" vType="Car" speedFactor="1.00" vaporized=""/>
    <tripinfo id="car_n2e_57" depart="57.00" departLane="n2sep_1" departPos="3.60" departPosLat="0.00" departSpeed="13.90" departDelay="0.00" arrival="198.05" arrivalLane="c2e_1" arrivalPos="990.00" arrivalPosLat="0.00" arrivalSpeed="15.16" duration="141.05" routeLength="1996.47" waitingTime="0.00" waitingCount="0" stopTime="0.00" timeLoss="8.72" rerouteNo="1" devices="tripinfo_car_n2e_57 routing_car_n2e_57" vType="Car" speedFactor="1.09" vaporized=""/>
    <tripinfo id="car_e2n_25" depart="25.00" departLane="e2sep_1" departPos="3.60" departPosLat="0.00" departSpeed="13.90" departDelay="0.00" arrival="204.85" arrivalLane="c2n_1" arrivalPos="990.00" arrivalPosLat="0.00" arrivalSpeed="15.16" duration="179.85" routeLength="1986.69" waitingTime="39.50" waitingCount="1" stopTime="0.00" timeLoss="48.12" rerouteNo="1" devices="tripinfo_car_e2n_25 routing_car_e2n_25" vType="Car" speedFactor="1.09" vaporized=""/>
    <tripinfo id="car_e2n_54" depart="54.00" departLane="e2sep_1" departPos="3.60" departPosLat="0.00" departSpeed="13.90" departDelay="0.00" arrival="207.50" arrivalLane="c2n_1" arrivalPos="990.00" arrivalPosLat="0.00" arrivalSpeed="15.92" duration="153.50" routeLength="1986.69" waitingTime="15.95" waitingCount="1" stopTime="0.00" timeLoss="29.46" rerouteNo="1" devices="tripinfo_car_e2n_54 routing_car_e2n_54" vType="Car" speedFactor="1.16" vaporized=""/>
    <tripinfo id="car_w2s_19" depart="19.00" departLane="w2sep_1" departPos="3.60" departPosLat="0.00" departSpeed="13.90" departDelay="0.00" arrival="207.60" arrivalLane="c2s_1" arrivalPos="990.00" arrivalPosLat="0.00" arrivalSpeed="15.05" duration="188.60" routeLength="1986.69" waitingTime="41.05" waitingCount="1" stopTime="0.00" timeLoss="55.93" rerouteNo="1" devices="tripinfo_car_w2s_19 routing_car_w2s_19" vType="Car" speedFactor="1.08" vaporized=""/>
    <tripinfo id="car_w2e_16" depart="16.45" departLane="w2sep_1" departPos="3.60" departPosLat="0.00" departSpeed="13.90" departDelay="0.45" arrival="207.90" arrivalLane="c2e_1" arrivalPos="990.00" arrivalPosLat="0.00" arrivalSpeed="14.54" duration="191.45" routeLength="1997.01" waitingTime="42.35" waitingCount="1" stopTime="0.00" timeLoss="54.05" rerouteNo="1" devices="tripinfo_car_w2e_16 routing_car_w2e_16" vType="Car" speedFactor="1.05" vaporized=""/>
    <tripinfo id="car_e2n_70" depart="70.50" departLane="e2sep_1" departPos="3.60" departPosLat="0.00" departSpeed="13.90" departDelay="0.50" arrival="212.05" arrivalLane="c2n_1" arrivalPos="990.00" arrivalPosLat="0.00" arrivalSpeed="15.72" duration="141.55" routeLength="1986.69" waitingTime="0.00" waitingCount="0" stopTime="0.00" timeLoss="14.64" rerouteNo="1" devices="tripinfo_car_e2n_70 routing_car_e2n_70" vType="Car" speedFactor="1.13" vaporized=""/>
    <tripinfo id="car_w2e_35" depart="35.00" departLane="w2sep_1" departPos="3.60" departPosLat="0.00" departSpeed="13.90" departDelay="0.00" arrival="212.85" arrivalLane="c2e_1" arrivalPos="990.00" arrivalPosLat="0.00" arrivalSpeed="14.55" duration="177.85" routeLength="1997.01" waitingTime="29.95" waitingCount="1" stopTime="0.00" timeLoss="40.60" rerouteNo="1" devices="tripinfo_car_w2e_35 routing_car_w2e_35" vType="Car" speedFactor="1.05" vaporized=""/>
    <tripinfo id="car_e2w_69" depart="69.00" departLane="e2sep_1" departPos="3.60" departPosLat="0.00" departSpeed="13.90" departDelay="0.00" arrival="215.00" arrivalLane="c2w_1" arrivalPos="990.00" arrivalPosLat="0.00" arrivalSpeed="13.90" duration="146.00" routeLength="1997.01" waitingTime="0.00" waitingCount="0" stopTime="0.00" timeLoss="2.30" rerouteNo="1" devices="tripinfo_car_e2w_69 routing_car_e2w_69" vType="Car" speedFactor="1.00" vaporized=""/>
    <tripinfo id="car_w2e_50" depart="50.00" departLane="w2sep_1" departPos="3.60" departPosLat="0.00" departSpeed="13.90" departDelay="0.00" arrival="218.50" arrivalLane="c2e_1" arrivalPos="990.00" arrivalPosLat="0.00" arrivalSpeed="13.90" duration="168.50" routeLength="1997.01" waitingTime="13.05" waitingCount="1" stopTime="0.00" timeLoss="24.81" rerouteNo="1" devices="tripinfo_car_w2e_50 routing_car_w2e_50" vType="Car" speedFactor="1.00" vaporized=""/>
    <tripinfo id="car_w2s_50" depart="51.45" departLane="w2sep_1" departPos="3.60" departPosLat="0.00" departSpeed="13.90" departDelay="1.45" arrival="219.65" arrivalLane="c2s_1" arrivalPos="990.00" arrivalPosLat="0.00" arrivalSpeed="13.90" duration="168.20" routeLength="1986.69" waitingTime="10.60" waitingCount="1" stopTime="0.00" timeLoss="24.52" rerouteNo="1" devices="tripinfo_car_w2s_50 routing_car_w2s_50" vType="Car" speedFactor="1.00" vaporized=""/>
    <tripinfo id="car_w2e_56" depart="56.00" departLane="w2sep_1" departPos="3.60" departPosLat="0.00" departSpeed="13.90" departDelay="0.00" arrival="222.40" arrivalLane="c2e_1" arrivalPos="990.00" arrivalPosLat="0.00" arrivalSpeed="14.02" duration="166.40" routeLength="1997.01" waitingTime="8.60" waitingCount="1" stopTime="0.00" timeLoss="24.16" rerouteNo="1" devices="tripinfo_car_w2e_56 routing_car_w2e_56" vType="Car" speedFactor="1.01" vaporized=""/>
    <tripinfo id="car_w2e_60" depart="60.00" departLane="w2sep_1" departPos="3.60" departPosLat="0.00" departSpeed="13.90" departDelay="0.00" arrival="225.45" arrivalLane="c2e_1" arrivalPos="990.00" arrivalPosLat="0.00" arrivalSpeed="14.20" duration="165.45" routeLength="1997.01" waitingTime="6.85" waitingCount="1" stopTime="0.00" timeLoss="25.45" rerouteNo="1" devices="tripinfo_car_w2e_60 routing_car_w2e_60" vType="Car" speedFactor="1.03" vaporized=""/>
    <tripinfo id="car_w2s_72" depart="72.00" departLane="w2sep_1" departPos="3.60" departPosLat="0.00" departSpeed="13.90" departDelay="0.00" arrival="226.25" arrivalLane="c2s_1" arrivalPos="990.00" arrivalPosLat="0.00" arrivalSpeed="13.90" duration="154.25" routeLength="1986.69" waitingTime="0.00" waitingCount="0" stopTime="0.00" timeLoss="10.56" rerouteNo="1" devices="tripinfo_car_w2s_72 routing_car_w2s_72" vType="Car" speedFactor="1.00" vaporized=""/>
    <tripinfo id="car_e2n_80" depart="80.00" departLane="e2sep_1" departPos="3.60" departPosLat="0.00" departSpeed="13.90" departDelay="0.00" arrival="226.95" arrivalLane="c2n_1" arrivalPos="990.00" arrivalPosLat="0.00" arrivalSpeed="13.97" duration="146.95" routeLength="1986.69" waitingTime="0.00" waitingCount="0" stopTime="0.00" timeLoss="4.01" rerouteNo="1" devices="tripinfo_car_e2n_80 routing_car_e2n_80" vType="Car" speedFactor="1.01" vaporized=""/>
    <tripinfo id="car_w2s_86" depart="86.00" departLane="w2sep_1" departPos="3.60" departPosLat="0.00" departSpeed="13.90" departDelay="0.00" arrival="228.10" arrivalLane="c2s_1" arrivalPos="990.00" arrivalPosLat="0.00" arrivalSpeed="15.43" duration="142.10" routeLength="1986.69" waitingTime="0.00" waitingCount="0" stopTime="0.00" timeLoss="19.47" rerouteNo="1" devices="tripinfo_car_w2s_86 routing_car_w2s_86" vType="Car" speedFactor="1.17" vaporized=""/>
    <tripinfo id="car_w2e_98" depart="98.00" departLane="w2sep_1" departPos="3.60" departPosLat="0.00" departSpeed="13.90" departDelay="0.00" arrival="229.65" arrivalLane="c2e_1" arrivalPos="990.00" arrivalPosLat="0.00" arrivalSpeed="15.30" duration="131.65" routeLength="1997.01" waitingTime="0.00" waitingCount="0" stopTime="0.00" timeLoss="1.29" rerouteNo="1" devices="tripinfo_car_w2e_98 routing_car_w2e_98" vType="Car" speedFactor="1.10" vaporized=""/>
    <tripinfo id="car_w2n_43" depart="43.00" departLane="w2sep_1" departPos="3.60" departPosLat="0.00" departSpeed="13.90" departDelay="0.00" arrival="230.15" arrivalLane="c2n_1" arrivalPos="990.00" arrivalPosLat="0.00" arrivalSpeed="14.48" duration="187.15" routeLength="1996.47" waitingTime="34.90" waitingCount="3" stopTime="0.00" timeLoss="49.12" rerouteNo="1" devices="tripinfo_car_w2n_43 routing_car_w2n_43" vType="Car" speedFactor="1.05" vaporized=""/>
    <tripinfo id="car_e2s_18" depart="18.00" departLane="e2sep_1" departPos="3.60" departPosLat="0.00" departSpeed="13.90" departDelay="0.00" arrival="232.25" arrivalLane="c2s_1" arrivalPos="990.00" arrivalPosLat="0.00" arrivalSpeed="14.03" duration="214.25" routeLength="1996.47" waitingTime="58.75" waitingCount="2" stopTime="0.00" timeLoss="71.40" rerouteNo="1" devices="tripinfo_car_e2s_18 routing_car_e2s_18" vType="Car" speedFactor="1.01" vaporized=""/>
    <tripinfo id="car_e2w_90" depart="90.00" departLane="e2sep_1" departPos="3.60" departPosLat="0.00" departSpeed="13.90" departDelay="0.00" arrival="234.20" arrivalLane="c2w_1" arrivalPos="990.00" arrivalPosLat="0.00" arrivalSpeed="13.90" duration="144.20" routeLength="1997.01" waitingTime="0.00" waitingCount="0" stopTime="0.00" timeLoss="0.53" rerouteNo="1" devices="tripinfo_car_e2w_90 routing_car_e2w_90" vType="Car" speedFactor="1.00" vaporized=""/>
    <tripinfo id="car_e2s_36" depart="36.00" departLane="e2sep_1" departPos="3.60" departPosLat="0.00" departSpeed="13.90" departDelay="0.00" arrival="234.40" arrivalLane="c2s_1" arrivalPos="990.00" arrivalPosLat="0.00" arrivalSpeed="15.20" duration="198.40" routeLength="1996.47" waitingTime="49.65" waitingCount="3" stopTime="0.00" timeLoss="69.89" rerouteNo="1" devices="tripinfo_car_e2s_36 routing_car_e2s_36" vType="Car" speedFactor="1.12" vaporized=""/>
    <tripinfo id="car_e2w_93" depart="93.00" departLane="e2sep_1" departPos="3.60" departPosLat="0.00" departSpeed="13.90" departDelay="0.00" arrival="238.25" arrivalLane="c2w_1" arrivalPos="990.00" arrivalPosLat="0.00" arrivalSpeed="14.16" duration="145.25" routeLength="1997.01" waitingTime="0.00" waitingCount="0" stopTime="0.00" timeLoss="4.34" rerouteNo="1" devices="tripinfo_car_e2w_93 routing_car_e2w_93" vType="Car" speedFactor="1.02" vaporized=""/>
    <tripinfo id="car_e2s_65" depart="65.00" departLane="e2sep_1" departPos="3.60" departPosLat="0.00" departSpeed="13.90" departDelay="0.00" arrival="241.80" arrivalLane="c2s_1" arrivalPos="990.00" arrivalPosLat="0.00" arrivalSpeed="13.90" duration="176.80" routeLength="1996.47" waitingTime="14.20" waitingCount="2" stopTime="0.00" timeLoss="32.49" rerouteNo="1" devices="tripinfo_car_e2s_65 routing_car_e2s_65" vType="Car" speedFactor="1.00" vaporized=""/>
    <tripinfo id="car_e2w_94" depart="94.50" departLane="e2sep_1" departPos="3.60" departPosLat="0.00" departSpeed="13.90" departDelay="0.50" arrival="243.10" arrivalLane="c2w_1" arrivalPos="990.00" arrivalPosLat="0.00" arrivalSpeed="13.89" duration="148.60" routeLength="1997.01" waitingTime="0.00" waitingCount="0" stopTime="0.00" timeLoss="4.92" rerouteNo="1" devices="tripinfo_car_e2w_94 routing_car_e2w_94" vType="Car" speedFactor="1.00" vaporized=""/>
    <tripinfo id="car_n2w_80" depart="80.00" departLane="n2sep_1" departPos="3.60" departPosLat="0.00" departSpeed="13.90" departDelay="0.00" arrival="249.05" arrivalLane="c2w_1" arrivalPos="990.00" arrivalPosLat="0.00" arrivalSpeed="16.04" duration="169.05" routeLength="1986.69" waitingTime="34.75" waitingCount="1" stopTime="0.00" timeLoss="44.58" rerouteNo="1" devices="tripinfo_car_n2w_80 routing_car_n2w_80" vType="Car" speedFactor="1.15" vaporized=""/>
    <tripinfo id="car_s2n_62" depart="62.00" departLane="s2sep_1" departPos="3.60" departPosLat="0.00" departSpeed="13.90" departDelay="0.00" arrival="250.20" arrivalLane="c2n_1" arrivalPos="990.00" arrivalPosLat="0.00" arrivalSpeed="15.61" duration="188.20" routeLength="1997.01" waitingTime="46.90" waitingCount="1" stopTime="0.00" timeLoss="60.25" rerouteNo="1" devices="tripinfo_car_s2n_62 routing_car_s2n_62" vType="Car" speedFactor="1.12" vaporized=""/>
    <tripinfo id="car_s2e_60" depart="60.00" departLane="s2sep_1" departPos="3.60" departPosLat="0.00" departSpeed="13.90" departDelay="0.00" arrival="252.50" arrivalLane="c2e_1" arrivalPos="990.00" arrivalPosLat="0.00" arrivalSpeed="14.55" duration="192.50" routeLength="1986.69" waitingTime="48.20" waitingCount="1" stopTime="0.00" timeLoss="55.30" rerouteNo="1" devices="tripinfo_car_s2e_60 routing_car_s2e_60" vType="Car" speedFactor="1.05" vaporized=""/>
    <tripinfo id="car_s2n_97" depart="97.00" departLane="s2sep_1" departPos="3.60" departPosLat="0.00" departSpeed="13.90" departDelay="0.00" arrival="253.40" arrivalLane="c2n_1" arrivalPos="990.00" arrivalPosLat="0.00" arrivalSpeed="16.31" duration="156.40" routeLength="1997.01" waitingTime="21.20" waitingCount="1" stopTime="0.00" timeLoss="34.57" rerouteNo="1" devices="tripinfo_car_s2n_97 routing_car_s2n_97" vType="Car" speedFactor="1.18" vaporized=""/>
    <tripinfo id="car_s2e_74" depart="74.00" departLane="s2sep_1" departPos="3.60" departPosLat="0.00" departSpeed="13.90" departDelay="0.00" arrival="254.55" arrivalLane="c2e_1" arrivalPos="990.00" arrivalPosLat="0.00" arrivalSpeed="15.84" duration="180.55" routeLength="1986.69" waitingTime="42.90" waitingCount="1" stopTime="0.00" timeLoss="58.67" rerouteNo="1" devices="tripinfo_car_s2e_74 routing_car_s2e_74" vType="Car" speedFactor="1.18" vaporized=""/>
    <tripinfo id="car_n2s_55" depart="55.00" departLane="n2sep_1" departPos="3.60" departPosLat="0.00" departSpeed="13.90" departDelay="0.00" arrival="254.60" arrivalLane="c2s_1" arrivalPos="990.00" arrivalPosLat="0.00" arrivalSpeed="14.15" duration="199.60" routeLength="1997.01" waitingTime="52.05" waitingCount="1" stopTime="0.00" timeLoss="58.45" rerouteNo="1" devices="tripinfo_car_n2s_55 routing_car_n2s_55" vType="Car" speedFactor="1.02" vaporized=""/>
    <tripinfo id="car_s2e_98" depart="98.20" departLane="s2sep_1" departPos="3.60" departPosLat="0.00" departSpeed="13.90" departDelay="0.20" arrival="257.30" arrivalLane="c2e_1" arrivalPos="990.00" arrivalPosLat="0.00" arrivalSpeed="15.94" duration="159.10" routeLength="1986.69" waitingTime="18.50" waitingCount="1" stopTime="0.00" timeLoss="35.02" rerouteNo="1" devices="tripinfo_car_s2e_98 routing_car_s2e_98" vType="Car" speedFactor="1.16" vaporized=""/>
    <tripinfo id="car_n2w_102" depart="102.00" departLane="n2sep_1" departPos="3.60" departPosLat="0.00" departSpeed="13.90" departDelay="0.00" arrival="259.60" arrivalLane="c2w_1" arrivalPos="990.00" arrivalPosLat="0.00" arrivalSpeed="14.15" duration="157.60" routeLength="1986.69" waitingTime="6.15" waitingCount="1" stopTime="0.00" timeLoss="16.49" rerouteNo="1" devices="tripinfo_car_n2w_102 routing_car_n2w_102" vType="Car" speedFactor="1.02" vaporized=""/>
    <tripinfo id="car_n2w_110" depart="110.00" departLane="n2sep_1" departPos="3.60" departPosLat="0.00" departSpeed="13.90" departDelay="0.00" arrival="262.15" arrivalLane="c2w_1" arrivalPos="990.00" arrivalPosLat="0.00" arrivalSpeed="14.94" duration="152.15" routeLength="1986.69" waitingTime="3.25" waitingCount="1" stopTime="0.00" timeLoss="20.12" rerouteNo="1" devices="tripinfo_car_n2w_110 routing_car_n2w_110" vType="Car" speedFactor="1.09" vaporized=""/>
    <tripinfo id="car_n2e_111" depart="111.35" departLane="n2sep_1" departPos="3.60" departPosLat="0.00" departSpeed="13.90" departDelay="0.35" arrival="267.55" arrivalLane="c2e_1" arrivalPos="990.00" arrivalPosLat="0.00" arrivalSpeed="14.04" duration="156.20" routeLength="1996.47" waitingTime="4.55" waitingCount="1" stopTime="0.00" timeLoss="13.30" rerouteNo="1" devices="tripinfo_car_n2e_111 routing_car_n2e_111" vType="Car" speedFactor="1.01" vaporized=""/>
    <tripinfo id="car_n2w_123" depart="123.00" departLane="n2sep_1" departPos="3.60" departPosLat="0.00" departSpeed="13.90" departDelay="0.00" arrival="270.85" arrivalLane="c2w_1" arrivalPos="990.00" arrivalPosLat="0.00" arrivalSpeed="13.94" duration="147.85" routeLength="1986.69" waitingTime="0.00" waitingCount="0" stopTime="0.00" timeLoss="4.64" rerouteNo="1" devices="tripinfo_car_n2w_123 routing_car_n2w_123" vType="Car" speedFactor="1.00" vaporized=""/>
    <tripinfo id="car_n2e_117" depart="117.00" departLane="n2sep_1" departPos="3.60" departPosLat="0.00" departSpeed="13.90" departDelay="0.00" arrival="272.20" arrivalLane="c2e_1" arrivalPos="990.00" arrivalPosLat="0.00" arrivalSpeed="13.89" duration="155.20" routeLength="1996.47" waitingTime="0.00" waitingCount="0" stopTime="0.00" timeLoss="10.88" rerouteNo="1" devices="tripinfo_car_n2e_117 routing_car_n2e_117" vType="Car" speedFactor="1.00" vaporized=""/>
    <tripinfo id="car_s2w_108" depart="108.00" departLane="s2sep_1" departPos="3.60" departPosLat="0.00" departSpeed="13.90" departDelay="0.00" arrival="274.15" arrivalLane="c2w_1" arrivalPos="990.00" arrivalPosLat="0.00" arrivalSpeed="14.37" duration="166.15" routeLength="1996.47" waitingTime="14.00" waitingCount="2" stopTime="0.00" timeLoss="27.07" rerouteNo="1" devices="tripinfo_car_s2w_108 routing_car_s2w_108" vType="Car" speedFactor="1.04" vaporized=""/>
    <tripinfo id="car_n2e_129" depart="129.00" departLane="n2sep_1" departPos="3.60" departPosLat="0.00" departSpeed="13.90" departDelay="0.00" arrival="277.95" arrivalLane="c2e_1" arrivalPos="990.00" arrivalPosLat="0.00" arrivalSpeed="13.90" duration="148.95" routeLength="1996.47" waitingTime="0.00" waitingCount="0" stopTime="0.00" timeLoss="4.61" rerouteNo="1" devices="tripinfo_car_n2e_129 routing_car_n2e_129" vType="Car" speedFactor="1.00" vaporized=""/>
    <tripinfo id="car_s2w_115" depart="115.00" departLane="s2sep_1" departPos="3.60" departPosLat="0.00" departSpeed="13.90" departDelay="0.00" arrival="278.55" arrivalLane="c2w_1" arrivalPos="990.00" arrivalPosLat="0.00" arrivalSpeed="13.89" duration="163.55" routeLength="1996.47" waitingTime="8.70" waitingCount="1" stopTime="0.00" timeLoss="19.19" rerouteNo="1" devices="tripinfo_car_s2w_115 routing_car_s2w_115" vType="Car" speedFactor="1.00" vaporized=""/>
    <tripinfo id="car_s2w_121" depart="121.00" departLane="s2sep_1" departPos="3.60" departPosLat="0.00" departSpeed="13.90" departDelay="0.00" arrival="280.65" arrivalLane="c2w_1" arrivalPos="990.00" arrivalPosLat="0.00" arrivalSpeed="14.83" duration="159.65" routeLength="1996.47" waitingTime="6.10" waitingCount="1" stopTime="0.00" timeLoss="27.96" rerouteNo="1" devices="tripinfo_car_s2w_121 routing_car_s2w_121" vType="Car" speedFactor="1.10" vaporized=""/>
    <tripinfo id="car_n2w_139" depart="139.45" departLane="n2sep_1" departPos="3.60" departPosLat="0.00" departSpeed="13.90" departDelay="0.45" arrival="282.50" arrivalLane="c2w_1" arrivalPos="990.00" arrivalPosLat="0.00" arrivalSpeed="15.53" duration="143.05" routeLength="1986.69" waitingTime="0.00" waitingCount="0" stopTime="0.00" timeLoss="21.14" rerouteNo="1" devices="tripinfo_car_n2w_139 routing_car_n2w_139" vType="Car" speedFactor="1.18" vaporized=""/>
    <tripinfo id="car_s2n_144" depart="144.00" departLane="s2sep_1" departPos="3.60" departPosLat="0.00" departSpeed="13.90" departDelay="0.00" arrival="284.60" arrivalLane="c2n_1" arrivalPos="990.00" arrivalPosLat="0.00" arrivalSpeed="14.22" duration="140.60" routeLength="1997.01" waitingTime="0.00" waitingCount="0" stopTime="0.00" timeLoss="0.12" rerouteNo="1" devices="tripinfo_car_s2n_144 routing_car_s2n_144" vType="Car" speedFactor="1.02" vaporized=""/>
    <tripinfo id="car_n2e_138" depart="138.00" departLane="n2sep_1" departPos="3.60" departPosLat="0.00" departSpeed="13.90" departDelay="0.00" arrival="288.65" arrivalLane="c2e_1" arrivalPos="990.00" arrivalPosLat="0.00" arrivalSpeed="14.12" duration="150.65" routeLength="1996.47" waitingTime="1.25" waitingCount="1" stopTime="0.00" timeLoss="8.54" rerouteNo="1" devices="tripinfo_car_n2e_138 routing_car_n2e_138" vType="Car" speedFactor="1.02" vaporized=""/>
    <tripinfo id="car_n2e_144" depart="144.00" departLane="n2sep_1" departPos="3.60" departPosLat="0.00" departSpeed="13.90" departDelay="0.00" arrival="293.65" arrivalLane="c2e_1" arrivalPos="990.00" arrivalPosLat="0.00" arrivalSpeed="14.20" duration="149.65" routeLength="1996.47" waitingTime="0.00" waitingCount="0" stopTime="0.00" timeLoss="8.46" rerouteNo="1" devices="tripinfo_car_n2e_144 routing_car_n2e_144" vType="Car" speedFactor="1.02" vaporized=""/>
    <tripinfo id="car_e2w_108" depart="108.00" departLane="e2sep_1" departPos="3.60" departPosLat="0.00" departSpeed="13.90" departDelay="0.00" arrival="297.00" arrivalLane="c2w_1" arrivalPos="990.00" arrivalPosLat="0.00" arrivalSpeed="15.18" duration="189.00" routeLength="1997.01" waitingTime="47.70" waitingCount="1" stopTime="0.00" timeLoss="57.41" rerouteNo="1" devices="tripinfo_car_e2w_108 routing_car_e2w_108" vType="Car" speedFactor="1.09" vaporized=""/>
    <tripinfo id="car_n2e_150" depart="150.00" departLane="n2sep_1" departPos="3.60" departPosLat="0.00" departSpeed="13.90" departDelay="0.00" arrival="298.05" arrivalLane="c2e_1" arrivalPos="990.00" arrivalPosLat="0.00" arrivalSpeed="14.16" duration="148.05" routeLength="1996.47" waitingTime="0.00" waitingCount="0" stopTime="0.00" timeLoss="6.52" rerouteNo="1" devices="tripinfo_car_n2e_150 routing_car_n2e_150" vType="Car" speedFactor="1.02" vaporized=""/>
    <tripinfo id="car_e2n_100" depart="100.00" departLane="e2sep_1" departPos="3.60" departPosLat="0.00" departSpeed="13.90" departDelay="0.00" arrival="298.65" arrivalLane="c2n_1" arrivalPos="990.00" arrivalPosLat="0.00" arrivalSpeed="14.32" duration="198.65" routeLength="1986.69" waitingTime="49.60" waitingCount="1" stopTime="0.00" timeLoss="59.23" rerouteNo="1" devices="tripinfo_car_e2n_100 routing_car_e2n_100" vType="Car" speedFactor="1.03" vaporized=""/>
    <tripinfo id="car_e2n_130" depart="130.50" departLane="e2sep_1" departPos="3.60" departPosLat="0.00" departSpeed="13.90" departDelay="0.50" arrival="300.85" arrivalLane="c2n_1" arrivalPos="990.00" arrivalPosLat="0.00" arrivalSpeed="15.49" duration="170.35" routeLength="1986.69" waitingTime="20.65" waitingCount="1" stopTime="0.00" timeLoss="44.60" rerouteNo="1" devices="tripinfo_car_e2n_130 routing_car_e2n_130" vType="Car" speedFactor="1.14" vaporized=""/>
    <tripinfo id="car_w2e_110" depart="110.00" departLane="w2sep_1" departPos="3.60" departPosLat="0.00" departSpeed="13.90" departDelay="0.00" arrival="301.15" arrivalLane="c2e_1" arrivalPos="990.00" arrivalPosLat="0.00" arrivalSpeed="14.44" duration="191.15" routeLength="1997.01" waitingTime="42.90" waitingCount="1" stopTime="0.00" timeLoss="53.45" rerouteNo="1" devices="tripinfo_car_w2e_110 routing_car_w2e_110" vType="Car" speedFactor="1.04" vaporized=""/>
    <tripinfo id="car_e2n_134" depart="134.00" departLane="e2sep_1" departPos="3.60" departPosLat="0.00" departSpeed="13.90" departDelay="0.00" arrival="303.65" arrivalLane="c2n_1" arrivalPos="990.00" arrivalPosLat="0.00" arrivalSpeed="15.60" duration="169.65" routeLength="1986.69" waitingTime="18.00" waitingCount="1" stopTime="0.00" timeLoss="42.71" rerouteNo="1" devices="tripinfo_car_e2n_134 routing_car_e2n_134" vType="Car" speedFactor="1.13" vaporized=""/>
    <tripinfo id="car_w2s_121" depart="122.55" departLane="w2sep_1" departPos="3.60" departPosLat="0.00" departSpeed="13.90" departDelay="1.55" arrival="304.10" arrivalLane="c2s_1" arrivalPos="990.00" arrivalPosLat="0.00" arrivalSpeed="14.13" duration="181.55" routeLength="1986.69" waitingTime="26.05" waitingCount="1" stopTime="0.00" timeLoss="40.26" rerouteNo="1" devices="tripinfo_car_w2s_121 routing_car_w2s_121" vType="Car" speedFactor="1.02" vaporized=""/>
    <tripinfo id="car_w2e_117" depart="117.00" departLane="w2sep_1" departPos="3.60" departPosLat="0.00" departSpeed="13.90" departDelay="0.00" arrival="305.45" arrivalLane="c2e_1" arrivalPos="990.00" arrivalPosLat="0.00" arrivalSpeed="13.89" duration="188.45" routeLength="1997.01" waitingTime="33.80" waitingCount="1" stopTime="0.00" timeLoss="44.76" rerouteNo="1" devices="tripinfo_car_w2e_117 routing_car_w2e_117" vType="Car" speedFactor="1.00" vaporized=""/>
    <tripinfo id="car_e2w_131" depart="132.15" departLane="e2sep_1" departPos="3.60" departPosLat="0.00" departSpeed="13.90" departDelay="1.15" arrival="305.90" arrivalLane="c2w_1" arrivalPos="990.00" arrivalPosLat="0.00" arrivalSpeed="14.23" duration="173.75" routeLength="1997.01" waitingTime="18.75" waitingCount="1" stopTime="0.00" timeLoss="33.37" rerouteNo="1" devices="tripinfo_car_e2w_131 routing_car_e2w_131" vType="Car" speedFactor="1.02" vaporized=""/>
    <tripinfo id="car_w2e_135" depart="135.00" departLane="w2sep_1" departPos="3.60" departPosLat="0.00" departSpeed="13.90" departDelay="0.00" arrival="307.70" arrivalLane="c2e_1" arrivalPos="990.00" arrivalPosLat="0.00" arrivalSpeed="14.73" duration="172.70" routeLength="1997.01" waitingTime="23.10" waitingCount="1" stopTime="0.00" timeLoss="39.94" rerouteNo="1" devices="tripinfo_car_w2e_135 routing_car_w2e_135" vType="Car" speedFactor="1.08" vaporized=""/>
    <tripinfo id="car_e2w_140" depart="141.90" departLane="e2sep_1" departPos="3.60" departPosLat="0.00" departSpeed="13.90" departDelay="1.90" arrival="307.95" arrivalLane="c2w_1" arrivalPos="990.00" arrivalPosLat="0.00" arrivalSpeed="15.51" duration="166.05" routeLength="1997.01" waitingTime="10.10" waitingCount="1" stopTime="0.00" timeLoss="41.56" rerouteNo="1" devices="tripinfo_car_e2w_140 routing_car_e2w_140" vType="Car" speedFactor="1.15" vaporized=""/>
    <tripinfo id="car_w2s_143" depart="143.00" departLane="w2sep_1" departPos="3.60" departPosLat="0.00" departSpeed="13.90" departDelay="0.00" arrival="309.60" arrivalLane="c2s_1" arrivalPos="990.00" arrivalPosLat="0.00" arrivalSpeed="14.45" duration="166.60" routeLength="1986.69" waitingTime="15.10" waitingCount="1" stopTime="0.00" timeLoss="28.46" rerouteNo="1" devices="tripinfo_car_w2s_143 routing_car_w2s_143" vType="Car" speedFactor="1.04" vaporized=""/>
    <tripinfo id="car_w2e_138" depart="138.00" departLane="w2sep_1" departPos="3.60" departPosLat="0.00" departSpeed="13.90" departDelay="0.00" arrival="309.75" arrivalLane="c2e_1" arrivalPos="990.00" arrivalPosLat="0.00" arrivalSpeed="15.09" duration="171.75" routeLength="1997.01" waitingTime="21.55" waitingCount="1" stopTime="0.00" timeLoss="43.36" rerouteNo="1" devices="tripinfo_car_w2e_138 routing_car_w2e_138" vType="Car" speedFactor="1.12" vaporized=""/>
    <tripinfo id="car_e2w_141" depart="143.65" departLane="e2sep_1" departPos="3.60" departPosLat="0.00" departSpeed="13.90" departDelay="2.65" arrival="309.95" arrivalLane="c2w_1" arrivalPos="990.00" arrivalPosLat="0.00" arrivalSpeed="15.74" duration="166.30" routeLength="1997.01" waitingTime="9.50" waitingCount="1" stopTime="0.00" timeLoss="43.67" rerouteNo="1" devices="tripinfo_car_e2w_141 routing_car_e2w_141" vType="Car" speedFactor="1.17" vaporized=""/>
    <tripinfo id="car_w2s_160" depart="160.00" departLane="w2sep_1" departPos="3.60" departPosLat="0.00" departSpeed="13.90" departDelay="0.00" arrival="313.90" arrivalLane="c2s_1" arrivalPos="990.00" arrivalPosLat="0.00" arrivalSpeed="14.34" duration="153.90" routeLength="1986.69" waitingTime="0.00" waitingCount="0" stopTime="0.00" timeLoss="14.73" rerouteNo="1" devices="tripinfo_car_w2s_160 routing_car_w2s_160" vType="Car" speedFactor="1.03" vaporized=""/>
    <tripinfo id="car_w2e_172" depart="172.00" departLane="w2sep_1" departPos="3.60" departPosLat="0.00" departSpeed="13.90" departDelay="0.00" arrival="315.30" arrivalLane="c2e_1" arrivalPos="990.00" arrivalPosLat="0.00" arrivalSpeed="14.13" duration="143.30" routeLength="1997.01" waitingTime="0.00" waitingCount="0" stopTime="0.00" timeLoss="2.02" rerouteNo="1" devices="tripinfo_car_w2e_172 routing_car_w2e_172" vType="Car" speedFactor="1.02" vaporized=""/>
    <tripinfo id="car_e2w_171" depart="171.40" departLane="e2sep_1" departPos="3.60" departPosLat="0.00" departSpeed="13.90" departDelay="0.40" arrival="318.00" arrivalLane="c2w_1" arrivalPos="990.00" arrivalPosLat="0.00" arrivalSpeed="13.90" duration="146.60" routeLength="1997.01" waitingTime="0.00" waitingCount="0" stopTime="0.00" timeLoss="2.91" rerouteNo="1" devices="tripinfo_car_e2w_171 routing_car_e2w_171" vType="Car" speedFactor="1.00" vaporized=""/>
    <tripinfo id="car_e2s_124" depart="124.00" departLane="e2sep_1" departPos="3.60" departPosLat="0.00" departSpeed="13.90" departDelay="0.00" arrival="319.95" arrivalLane="c2s_1" arrivalPos="990.00" arrivalPosLat="0.00" arrivalSpeed="13.90" duration="195.95" routeLength="1996.47" waitingTime="39.85" waitingCount="2" stopTime="0.00" timeLoss="51.62" rerouteNo="1" devices="tripinfo_car_e2s_124 routing_car_e2s_124" vType="Car" speedFactor="1.00" vaporized=""/>
    <tripinfo id="car_e2w_172" depart="173.20" departLane="e2sep_1" departPos="3.60" departPosLat="0.00" departSpeed="13.90" departDelay="1.20" arrival="321.30" arrivalLane="c2w_1" arrivalPos="990.00" arrivalPosLat="0.00" arrivalSpeed="14.27" duration="148.10" routeLength="1997.01" waitingTime="0.00" waitingCount="0" stopTime="0.00" timeLoss="8.65" rerouteNo="1" devices="tripinfo_car_e2w_172 routing_car_e2w_172" vType="Car" speedFactor="1.03" vaporized=""/>
    <tripinfo id="car_w2n_119" depart="119.00" departLane="w2sep_1" departPos="3.60" departPosLat="0.00" departSpeed="13.90" departDelay="0.00" arrival="323.75" arrivalLane="c2n_1" arrivalPos="990.00" arrivalPosLat="0.00" arrivalSpeed="13.90" duration="204.75" routeLength="1996.47" waitingTime="47.25" waitingCount="3" stopTime="0.00" timeLoss="60.44" rerouteNo="1" devices="tripinfo_car_w2n_119 routing_car_w2n_119" vType="Car" speedFactor="1.00" vaporized=""/>
    <tripinfo id="car_e2n_186" depart="186.00" departLane="e2sep_1" departPos="3.60" departPosLat="0.00" departSpeed="13.90" departDelay="0.00" arrival="326.40" arrivalLane="c2n_1" arrivalPos="990.00" arrivalPosLat="0.00" arrivalSpeed="15.01" duration="140.40" routeLength="1986.69" waitingTime="0.00" waitingCount="0" stopTime="0.00" timeLoss="8.81" rerouteNo="1" devices="tripinfo_car_e2n_186 routing_car_e2n_186" vType="Car" speedFactor="1.09" vaporized=""/>
    <tripinfo id="car_w2s_183" depart="183.00" departLane="w2sep_1" departPos="3.60" departPosLat="0.00" departSpeed="13.90" departDelay="0.00" arrival="327.65" arrivalLane="c2s_1" arrivalPos="990.00" arrivalPosLat="0.00" arrivalSpeed="14.21" duration="144.65" routeLength="1986.69" waitingTime="0.00" waitingCount="0" stopTime="0.00" timeLoss="4.06" rerouteNo="1" devices="tripinfo_car_w2s_183 routing_car_w2s_183" vType="Car" speedFactor="1.02" vaporized=""/>
    <tripinfo id="car_w2n_121" depart="121.00" departLane="w2sep_1" departPos="3.60" departPosLat="0.00" departSpeed="13.90" departDelay="0.00" arrival="328.45" arrivalLane="c2n_1" arrivalPos="990.00" arrivalPosLat="0.00" arrivalSpeed="15.73" duration="207.45" routeLength="1996.47" waitingTime="49.45" waitingCount="3" stopTime="0.00" timeLoss="83.98" rerouteNo="1" devices="tripinfo_car_w2n_121 routing_car_w2n_121" vType="Car" speedFactor="1.17" vaporized=""/>
    <tripinfo id="bus_e2s_129" depart="129.00" departLane="e2sep_1" departPos="12.10" departPosLat="0.00" departSpeed="13.90" departDelay="0.00" arrival="335.85" arrivalLane="c2s_1" arrivalPos="990.00" arrivalPosLat="0.00" arrivalSpeed="13.90" duration="206.85" routeLength="1987.97" waitingTime="42.95" waitingCount="3" stopTime="0.00" timeLoss="63.13" rerouteNo="1" devices="tripinfo_bus_e2s_129 routing_bus_e2s_129" vType="Bus" speedFactor="1.00" vaporized=""/>
    <tripinfo id="car_w2n_197" depart="197.00" departLane="w2sep_1" departPos="3.60" departPosLat="0.00" departSpeed="13.90" departDelay="0.00" arrival="339.05" arrivalLane="c2n_1" arrivalPos="990.00" arrivalPosLat="0.00" arrivalSpeed="14.50" duration="142.05" routeLength="1996.47" waitingTime="0.00" waitingCount="0" stopTime="0.00" timeLoss="3.70" rerouteNo="1" devices="tripinfo_car_w2n_197 routing_car_w2n_197" vType="Car" speedFactor="1.04" vaporized=""/>
    <tripinfo id="car_e2s_138" depart="138.00" departLane="e2sep_1" departPos="3.60" departPosLat="0.00" departSpeed="13.90" departDelay="0.00" arrival="340.55" arrivalLane="c2s_1" arrivalPos="990.00" arrivalPosLat="0.00" arrivalSpeed="13.89" duration="202.55" routeLength="1996.47" waitingTime="30.65" waitingCount="3" stopTime="0.00" timeLoss="58.22" rerouteNo="1" devices="tripinfo_car_e2s_138 routing_car_e2s_138" vType="Car" speedFactor="1.00" vaporized=""/>
    <tripinfo id="bus_e2s_138" depart="140.20" departLane="e2sep_1" departPos="12.10" departPosLat="0.00" departSpeed="13.90" departDelay="2.20" arrival="344.25" arrivalLane="c2s_1" arrivalPos="990.00" arrivalPosLat="0.00" arrivalSpeed="13.79" duration="204.05" routeLength="1987.97" waitingTime="30.25" waitingCount="3" stopTime="0.00" timeLoss="60.32" rerouteNo="1" devices="tripinfo_bus_e2s_138 routing_bus_e2s_138" vType="Bus" speedFactor="1.00" vaporized=""/>
    <tripinfo id="car_s2n_146" depart="146.00" departLane="s2sep_1" departPos="3.60" departPosLat="0.00" departSpeed="13.90" departDelay="0.00" arrival="346.40" arrivalLane="c2n_1" arrivalPos="990.00" arrivalPosLat="0.00" arrivalSpeed="13.90" duration="200.40" routeLength="1997.01" waitingTime="47.50" waitingCount="1" stopTime="0.00" timeLoss="56.70" rerouteNo="1" devices="tripinfo_car_s2n_146 routing_car_s2n_146" vType="Car" speedFactor="1.00" vaporized=""/>
    <tripinfo id="car_n2s_141" depart="141.10" departLane="n2sep_1" departPos="3.60" departPosLat="0.00" departSpeed="13.90" departDelay="0.10" arrival="348.15" arrivalLane="c2s_1" arrivalPos="990.00" arrivalPosLat="0.00" arrivalSpeed="13.94" duration="207.05" routeLength="1997.01" waitingTime="51.85" waitingCount="1" stopTime="0.00" timeLoss="64.12" rerouteNo="1" devices="tripinfo_car_n2s_141 routing_car_n2s_141" vType="Car" speedFactor="1.01" vaporized=""/>
    <tripinfo id="car_s2n_152" depart="152.00" departLane="s2sep_1" departPos="3.60" departPosLat="0.00" departSpeed="13.90" departDelay="0.00" arrival="349.05" arrivalLane="c2n_1" arrivalPos="990.00" arrivalPosLat="0.00" arrivalSpeed="14.54" duration="197.05" routeLength="1997.01" waitingTime="45.75" waitingCount="1" stopTime="0.00" timeLoss="60.96" rerouteNo="1" devices="tripinfo_car_s2n_152 routing_car_s2n_152" vType="Car" speedFactor="1.06" vaporized=""/>
    <tripinfo id="car_n2w_166" depart="166.00" departLane="n2sep_1" departPos="3.60" departPosLat="0.00" departSpeed="13.90" departDelay="0.00" arrival="349.70" arrivalLane="c2w_1" arrivalPos="990.00" arrivalPosLat="0.00" arrivalSpeed="14.00" duration="183.70" routeLength="1986.69" waitingTime="30.60" waitingCount="1" stopTime="0.00" timeLoss="41.08" rerouteNo="1" devices="tripinfo_car_n2w_166 routing_car_n2w_166" vType="Car" speedFactor="1.01" vaporized=""/>
    <tripinfo id="car_n2e_163" depart="163.00" departLane="n2sep_1" departPos="3.60" departPosLat="0.00" departSpeed="13.90" departDelay="0.00" arrival="350.40" arrivalLane="c2e_1" arrivalPos="990.00" arrivalPosLat="0.00" arrivalSpeed="15.32" duration="187.40" routeLength="1996.47" waitingTime="40.65" waitingCount="2" stopTime="0.00" timeLoss="56.46" rerouteNo="1" devices="tripinfo_car_n2e_163 routing_car_n2e_163" vType="Car" speedFactor="1.10" vaporized=""/>
    <tripinfo id="car_n2s_159" depart="159.00" departLane="n2sep_1" departPos="3.60" departPosLat="0.00" departSpeed="13.90" departDelay="0.00" arrival="351.50" arrivalLane="c2s_1" arrivalPos="990.00" arrivalPosLat="0.00" arrivalSpeed="13.86" duration="192.50" routeLength="1997.01" waitingTime="36.70" waitingCount="1" stopTime="0.00" timeLoss="48.82" rerouteNo="1" devices="tripinfo_car_n2s_159 routing_car_n2s_159" vType="Car" speedFactor="1.00" vaporized=""/>
    <tripinfo id="bus_s2n_152" depart="153.95" departLane="s2sep_1" departPos="12.10" departPosLat="0.00" departSpeed="13.90" departDelay="1.95" arrival="353.75" arrivalLane="c2n_1" arrivalPos="990.00" arrivalPosLat="0.00" arrivalSpeed="13.86" duration="199.80" routeLength="1988.51" waitingTime="42.80" waitingCount="1" stopTime="0.00" timeLoss="56.72" rerouteNo="1" devices="tripinfo_bus_s2n_152 routing_bus_s2n_152" vType="Bus" speedFactor="1.00" vaporized=""/>
    <tripinfo id="car_n2w_176" depart="176.00" departLane="n2sep_1" departPos="3.60" departPosLat="0.00" departSpeed="13.90" departDelay="0.00" arrival="354.50" arrivalLane="c2w_1" arrivalPos="990.00" arrivalPosLat="0.00" arrivalSpeed="13.89" duration="178.50" routeLength="1986.69" waitingTime="21.95" waitingCount="1" stopTime="0.00" timeLoss="34.84" rerouteNo="1" devices="tripinfo_car_n2w_176 routing_car_n2w_176" vType="Car" speedFactor="1.00" vaporized=""/>
    <tripinfo id="car_n2e_169" depart="169.00" departLane="n2sep_1" departPos="3.60" departPosLat="0.00" departSpeed="13.90" departDelay="0.00" arrival="355.15" arrivalLane="c2e_1" arrivalPos="990.00" arrivalPosLat="0.00" arrivalSpeed="15.10" duration="186.15" routeLength="1996.47" waitingTime="33.05" waitingCount="2" stopTime="0.00" timeLoss="53.39" rerouteNo="1" devices="tripinfo_car_n2e_169 routing_car_n2e_169" vType="Car" speedFactor="1.09" vaporized=""/>
    <tripinfo id="car_s2n_159" depart="159.00" departLane="s2sep_1" departPos="3.60" departPosLat="0.00" departSpeed="13.90" departDelay="0.00" arrival="356.10" arrivalLane="c2n_1" arrivalPos="990.00" arrivalPosLat="0.00" arrivalSpeed="15.69" duration="197.10" routeLength="1997.01" waitingTime="41.60" waitingCount="1" stopTime="0.00" timeLoss="75.27" rerouteNo="1" devices="tripinfo_car_s2n_159 routing_car_s2n_159" vType="Car" speedFactor="1.18" vaporized=""/>
    <tripinfo id="car_n2s_184" depart="184.00" departLane="n2sep_1" departPos="3.60" departPosLat="0.00" departSpeed="13.90" departDelay="0.00" arrival="356.35" arrivalLane="c2s_1" arrivalPos="990.00" arrivalPosLat="0.00" arrivalSpeed="14.13" duration="172.35" routeLength="1997.01" waitingTime="17.25" waitingCount="1" stopTime="0.00" timeLoss="31.04" rerouteNo="1" devices="tripinfo_car_n2s_184 routing_car_n2s_184" vType="Car" speedFactor="1.02" vaporized=""/>
    <tripinfo id="car_n2w_178" depart="178.00" departLane="n2sep_1" departPos="3.60" departPosLat="0.00" departSpeed="13.90" departDelay="0.00" arrival="357.20" arrivalLane="c2w_1" arrivalPos="990.00" arrivalPosLat="0.00" arrivalSpeed="14.37" duration="179.20" routeLength="1986.69" waitingTime="20.70" waitingCount="1" stopTime="0.00" timeLoss="41.43" rerouteNo="1" devices="tripinfo_car_n2w_178 routing_car_n2w_178" vType="Car" speedFactor="1.04" vaporized=""/>
    <tripinfo id="car_n2w_206" depart="206.00" departLane="n2sep_1" departPos="3.60" departPosLat="0.00" departSpeed="13.90" departDelay="0.00" arrival="359.25" arrivalLane="c2w_1" arrivalPos="990.00" arrivalPosLat="0.00" arrivalSpeed="15.09" duration="153.25" routeLength="1986.69" waitingTime="3.05" waitingCount="1" stopTime="0.00" timeLoss="25.15" rerouteNo="1" devices="tripinfo_car_n2w_206 routing_car_n2w_206" vType="Car" speedFactor="1.12" vaporized=""/>
    <tripinfo id="car_s2w_174" depart="174.00" departLane="s2sep_1" departPos="3.60" departPosLat="0.00" departSpeed="13.90" departDelay="0.00" arrival="361.20" arrivalLane="c2w_1" arrivalPos="990.00" arrivalPosLat="0.00" arrivalSpeed="15.35" duration="187.20" routeLength="1996.47" waitingTime="41.65" waitingCount="2" stopTime="0.00" timeLoss="61.45" rerouteNo="1" devices="tripinfo_car_s2w_174 routing_car_s2w_174" vType="Car" speedFactor="1.15" vaporized=""/>
    <tripinfo id="car_s2e_221" depart="221.00" departLane="s2sep_1" departPos="3.60" departPosLat="0.00" departSpeed="13.90" departDelay="0.00" arrival="368.40" arrivalLane="c2e_1" arrivalPos="990.00" arrivalPosLat="0.00" arrivalSpeed="13.90" duration="147.40" routeLength="1986.69" waitingTime="0.00" waitingCount="0" stopTime="0.00" timeLoss="3.72" rerouteNo="1" devices="tripinfo_car_s2e_221 routing_car_s2e_221" vType="Car" speedFactor="1.00" vaporized=""/>
    <tripinfo id="car_n2w_222" depart="222.00" departLane="n2sep_1" departPos="3.60" departPosLat="0.00" departSpeed="13.90" departDelay="0.00" arrival="369.65" arrivalLane="c2w_1" arrivalPos="990.00" arrivalPosLat="0.00" arrivalSpeed="13.90" duration="147.65" routeLength="1986.69" waitingTime="0.00" waitingCount="0" stopTime="0.00" timeLoss="3.98" rerouteNo="1" devices="tripinfo_car_n2w_222 routing_car_n2w_222" vType="Car" speedFactor="1.00" vaporized=""/>
    <tripinfo id="car_s2e_239" depart="239.00" departLane="s2sep_1" departPos="3.60" departPosLat="0.00" departSpeed="13.90" departDelay="0.00" arrival="370.30" arrivalLane="c2e_1" arrivalPos="990.00" arrivalPosLat="0.00" arrivalSpeed="15.50" duration="131.30" routeLength="1986.69" waitingTime="0.00" waitingCount="0" stopTime="0.00" timeLoss="8.41" rerouteNo="1" devices="tripinfo_car_s2e_239 routing_car_s2e_239" vType="Car" speedFactor="1.17" vaporized=""/>
    <tripinfo id="car_n2w_223" depart="223.45" departLane="n2sep_1" departPos="3.60" departPosLat="0.00" departSpeed="13.90" departDelay="0.45" arrival="372.15" arrivalLane="c2w_1" arrivalPos="990.00" arrivalPosLat="0.00" arrivalSpeed="14.72" duration="148.70" routeLength="1986.69" waitingTime="0.00" waitingCount="0" stopTime="0.00" timeLoss="14.79" rerouteNo="1" devices="tripinfo_car_n2w_223 routing_car_n2w_223" vType="Car" speedFactor="1.07" vaporized=""/>
    <tripinfo id="car_s2w_177" depart="177.00" departLane="s2sep_1" departPos="3.60" departPosLat="0.00" departSpeed="13.90" departDelay="0.00" arrival="376.70" arrivalLane="c2w_1" arrivalPos="990.00" arrivalPosLat="0.00" arrivalSpeed="13.92" duration="199.70" routeLength="1996.47" waitingTime="37.45" waitingCount="3" stopTime="0.00" timeLoss="55.60" rerouteNo="1" devices="tripinfo_car_s2w_177 routing_car_s2w_177" vType="Car" speedFactor="1.00" vaporized=""/>
    <tripinfo id="car_w2e_197" depart="198.40" departLane="w2sep_1" departPos="3.60" departPosLat="0.00" departSpeed="13.90" departDelay="1.40" arrival="385.00" arrivalLane="c2e_1" arrivalPos="990.00" arrivalPosLat="0.00" arrivalSpeed="15.16" duration="186.60" routeLength="1997.01" waitingTime="43.15" waitingCount="1" stopTime="0.00" timeLoss="54.87" rerouteNo="1" devices="tripinfo_car_w2e_197 routing_car_w2e_197" vType="Car" speedFactor="1.09" vaporized=""/>
    <tripinfo id="car_e2w_211" depart="211.00" departLane="e2sep_1" departPos="3.60" departPosLat="0.00" departSpeed="13.90" departDelay="0.00" arrival="386.65" arrivalLane="c2w_1" arrivalPos="990.00" arrivalPosLat="0.00" arrivalSpeed="14.80" duration="175.65" routeLength="1997.01" waitingTime="32.50" waitingCount="1" stopTime="0.00" timeLoss="40.72" rerouteNo="1" devices="tripinfo_car_e2w_211 routing_car_e2w_211" vType="Car" speedFactor="1.07" vaporized=""/>
    <tripinfo id="car_w2s_203" depart="203.75" departLane="w2sep_1" departPos="3.60" departPosLat="0.00" departSpeed="13.90" departDelay="0.75" arrival="389.50" arrivalLane="c2s_1" arrivalPos="990.00" arrivalPosLat="0.00" arrivalSpeed="15.12" duration="185.75" routeLength="1986.69" waitingTime="35.30" waitingCount="1" stopTime="0.00" timeLoss="53.72" rerouteNo="1" devices="tripinfo_car_w2s_203 routing_car_w2s_203" vType="Car" speedFactor="1.09" vaporized=""/>
    <tripinfo id="car_w2e_199" depart="201.90" departLane="w2sep_1" departPos="3.60" departPosLat="0.00" departSpeed="13.90" departDelay="2.90" arrival="393.00" arrivalLane="c2e_1" arrivalPos="990.00" arrivalPosLat="0.00" arrivalSpeed="14.04" duration="191.10" routeLength="1997.01" waitingTime="36.20" waitingCount="1" stopTime="0.00" timeLoss="48.82" rerouteNo="1" devices="tripinfo_car_w2e_199 routing_car_w2e_199" vType="Car" speedFactor="1.01" vaporized=""/>
    <tripinfo id="car_e2n_234" depart="234.00" departLane="e2sep_1" departPos="3.60" departPosLat="0.00" departSpeed="13.90" departDelay="0.00" arrival="395.25" arrivalLane="c2n_1" arrivalPos="990.00" arrivalPosLat="0.00" arrivalSpeed="14.38" duration="161.25" routeLength="1986.69" waitingTime="11.05" waitingCount="1" stopTime="0.00" timeLoss="22.36" rerouteNo="1" devices="tripinfo_car_e2n_234 routing_car_e2n_234" vType="Car" speedFactor="1.03" vaporized=""/>
    <tripinfo id="bus_e2w_211" depart="212.95" departLane="e2sep_1" departPos="12.10" departPosLat="0.00" departSpeed="13.90" departDelay="1.95" arrival="396.10" arrivalLane="c2w_1" arrivalPos="990.00" arrivalPosLat="0.00" arrivalSpeed="13.90" duration="183.15" routeLength="1988.51" waitingTime="27.80" waitingCount="1" stopTime="0.00" timeLoss="40.09" rerouteNo="1" devices="tripinfo_bus_e2w_211 routing_bus_e2w_211" vType="Bus" speedFactor="1.00" vaporized=""/>
    <tripinfo id="car_w2e_230" depart="230.00" departLane="w2sep_1" departPos="3.60" departPosLat="0.00" departSpeed="13.90" departDelay="0.00" arrival="397.50" arrivalLane="c2e_1" arrivalPos="990.00" arrivalPosLat="0.00" arrivalSpeed="14.08" duration="167.50" routeLength="1997.01" waitingTime="13.85" waitingCount="1" stopTime="0.00" timeLoss="25.78" rerouteNo="1" devices="tripinfo_car_w2e_230 routing_car_w2e_230" vType="Car" speedFactor="1.01" vaporized=""/>
    <tripinfo id="car_e2w_235" depart="235.40" departLane="e2sep_1" departPos="3.60" departPosLat="0.00" departSpeed="13.90" departDelay="0.40" arrival="399.30" arrivalLane="c2w_1" arrivalPos="990.00" arrivalPosLat="0.00" arrivalSpeed="14.70" duration="163.90" routeLength="1997.01" waitingTime="9.50" waitingCount="1" stopTime="0.00" timeLoss="28.98" rerouteNo="1" devices="tripinfo_car_e2w_235 routing_car_e2w_235" vType="Car" speedFactor="1.06" vaporized=""/>
    <tripinfo id="car_w2e_241" depart="242.45" departLane="w2sep_1" departPos="3.60" departPosLat="0.00" departSpeed="13.90" departDelay="1.45" arrival="399.70" arrivalLane="c2e_1" arrivalPos="990.00" arrivalPosLat="0.00" arrivalSpeed="14.94" duration="157.25" routeLength="1997.01" waitingTime="2.40" waitingCount="1" stopTime="0.00" timeLoss="26.47" rerouteNo="1" devices="tripinfo_car_w2e_241 routing_car_w2e_241" vType="Car" speedFactor="1.10" vaporized=""/>
    <tripinfo id="car_e2n_239" depart="239.00" departLane="e2sep_1" departPos="3.60" departPosLat="0.00" departSpeed="13.90" departDelay="0.00" arrival="402.45" arrivalLane="c2n_1" arrivalPos="990.00" arrivalPosLat="0.00" arrivalSpeed="13.90" duration="163.45" routeLength="1986.69" waitingTime="5.35" waitingCount="1" stopTime="0.00" timeLoss="19.78" rerouteNo="1" devices="tripinfo_car_e2n_239 routing_car_e2n_239" vType="Car" speedFactor="1.00" vaporized=""/>
    <tripinfo id="car_w2e_243" depart="244.15" departLane="w2sep_1" departPos="3.60" departPosLat="0.00" departSpeed="13.90" departDelay="1.15" arrival="403.50" arrivalLane="c2e_1" arrivalPos="990.00" arrivalPosLat="0.00" arrivalSpeed="14.01" duration="159.35" routeLength="1997.01" waitingTime="0.00" waitingCount="0" stopTime="0.00" timeLoss="16.94" rerouteNo="1" devices="tripinfo_car_w2e_243 routing_car_w2e_243" vType="Car" speedFactor="1.01" vaporized=""/>
    <tripinfo id="car_e2s_170" depart="170.00" departLane="e2sep_1" departPos="3.60" departPosLat="0.00" departSpeed="13.90" departDelay="0.00" arrival="404.80" arrivalLane="c2s_1" arrivalPos="990.00" arrivalPosLat="0.00" arrivalSpeed="14.38" duration="234.80" routeLength="1996.47" waitingTime="69.00" waitingCount="4" stopTime="0.00" timeLoss="95.29" rerouteNo="1" devices="tripinfo_car_e2s_170 routing_car_e2s_170" vType="Car" speedFactor="1.03" vaporized=""/>
    <tripinfo id="car_w2n_199" depart="200.10" departLane="w2sep_1" departPos="3.60" departPosLat="0.00" departSpeed="13.90" departDelay="1.10" arrival="405.20" arrivalLane="c2n_1" arrivalPos="990.00" arrivalPosLat="0.00" arrivalSpeed="14.56" duration="205.10" routeLength="1996.47" waitingTime="49.60" waitingCount="2" stopTime="0.00" timeLoss="68.50" rerouteNo="1" devices="tripinfo_car_w2n_199 routing_car_w2n_199" vType="Car" speedFactor="1.06" vaporized=""/>
    <tripinfo id="car_w2e_249" depart="249.00" departLane="w2sep_1" departPos="3.60" departPosLat="0.00" departSpeed="13.90" departDelay="0.00" arrival="405.65" arrivalLane="c2e_1" arrivalPos="990.00" arrivalPosLat="0.00" arrivalSpeed="14.86" duration="156.65" routeLength="1997.01" waitingTime="0.00" waitingCount="0" stopTime="0.00" timeLoss="25.59" rerouteNo="1" devices="tripinfo_car_w2e_249 routing_car_w2e_249" vType="Car" speedFactor="1.10" vaporized=""/>
    <tripinfo id="car_w2e_262" depart="262.00" departLane="w2sep_1" departPos="3.60" departPosLat="0.00" departSpeed="13.90" departDelay="0.00" arrival="408.00" arrivalLane="c2e_1" arrivalPos="990.00" arrivalPosLat="0.00" arrivalSpeed="14.66" duration="146.00" routeLength="1997.01" waitingTime="0.00" waitingCount="0" stopTime="0.00" timeLoss="11.83" rerouteNo="1" devices="tripinfo_car_w2e_262 routing_car_w2e_262" vType="Car" speedFactor="1.07" vaporized=""/>
    <tripinfo id="amb_w2e_300" depart="300.00" departLane="w2sep_1" departPos="6.60" departPosLat="0.00" departSpeed="13.90" departDelay="0.00" arrival="410.00" arrivalLane="c2e_1" arrivalPos="990.00" arrivalPosLat="-0.95" arrivalSpeed="19.30" duration="110.00" routeLength="1994.01" waitingTime="0.00" waitingCount="0" stopTime="0.00" timeLoss="14.34" rerouteNo="1" devices="tripinfo_amb_w2e_300 routing_amb_w2e_300 bluelight_amb_w2e_300 fcd_amb_w2e_300" vType="Ambulance" speedFactor="1.50" vaporized="">
        <example_device customValue1="0.00" customValue2="-1.00"/>
    </tripinfo>
    <tripinfo id="car_e2s_180" depart="180.00" departLane="e2sep_1" departPos="3.60" departPosLat="0.00" departSpeed="13.90" departDelay="0.00" arrival="410.30" arrivalLane="c2s_1" arrivalPos="990.00" arrivalPosLat="0.00" arrivalSpeed="14.00" duration="230.30" routeLength="1996.47" waitingTime="59.95" waitingCount="3" stopTime="0.00" timeLoss="87.01" rerouteNo="1" devices="tripinfo_car_e2s_180 routing_car_e2s_180" vType="Car" speedFactor="1.01" vaporized=""/>
    <tripinfo id="car_e2n_262" depart="262.00" departLane="e2sep_1" departPos="3.60" departPosLat="0.00" departSpeed="13.90" departDelay="0.00" arrival="411.10" arrivalLane="c2n_1" arrivalPos="990.00" arrivalPosLat="0.00" arrivalSpeed="13.90" duration="149.10" routeLength="1986.69" waitingTime="0.00" waitingCount="0" stopTime="0.00" timeLoss="5.44" rerouteNo="1" devices="tripinfo_car_e2n_262 routing_car_e2n_262" vType="Car" speedFactor="1.00" vaporized=""/>
    <tripinfo id="car_e2s_195" depart="195.00" departLane="e2sep_1" departPos="3.60" departPosLat="0.00" departSpeed="13.90" departDelay="0.00" arrival="413.35" arrivalLane="c2s_1" arrivalPos="990.00" arrivalPosLat="0.00" arrivalSpeed="14.35" duration="218.35" routeLength="1996.47" waitingTime="52.00" waitingCount="2" stopTime="0.00" timeLoss="79.27" rerouteNo="1" devices="tripinfo_car_e2s_195 routing_car_e2s_195" vType="Car" speedFactor="1.04" vaporized=""/>
    <tripinfo id="car_w2n_222" depart="222.00" departLane="w2sep_1" departPos="3.60" departPosLat="0.00" departSpeed="13.90" departDelay="0.00" arrival="415.45" arrivalLane="c2n_1" arrivalPos="990.00" arrivalPosLat="0.00" arrivalSpeed="13.89" duration="193.45" routeLength="1996.47" waitingTime="31.10" waitingCount="3" stopTime="0.00" timeLoss="49.10" rerouteNo="1" devices="tripinfo_car_w2n_222 routing_car_w2n_222" vType="Car" speedFactor="1.00" vaporized=""/>
    <tripinfo id="car_e2s_207" depart="207.00" departLane="e2sep_1" departPos="3.60" departPosLat="0.00" departSpeed="13.90" departDelay="0.00" arrival="415.55" arrivalLane="c2s_1" arrivalPos="990.00" arrivalPosLat="0.00" arrivalSpeed="14.92" duration="208.55" routeLength="1996.47" waitingTime="49.80" waitingCount="2" stopTime="0.00" timeLoss="77.00" rerouteNo="1" devices="tripinfo_car_e2s_207 routing_car_e2s_207" vType="Car" speedFactor="1.10" vaporized=""/>
    <tripinfo id="car_w2n_241" depart="241.00" departLane="w2sep_1" departPos="3.60" departPosLat="0.00" departSpeed="13.90" departDelay="0.00" arrival="418.60" arrivalLane="c2n_1" arrivalPos="990.00" arrivalPosLat="0.00" arrivalSpeed="14.08" duration="177.60" routeLength="1996.47" waitingTime="10.85" waitingCount="3" stopTime="0.00" timeLoss="35.64" rerouteNo="1" devices="tripinfo_car_w2n_241 routing_car_w2n_241" vType="Car" speedFactor="1.02" vaporized=""/>
    <tripinfo id="car_w2e_283" depart="283.00" departLane="w2sep_1" departPos="3.60" departPosLat="0.00" departSpeed="13.90" departDelay="0.00" arrival="418.85" arrivalLane="c2e_1" arrivalPos="990.00" arrivalPosLat="1.10" arrivalSpeed="14.75" duration="135.85" routeLength="1997.01" waitingTime="0.00" waitingCount="0" stopTime="0.00" timeLoss="0.42" rerouteNo="1" devices="tripinfo_car_w2e_283 routing_car_w2e_283" vType="Car@car_w2e_283" speedFactor="1.06" vaporized=""/>
    <tripinfo id="car_e2s_212" depart="214.60" departLane="e2sep_1" departPos="3.60" departPosLat="0.00" departSpeed="13.90" departDelay="2.60" arrival="419.40" arrivalLane="c2s_1" arrivalPos="990.00" arrivalPosLat="0.00" arrivalSpeed="13.88" duration="204.80" routeLength="1996.47" waitingTime="33.80" waitingCount="2" stopTime="0.00" timeLoss="60.48" rerouteNo="1" devices="tripinfo_car_e2s_212 routing_car_e2s_212" vType="Car" speedFactor="1.00" vaporized=""/>
    <tripinfo id="car_w2n_288" depart="288.00" departLane="w2sep_1" departPos="3.60" departPosLat="0.00" departSpeed="13.90" departDelay="0.00" arrival="421.15" arrivalLane="c2n_1" arrivalPos="990.00" arrivalPosLat="0.00" arrivalSpeed="15.77" duration="133.15" routeLength="1996.47" waitingTime="0.00" waitingCount="0" stopTime="0.00" timeLoss="7.93" rerouteNo="1" devices="tripinfo_car_w2n_288 routing_car_w2n_288" vType="Car" speedFactor="1.15" vaporized=""/>
    <tripinfo id="car_e2s_255" depart="255.00" departLane="e2sep_1" departPos="3.60" departPosLat="0.00" departSpeed="13.90" departDelay="0.00" arrival="421.20" arrivalLane="c2s_1" arrivalPos="990.00" arrivalPosLat="0.00" arrivalSpeed="15.38" duration="166.20" routeLength="1996.47" waitingTime="7.10" waitingCount="1" stopTime="0.00" timeLoss="43.58" rerouteNo="1" devices="tripinfo_car_e2s_255 routing_car_e2s_255" vType="Car" speedFactor="1.18" vaporized=""/>
    <tripinfo id="car_e2n_288" depart="288.00" departLane="e2sep_1" departPos="3.60" departPosLat="0.00" departSpeed="13.90" departDelay="0.00" arrival="432.15" arrivalLane="c2n_1" arrivalPos="990.00" arrivalPosLat="0.00" arrivalSpeed="14.35" duration="144.15" routeLength="1986.69" waitingTime="0.00" waitingCount="0" stopTime="0.00" timeLoss="4.98" rerouteNo="1" devices="tripinfo_car_e2n_288 routing_car_e2n_288" vType="Car" speedFactor="1.03" vaporized=""/>
    <tripinfo id="car_w2e_289" depart="289.25" departLane="w2sep_1" departPos="3.60" departPosLat="0.00" departSpeed="13.90" departDelay="0.25" arrival="434.10" arrivalLane="c2e_1" arrivalPos="990.00" arrivalPosLat="0.00" arrivalSpeed="13.90" duration="144.85" routeLength="1997.01" waitingTime="0.00" waitingCount="0" stopTime="0.00" timeLoss="1.15" rerouteNo="1" devices="tripinfo_car_w2e_289 routing_car_w2e_289" vType="Car" speedFactor="1.00" vaporized=""/>
    <tripinfo id="car_e2s_258" depart="258.00" departLane="e2sep_1" departPos="3.60" departPosLat="0.00" departSpeed="13.90" departDelay="0.00" arrival="436.50" arrivalLane="c2s_1" arrivalPos="990.00" arrivalPosLat="0.00" arrivalSpeed="13.96" duration="178.50" routeLength="1996.47" waitingTime="18.25" waitingCount="2" stopTime="0.00" timeLoss="34.82" rerouteNo="1" devices="tripinfo_car_e2s_258 routing_car_e2s_258" vType="Car" speedFactor="1.00" vaporized=""/>
    <tripinfo id="car_s2n_253" depart="253.00" departLane="s2sep_1" departPos="3.60" departPosLat="0.00" departSpeed="13.90" departDelay="0.00" arrival="445.65" arrivalLane="c2n_1" arrivalPos="990.00" arrivalPosLat="0.00" arrivalSpeed="15.23" duration="192.65" routeLength="1997.01" waitingTime="53.75" waitingCount="1" stopTime="0.00" timeLoss="61.50" rerouteNo="1" devices="tripinfo_car_s2n_253 routing_car_s2n_253" vType="Car" speedFactor="1.10" vaporized=""/>
    <tripinfo id="car_n2s_259" depart="259.00" departLane="n2sep_1" departPos="3.60" departPosLat="0.00" departSpeed="13.90" departDelay="0.00" arrival="451.45" arrivalLane="c2s_1" arrivalPos="990.00" arrivalPosLat="0.00" arrivalSpeed="13.94" duration="192.45" routeLength="1997.01" waitingTime="42.05" waitingCount="1" stopTime="0.00" timeLoss="49.23" rerouteNo="1" devices="tripinfo_car_n2s_259 routing_car_n2s_259" vType="Car" speedFactor="1.00" vaporized=""/>
    <tripinfo id="car_s2e_295" depart="295.00" departLane="s2sep_1" departPos="3.60" departPosLat="0.00" departSpeed="13.90" departDelay="0.00" arrival="451.70" arrivalLane="c2e_1" arrivalPos="990.00" arrivalPosLat="0.00" arrivalSpeed="14.35" duration="156.70" routeLength="1986.69" waitingTime="6.40" waitingCount="1" stopTime="0.00" timeLoss="17.53" rerouteNo="1" devices="tripinfo_car_s2e_295 routing_car_s2e_295" vType="Car" speedFactor="1.03" vaporized=""/>
    <tripinfo id="car_s2n_297" depart="297.00" departLane="s2sep_1" departPos="3.60" departPosLat="0.00" departSpeed="13.90" departDelay="0.00" arrival="452.00" arrivalLane="c2n_1" arrivalPos="990.00" arrivalPosLat="0.00" arrivalSpeed="14.85" duration="155.00" routeLength="1997.01" waitingTime="5.25" waitingCount="1" stopTime="0.00" timeLoss="20.49" rerouteNo="1" devices="tripinfo_car_s2n_297 routing_car_s2n_297" vType="Car" speedFactor="1.07" vaporized=""/>
    <tripinfo id="car_s2e_301" depart="301.00" departLane="s2sep_1" departPos="3.60" departPosLat="0.00" departSpeed="13.90" departDelay="0.00" arrival="453.50" arrivalLane="c2e_1" arrivalPos="990.00" arrivalPosLat="0.00" arrivalSpeed="16.00" duration="152.50" routeLength="1986.69" waitingTime="4.55" waitingCount="1" stopTime="0.00" timeLoss="35.31" rerouteNo="1" devices="tripinfo_car_s2e_301 routing_car_s2e_301" vType="Car" speedFactor="1.23" vaporized=""/>
    <tripinfo id="car_n2s_275" depart="275.00" departLane="n2sep_1" departPos="3.60" departPosLat="0.00" departSpeed="13.90" departDelay="0.00" arrival="455.10" arrivalLane="c2s_1" arrivalPos="990.00" arrivalPosLat="0.00" arrivalSpeed="14.20" duration="180.10" routeLength="1997.01" waitingTime="28.20" waitingCount="1" stopTime="0.00" timeLoss="39.68" rerouteNo="1" devices="tripinfo_car_n2s_275 routing_car_n2s_275" vType="Car" speedFactor="1.02" vaporized=""/>
    <tripinfo id="car_s2w_272" depart="272.00" departLane="s2sep_1" departPos="3.60" departPosLat="0.00" departSpeed="13.90" departDelay="0.00" arrival="456.30" arrivalLane="c2w_1" arrivalPos="990.00" arrivalPosLat="0.00" arrivalSpeed="14.34" duration="184.30" routeLength="1996.47" waitingTime="33.25" waitingCount="2" stopTime="0.00" timeLoss="44.34" rerouteNo="1" devices="tripinfo_car_s2w_272 routing_car_s2w_272" vType="Car" speedFactor="1.03" vaporized=""/>
    <tripinfo id="car_n2s_300" depart="300.00" departLane="n2sep_1" departPos="3.60" departPosLat="0.00" departSpeed="13.90" departDelay="0.00" arrival="457.05" arrivalLane="c2s_1" arrivalPos="990.00" arrivalPosLat="0.00" arrivalSpeed="15.27" duration="157.05" routeLength="1997.01" waitingTime="11.10" waitingCount="1" stopTime="0.00" timeLoss="31.29" rerouteNo="1" devices="tripinfo_car_n2s_300 routing_car_n2s_300" vType="Car" speedFactor="1.14" vaporized=""/>
    <tripinfo id="car_n2e_265" depart="265.00" departLane="n2sep_1" departPos="3.60" departPosLat="0.00" departSpeed="13.90" departDelay="0.00" arrival="457.55" arrivalLane="c2e_1" arrivalPos="990.00" arrivalPosLat="0.00" arrivalSpeed="15.31" duration="192.55" routeLength="1996.47" waitingTime="46.95" waitingCount="2" stopTime="0.00" timeLoss="61.72" rerouteNo="1" devices="tripinfo_car_n2e_265 routing_car_n2e_265" vType="Car" speedFactor="1.10" vaporized=""/>
    <tripinfo id="car_s2w_290" depart="290.00" departLane="s2sep_1" departPos="3.60" departPosLat="0.00" departSpeed="13.90" departDelay="0.00" arrival="459.50" arrivalLane="c2w_1" arrivalPos="990.00" arrivalPosLat="0.00" arrivalSpeed="15.47" duration="169.50" routeLength="1996.47" waitingTime="21.85" waitingCount="3" stopTime="0.00" timeLoss="40.44" rerouteNo="1" devices="tripinfo_car_s2w_290 routing_car_s2w_290" vType="Car" speedFactor="1.12" vaporized=""/>
    <tripinfo id="car_s2n_304" depart="304.00" departLane="s2sep_1" departPos="3.60" departPosLat="0.00" departSpeed="13.90" departDelay="0.00" arrival="459.80" arrivalLane="c2n_1" arrivalPos="990.00" arrivalPosLat="0.00" arrivalSpeed="14.06" duration="155.80" routeLength="1997.01" waitingTime="1.35" waitingCount="1" stopTime="0.00" timeLoss="13.75" rerouteNo="1" devices="tripinfo_car_s2n_304 routing_car_s2n_304" vType="Car" speedFactor="1.01" vaporized=""/>
    <tripinfo id="car_s2e_326" depart="327.30" departLane="s2sep_1" departPos="3.60" departPosLat="0.00" departSpeed="13.90" departDelay="1.30" arrival="460.70" arrivalLane="c2e_1" arrivalPos="990.00" arrivalPosLat="0.00" arrivalSpeed="16.09" duration="133.40" routeLength="1986.69" waitingTime="0.00" waitingCount="0" stopTime="0.00" timeLoss="10.00" rerouteNo="1" devices="tripinfo_car_s2e_326 routing_car_s2e_326" vType="Car" speedFactor="1.16" vaporized=""/>
    <tripinfo id="car_n2s_318" depart="318.00" departLane="n2sep_1" departPos="3.60" departPosLat="0.00" departSpeed="13.90" departDelay="0.00" arrival="462.60" arrivalLane="c2s_1" arrivalPos="990.00" arrivalPosLat="0.00" arrivalSpeed="13.95" duration="144.60" routeLength="1997.01" waitingTime="0.00" waitingCount="0" stopTime="0.00" timeLoss="1.45" rerouteNo="1" devices="tripinfo_car_n2s_318 routing_car_n2s_318" vType="Car" speedFactor="1.00" vaporized=""/>
    <tripinfo id="car_s2w_292" depart="292.00" departLane="s2sep_1" departPos="3.60" departPosLat="0.00" departSpeed="13.90" departDelay="0.00" arrival="467.70" arrivalLane="c2w_1" arrivalPos="990.00" arrivalPosLat="0.00" arrivalSpeed="14.02" duration="175.70" routeLength="1996.47" waitingTime="12.20" waitingCount="3" stopTime="0.00" timeLoss="32.56" rerouteNo="1" devices="tripinfo_car_s2w_292 routing_car_s2w_292" vType="Car" speedFactor="1.01" vaporized=""/>
    <tripinfo id="car_s2w_326" depart="326.00" departLane="s2sep_1" departPos="3.60" departPosLat="0.00" departSpeed="13.90" departDelay="0.00" arrival="469.85" arrivalLane="c2w_1" arrivalPos="990.00" arrivalPosLat="0.00" arrivalSpeed="15.09" duration="143.85" routeLength="1996.47" waitingTime="0.00" waitingCount="0" stopTime="0.00" timeLoss="14.29" rerouteNo="1" devices="tripinfo_car_s2w_326 routing_car_s2w_326" vType="Car" speedFactor="1.11" vaporized=""/>
</tripinfos>
