<?xml version="1.0" encoding="UTF-8"?>

<!-- generated on Sat Apr 24 18:26:30 2021 by Eclipse SUMO Version 1.4.0
<configuration xmlns:xsi="http://www.w3.org/2001/XMLSchema-instance" xsi:noNamespaceSchemaLocation="http://sumo.dlr.de/xsd/sumoConfiguration.xsd">

    <input>
        <net-file value="sumofiles/junction.net.xml"/>
        <route-files value="sumofiles/junction_preemption_237.rou.xml"/>
        <additional-files value="sumofiles/junction.det.xml"/>
    </input>

    <output>
        <tripinfo-output value="sumofiles/output/tripinfo_preemption_237.xml"/>
    </output>

    <time>
        <begin value="0"/>
        <end value="10000"/>
        <step-length value="0.05"/>
    </time>

    <processing>
        <lateral-resolution value="0.1"/>
    </processing>

    <report>
        <no-warnings value="true"/>
        <error-log value="sumofiles/output/errorlog_preemption_237.log"/>
        <no-step-log value="true"/>
    </report>

    <traci_server>
        <remote-port value="38765"/>
    </traci_server>

    <gui_only>
        <gui-settings-file value="sumofiles/junction-gui.settings.xml"/>
        <tracker-interval value="0.05"/>
    </gui_only>

</configuration>
-->

<tripinfos xmlns:xsi="http://www.w3.org/2001/XMLSchema-instance" xsi:noNamespaceSchemaLocation="http://sumo.dlr.de/xsd/tripinfo_file.xsd">
    <tripinfo id="car_n2s_0" depart="0.00" departLane="n2sep_1" departPos="3.60" departPosLat="0.00" departSpeed="13.90" departDelay="0.00" arrival="161.75" arrivalLane="c2s_1" arrivalPos="990.00" arrivalPosLat="0.00" arrivalSpeed="14.73" duration="161.75" routeLength="1997.01" waitingTime="18.75" waitingCount="1" stopTime="0.00" timeLoss="26.20" rerouteNo="1" devices="tripinfo_car_n2s_0 routing_car_n2s_0" vType="Car" speedFactor="1.06" vaporized=""/>
    <tripinfo id="bus_n2w_15" depart="15.00" departLane="n2sep_1" departPos="12.10" departPosLat="0.00" departSpeed="13.90" departDelay="0.00" arrival="171.30" arrivalLane="c2w_1" arrivalPos="990.00" arrivalPosLat="0.00" arrivalSpeed="13.90" duration="156.30" routeLength="1978.19" waitingTime="2.05" waitingCount="1" stopTime="0.00" timeLoss="13.23" rerouteNo="1" devices="tripinfo_bus_n2w_15 routing_bus_n2w_15" vType="Bus" speedFactor="1.00" vaporized=""/>
    <tripinfo id="car_s2w_14" depart="14.00" departLane="s2sep_1" departPos="3.60" departPosLat="0.00" departSpeed="13.90" departDelay="0.00" arrival="175.90" arrivalLane="c2w_1" arrivalPos="990.00" arrivalPosLat="0.00" arrivalSpeed="14.03" duration="161.90" routeLength="1996.47" waitingTime="5.50" waitingCount="2" stopTime="0.00" timeLoss="19.05" rerouteNo="1" devices="tripinfo_car_s2w_14 routing_car_s2w_14" vType="Car" speedFactor="1.01" vaporized=""/>
    <tripinfo id="car_s2w_19" depart="19.00" departLane="s2sep_1" departPos="3.60" departPosLat="0.00" departSpeed="13.90" departDelay="0.00" arrival="178.20" arrivalLane="c2w_1" arrivalPos="990.00" arrivalPosLat="0.00" arrivalSpeed="14.77" duration="159.20" routeLength="1996.47" waitingTime="2.90" waitingCount="1" stopTime="0.00" timeLoss="25.88" rerouteNo="1" devices="tripinfo_car_s2w_19 routing_car_s2w_19" vType="Car" speedFactor="1.08" vaporized=""/>
    <tripinfo id="car_n2s_47" depart="47.00" departLane="n2sep_1" departPos="3.60" departPosLat="0.00" departSpeed="13.90" departDelay="0.00" arrival="180.50" arrivalLane="c2s_1" arrivalPos="990.00" arrivalPosLat="0.00" arrivalSpeed="15.61" duration="133.50" routeLength="1997.01" waitingTime="0.00" waitingCount="0" stopTime="0.00" timeLoss="5.53" rerouteNo="1" devices="tripinfo_car_n2s_47 routing_car_n2s_47" vType="Car" speedFactor="1.12" vaporized=""/>
    <tripinfo id="car_s2w_20" depart="20.35" departLane="s2sep_1" departPos="3.60" departPosLat="0.00" departSpeed="13.90" departDelay="0.35" arrival="181.95" arrivalLane="c2w_1" arrivalPos="990.00" arrivalPosLat="0.00" arrivalSpeed="13.88" duration="161.60" routeLength="1996.47" waitingTime="0.70" waitingCount="1" stopTime="0.00" timeLoss="17.25" rerouteNo="1" devices="tripinfo_car_s2w_20 routing_car_s2w_20" vType="Car" speedFactor="1.00" vaporized=""/>
    <tripinfo id="car_n2e_39" depart="39.00" departLane="n2sep_1" departPos="3.60" departPosLat="0.00" departSpeed="13.90" departDelay="0.00" arrival="182.50" arrivalLane="c2e_1" arrivalPos="990.00" arrivalPosLat="0.00" arrivalSpeed="14.32" duration="143.50" routeLength="1996.47" waitingTime="0.00" waitingCount="0" stopTime="0.00" timeLoss="3.41" rerouteNo="1" devices="tripinfo_car_n2e_39 routing_car_n2e_39" vType="Car" speedFactor="1.03" vaporized=""/>
    <tripinfo id="car_n2e_44" depart="44.00" departLane="n2sep_1" departPos="3.60" departPosLat="0.00" departSpeed="13.90" departDelay="0.00" arrival="189.30" arrivalLane="c2e_1" arrivalPos="990.00" arrivalPosLat="0.00" arrivalSpeed="14.26" duration="145.30" routeLength="1996.47" waitingTime="0.00" waitingCount="0" stopTime="0.00" timeLoss="4.67" rerouteNo="1" devices="tripinfo_car_n2e_44 routing_car_n2e_44" vType="Car" speedFactor="1.03" vaporized=""/>
    <tripinfo id="car_n2e_54" depart="54.00" departLane="n2sep_1" departPos="3.60" departPosLat="0.00" departSpeed="13.90" departDelay="0.00" arrival="196.45" arrivalLane="c2e_1" arrivalPos="990.00" arrivalPosLat="0.00" arrivalSpeed="14.54" duration="142.45" routeLength="1996.47" waitingTime="0.00" waitingCount="0" stopTime="0.00" timeLoss="4.44" rerouteNo="1" devices="tripinfo_car_n2e_54 routing_car_n2e_54" vType="Car" speedFactor="1.05" vaporized=""/>
    <tripinfo id="car_s2n_53" depart="53.00" departLane="s2sep_1" departPos="3.60" departPosLat="0.00" departSpeed="13.90" departDelay="0.00" arrival="196.75" arrivalLane="c2n_1" arrivalPos="990.00" arrivalPosLat="0.00" arrivalSpeed="13.90" duration="143.75" routeLength="1997.01" waitingTime="0.00" waitingCount="0" stopTime="0.00" timeLoss="0.05" rerouteNo="1" devices="tripinfo_car_s2n_53 routing_car_s2n_53" vType="Car" speedFactor="1.00" vaporized=""/>
    <tripinfo id="car_w2s_14" depart="14.00" departLane="w2sep_1" departPos="3.60" departPosLat="0.00" departSpeed="13.90" departDelay="0.00" arrival="206.70" arrivalLane="c2s_1" arrivalPos="990.00" arrivalPosLat="0.00" arrivalSpeed="14.73" duration="192.70" routeLength="1986.69" waitingTime="50.15" waitingCount="1" stopTime="0.00" timeLoss="57.16" rerouteNo="1" devices="tripinfo_car_w2s_14 routing_car_w2s_14" vType="Car" speedFactor="1.06" vaporized=""/>
    <tripinfo id="car_e2w_20" depart="20.00" departLane="e2sep_1" departPos="3.60" departPosLat="0.00" departSpeed="13.90" departDelay="0.00" arrival="208.65" arrivalLane="c2w_1" arrivalPos="990.00" arrivalPosLat="0.00" arrivalSpeed="14.32" duration="188.65" routeLength="1997.01" waitingTime="42.10" waitingCount="1" stopTime="0.00" timeLoss="49.21" rerouteNo="1" devices="tripinfo_car_e2w_20 routing_car_e2w_20" vType="Car" speedFactor="1.03" vaporized=""/>
    <tripinfo id="car_w2s_32" depart="32.00" departLane="w2sep_1" departPos="3.60" departPosLat="0.00" departSpeed="13.90" departDelay="0.00" arrival="210.30" arrivalLane="c2s_1" arrivalPos="990.00" arrivalPosLat="0.00" arrivalSpeed="15.01" duration="178.30" routeLength="1986.69" waitingTime="34.00" waitingCount="1" stopTime="0.00" timeLoss="45.62" rerouteNo="1" devices="tripinfo_car_w2s_32 routing_car_w2s_32" vType="Car" speedFactor="1.08" vaporized=""/>
    <tripinfo id="car_e2w_29" depart="29.00" departLane="e2sep_1" departPos="3.60" departPosLat="0.00" departSpeed="13.90" departDelay="0.00" arrival="212.45" arrivalLane="c2w_1" arrivalPos="990.00" arrivalPosLat="0.00" arrivalSpeed="14.51" duration="183.45" routeLength="1997.01" waitingTime="34.65" waitingCount="1" stopTime="0.00" timeLoss="46.05" rerouteNo="1" devices="tripinfo_car_e2w_29 routing_car_e2w_29" vType="Car" speedFactor="1.05" vaporized=""/>
    <tripinfo id="car_e2n_30" depart="30.40" departLane="e2sep_1" departPos="3.60" departPosLat="0.00" departSpeed="13.90" departDelay="0.40" arrival="214.50" arrivalLane="c2n_1" arrivalPos="990.00" arrivalPosLat="0.00" arrivalSpeed="14.04" duration="184.10" routeLength="1986.69" waitingTime="30.55" waitingCount="1" stopTime="0.00" timeLoss="41.90" rerouteNo="1" devices="tripinfo_car_e2n_30 routing_car_e2n_30" vType="Car" speedFactor="1.01" vaporized=""/>
    <tripinfo id="car_w2e_57" depart="57.00" departLane="w2sep_1" departPos="3.60" departPosLat="0.00" departSpeed="13.90" departDelay="0.00" arrival="215.15" arrivalLane="c2e_1" arrivalPos="990.00" arrivalPosLat="0.00" arrivalSpeed="13.90" duration="158.15" routeLength="1997.01" waitingTime="5.00" waitingCount="1" stopTime="0.00" timeLoss="14.45" rerouteNo="1" devices="tripinfo_car_w2e_57 routing_car_w2e_57" vType="Car" speedFactor="1.00" vaporized=""/>
    <tripinfo id="car_w2s_73" depart="73.00" departLane="w2sep_1" departPos="3.60" departPosLat="0.00" departSpeed="13.90" departDelay="0.00" arrival="217.65" arrivalLane="c2s_1" arrivalPos="990.00" arrivalPosLat="0.00" arrivalSpeed="14.27" duration="144.65" routeLength="1986.69" waitingTime="0.00" waitingCount="0" stopTime="0.00" timeLoss="4.68" rerouteNo="1" devices="tripinfo_car_w2s_73 routing_car_w2s_73" vType="Car" speedFactor="1.03" vaporized=""/>
    <tripinfo id="car_e2n_44" depart="44.00" departLane="e2sep_1" departPos="3.60" departPosLat="0.00" departSpeed="13.90" departDelay="0.00" arrival="217.70" arrivalLane="c2n_1" arrivalPos="990.00" arrivalPosLat="0.00" arrivalSpeed="14.49" duration="173.70" routeLength="1986.69" waitingTime="22.10" waitingCount="1" stopTime="0.00" timeLoss="36.47" rerouteNo="1" devices="tripinfo_car_e2n_44 routing_car_e2n_44" vType="Car" speedFactor="1.05" vaporized=""/>
    <tripinfo id="car_w2e_75" depart="75.00" departLane="w2sep_1" departPos="3.60" departPosLat="0.00" departSpeed="13.90" departDelay="0.00" arrival="218.75" arrivalLane="c2e_1" arrivalPos="990.00" arrivalPosLat="0.00" arrivalSpeed="14.52" duration="143.75" routeLength="1997.01" waitingTime="0.00" waitingCount="0" stopTime="0.00" timeLoss="6.54" rerouteNo="1" devices="tripinfo_car_w2e_75 routing_car_w2e_75" vType="Car" speedFactor="1.05" vaporized=""/>
    <tripinfo id="car_e2s_68" depart="68.00" departLane="e2sep_1" departPos="3.60" departPosLat="0.00" departSpeed="13.90" departDelay="0.00" arrival="220.45" arrivalLane="c2s_1" arrivalPos="990.00" arrivalPosLat="0.00" arrivalSpeed="15.03" duration="152.45" routeLength="1996.47" waitingTime="6.10" waitingCount="1" stopTime="0.00" timeLoss="20.11" rerouteNo="1" devices="tripinfo_car_e2s_68 routing_car_e2s_68" vType="Car" speedFactor="1.09" vaporized=""/>
    <tripinfo id="bus_e2n_57" depart="57.00" departLane="e2sep_1" departPos="12.10" departPosLat="0.00" departSpeed="13.90" departDelay="0.00" arrival="223.40" arrivalLane="c2n_1" arrivalPos="990.00" arrivalPosLat="0.00" arrivalSpeed="13.88" duration="166.40" routeLength="1978.19" waitingTime="8.85" waitingCount="1" stopTime="0.00" timeLoss="23.32" rerouteNo="1" devices="tripinfo_bus_e2n_57 routing_bus_e2n_57" vType="Bus" speedFactor="1.00" vaporized=""/>
    <tripinfo id="car_e2w_58" depart="58.45" departLane="e2sep_1" departPos="3.60" departPosLat="0.00" departSpeed="13.90" departDelay="0.45" arrival="224.05" arrivalLane="c2w_1" arrivalPos="990.00" arrivalPosLat="0.00" arrivalSpeed="13.90" duration="165.60" routeLength="1997.01" waitingTime="5.90" waitingCount="1" stopTime="0.00" timeLoss="21.93" rerouteNo="1" devices="tripinfo_car_e2w_58 routing_car_e2w_58" vType="Car" speedFactor="1.00" vaporized=""/>
    <tripinfo id="car_w2n_41" depart="41.00" departLane="w2sep_1" departPos="3.60" departPosLat="0.00" departSpeed="13.90" departDelay="0.00" arrival="226.30" arrivalLane="c2n_1" arrivalPos="990.00" arrivalPosLat="0.00" arrivalSpeed="14.98" duration="185.30" routeLength="1996.47" waitingTime="37.90" waitingCount="2" stopTime="0.00" timeLoss="52.96" rerouteNo="1" devices="tripinfo_car_w2n_41 routing_car_w2n_41" vType="Car" speedFactor="1.09" vaporized=""/>
    <tripinfo id="car_e2w_60" depart="60.30" departLane="e2sep_1" departPos="3.60" departPosLat="0.00" departSpeed="13.90" departDelay="0.30" arrival="228.35" arrivalLane="c2w_1" arrivalPos="990.00" arrivalPosLat="0.00" arrivalSpeed="13.89" duration="168.05" routeLength="1997.01" waitingTime="4.00" waitingCount="1" stopTime="0.00" timeLoss="24.36" rerouteNo="1" devices="tripinfo_car_e2w_60 routing_car_e2w_60" vType="Car" speedFactor="1.00" vaporized=""/>
    <tripinfo id="car_e2s_81" depart="81.00" departLane="e2sep_1" departPos="3.60" departPosLat="0.00" departSpeed="13.90" departDelay="0.00" arrival="229.05" arrivalLane="c2s_1" arrivalPos="990.00" arrivalPosLat="0.00" arrivalSpeed="13.90" duration="148.05" routeLength="1996.47" waitingTime="0.00" waitingCount="0" stopTime="0.00" timeLoss="3.73" rerouteNo="1" devices="tripinfo_car_e2s_81 routing_car_e2s_81" vType="Car" speedFactor="1.00" vaporized=""/>
    <tripinfo id="car_w2s_90" depart="90.00" departLane="w2sep_1" departPos="3.60" departPosLat="0.00" departSpeed="13.90" departDelay="0.00" arrival="231.05" arrivalLane="c2s_1" arrivalPos="990.00" arrivalPosLat="0.00" arrivalSpeed="15.42" duration="141.05" routeLength="1986.69" waitingTime="0.00" waitingCount="0" stopTime="0.00" timeLoss="16.58" rerouteNo="1" devices="tripinfo_car_w2s_90 routing_car_w2s_90" vType="Car" speedFactor="1.15" vaporized=""/>
    <tripinfo id="car_w2n_88" depart="88.00" departLane="w2sep_1" departPos="3.60" departPosLat="0.00" departSpeed="13.90" departDelay="0.00" arrival="235.85" arrivalLane="c2n_1" arrivalPos="990.00" arrivalPosLat="0.00" arrivalSpeed="13.90" duration="147.85" routeLength="1996.47" waitingTime="0.00" waitingCount="0" stopTime="0.00" timeLoss="3.54" rerouteNo="1" devices="tripinfo_car_w2n_88 routing_car_w2n_88" vType="Car" speedFactor="1.00" vaporized=""/>
    <tripinfo id="car_e2s_93" depart="93.00" departLane="e2sep_1" departPos="3.60" departPosLat="0.00" departSpeed="13.90" departDelay="0.00" arrival="240.30" arrivalLane="c2s_1" arrivalPos="990.00" arrivalPosLat="0.00" arrivalSpeed="13.97" duration="147.30" routeLength="1996.47" waitingTime="0.00" waitingCount="0" stopTime="0.00" timeLoss="3.69" rerouteNo="1" devices="tripinfo_car_e2s_93 routing_car_e2s_93" vType="Car" speedFactor="1.01" vaporized=""/>
    <tripinfo id="car_e2s_97" depart="97.00" departLane="e2sep_1" departPos="3.60" departPosLat="0.00" departSpeed="13.90" departDelay="0.00" arrival="242.15" arrivalLane="c2s_1" arrivalPos="990.00" arrivalPosLat="0.00" arrivalSpeed="15.47" duration="145.15" routeLength="1996.47" waitingTime="0.00" waitingCount="0" stopTime="0.00" timeLoss="21.97" rerouteNo="1" devices="tripinfo_car_e2s_97 routing_car_e2s_97" vType="Car" speedFactor="1.17" vaporized=""/>
    <tripinfo id="car_s2e_60" depart="60.00" departLane="s2sep_1" departPos="3.60" departPosLat="0.00" departSpeed="13.90" departDelay="0.00" arrival="246.20" arrivalLane="c2e_1" arrivalPos="990.00" arrivalPosLat="0.00" arrivalSpeed="16.10" duration="186.20" routeLength="1986.69" waitingTime="50.60" waitingCount="1" stopTime="0.00" timeLoss="62.13" rerouteNo="1" devices="tripinfo_car_s2e_60 routing_car_s2e_60" vType="Car" speedFactor="1.16" vaporized=""/>
    <tripinfo id="car_s2n_76" depart="76.00" departLane="s2sep_1" departPos="3.60" departPosLat="0.00" departSpeed="13.90" departDelay="0.00" arrival="250.25" arrivalLane="c2n_1" arrivalPos="990.00" arrivalPosLat="0.00" arrivalSpeed="15.61" duration="174.25" routeLength="1997.01" waitingTime="37.20" waitingCount="1" stopTime="0.00" timeLoss="46.27" rerouteNo="1" devices="tripinfo_car_s2n_76 routing_car_s2n_76" vType="Car" speedFactor="1.12" vaporized=""/>
    <tripinfo id="car_n2w_82" depart="82.00" departLane="n2sep_1" departPos="3.60" departPosLat="0.00" departSpeed="13.90" departDelay="0.00" arrival="255.65" arrivalLane="c2w_1" arrivalPos="990.00" arrivalPosLat="0.00" arrivalSpeed="13.90" duration="173.65" routeLength="1986.69" waitingTime="22.90" waitingCount="1" stopTime="0.00" timeLoss="29.97" rerouteNo="1" devices="tripinfo_car_n2w_82 routing_car_n2w_82" vType="Car" speedFactor="1.00" vaporized=""/>
    <tripinfo id="car_n2w_83" depart="83.45" departLane="n2sep_1" departPos="3.60" departPosLat="0.00" departSpeed="13.90" departDelay="0.45" arrival="257.65" arrivalLane="c2w_1" arrivalPos="990.00" arrivalPosLat="0.00" arrivalSpeed="15.19" duration="174.20" routeLength="1986.69" waitingTime="21.95" waitingCount="1" stopTime="0.00" timeLoss="47.29" rerouteNo="1" devices="tripinfo_car_n2w_83 routing_car_n2w_83" vType="Car" speedFactor="1.13" vaporized=""/>
    <tripinfo id="car_n2e_64" depart="64.00" departLane="n2sep_1" departPos="3.60" departPosLat="0.00" departSpeed="13.90" departDelay="0.00" arrival="259.50" arrivalLane="c2e_1" arrivalPos="990.00" arrivalPosLat="0.00" arrivalSpeed="14.15" duration="195.50" routeLength="1996.47" waitingTime="42.80" waitingCount="2" stopTime="0.00" timeLoss="53.75" rerouteNo="1" devices="tripinfo_car_n2e_64 routing_car_n2e_64" vType="Car" speedFactor="1.02" vaporized=""/>
    <tripinfo id="car_n2w_89" depart="89.00" departLane="n2sep_1" departPos="3.60" departPosLat="0.00" departSpeed="13.90" departDelay="0.00" arrival="259.55" arrivalLane="c2w_1" arrivalPos="990.00" arrivalPosLat="0.00" arrivalSpeed="15.65" duration="170.55" routeLength="1986.69" waitingTime="21.20" waitingCount="1" stopTime="0.00" timeLoss="48.65" rerouteNo="1" devices="tripinfo_car_n2w_89 routing_car_n2w_89" vType="Car" speedFactor="1.18" vaporized=""/>
    <tripinfo id="car_n2w_107" depart="107.00" departLane="n2sep_1" departPos="3.60" departPosLat="0.00" departSpeed="13.90" departDelay="0.00" arrival="261.50" arrivalLane="c2w_1" arrivalPos="990.00" arrivalPosLat="0.00" arrivalSpeed="15.74" duration="154.50" routeLength="1986.69" waitingTime="11.20" waitingCount="1" stopTime="0.00" timeLoss="32.67" rerouteNo="1" devices="tripinfo_car_n2w_107 routing_car_n2w_107" vType="Car" speedFactor="1.18" vaporized=""/>
    <tripinfo id="car_n2w_115" depart="115.00" departLane="n2sep_1" departPos="3.60" departPosLat="0.00" departSpeed="13.90" departDelay="0.00" arrival="263.50" arrivalLane="c2w_1" arrivalPos="990.00" arrivalPosLat="0.00" arrivalSpeed="15.58" duration="148.50" routeLength="1986.69" waitingTime="3.40" waitingCount="1" stopTime="0.00" timeLoss="24.45" rerouteNo="1" devices="tripinfo_car_n2w_115 routing_car_n2w_115" vType="Car" speedFactor="1.16" vaporized=""/>
    <tripinfo id="car_s2n_122" depart="122.00" departLane="s2sep_1" departPos="3.60" departPosLat="0.00" departSpeed="13.90" departDelay="0.00" arrival="263.75" arrivalLane="c2n_1" arrivalPos="990.00" arrivalPosLat="0.00" arrivalSpeed="14.15" duration="141.75" routeLength="1997.01" waitingTime="0.00" waitingCount="0" stopTime="0.00" timeLoss="0.62" rerouteNo="1" devices="tripinfo_car_s2n_122 routing_car_s2n_122" vType="Car" speedFactor="1.02" vaporized=""/>
    <tripinfo id="car_n2e_68" depart="68.00" departLane="n2sep_1" departPos="3.60" departPosLat="0.00" departSpeed="13.90" departDelay="0.00" arrival="267.90" arrivalLane="c2e_1" arrivalPos="990.00" arrivalPosLat="0.00" arrivalSpeed="14.04" duration="199.90" routeLength="1996.47" waitingTime="40.40" waitingCount="2" stopTime="0.00" timeLoss="57.00" rerouteNo="1" devices="tripinfo_car_n2e_68 routing_car_n2e_68" vType="Car" speedFactor="1.01" vaporized=""/>
    <tripinfo id="car_s2w_98" depart="98.00" departLane="s2sep_1" departPos="3.60" departPosLat="0.00" departSpeed="13.90" departDelay="0.00" arrival="268.05" arrivalLane="c2w_1" arrivalPos="990.00" arrivalPosLat="0.00" arrivalSpeed="14.17" duration="170.05" routeLength="1996.47" waitingTime="14.95" waitingCount="3" stopTime="0.00" timeLoss="28.50" rerouteNo="1" devices="tripinfo_car_s2w_98 routing_car_s2w_98" vType="Car" speedFactor="1.02" vaporized=""/>
    <tripinfo id="car_s2e_132" depart="132.00" departLane="s2sep_1" departPos="3.60" departPosLat="0.00" departSpeed="13.90" departDelay="0.00" arrival="274.75" arrivalLane="c2e_1" arrivalPos="990.00" arrivalPosLat="0.00" arrivalSpeed="14.42" duration="142.75" routeLength="1986.69" waitingTime="0.00" waitingCount="0" stopTime="0.00" timeLoss="4.29" rerouteNo="1" devices="tripinfo_car_s2e_132 routing_car_s2e_132" vType="Car" speedFactor="1.04" vaporized=""/>
    <tripinfo id="car_s2n_139" depart="139.00" departLane="s2sep_1" departPos="3.60" departPosLat="0.00" departSpeed="13.90" departDelay="0.00" arrival="283.10" arrivalLane="c2n_1" arrivalPos="990.00" arrivalPosLat="0.00" arrivalSpeed="13.90" duration="144.10" routeLength="1997.01" waitingTime="0.00" waitingCount="0" stopTime="0.00" timeLoss="0.43" rerouteNo="1" devices="tripinfo_car_s2n_139 routing_car_s2n_139" vType="Car" speedFactor="1.00" vaporized=""/>
    <tripinfo id="car_s2n_143" depart="143.00" departLane="s2sep_1" departPos="3.60" departPosLat="0.00" departSpeed="13.90" departDelay="0.00" arrival="285.00" arrivalLane="c2n_1" arrivalPos="990.00" arrivalPosLat="0.00" arrivalSpeed="15.45" duration="142.00" routeLength="1997.01" waitingTime="0.00" waitingCount="0" stopTime="0.00" timeLoss="19.06" rerouteNo="1" devices="tripinfo_car_s2n_143 routing_car_s2n_143" vType="Car" speedFactor="1.17" vaporized=""/>
    <tripinfo id="car_n2e_150" depart="150.00" departLane="n2sep_1" departPos="3.60" departPosLat="0.00" departSpeed="13.90" departDelay="0.00" arrival="285.55" arrivalLane="c2e_1" arrivalPos="990.00" arrivalPosLat="0.00" arrivalSpeed="15.23" duration="135.55" routeLength="1996.47" waitingTime="0.00" waitingCount="0" stopTime="0.00" timeLoss="3.82" rerouteNo="1" devices="tripinfo_car_n2e_150 routing_car_n2e_150" vType="Car" speedFactor="1.10" vaporized=""/>
    <tripinfo id="car_e2w_107" depart="107.00" departLane="e2sep_1" departPos="3.60" departPosLat="0.00" departSpeed="13.90" departDelay="0.00" arrival="296.35" arrivalLane="c2w_1" arrivalPos="990.00" arrivalPosLat="0.00" arrivalSpeed="15.32" duration="189.35" routeLength="1997.01" waitingTime="48.95" waitingCount="1" stopTime="0.00" timeLoss="58.99" rerouteNo="1" devices="tripinfo_car_e2w_107 routing_car_e2w_107" vType="Car" speedFactor="1.10" vaporized=""/>
    <tripinfo id="car_w2s_103" depart="103.00" departLane="w2sep_1" departPos="3.60" departPosLat="0.00" departSpeed="13.90" departDelay="0.00" arrival="300.60" arrivalLane="c2s_1" arrivalPos="990.00" arrivalPosLat="0.00" arrivalSpeed="13.90" duration="197.60" routeLength="1986.69" waitingTime="47.15" waitingCount="1" stopTime="0.00" timeLoss="53.95" rerouteNo="1" devices="tripinfo_car_w2s_103 routing_car_w2s_103" vType="Car" speedFactor="1.00" vaporized=""/>
    <tripinfo id="car_e2n_98" depart="98.30" departLane="e2sep_1" departPos="3.60" departPosLat="0.00" departSpeed="13.90" departDelay="0.30" arrival="300.70" arrivalLane="c2n_1" arrivalPos="990.00" arrivalPosLat="0.00" arrivalSpeed="13.90" duration="202.40" routeLength="1986.69" waitingTime="50.45" waitingCount="1" stopTime="0.00" timeLoss="58.72" rerouteNo="1" devices="tripinfo_car_e2n_98 routing_car_e2n_98" vType="Car" speedFactor="1.00" vaporized=""/>
    <tripinfo id="car_e2w_129" depart="129.00" departLane="e2sep_1" departPos="3.60" departPosLat="0.00" departSpeed="13.90" departDelay="0.00" arrival="300.90" arrivalLane="c2w_1" arrivalPos="990.00" arrivalPosLat="0.00" arrivalSpeed="15.17" duration="171.90" routeLength="1997.01" waitingTime="28.60" waitingCount="1" stopTime="0.00" timeLoss="40.30" rerouteNo="1" devices="tripinfo_car_e2w_129 routing_car_e2w_129" vType="Car" speedFactor="1.09" vaporized=""/>
    <tripinfo id="car_w2s_116" depart="116.00" departLane="w2sep_1" departPos="3.60" departPosLat="0.00" departSpeed="13.90" departDelay="0.00" arrival="304.05" arrivalLane="c2s_1" arrivalPos="990.00" arrivalPosLat="0.00" arrivalSpeed="14.28" duration="188.05" routeLength="1986.69" waitingTime="36.80" waitingCount="1" stopTime="0.00" timeLoss="48.60" rerouteNo="1" devices="tripinfo_car_w2s_116 routing_car_w2s_116" vType="Car" speedFactor="1.03" vaporized=""/>
    <tripinfo id="car_w2e_137" depart="137.00" departLane="w2sep_1" departPos="3.60" departPosLat="0.00" departSpeed="13.90" departDelay="0.00" arrival="304.45" arrivalLane="c2e_1" arrivalPos="990.00" arrivalPosLat="0.00" arrivalSpeed="14.04" duration="167.45" routeLength="1997.01" waitingTime="14.30" waitingCount="1" stopTime="0.00" timeLoss="25.20" rerouteNo="1" devices="tripinfo_car_w2e_137 routing_car_w2e_137" vType="Car" speedFactor="1.01" vaporized=""/>
    <tripinfo id="car_e2w_136" depart="136.00" departLane="e2sep_1" departPos="3.60" departPosLat="0.00" departSpeed="13.90" departDelay="0.00" arrival="304.50" arrivalLane="c2w_1" arrivalPos="990.00" arrivalPosLat="0.00" arrivalSpeed="15.09" duration="168.50" routeLength="1997.01" waitingTime="22.45" waitingCount="1" stopTime="0.00" timeLoss="36.41" rerouteNo="1" devices="tripinfo_car_e2w_136 routing_car_e2w_136" vType="Car" speedFactor="1.09" vaporized=""/>
    <tripinfo id="car_e2s_162" depart="162.00" departLane="e2sep_1" departPos="3.60" departPosLat="0.00" departSpeed="13.90" departDelay="0.00" arrival="306.95" arrivalLane="c2s_1" arrivalPos="990.00" arrivalPosLat="0.00" arrivalSpeed="15.60" duration="144.95" routeLength="1996.47" waitingTime="3.75" waitingCount="1" stopTime="0.00" timeLoss="17.40" rerouteNo="1" devices="tripinfo_car_e2s_162 routing_car_e2s_162" vType="Car" speedFactor="1.13" vaporized=""/>
    <tripinfo id="car_w2e_148" depart="148.00" departLane="w2sep_1" departPos="3.60" departPosLat="0.00" departSpeed="13.90" departDelay="0.00" arrival="308.50" arrivalLane="c2e_1" arrivalPos="990.00" arrivalPosLat="0.00" arrivalSpeed="14.12" duration="160.50" routeLength="1997.01" waitingTime="4.95" waitingCount="1" stopTime="0.00" timeLoss="19.21" rerouteNo="1" devices="tripinfo_car_w2e_148 routing_car_w2e_148" vType="Car" speedFactor="1.02" vaporized=""/>
    <tripinfo id="car_e2n_138" depart="138.00" departLane="e2sep_1" departPos="3.60" departPosLat="0.00" departSpeed="13.90" departDelay="0.00" arrival="309.75" arrivalLane="c2n_1" arrivalPos="990.00" arrivalPosLat="0.00" arrivalSpeed="13.90" duration="171.75" routeLength="1986.69" waitingTime="15.80" waitingCount="1" stopTime="0.00" timeLoss="28.06" rerouteNo="1" devices="tripinfo_car_e2n_138 routing_car_e2n_138" vType="Car" speedFactor="1.00" vaporized=""/>
    <tripinfo id="car_w2e_151" depart="151.00" departLane="w2sep_1" departPos="3.60" departPosLat="0.00" departSpeed="13.90" departDelay="0.00" arrival="312.35" arrivalLane="c2e_1" arrivalPos="990.00" arrivalPosLat="0.00" arrivalSpeed="13.92" duration="161.35" routeLength="1997.01" waitingTime="2.40" waitingCount="1" stopTime="0.00" timeLoss="18.10" rerouteNo="1" devices="tripinfo_car_w2e_151 routing_car_w2e_151" vType="Car" speedFactor="1.00" vaporized=""/>
    <tripinfo id="car_e2n_157" depart="157.00" departLane="e2sep_1" departPos="3.60" departPosLat="0.00" departSpeed="13.90" departDelay="0.00" arrival="314.05" arrivalLane="c2n_1" arrivalPos="990.00" arrivalPosLat="0.00" arrivalSpeed="13.89" duration="157.05" routeLength="1986.69" waitingTime="0.00" waitingCount="0" stopTime="0.00" timeLoss="13.39" rerouteNo="1" devices="tripinfo_car_e2n_157 routing_car_e2n_157" vType="Car" speedFactor="1.00" vaporized=""/>
    <tripinfo id="car_w2e_160" depart="160.00" departLane="w2sep_1" departPos="3.60" departPosLat="0.00" departSpeed="13.90" departDelay="0.00" arrival="314.25" arrivalLane="c2e_1" arrivalPos="990.00" arrivalPosLat="0.00" arrivalSpeed="15.17" duration="154.25" routeLength="1997.01" waitingTime="1.65" waitingCount="1" stopTime="0.00" timeLoss="28.47" rerouteNo="1" devices="tripinfo_car_w2e_160 routing_car_w2e_160" vType="Car" speedFactor="1.14" vaporized=""/>
    <tripinfo id="car_e2s_168" depart="168.00" departLane="e2sep_1" departPos="3.60" departPosLat="0.00" departSpeed="13.90" departDelay="0.00" arrival="316.55" arrivalLane="c2s_1" arrivalPos="990.00" arrivalPosLat="0.00" arrivalSpeed="13.90" duration="148.55" routeLength="1996.47" waitingTime="0.00" waitingCount="0" stopTime="0.00" timeLoss="4.21" rerouteNo="1" devices="tripinfo_car_e2s_168 routing_car_e2s_168" vType="Car" speedFactor="1.00" vaporized=""/>
    <tripinfo id="car_w2n_135" depart="135.00" departLane="w2sep_1" departPos="3.60" departPosLat="0.00" departSpeed="13.90" departDelay="0.00" arrival="316.75" arrivalLane="c2n_1" arrivalPos="990.00" arrivalPosLat="0.00" arrivalSpeed="14.37" duration="181.75" routeLength="1996.47" waitingTime="27.65" waitingCount="2" stopTime="0.00" timeLoss="43.40" rerouteNo="1" devices="tripinfo_car_w2n_135 routing_car_w2n_135" vType="Car" speedFactor="1.04" vaporized=""/>
    <tripinfo id="car_w2n_138" depart="138.60" departLane="w2sep_1" departPos="3.60" departPosLat="0.00" departSpeed="13.90" departDelay="0.60" arrival="320.35" arrivalLane="c2n_1" arrivalPos="990.00" arrivalPosLat="0.00" arrivalSpeed="13.87" duration="181.75" routeLength="1996.47" waitingTime="18.10" waitingCount="2" stopTime="0.00" timeLoss="37.42" rerouteNo="1" devices="tripinfo_car_w2n_138 routing_car_w2n_138" vType="Car" speedFactor="1.00" vaporized=""/>
    <tripinfo id="car_w2n_141" depart="141.00" departLane="w2sep_1" departPos="3.60" departPosLat="0.00" departSpeed="13.90" departDelay="0.00" arrival="323.60" arrivalLane="c2n_1" arrivalPos="990.00" arrivalPosLat="0.00" arrivalSpeed="13.86" duration="182.60" routeLength="1996.47" waitingTime="13.85" waitingCount="2" stopTime="0.00" timeLoss="38.28" rerouteNo="1" devices="tripinfo_car_w2n_141 routing_car_w2n_141" vType="Car" speedFactor="1.00" vaporized=""/>
    <tripinfo id="car_w2s_180" depart="180.00" departLane="w2sep_1" departPos="3.60" departPosLat="0.00" departSpeed="13.90" departDelay="0.00" arrival="324.90" arrivalLane="c2s_1" arrivalPos="990.00" arrivalPosLat="0.00" arrivalSpeed="14.21" duration="144.90" routeLength="1986.69" waitingTime="0.00" waitingCount="0" stopTime="0.00" timeLoss="4.32" rerouteNo="1" devices="tripinfo_car_w2s_180 routing_car_w2s_180" vType="Car" speedFactor="1.02" vaporized=""/>
    <tripinfo id="car_w2n_173" depart="173.00" departLane="w2sep_1" departPos="3.60" departPosLat="0.00" departSpeed="13.90" departDelay="0.00" arrival="326.55" arrivalLane="c2n_1" arrivalPos="990.00" arrivalPosLat="0.00" arrivalSpeed="13.90" duration="153.55" routeLength="1996.47" waitingTime="0.00" waitingCount="0" stopTime="0.00" timeLoss="9.96" rerouteNo="1" devices="tripinfo_car_w2n_173 routing_car_w2n_173" vType="Car" speedFactor="1.01" vaporized=""/>
    <tripinfo id="car_w2s_188" depart="188.00" departLane="w2sep_1" departPos="3.60" departPosLat="0.00" departSpeed="13.90" departDelay="0.00" arrival="329.35" arrivalLane="c2s_1" arrivalPos="990.00" arrivalPosLat="0.00" arrivalSpeed="14.66" duration="141.35" routeLength="1986.69" waitingTime="0.00" waitingCount="0" stopTime="0.00" timeLoss="5.27" rerouteNo="1" devices="tripinfo_car_w2s_188 routing_car_w2s_188" vType="Car" speedFactor="1.06" vaporized=""/>
    <tripinfo id="car_e2n_184" depart="184.00" departLane="e2sep_1" departPos="3.60" departPosLat="0.00" departSpeed="13.90" departDelay="0.00" arrival="332.50" arrivalLane="c2n_1" arrivalPos="990.00" arrivalPosLat="0.00" arrivalSpeed="13.90" duration="148.50" routeLength="1986.69" waitingTime="0.00" waitingCount="0" stopTime="0.00" timeLoss="4.80" rerouteNo="1" devices="tripinfo_car_e2n_184 routing_car_e2n_184" vType="Car" speedFactor="1.00" vaporized=""/>
    <tripinfo id="car_e2s_180" depart="180.00" departLane="e2sep_1" departPos="3.60" departPosLat="0.00" departSpeed="13.90" departDelay="0.00" arrival="334.50" arrivalLane="c2s_1" arrivalPos="990.00" arrivalPosLat="0.00" arrivalSpeed="14.22" duration="154.50" routeLength="1996.47" waitingTime="3.90" waitingCount="1" stopTime="0.00" timeLoss="13.39" rerouteNo="1" devices="tripinfo_car_e2s_180 routing_car_e2s_180" vType="Car" speedFactor="1.02" vaporized=""/>
    <tripinfo id="car_s2e_166" depart="167.35" departLane="s2sep_1" departPos="3.60" departPosLat="0.00" departSpeed="13.90" departDelay="1.35" arrival="340.55" arrivalLane="c2e_1" arrivalPos="990.00" arrivalPosLat="0.00" arrivalSpeed="15.56" duration="173.20" routeLength="1986.69" waitingTime="32.30" waitingCount="1" stopTime="0.00" timeLoss="44.83" rerouteNo="1" devices="tripinfo_car_s2e_166 routing_car_s2e_166" vType="Car" speedFactor="1.12" vaporized=""/>
    <tripinfo id="car_s2n_166" depart="166.00" departLane="s2sep_1" departPos="3.60" departPosLat="0.00" departSpeed="13.90" departDelay="0.00" arrival="340.65" arrivalLane="c2n_1" arrivalPos="990.00" arrivalPosLat="0.00" arrivalSpeed="15.05" duration="174.65" routeLength="1997.01" waitingTime="34.10" waitingCount="1" stopTime="0.00" timeLoss="41.92" rerouteNo="1" devices="tripinfo_car_s2n_166 routing_car_s2n_166" vType="Car" speedFactor="1.08" vaporized=""/>
    <tripinfo id="car_s2n_172" depart="172.00" departLane="s2sep_1" departPos="3.60" departPosLat="0.00" departSpeed="13.90" departDelay="0.00" arrival="343.30" arrivalLane="c2n_1" arrivalPos="990.00" arrivalPosLat="0.00" arrivalSpeed="15.87" duration="171.30" routeLength="1997.01" waitingTime="25.50" waitingCount="1" stopTime="0.00" timeLoss="46.86" rerouteNo="1" devices="tripinfo_car_s2n_172 routing_car_s2n_172" vType="Car" speedFactor="1.15" vaporized=""/>
    <tripinfo id="car_s2e_174" depart="174.00" departLane="s2sep_1" departPos="3.60" departPosLat="0.00" departSpeed="13.90" departDelay="0.00" arrival="343.90" arrivalLane="c2e_1" arrivalPos="990.00" arrivalPosLat="0.00" arrivalSpeed="16.22" duration="169.90" routeLength="1986.69" waitingTime="24.75" waitingCount="1" stopTime="0.00" timeLoss="47.30" rerouteNo="1" devices="tripinfo_car_s2e_174 routing_car_s2e_174" vType="Car" speedFactor="1.17" vaporized=""/>
    <tripinfo id="car_n2s_155" depart="155.00" departLane="n2sep_1" departPos="3.60" departPosLat="0.00" departSpeed="13.90" departDelay="0.00" arrival="345.85" arrivalLane="c2s_1" arrivalPos="990.00" arrivalPosLat="0.00" arrivalSpeed="13.90" duration="190.85" routeLength="1997.01" waitingTime="39.85" waitingCount="1" stopTime="0.00" timeLoss="47.18" rerouteNo="1" devices="tripinfo_car_n2s_155 routing_car_n2s_155" vType="Car" speedFactor="1.00" vaporized=""/>
    <tripinfo id="car_n2w_160" depart="160.00" departLane="n2sep_1" departPos="3.60" departPosLat="0.00" departSpeed="13.90" departDelay="0.00" arrival="346.35" arrivalLane="c2w_1" arrivalPos="990.00" arrivalPosLat="0.00" arrivalSpeed="14.23" duration="186.35" routeLength="1986.69" waitingTime="36.60" waitingCount="1" stopTime="0.00" timeLoss="46.01" rerouteNo="1" devices="tripinfo_car_n2w_160 routing_car_n2w_160" vType="Car" speedFactor="1.02" vaporized=""/>
    <tripinfo id="car_n2s_201" depart="201.00" departLane="n2sep_1" departPos="3.60" departPosLat="0.00" departSpeed="13.90" departDelay="0.00" arrival="349.45" arrivalLane="c2s_1" arrivalPos="990.00" arrivalPosLat="0.00" arrivalSpeed="14.35" duration="148.45" routeLength="1997.01" waitingTime="0.00" waitingCount="0" stopTime="0.00" timeLoss="9.57" rerouteNo="1" devices="tripinfo_car_n2s_201 routing_car_n2s_201" vType="Car" speedFactor="1.03" vaporized=""/>
    <tripinfo id="car_s2n_179" depart="179.00" departLane="s2sep_1" departPos="3.60" departPosLat="0.00" departSpeed="13.90" departDelay="0.00" arrival="351.85" arrivalLane="c2n_1" arrivalPos="990.00" arrivalPosLat="0.00" arrivalSpeed="14.46" duration="172.85" routeLength="1997.01" waitingTime="22.05" waitingCount="1" stopTime="0.00" timeLoss="34.67" rerouteNo="1" devices="tripinfo_car_s2n_179 routing_car_s2n_179" vType="Car" speedFactor="1.04" vaporized=""/>
    <tripinfo id="car_n2w_205" depart="205.00" departLane="n2sep_1" departPos="3.60" departPosLat="0.00" departSpeed="13.90" departDelay="0.00" arrival="352.20" arrivalLane="c2w_1" arrivalPos="990.00" arrivalPosLat="0.00" arrivalSpeed="14.13" duration="147.20" routeLength="1986.69" waitingTime="0.00" waitingCount="0" stopTime="0.00" timeLoss="5.94" rerouteNo="1" devices="tripinfo_car_n2w_205 routing_car_n2w_205" vType="Car" speedFactor="1.02" vaporized=""/>
    <tripinfo id="car_s2e_188" depart="188.00" departLane="s2sep_1" departPos="3.60" departPosLat="0.00" departSpeed="13.90" departDelay="0.00" arrival="356.95" arrivalLane="c2e_1" arrivalPos="990.00" arrivalPosLat="0.00" arrivalSpeed="13.90" duration="168.95" routeLength="1986.69" waitingTime="12.70" waitingCount="1" stopTime="0.00" timeLoss="25.28" rerouteNo="1" devices="tripinfo_car_s2e_188 routing_car_s2e_188" vType="Car" speedFactor="1.00" vaporized=""/>
    <tripinfo id="car_s2n_198" depart="198.00" departLane="s2sep_1" departPos="3.60" departPosLat="0.00" departSpeed="13.90" departDelay="0.00" arrival="358.65" arrivalLane="c2n_1" arrivalPos="990.00" arrivalPosLat="0.00" arrivalSpeed="14.00" duration="160.65" routeLength="1997.01" waitingTime="4.45" waitingCount="1" stopTime="0.00" timeLoss="18.01" rerouteNo="1" devices="tripinfo_car_s2n_198 routing_car_s2n_198" vType="Car" speedFactor="1.01" vaporized=""/>
    <tripinfo id="bus_n2w_209" depart="209.00" departLane="n2sep_1" departPos="12.10" departPosLat="0.00" departSpeed="13.90" departDelay="0.00" arrival="359.45" arrivalLane="c2w_1" arrivalPos="990.00" arrivalPosLat="0.00" arrivalSpeed="13.89" duration="150.45" routeLength="1978.19" waitingTime="0.00" waitingCount="0" stopTime="0.00" timeLoss="7.37" rerouteNo="1" devices="tripinfo_bus_n2w_209 routing_bus_n2w_209" vType="Bus" speedFactor="1.00" vaporized=""/>
    <tripinfo id="car_s2e_205" depart="205.00" departLane="s2sep_1" departPos="3.60" departPosLat="0.00" departSpeed="13.90" departDelay="0.00" arrival="360.70" arrivalLane="c2e_1" arrivalPos="990.00" arrivalPosLat="0.00" arrivalSpeed="14.30" duration="155.70" routeLength="1986.69" waitingTime="0.00" waitingCount="0" stopTime="0.00" timeLoss="16.27" rerouteNo="1" devices="tripinfo_car_s2e_205 routing_car_s2e_205" vType="Car" speedFactor="1.03" vaporized=""/>
    <tripinfo id="car_s2e_216" depart="216.00" departLane="s2sep_1" departPos="3.60" departPosLat="0.00" departSpeed="13.90" departDelay="0.00" arrival="363.85" arrivalLane="c2e_1" arrivalPos="990.00" arrivalPosLat="0.00" arrivalSpeed="14.43" duration="147.85" routeLength="1986.69" waitingTime="0.00" waitingCount="0" stopTime="0.00" timeLoss="10.07" rerouteNo="1" devices="tripinfo_car_s2e_216 routing_car_s2e_216" vType="Car" speedFactor="1.04" vaporized=""/>
    <tripinfo id="car_n2w_215" depart="215.00" departLane="n2sep_1" departPos="3.60" departPosLat="0.00" departSpeed="13.90" departDelay="0.00" arrival="364.45" arrivalLane="c2w_1" arrivalPos="990.00" arrivalPosLat="0.00" arrivalSpeed="13.92" duration="149.45" routeLength="1986.69" waitingTime="0.00" waitingCount="0" stopTime="0.00" timeLoss="6.04" rerouteNo="1" devices="tripinfo_car_n2w_215 routing_car_n2w_215" vType="Car" speedFactor="1.00" vaporized=""/>
    <tripinfo id="car_n2e_172" depart="172.00" departLane="n2sep_1" departPos="3.60" departPosLat="0.00" departSpeed="13.90" departDelay="0.00" arrival="365.70" arrivalLane="c2e_1" arrivalPos="990.00" arrivalPosLat="0.00" arrivalSpeed="15.58" duration="193.70" routeLength="1996.47" waitingTime="48.75" waitingCount="2" stopTime="0.00" timeLoss="71.26" rerouteNo="1" devices="tripinfo_car_n2e_172 routing_car_n2e_172" vType="Car" speedFactor="1.18" vaporized=""/>
    <tripinfo id="car_s2w_167" depart="169.00" departLane="s2sep_1" departPos="3.60" departPosLat="0.00" departSpeed="13.90" departDelay="2.00" arrival="367.85" arrivalLane="c2w_1" arrivalPos="990.00" arrivalPosLat="0.00" arrivalSpeed="14.08" duration="198.85" routeLength="1996.47" waitingTime="41.00" waitingCount="2" stopTime="0.00" timeLoss="56.77" rerouteNo="1" devices="tripinfo_car_s2w_167 routing_car_s2w_167" vType="Car" speedFactor="1.02" vaporized=""/>
    <tripinfo id="car_s2n_230" depart="230.00" departLane="s2sep_1" departPos="3.60" departPosLat="0.00" departSpeed="13.90" departDelay="0.00" arrival="369.00" arrivalLane="c2n_1" arrivalPos="990.00" arrivalPosLat="0.00" arrivalSpeed="14.42" duration="139.00" routeLength="1997.01" waitingTime="0.00" waitingCount="0" stopTime="0.00" timeLoss="0.54" rerouteNo="1" devices="tripinfo_car_s2n_230 routing_car_s2n_230" vType="Car" speedFactor="1.04" vaporized=""/>
    <tripinfo id="car_n2e_225" depart="225.00" departLane="n2sep_1" departPos="3.60" departPosLat="0.00" departSpeed="13.90" departDelay="0.00" arrival="373.65" arrivalLane="c2e_1" arrivalPos="990.00" arrivalPosLat="0.00" arrivalSpeed="14.21" duration="148.65" routeLength="1996.47" waitingTime="0.10" waitingCount="1" stopTime="0.00" timeLoss="7.40" rerouteNo="1" devices="tripinfo_car_n2e_225 routing_car_n2e_225" vType="Car" speedFactor="1.02" vaporized=""/>
    <tripinfo id="car_s2w_235" depart="235.00" departLane="s2sep_1" departPos="3.60" departPosLat="0.00" departSpeed="13.90" departDelay="0.00" arrival="377.75" arrivalLane="c2w_1" arrivalPos="990.00" arrivalPosLat="0.00" arrivalSpeed="14.50" duration="142.75" routeLength="1996.47" waitingTime="0.00" waitingCount="0" stopTime="0.00" timeLoss="4.42" rerouteNo="1" devices="tripinfo_car_s2w_235 routing_car_s2w_235" vType="Car" speedFactor="1.04" vaporized=""/>
    <tripinfo id="car_n2e_229" depart="229.00" departLane="n2sep_1" departPos="3.60" departPosLat="0.00" departSpeed="13.90" departDelay="0.00" arrival="378.00" arrivalLane="c2e_1" arrivalPos="990.00" arrivalPosLat="0.00" arrivalSpeed="14.12" duration="149.00" routeLength="1996.47" waitingTime="0.00" waitingCount="0" stopTime="0.00" timeLoss="7.05" rerouteNo="1" devices="tripinfo_car_n2e_229 routing_car_n2e_229" vType="Car" speedFactor="1.02" vaporized=""/>
    <tripinfo id="car_w2s_197" depart="197.00" departLane="w2sep_1" departPos="3.60" departPosLat="0.00" departSpeed="13.90" departDelay="0.00" arrival="380.10" arrivalLane="c2s_1" arrivalPos="990.00" arrivalPosLat="0.00" arrivalSpeed="16.40" duration="183.10" routeLength="1986.69" waitingTime="52.35" waitingCount="1" stopTime="0.00" timeLoss="61.31" rerouteNo="1" devices="tripinfo_car_w2s_197 routing_car_w2s_197" vType="Car" speedFactor="1.18" vaporized=""/>
    <tripinfo id="car_w2s_200" depart="200.00" departLane="w2sep_1" departPos="3.60" departPosLat="0.00" departSpeed="13.90" departDelay="0.00" arrival="388.25" arrivalLane="c2s_1" arrivalPos="990.00" arrivalPosLat="0.00" arrivalSpeed="15.11" duration="188.25" routeLength="1986.69" waitingTime="45.90" waitingCount="1" stopTime="0.00" timeLoss="56.09" rerouteNo="1" devices="tripinfo_car_w2s_200 routing_car_w2s_200" vType="Car" speedFactor="1.09" vaporized=""/>
    <tripinfo id="car_e2n_186" depart="186.00" departLane="e2sep_1" departPos="3.60" departPosLat="0.00" departSpeed="13.90" departDelay="0.00" arrival="389.30" arrivalLane="c2n_1" arrivalPos="990.00" arrivalPosLat="0.00" arrivalSpeed="14.17" duration="203.30" routeLength="1986.69" waitingTime="52.15" waitingCount="1" stopTime="0.00" timeLoss="62.42" rerouteNo="1" devices="tripinfo_car_e2n_186 routing_car_e2n_186" vType="Car" speedFactor="1.02" vaporized=""/>
    <tripinfo id="car_e2n_197" depart="197.00" departLane="e2sep_1" departPos="3.60" departPosLat="0.00" departSpeed="13.90" departDelay="0.00" arrival="393.25" arrivalLane="c2n_1" arrivalPos="990.00" arrivalPosLat="0.00" arrivalSpeed="14.33" duration="196.25" routeLength="1986.69" waitingTime="45.90" waitingCount="1" stopTime="0.00" timeLoss="57.12" rerouteNo="1" devices="tripinfo_car_e2n_197 routing_car_e2n_197" vType="Car" speedFactor="1.03" vaporized=""/>
    <tripinfo id="car_w2e_214" depart="214.25" departLane="w2sep_1" departPos="3.60" departPosLat="0.00" departSpeed="13.90" departDelay="0.25" arrival="395.15" arrivalLane="c2e_1" arrivalPos="990.00" arrivalPosLat="0.00" arrivalSpeed="13.90" duration="180.90" routeLength="1997.01" waitingTime="27.00" waitingCount="1" stopTime="0.00" timeLoss="37.21" rerouteNo="1" devices="tripinfo_car_w2e_214 routing_car_w2e_214" vType="Car" speedFactor="1.00" vaporized=""/>
    <tripinfo id="car_e2s_198" depart="198.40" departLane="e2sep_1" departPos="3.60" departPosLat="0.00" departSpeed="13.90" departDelay="0.40" arrival="396.65" arrivalLane="c2s_1" arrivalPos="990.00" arrivalPosLat="0.00" arrivalSpeed="15.32" duration="198.25" routeLength="1996.47" waitingTime="50.50" waitingCount="2" stopTime="0.00" timeLoss="67.32" rerouteNo="1" devices="tripinfo_car_e2s_198 routing_car_e2s_198" vType="Car" speedFactor="1.10" vaporized=""/>
    <tripinfo id="car_e2n_202" depart="202.00" departLane="e2sep_1" departPos="3.60" departPosLat="0.00" departSpeed="13.90" departDelay="0.00" arrival="397.85" arrivalLane="c2n_1" arrivalPos="990.00" arrivalPosLat="0.00" arrivalSpeed="13.89" duration="195.85" routeLength="1986.69" waitingTime="38.90" waitingCount="1" stopTime="0.00" timeLoss="52.21" rerouteNo="1" devices="tripinfo_car_e2n_202 routing_car_e2n_202" vType="Car" speedFactor="1.00" vaporized=""/>
    <tripinfo id="bus_w2e_248" depart="248.00" departLane="w2sep_1" departPos="12.10" departPosLat="0.00" departSpeed="13.90" departDelay="0.00" arrival="399.80" arrivalLane="c2e_1" arrivalPos="990.00" arrivalPosLat="0.00" arrivalSpeed="13.85" duration="151.80" routeLength="1988.51" waitingTime="0.00" waitingCount="0" stopTime="0.00" timeLoss="8.71" rerouteNo="1" devices="tripinfo_bus_w2e_248 routing_bus_w2e_248" vType="Bus" speedFactor="1.00" vaporized=""/>
    <tripinfo id="car_e2w_254" depart="254.00" departLane="e2sep_1" departPos="3.60" departPosLat="0.00" departSpeed="13.90" departDelay="0.00" arrival="399.80" arrivalLane="c2w_1" arrivalPos="990.00" arrivalPosLat="0.00" arrivalSpeed="13.90" duration="145.80" routeLength="1997.01" waitingTime="0.00" waitingCount="0" stopTime="0.00" timeLoss="2.09" rerouteNo="1" devices="tripinfo_car_e2w_254 routing_car_e2w_254" vType="Car" speedFactor="1.00" vaporized=""/>
    <tripinfo id="car_e2n_252" depart="252.00" departLane="e2sep_1" departPos="3.60" departPosLat="0.00" departSpeed="13.90" departDelay="0.00" arrival="400.00" arrivalLane="c2n_1" arrivalPos="990.00" arrivalPosLat="0.00" arrivalSpeed="14.86" duration="148.00" routeLength="1986.69" waitingTime="0.00" waitingCount="0" stopTime="0.00" timeLoss="17.06" rerouteNo="1" devices="tripinfo_car_e2n_252 routing_car_e2n_252" vType="Car" speedFactor="1.10" vaporized=""/>
    <tripinfo id="car_w2n_213" depart="213.00" departLane="w2sep_1" departPos="3.60" departPosLat="0.00" departSpeed="13.90" departDelay="0.00" arrival="401.95" arrivalLane="c2n_1" arrivalPos="990.00" arrivalPosLat="0.00" arrivalSpeed="15.33" duration="188.95" routeLength="1996.47" waitingTime="43.55" waitingCount="2" stopTime="0.00" timeLoss="63.19" rerouteNo="1" devices="tripinfo_car_w2n_213 routing_car_w2n_213" vType="Car" speedFactor="1.15" vaporized=""/>
    <tripinfo id="car_w2e_253" depart="253.00" departLane="w2sep_1" departPos="3.60" departPosLat="0.00" departSpeed="13.90" departDelay="0.00" arrival="402.80" arrivalLane="c2e_1" arrivalPos="990.00" arrivalPosLat="0.00" arrivalSpeed="14.66" duration="149.80" routeLength="1997.01" waitingTime="0.00" waitingCount="0" stopTime="0.00" timeLoss="14.87" rerouteNo="1" devices="tripinfo_car_w2e_253 routing_car_w2e_253" vType="Car" speedFactor="1.07" vaporized=""/>
    <tripinfo id="car_w2n_217" depart="217.00" departLane="w2sep_1" departPos="3.60" departPosLat="0.00" departSpeed="13.90" departDelay="0.00" arrival="406.25" arrivalLane="c2n_1" arrivalPos="990.00" arrivalPosLat="0.00" arrivalSpeed="13.99" duration="189.25" routeLength="1996.47" waitingTime="28.95" waitingCount="2" stopTime="0.00" timeLoss="45.94" rerouteNo="1" devices="tripinfo_car_w2n_217 routing_car_w2n_217" vType="Car" speedFactor="1.01" vaporized=""/>
    <tripinfo id="car_w2n_236" depart="236.00" departLane="w2sep_1" departPos="3.60" departPosLat="0.00" departSpeed="13.90" departDelay="0.00" arrival="408.50" arrivalLane="c2n_1" arrivalPos="990.00" arrivalPosLat="0.00" arrivalSpeed="14.85" duration="172.50" routeLength="1996.47" waitingTime="16.05" waitingCount="2" stopTime="0.00" timeLoss="40.20" rerouteNo="1" devices="tripinfo_car_w2n_236 routing_car_w2n_236" vType="Car" speedFactor="1.09" vaporized=""/>
    <tripinfo id="car_e2w_278" depart="278.00" departLane="e2sep_1" departPos="3.60" departPosLat="0.00" departSpeed="13.90" departDelay="0.00" arrival="409.35" arrivalLane="c2w_1" arrivalPos="990.00" arrivalPosLat="0.00" arrivalSpeed="15.27" duration="131.35" routeLength="1997.01" waitingTime="0.00" waitingCount="0" stopTime="0.00" timeLoss="0.55" rerouteNo="1" devices="tripinfo_car_e2w_278 routing_car_e2w_278" vType="Car" speedFactor="1.10" vaporized=""/>
    <tripinfo id="car_w2e_269" depart="269.00" departLane="w2sep_1" departPos="3.60" departPosLat="0.00" departSpeed="13.90" departDelay="0.00" arrival="409.85" arrivalLane="c2e_1" arrivalPos="990.00" arrivalPosLat="1.10" arrivalSpeed="14.38" duration="140.85" routeLength="1997.01" waitingTime="0.00" waitingCount="0" stopTime="0.00" timeLoss="1.97" rerouteNo="1" devices="tripinfo_car_w2e_269 routing_car_w2e_269" vType="Car@car_w2e_269" speedFactor="1.03" vaporized=""/>
    <tripinfo id="amb_w2e_300" depart="300.00" departLane="w2sep_1" departPos="6.60" departPosLat="0.00" departSpeed="13.90" departDelay="0.00" arrival="410.45" arrivalLane="c2e_1" arrivalPos="990.00" arrivalPosLat="-0.87" arrivalSpeed="19.73" duration="110.45" routeLength="1994.01" waitingTime="0.00" waitingCount="0" stopTime="0.00" timeLoss="14.80" rerouteNo="1" devices="tripinfo_amb_w2e_300 routing_amb_w2e_300 bluelight_amb_w2e_300 fcd_amb_w2e_300" vType="Ambulance" speedFactor="1.50" vaporized="">
        <example_device customValue1="0.00" customValue2="-1.00"/>
    </tripinfo>
    <tripinfo id="car_w2n_265" depart="265.00" departLane="w2sep_1" departPos="3.60" departPosLat="0.00" departSpeed="13.90" departDelay="0.00" arrival="412.60" arrivalLane="c2n_1" arrivalPos="990.00" arrivalPosLat="0.00" arrivalSpeed="14.08" duration="147.60" routeLength="1996.47" waitingTime="0.00" waitingCount="0" stopTime="0.00" timeLoss="5.28" rerouteNo="1" devices="tripinfo_car_w2n_265 routing_car_w2n_265" vType="Car" speedFactor="1.01" vaporized=""/>
    <tripinfo id="car_w2s_278" depart="278.00" departLane="w2sep_1" departPos="3.60" departPosLat="0.00" departSpeed="13.90" departDelay="0.00" arrival="423.10" arrivalLane="c2s_1" arrivalPos="990.00" arrivalPosLat="0.00" arrivalSpeed="14.13" duration="145.10" routeLength="1986.69" waitingTime="0.00" waitingCount="0" stopTime="0.00" timeLoss="3.76" rerouteNo="1" devices="tripinfo_car_w2s_278 routing_car_w2s_278" vType="Car" speedFactor="1.02" vaporized=""/>
    <tripinfo id="car_e2s_282" depart="282.00" departLane="e2sep_1" departPos="3.60" departPosLat="0.00" departSpeed="13.90" departDelay="0.00" arrival="427.00" arrivalLane="c2s_1" arrivalPos="990.00" arrivalPosLat="0.00" arrivalSpeed="15.20" duration="145.00" routeLength="1996.47" waitingTime="3.65" waitingCount="1" stopTime="0.00" timeLoss="13.30" rerouteNo="1" devices="tripinfo_car_e2s_282 routing_car_e2s_282" vType="Car" speedFactor="1.10" vaporized=""/>
    <tripinfo id="bus_e2w_286" depart="286.00" departLane="e2sep_1" departPos="12.10" departPosLat="0.00" departSpeed="13.90" departDelay="0.00" arrival="430.95" arrivalLane="c2w_1" arrivalPos="990.00" arrivalPosLat="0.00" arrivalSpeed="13.90" duration="144.95" routeLength="1988.51" waitingTime="0.00" waitingCount="0" stopTime="0.00" timeLoss="1.90" rerouteNo="1" devices="tripinfo_bus_e2w_286 routing_bus_e2w_286" vType="Bus" speedFactor="1.00" vaporized=""/>
    <tripinfo id="car_e2s_287" depart="287.50" departLane="e2sep_1" departPos="3.60" departPosLat="0.00" departSpeed="13.90" departDelay="0.50" arrival="438.00" arrivalLane="c2s_1" arrivalPos="990.00" arrivalPosLat="0.00" arrivalSpeed="13.94" duration="150.50" routeLength="1996.47" waitingTime="0.00" waitingCount="0" stopTime="0.00" timeLoss="6.64" rerouteNo="1" devices="tripinfo_car_e2s_287 routing_car_e2s_287" vType="Car" speedFactor="1.00" vaporized=""/>
    <tripinfo id="car_n2w_230" depart="230.45" departLane="n2sep_1" departPos="3.60" departPosLat="0.00" departSpeed="13.90" departDelay="0.45" arrival="442.25" arrivalLane="c2w_1" arrivalPos="990.00" arrivalPosLat="0.00" arrivalSpeed="15.18" duration="211.80" routeLength="1986.69" waitingTime="67.05" waitingCount="1" stopTime="0.00" timeLoss="80.25" rerouteNo="1" devices="tripinfo_car_n2w_230 routing_car_n2w_230" vType="Car" speedFactor="1.09" vaporized=""/>
    <tripinfo id="car_n2s_248" depart="248.00" departLane="n2sep_1" departPos="3.60" departPosLat="0.00" departSpeed="13.90" departDelay="0.00" arrival="443.15" arrivalLane="c2s_1" arrivalPos="990.00" arrivalPosLat="0.00" arrivalSpeed="15.58" duration="195.15" routeLength="1997.01" waitingTime="53.40" waitingCount="1" stopTime="0.00" timeLoss="67.02" rerouteNo="1" devices="tripinfo_car_n2s_248 routing_car_n2s_248" vType="Car" speedFactor="1.12" vaporized=""/>
    <tripinfo id="car_s2e_238" depart="238.00" departLane="s2sep_1" departPos="3.60" departPosLat="0.00" departSpeed="13.90" departDelay="0.00" arrival="444.25" arrivalLane="c2e_1" arrivalPos="990.00" arrivalPosLat="0.00" arrivalSpeed="14.69" duration="206.25" routeLength="1986.69" waitingTime="61.15" waitingCount="1" stopTime="0.00" timeLoss="70.29" rerouteNo="1" devices="tripinfo_car_s2e_238 routing_car_s2e_238" vType="Car" speedFactor="1.06" vaporized=""/>
    <tripinfo id="car_s2n_256" depart="256.00" departLane="s2sep_1" departPos="3.60" departPosLat="0.00" departSpeed="13.90" departDelay="0.00" arrival="450.15" arrivalLane="c2n_1" arrivalPos="990.00" arrivalPosLat="0.00" arrivalSpeed="13.90" duration="194.15" routeLength="1997.01" waitingTime="42.25" waitingCount="1" stopTime="0.00" timeLoss="50.46" rerouteNo="1" devices="tripinfo_car_s2n_256 routing_car_s2n_256" vType="Car" speedFactor="1.00" vaporized=""/>
    <tripinfo id="car_s2e_279" depart="279.00" departLane="s2sep_1" departPos="3.60" departPosLat="0.00" departSpeed="13.90" departDelay="0.00" arrival="452.55" arrivalLane="c2e_1" arrivalPos="990.00" arrivalPosLat="0.00" arrivalSpeed="14.02" duration="173.55" routeLength="1986.69" waitingTime="18.55" waitingCount="1" stopTime="0.00" timeLoss="31.15" rerouteNo="1" devices="tripinfo_car_s2e_279 routing_car_s2e_279" vType="Car" speedFactor="1.01" vaporized=""/>
    <tripinfo id="car_n2s_275" depart="275.00" departLane="n2sep_1" departPos="3.60" departPosLat="0.00" departSpeed="13.90" departDelay="0.00" arrival="452.80" arrivalLane="c2s_1" arrivalPos="990.00" arrivalPosLat="0.00" arrivalSpeed="13.90" duration="177.80" routeLength="1997.01" waitingTime="24.10" waitingCount="1" stopTime="0.00" timeLoss="34.11" rerouteNo="1" devices="tripinfo_car_n2s_275 routing_car_n2s_275" vType="Car" speedFactor="1.00" vaporized=""/>
    <tripinfo id="car_s2n_287" depart="287.00" departLane="s2sep_1" departPos="3.60" departPosLat="0.00" departSpeed="13.90" departDelay="0.00" arrival="453.60" arrivalLane="c2n_1" arrivalPos="990.00" arrivalPosLat="0.00" arrivalSpeed="14.84" duration="166.60" routeLength="1997.01" waitingTime="15.10" waitingCount="1" stopTime="0.00" timeLoss="32.43" rerouteNo="1" devices="tripinfo_car_s2n_287 routing_car_s2n_287" vType="Car" speedFactor="1.07" vaporized=""/>
    <tripinfo id="car_n2w_303" depart="303.00" departLane="n2sep_1" departPos="3.60" departPosLat="0.00" departSpeed="13.90" departDelay="0.00" arrival="454.70" arrivalLane="c2w_1" arrivalPos="990.00" arrivalPosLat="0.00" arrivalSpeed="14.35" duration="151.70" routeLength="1986.69" waitingTime="0.10" waitingCount="1" stopTime="0.00" timeLoss="12.52" rerouteNo="1" devices="tripinfo_car_n2w_303 routing_car_n2w_303" vType="Car" speedFactor="1.03" vaporized=""/>
    <tripinfo id="car_s2e_281" depart="281.00" departLane="s2sep_1" departPos="3.60" departPosLat="0.00" departSpeed="13.90" departDelay="0.00" arrival="454.85" arrivalLane="c2e_1" arrivalPos="990.00" arrivalPosLat="0.00" arrivalSpeed="14.96" duration="173.85" routeLength="1986.69" waitingTime="17.80" waitingCount="1" stopTime="0.00" timeLoss="42.83" rerouteNo="1" devices="tripinfo_car_s2e_281 routing_car_s2e_281" vType="Car" speedFactor="1.10" vaporized=""/>
    <tripinfo id="car_n2s_286" depart="286.00" departLane="n2sep_1" departPos="3.60" departPosLat="0.00" departSpeed="13.90" departDelay="0.00" arrival="456.80" arrivalLane="c2s_1" arrivalPos="990.00" arrivalPosLat="0.00" arrivalSpeed="13.94" duration="170.80" routeLength="1997.01" waitingTime="14.75" waitingCount="1" stopTime="0.00" timeLoss="27.74" rerouteNo="1" devices="tripinfo_car_n2s_286 routing_car_n2s_286" vType="Car" speedFactor="1.00" vaporized=""/>
    <tripinfo id="car_s2e_302" depart="303.35" departLane="s2sep_1" departPos="3.60" departPosLat="0.00" departSpeed="13.90" departDelay="1.35" arrival="456.85" arrivalLane="c2e_1" arrivalPos="990.00" arrivalPosLat="0.00" arrivalSpeed="15.48" duration="153.50" routeLength="1986.69" waitingTime="2.80" waitingCount="1" stopTime="0.00" timeLoss="28.90" rerouteNo="1" devices="tripinfo_car_s2e_302 routing_car_s2e_302" vType="Car" speedFactor="1.15" vaporized=""/>
    <tripinfo id="car_n2w_323" depart="323.00" departLane="n2sep_1" departPos="3.60" departPosLat="0.00" departSpeed="13.90" departDelay="0.00" arrival="457.65" arrivalLane="c2w_1" arrivalPos="990.00" arrivalPosLat="0.00" arrivalSpeed="15.45" duration="134.65" routeLength="1986.69" waitingTime="0.00" waitingCount="0" stopTime="0.00" timeLoss="6.33" rerouteNo="1" devices="tripinfo_car_n2w_323 routing_car_n2w_323" vType="Car" speedFactor="1.12" vaporized=""/>
    <tripinfo id="car_s2n_315" depart="315.00" departLane="s2sep_1" departPos="3.60" departPosLat="0.00" departSpeed="13.90" departDelay="0.00" arrival="459.55" arrivalLane="c2n_1" arrivalPos="990.00" arrivalPosLat="0.00" arrivalSpeed="14.35" duration="144.55" routeLength="1997.01" waitingTime="0.00" waitingCount="0" stopTime="0.00" timeLoss="5.35" rerouteNo="1" devices="tripinfo_car_s2n_315 routing_car_s2n_315" vType="Car" speedFactor="1.03" vaporized=""/>
    <tripinfo id="car_s2e_315" depart="316.40" departLane="s2sep_1" departPos="3.60" departPosLat="0.00" departSpeed="13.90" departDelay="1.40" arrival="460.65" arrivalLane="c2e_1" arrivalPos="990.00" arrivalPosLat="0.00" arrivalSpeed="14.82" duration="144.25" routeLength="1986.69" waitingTime="0.00" waitingCount="0" stopTime="0.00" timeLoss="9.74" rerouteNo="1" devices="tripinfo_car_s2e_315 routing_car_s2e_315" vType="Car" speedFactor="1.07" vaporized=""/>
    <tripinfo id="car_s2n_317" depart="320.60" departLane="s2sep_1" departPos="3.60" departPosLat="0.00" departSpeed="13.90" departDelay="3.60" arrival="463.65" arrivalLane="c2n_1" arrivalPos="990.00" arrivalPosLat="0.00" arrivalSpeed="15.85" duration="143.05" routeLength="1997.01" waitingTime="0.00" waitingCount="0" stopTime="0.00" timeLoss="17.28" rerouteNo="1" devices="tripinfo_car_s2n_317 routing_car_s2n_317" vType="Car" speedFactor="1.14" vaporized=""/>
    <tripinfo id="car_s2n_318" depart="322.35" departLane="s2sep_1" departPos="3.60" departPosLat="0.00" departSpeed="13.90" departDelay="4.35" arrival="465.90" arrivalLane="c2n_1" arrivalPos="990.00" arrivalPosLat="0.00" arrivalSpeed="16.66" duration="143.55" routeLength="1997.01" waitingTime="0.00" waitingCount="0" stopTime="0.00" timeLoss="26.35" rerouteNo="1" devices="tripinfo_car_s2n_318 routing_car_s2n_318" vType="Car" speedFactor="1.23" vaporized=""/>
    <tripinfo id="car_n2s_323" depart="324.30" departLane="n2sep_1" departPos="3.60" departPosLat="0.00" departSpeed="13.90" departDelay="1.30" arrival="467.40" arrivalLane="c2s_1" arrivalPos="990.00" arrivalPosLat="0.00" arrivalSpeed="14.11" duration="143.10" routeLength="1997.01" waitingTime="0.00" waitingCount="0" stopTime="0.00" timeLoss="1.58" rerouteNo="1" devices="tripinfo_car_n2s_323 routing_car_n2s_323" vType="Car" speedFactor="1.02" vaporized=""/>
    <tripinfo id="car_s2n_330" depart="330.00" departLane="s2sep_1" departPos="3.60" departPosLat="0.00" departSpeed="13.90" departDelay="0.00" arrival="469.00" arrivalLane="c2n_1" arrivalPos="990.00" arrivalPosLat="0.00" arrivalSpeed="16.10" duration="139.00" routeLength="1997.01" waitingTime="0.00" waitingCount="0" stopTime="0.00" timeLoss="15.60" rerouteNo="1" devices="tripinfo_car_s2n_330 routing_car_s2n_330" vType="Car" speedFactor="1.16" vaporized=""/>
    <tripinfo id="bus_s2e_315" depart="318.90" departLane="s2sep_1" departPos="12.10" departPosLat="0.00" departSpeed="13.90" departDelay="3.90" arrival="470.45" arrivalLane="c2e_1" arrivalPos="990.00" arrivalPosLat="0.00" arrivalSpeed="13.90" duration="151.55" routeLength="1978.19" waitingTime="0.00" waitingCount="0" stopTime="0.00" timeLoss="8.48" rerouteNo="1" devices="tripinfo_bus_s2e_315 routing_bus_s2e_315" vType="Bus" speedFactor="1.00" vaporized=""/>
    <tripinfo id="car_s2e_331" depart="331.25" departLane="s2sep_1" departPos="3.60" departPosLat="0.00" departSpeed="13.90" departDelay="0.25" arrival="473.10" arrivalLane="c2e_1" arrivalPos="990.00" arrivalPosLat="0.00" arrivalSpeed="15.37" duration="141.85" routeLength="1986.69" waitingTime="0.00" waitingCount="0" stopTime="0.00" timeLoss="14.61" rerouteNo="1" devices="tripinfo_car_s2e_331 routing_car_s2e_331" vType="Car" speedFactor="1.13" vaporized=""/>
    <tripinfo id="car_n2w_326" depart="326.05" departLane="n2sep_1" departPos="3.60" departPosLat="0.00" departSpeed="13.90" departDelay="0.05" arrival="473.70" arrivalLane="c2w_1" arrivalPos="990.00" arrivalPosLat="0.00" arrivalSpeed="14.23" duration="147.65" routeLength="1986.69" waitingTime="0.00" waitingCount="0" stopTime="0.00" timeLoss="7.30" rerouteNo="1" devices="tripinfo_car_n2w_326 routing_car_n2w_326" vType="Car" speedFactor="1.02" vaporized=""/>
    <tripinfo id="car_s2e_337" depart="337.00" departLane="s2sep_1" departPos="3.60" departPosLat="0.00" departSpeed="13.90" departDelay="0.00" arrival="475.70" arrivalLane="c2e_1" arrivalPos="990.00" arrivalPosLat="0.00" arrivalSpeed="15.38" duration="138.70" routeLength="1986.69" waitingTime="0.00" waitingCount="0" stopTime="0.00" timeLoss="10.34" rerouteNo="1" devices="tripinfo_car_s2e_337 routing_car_s2e_337" vType="Car" speedFactor="1.12" vaporized=""/>
    <tripinfo id="car_s2w_264" depart="264.00" departLane="s2sep_1" departPos="3.60" departPosLat="0.00" departSpeed="13.90" departDelay="0.00" arrival="476.65" arrivalLane="c2w_1" arrivalPos="990.00" arrivalPosLat="0.00" arrivalSpeed="14.82" duration="212.65" routeLength="1996.47" waitingTime="61.35" waitingCount="3" stopTime="0.00" timeLoss="78.08" rerouteNo="1" devices="tripinfo_car_s2w_264 routing_car_s2w_264" vType="Car" speedFactor="1.07" vaporized=""/>
</tripinfos>
