<?xml version="1.0" encoding="UTF-8"?>

<!-- generated on Sat Apr 24 18:34:26 2021 by Eclipse SUMO Version 1.4.0
<configuration xmlns:xsi="http://www.w3.org/2001/XMLSchema-instance" xsi:noNamespaceSchemaLocation="http://sumo.dlr.de/xsd/sumoConfiguration.xsd">

    <input>
        <net-file value="sumofiles/junction.net.xml"/>
        <route-files value="sumofiles/junction_preemption_246.rou.xml"/>
        <additional-files value="sumofiles/junction.det.xml"/>
    </input>

    <output>
        <tripinfo-output value="sumofiles/output/tripinfo_preemption_246.xml"/>
    </output>

    <time>
        <begin value="0"/>
        <end value="10000"/>
        <step-length value="0.05"/>
    </time>

    <processing>
        <lateral-resolution value="0.1"/>
    </processing>

    <report>
        <no-warnings value="true"/>
        <error-log value="sumofiles/output/errorlog_preemption_246.log"/>
        <no-step-log value="true"/>
    </report>

    <traci_server>
        <remote-port value="44583"/>
    </traci_server>

    <gui_only>
        <gui-settings-file value="sumofiles/junction-gui.settings.xml"/>
        <tracker-interval value="0.05"/>
    </gui_only>

</configuration>
-->

<tripinfos xmlns:xsi="http://www.w3.org/2001/XMLSchema-instance" xsi:noNamespaceSchemaLocation="http://sumo.dlr.de/xsd/tripinfo_file.xsd">
    <tripinfo id="car_e2s_4" depart="4.00" departLane="e2sep_1" departPos="3.60" departPosLat="0.00" departSpeed="13.90" departDelay="0.00" arrival="143.70" arrivalLane="c2s_1" arrivalPos="990.00" arrivalPosLat="0.00" arrivalSpeed="14.73" duration="139.70" routeLength="1996.47" waitingTime="0.00" waitingCount="0" stopTime="0.00" timeLoss="3.53" rerouteNo="1" devices="tripinfo_car_e2s_4 routing_car_e2s_4" vType="Car" speedFactor="1.06" vaporized=""/>
    <tripinfo id="car_e2w_6" depart="6.00" departLane="e2sep_1" departPos="3.60" departPosLat="0.00" departSpeed="13.90" departDelay="0.00" arrival="149.50" arrivalLane="c2w_1" arrivalPos="990.00" arrivalPosLat="0.00" arrivalSpeed="14.04" duration="143.50" routeLength="1997.01" waitingTime="0.00" waitingCount="0" stopTime="0.00" timeLoss="1.31" rerouteNo="1" devices="tripinfo_car_e2w_6 routing_car_e2w_6" vType="Car" speedFactor="1.01" vaporized=""/>
    <tripinfo id="car_w2n_18" depart="18.00" departLane="w2sep_1" departPos="3.60" departPosLat="0.00" departSpeed="13.90" departDelay="0.00" arrival="156.55" arrivalLane="c2n_1" arrivalPos="990.00" arrivalPosLat="0.00" arrivalSpeed="15.16" duration="138.55" routeLength="1996.47" waitingTime="0.00" waitingCount="0" stopTime="0.00" timeLoss="6.20" rerouteNo="1" devices="tripinfo_car_w2n_18 routing_car_w2n_18" vType="Car" speedFactor="1.09" vaporized=""/>
    <tripinfo id="car_n2w_4" depart="4.00" departLane="n2sep_1" departPos="3.60" departPosLat="0.00" departSpeed="13.90" departDelay="0.00" arrival="161.80" arrivalLane="c2w_1" arrivalPos="990.00" arrivalPosLat="0.00" arrivalSpeed="14.73" duration="157.80" routeLength="1986.69" waitingTime="14.75" waitingCount="1" stopTime="0.00" timeLoss="22.26" rerouteNo="1" devices="tripinfo_car_n2w_4 routing_car_n2w_4" vType="Car" speedFactor="1.06" vaporized=""/>
    <tripinfo id="car_n2s_8" depart="8.00" departLane="n2sep_1" departPos="3.60" departPosLat="0.00" departSpeed="13.90" departDelay="0.00" arrival="162.50" arrivalLane="c2s_1" arrivalPos="990.00" arrivalPosLat="0.00" arrivalSpeed="15.05" duration="154.50" routeLength="1997.01" waitingTime="12.00" waitingCount="1" stopTime="0.00" timeLoss="21.79" rerouteNo="1" devices="tripinfo_car_n2s_8 routing_car_n2s_8" vType="Car" speedFactor="1.08" vaporized=""/>
    <tripinfo id="car_s2n_11" depart="11.00" departLane="s2sep_1" departPos="3.60" departPosLat="0.00" departSpeed="13.90" departDelay="0.00" arrival="164.30" arrivalLane="c2n_1" arrivalPos="990.00" arrivalPosLat="0.00" arrivalSpeed="14.32" duration="153.30" routeLength="1997.01" waitingTime="5.90" waitingCount="1" stopTime="0.00" timeLoss="13.85" rerouteNo="1" devices="tripinfo_car_s2n_11 routing_car_s2n_11" vType="Car" speedFactor="1.03" vaporized=""/>
    <tripinfo id="car_s2e_17" depart="17.45" departLane="s2sep_1" departPos="3.60" departPosLat="0.00" departSpeed="13.90" departDelay="0.45" arrival="165.45" arrivalLane="c2e_1" arrivalPos="990.00" arrivalPosLat="0.00" arrivalSpeed="14.32" duration="148.00" routeLength="1986.69" waitingTime="0.00" waitingCount="0" stopTime="0.00" timeLoss="8.54" rerouteNo="1" devices="tripinfo_car_s2e_17 routing_car_s2e_17" vType="Car" speedFactor="1.03" vaporized=""/>
    <tripinfo id="car_s2w_16" depart="16.00" departLane="s2sep_1" departPos="3.60" departPosLat="0.00" departSpeed="13.90" departDelay="0.00" arrival="170.35" arrivalLane="c2w_1" arrivalPos="990.00" arrivalPosLat="0.00" arrivalSpeed="14.04" duration="154.35" routeLength="1996.47" waitingTime="0.75" waitingCount="1" stopTime="0.00" timeLoss="11.49" rerouteNo="1" devices="tripinfo_car_s2w_16 routing_car_s2w_16" vType="Car" speedFactor="1.01" vaporized=""/>
    <tripinfo id="car_n2e_13" depart="13.00" departLane="n2sep_1" departPos="3.60" departPosLat="0.00" departSpeed="13.90" departDelay="0.00" arrival="171.25" arrivalLane="c2e_1" arrivalPos="990.00" arrivalPosLat="0.00" arrivalSpeed="13.90" duration="158.25" routeLength="1996.47" waitingTime="1.65" waitingCount="1" stopTime="0.00" timeLoss="13.91" rerouteNo="1" devices="tripinfo_car_n2e_13 routing_car_n2e_13" vType="Car" speedFactor="1.00" vaporized=""/>
    <tripinfo id="car_s2w_20" depart="20.00" departLane="s2sep_1" departPos="3.60" departPosLat="0.00" departSpeed="13.90" departDelay="0.00" arrival="173.95" arrivalLane="c2w_1" arrivalPos="990.00" arrivalPosLat="0.00" arrivalSpeed="14.24" duration="153.95" routeLength="1996.47" waitingTime="0.00" waitingCount="0" stopTime="0.00" timeLoss="13.34" rerouteNo="1" devices="tripinfo_car_s2w_20 routing_car_s2w_20" vType="Car" speedFactor="1.03" vaporized=""/>
    <tripinfo id="car_n2e_25" depart="25.00" departLane="n2sep_1" departPos="3.60" departPosLat="0.00" departSpeed="13.90" departDelay="0.00" arrival="175.30" arrivalLane="c2e_1" arrivalPos="990.00" arrivalPosLat="0.00" arrivalSpeed="13.88" duration="150.30" routeLength="1996.47" waitingTime="0.00" waitingCount="0" stopTime="0.00" timeLoss="5.95" rerouteNo="1" devices="tripinfo_car_n2e_25 routing_car_n2e_25" vType="Car" speedFactor="1.00" vaporized=""/>
    <tripinfo id="car_s2w_33" depart="33.00" departLane="s2sep_1" departPos="3.60" departPosLat="0.00" departSpeed="13.90" departDelay="0.00" arrival="175.90" arrivalLane="c2w_1" arrivalPos="990.00" arrivalPosLat="0.00" arrivalSpeed="15.42" duration="142.90" routeLength="1996.47" waitingTime="0.00" waitingCount="0" stopTime="0.00" timeLoss="18.27" rerouteNo="1" devices="tripinfo_car_s2w_33 routing_car_s2w_33" vType="Car" speedFactor="1.16" vaporized=""/>
    <tripinfo id="car_s2w_34" depart="34.25" departLane="s2sep_1" departPos="3.60" departPosLat="0.00" departSpeed="13.90" departDelay="0.25" arrival="181.25" arrivalLane="c2w_1" arrivalPos="990.00" arrivalPosLat="0.00" arrivalSpeed="14.15" duration="147.00" routeLength="1996.47" waitingTime="0.00" waitingCount="0" stopTime="0.00" timeLoss="5.22" rerouteNo="1" devices="tripinfo_car_s2w_34 routing_car_s2w_34" vType="Car" speedFactor="1.02" vaporized=""/>
    <tripinfo id="car_e2w_17" depart="17.00" departLane="e2sep_1" departPos="3.60" departPosLat="0.00" departSpeed="13.90" departDelay="0.00" arrival="205.40" arrivalLane="c2w_1" arrivalPos="990.00" arrivalPosLat="0.00" arrivalSpeed="15.05" duration="188.40" routeLength="1997.01" waitingTime="48.00" waitingCount="1" stopTime="0.00" timeLoss="55.70" rerouteNo="1" devices="tripinfo_car_e2w_17 routing_car_e2w_17" vType="Car" speedFactor="1.08" vaporized=""/>
    <tripinfo id="car_w2s_15" depart="15.00" departLane="w2sep_1" departPos="3.60" departPosLat="0.00" departSpeed="13.90" departDelay="0.00" arrival="207.55" arrivalLane="c2s_1" arrivalPos="990.00" arrivalPosLat="0.00" arrivalSpeed="14.54" duration="192.55" routeLength="1986.69" waitingTime="48.25" waitingCount="1" stopTime="0.00" timeLoss="55.20" rerouteNo="1" devices="tripinfo_car_w2s_15 routing_car_w2s_15" vType="Car" speedFactor="1.05" vaporized=""/>
    <tripinfo id="car_e2w_24" depart="24.00" departLane="e2sep_1" departPos="3.60" departPosLat="0.00" departSpeed="13.90" departDelay="0.00" arrival="208.50" arrivalLane="c2w_1" arrivalPos="990.00" arrivalPosLat="0.00" arrivalSpeed="15.53" duration="184.50" routeLength="1997.01" waitingTime="43.80" waitingCount="1" stopTime="0.00" timeLoss="56.55" rerouteNo="1" devices="tripinfo_car_e2w_24 routing_car_e2w_24" vType="Car" speedFactor="1.12" vaporized=""/>
    <tripinfo id="car_w2s_23" depart="23.00" departLane="w2sep_1" departPos="3.60" departPosLat="0.00" departSpeed="13.90" departDelay="0.00" arrival="211.95" arrivalLane="c2s_1" arrivalPos="990.00" arrivalPosLat="0.00" arrivalSpeed="14.54" duration="188.95" routeLength="1986.69" waitingTime="40.30" waitingCount="1" stopTime="0.00" timeLoss="51.74" rerouteNo="1" devices="tripinfo_car_w2s_23 routing_car_w2s_23" vType="Car" speedFactor="1.05" vaporized=""/>
    <tripinfo id="car_e2n_27" depart="27.00" departLane="e2sep_1" departPos="3.60" departPosLat="0.00" departSpeed="13.90" departDelay="0.00" arrival="212.10" arrivalLane="c2n_1" arrivalPos="990.00" arrivalPosLat="0.00" arrivalSpeed="14.54" duration="185.10" routeLength="1986.69" waitingTime="37.40" waitingCount="1" stopTime="0.00" timeLoss="47.72" rerouteNo="1" devices="tripinfo_car_e2n_27 routing_car_e2n_27" vType="Car" speedFactor="1.05" vaporized=""/>
    <tripinfo id="car_e2n_64" depart="64.00" departLane="e2sep_1" departPos="3.60" departPosLat="0.00" departSpeed="13.90" departDelay="0.00" arrival="214.65" arrivalLane="c2n_1" arrivalPos="990.00" arrivalPosLat="0.00" arrivalSpeed="16.13" duration="150.65" routeLength="1986.69" waitingTime="8.00" waitingCount="1" stopTime="0.00" timeLoss="28.74" rerouteNo="1" devices="tripinfo_car_e2n_64 routing_car_e2n_64" vType="Car" speedFactor="1.18" vaporized=""/>
    <tripinfo id="car_w2e_33" depart="33.00" departLane="w2sep_1" departPos="3.60" departPosLat="0.00" departSpeed="13.90" departDelay="0.00" arrival="215.10" arrivalLane="c2e_1" arrivalPos="990.00" arrivalPosLat="0.00" arrivalSpeed="13.90" duration="182.10" routeLength="1997.01" waitingTime="28.95" waitingCount="1" stopTime="0.00" timeLoss="38.41" rerouteNo="1" devices="tripinfo_car_w2e_33 routing_car_w2e_33" vType="Car" speedFactor="1.00" vaporized=""/>
    <tripinfo id="car_w2s_53" depart="53.00" departLane="w2sep_1" departPos="3.60" departPosLat="0.00" departSpeed="13.90" departDelay="0.00" arrival="215.25" arrivalLane="c2s_1" arrivalPos="990.00" arrivalPosLat="0.00" arrivalSpeed="15.54" duration="162.25" routeLength="1986.69" waitingTime="15.40" waitingCount="1" stopTime="0.00" timeLoss="34.32" rerouteNo="1" devices="tripinfo_car_w2s_53 routing_car_w2s_53" vType="Car" speedFactor="1.12" vaporized=""/>
    <tripinfo id="car_w2e_42" depart="42.00" departLane="w2sep_1" departPos="3.60" departPosLat="0.00" departSpeed="13.90" departDelay="0.00" arrival="217.40" arrivalLane="c2e_1" arrivalPos="990.00" arrivalPosLat="0.00" arrivalSpeed="14.88" duration="175.40" routeLength="1997.01" waitingTime="24.45" waitingCount="1" stopTime="0.00" timeLoss="43.68" rerouteNo="1" devices="tripinfo_car_w2e_42 routing_car_w2e_42" vType="Car" speedFactor="1.09" vaporized=""/>
    <tripinfo id="car_e2w_30" depart="30.25" departLane="e2sep_1" departPos="3.60" departPosLat="0.00" departSpeed="13.90" departDelay="0.25" arrival="217.45" arrivalLane="c2w_1" arrivalPos="990.00" arrivalPosLat="0.00" arrivalSpeed="13.90" duration="187.20" routeLength="1997.01" waitingTime="29.30" waitingCount="1" stopTime="0.00" timeLoss="43.50" rerouteNo="1" devices="tripinfo_car_e2w_30 routing_car_e2w_30" vType="Car" speedFactor="1.00" vaporized=""/>
    <tripinfo id="car_e2w_51" depart="51.00" departLane="e2sep_1" departPos="3.60" departPosLat="0.00" departSpeed="13.90" departDelay="0.00" arrival="220.30" arrivalLane="c2w_1" arrivalPos="990.00" arrivalPosLat="0.00" arrivalSpeed="14.45" duration="169.30" routeLength="1997.01" waitingTime="16.40" waitingCount="1" stopTime="0.00" timeLoss="32.08" rerouteNo="1" devices="tripinfo_car_e2w_51 routing_car_e2w_51" vType="Car" speedFactor="1.05" vaporized=""/>
    <tripinfo id="car_w2e_50" depart="50.00" departLane="w2sep_1" departPos="3.60" departPosLat="0.00" departSpeed="13.90" departDelay="0.00" arrival="220.90" arrivalLane="c2e_1" arrivalPos="990.00" arrivalPosLat="0.00" arrivalSpeed="14.23" duration="170.90" routeLength="1997.01" waitingTime="16.15" waitingCount="1" stopTime="0.00" timeLoss="30.88" rerouteNo="1" devices="tripinfo_car_w2e_50 routing_car_w2e_50" vType="Car" speedFactor="1.03" vaporized=""/>
    <tripinfo id="car_e2w_59" depart="59.00" departLane="e2sep_1" departPos="3.60" departPosLat="0.00" departSpeed="13.90" departDelay="0.00" arrival="222.35" arrivalLane="c2w_1" arrivalPos="990.00" arrivalPosLat="0.00" arrivalSpeed="15.23" duration="163.35" routeLength="1997.01" waitingTime="8.65" waitingCount="1" stopTime="0.00" timeLoss="36.39" rerouteNo="1" devices="tripinfo_car_e2w_59 routing_car_e2w_59" vType="Car" speedFactor="1.13" vaporized=""/>
    <tripinfo id="car_w2s_62" depart="62.00" departLane="w2sep_1" departPos="3.60" departPosLat="0.00" departSpeed="13.90" departDelay="0.00" arrival="224.55" arrivalLane="c2s_1" arrivalPos="990.00" arrivalPosLat="0.00" arrivalSpeed="13.90" duration="162.55" routeLength="1986.69" waitingTime="5.10" waitingCount="1" stopTime="0.00" timeLoss="18.88" rerouteNo="1" devices="tripinfo_car_w2s_62 routing_car_w2s_62" vType="Car" speedFactor="1.00" vaporized=""/>
    <tripinfo id="car_w2n_35" depart="35.00" departLane="w2sep_1" departPos="3.60" departPosLat="0.00" departSpeed="13.90" departDelay="0.00" arrival="226.05" arrivalLane="c2n_1" arrivalPos="990.00" arrivalPosLat="0.00" arrivalSpeed="14.04" duration="191.05" routeLength="1996.47" waitingTime="34.45" waitingCount="2" stopTime="0.00" timeLoss="48.17" rerouteNo="1" devices="tripinfo_car_w2n_35 routing_car_w2n_35" vType="Car" speedFactor="1.01" vaporized=""/>
    <tripinfo id="car_w2s_71" depart="71.00" departLane="w2sep_1" departPos="3.60" departPosLat="0.00" departSpeed="13.90" departDelay="0.00" arrival="226.45" arrivalLane="c2s_1" arrivalPos="990.00" arrivalPosLat="0.00" arrivalSpeed="15.33" duration="155.45" routeLength="1986.69" waitingTime="4.40" waitingCount="1" stopTime="0.00" timeLoss="31.02" rerouteNo="1" devices="tripinfo_car_w2s_71 routing_car_w2s_71" vType="Car" speedFactor="1.15" vaporized=""/>
    <tripinfo id="car_e2s_28" depart="28.45" departLane="e2sep_1" departPos="3.60" departPosLat="0.00" departSpeed="13.90" departDelay="0.45" arrival="231.10" arrivalLane="c2s_1" arrivalPos="990.00" arrivalPosLat="0.00" arrivalSpeed="13.89" duration="202.65" routeLength="1996.47" waitingTime="43.90" waitingCount="2" stopTime="0.00" timeLoss="58.32" rerouteNo="1" devices="tripinfo_car_e2s_28 routing_car_e2s_28" vType="Car" speedFactor="1.00" vaporized=""/>
    <tripinfo id="car_e2n_85" depart="85.00" departLane="e2sep_1" departPos="3.60" departPosLat="0.00" departSpeed="13.90" departDelay="0.00" arrival="233.00" arrivalLane="c2n_1" arrivalPos="990.00" arrivalPosLat="0.00" arrivalSpeed="13.90" duration="148.00" routeLength="1986.69" waitingTime="0.00" waitingCount="0" stopTime="0.00" timeLoss="4.33" rerouteNo="1" devices="tripinfo_car_e2n_85 routing_car_e2n_85" vType="Car" speedFactor="1.00" vaporized=""/>
    <tripinfo id="car_e2s_55" depart="55.00" departLane="e2sep_1" departPos="3.60" departPosLat="0.00" departSpeed="13.90" departDelay="0.00" arrival="234.80" arrivalLane="c2s_1" arrivalPos="990.00" arrivalPosLat="0.00" arrivalSpeed="13.88" duration="179.80" routeLength="1996.47" waitingTime="18.65" waitingCount="2" stopTime="0.00" timeLoss="35.45" rerouteNo="1" devices="tripinfo_car_e2s_55 routing_car_e2s_55" vType="Car" speedFactor="1.00" vaporized=""/>
    <tripinfo id="car_e2n_98" depart="98.00" departLane="e2sep_1" departPos="3.60" departPosLat="0.00" departSpeed="13.90" departDelay="0.00" arrival="235.75" arrivalLane="c2n_1" arrivalPos="990.00" arrivalPosLat="0.00" arrivalSpeed="15.03" duration="137.75" routeLength="1986.69" waitingTime="0.00" waitingCount="0" stopTime="0.00" timeLoss="6.17" rerouteNo="1" devices="tripinfo_car_e2n_98 routing_car_e2n_98" vType="Car" speedFactor="1.09" vaporized=""/>
    <tripinfo id="bus_e2s_72" depart="72.00" departLane="e2sep_1" departPos="12.10" departPosLat="0.00" departSpeed="13.90" departDelay="0.00" arrival="238.85" arrivalLane="c2s_1" arrivalPos="990.00" arrivalPosLat="0.00" arrivalSpeed="13.82" duration="166.85" routeLength="1987.97" waitingTime="8.70" waitingCount="1" stopTime="0.00" timeLoss="23.15" rerouteNo="1" devices="tripinfo_bus_e2s_72 routing_bus_e2s_72" vType="Bus" speedFactor="1.00" vaporized=""/>
    <tripinfo id="car_s2e_78" depart="78.00" departLane="s2sep_1" departPos="3.60" departPosLat="0.00" departSpeed="13.90" departDelay="0.00" arrival="245.50" arrivalLane="c2e_1" arrivalPos="990.00" arrivalPosLat="0.00" arrivalSpeed="16.29" duration="167.50" routeLength="1986.69" waitingTime="36.85" waitingCount="1" stopTime="0.00" timeLoss="44.89" rerouteNo="1" devices="tripinfo_car_s2e_78 routing_car_s2e_78" vType="Car" speedFactor="1.17" vaporized=""/>
    <tripinfo id="bus_w2n_85" depart="85.00" departLane="w2sep_1" departPos="12.10" departPosLat="0.00" departSpeed="13.90" departDelay="0.00" arrival="246.55" arrivalLane="c2n_1" arrivalPos="990.00" arrivalPosLat="0.00" arrivalSpeed="13.90" duration="161.55" routeLength="1987.97" waitingTime="7.90" waitingCount="1" stopTime="0.00" timeLoss="17.80" rerouteNo="1" devices="tripinfo_bus_w2n_85 routing_bus_w2n_85" vType="Bus" speedFactor="1.00" vaporized=""/>
    <tripinfo id="car_w2n_88" depart="88.00" departLane="w2sep_1" departPos="3.60" departPosLat="0.00" departSpeed="13.90" departDelay="0.00" arrival="248.90" arrivalLane="c2n_1" arrivalPos="990.00" arrivalPosLat="0.00" arrivalSpeed="15.73" duration="160.90" routeLength="1996.47" waitingTime="6.65" waitingCount="1" stopTime="0.00" timeLoss="38.54" rerouteNo="1" devices="tripinfo_car_w2n_88 routing_car_w2n_88" vType="Car" speedFactor="1.18" vaporized=""/>
    <tripinfo id="car_n2s_89" depart="89.00" departLane="n2sep_1" departPos="3.60" departPosLat="0.00" departSpeed="13.90" departDelay="0.00" arrival="250.75" arrivalLane="c2s_1" arrivalPos="990.00" arrivalPosLat="0.00" arrivalSpeed="16.10" duration="161.75" routeLength="1997.01" waitingTime="24.80" waitingCount="1" stopTime="0.00" timeLoss="37.67" rerouteNo="1" devices="tripinfo_car_n2s_89 routing_car_n2s_89" vType="Car" speedFactor="1.16" vaporized=""/>
    <tripinfo id="car_w2n_92" depart="92.00" departLane="w2sep_1" departPos="3.60" departPosLat="0.00" departSpeed="13.90" departDelay="0.00" arrival="252.60" arrivalLane="c2n_1" arrivalPos="990.00" arrivalPosLat="0.00" arrivalSpeed="14.13" duration="160.60" routeLength="1996.47" waitingTime="3.60" waitingCount="1" stopTime="0.00" timeLoss="18.85" rerouteNo="1" devices="tripinfo_car_w2n_92 routing_car_w2n_92" vType="Car" speedFactor="1.02" vaporized=""/>
    <tripinfo id="car_n2w_54" depart="54.00" departLane="n2sep_1" departPos="3.60" departPosLat="0.00" departSpeed="13.90" departDelay="0.00" arrival="255.65" arrivalLane="c2w_1" arrivalPos="990.00" arrivalPosLat="0.00" arrivalSpeed="13.90" duration="201.65" routeLength="1986.69" waitingTime="51.30" waitingCount="1" stopTime="0.00" timeLoss="57.96" rerouteNo="1" devices="tripinfo_car_n2w_54 routing_car_n2w_54" vType="Car" speedFactor="1.00" vaporized=""/>
    <tripinfo id="car_s2n_80" depart="80.00" departLane="s2sep_1" departPos="3.60" departPosLat="0.00" departSpeed="13.90" departDelay="0.00" arrival="258.50" arrivalLane="c2n_1" arrivalPos="990.00" arrivalPosLat="0.00" arrivalSpeed="13.90" duration="178.50" routeLength="1997.01" waitingTime="25.55" waitingCount="1" stopTime="0.00" timeLoss="34.80" rerouteNo="1" devices="tripinfo_car_s2n_80 routing_car_s2n_80" vType="Car" speedFactor="1.00" vaporized=""/>
    <tripinfo id="car_n2w_81" depart="81.00" departLane="n2sep_1" departPos="3.60" departPosLat="0.00" departSpeed="13.90" departDelay="0.00" arrival="259.40" arrivalLane="c2w_1" arrivalPos="990.00" arrivalPosLat="0.00" arrivalSpeed="14.15" duration="178.40" routeLength="1986.69" waitingTime="25.65" waitingCount="1" stopTime="0.00" timeLoss="37.49" rerouteNo="1" devices="tripinfo_car_n2w_81 routing_car_n2w_81" vType="Car" speedFactor="1.02" vaporized=""/>
    <tripinfo id="car_s2n_100" depart="101.40" departLane="s2sep_1" departPos="3.60" departPosLat="0.00" departSpeed="13.90" departDelay="1.40" arrival="261.35" arrivalLane="c2n_1" arrivalPos="990.00" arrivalPosLat="0.00" arrivalSpeed="14.40" duration="159.95" routeLength="1997.01" waitingTime="5.65" waitingCount="1" stopTime="0.00" timeLoss="22.22" rerouteNo="1" devices="tripinfo_car_s2n_100 routing_car_s2n_100" vType="Car" speedFactor="1.04" vaporized=""/>
    <tripinfo id="car_s2w_88" depart="88.00" departLane="s2sep_1" departPos="3.60" departPosLat="0.00" departSpeed="13.90" departDelay="0.00" arrival="262.15" arrivalLane="c2w_1" arrivalPos="990.00" arrivalPosLat="0.00" arrivalSpeed="15.18" duration="174.15" routeLength="1996.47" waitingTime="28.60" waitingCount="2" stopTime="0.00" timeLoss="43.19" rerouteNo="1" devices="tripinfo_car_s2w_88 routing_car_s2w_88" vType="Car" speedFactor="1.10" vaporized=""/>
    <tripinfo id="car_n2s_105" depart="105.00" departLane="n2sep_1" departPos="3.60" departPosLat="0.00" departSpeed="13.90" departDelay="0.00" arrival="262.50" arrivalLane="c2s_1" arrivalPos="990.00" arrivalPosLat="0.00" arrivalSpeed="13.90" duration="157.50" routeLength="1997.01" waitingTime="3.25" waitingCount="1" stopTime="0.00" timeLoss="13.80" rerouteNo="1" devices="tripinfo_car_n2s_105 routing_car_n2s_105" vType="Car" speedFactor="1.00" vaporized=""/>
    <tripinfo id="car_s2e_107" depart="107.00" departLane="s2sep_1" departPos="3.60" departPosLat="0.00" departSpeed="13.90" departDelay="0.00" arrival="262.50" arrivalLane="c2e_1" arrivalPos="990.00" arrivalPosLat="0.00" arrivalSpeed="13.90" duration="155.50" routeLength="1986.69" waitingTime="0.00" waitingCount="0" stopTime="0.00" timeLoss="11.83" rerouteNo="1" devices="tripinfo_car_s2e_107 routing_car_s2e_107" vType="Car" speedFactor="1.00" vaporized=""/>
    <tripinfo id="car_n2s_107" depart="107.00" departLane="n2sep_1" departPos="3.60" departPosLat="0.00" departSpeed="13.90" departDelay="0.00" arrival="266.70" arrivalLane="c2s_1" arrivalPos="990.00" arrivalPosLat="0.00" arrivalSpeed="13.89" duration="159.70" routeLength="1997.01" waitingTime="0.00" waitingCount="0" stopTime="0.00" timeLoss="16.03" rerouteNo="1" devices="tripinfo_car_n2s_107 routing_car_n2s_107" vType="Car" speedFactor="1.00" vaporized=""/>
    <tripinfo id="car_s2w_100" depart="100.00" departLane="s2sep_1" departPos="3.60" departPosLat="0.00" departSpeed="13.90" departDelay="0.00" arrival="267.65" arrivalLane="c2w_1" arrivalPos="990.00" arrivalPosLat="0.00" arrivalSpeed="14.42" duration="167.65" routeLength="1996.47" waitingTime="13.85" waitingCount="2" stopTime="0.00" timeLoss="28.59" rerouteNo="1" devices="tripinfo_car_s2w_100 routing_car_s2w_100" vType="Car" speedFactor="1.04" vaporized=""/>
    <tripinfo id="car_s2e_120" depart="120.00" departLane="s2sep_1" departPos="3.60" departPosLat="0.00" departSpeed="13.90" departDelay="0.00" arrival="268.40" arrivalLane="c2e_1" arrivalPos="990.00" arrivalPosLat="0.00" arrivalSpeed="13.90" duration="148.40" routeLength="1986.69" waitingTime="0.00" waitingCount="0" stopTime="0.00" timeLoss="4.72" rerouteNo="1" devices="tripinfo_car_s2e_120 routing_car_s2e_120" vType="Car" speedFactor="1.00" vaporized=""/>
    <tripinfo id="car_s2n_127" depart="127.00" departLane="s2sep_1" departPos="3.60" departPosLat="0.00" departSpeed="13.90" departDelay="0.00" arrival="268.90" arrivalLane="c2n_1" arrivalPos="990.00" arrivalPosLat="0.00" arrivalSpeed="14.23" duration="141.90" routeLength="1997.01" waitingTime="0.00" waitingCount="0" stopTime="0.00" timeLoss="1.53" rerouteNo="1" devices="tripinfo_car_s2n_127 routing_car_s2n_127" vType="Car" speedFactor="1.02" vaporized=""/>
    <tripinfo id="car_s2w_104" depart="104.00" departLane="s2sep_1" departPos="3.60" departPosLat="0.00" departSpeed="13.90" departDelay="0.00" arrival="272.60" arrivalLane="c2w_1" arrivalPos="990.00" arrivalPosLat="0.00" arrivalSpeed="14.04" duration="168.60" routeLength="1996.47" waitingTime="4.65" waitingCount="2" stopTime="0.00" timeLoss="25.75" rerouteNo="1" devices="tripinfo_car_s2w_104 routing_car_s2w_104" vType="Car" speedFactor="1.01" vaporized=""/>
    <tripinfo id="car_n2e_75" depart="75.00" departLane="n2sep_1" departPos="3.60" departPosLat="0.00" departSpeed="13.90" departDelay="0.00" arrival="273.95" arrivalLane="c2e_1" arrivalPos="990.00" arrivalPosLat="0.00" arrivalSpeed="13.97" duration="198.95" routeLength="1996.47" waitingTime="43.80" waitingCount="2" stopTime="0.00" timeLoss="55.37" rerouteNo="1" devices="tripinfo_car_n2e_75 routing_car_n2e_75" vType="Car" speedFactor="1.01" vaporized=""/>
    <tripinfo id="car_s2w_136" depart="136.00" departLane="s2sep_1" departPos="3.60" departPosLat="0.00" departSpeed="13.90" departDelay="0.00" arrival="274.75" arrivalLane="c2w_1" arrivalPos="990.00" arrivalPosLat="0.00" arrivalSpeed="15.13" duration="138.75" routeLength="1996.47" waitingTime="0.00" waitingCount="0" stopTime="0.00" timeLoss="9.78" rerouteNo="1" devices="tripinfo_car_s2w_136 routing_car_s2w_136" vType="Car" speedFactor="1.12" vaporized=""/>
    <tripinfo id="car_n2e_90" depart="90.25" departLane="n2sep_1" departPos="3.60" departPosLat="0.00" departSpeed="13.90" departDelay="0.25" arrival="277.20" arrivalLane="c2e_1" arrivalPos="990.00" arrivalPosLat="0.00" arrivalSpeed="14.27" duration="186.95" routeLength="1996.47" waitingTime="28.95" waitingCount="2" stopTime="0.00" timeLoss="46.86" rerouteNo="1" devices="tripinfo_car_n2e_90 routing_car_n2e_90" vType="Car" speedFactor="1.03" vaporized=""/>
    <tripinfo id="car_s2n_136" depart="137.30" departLane="s2sep_1" departPos="3.60" departPosLat="0.00" departSpeed="13.90" departDelay="1.30" arrival="280.40" arrivalLane="c2n_1" arrivalPos="990.00" arrivalPosLat="0.00" arrivalSpeed="14.12" duration="143.10" routeLength="1997.01" waitingTime="0.00" waitingCount="0" stopTime="0.00" timeLoss="1.64" rerouteNo="1" devices="tripinfo_car_s2n_136 routing_car_s2n_136" vType="Car" speedFactor="1.02" vaporized=""/>
    <tripinfo id="car_n2e_117" depart="117.00" departLane="n2sep_1" departPos="3.60" departPosLat="0.00" departSpeed="13.90" departDelay="0.00" arrival="281.00" arrivalLane="c2e_1" arrivalPos="990.00" arrivalPosLat="0.00" arrivalSpeed="13.92" duration="164.00" routeLength="1996.47" waitingTime="6.00" waitingCount="1" stopTime="0.00" timeLoss="20.13" rerouteNo="1" devices="tripinfo_car_n2e_117 routing_car_n2e_117" vType="Car" speedFactor="1.00" vaporized=""/>
    <tripinfo id="car_w2s_103" depart="103.00" departLane="w2sep_1" departPos="3.60" departPosLat="0.00" departSpeed="13.90" departDelay="0.00" arrival="295.00" arrivalLane="c2s_1" arrivalPos="990.00" arrivalPosLat="0.00" arrivalSpeed="15.12" duration="192.00" routeLength="1986.69" waitingTime="52.45" waitingCount="1" stopTime="0.00" timeLoss="59.97" rerouteNo="1" devices="tripinfo_car_w2s_103 routing_car_w2s_103" vType="Car" speedFactor="1.09" vaporized=""/>
    <tripinfo id="car_e2w_114" depart="114.00" departLane="e2sep_1" departPos="3.60" departPosLat="0.00" departSpeed="13.90" departDelay="0.00" arrival="299.55" arrivalLane="c2w_1" arrivalPos="990.00" arrivalPosLat="0.00" arrivalSpeed="14.13" duration="185.55" routeLength="1997.01" waitingTime="37.10" waitingCount="1" stopTime="0.00" timeLoss="44.25" rerouteNo="1" devices="tripinfo_car_e2w_114 routing_car_e2w_114" vType="Car" speedFactor="1.02" vaporized=""/>
    <tripinfo id="car_e2w_128" depart="128.25" departLane="e2sep_1" departPos="3.60" departPosLat="0.00" departSpeed="13.90" departDelay="0.25" arrival="301.70" arrivalLane="c2w_1" arrivalPos="990.00" arrivalPosLat="0.00" arrivalSpeed="15.31" duration="173.45" routeLength="1997.01" waitingTime="28.00" waitingCount="1" stopTime="0.00" timeLoss="46.50" rerouteNo="1" devices="tripinfo_car_e2w_128 routing_car_e2w_128" vType="Car" speedFactor="1.13" vaporized=""/>
    <tripinfo id="car_w2s_107" depart="107.00" departLane="w2sep_1" departPos="3.60" departPosLat="0.00" departSpeed="13.90" departDelay="0.00" arrival="303.85" arrivalLane="c2s_1" arrivalPos="990.00" arrivalPosLat="0.00" arrivalSpeed="13.90" duration="196.85" routeLength="1986.69" waitingTime="43.70" waitingCount="1" stopTime="0.00" timeLoss="53.20" rerouteNo="1" devices="tripinfo_car_w2s_107 routing_car_w2s_107" vType="Car" speedFactor="1.00" vaporized=""/>
    <tripinfo id="car_w2e_118" depart="118.00" departLane="w2sep_1" departPos="3.60" departPosLat="0.00" departSpeed="13.90" departDelay="0.00" arrival="305.15" arrivalLane="c2e_1" arrivalPos="990.00" arrivalPosLat="0.00" arrivalSpeed="13.90" duration="187.15" routeLength="1997.01" waitingTime="33.15" waitingCount="1" stopTime="0.00" timeLoss="43.46" rerouteNo="1" devices="tripinfo_car_w2e_118 routing_car_w2e_118" vType="Car" speedFactor="1.00" vaporized=""/>
    <tripinfo id="car_e2n_137" depart="137.00" departLane="e2sep_1" departPos="3.60" departPosLat="0.00" departSpeed="13.90" departDelay="0.00" arrival="305.20" arrivalLane="c2n_1" arrivalPos="990.00" arrivalPosLat="0.00" arrivalSpeed="13.90" duration="168.20" routeLength="1986.69" waitingTime="14.45" waitingCount="1" stopTime="0.00" timeLoss="24.51" rerouteNo="1" devices="tripinfo_car_e2n_137 routing_car_e2n_137" vType="Car" speedFactor="1.00" vaporized=""/>
    <tripinfo id="car_e2s_127" depart="127.00" departLane="e2sep_1" departPos="3.60" departPosLat="0.00" departSpeed="13.90" departDelay="0.00" arrival="305.85" arrivalLane="c2s_1" arrivalPos="990.00" arrivalPosLat="0.00" arrivalSpeed="15.29" duration="178.85" routeLength="1996.47" waitingTime="35.85" waitingCount="2" stopTime="0.00" timeLoss="52.53" rerouteNo="1" devices="tripinfo_car_e2s_127 routing_car_e2s_127" vType="Car" speedFactor="1.14" vaporized=""/>
    <tripinfo id="car_w2e_138" depart="138.00" departLane="w2sep_1" departPos="3.60" departPosLat="0.00" departSpeed="13.90" departDelay="0.00" arrival="307.00" arrivalLane="c2e_1" arrivalPos="990.00" arrivalPosLat="0.00" arrivalSpeed="15.50" duration="169.00" routeLength="1997.01" waitingTime="25.15" waitingCount="1" stopTime="0.00" timeLoss="47.06" rerouteNo="1" devices="tripinfo_car_w2e_138 routing_car_w2e_138" vType="Car" speedFactor="1.18" vaporized=""/>
    <tripinfo id="car_e2s_134" depart="134.00" departLane="e2sep_1" departPos="3.60" departPosLat="0.00" departSpeed="13.90" departDelay="0.00" arrival="309.00" arrivalLane="c2s_1" arrivalPos="990.00" arrivalPosLat="0.00" arrivalSpeed="14.98" duration="175.00" routeLength="1996.47" waitingTime="25.25" waitingCount="2" stopTime="0.00" timeLoss="41.69" rerouteNo="1" devices="tripinfo_car_e2s_134 routing_car_e2s_134" vType="Car" speedFactor="1.08" vaporized=""/>
    <tripinfo id="bus_e2w_143" depart="143.00" departLane="e2sep_1" departPos="12.10" departPosLat="0.00" departSpeed="13.90" departDelay="0.00" arrival="309.60" arrivalLane="c2w_1" arrivalPos="990.00" arrivalPosLat="0.00" arrivalSpeed="13.90" duration="166.60" routeLength="1988.51" waitingTime="11.25" waitingCount="1" stopTime="0.00" timeLoss="23.52" rerouteNo="1" devices="tripinfo_bus_e2w_143 routing_bus_e2w_143" vType="Bus" speedFactor="1.00" vaporized=""/>
    <tripinfo id="car_e2n_170" depart="170.00" departLane="e2sep_1" departPos="3.60" departPosLat="0.00" departSpeed="13.90" departDelay="0.00" arrival="314.75" arrivalLane="c2n_1" arrivalPos="990.00" arrivalPosLat="0.00" arrivalSpeed="14.21" duration="144.75" routeLength="1986.69" waitingTime="0.00" waitingCount="0" stopTime="0.00" timeLoss="4.20" rerouteNo="1" devices="tripinfo_car_e2n_170 routing_car_e2n_170" vType="Car" speedFactor="1.02" vaporized=""/>
    <tripinfo id="car_w2n_109" depart="109.00" departLane="w2sep_1" departPos="3.60" departPosLat="0.00" departSpeed="13.90" departDelay="0.00" arrival="318.50" arrivalLane="c2n_1" arrivalPos="990.00" arrivalPosLat="0.00" arrivalSpeed="16.19" duration="209.50" routeLength="1996.47" waitingTime="63.85" waitingCount="3" stopTime="0.00" timeLoss="86.02" rerouteNo="1" devices="tripinfo_car_w2n_109 routing_car_w2n_109" vType="Car" speedFactor="1.17" vaporized=""/>
    <tripinfo id="car_e2s_172" depart="172.00" departLane="e2sep_1" departPos="3.60" departPosLat="0.00" departSpeed="13.90" departDelay="0.00" arrival="318.90" arrivalLane="c2s_1" arrivalPos="990.00" arrivalPosLat="0.00" arrivalSpeed="14.22" duration="146.90" routeLength="1996.47" waitingTime="0.00" waitingCount="0" stopTime="0.00" timeLoss="5.84" rerouteNo="1" devices="tripinfo_car_e2s_172 routing_car_e2s_172" vType="Car" speedFactor="1.02" vaporized=""/>
    <tripinfo id="car_e2w_176" depart="176.00" departLane="e2sep_1" departPos="3.60" departPosLat="0.00" departSpeed="13.90" departDelay="0.00" arrival="319.35" arrivalLane="c2w_1" arrivalPos="990.00" arrivalPosLat="0.00" arrivalSpeed="14.17" duration="143.35" routeLength="1997.01" waitingTime="0.00" waitingCount="0" stopTime="0.00" timeLoss="2.42" rerouteNo="1" devices="tripinfo_car_e2w_176 routing_car_e2w_176" vType="Car" speedFactor="1.02" vaporized=""/>
    <tripinfo id="car_e2w_186" depart="186.00" departLane="e2sep_1" departPos="3.60" departPosLat="0.00" departSpeed="13.90" departDelay="0.00" arrival="321.75" arrivalLane="c2w_1" arrivalPos="990.00" arrivalPosLat="0.00" arrivalSpeed="15.08" duration="135.75" routeLength="1997.01" waitingTime="0.00" waitingCount="0" stopTime="0.00" timeLoss="5.41" rerouteNo="1" devices="tripinfo_car_e2w_186 routing_car_e2w_186" vType="Car" speedFactor="1.10" vaporized=""/>
    <tripinfo id="car_w2n_116" depart="116.00" departLane="w2sep_1" departPos="3.60" departPosLat="0.00" departSpeed="13.90" departDelay="0.00" arrival="327.25" arrivalLane="c2n_1" arrivalPos="990.00" arrivalPosLat="0.00" arrivalSpeed="15.23" duration="211.25" routeLength="1996.47" waitingTime="61.10" waitingCount="3" stopTime="0.00" timeLoss="79.55" rerouteNo="1" devices="tripinfo_car_w2n_116 routing_car_w2n_116" vType="Car" speedFactor="1.10" vaporized=""/>
    <tripinfo id="car_w2n_140" depart="140.00" departLane="w2sep_1" departPos="3.60" departPosLat="0.00" departSpeed="13.90" departDelay="0.00" arrival="329.95" arrivalLane="c2n_1" arrivalPos="990.00" arrivalPosLat="0.00" arrivalSpeed="15.88" duration="189.95" routeLength="1996.47" waitingTime="38.60" waitingCount="2" stopTime="0.00" timeLoss="64.95" rerouteNo="1" devices="tripinfo_car_w2n_140 routing_car_w2n_140" vType="Car" speedFactor="1.15" vaporized=""/>
    <tripinfo id="car_w2n_168" depart="168.00" departLane="w2sep_1" departPos="3.60" departPosLat="0.00" departSpeed="13.90" departDelay="0.00" arrival="336.10" arrivalLane="c2n_1" arrivalPos="990.00" arrivalPosLat="0.00" arrivalSpeed="14.45" duration="168.10" routeLength="1996.47" waitingTime="15.75" waitingCount="1" stopTime="0.00" timeLoss="29.31" rerouteNo="1" devices="tripinfo_car_w2n_168 routing_car_w2n_168" vType="Car" speedFactor="1.04" vaporized=""/>
    <tripinfo id="car_w2n_173" depart="173.00" departLane="w2sep_1" departPos="3.60" departPosLat="0.00" departSpeed="13.90" departDelay="0.00" arrival="341.55" arrivalLane="c2n_1" arrivalPos="990.00" arrivalPosLat="0.00" arrivalSpeed="13.90" duration="168.55" routeLength="1996.47" waitingTime="9.25" waitingCount="1" stopTime="0.00" timeLoss="24.21" rerouteNo="1" devices="tripinfo_car_w2n_173 routing_car_w2n_173" vType="Car" speedFactor="1.00" vaporized=""/>
    <tripinfo id="car_n2s_183" depart="183.45" departLane="n2sep_1" departPos="3.60" departPosLat="0.00" departSpeed="13.90" departDelay="0.45" arrival="341.90" arrivalLane="c2s_1" arrivalPos="990.00" arrivalPosLat="0.00" arrivalSpeed="16.40" duration="158.45" routeLength="1997.01" waitingTime="14.40" waitingCount="1" stopTime="0.00" timeLoss="36.62" rerouteNo="1" devices="tripinfo_car_n2s_183 routing_car_n2s_183" vType="Car" speedFactor="1.18" vaporized=""/>
    <tripinfo id="car_w2n_179" depart="179.00" departLane="w2sep_1" departPos="3.60" departPosLat="0.00" departSpeed="13.90" departDelay="0.00" arrival="344.10" arrivalLane="c2n_1" arrivalPos="990.00" arrivalPosLat="0.00" arrivalSpeed="14.51" duration="165.10" routeLength="1996.47" waitingTime="7.35" waitingCount="1" stopTime="0.00" timeLoss="28.41" rerouteNo="1" devices="tripinfo_car_w2n_179 routing_car_w2n_179" vType="Car" speedFactor="1.06" vaporized=""/>
    <tripinfo id="car_n2w_153" depart="153.00" departLane="n2sep_1" departPos="3.60" departPosLat="0.00" departSpeed="13.90" departDelay="0.00" arrival="345.30" arrivalLane="c2w_1" arrivalPos="990.00" arrivalPosLat="0.00" arrivalSpeed="13.97" duration="192.30" routeLength="1986.69" waitingTime="42.45" waitingCount="1" stopTime="0.00" timeLoss="49.35" rerouteNo="1" devices="tripinfo_car_n2w_153 routing_car_n2w_153" vType="Car" speedFactor="1.01" vaporized=""/>
    <tripinfo id="car_n2w_155" depart="155.00" departLane="n2sep_1" departPos="3.60" departPosLat="0.00" departSpeed="13.90" departDelay="0.00" arrival="347.15" arrivalLane="c2w_1" arrivalPos="990.00" arrivalPosLat="0.00" arrivalSpeed="15.47" duration="192.15" routeLength="1986.69" waitingTime="41.55" waitingCount="1" stopTime="0.00" timeLoss="69.56" rerouteNo="1" devices="tripinfo_car_n2w_155 routing_car_n2w_155" vType="Car" speedFactor="1.17" vaporized=""/>
    <tripinfo id="car_s2n_200" depart="200.00" departLane="s2sep_1" departPos="3.60" departPosLat="0.00" departSpeed="13.90" departDelay="0.00" arrival="347.90" arrivalLane="c2n_1" arrivalPos="990.00" arrivalPosLat="0.00" arrivalSpeed="13.88" duration="147.90" routeLength="1997.01" waitingTime="0.00" waitingCount="0" stopTime="0.00" timeLoss="4.20" rerouteNo="1" devices="tripinfo_car_s2n_200 routing_car_s2n_200" vType="Car" speedFactor="1.00" vaporized=""/>
    <tripinfo id="car_s2e_202" depart="202.00" departLane="s2sep_1" departPos="3.60" departPosLat="0.00" departSpeed="13.90" departDelay="0.00" arrival="348.45" arrivalLane="c2e_1" arrivalPos="990.00" arrivalPosLat="0.00" arrivalSpeed="14.32" duration="146.45" routeLength="1986.69" waitingTime="0.00" waitingCount="0" stopTime="0.00" timeLoss="7.00" rerouteNo="1" devices="tripinfo_car_s2e_202 routing_car_s2e_202" vType="Car" speedFactor="1.03" vaporized=""/>
    <tripinfo id="car_n2w_182" depart="182.00" departLane="n2sep_1" departPos="3.60" departPosLat="0.00" departSpeed="13.90" departDelay="0.00" arrival="352.20" arrivalLane="c2w_1" arrivalPos="990.00" arrivalPosLat="0.00" arrivalSpeed="13.90" duration="170.20" routeLength="1986.69" waitingTime="15.00" waitingCount="1" stopTime="0.00" timeLoss="26.53" rerouteNo="1" devices="tripinfo_car_n2w_182 routing_car_n2w_182" vType="Car" speedFactor="1.00" vaporized=""/>
    <tripinfo id="car_n2e_186" depart="186.00" departLane="n2sep_1" departPos="3.60" departPosLat="0.00" departSpeed="13.90" departDelay="0.00" arrival="353.05" arrivalLane="c2e_1" arrivalPos="990.00" arrivalPosLat="0.00" arrivalSpeed="14.34" duration="167.05" routeLength="1996.47" waitingTime="11.55" waitingCount="2" stopTime="0.00" timeLoss="27.27" rerouteNo="1" devices="tripinfo_car_n2e_186 routing_car_n2e_186" vType="Car" speedFactor="1.03" vaporized=""/>
    <tripinfo id="car_n2s_196" depart="196.00" departLane="n2sep_1" departPos="3.60" departPosLat="0.00" departSpeed="13.90" departDelay="0.00" arrival="354.60" arrivalLane="c2s_1" arrivalPos="990.00" arrivalPosLat="0.00" arrivalSpeed="14.38" duration="158.60" routeLength="1997.01" waitingTime="6.30" waitingCount="1" stopTime="0.00" timeLoss="19.68" rerouteNo="1" devices="tripinfo_car_n2s_196 routing_car_n2s_196" vType="Car" speedFactor="1.03" vaporized=""/>
    <tripinfo id="car_n2w_190" depart="190.00" departLane="n2sep_1" departPos="3.60" departPosLat="0.00" departSpeed="13.90" departDelay="0.00" arrival="356.25" arrivalLane="c2w_1" arrivalPos="990.00" arrivalPosLat="0.00" arrivalSpeed="13.99" duration="166.25" routeLength="1986.69" waitingTime="8.55" waitingCount="1" stopTime="0.00" timeLoss="23.59" rerouteNo="1" devices="tripinfo_car_n2w_190 routing_car_n2w_190" vType="Car" speedFactor="1.01" vaporized=""/>
    <tripinfo id="car_n2e_201" depart="201.00" departLane="n2sep_1" departPos="3.60" departPosLat="0.00" departSpeed="13.90" departDelay="0.00" arrival="357.25" arrivalLane="c2e_1" arrivalPos="990.00" arrivalPosLat="0.00" arrivalSpeed="14.12" duration="156.25" routeLength="1996.47" waitingTime="2.65" waitingCount="1" stopTime="0.00" timeLoss="14.33" rerouteNo="1" devices="tripinfo_car_n2e_201 routing_car_n2e_201" vType="Car" speedFactor="1.02" vaporized=""/>
    <tripinfo id="car_s2w_205" depart="205.00" departLane="s2sep_1" departPos="3.60" departPosLat="0.00" departSpeed="13.90" departDelay="0.00" arrival="358.15" arrivalLane="c2w_1" arrivalPos="990.00" arrivalPosLat="0.00" arrivalSpeed="15.25" duration="153.15" routeLength="1996.47" waitingTime="5.75" waitingCount="1" stopTime="0.00" timeLoss="27.40" rerouteNo="1" devices="tripinfo_car_s2w_205 routing_car_s2w_205" vType="Car" speedFactor="1.15" vaporized=""/>
    <tripinfo id="car_s2n_217" depart="217.00" departLane="s2sep_1" departPos="3.60" departPosLat="0.00" departSpeed="13.90" departDelay="0.00" arrival="358.20" arrivalLane="c2n_1" arrivalPos="990.00" arrivalPosLat="0.00" arrivalSpeed="14.21" duration="141.20" routeLength="1997.01" waitingTime="0.00" waitingCount="0" stopTime="0.00" timeLoss="0.62" rerouteNo="1" devices="tripinfo_car_s2n_217 routing_car_s2n_217" vType="Car" speedFactor="1.02" vaporized=""/>
    <tripinfo id="car_n2s_215" depart="215.00" departLane="n2sep_1" departPos="3.60" departPosLat="0.00" departSpeed="13.90" departDelay="0.00" arrival="358.50" arrivalLane="c2s_1" arrivalPos="990.00" arrivalPosLat="0.00" arrivalSpeed="14.47" duration="143.50" routeLength="1997.01" waitingTime="0.00" waitingCount="0" stopTime="0.00" timeLoss="5.70" rerouteNo="1" devices="tripinfo_car_n2s_215 routing_car_n2s_215" vType="Car" speedFactor="1.04" vaporized=""/>
    <tripinfo id="car_s2e_223" depart="223.00" departLane="s2sep_1" departPos="3.60" departPosLat="0.00" departSpeed="13.90" departDelay="0.00" arrival="361.10" arrivalLane="c2e_1" arrivalPos="990.00" arrivalPosLat="0.00" arrivalSpeed="15.13" duration="138.10" routeLength="1986.69" waitingTime="0.00" waitingCount="0" stopTime="0.00" timeLoss="6.40" rerouteNo="1" devices="tripinfo_car_s2e_223 routing_car_s2e_223" vType="Car" speedFactor="1.09" vaporized=""/>
    <tripinfo id="car_n2e_218" depart="218.00" departLane="n2sep_1" departPos="3.60" departPosLat="0.00" departSpeed="13.90" departDelay="0.00" arrival="367.95" arrivalLane="c2e_1" arrivalPos="990.00" arrivalPosLat="0.00" arrivalSpeed="14.13" duration="149.95" routeLength="1996.47" waitingTime="0.00" waitingCount="0" stopTime="0.00" timeLoss="7.99" rerouteNo="1" devices="tripinfo_car_n2e_218 routing_car_n2e_218" vType="Car" speedFactor="1.02" vaporized=""/>
    <tripinfo id="car_n2e_220" depart="220.00" departLane="n2sep_1" departPos="3.60" departPosLat="0.00" departSpeed="13.90" departDelay="0.00" arrival="371.30" arrivalLane="c2e_1" arrivalPos="990.00" arrivalPosLat="0.00" arrivalSpeed="14.38" duration="151.30" routeLength="1996.47" waitingTime="0.00" waitingCount="0" stopTime="0.00" timeLoss="12.22" rerouteNo="1" devices="tripinfo_car_n2e_220 routing_car_n2e_220" vType="Car" speedFactor="1.04" vaporized=""/>
    <tripinfo id="car_n2s_231" depart="231.00" departLane="n2sep_1" departPos="3.60" departPosLat="0.00" departSpeed="13.90" departDelay="0.00" arrival="373.65" arrivalLane="c2s_1" arrivalPos="990.00" arrivalPosLat="0.00" arrivalSpeed="14.04" duration="142.65" routeLength="1997.01" waitingTime="0.00" waitingCount="0" stopTime="0.00" timeLoss="0.35" rerouteNo="1" devices="tripinfo_car_n2s_231 routing_car_n2s_231" vType="Car" speedFactor="1.01" vaporized=""/>
    <tripinfo id="car_e2n_193" depart="193.00" departLane="e2sep_1" departPos="3.60" departPosLat="0.00" departSpeed="13.90" departDelay="0.00" arrival="385.10" arrivalLane="c2n_1" arrivalPos="990.00" arrivalPosLat="0.00" arrivalSpeed="15.11" duration="192.10" routeLength="1986.69" waitingTime="52.40" waitingCount="1" stopTime="0.00" timeLoss="59.90" rerouteNo="1" devices="tripinfo_car_e2n_193 routing_car_e2n_193" vType="Car" speedFactor="1.09" vaporized=""/>
    <tripinfo id="car_w2e_221" depart="221.00" departLane="w2sep_1" departPos="3.60" departPosLat="0.00" departSpeed="13.90" departDelay="0.00" arrival="387.85" arrivalLane="c2e_1" arrivalPos="990.00" arrivalPosLat="0.00" arrivalSpeed="14.50" duration="166.85" routeLength="1997.01" waitingTime="21.65" waitingCount="1" stopTime="0.00" timeLoss="29.16" rerouteNo="1" devices="tripinfo_car_w2e_221 routing_car_w2e_221" vType="Car" speedFactor="1.04" vaporized=""/>
    <tripinfo id="car_w2s_244" depart="244.00" departLane="w2sep_1" departPos="3.60" departPosLat="0.00" departSpeed="13.90" departDelay="0.00" arrival="390.55" arrivalLane="c2s_1" arrivalPos="990.00" arrivalPosLat="0.00" arrivalSpeed="14.38" duration="146.55" routeLength="1986.69" waitingTime="0.00" waitingCount="0" stopTime="0.00" timeLoss="7.68" rerouteNo="1" devices="tripinfo_car_w2s_244 routing_car_w2s_244" vType="Car" speedFactor="1.03" vaporized=""/>
    <tripinfo id="car_w2e_245" depart="245.40" departLane="w2sep_1" departPos="3.60" departPosLat="0.00" departSpeed="13.90" departDelay="0.40" arrival="392.00" arrivalLane="c2e_1" arrivalPos="990.00" arrivalPosLat="0.00" arrivalSpeed="14.78" duration="146.60" routeLength="1997.01" waitingTime="0.00" waitingCount="0" stopTime="0.00" timeLoss="11.65" rerouteNo="1" devices="tripinfo_car_w2e_245 routing_car_w2e_245" vType="Car" speedFactor="1.06" vaporized=""/>
    <tripinfo id="car_e2w_206" depart="206.00" departLane="e2sep_1" departPos="3.60" departPosLat="0.00" departSpeed="13.90" departDelay="0.00" arrival="392.80" arrivalLane="c2w_1" arrivalPos="990.00" arrivalPosLat="0.00" arrivalSpeed="13.90" duration="186.80" routeLength="1997.01" waitingTime="34.90" waitingCount="1" stopTime="0.00" timeLoss="43.11" rerouteNo="1" devices="tripinfo_car_e2w_206 routing_car_e2w_206" vType="Car" speedFactor="1.00" vaporized=""/>
    <tripinfo id="car_e2n_216" depart="216.00" departLane="e2sep_1" departPos="3.60" departPosLat="0.00" departSpeed="13.90" departDelay="0.00" arrival="395.15" arrivalLane="c2n_1" arrivalPos="990.00" arrivalPosLat="0.00" arrivalSpeed="14.00" duration="179.15" routeLength="1986.69" waitingTime="26.40" waitingCount="1" stopTime="0.00" timeLoss="36.52" rerouteNo="1" devices="tripinfo_car_e2n_216 routing_car_e2n_216" vType="Car" speedFactor="1.01" vaporized=""/>
    <tripinfo id="car_e2w_219" depart="219.00" departLane="e2sep_1" departPos="3.60" departPosLat="0.00" departSpeed="13.90" departDelay="0.00" arrival="395.15" arrivalLane="c2w_1" arrivalPos="990.00" arrivalPosLat="0.00" arrivalSpeed="14.91" duration="176.15" routeLength="1997.01" waitingTime="25.50" waitingCount="1" stopTime="0.00" timeLoss="44.57" rerouteNo="1" devices="tripinfo_car_e2w_219 routing_car_e2w_219" vType="Car" speedFactor="1.09" vaporized=""/>
    <tripinfo id="car_e2w_233" depart="233.35" departLane="e2sep_1" departPos="3.60" departPosLat="0.00" departSpeed="13.90" departDelay="0.35" arrival="397.45" arrivalLane="c2w_1" arrivalPos="990.00" arrivalPosLat="0.00" arrivalSpeed="15.29" duration="164.10" routeLength="1997.01" waitingTime="15.75" waitingCount="1" stopTime="0.00" timeLoss="35.99" rerouteNo="1" devices="tripinfo_car_e2w_233 routing_car_e2w_233" vType="Car" speedFactor="1.12" vaporized=""/>
    <tripinfo id="car_w2s_245" depart="247.10" departLane="w2sep_1" departPos="3.60" departPosLat="0.00" departSpeed="13.90" departDelay="2.10" arrival="398.10" arrivalLane="c2s_1" arrivalPos="990.00" arrivalPosLat="0.00" arrivalSpeed="13.90" duration="151.00" routeLength="1986.69" waitingTime="0.00" waitingCount="0" stopTime="0.00" timeLoss="7.33" rerouteNo="1" devices="tripinfo_car_w2s_245 routing_car_w2s_245" vType="Car" speedFactor="1.00" vaporized=""/>
    <tripinfo id="car_e2n_226" depart="226.00" departLane="e2sep_1" departPos="3.60" departPosLat="0.00" departSpeed="13.90" departDelay="0.00" arrival="398.30" arrivalLane="c2n_1" arrivalPos="990.00" arrivalPosLat="0.00" arrivalSpeed="14.62" duration="172.30" routeLength="1986.69" waitingTime="21.80" waitingCount="1" stopTime="0.00" timeLoss="36.37" rerouteNo="1" devices="tripinfo_car_e2n_226 routing_car_e2n_226" vType="Car" speedFactor="1.06" vaporized=""/>
    <tripinfo id="car_w2s_246" depart="249.00" departLane="w2sep_1" departPos="3.60" departPosLat="0.00" departSpeed="13.90" departDelay="3.00" arrival="399.95" arrivalLane="c2s_1" arrivalPos="990.00" arrivalPosLat="0.00" arrivalSpeed="15.41" duration="150.95" routeLength="1986.69" waitingTime="0.00" waitingCount="0" stopTime="0.00" timeLoss="28.05" rerouteNo="1" devices="tripinfo_car_w2s_246 routing_car_w2s_246" vType="Car" speedFactor="1.17" vaporized=""/>
    <tripinfo id="car_w2s_250" depart="250.70" departLane="w2sep_1" departPos="3.60" departPosLat="0.00" departSpeed="13.90" departDelay="0.70" arrival="403.75" arrivalLane="c2s_1" arrivalPos="990.00" arrivalPosLat="0.00" arrivalSpeed="14.11" duration="153.05" routeLength="1986.69" waitingTime="0.00" waitingCount="0" stopTime="0.00" timeLoss="11.73" rerouteNo="1" devices="tripinfo_car_w2s_250 routing_car_w2s_250" vType="Car" speedFactor="1.02" vaporized=""/>
    <tripinfo id="car_w2e_270" depart="270.00" departLane="w2sep_1" departPos="3.60" departPosLat="0.00" departSpeed="13.90" departDelay="0.00" arrival="404.50" arrivalLane="c2e_1" arrivalPos="990.00" arrivalPosLat="0.00" arrivalSpeed="15.33" duration="134.50" routeLength="1997.01" waitingTime="0.00" waitingCount="0" stopTime="0.00" timeLoss="4.23" rerouteNo="1" devices="tripinfo_car_w2e_270 routing_car_w2e_270" vType="Car" speedFactor="1.10" vaporized=""/>
    <tripinfo id="car_e2n_240" depart="240.00" departLane="e2sep_1" departPos="3.60" departPosLat="0.00" departSpeed="13.90" departDelay="0.00" arrival="404.75" arrivalLane="c2n_1" arrivalPos="990.00" arrivalPosLat="0.00" arrivalSpeed="13.90" duration="164.75" routeLength="1986.69" waitingTime="6.60" waitingCount="1" stopTime="0.00" timeLoss="21.08" rerouteNo="1" devices="tripinfo_car_e2n_240 routing_car_e2n_240" vType="Car" speedFactor="1.00" vaporized=""/>
    <tripinfo id="bus_w2s_254" depart="254.00" departLane="w2sep_1" departPos="12.10" departPosLat="0.00" departSpeed="13.90" departDelay="0.00" arrival="408.55" arrivalLane="c2s_1" arrivalPos="990.00" arrivalPosLat="0.00" arrivalSpeed="13.86" duration="154.55" routeLength="1978.19" waitingTime="0.00" waitingCount="0" stopTime="0.00" timeLoss="11.45" rerouteNo="1" devices="tripinfo_bus_w2s_254 routing_bus_w2s_254" vType="Bus" speedFactor="1.00" vaporized=""/>
    <tripinfo id="car_w2n_209" depart="209.00" departLane="w2sep_1" departPos="3.60" departPosLat="0.00" departSpeed="13.90" departDelay="0.00" arrival="409.00" arrivalLane="c2n_1" arrivalPos="990.00" arrivalPosLat="0.00" arrivalSpeed="13.91" duration="200.00" routeLength="1996.47" waitingTime="43.15" waitingCount="2" stopTime="0.00" timeLoss="55.94" rerouteNo="1" devices="tripinfo_car_w2n_209 routing_car_w2n_209" vType="Car" speedFactor="1.00" vaporized=""/>
    <tripinfo id="amb_w2e_300" depart="302.05" departLane="w2sep_1" departPos="6.60" departPosLat="0.00" departSpeed="13.90" departDelay="2.05" arrival="409.75" arrivalLane="c2e_1" arrivalPos="990.00" arrivalPosLat="-0.95" arrivalSpeed="20.81" duration="107.70" routeLength="1994.01" waitingTime="0.00" waitingCount="0" stopTime="0.00" timeLoss="12.06" rerouteNo="1" devices="tripinfo_amb_w2e_300 routing_amb_w2e_300 bluelight_amb_w2e_300 fcd_amb_w2e_300" vType="Ambulance" speedFactor="1.50" vaporized="">
        <example_device customValue1="0.00" customValue2="-1.00"/>
    </tripinfo>
    <tripinfo id="car_w2s_259" depart="259.00" departLane="w2sep_1" departPos="3.60" departPosLat="0.00" departSpeed="13.90" departDelay="0.00" arrival="411.25" arrivalLane="c2s_1" arrivalPos="990.00" arrivalPosLat="0.00" arrivalSpeed="14.97" duration="152.25" routeLength="1986.69" waitingTime="0.00" waitingCount="0" stopTime="0.00" timeLoss="21.15" rerouteNo="1" devices="tripinfo_car_w2s_259 routing_car_w2s_259" vType="Car" speedFactor="1.10" vaporized=""/>
    <tripinfo id="car_e2w_267" depart="267.00" departLane="e2sep_1" departPos="3.60" departPosLat="0.00" departSpeed="13.90" departDelay="0.00" arrival="411.35" arrivalLane="c2w_1" arrivalPos="990.00" arrivalPosLat="0.00" arrivalSpeed="13.90" duration="144.35" routeLength="1997.01" waitingTime="0.00" waitingCount="0" stopTime="0.00" timeLoss="0.65" rerouteNo="1" devices="tripinfo_car_e2w_267 routing_car_e2w_267" vType="Car" speedFactor="1.00" vaporized=""/>
    <tripinfo id="car_e2s_232" depart="232.00" departLane="e2sep_1" departPos="3.60" departPosLat="0.00" departSpeed="13.90" departDelay="0.00" arrival="413.55" arrivalLane="c2s_1" arrivalPos="990.00" arrivalPosLat="0.00" arrivalSpeed="14.87" duration="181.55" routeLength="1996.47" waitingTime="31.55" waitingCount="2" stopTime="0.00" timeLoss="48.92" rerouteNo="1" devices="tripinfo_car_e2s_232 routing_car_e2s_232" vType="Car" speedFactor="1.09" vaporized=""/>
    <tripinfo id="car_w2s_275" depart="275.00" departLane="w2sep_1" departPos="3.60" departPosLat="0.00" departSpeed="13.90" departDelay="0.00" arrival="418.90" arrivalLane="c2s_1" arrivalPos="990.00" arrivalPosLat="0.00" arrivalSpeed="14.34" duration="143.90" routeLength="1986.69" waitingTime="0.00" waitingCount="0" stopTime="0.00" timeLoss="4.72" rerouteNo="1" devices="tripinfo_car_w2s_275 routing_car_w2s_275" vType="Car" speedFactor="1.03" vaporized=""/>
    <tripinfo id="car_e2s_233" depart="235.00" departLane="e2sep_1" departPos="3.60" departPosLat="0.00" departSpeed="13.90" departDelay="2.00" arrival="421.45" arrivalLane="c2s_1" arrivalPos="990.00" arrivalPosLat="0.00" arrivalSpeed="15.06" duration="186.45" routeLength="1996.47" waitingTime="29.95" waitingCount="3" stopTime="0.00" timeLoss="54.91" rerouteNo="1" devices="tripinfo_car_e2s_233 routing_car_e2s_233" vType="Car" speedFactor="1.10" vaporized=""/>
    <tripinfo id="car_e2s_243" depart="243.00" departLane="e2sep_1" departPos="3.60" departPosLat="0.00" departSpeed="13.90" departDelay="0.00" arrival="426.50" arrivalLane="c2s_1" arrivalPos="990.00" arrivalPosLat="0.00" arrivalSpeed="14.09" duration="183.50" routeLength="1996.47" waitingTime="18.90" waitingCount="2" stopTime="0.00" timeLoss="41.17" rerouteNo="1" devices="tripinfo_car_e2s_243 routing_car_e2s_243" vType="Car" speedFactor="1.01" vaporized=""/>
    <tripinfo id="car_w2n_288" depart="288.00" departLane="w2sep_1" departPos="3.60" departPosLat="0.00" departSpeed="13.90" departDelay="0.00" arrival="426.85" arrivalLane="c2n_1" arrivalPos="990.00" arrivalPosLat="0.00" arrivalSpeed="14.85" duration="138.85" routeLength="1996.47" waitingTime="0.00" waitingCount="0" stopTime="0.00" timeLoss="3.74" rerouteNo="1" devices="tripinfo_car_w2n_288 routing_car_w2n_288" vType="Car" speedFactor="1.07" vaporized=""/>
    <tripinfo id="car_e2w_283" depart="283.00" departLane="e2sep_1" departPos="3.60" departPosLat="0.00" departSpeed="13.90" departDelay="0.00" arrival="437.50" arrivalLane="c2w_1" arrivalPos="990.00" arrivalPosLat="0.00" arrivalSpeed="14.35" duration="154.50" routeLength="1997.01" waitingTime="8.25" waitingCount="1" stopTime="0.00" timeLoss="15.29" rerouteNo="1" devices="tripinfo_car_e2w_283 routing_car_e2w_283" vType="Car" speedFactor="1.03" vaporized=""/>
    <tripinfo id="car_w2n_297" depart="297.00" departLane="w2sep_1" departPos="3.60" departPosLat="0.00" departSpeed="13.90" departDelay="0.00" arrival="439.80" arrivalLane="c2n_1" arrivalPos="990.00" arrivalPosLat="0.00" arrivalSpeed="14.42" duration="142.80" routeLength="1996.47" waitingTime="0.00" waitingCount="0" stopTime="0.00" timeLoss="3.67" rerouteNo="1" devices="tripinfo_car_w2n_297 routing_car_w2n_297" vType="Car" speedFactor="1.04" vaporized=""/>
    <tripinfo id="car_e2s_257" depart="257.00" departLane="e2sep_1" departPos="3.60" departPosLat="0.00" departSpeed="13.90" departDelay="0.00" arrival="440.20" arrivalLane="c2s_1" arrivalPos="990.00" arrivalPosLat="0.00" arrivalSpeed="14.03" duration="183.20" routeLength="1996.47" waitingTime="26.60" waitingCount="2" stopTime="0.00" timeLoss="40.16" rerouteNo="1" devices="tripinfo_car_e2s_257 routing_car_e2s_257" vType="Car" speedFactor="1.01" vaporized=""/>
    <tripinfo id="car_w2n_298" depart="298.40" departLane="w2sep_1" departPos="3.60" departPosLat="0.00" departSpeed="13.90" departDelay="0.40" arrival="441.60" arrivalLane="c2n_1" arrivalPos="990.00" arrivalPosLat="0.00" arrivalSpeed="16.03" duration="143.20" routeLength="1996.47" waitingTime="0.00" waitingCount="0" stopTime="0.00" timeLoss="25.48" rerouteNo="1" devices="tripinfo_car_w2n_298 routing_car_w2n_298" vType="Car" speedFactor="1.23" vaporized=""/>
    <tripinfo id="car_s2n_260" depart="260.00" departLane="s2sep_1" departPos="3.60" departPosLat="0.00" departSpeed="13.90" departDelay="0.00" arrival="450.80" arrivalLane="c2n_1" arrivalPos="990.00" arrivalPosLat="0.00" arrivalSpeed="16.36" duration="190.80" routeLength="1997.01" waitingTime="54.20" waitingCount="1" stopTime="0.00" timeLoss="68.72" rerouteNo="1" devices="tripinfo_car_s2n_260 routing_car_s2n_260" vType="Car" speedFactor="1.18" vaporized=""/>
    <tripinfo id="car_s2e_238" depart="238.00" departLane="s2sep_1" departPos="3.60" departPosLat="0.00" departSpeed="13.90" departDelay="0.00" arrival="456.55" arrivalLane="c2e_1" arrivalPos="990.00" arrivalPosLat="0.00" arrivalSpeed="13.90" duration="218.55" routeLength="1986.69" waitingTime="68.15" waitingCount="1" stopTime="0.00" timeLoss="74.90" rerouteNo="1" devices="tripinfo_car_s2e_238 routing_car_s2e_238" vType="Car" speedFactor="1.00" vaporized=""/>
    <tripinfo id="bus_n2s_232" depart="233.05" departLane="n2sep_1" departPos="12.10" departPosLat="0.00" departSpeed="13.90" departDelay="1.05" arrival="460.20" arrivalLane="c2s_1" arrivalPos="990.00" arrivalPosLat="0.00" arrivalSpeed="13.90" duration="227.15" routeLength="1988.51" waitingTime="71.60" waitingCount="1" stopTime="0.00" timeLoss="84.05" rerouteNo="1" devices="tripinfo_bus_n2s_232 routing_bus_n2s_232" vType="Bus" speedFactor="1.00" vaporized=""/>
    <tripinfo id="car_s2n_299" depart="299.00" departLane="s2sep_1" departPos="3.60" departPosLat="0.00" departSpeed="13.90" departDelay="0.00" arrival="460.50" arrivalLane="c2n_1" arrivalPos="990.00" arrivalPosLat="0.00" arrivalSpeed="15.56" duration="161.50" routeLength="1997.01" waitingTime="19.60" waitingCount="1" stopTime="0.00" timeLoss="33.13" rerouteNo="1" devices="tripinfo_car_s2n_299 routing_car_s2n_299" vType="Car" speedFactor="1.12" vaporized=""/>
    <tripinfo id="car_s2e_241" depart="241.75" departLane="s2sep_1" departPos="3.60" departPosLat="0.00" departSpeed="13.90" departDelay="0.75" arrival="461.10" arrivalLane="c2e_1" arrivalPos="990.00" arrivalPosLat="0.00" arrivalSpeed="13.89" duration="219.35" routeLength="1986.69" waitingTime="60.95" waitingCount="1" stopTime="0.00" timeLoss="75.69" rerouteNo="1" devices="tripinfo_car_s2e_241 routing_car_s2e_241" vType="Car" speedFactor="1.00" vaporized=""/>
    <tripinfo id="car_n2w_266" depart="266.00" departLane="n2sep_1" departPos="3.60" departPosLat="0.00" departSpeed="13.90" departDelay="0.00" arrival="462.80" arrivalLane="c2w_1" arrivalPos="990.00" arrivalPosLat="0.00" arrivalSpeed="14.89" duration="196.80" routeLength="1986.69" waitingTime="49.25" waitingCount="1" stopTime="0.00" timeLoss="62.63" rerouteNo="1" devices="tripinfo_car_n2w_266 routing_car_n2w_266" vType="Car" speedFactor="1.07" vaporized=""/>
    <tripinfo id="car_n2s_235" depart="235.00" departLane="n2sep_1" departPos="3.60" departPosLat="0.00" departSpeed="13.90" departDelay="0.00" arrival="463.40" arrivalLane="c2s_1" arrivalPos="990.00" arrivalPosLat="0.00" arrivalSpeed="14.70" duration="228.40" routeLength="1997.01" waitingTime="70.20" waitingCount="1" stopTime="0.00" timeLoss="93.46" rerouteNo="1" devices="tripinfo_car_n2s_235 routing_car_n2s_235" vType="Car" speedFactor="1.07" vaporized=""/>
    <tripinfo id="car_s2e_263" depart="263.00" departLane="s2sep_1" departPos="3.60" departPosLat="0.00" departSpeed="13.90" departDelay="0.00" arrival="465.10" arrivalLane="c2e_1" arrivalPos="990.00" arrivalPosLat="0.00" arrivalSpeed="13.94" duration="202.10" routeLength="1986.69" waitingTime="46.15" waitingCount="1" stopTime="0.00" timeLoss="59.06" rerouteNo="1" devices="tripinfo_car_s2e_263 routing_car_s2e_263" vType="Car" speedFactor="1.00" vaporized=""/>
    <tripinfo id="car_s2e_292" depart="292.00" departLane="s2sep_1" departPos="3.60" departPosLat="0.00" departSpeed="13.90" departDelay="0.00" arrival="467.00" arrivalLane="c2e_1" arrivalPos="990.00" arrivalPosLat="0.00" arrivalSpeed="15.19" duration="175.00" routeLength="1986.69" waitingTime="26.60" waitingCount="1" stopTime="0.00" timeLoss="49.27" rerouteNo="1" devices="tripinfo_car_s2e_292 routing_car_s2e_292" vType="Car" speedFactor="1.14" vaporized=""/>
    <tripinfo id="bus_n2s_256" depart="256.00" departLane="n2sep_1" departPos="12.10" departPosLat="0.00" departSpeed="13.90" departDelay="0.00" arrival="467.60" arrivalLane="c2s_1" arrivalPos="990.00" arrivalPosLat="0.00" arrivalSpeed="13.84" duration="211.60" routeLength="1988.51" waitingTime="53.90" waitingCount="1" stopTime="0.00" timeLoss="68.52" rerouteNo="1" devices="tripinfo_bus_n2s_256 routing_bus_n2s_256" vType="Bus" speedFactor="1.00" vaporized=""/>
    <tripinfo id="car_n2w_270" depart="270.00" departLane="n2sep_1" departPos="3.60" departPosLat="0.00" departSpeed="13.90" departDelay="0.00" arrival="468.85" arrivalLane="c2w_1" arrivalPos="990.00" arrivalPosLat="0.00" arrivalSpeed="14.33" duration="198.85" routeLength="1986.69" waitingTime="43.90" waitingCount="1" stopTime="0.00" timeLoss="59.57" rerouteNo="1" devices="tripinfo_car_n2w_270 routing_car_n2w_270" vType="Car" speedFactor="1.03" vaporized=""/>
    <tripinfo id="car_n2s_277" depart="277.00" departLane="n2sep_1" departPos="3.60" departPosLat="0.00" departSpeed="13.90" departDelay="0.00" arrival="470.60" arrivalLane="c2s_1" arrivalPos="990.00" arrivalPosLat="0.00" arrivalSpeed="15.37" duration="193.60" routeLength="1997.01" waitingTime="36.10" waitingCount="1" stopTime="0.00" timeLoss="65.13" rerouteNo="1" devices="tripinfo_car_n2s_277 routing_car_n2s_277" vType="Car" speedFactor="1.12" vaporized=""/>
    <tripinfo id="car_n2w_272" depart="273.25" departLane="n2sep_1" departPos="3.60" departPosLat="0.00" departSpeed="13.90" departDelay="1.25" arrival="470.90" arrivalLane="c2w_1" arrivalPos="990.00" arrivalPosLat="0.00" arrivalSpeed="15.51" duration="197.65" routeLength="1986.69" waitingTime="39.40" waitingCount="1" stopTime="0.00" timeLoss="73.04" rerouteNo="1" devices="tripinfo_car_n2w_272 routing_car_n2w_272" vType="Car" speedFactor="1.15" vaporized=""/>
    <tripinfo id="car_s2e_300" depart="300.30" departLane="s2sep_1" departPos="3.60" departPosLat="0.00" departSpeed="13.90" departDelay="0.30" arrival="470.90" arrivalLane="c2e_1" arrivalPos="990.00" arrivalPosLat="0.00" arrivalSpeed="14.09" duration="170.60" routeLength="1986.69" waitingTime="12.80" waitingCount="1" stopTime="0.00" timeLoss="29.05" rerouteNo="1" devices="tripinfo_car_s2e_300 routing_car_s2e_300" vType="Car" speedFactor="1.02" vaporized=""/>
    <tripinfo id="bus_s2n_315" depart="315.00" departLane="s2sep_1" departPos="12.10" departPosLat="0.00" departSpeed="13.90" departDelay="0.00" arrival="473.30" arrivalLane="c2n_1" arrivalPos="990.00" arrivalPosLat="0.00" arrivalSpeed="13.90" duration="158.30" routeLength="1988.51" waitingTime="1.05" waitingCount="1" stopTime="0.00" timeLoss="15.21" rerouteNo="1" devices="tripinfo_bus_s2n_315 routing_bus_s2n_315" vType="Bus" speedFactor="1.00" vaporized=""/>
</tripinfos>
