<?xml version="1.0" encoding="UTF-8"?>

<!-- generated on Sat Apr 24 17:20:06 2021 by Eclipse SUMO Version 1.4.0
<configuration xmlns:xsi="http://www.w3.org/2001/XMLSchema-instance" xsi:noNamespaceSchemaLocation="http://sumo.dlr.de/xsd/sumoConfiguration.xsd">

    <input>
        <net-file value="sumofiles/junction.net.xml"/>
        <route-files value="sumofiles/junction_preemption_400.rou.xml"/>
        <additional-files value="sumofiles/junction.det.xml"/>
    </input>

    <output>
        <tripinfo-output value="sumofiles/output/tripinfo_preemption_400.xml"/>
    </output>

    <time>
        <begin value="0"/>
        <end value="10000"/>
        <step-length value="0.05"/>
    </time>

    <processing>
        <lateral-resolution value="0.1"/>
    </processing>

    <report>
        <no-warnings value="true"/>
        <error-log value="sumofiles/output/errorlog_preemption_400.log"/>
        <no-step-log value="true"/>
    </report>

    <traci_server>
        <remote-port value="37807"/>
    </traci_server>

    <gui_only>
        <gui-settings-file value="sumofiles/junction-gui.settings.xml"/>
        <tracker-interval value="0.05"/>
    </gui_only>

</configuration>
-->

<tripinfos xmlns:xsi="http://www.w3.org/2001/XMLSchema-instance" xsi:noNamespaceSchemaLocation="http://sumo.dlr.de/xsd/tripinfo_file.xsd">
    <tripinfo id="car_e2w_3" depart="3.00" departLane="e2sep_1" departPos="3.60" departPosLat="0.00" departSpeed="13.90" departDelay="0.00" arrival="138.70" arrivalLane="c2w_1" arrivalPos="990.00" arrivalPosLat="0.00" arrivalSpeed="14.73" duration="135.70" routeLength="1997.01" waitingTime="0.00" waitingCount="0" stopTime="0.00" timeLoss="0.15" rerouteNo="1" devices="tripinfo_car_e2w_3 routing_car_e2w_3" vType="Car" speedFactor="1.06" vaporized=""/>
    <tripinfo id="car_e2s_8" depart="8.00" departLane="e2sep_1" departPos="3.60" departPosLat="0.00" departSpeed="13.90" departDelay="0.00" arrival="151.25" arrivalLane="c2s_1" arrivalPos="990.00" arrivalPosLat="0.00" arrivalSpeed="14.73" duration="143.25" routeLength="1996.47" waitingTime="0.00" waitingCount="0" stopTime="0.00" timeLoss="7.10" rerouteNo="1" devices="tripinfo_car_e2s_8 routing_car_e2s_8" vType="Car" speedFactor="1.06" vaporized=""/>
    <tripinfo id="car_w2e_9" depart="9.00" departLane="w2sep_1" departPos="3.60" departPosLat="0.00" departSpeed="13.90" departDelay="0.00" arrival="151.25" arrivalLane="c2e_1" arrivalPos="990.00" arrivalPosLat="0.00" arrivalSpeed="14.04" duration="142.25" routeLength="1997.01" waitingTime="0.00" waitingCount="0" stopTime="0.00" timeLoss="0.04" rerouteNo="1" devices="tripinfo_car_w2e_9 routing_car_w2e_9" vType="Car" speedFactor="1.01" vaporized=""/>
    <tripinfo id="car_e2s_9" depart="9.40" departLane="e2sep_1" departPos="3.60" departPosLat="0.00" departSpeed="13.90" departDelay="0.40" arrival="154.80" arrivalLane="c2s_1" arrivalPos="990.00" arrivalPosLat="0.00" arrivalSpeed="15.01" duration="145.40" routeLength="1996.47" waitingTime="0.00" waitingCount="0" stopTime="0.00" timeLoss="12.08" rerouteNo="1" devices="tripinfo_car_e2s_9 routing_car_e2s_9" vType="Car" speedFactor="1.08" vaporized=""/>
    <tripinfo id="car_s2e_20" depart="20.00" departLane="s2sep_1" departPos="3.60" departPosLat="0.00" departSpeed="13.90" departDelay="0.00" arrival="163.60" arrivalLane="c2e_1" arrivalPos="990.00" arrivalPosLat="0.00" arrivalSpeed="14.32" duration="143.60" routeLength="1986.69" waitingTime="0.00" waitingCount="0" stopTime="0.00" timeLoss="4.18" rerouteNo="1" devices="tripinfo_car_s2e_20 routing_car_s2e_20" vType="Car" speedFactor="1.03" vaporized=""/>
    <tripinfo id="car_n2e_12" depart="12.00" departLane="n2sep_1" departPos="3.60" departPosLat="0.00" departSpeed="13.90" departDelay="0.00" arrival="167.85" arrivalLane="c2e_1" arrivalPos="990.00" arrivalPosLat="0.00" arrivalSpeed="14.31" duration="155.85" routeLength="1996.47" waitingTime="4.95" waitingCount="1" stopTime="0.00" timeLoss="15.77" rerouteNo="1" devices="tripinfo_car_n2e_12 routing_car_n2e_12" vType="Car" speedFactor="1.03" vaporized=""/>
    <tripinfo id="car_s2e_31" depart="31.00" departLane="s2sep_1" departPos="3.60" departPosLat="0.00" departSpeed="13.90" departDelay="0.00" arrival="172.95" arrivalLane="c2e_1" arrivalPos="990.00" arrivalPosLat="0.00" arrivalSpeed="14.55" duration="141.95" routeLength="1986.69" waitingTime="0.00" waitingCount="0" stopTime="0.00" timeLoss="4.75" rerouteNo="1" devices="tripinfo_car_s2e_31 routing_car_s2e_31" vType="Car" speedFactor="1.05" vaporized=""/>
    <tripinfo id="car_n2w_31" depart="31.00" departLane="n2sep_1" departPos="3.60" departPosLat="0.00" departSpeed="13.90" departDelay="0.00" arrival="174.70" arrivalLane="c2w_1" arrivalPos="990.00" arrivalPosLat="0.00" arrivalSpeed="14.27" duration="143.70" routeLength="1986.69" waitingTime="0.00" waitingCount="0" stopTime="0.00" timeLoss="3.72" rerouteNo="1" devices="tripinfo_car_n2w_31 routing_car_n2w_31" vType="Car" speedFactor="1.03" vaporized=""/>
    <tripinfo id="car_n2w_33" depart="33.00" departLane="n2sep_1" departPos="3.60" departPosLat="0.00" departSpeed="13.90" departDelay="0.00" arrival="177.00" arrivalLane="c2w_1" arrivalPos="990.00" arrivalPosLat="0.00" arrivalSpeed="15.29" duration="144.00" routeLength="1986.69" waitingTime="0.00" waitingCount="0" stopTime="0.00" timeLoss="16.05" rerouteNo="1" devices="tripinfo_car_n2w_33 routing_car_n2w_33" vType="Car" speedFactor="1.12" vaporized=""/>
    <tripinfo id="car_n2w_34" depart="34.45" departLane="n2sep_1" departPos="3.60" departPosLat="0.00" departSpeed="13.90" departDelay="0.45" arrival="184.55" arrivalLane="c2w_1" arrivalPos="990.00" arrivalPosLat="0.00" arrivalSpeed="13.90" duration="150.10" routeLength="1986.69" waitingTime="0.00" waitingCount="0" stopTime="0.00" timeLoss="6.40" rerouteNo="1" devices="tripinfo_car_n2w_34 routing_car_n2w_34" vType="Car" speedFactor="1.00" vaporized=""/>
    <tripinfo id="car_n2w_42" depart="42.00" departLane="n2sep_1" departPos="3.60" departPosLat="0.00" departSpeed="13.90" departDelay="0.00" arrival="186.45" arrivalLane="c2w_1" arrivalPos="990.00" arrivalPosLat="0.00" arrivalSpeed="15.35" duration="144.45" routeLength="1986.69" waitingTime="0.00" waitingCount="0" stopTime="0.00" timeLoss="20.39" rerouteNo="1" devices="tripinfo_car_n2w_42 routing_car_n2w_42" vType="Car" speedFactor="1.16" vaporized=""/>
    <tripinfo id="car_n2e_36" depart="36.30" departLane="n2sep_1" departPos="3.60" departPosLat="0.00" departSpeed="13.90" departDelay="0.30" arrival="187.95" arrivalLane="c2e_1" arrivalPos="990.00" arrivalPosLat="0.00" arrivalSpeed="13.90" duration="151.65" routeLength="1996.47" waitingTime="0.00" waitingCount="0" stopTime="0.00" timeLoss="7.33" rerouteNo="1" devices="tripinfo_car_n2e_36 routing_car_n2e_36" vType="Car" speedFactor="1.00" vaporized=""/>
    <tripinfo id="car_s2w_41" depart="41.00" departLane="s2sep_1" departPos="3.60" departPosLat="0.00" departSpeed="13.90" departDelay="0.00" arrival="191.80" arrivalLane="c2w_1" arrivalPos="990.00" arrivalPosLat="0.00" arrivalSpeed="13.90" duration="150.80" routeLength="1996.47" waitingTime="0.00" waitingCount="0" stopTime="0.00" timeLoss="6.44" rerouteNo="1" devices="tripinfo_car_s2w_41 routing_car_s2w_41" vType="Car" speedFactor="1.00" vaporized=""/>
    <tripinfo id="car_s2w_45" depart="45.00" departLane="s2sep_1" departPos="3.60" departPosLat="0.00" departSpeed="13.90" departDelay="0.00" arrival="195.15" arrivalLane="c2w_1" arrivalPos="990.00" arrivalPosLat="0.00" arrivalSpeed="14.11" duration="150.15" routeLength="1996.47" waitingTime="0.00" waitingCount="0" stopTime="0.00" timeLoss="8.36" rerouteNo="1" devices="tripinfo_car_s2w_45 routing_car_s2w_45" vType="Car" speedFactor="1.02" vaporized=""/>
    <tripinfo id="car_s2w_59" depart="59.00" departLane="s2sep_1" departPos="3.60" departPosLat="0.00" departSpeed="13.90" departDelay="0.00" arrival="201.00" arrivalLane="c2w_1" arrivalPos="990.00" arrivalPosLat="0.00" arrivalSpeed="14.55" duration="142.00" routeLength="1996.47" waitingTime="0.00" waitingCount="0" stopTime="0.00" timeLoss="4.14" rerouteNo="1" devices="tripinfo_car_s2w_59 routing_car_s2w_59" vType="Car" speedFactor="1.05" vaporized=""/>
    <tripinfo id="car_e2n_13" depart="13.60" departLane="e2sep_1" departPos="3.60" departPosLat="0.00" departSpeed="13.90" departDelay="0.60" arrival="209.90" arrivalLane="c2n_1" arrivalPos="990.00" arrivalPosLat="0.00" arrivalSpeed="14.54" duration="196.30" routeLength="1986.69" waitingTime="44.90" waitingCount="1" stopTime="0.00" timeLoss="58.94" rerouteNo="1" devices="tripinfo_car_e2n_13 routing_car_e2n_13" vType="Car" speedFactor="1.05" vaporized=""/>
    <tripinfo id="car_w2s_81" depart="81.00" departLane="w2sep_1" departPos="3.60" departPosLat="0.00" departSpeed="13.90" departDelay="0.00" arrival="210.85" arrivalLane="c2s_1" arrivalPos="990.00" arrivalPosLat="0.00" arrivalSpeed="16.05" duration="129.85" routeLength="1986.69" waitingTime="0.00" waitingCount="0" stopTime="0.00" timeLoss="5.42" rerouteNo="1" devices="tripinfo_car_w2s_81 routing_car_w2s_81" vType="Car" speedFactor="1.15" vaporized=""/>
    <tripinfo id="car_e2w_12" depart="12.00" departLane="e2sep_1" departPos="3.60" departPosLat="0.00" departSpeed="13.90" departDelay="0.00" arrival="210.95" arrivalLane="c2w_1" arrivalPos="990.00" arrivalPosLat="0.00" arrivalSpeed="13.90" duration="198.95" routeLength="1997.01" waitingTime="46.50" waitingCount="1" stopTime="0.00" timeLoss="55.27" rerouteNo="1" devices="tripinfo_car_e2w_12 routing_car_e2w_12" vType="Car" speedFactor="1.00" vaporized=""/>
    <tripinfo id="car_e2n_23" depart="23.00" departLane="e2sep_1" departPos="3.60" departPosLat="0.00" departSpeed="13.90" departDelay="0.00" arrival="212.95" arrivalLane="c2n_1" arrivalPos="990.00" arrivalPosLat="0.00" arrivalSpeed="15.08" duration="189.95" routeLength="1986.69" waitingTime="38.55" waitingCount="1" stopTime="0.00" timeLoss="58.22" rerouteNo="1" devices="tripinfo_car_e2n_23 routing_car_e2n_23" vType="Car" speedFactor="1.09" vaporized=""/>
    <tripinfo id="bus_w2e_14" depart="14.00" departLane="w2sep_1" departPos="12.10" departPosLat="0.00" departSpeed="13.90" departDelay="0.00" arrival="214.20" arrivalLane="c2e_1" arrivalPos="990.00" arrivalPosLat="0.00" arrivalSpeed="13.90" duration="200.20" routeLength="1988.51" waitingTime="45.95" waitingCount="1" stopTime="0.00" timeLoss="57.13" rerouteNo="1" devices="tripinfo_bus_w2e_14 routing_bus_w2e_14" vType="Bus" speedFactor="1.00" vaporized=""/>
    <tripinfo id="car_e2w_35" depart="35.00" departLane="e2sep_1" departPos="3.60" departPosLat="0.00" departSpeed="13.90" departDelay="0.00" arrival="215.20" arrivalLane="c2w_1" arrivalPos="990.00" arrivalPosLat="0.00" arrivalSpeed="14.52" duration="180.20" routeLength="1997.01" waitingTime="31.05" waitingCount="1" stopTime="0.00" timeLoss="42.81" rerouteNo="1" devices="tripinfo_car_e2w_35 routing_car_e2w_35" vType="Car" speedFactor="1.05" vaporized=""/>
    <tripinfo id="car_w2e_54" depart="54.00" departLane="w2sep_1" departPos="3.60" departPosLat="0.00" departSpeed="13.90" departDelay="0.00" arrival="217.10" arrivalLane="c2e_1" arrivalPos="990.00" arrivalPosLat="0.00" arrivalSpeed="14.97" duration="163.10" routeLength="1997.01" waitingTime="10.00" waitingCount="1" stopTime="0.00" timeLoss="31.36" rerouteNo="1" devices="tripinfo_car_w2e_54 routing_car_w2e_54" vType="Car" speedFactor="1.09" vaporized=""/>
    <tripinfo id="car_e2w_78" depart="78.00" departLane="e2sep_1" departPos="3.60" departPosLat="0.00" departSpeed="13.90" departDelay="0.00" arrival="222.75" arrivalLane="c2w_1" arrivalPos="990.00" arrivalPosLat="0.00" arrivalSpeed="13.90" duration="144.75" routeLength="1997.01" waitingTime="0.00" waitingCount="0" stopTime="0.00" timeLoss="1.08" rerouteNo="1" devices="tripinfo_car_e2w_78 routing_car_e2w_78" vType="Car" speedFactor="1.00" vaporized=""/>
    <tripinfo id="car_e2s_13" depart="15.40" departLane="e2sep_1" departPos="3.60" departPosLat="0.00" departSpeed="13.90" departDelay="2.40" arrival="222.90" arrivalLane="c2s_1" arrivalPos="990.00" arrivalPosLat="0.00" arrivalSpeed="14.04" duration="207.50" routeLength="1996.47" waitingTime="48.80" waitingCount="2" stopTime="0.00" timeLoss="64.64" rerouteNo="1" devices="tripinfo_car_e2s_13 routing_car_e2s_13" vType="Car" speedFactor="1.01" vaporized=""/>
    <tripinfo id="car_e2s_16" depart="17.30" departLane="e2sep_1" departPos="3.60" departPosLat="0.00" departSpeed="13.90" departDelay="1.30" arrival="225.40" arrivalLane="c2s_1" arrivalPos="990.00" arrivalPosLat="0.00" arrivalSpeed="14.85" duration="208.10" routeLength="1996.47" waitingTime="46.65" waitingCount="2" stopTime="0.00" timeLoss="74.81" rerouteNo="1" devices="tripinfo_car_e2s_16 routing_car_e2s_16" vType="Car" speedFactor="1.08" vaporized=""/>
    <tripinfo id="car_w2n_40" depart="40.00" departLane="w2sep_1" departPos="3.60" departPosLat="0.00" departSpeed="13.90" departDelay="0.00" arrival="225.70" arrivalLane="c2n_1" arrivalPos="990.00" arrivalPosLat="0.00" arrivalSpeed="13.90" duration="185.70" routeLength="1996.47" waitingTime="30.35" waitingCount="3" stopTime="0.00" timeLoss="41.39" rerouteNo="1" devices="tripinfo_car_w2n_40 routing_car_w2n_40" vType="Car" speedFactor="1.00" vaporized=""/>
    <tripinfo id="car_e2w_97" depart="97.00" departLane="e2sep_1" departPos="3.60" departPosLat="0.00" departSpeed="13.90" departDelay="0.00" arrival="228.25" arrivalLane="c2w_1" arrivalPos="990.00" arrivalPosLat="0.00" arrivalSpeed="15.32" duration="131.25" routeLength="1997.01" waitingTime="0.00" waitingCount="0" stopTime="0.00" timeLoss="0.91" rerouteNo="1" devices="tripinfo_car_e2w_97 routing_car_e2w_97" vType="Car" speedFactor="1.10" vaporized=""/>
    <tripinfo id="car_w2n_50" depart="50.00" departLane="w2sep_1" departPos="3.60" departPosLat="0.00" departSpeed="13.90" departDelay="0.00" arrival="229.65" arrivalLane="c2n_1" arrivalPos="990.00" arrivalPosLat="0.00" arrivalSpeed="14.02" duration="179.65" routeLength="1996.47" waitingTime="20.85" waitingCount="2" stopTime="0.00" timeLoss="36.79" rerouteNo="1" devices="tripinfo_car_w2n_50 routing_car_w2n_50" vType="Car" speedFactor="1.01" vaporized=""/>
    <tripinfo id="car_e2w_100" depart="100.00" departLane="e2sep_1" departPos="3.60" departPosLat="0.00" departSpeed="13.90" departDelay="0.00" arrival="230.95" arrivalLane="c2w_1" arrivalPos="990.00" arrivalPosLat="0.00" arrivalSpeed="15.94" duration="130.95" routeLength="1997.01" waitingTime="0.00" waitingCount="0" stopTime="0.00" timeLoss="6.91" rerouteNo="1" devices="tripinfo_car_e2w_100 routing_car_e2w_100" vType="Car" speedFactor="1.16" vaporized=""/>
    <tripinfo id="car_w2n_70" depart="70.00" departLane="w2sep_1" departPos="3.60" departPosLat="0.00" departSpeed="13.90" departDelay="0.00" arrival="233.40" arrivalLane="c2n_1" arrivalPos="990.00" arrivalPosLat="0.00" arrivalSpeed="13.88" duration="163.40" routeLength="1996.47" waitingTime="5.00" waitingCount="1" stopTime="0.00" timeLoss="19.07" rerouteNo="1" devices="tripinfo_car_w2n_70 routing_car_w2n_70" vType="Car" speedFactor="1.00" vaporized=""/>
    <tripinfo id="car_w2e_90" depart="90.00" departLane="w2sep_1" departPos="3.60" departPosLat="0.00" departSpeed="13.90" departDelay="0.00" arrival="235.95" arrivalLane="c2e_1" arrivalPos="990.00" arrivalPosLat="0.00" arrivalSpeed="13.90" duration="145.95" routeLength="1997.01" waitingTime="0.00" waitingCount="0" stopTime="0.00" timeLoss="2.28" rerouteNo="1" devices="tripinfo_car_w2e_90 routing_car_w2e_90" vType="Car" speedFactor="1.00" vaporized=""/>
    <tripinfo id="car_w2e_92" depart="92.00" departLane="w2sep_1" departPos="3.60" departPosLat="0.00" departSpeed="13.90" departDelay="0.00" arrival="239.85" arrivalLane="c2e_1" arrivalPos="990.00" arrivalPosLat="0.00" arrivalSpeed="14.15" duration="147.85" routeLength="1997.01" waitingTime="0.00" waitingCount="0" stopTime="0.00" timeLoss="6.96" rerouteNo="1" devices="tripinfo_car_w2e_92 routing_car_w2e_92" vType="Car" speedFactor="1.02" vaporized=""/>
    <tripinfo id="car_w2n_88" depart="88.00" departLane="w2sep_1" departPos="3.60" departPosLat="0.00" departSpeed="13.90" departDelay="0.00" arrival="240.65" arrivalLane="c2n_1" arrivalPos="990.00" arrivalPosLat="0.00" arrivalSpeed="13.97" duration="152.65" routeLength="1996.47" waitingTime="1.65" waitingCount="1" stopTime="0.00" timeLoss="9.07" rerouteNo="1" devices="tripinfo_car_w2n_88 routing_car_w2n_88" vType="Car" speedFactor="1.01" vaporized=""/>
    <tripinfo id="car_w2n_95" depart="95.00" departLane="w2sep_1" departPos="3.60" departPosLat="0.00" departSpeed="13.90" departDelay="0.00" arrival="246.80" arrivalLane="c2n_1" arrivalPos="990.00" arrivalPosLat="0.00" arrivalSpeed="13.90" duration="151.80" routeLength="1996.47" waitingTime="0.00" waitingCount="0" stopTime="0.00" timeLoss="7.46" rerouteNo="1" devices="tripinfo_car_w2n_95 routing_car_w2n_95" vType="Car" speedFactor="1.00" vaporized=""/>
    <tripinfo id="car_n2s_89" depart="89.00" departLane="n2sep_1" departPos="3.60" departPosLat="0.00" departSpeed="13.90" departDelay="0.00" arrival="247.65" arrivalLane="c2s_1" arrivalPos="990.00" arrivalPosLat="0.00" arrivalSpeed="16.29" duration="158.65" routeLength="1997.01" waitingTime="26.60" waitingCount="1" stopTime="0.00" timeLoss="36.01" rerouteNo="1" devices="tripinfo_car_n2s_89 routing_car_n2s_89" vType="Car" speedFactor="1.17" vaporized=""/>
    <tripinfo id="car_s2e_68" depart="68.00" departLane="s2sep_1" departPos="3.60" departPosLat="0.00" departSpeed="13.90" departDelay="0.00" arrival="248.25" arrivalLane="c2e_1" arrivalPos="990.00" arrivalPosLat="0.00" arrivalSpeed="15.61" duration="180.25" routeLength="1986.69" waitingTime="44.00" waitingCount="1" stopTime="0.00" timeLoss="52.31" rerouteNo="1" devices="tripinfo_car_s2e_68 routing_car_s2e_68" vType="Car" speedFactor="1.12" vaporized=""/>
    <tripinfo id="car_s2e_74" depart="75.45" departLane="s2sep_1" departPos="3.60" departPosLat="0.00" departSpeed="13.90" departDelay="1.45" arrival="253.15" arrivalLane="c2e_1" arrivalPos="990.00" arrivalPosLat="0.00" arrivalSpeed="15.72" duration="177.70" routeLength="1986.69" waitingTime="31.05" waitingCount="1" stopTime="0.00" timeLoss="50.78" rerouteNo="1" devices="tripinfo_car_s2e_74 routing_car_s2e_74" vType="Car" speedFactor="1.13" vaporized=""/>
    <tripinfo id="car_n2w_58" depart="58.00" departLane="n2sep_1" departPos="3.60" departPosLat="0.00" departSpeed="13.90" departDelay="0.00" arrival="253.85" arrivalLane="c2w_1" arrivalPos="990.00" arrivalPosLat="0.00" arrivalSpeed="14.27" duration="195.85" routeLength="1986.69" waitingTime="48.95" waitingCount="1" stopTime="0.00" timeLoss="55.87" rerouteNo="1" devices="tripinfo_car_n2w_58 routing_car_n2w_58" vType="Car" speedFactor="1.03" vaporized=""/>
    <tripinfo id="car_s2e_78" depart="78.00" departLane="s2sep_1" departPos="3.60" departPosLat="0.00" departSpeed="13.90" departDelay="0.00" arrival="255.90" arrivalLane="c2e_1" arrivalPos="990.00" arrivalPosLat="0.00" arrivalSpeed="16.23" duration="177.90" routeLength="1986.69" waitingTime="30.40" waitingCount="1" stopTime="0.00" timeLoss="55.99" rerouteNo="1" devices="tripinfo_car_s2e_78 routing_car_s2e_78" vType="Car" speedFactor="1.18" vaporized=""/>
    <tripinfo id="car_s2n_74" depart="74.00" departLane="s2sep_1" departPos="3.60" departPosLat="0.00" departSpeed="13.90" departDelay="0.00" arrival="257.95" arrivalLane="c2n_1" arrivalPos="990.00" arrivalPosLat="0.00" arrivalSpeed="13.90" duration="183.95" routeLength="1997.01" waitingTime="31.80" waitingCount="1" stopTime="0.00" timeLoss="40.26" rerouteNo="1" devices="tripinfo_car_s2n_74 routing_car_s2n_74" vType="Car" speedFactor="1.00" vaporized=""/>
    <tripinfo id="car_n2s_105" depart="105.00" departLane="n2sep_1" departPos="3.60" departPosLat="0.00" departSpeed="13.90" departDelay="0.00" arrival="258.25" arrivalLane="c2s_1" arrivalPos="990.00" arrivalPosLat="0.00" arrivalSpeed="14.32" duration="153.25" routeLength="1997.01" waitingTime="3.95" waitingCount="1" stopTime="0.00" timeLoss="13.79" rerouteNo="1" devices="tripinfo_car_n2s_105 routing_car_n2s_105" vType="Car" speedFactor="1.03" vaporized=""/>
    <tripinfo id="car_s2e_96" depart="96.00" departLane="s2sep_1" departPos="3.60" departPosLat="0.00" departSpeed="13.90" departDelay="0.00" arrival="258.60" arrivalLane="c2e_1" arrivalPos="990.00" arrivalPosLat="0.00" arrivalSpeed="16.24" duration="162.60" routeLength="1986.69" waitingTime="23.45" waitingCount="1" stopTime="0.00" timeLoss="40.79" rerouteNo="1" devices="tripinfo_car_s2e_96 routing_car_s2e_96" vType="Car" speedFactor="1.18" vaporized=""/>
    <tripinfo id="car_n2s_111" depart="111.00" departLane="n2sep_1" departPos="3.60" departPosLat="0.00" departSpeed="13.90" departDelay="0.00" arrival="262.15" arrivalLane="c2s_1" arrivalPos="990.00" arrivalPosLat="0.00" arrivalSpeed="14.40" duration="151.15" routeLength="1997.01" waitingTime="0.00" waitingCount="0" stopTime="0.00" timeLoss="12.68" rerouteNo="1" devices="tripinfo_car_n2s_111 routing_car_n2s_111" vType="Car" speedFactor="1.04" vaporized=""/>
    <tripinfo id="car_s2w_117" depart="117.00" departLane="s2sep_1" departPos="3.60" departPosLat="0.00" departSpeed="13.90" departDelay="0.00" arrival="264.70" arrivalLane="c2w_1" arrivalPos="990.00" arrivalPosLat="0.00" arrivalSpeed="14.04" duration="147.70" routeLength="1996.47" waitingTime="0.00" waitingCount="0" stopTime="0.00" timeLoss="4.82" rerouteNo="1" devices="tripinfo_car_s2w_117 routing_car_s2w_117" vType="Car" speedFactor="1.01" vaporized=""/>
    <tripinfo id="car_s2n_107" depart="107.00" departLane="s2sep_1" departPos="3.60" departPosLat="0.00" departSpeed="13.90" departDelay="0.00" arrival="265.85" arrivalLane="c2n_1" arrivalPos="990.00" arrivalPosLat="0.00" arrivalSpeed="14.15" duration="158.85" routeLength="1997.01" waitingTime="5.00" waitingCount="1" stopTime="0.00" timeLoss="17.71" rerouteNo="1" devices="tripinfo_car_s2n_107 routing_car_s2n_107" vType="Car" speedFactor="1.02" vaporized=""/>
    <tripinfo id="car_s2n_109" depart="109.00" departLane="s2sep_1" departPos="3.60" departPosLat="0.00" departSpeed="13.90" departDelay="0.00" arrival="268.30" arrivalLane="c2n_1" arrivalPos="990.00" arrivalPosLat="0.00" arrivalSpeed="14.96" duration="159.30" routeLength="1997.01" waitingTime="4.10" waitingCount="1" stopTime="0.00" timeLoss="27.72" rerouteNo="1" devices="tripinfo_car_s2n_109 routing_car_s2n_109" vType="Car" speedFactor="1.09" vaporized=""/>
    <tripinfo id="car_s2e_114" depart="114.00" departLane="s2sep_1" departPos="3.60" departPosLat="0.00" departSpeed="13.90" departDelay="0.00" arrival="268.40" arrivalLane="c2e_1" arrivalPos="990.00" arrivalPosLat="0.00" arrivalSpeed="14.50" duration="154.40" routeLength="1986.69" waitingTime="1.40" waitingCount="1" stopTime="0.00" timeLoss="16.72" rerouteNo="1" devices="tripinfo_car_s2e_114 routing_car_s2e_114" vType="Car" speedFactor="1.04" vaporized=""/>
    <tripinfo id="car_n2s_128" depart="128.00" departLane="n2sep_1" departPos="3.60" departPosLat="0.00" departSpeed="13.90" departDelay="0.00" arrival="272.70" arrivalLane="c2s_1" arrivalPos="990.00" arrivalPosLat="0.00" arrivalSpeed="13.90" duration="144.70" routeLength="1997.01" waitingTime="0.00" waitingCount="0" stopTime="0.00" timeLoss="1.03" rerouteNo="1" devices="tripinfo_car_n2s_128 routing_car_n2s_128" vType="Car" speedFactor="1.00" vaporized=""/>
    <tripinfo id="car_n2e_123" depart="123.00" departLane="n2sep_1" departPos="3.60" departPosLat="0.00" departSpeed="13.90" departDelay="0.00" arrival="274.55" arrivalLane="c2e_1" arrivalPos="990.00" arrivalPosLat="0.00" arrivalSpeed="13.90" duration="151.55" routeLength="1996.47" waitingTime="0.00" waitingCount="0" stopTime="0.00" timeLoss="7.23" rerouteNo="1" devices="tripinfo_car_n2e_123 routing_car_n2e_123" vType="Car" speedFactor="1.00" vaporized=""/>
    <tripinfo id="car_n2w_141" depart="141.00" departLane="n2sep_1" departPos="3.60" departPosLat="0.00" departSpeed="13.90" departDelay="0.00" arrival="275.15" arrivalLane="c2w_1" arrivalPos="990.00" arrivalPosLat="0.00" arrivalSpeed="15.73" duration="134.15" routeLength="1986.69" waitingTime="0.00" waitingCount="0" stopTime="0.00" timeLoss="7.23" rerouteNo="1" devices="tripinfo_car_n2w_141 routing_car_n2w_141" vType="Car" speedFactor="1.13" vaporized=""/>
    <tripinfo id="car_s2n_135" depart="135.00" departLane="s2sep_1" departPos="3.60" departPosLat="0.00" departSpeed="13.90" departDelay="0.00" arrival="279.20" arrivalLane="c2n_1" arrivalPos="990.00" arrivalPosLat="0.00" arrivalSpeed="13.90" duration="144.20" routeLength="1997.01" waitingTime="0.00" waitingCount="0" stopTime="0.00" timeLoss="0.49" rerouteNo="1" devices="tripinfo_car_s2n_135 routing_car_s2n_135" vType="Car" speedFactor="1.00" vaporized=""/>
    <tripinfo id="car_n2e_134" depart="134.00" departLane="n2sep_1" departPos="3.60" departPosLat="0.00" departSpeed="13.90" departDelay="0.00" arrival="282.20" arrivalLane="c2e_1" arrivalPos="990.00" arrivalPosLat="0.00" arrivalSpeed="13.94" duration="148.20" routeLength="1996.47" waitingTime="0.00" waitingCount="0" stopTime="0.00" timeLoss="4.31" rerouteNo="1" devices="tripinfo_car_n2e_134 routing_car_n2e_134" vType="Car" speedFactor="1.00" vaporized=""/>
    <tripinfo id="car_e2w_130" depart="130.00" departLane="e2sep_1" departPos="3.60" departPosLat="0.00" departSpeed="13.90" departDelay="0.00" arrival="290.75" arrivalLane="c2w_1" arrivalPos="990.00" arrivalPosLat="0.00" arrivalSpeed="16.25" duration="160.75" routeLength="1997.01" waitingTime="27.50" waitingCount="1" stopTime="0.00" timeLoss="37.83" rerouteNo="1" devices="tripinfo_car_e2w_130 routing_car_e2w_130" vType="Car" speedFactor="1.17" vaporized=""/>
    <tripinfo id="car_w2s_137" depart="137.00" departLane="w2sep_1" departPos="3.60" departPosLat="0.00" departSpeed="13.90" departDelay="0.00" arrival="300.65" arrivalLane="c2s_1" arrivalPos="990.00" arrivalPosLat="0.00" arrivalSpeed="13.90" duration="163.65" routeLength="1986.69" waitingTime="12.90" waitingCount="1" stopTime="0.00" timeLoss="19.96" rerouteNo="1" devices="tripinfo_car_w2s_137 routing_car_w2s_137" vType="Car" speedFactor="1.00" vaporized=""/>
    <tripinfo id="car_e2n_154" depart="154.00" departLane="e2sep_1" departPos="3.60" departPosLat="0.00" departSpeed="13.90" departDelay="0.00" arrival="302.00" arrivalLane="c2n_1" arrivalPos="990.00" arrivalPosLat="0.00" arrivalSpeed="15.05" duration="148.00" routeLength="1986.69" waitingTime="4.20" waitingCount="1" stopTime="0.00" timeLoss="15.25" rerouteNo="1" devices="tripinfo_car_e2n_154 routing_car_e2n_154" vType="Car" speedFactor="1.08" vaporized=""/>
    <tripinfo id="car_e2w_132" depart="132.00" departLane="e2sep_1" departPos="3.60" departPosLat="0.00" departSpeed="13.90" departDelay="0.00" arrival="302.05" arrivalLane="c2w_1" arrivalPos="990.00" arrivalPosLat="0.00" arrivalSpeed="14.13" duration="170.05" routeLength="1997.01" waitingTime="19.45" waitingCount="1" stopTime="0.00" timeLoss="28.76" rerouteNo="1" devices="tripinfo_car_e2w_132 routing_car_e2w_132" vType="Car" speedFactor="1.02" vaporized=""/>
    <tripinfo id="car_w2e_161" depart="161.00" departLane="w2sep_1" departPos="3.60" departPosLat="0.00" departSpeed="13.90" departDelay="0.00" arrival="303.95" arrivalLane="c2e_1" arrivalPos="990.00" arrivalPosLat="0.00" arrivalSpeed="14.12" duration="142.95" routeLength="1997.01" waitingTime="0.00" waitingCount="0" stopTime="0.00" timeLoss="1.47" rerouteNo="1" devices="tripinfo_car_w2e_161 routing_car_w2e_161" vType="Car" speedFactor="1.02" vaporized=""/>
    <tripinfo id="car_e2w_140" depart="140.00" departLane="e2sep_1" departPos="3.60" departPosLat="0.00" departSpeed="13.90" departDelay="0.00" arrival="304.15" arrivalLane="c2w_1" arrivalPos="990.00" arrivalPosLat="0.00" arrivalSpeed="15.39" duration="164.15" routeLength="1997.01" waitingTime="16.70" waitingCount="1" stopTime="0.00" timeLoss="38.37" rerouteNo="1" devices="tripinfo_car_e2w_140 routing_car_e2w_140" vType="Car" speedFactor="1.14" vaporized=""/>
    <tripinfo id="car_w2s_141" depart="141.00" departLane="w2sep_1" departPos="3.60" departPosLat="0.00" departSpeed="13.90" departDelay="0.00" arrival="304.25" arrivalLane="c2s_1" arrivalPos="990.00" arrivalPosLat="0.00" arrivalSpeed="14.20" duration="163.25" routeLength="1986.69" waitingTime="10.25" waitingCount="1" stopTime="0.00" timeLoss="22.90" rerouteNo="1" devices="tripinfo_car_w2s_141 routing_car_w2s_141" vType="Car" speedFactor="1.02" vaporized=""/>
    <tripinfo id="car_w2e_171" depart="171.00" departLane="w2sep_1" departPos="3.60" departPosLat="0.00" departSpeed="13.90" departDelay="0.00" arrival="305.95" arrivalLane="c2e_1" arrivalPos="990.00" arrivalPosLat="0.00" arrivalSpeed="15.45" duration="134.95" routeLength="1997.01" waitingTime="0.00" waitingCount="0" stopTime="0.00" timeLoss="10.46" rerouteNo="1" devices="tripinfo_car_w2e_171 routing_car_w2e_171" vType="Car" speedFactor="1.15" vaporized=""/>
    <tripinfo id="car_w2n_116" depart="116.00" departLane="w2sep_1" departPos="3.60" departPosLat="0.00" departSpeed="13.90" departDelay="0.00" arrival="306.40" arrivalLane="c2n_1" arrivalPos="990.00" arrivalPosLat="0.00" arrivalSpeed="15.11" duration="190.40" routeLength="1996.47" waitingTime="44.95" waitingCount="2" stopTime="0.00" timeLoss="57.74" rerouteNo="1" devices="tripinfo_car_w2n_116 routing_car_w2n_116" vType="Car" speedFactor="1.09" vaporized=""/>
    <tripinfo id="car_e2s_121" depart="121.00" departLane="e2sep_1" departPos="3.60" departPosLat="0.00" departSpeed="13.90" departDelay="0.00" arrival="311.10" arrivalLane="c2s_1" arrivalPos="990.00" arrivalPosLat="0.00" arrivalSpeed="13.90" duration="190.10" routeLength="1996.47" waitingTime="34.50" waitingCount="2" stopTime="0.00" timeLoss="45.77" rerouteNo="1" devices="tripinfo_car_e2s_121 routing_car_e2s_121" vType="Car" speedFactor="1.00" vaporized=""/>
    <tripinfo id="car_e2s_132" depart="133.55" departLane="e2sep_1" departPos="3.60" departPosLat="0.00" departSpeed="13.90" departDelay="1.55" arrival="313.35" arrivalLane="c2s_1" arrivalPos="990.00" arrivalPosLat="0.00" arrivalSpeed="14.90" duration="179.80" routeLength="1996.47" waitingTime="21.85" waitingCount="2" stopTime="0.00" timeLoss="48.07" rerouteNo="1" devices="tripinfo_car_e2s_132 routing_car_e2s_132" vType="Car" speedFactor="1.10" vaporized=""/>
    <tripinfo id="car_w2n_119" depart="119.00" departLane="w2sep_1" departPos="3.60" departPosLat="0.00" departSpeed="13.90" departDelay="0.00" arrival="313.75" arrivalLane="c2n_1" arrivalPos="990.00" arrivalPosLat="0.00" arrivalSpeed="13.90" duration="194.75" routeLength="1996.47" waitingTime="35.80" waitingCount="2" stopTime="0.00" timeLoss="50.41" rerouteNo="1" devices="tripinfo_car_w2n_119 routing_car_w2n_119" vType="Car" speedFactor="1.00" vaporized=""/>
    <tripinfo id="car_e2w_180" depart="180.00" departLane="e2sep_1" departPos="3.60" departPosLat="0.00" departSpeed="13.90" departDelay="0.00" arrival="320.80" arrivalLane="c2w_1" arrivalPos="990.00" arrivalPosLat="0.00" arrivalSpeed="14.21" duration="140.80" routeLength="1997.01" waitingTime="0.00" waitingCount="0" stopTime="0.00" timeLoss="0.23" rerouteNo="1" devices="tripinfo_car_e2w_180 routing_car_e2w_180" vType="Car" speedFactor="1.02" vaporized=""/>
    <tripinfo id="car_w2s_179" depart="179.00" departLane="w2sep_1" departPos="3.60" departPosLat="0.00" departSpeed="13.90" departDelay="0.00" arrival="325.60" arrivalLane="c2s_1" arrivalPos="990.00" arrivalPosLat="0.00" arrivalSpeed="13.97" duration="146.60" routeLength="1986.69" waitingTime="0.00" waitingCount="0" stopTime="0.00" timeLoss="3.70" rerouteNo="1" devices="tripinfo_car_w2s_179 routing_car_w2s_179" vType="Car" speedFactor="1.01" vaporized=""/>
    <tripinfo id="car_e2w_181" depart="181.40" departLane="e2sep_1" departPos="3.60" departPosLat="0.00" departSpeed="13.90" departDelay="0.40" arrival="328.05" arrivalLane="c2w_1" arrivalPos="990.00" arrivalPosLat="0.00" arrivalSpeed="13.90" duration="146.65" routeLength="1997.01" waitingTime="0.00" waitingCount="0" stopTime="0.00" timeLoss="2.97" rerouteNo="1" devices="tripinfo_car_e2w_181 routing_car_e2w_181" vType="Car" speedFactor="1.00" vaporized=""/>
    <tripinfo id="car_w2n_184" depart="184.00" departLane="w2sep_1" departPos="3.60" departPosLat="0.00" departSpeed="13.90" departDelay="0.00" arrival="329.85" arrivalLane="c2n_1" arrivalPos="990.00" arrivalPosLat="0.00" arrivalSpeed="14.17" duration="145.85" routeLength="1996.47" waitingTime="0.00" waitingCount="0" stopTime="0.00" timeLoss="4.29" rerouteNo="1" devices="tripinfo_car_w2n_184 routing_car_w2n_184" vType="Car" speedFactor="1.02" vaporized=""/>
    <tripinfo id="car_s2n_167" depart="167.00" departLane="s2sep_1" departPos="3.60" departPosLat="0.00" departSpeed="13.90" departDelay="0.00" arrival="335.65" arrivalLane="c2n_1" arrivalPos="990.00" arrivalPosLat="0.00" arrivalSpeed="16.38" duration="168.65" routeLength="1997.01" waitingTime="37.60" waitingCount="1" stopTime="0.00" timeLoss="46.71" rerouteNo="1" devices="tripinfo_car_s2n_167 routing_car_s2n_167" vType="Car" speedFactor="1.18" vaporized=""/>
    <tripinfo id="car_s2e_204" depart="204.00" departLane="s2sep_1" departPos="3.60" departPosLat="0.00" departSpeed="13.90" departDelay="0.00" arrival="341.15" arrivalLane="c2e_1" arrivalPos="990.00" arrivalPosLat="0.00" arrivalSpeed="15.32" duration="137.15" routeLength="1986.69" waitingTime="0.00" waitingCount="0" stopTime="0.00" timeLoss="6.81" rerouteNo="1" devices="tripinfo_car_s2e_204 routing_car_s2e_204" vType="Car" speedFactor="1.10" vaporized=""/>
    <tripinfo id="car_n2w_166" depart="166.00" departLane="n2sep_1" departPos="3.60" departPosLat="0.00" departSpeed="13.90" departDelay="0.00" arrival="345.70" arrivalLane="c2w_1" arrivalPos="990.00" arrivalPosLat="0.00" arrivalSpeed="13.90" duration="179.70" routeLength="1986.69" waitingTime="28.95" waitingCount="1" stopTime="0.00" timeLoss="36.01" rerouteNo="1" devices="tripinfo_car_n2w_166 routing_car_n2w_166" vType="Car" speedFactor="1.00" vaporized=""/>
    <tripinfo id="car_n2w_179" depart="179.00" departLane="n2sep_1" departPos="3.60" departPosLat="0.00" departSpeed="13.90" departDelay="0.00" arrival="347.55" arrivalLane="c2w_1" arrivalPos="990.00" arrivalPosLat="0.00" arrivalSpeed="15.44" duration="168.55" routeLength="1986.69" waitingTime="26.40" waitingCount="1" stopTime="0.00" timeLoss="45.93" rerouteNo="1" devices="tripinfo_car_n2w_179 routing_car_n2w_179" vType="Car" speedFactor="1.17" vaporized=""/>
    <tripinfo id="car_n2s_181" depart="181.00" departLane="n2sep_1" departPos="3.60" departPosLat="0.00" departSpeed="13.90" departDelay="0.00" arrival="348.55" arrivalLane="c2s_1" arrivalPos="990.00" arrivalPosLat="0.00" arrivalSpeed="14.22" duration="167.55" routeLength="1997.01" waitingTime="17.10" waitingCount="1" stopTime="0.00" timeLoss="27.07" rerouteNo="1" devices="tripinfo_car_n2s_181 routing_car_n2s_181" vType="Car" speedFactor="1.02" vaporized=""/>
    <tripinfo id="car_s2w_160" depart="160.00" departLane="s2sep_1" departPos="3.60" departPosLat="0.00" departSpeed="13.90" departDelay="0.00" arrival="350.00" arrivalLane="c2w_1" arrivalPos="990.00" arrivalPosLat="0.00" arrivalSpeed="15.33" duration="190.00" routeLength="1996.47" waitingTime="47.25" waitingCount="2" stopTime="0.00" timeLoss="61.04" rerouteNo="1" devices="tripinfo_car_s2w_160 routing_car_s2w_160" vType="Car" speedFactor="1.12" vaporized=""/>
    <tripinfo id="car_n2s_201" depart="201.00" departLane="n2sep_1" departPos="3.60" departPosLat="0.00" departSpeed="13.90" departDelay="0.00" arrival="352.50" arrivalLane="c2s_1" arrivalPos="990.00" arrivalPosLat="0.00" arrivalSpeed="14.33" duration="151.50" routeLength="1997.01" waitingTime="0.00" waitingCount="0" stopTime="0.00" timeLoss="12.33" rerouteNo="1" devices="tripinfo_car_n2s_201 routing_car_n2s_201" vType="Car" speedFactor="1.03" vaporized=""/>
    <tripinfo id="car_s2e_205" depart="205.30" departLane="s2sep_1" departPos="3.60" departPosLat="0.00" departSpeed="13.90" departDelay="0.30" arrival="353.05" arrivalLane="c2e_1" arrivalPos="990.00" arrivalPosLat="0.00" arrivalSpeed="14.00" duration="147.75" routeLength="1986.69" waitingTime="0.00" waitingCount="0" stopTime="0.00" timeLoss="5.11" rerouteNo="1" devices="tripinfo_car_s2e_205 routing_car_s2e_205" vType="Car" speedFactor="1.01" vaporized=""/>
    <tripinfo id="car_s2w_179" depart="179.00" departLane="s2sep_1" departPos="3.60" departPosLat="0.00" departSpeed="13.90" departDelay="0.00" arrival="355.60" arrivalLane="c2w_1" arrivalPos="990.00" arrivalPosLat="0.00" arrivalSpeed="14.45" duration="176.60" routeLength="1996.47" waitingTime="23.20" waitingCount="2" stopTime="0.00" timeLoss="37.80" rerouteNo="1" devices="tripinfo_car_s2w_179 routing_car_s2w_179" vType="Car" speedFactor="1.04" vaporized=""/>
    <tripinfo id="car_s2w_194" depart="194.00" departLane="s2sep_1" departPos="3.60" departPosLat="0.00" departSpeed="13.90" departDelay="0.00" arrival="357.55" arrivalLane="c2w_1" arrivalPos="990.00" arrivalPosLat="0.00" arrivalSpeed="15.74" duration="163.55" routeLength="1996.47" waitingTime="14.40" waitingCount="2" stopTime="0.00" timeLoss="41.19" rerouteNo="1" devices="tripinfo_car_s2w_194 routing_car_s2w_194" vType="Car" speedFactor="1.18" vaporized=""/>
    <tripinfo id="car_n2w_221" depart="221.00" departLane="n2sep_1" departPos="3.60" departPosLat="0.00" departSpeed="13.90" departDelay="0.00" arrival="364.65" arrivalLane="c2w_1" arrivalPos="990.00" arrivalPosLat="0.00" arrivalSpeed="14.32" duration="143.65" routeLength="1986.69" waitingTime="0.00" waitingCount="0" stopTime="0.00" timeLoss="4.21" rerouteNo="1" devices="tripinfo_car_n2w_221 routing_car_n2w_221" vType="Car" speedFactor="1.03" vaporized=""/>
    <tripinfo id="car_n2w_224" depart="224.00" departLane="n2sep_1" departPos="3.60" departPosLat="0.00" departSpeed="13.90" departDelay="0.00" arrival="372.70" arrivalLane="c2w_1" arrivalPos="990.00" arrivalPosLat="0.00" arrivalSpeed="13.90" duration="148.70" routeLength="1986.69" waitingTime="0.00" waitingCount="0" stopTime="0.00" timeLoss="5.01" rerouteNo="1" devices="tripinfo_car_n2w_224 routing_car_n2w_224" vType="Car" speedFactor="1.00" vaporized=""/>
    <tripinfo id="car_n2e_234" depart="234.00" departLane="n2sep_1" departPos="3.60" departPosLat="0.00" departSpeed="13.90" departDelay="0.00" arrival="373.30" arrivalLane="c2e_1" arrivalPos="990.00" arrivalPosLat="0.00" arrivalSpeed="15.18" duration="139.30" routeLength="1996.47" waitingTime="0.00" waitingCount="0" stopTime="0.00" timeLoss="7.12" rerouteNo="1" devices="tripinfo_car_n2e_234 routing_car_n2e_234" vType="Car" speedFactor="1.09" vaporized=""/>
    <tripinfo id="car_n2w_230" depart="230.00" departLane="n2sep_1" departPos="3.60" departPosLat="0.00" departSpeed="13.90" departDelay="0.00" arrival="376.75" arrivalLane="c2w_1" arrivalPos="990.00" arrivalPosLat="0.00" arrivalSpeed="14.19" duration="146.75" routeLength="1986.69" waitingTime="0.00" waitingCount="0" stopTime="0.00" timeLoss="6.17" rerouteNo="1" devices="tripinfo_car_n2w_230 routing_car_n2w_230" vType="Car" speedFactor="1.02" vaporized=""/>
    <tripinfo id="car_w2e_224" depart="224.00" departLane="w2sep_1" departPos="3.60" departPosLat="0.00" departSpeed="13.90" departDelay="0.00" arrival="386.20" arrivalLane="c2e_1" arrivalPos="990.00" arrivalPosLat="0.00" arrivalSpeed="15.95" duration="162.20" routeLength="1997.01" waitingTime="26.15" waitingCount="1" stopTime="0.00" timeLoss="37.02" rerouteNo="1" devices="tripinfo_car_w2e_224 routing_car_w2e_224" vType="Car" speedFactor="1.15" vaporized=""/>
    <tripinfo id="car_w2s_185" depart="185.45" departLane="w2sep_1" departPos="3.60" departPosLat="0.00" departSpeed="13.90" departDelay="0.45" arrival="386.95" arrivalLane="c2s_1" arrivalPos="990.00" arrivalPosLat="0.00" arrivalSpeed="14.67" duration="201.50" routeLength="1986.69" waitingTime="54.00" waitingCount="1" stopTime="0.00" timeLoss="65.42" rerouteNo="1" devices="tripinfo_car_w2s_185 routing_car_w2s_185" vType="Car" speedFactor="1.06" vaporized=""/>
    <tripinfo id="car_w2s_210" depart="210.00" departLane="w2sep_1" departPos="3.60" departPosLat="0.00" departSpeed="13.90" departDelay="0.00" arrival="390.35" arrivalLane="c2s_1" arrivalPos="990.00" arrivalPosLat="0.00" arrivalSpeed="15.06" duration="180.35" routeLength="1986.69" waitingTime="36.25" waitingCount="1" stopTime="0.00" timeLoss="48.16" rerouteNo="1" devices="tripinfo_car_w2s_210 routing_car_w2s_210" vType="Car" speedFactor="1.09" vaporized=""/>
    <tripinfo id="car_e2n_193" depart="193.00" departLane="e2sep_1" departPos="3.60" departPosLat="0.00" departSpeed="13.90" departDelay="0.00" arrival="390.60" arrivalLane="c2n_1" arrivalPos="990.00" arrivalPosLat="0.00" arrivalSpeed="13.90" duration="197.60" routeLength="1986.69" waitingTime="47.05" waitingCount="1" stopTime="0.00" timeLoss="53.95" rerouteNo="1" devices="tripinfo_car_e2n_193 routing_car_e2n_193" vType="Car" speedFactor="1.00" vaporized=""/>
    <tripinfo id="car_e2w_218" depart="218.45" departLane="e2sep_1" departPos="3.60" departPosLat="0.00" departSpeed="13.90" departDelay="0.45" arrival="391.70" arrivalLane="c2w_1" arrivalPos="990.00" arrivalPosLat="0.00" arrivalSpeed="14.13" duration="173.25" routeLength="1997.01" waitingTime="20.45" waitingCount="1" stopTime="0.00" timeLoss="31.97" rerouteNo="1" devices="tripinfo_car_e2w_218 routing_car_e2w_218" vType="Car" speedFactor="1.02" vaporized=""/>
    <tripinfo id="car_w2e_245" depart="245.00" departLane="w2sep_1" departPos="3.60" departPosLat="0.00" departSpeed="13.90" departDelay="0.00" arrival="392.40" arrivalLane="c2e_1" arrivalPos="990.00" arrivalPosLat="0.00" arrivalSpeed="15.16" duration="147.40" routeLength="1997.01" waitingTime="3.75" waitingCount="1" stopTime="0.00" timeLoss="15.71" rerouteNo="1" devices="tripinfo_car_w2e_245 routing_car_w2e_245" vType="Car" speedFactor="1.09" vaporized=""/>
    <tripinfo id="car_e2w_224" depart="224.00" departLane="e2sep_1" departPos="3.60" departPosLat="0.00" departSpeed="13.90" departDelay="0.00" arrival="396.70" arrivalLane="c2w_1" arrivalPos="990.00" arrivalPosLat="0.00" arrivalSpeed="13.92" duration="172.70" routeLength="1997.01" waitingTime="14.15" waitingCount="1" stopTime="0.00" timeLoss="29.24" rerouteNo="1" devices="tripinfo_car_e2w_224 routing_car_e2w_224" vType="Car" speedFactor="1.00" vaporized=""/>
    <tripinfo id="car_w2e_262" depart="262.00" departLane="w2sep_1" departPos="3.60" departPosLat="0.00" departSpeed="13.90" departDelay="0.00" arrival="396.70" arrivalLane="c2e_1" arrivalPos="990.00" arrivalPosLat="0.00" arrivalSpeed="15.11" duration="134.70" routeLength="1997.01" waitingTime="0.00" waitingCount="0" stopTime="0.00" timeLoss="2.63" rerouteNo="1" devices="tripinfo_car_w2e_262 routing_car_w2e_262" vType="Car" speedFactor="1.09" vaporized=""/>
    <tripinfo id="car_e2n_238" depart="238.00" departLane="e2sep_1" departPos="3.60" departPosLat="0.00" departSpeed="13.90" departDelay="0.00" arrival="398.75" arrivalLane="c2n_1" arrivalPos="990.00" arrivalPosLat="0.00" arrivalSpeed="14.50" duration="160.75" routeLength="1986.69" waitingTime="9.85" waitingCount="1" stopTime="0.00" timeLoss="23.09" rerouteNo="1" devices="tripinfo_car_e2n_238 routing_car_e2n_238" vType="Car" speedFactor="1.04" vaporized=""/>
    <tripinfo id="amb_w2e_300" depart="300.00" departLane="w2sep_1" departPos="6.60" departPosLat="0.00" departSpeed="13.90" departDelay="0.00" arrival="398.75" arrivalLane="c2e_1" arrivalPos="990.00" arrivalPosLat="0.00" arrivalSpeed="19.52" duration="98.75" routeLength="1994.01" waitingTime="0.00" waitingCount="0" stopTime="0.00" timeLoss="3.07" rerouteNo="1" devices="tripinfo_amb_w2e_300 routing_amb_w2e_300 bluelight_amb_w2e_300 fcd_amb_w2e_300" vType="Ambulance" speedFactor="1.50" vaporized="">
        <example_device customValue1="0.00" customValue2="-1.00"/>
    </tripinfo>
    <tripinfo id="car_e2w_225" depart="225.70" departLane="e2sep_1" departPos="3.60" departPosLat="0.00" departSpeed="13.90" departDelay="0.70" arrival="399.45" arrivalLane="c2w_1" arrivalPos="990.00" arrivalPosLat="0.00" arrivalSpeed="14.38" duration="173.75" routeLength="1997.01" waitingTime="13.20" waitingCount="1" stopTime="0.00" timeLoss="35.95" rerouteNo="1" devices="tripinfo_car_e2w_225 routing_car_e2w_225" vType="Car" speedFactor="1.04" vaporized=""/>
    <tripinfo id="car_e2w_227" depart="227.55" departLane="e2sep_1" departPos="3.60" departPosLat="0.00" departSpeed="13.90" departDelay="0.55" arrival="402.80" arrivalLane="c2w_1" arrivalPos="990.00" arrivalPosLat="0.00" arrivalSpeed="13.96" duration="175.25" routeLength="1997.01" waitingTime="11.75" waitingCount="1" stopTime="0.00" timeLoss="32.58" rerouteNo="1" devices="tripinfo_car_e2w_227 routing_car_e2w_227" vType="Car" speedFactor="1.01" vaporized=""/>
    <tripinfo id="car_e2s_217" depart="217.00" departLane="e2sep_1" departPos="3.60" departPosLat="0.00" departSpeed="13.90" departDelay="0.00" arrival="404.25" arrivalLane="c2s_1" arrivalPos="990.00" arrivalPosLat="0.00" arrivalSpeed="13.90" duration="187.25" routeLength="1996.47" waitingTime="32.00" waitingCount="2" stopTime="0.00" timeLoss="42.91" rerouteNo="1" devices="tripinfo_car_e2s_217 routing_car_e2s_217" vType="Car" speedFactor="1.00" vaporized=""/>
    <tripinfo id="car_e2n_258" depart="258.00" departLane="e2sep_1" departPos="3.60" departPosLat="0.00" departSpeed="13.90" departDelay="0.00" arrival="405.20" arrivalLane="c2n_1" arrivalPos="990.00" arrivalPosLat="0.00" arrivalSpeed="14.04" duration="147.20" routeLength="1986.69" waitingTime="0.00" waitingCount="0" stopTime="0.00" timeLoss="4.95" rerouteNo="1" devices="tripinfo_car_e2n_258 routing_car_e2n_258" vType="Car" speedFactor="1.01" vaporized=""/>
    <tripinfo id="car_e2n_270" depart="270.00" departLane="e2sep_1" departPos="3.60" departPosLat="0.00" departSpeed="13.90" departDelay="0.00" arrival="407.80" arrivalLane="c2n_1" arrivalPos="990.00" arrivalPosLat="0.00" arrivalSpeed="15.06" duration="137.80" routeLength="1986.69" waitingTime="0.00" waitingCount="0" stopTime="0.00" timeLoss="6.83" rerouteNo="1" devices="tripinfo_car_e2n_270 routing_car_e2n_270" vType="Car" speedFactor="1.10" vaporized=""/>
    <tripinfo id="bus_e2s_222" depart="222.00" departLane="e2sep_1" departPos="12.10" departPosLat="0.00" departSpeed="13.90" departDelay="0.00" arrival="410.15" arrivalLane="c2s_1" arrivalPos="990.00" arrivalPosLat="0.00" arrivalSpeed="13.88" duration="188.15" routeLength="1987.97" waitingTime="25.60" waitingCount="2" stopTime="0.00" timeLoss="44.43" rerouteNo="1" devices="tripinfo_bus_e2s_222 routing_bus_e2s_222" vType="Bus" speedFactor="1.00" vaporized=""/>
    <tripinfo id="car_w2n_213" depart="213.00" departLane="w2sep_1" departPos="3.60" departPosLat="0.00" departSpeed="13.90" departDelay="0.00" arrival="413.35" arrivalLane="c2n_1" arrivalPos="990.00" arrivalPosLat="0.00" arrivalSpeed="14.38" duration="200.35" routeLength="1996.47" waitingTime="48.00" waitingCount="2" stopTime="0.00" timeLoss="60.82" rerouteNo="1" devices="tripinfo_car_w2n_213 routing_car_w2n_213" vType="Car" speedFactor="1.03" vaporized=""/>
    <tripinfo id="car_e2s_274" depart="274.00" departLane="e2sep_1" departPos="3.60" departPosLat="0.00" departSpeed="13.90" departDelay="0.00" arrival="414.85" arrivalLane="c2s_1" arrivalPos="990.00" arrivalPosLat="0.00" arrivalSpeed="14.79" duration="140.85" routeLength="1996.47" waitingTime="0.00" waitingCount="0" stopTime="0.00" timeLoss="5.31" rerouteNo="1" devices="tripinfo_car_e2s_274 routing_car_e2s_274" vType="Car" speedFactor="1.07" vaporized=""/>
    <tripinfo id="car_w2n_268" depart="268.00" departLane="w2sep_1" departPos="3.60" departPosLat="0.00" departSpeed="13.90" departDelay="0.00" arrival="415.65" arrivalLane="c2n_1" arrivalPos="990.00" arrivalPosLat="0.00" arrivalSpeed="15.28" duration="147.65" routeLength="1996.47" waitingTime="3.50" waitingCount="1" stopTime="0.00" timeLoss="18.94" rerouteNo="1" devices="tripinfo_car_w2n_268 routing_car_w2n_268" vType="Car" speedFactor="1.12" vaporized=""/>
    <tripinfo id="car_e2w_285" depart="285.00" departLane="e2sep_1" departPos="3.60" departPosLat="0.00" departSpeed="13.90" departDelay="0.00" arrival="429.35" arrivalLane="c2w_1" arrivalPos="990.00" arrivalPosLat="0.00" arrivalSpeed="13.90" duration="144.35" routeLength="1997.01" waitingTime="0.00" waitingCount="0" stopTime="0.00" timeLoss="0.64" rerouteNo="1" devices="tripinfo_car_e2w_285 routing_car_e2w_285" vType="Car" speedFactor="1.00" vaporized=""/>
    <tripinfo id="car_e2s_295" depart="295.00" departLane="e2sep_1" departPos="3.60" departPosLat="0.00" departSpeed="13.90" departDelay="0.00" arrival="442.80" arrivalLane="c2s_1" arrivalPos="990.00" arrivalPosLat="0.00" arrivalSpeed="13.90" duration="147.80" routeLength="1996.47" waitingTime="0.00" waitingCount="0" stopTime="0.00" timeLoss="3.45" rerouteNo="1" devices="tripinfo_car_e2s_295 routing_car_e2s_295" vType="Car" speedFactor="1.00" vaporized=""/>
    <tripinfo id="car_n2w_237" depart="237.00" departLane="n2sep_1" departPos="3.60" departPosLat="0.00" departSpeed="13.90" departDelay="0.00" arrival="443.40" arrivalLane="c2w_1" arrivalPos="990.00" arrivalPosLat="0.00" arrivalSpeed="14.42" duration="206.40" routeLength="1986.69" waitingTime="59.40" waitingCount="1" stopTime="0.00" timeLoss="67.99" rerouteNo="1" devices="tripinfo_car_n2w_237 routing_car_n2w_237" vType="Car" speedFactor="1.04" vaporized=""/>
    <tripinfo id="car_s2e_232" depart="232.00" departLane="s2sep_1" departPos="3.60" departPosLat="0.00" departSpeed="13.90" departDelay="0.00" arrival="444.70" arrivalLane="c2e_1" arrivalPos="990.00" arrivalPosLat="0.00" arrivalSpeed="14.13" duration="212.70" routeLength="1986.69" waitingTime="65.10" waitingCount="1" stopTime="0.00" timeLoss="71.41" rerouteNo="1" devices="tripinfo_car_s2e_232 routing_car_s2e_232" vType="Car" speedFactor="1.02" vaporized=""/>
    <tripinfo id="car_s2e_245" depart="245.00" departLane="s2sep_1" departPos="3.60" departPosLat="0.00" departSpeed="13.90" departDelay="0.00" arrival="447.85" arrivalLane="c2e_1" arrivalPos="990.00" arrivalPosLat="0.00" arrivalSpeed="14.62" duration="202.85" routeLength="1986.69" waitingTime="54.75" waitingCount="1" stopTime="0.00" timeLoss="66.92" rerouteNo="1" devices="tripinfo_car_s2e_245 routing_car_s2e_245" vType="Car" speedFactor="1.06" vaporized=""/>
    <tripinfo id="car_s2n_295" depart="295.00" departLane="s2sep_1" departPos="3.60" departPosLat="0.00" departSpeed="13.90" departDelay="0.00" arrival="448.00" arrivalLane="c2n_1" arrivalPos="990.00" arrivalPosLat="0.00" arrivalSpeed="14.91" duration="153.00" routeLength="1997.01" waitingTime="7.95" waitingCount="1" stopTime="0.00" timeLoss="19.03" rerouteNo="1" devices="tripinfo_car_s2n_295 routing_car_s2n_295" vType="Car" speedFactor="1.07" vaporized=""/>
    <tripinfo id="car_n2w_295" depart="295.00" departLane="n2sep_1" departPos="3.60" departPosLat="0.00" departSpeed="13.90" departDelay="0.00" arrival="449.65" arrivalLane="c2w_1" arrivalPos="990.00" arrivalPosLat="0.00" arrivalSpeed="13.90" duration="154.65" routeLength="1986.69" waitingTime="1.10" waitingCount="1" stopTime="0.00" timeLoss="10.99" rerouteNo="1" devices="tripinfo_car_n2w_295 routing_car_n2w_295" vType="Car" speedFactor="1.00" vaporized=""/>
    <tripinfo id="car_n2s_298" depart="298.00" departLane="n2sep_1" departPos="3.60" departPosLat="0.00" departSpeed="13.90" departDelay="0.00" arrival="449.85" arrivalLane="c2s_1" arrivalPos="990.00" arrivalPosLat="0.00" arrivalSpeed="14.09" duration="151.85" routeLength="1997.01" waitingTime="0.00" waitingCount="0" stopTime="0.00" timeLoss="10.16" rerouteNo="1" devices="tripinfo_car_n2s_298 routing_car_n2s_298" vType="Car" speedFactor="1.01" vaporized=""/>
    <tripinfo id="car_s2e_278" depart="278.00" departLane="s2sep_1" departPos="3.60" departPosLat="0.00" departSpeed="13.90" departDelay="0.00" arrival="452.80" arrivalLane="c2e_1" arrivalPos="990.00" arrivalPosLat="0.00" arrivalSpeed="13.90" duration="174.80" routeLength="1986.69" waitingTime="19.25" waitingCount="1" stopTime="0.00" timeLoss="31.17" rerouteNo="1" devices="tripinfo_car_s2e_278 routing_car_s2e_278" vType="Car" speedFactor="1.00" vaporized=""/>
    <tripinfo id="car_s2n_299" depart="299.00" departLane="s2sep_1" departPos="3.60" departPosLat="0.00" departSpeed="13.90" departDelay="0.00" arrival="453.80" arrivalLane="c2n_1" arrivalPos="990.00" arrivalPosLat="0.00" arrivalSpeed="14.38" duration="154.80" routeLength="1997.01" waitingTime="2.60" waitingCount="1" stopTime="0.00" timeLoss="15.90" rerouteNo="1" devices="tripinfo_car_s2n_299 routing_car_s2n_299" vType="Car" speedFactor="1.03" vaporized=""/>
    <tripinfo id="car_s2w_301" depart="301.00" departLane="s2sep_1" departPos="3.60" departPosLat="0.00" departSpeed="13.90" departDelay="0.00" arrival="454.40" arrivalLane="c2w_1" arrivalPos="990.00" arrivalPosLat="0.00" arrivalSpeed="13.89" duration="153.40" routeLength="1996.47" waitingTime="0.00" waitingCount="0" stopTime="0.00" timeLoss="9.05" rerouteNo="1" devices="tripinfo_car_s2w_301 routing_car_s2w_301" vType="Car" speedFactor="1.00" vaporized=""/>
    <tripinfo id="car_s2n_316" depart="316.00" departLane="s2sep_1" departPos="3.60" departPosLat="0.00" departSpeed="13.90" departDelay="0.00" arrival="456.30" arrivalLane="c2n_1" arrivalPos="990.00" arrivalPosLat="0.00" arrivalSpeed="15.07" duration="140.30" routeLength="1997.01" waitingTime="0.00" waitingCount="0" stopTime="0.00" timeLoss="9.51" rerouteNo="1" devices="tripinfo_car_s2n_316 routing_car_s2n_316" vType="Car" speedFactor="1.10" vaporized=""/>
</tripinfos>
