<?xml version="1.0" encoding="UTF-8"?>

<!-- generated on 2021-05-18 05:16:42 by Eclipse SUMO sumo Version 1.9.1
<configuration xmlns:xsi="http://www.w3.org/2001/XMLSchema-instance" xsi:noNamespaceSchemaLocation="http://sumo.dlr.de/xsd/sumoConfiguration.xsd">

    <input>
        <net-file value="sumofiles/junction.net.xml"/>
        <route-files value="sumofiles/junction_radius_8.rou.xml"/>
        <additional-files value="sumofiles/junction.det.xml"/>
    </input>

    <output>
        <tripinfo-output value="sumofiles/output/tripinfo_radius_8.xml"/>
    </output>

    <time>
        <begin value="0"/>
        <end value="10000"/>
        <step-length value="1.0"/>
    </time>

    <processing>
        <lateral-resolution value="0.5"/>
    </processing>

    <report>
        <no-warnings value="true"/>
        <error-log value="sumofiles/output/errorlog_radius_8.log"/>
        <no-step-log value="true"/>
    </report>

    <traci_server>
        <remote-port value="39171"/>
    </traci_server>

    <gui_only>
        <gui-settings-file value="sumofiles/junction-gui.settings.xml"/>
        <tracker-interval value="1"/>
    </gui_only>

</configuration>
-->

<tripinfos xmlns:xsi="http://www.w3.org/2001/XMLSchema-instance" xsi:noNamespaceSchemaLocation="http://sumo.dlr.de/xsd/tripinfo_file.xsd">
    <tripinfo id="car_e2s_0" depart="0.00" departLane="e2sep_1" departPos="3.60" departPosLat="0.00" departSpeed="13.90" departDelay="0.00" arrival="142.00" arrivalLane="c2s_1" arrivalPos="990.00" arrivalPosLat="0.00" arrivalSpeed="14.73" duration="142.00" routeLength="1996.47" waitingTime="0.00" waitingCount="0" stopTime="0.00" timeLoss="4.92" rerouteNo="1" devices="tripinfo_car_e2s_0 routing_car_e2s_0" vType="Car" speedFactor="1.06" vaporized=""/>
    <tripinfo id="car_e2s_2" depart="2.00" departLane="e2sep_1" departPos="3.60" departPosLat="0.00" departSpeed="13.90" departDelay="0.00" arrival="148.00" arrivalLane="c2s_1" arrivalPos="990.00" arrivalPosLat="0.00" arrivalSpeed="14.73" duration="146.00" routeLength="1996.47" waitingTime="0.00" waitingCount="0" stopTime="0.00" timeLoss="9.74" rerouteNo="1" devices="tripinfo_car_e2s_2 routing_car_e2s_2" vType="Car" speedFactor="1.06" vaporized=""/>
    <tripinfo id="car_e2s_14" depart="14.00" departLane="e2sep_1" departPos="3.60" departPosLat="0.00" departSpeed="13.90" departDelay="0.00" arrival="157.00" arrivalLane="c2s_1" arrivalPos="990.00" arrivalPosLat="0.00" arrivalSpeed="14.32" duration="143.00" routeLength="1996.47" waitingTime="0.00" waitingCount="0" stopTime="0.00" timeLoss="2.69" rerouteNo="1" devices="tripinfo_car_e2s_14 routing_car_e2s_14" vType="Car" speedFactor="1.03" vaporized=""/>
    <tripinfo id="car_n2s_6" depart="6.00" departLane="n2sep_1" departPos="3.60" departPosLat="0.00" departSpeed="13.90" departDelay="0.00" arrival="161.00" arrivalLane="c2s_1" arrivalPos="990.00" arrivalPosLat="0.00" arrivalSpeed="15.02" duration="155.00" routeLength="1997.01" waitingTime="10.00" waitingCount="1" stopTime="0.00" timeLoss="21.66" rerouteNo="1" devices="tripinfo_car_n2s_6 routing_car_n2s_6" vType="Car" speedFactor="1.08" vaporized=""/>
    <tripinfo id="car_s2w_16" depart="16.00" departLane="s2sep_1" departPos="3.60" departPosLat="0.00" departSpeed="13.90" departDelay="0.00" arrival="167.00" arrivalLane="c2w_1" arrivalPos="990.00" arrivalPosLat="0.00" arrivalSpeed="13.90" duration="151.00" routeLength="1996.47" waitingTime="0.00" waitingCount="0" stopTime="0.00" timeLoss="5.79" rerouteNo="1" devices="tripinfo_car_s2w_16 routing_car_s2w_16" vType="Car" speedFactor="1.00" vaporized=""/>
    <tripinfo id="car_s2w_28" depart="28.00" departLane="s2sep_1" departPos="3.60" departPosLat="0.00" departSpeed="13.90" departDelay="0.00" arrival="169.00" arrivalLane="c2w_1" arrivalPos="990.00" arrivalPosLat="0.00" arrivalSpeed="14.84" duration="141.00" routeLength="1996.47" waitingTime="0.00" waitingCount="0" stopTime="0.00" timeLoss="7.61" rerouteNo="1" devices="tripinfo_car_s2w_28 routing_car_s2w_28" vType="Car" speedFactor="1.08" vaporized=""/>
    <tripinfo id="bus_n2e_25" depart="25.00" departLane="n2sep_1" departPos="12.10" departPosLat="0.00" departSpeed="13.90" departDelay="0.00" arrival="177.00" arrivalLane="c2e_1" arrivalPos="990.00" arrivalPosLat="0.00" arrivalSpeed="13.90" duration="152.00" routeLength="1987.97" waitingTime="0.00" waitingCount="0" stopTime="0.00" timeLoss="7.51" rerouteNo="1" devices="tripinfo_bus_n2e_25 routing_bus_n2e_25" vType="Bus" speedFactor="1.00" vaporized=""/>
    <tripinfo id="car_n2e_30" depart="30.00" departLane="n2sep_1" departPos="3.60" departPosLat="0.00" departSpeed="13.90" departDelay="0.00" arrival="181.00" arrivalLane="c2e_1" arrivalPos="990.00" arrivalPosLat="0.00" arrivalSpeed="14.25" duration="151.00" routeLength="1996.47" waitingTime="0.00" waitingCount="0" stopTime="0.00" timeLoss="9.79" rerouteNo="1" devices="tripinfo_car_n2e_30 routing_car_n2e_30" vType="Car" speedFactor="1.03" vaporized=""/>
    <tripinfo id="car_s2n_38" depart="38.00" departLane="s2sep_1" departPos="3.60" departPosLat="0.00" departSpeed="13.90" departDelay="0.00" arrival="183.00" arrivalLane="c2n_1" arrivalPos="990.00" arrivalPosLat="0.00" arrivalSpeed="13.90" duration="145.00" routeLength="1997.01" waitingTime="0.00" waitingCount="0" stopTime="0.00" timeLoss="0.36" rerouteNo="1" devices="tripinfo_car_s2n_38 routing_car_s2n_38" vType="Car" speedFactor="1.00" vaporized=""/>
    <tripinfo id="car_n2e_37" depart="37.00" departLane="n2sep_1" departPos="3.60" departPosLat="0.00" departSpeed="13.90" departDelay="0.00" arrival="184.00" arrivalLane="c2e_1" arrivalPos="990.00" arrivalPosLat="0.00" arrivalSpeed="14.48" duration="147.00" routeLength="1996.47" waitingTime="0.00" waitingCount="0" stopTime="0.00" timeLoss="8.39" rerouteNo="1" devices="tripinfo_car_n2e_37 routing_car_n2e_37" vType="Car" speedFactor="1.05" vaporized=""/>
    <tripinfo id="car_n2e_58" depart="58.00" departLane="n2sep_1" departPos="3.60" departPosLat="0.00" departSpeed="13.90" departDelay="0.00" arrival="192.00" arrivalLane="c2e_1" arrivalPos="990.00" arrivalPosLat="0.00" arrivalSpeed="15.61" duration="134.00" routeLength="1996.47" waitingTime="0.00" waitingCount="0" stopTime="0.00" timeLoss="4.99" rerouteNo="1" devices="tripinfo_car_n2e_58 routing_car_n2e_58" vType="Car" speedFactor="1.12" vaporized=""/>
    <tripinfo id="car_n2w_48" depart="48.00" departLane="n2sep_1" departPos="3.60" departPosLat="0.00" departSpeed="13.90" departDelay="0.00" arrival="193.00" arrivalLane="c2w_1" arrivalPos="990.00" arrivalPosLat="0.00" arrivalSpeed="14.27" duration="145.00" routeLength="1986.69" waitingTime="0.00" waitingCount="0" stopTime="0.00" timeLoss="5.11" rerouteNo="1" devices="tripinfo_car_n2w_48 routing_car_n2w_48" vType="Car" speedFactor="1.03" vaporized=""/>
    <tripinfo id="car_n2e_66" depart="66.00" departLane="n2sep_1" departPos="3.60" departPosLat="0.00" departSpeed="13.90" departDelay="0.00" arrival="195.00" arrivalLane="c2e_1" arrivalPos="990.00" arrivalPosLat="0.00" arrivalSpeed="16.27" duration="129.00" routeLength="1996.47" waitingTime="0.00" waitingCount="0" stopTime="0.00" timeLoss="5.79" rerouteNo="1" devices="tripinfo_car_n2e_66 routing_car_n2e_66" vType="Car" speedFactor="1.18" vaporized=""/>
    <tripinfo id="car_s2w_41" depart="41.00" departLane="s2sep_1" departPos="3.60" departPosLat="0.00" departSpeed="13.90" departDelay="0.00" arrival="199.00" arrivalLane="c2w_1" arrivalPos="990.00" arrivalPosLat="0.00" arrivalSpeed="13.90" duration="158.00" routeLength="1996.47" waitingTime="1.00" waitingCount="1" stopTime="0.00" timeLoss="13.34" rerouteNo="1" devices="tripinfo_car_s2w_41 routing_car_s2w_41" vType="Car" speedFactor="1.00" vaporized=""/>
    <tripinfo id="car_s2w_62" depart="65.00" departLane="s2sep_1" departPos="3.60" departPosLat="0.00" departSpeed="13.90" departDelay="3.00" arrival="201.00" arrivalLane="c2w_1" arrivalPos="990.00" arrivalPosLat="0.00" arrivalSpeed="15.23" duration="136.00" routeLength="1996.47" waitingTime="0.00" waitingCount="0" stopTime="0.00" timeLoss="8.07" rerouteNo="1" devices="tripinfo_car_s2w_62 routing_car_s2w_62" vType="Car" speedFactor="1.13" vaporized=""/>
    <tripinfo id="car_w2s_4" depart="4.00" departLane="w2sep_1" departPos="3.60" departPosLat="0.00" departSpeed="13.90" departDelay="0.00" arrival="209.00" arrivalLane="c2s_1" arrivalPos="990.00" arrivalPosLat="0.00" arrivalSpeed="14.04" duration="205.00" routeLength="1986.69" waitingTime="56.00" waitingCount="1" stopTime="0.00" timeLoss="62.26" rerouteNo="1" devices="tripinfo_car_w2s_4 routing_car_w2s_4" vType="Car" speedFactor="1.01" vaporized=""/>
    <tripinfo id="car_e2w_24" depart="24.00" departLane="e2sep_1" departPos="3.60" departPosLat="0.00" departSpeed="13.90" departDelay="0.00" arrival="209.00" arrivalLane="c2w_1" arrivalPos="990.00" arrivalPosLat="0.00" arrivalSpeed="14.04" duration="185.00" routeLength="1997.01" waitingTime="32.00" waitingCount="1" stopTime="0.00" timeLoss="42.69" rerouteNo="1" devices="tripinfo_car_e2w_24 routing_car_e2w_24" vType="Car" speedFactor="1.01" vaporized=""/>
    <tripinfo id="car_e2w_67" depart="67.00" departLane="e2sep_1" departPos="3.60" departPosLat="0.00" departSpeed="13.90" departDelay="0.00" arrival="211.00" arrivalLane="c2w_1" arrivalPos="990.00" arrivalPosLat="0.00" arrivalSpeed="15.46" duration="144.00" routeLength="1997.01" waitingTime="0.00" waitingCount="0" stopTime="0.00" timeLoss="19.36" rerouteNo="1" devices="tripinfo_car_e2w_67 routing_car_e2w_67" vType="Car" speedFactor="1.15" vaporized=""/>
    <tripinfo id="car_w2n_17" depart="17.00" departLane="w2sep_1" departPos="3.60" departPosLat="0.00" departSpeed="13.90" departDelay="0.00" arrival="212.00" arrivalLane="c2n_1" arrivalPos="990.00" arrivalPosLat="0.00" arrivalSpeed="14.54" duration="195.00" routeLength="1996.47" waitingTime="42.00" waitingCount="1" stopTime="0.00" timeLoss="56.49" rerouteNo="1" devices="tripinfo_car_w2n_17 routing_car_w2n_17" vType="Car" speedFactor="1.05" vaporized=""/>
    <tripinfo id="car_w2s_29" depart="29.00" departLane="w2sep_1" departPos="3.60" departPosLat="0.00" departSpeed="13.90" departDelay="0.00" arrival="213.00" arrivalLane="c2s_1" arrivalPos="990.00" arrivalPosLat="0.00" arrivalSpeed="14.30" duration="184.00" routeLength="1986.69" waitingTime="30.00" waitingCount="1" stopTime="0.00" timeLoss="43.63" rerouteNo="1" devices="tripinfo_car_w2s_29 routing_car_w2s_29" vType="Car" speedFactor="1.03" vaporized=""/>
    <tripinfo id="car_w2s_30" depart="31.00" departLane="w2sep_1" departPos="3.60" departPosLat="0.00" departSpeed="13.90" departDelay="1.00" arrival="215.00" arrivalLane="c2s_1" arrivalPos="990.00" arrivalPosLat="0.00" arrivalSpeed="14.88" duration="184.00" routeLength="1986.69" waitingTime="29.00" waitingCount="1" stopTime="0.00" timeLoss="51.82" rerouteNo="1" devices="tripinfo_car_w2s_30 routing_car_w2s_30" vType="Car" speedFactor="1.09" vaporized=""/>
    <tripinfo id="car_w2s_33" depart="33.00" departLane="w2sep_1" departPos="3.60" departPosLat="0.00" departSpeed="13.90" departDelay="0.00" arrival="218.00" arrivalLane="c2s_1" arrivalPos="990.00" arrivalPosLat="0.00" arrivalSpeed="14.50" duration="185.00" routeLength="1986.69" waitingTime="27.00" waitingCount="1" stopTime="0.00" timeLoss="47.52" rerouteNo="1" devices="tripinfo_car_w2s_33 routing_car_w2s_33" vType="Car" speedFactor="1.05" vaporized=""/>
    <tripinfo id="car_w2n_45" depart="45.00" departLane="w2sep_1" departPos="3.60" departPosLat="0.00" departSpeed="13.90" departDelay="0.00" arrival="218.00" arrivalLane="c2n_1" arrivalPos="990.00" arrivalPosLat="0.00" arrivalSpeed="14.04" duration="173.00" routeLength="1996.47" waitingTime="13.00" waitingCount="1" stopTime="0.00" timeLoss="29.60" rerouteNo="1" devices="tripinfo_car_w2n_45 routing_car_w2n_45" vType="Car" speedFactor="1.01" vaporized=""/>
    <tripinfo id="car_w2s_34" depart="35.00" departLane="w2sep_1" departPos="3.60" departPosLat="0.00" departSpeed="13.90" departDelay="1.00" arrival="220.00" arrivalLane="c2s_1" arrivalPos="990.00" arrivalPosLat="0.00" arrivalSpeed="15.20" duration="185.00" routeLength="1986.69" waitingTime="27.00" waitingCount="1" stopTime="0.00" timeLoss="56.68" rerouteNo="1" devices="tripinfo_car_w2s_34 routing_car_w2s_34" vType="Car" speedFactor="1.12" vaporized=""/>
    <tripinfo id="car_w2e_40" depart="40.00" departLane="w2sep_1" departPos="3.60" departPosLat="0.00" departSpeed="13.90" departDelay="0.00" arrival="223.00" arrivalLane="c2e_1" arrivalPos="990.00" arrivalPosLat="0.00" arrivalSpeed="13.90" duration="183.00" routeLength="1997.01" waitingTime="22.00" waitingCount="1" stopTime="0.00" timeLoss="39.27" rerouteNo="1" devices="tripinfo_car_w2e_40 routing_car_w2e_40" vType="Car" speedFactor="1.00" vaporized=""/>
    <tripinfo id="car_w2s_48" depart="48.00" departLane="w2sep_1" departPos="3.60" departPosLat="0.00" departSpeed="13.90" departDelay="0.00" arrival="223.00" arrivalLane="c2s_1" arrivalPos="990.00" arrivalPosLat="0.00" arrivalSpeed="15.06" duration="175.00" routeLength="1986.69" waitingTime="21.00" waitingCount="1" stopTime="0.00" timeLoss="42.80" rerouteNo="1" devices="tripinfo_car_w2s_48 routing_car_w2s_48" vType="Car" speedFactor="1.09" vaporized=""/>
    <tripinfo id="car_w2e_77" depart="77.00" departLane="w2sep_1" departPos="3.60" departPosLat="0.00" departSpeed="13.90" departDelay="0.00" arrival="225.00" arrivalLane="c2e_1" arrivalPos="990.00" arrivalPosLat="0.00" arrivalSpeed="15.72" duration="148.00" routeLength="1997.01" waitingTime="0.00" waitingCount="0" stopTime="0.00" timeLoss="26.05" rerouteNo="1" devices="tripinfo_car_w2e_77 routing_car_w2e_77" vType="Car" speedFactor="1.18" vaporized=""/>
    <tripinfo id="car_e2w_93" depart="93.00" departLane="e2sep_1" departPos="3.60" departPosLat="0.00" departSpeed="13.90" departDelay="0.00" arrival="225.00" arrivalLane="c2w_1" arrivalPos="990.00" arrivalPosLat="0.00" arrivalSpeed="15.18" duration="132.00" routeLength="1997.01" waitingTime="0.00" waitingCount="0" stopTime="0.00" timeLoss="0.32" rerouteNo="1" devices="tripinfo_car_e2w_93 routing_car_e2w_93" vType="Car" speedFactor="1.09" vaporized=""/>
    <tripinfo id="car_w2e_88" depart="88.00" departLane="w2sep_1" departPos="3.60" departPosLat="0.00" departSpeed="13.90" departDelay="0.00" arrival="228.00" arrivalLane="c2e_1" arrivalPos="990.00" arrivalPosLat="0.00" arrivalSpeed="15.95" duration="140.00" routeLength="1997.01" waitingTime="0.00" waitingCount="0" stopTime="0.00" timeLoss="15.38" rerouteNo="1" devices="tripinfo_car_w2e_88 routing_car_w2e_88" vType="Car" speedFactor="1.16" vaporized=""/>
    <tripinfo id="bus_w2s_59" depart="59.00" departLane="w2sep_1" departPos="12.10" departPosLat="0.00" departSpeed="13.90" departDelay="0.00" arrival="232.00" arrivalLane="c2s_1" arrivalPos="990.00" arrivalPosLat="0.00" arrivalSpeed="13.90" duration="173.00" routeLength="1978.19" waitingTime="8.00" waitingCount="1" stopTime="0.00" timeLoss="29.32" rerouteNo="1" devices="tripinfo_bus_w2s_59 routing_bus_w2s_59" vType="Bus" speedFactor="1.00" vaporized=""/>
    <tripinfo id="car_w2n_96" depart="96.00" departLane="w2sep_1" departPos="3.60" departPosLat="0.00" departSpeed="13.90" departDelay="0.00" arrival="236.00" arrivalLane="c2n_1" arrivalPos="990.00" arrivalPosLat="0.00" arrivalSpeed="15.12" duration="140.00" routeLength="1996.47" waitingTime="0.00" waitingCount="0" stopTime="0.00" timeLoss="7.10" rerouteNo="1" devices="tripinfo_car_w2n_96 routing_car_w2n_96" vType="Car" speedFactor="1.09" vaporized=""/>
    <tripinfo id="car_w2e_93" depart="93.00" departLane="w2sep_1" departPos="3.60" departPosLat="0.00" departSpeed="13.90" departDelay="0.00" arrival="237.00" arrivalLane="c2e_1" arrivalPos="990.00" arrivalPosLat="0.00" arrivalSpeed="14.15" duration="144.00" routeLength="1997.01" waitingTime="0.00" waitingCount="0" stopTime="0.00" timeLoss="2.05" rerouteNo="1" devices="tripinfo_car_w2e_93 routing_car_w2e_93" vType="Car" speedFactor="1.02" vaporized=""/>
    <tripinfo id="car_e2s_35" depart="35.00" departLane="e2sep_1" departPos="3.60" departPosLat="0.00" departSpeed="13.90" departDelay="0.00" arrival="240.00" arrivalLane="c2s_1" arrivalPos="990.00" arrivalPosLat="0.00" arrivalSpeed="13.90" duration="205.00" routeLength="1996.47" waitingTime="45.00" waitingCount="2" stopTime="0.00" timeLoss="60.62" rerouteNo="1" devices="tripinfo_car_e2s_35 routing_car_e2s_35" vType="Car" speedFactor="1.00" vaporized=""/>
    <tripinfo id="car_e2s_42" depart="42.00" departLane="e2sep_1" departPos="3.60" departPosLat="0.00" departSpeed="13.90" departDelay="0.00" arrival="242.00" arrivalLane="c2s_1" arrivalPos="990.00" arrivalPosLat="0.00" arrivalSpeed="15.45" duration="200.00" routeLength="1996.47" waitingTime="43.00" waitingCount="2" stopTime="0.00" timeLoss="75.23" rerouteNo="1" devices="tripinfo_car_e2s_42 routing_car_e2s_42" vType="Car" speedFactor="1.16" vaporized=""/>
    <tripinfo id="car_e2s_44" depart="44.00" departLane="e2sep_1" departPos="3.60" departPosLat="0.00" departSpeed="13.90" departDelay="0.00" arrival="246.00" arrivalLane="c2s_1" arrivalPos="990.00" arrivalPosLat="0.00" arrivalSpeed="14.14" duration="202.00" routeLength="1996.47" waitingTime="38.00" waitingCount="2" stopTime="0.00" timeLoss="59.79" rerouteNo="1" devices="tripinfo_car_e2s_44 routing_car_e2s_44" vType="Car" speedFactor="1.02" vaporized=""/>
    <tripinfo id="car_e2s_71" depart="71.00" departLane="e2sep_1" departPos="3.60" departPosLat="0.00" departSpeed="13.90" departDelay="0.00" arrival="249.00" arrivalLane="c2s_1" arrivalPos="990.00" arrivalPosLat="0.00" arrivalSpeed="14.13" duration="178.00" routeLength="1996.47" waitingTime="20.00" waitingCount="1" stopTime="0.00" timeLoss="36.33" rerouteNo="1" devices="tripinfo_car_e2s_71 routing_car_e2s_71" vType="Car" speedFactor="1.02" vaporized=""/>
    <tripinfo id="car_n2w_52" depart="52.00" departLane="n2sep_1" departPos="3.60" departPosLat="0.00" departSpeed="13.90" departDelay="0.00" arrival="251.00" arrivalLane="c2w_1" arrivalPos="990.00" arrivalPosLat="0.00" arrivalSpeed="14.55" duration="199.00" routeLength="1986.69" waitingTime="51.00" waitingCount="1" stopTime="0.00" timeLoss="61.84" rerouteNo="1" devices="tripinfo_car_n2w_52 routing_car_n2w_52" vType="Car" speedFactor="1.05" vaporized=""/>
    <tripinfo id="car_s2n_58" depart="58.00" departLane="s2sep_1" departPos="3.60" departPosLat="0.00" departSpeed="13.90" departDelay="0.00" arrival="255.00" arrivalLane="c2n_1" arrivalPos="990.00" arrivalPosLat="0.00" arrivalSpeed="13.90" duration="197.00" routeLength="1997.01" waitingTime="43.00" waitingCount="1" stopTime="0.00" timeLoss="52.61" rerouteNo="1" devices="tripinfo_car_s2n_58 routing_car_s2n_58" vType="Car" speedFactor="1.00" vaporized=""/>
    <tripinfo id="car_n2w_81" depart="82.00" departLane="n2sep_1" departPos="3.60" departPosLat="0.00" departSpeed="13.90" departDelay="1.00" arrival="256.00" arrivalLane="c2w_1" arrivalPos="990.00" arrivalPosLat="0.00" arrivalSpeed="15.32" duration="174.00" routeLength="1986.69" waitingTime="27.00" waitingCount="1" stopTime="0.00" timeLoss="43.70" rerouteNo="1" devices="tripinfo_car_n2w_81 routing_car_n2w_81" vType="Car" speedFactor="1.10" vaporized=""/>
    <tripinfo id="car_n2s_68" depart="68.00" departLane="n2sep_1" departPos="3.60" departPosLat="0.00" departSpeed="13.90" departDelay="0.00" arrival="257.00" arrivalLane="c2s_1" arrivalPos="990.00" arrivalPosLat="0.00" arrivalSpeed="13.97" duration="189.00" routeLength="1997.01" waitingTime="34.00" waitingCount="1" stopTime="0.00" timeLoss="45.40" rerouteNo="1" devices="tripinfo_car_n2s_68 routing_car_n2s_68" vType="Car" speedFactor="1.01" vaporized=""/>
    <tripinfo id="bus_s2n_58" depart="61.00" departLane="s2sep_1" departPos="12.10" departPosLat="0.00" departSpeed="13.90" departDelay="3.00" arrival="261.00" arrivalLane="c2n_1" arrivalPos="990.00" arrivalPosLat="0.00" arrivalSpeed="13.88" duration="200.00" routeLength="1988.51" waitingTime="41.00" waitingCount="1" stopTime="0.00" timeLoss="56.21" rerouteNo="1" devices="tripinfo_bus_s2n_58 routing_bus_s2n_58" vType="Bus" speedFactor="1.00" vaporized=""/>
    <tripinfo id="car_n2s_76" depart="76.00" departLane="n2sep_1" departPos="3.60" departPosLat="0.00" departSpeed="13.90" departDelay="0.00" arrival="261.00" arrivalLane="c2s_1" arrivalPos="990.00" arrivalPosLat="0.00" arrivalSpeed="13.89" duration="185.00" routeLength="1997.01" waitingTime="27.00" waitingCount="1" stopTime="0.00" timeLoss="41.08" rerouteNo="1" devices="tripinfo_car_n2s_76 routing_car_n2s_76" vType="Car" speedFactor="1.00" vaporized=""/>
    <tripinfo id="car_s2e_61" depart="63.00" departLane="s2sep_1" departPos="3.60" departPosLat="0.00" departSpeed="13.90" departDelay="2.00" arrival="262.00" arrivalLane="c2e_1" arrivalPos="990.00" arrivalPosLat="0.00" arrivalSpeed="13.90" duration="199.00" routeLength="1986.69" waitingTime="39.00" waitingCount="1" stopTime="0.00" timeLoss="55.19" rerouteNo="1" devices="tripinfo_car_s2e_61 routing_car_s2e_61" vType="Car" speedFactor="1.00" vaporized=""/>
    <tripinfo id="car_s2n_89" depart="89.00" departLane="s2sep_1" departPos="3.60" departPosLat="0.00" departSpeed="13.90" departDelay="0.00" arrival="266.00" arrivalLane="c2n_1" arrivalPos="990.00" arrivalPosLat="0.00" arrivalSpeed="14.32" duration="177.00" routeLength="1997.01" waitingTime="20.00" waitingCount="1" stopTime="0.00" timeLoss="37.28" rerouteNo="1" devices="tripinfo_car_s2n_89 routing_car_s2n_89" vType="Car" speedFactor="1.03" vaporized=""/>
    <tripinfo id="car_s2e_64" depart="67.00" departLane="s2sep_1" departPos="3.60" departPosLat="0.00" departSpeed="13.90" departDelay="3.00" arrival="267.00" arrivalLane="c2e_1" arrivalPos="990.00" arrivalPosLat="0.00" arrivalSpeed="13.90" duration="200.00" routeLength="1986.69" waitingTime="37.00" waitingCount="1" stopTime="0.00" timeLoss="55.93" rerouteNo="1" devices="tripinfo_car_s2e_64 routing_car_s2e_64" vType="Car" speedFactor="1.00" vaporized=""/>
    <tripinfo id="car_s2n_108" depart="109.00" departLane="s2sep_1" departPos="3.60" departPosLat="0.00" departSpeed="13.90" departDelay="1.00" arrival="268.00" arrivalLane="c2n_1" arrivalPos="990.00" arrivalPosLat="0.00" arrivalSpeed="15.65" duration="159.00" routeLength="1997.01" waitingTime="1.00" waitingCount="1" stopTime="0.00" timeLoss="35.75" rerouteNo="1" devices="tripinfo_car_s2n_108 routing_car_s2n_108" vType="Car" speedFactor="1.17" vaporized=""/>
    <tripinfo id="bus_n2w_92" depart="92.00" departLane="n2sep_1" departPos="12.10" departPosLat="0.00" departSpeed="13.90" departDelay="0.00" arrival="269.00" arrivalLane="c2w_1" arrivalPos="990.00" arrivalPosLat="0.00" arrivalSpeed="13.90" duration="177.00" routeLength="1978.19" waitingTime="16.00" waitingCount="1" stopTime="0.00" timeLoss="33.07" rerouteNo="1" devices="tripinfo_bus_n2w_92 routing_bus_n2w_92" vType="Bus" speedFactor="1.00" vaporized=""/>
    <tripinfo id="car_s2e_105" depart="107.00" departLane="s2sep_1" departPos="3.60" departPosLat="0.00" departSpeed="13.90" departDelay="2.00" arrival="272.00" arrivalLane="c2e_1" arrivalPos="990.00" arrivalPosLat="0.00" arrivalSpeed="13.90" duration="165.00" routeLength="1986.69" waitingTime="1.00" waitingCount="1" stopTime="0.00" timeLoss="20.45" rerouteNo="1" devices="tripinfo_car_s2e_105 routing_car_s2e_105" vType="Car" speedFactor="1.00" vaporized=""/>
    <tripinfo id="car_n2w_106" depart="106.00" departLane="n2sep_1" departPos="3.60" departPosLat="0.00" departSpeed="13.90" departDelay="0.00" arrival="274.00" arrivalLane="c2w_1" arrivalPos="990.00" arrivalPosLat="0.00" arrivalSpeed="13.90" duration="168.00" routeLength="1986.69" waitingTime="2.00" waitingCount="1" stopTime="0.00" timeLoss="23.36" rerouteNo="1" devices="tripinfo_car_n2w_106 routing_car_n2w_106" vType="Car" speedFactor="1.00" vaporized=""/>
    <tripinfo id="car_s2w_68" depart="69.00" departLane="s2sep_1" departPos="3.60" departPosLat="0.00" departSpeed="13.90" departDelay="1.00" arrival="275.00" arrivalLane="c2w_1" arrivalPos="990.00" arrivalPosLat="0.00" arrivalSpeed="14.86" duration="206.00" routeLength="1996.47" waitingTime="52.00" waitingCount="2" stopTime="0.00" timeLoss="82.88" rerouteNo="1" devices="tripinfo_car_s2w_68 routing_car_s2w_68" vType="Car" speedFactor="1.17" vaporized=""/>
    <tripinfo id="car_n2e_69" depart="70.00" departLane="n2sep_1" departPos="3.60" departPosLat="0.00" departSpeed="13.90" departDelay="1.00" arrival="276.00" arrivalLane="c2e_1" arrivalPos="990.00" arrivalPosLat="0.00" arrivalSpeed="13.89" duration="206.00" routeLength="1996.47" waitingTime="44.00" waitingCount="2" stopTime="0.00" timeLoss="61.46" rerouteNo="1" devices="tripinfo_car_n2e_69 routing_car_n2e_69" vType="Car" speedFactor="1.00" vaporized=""/>
    <tripinfo id="car_n2w_139" depart="139.00" departLane="n2sep_1" departPos="3.60" departPosLat="0.00" departSpeed="13.90" departDelay="0.00" arrival="278.00" arrivalLane="c2w_1" arrivalPos="990.00" arrivalPosLat="0.00" arrivalSpeed="15.33" duration="139.00" routeLength="1986.69" waitingTime="0.00" waitingCount="0" stopTime="0.00" timeLoss="9.66" rerouteNo="1" devices="tripinfo_car_n2w_139 routing_car_n2w_139" vType="Car" speedFactor="1.12" vaporized=""/>
    <tripinfo id="car_s2e_143" depart="143.00" departLane="s2sep_1" departPos="3.60" departPosLat="0.00" departSpeed="13.90" departDelay="0.00" arrival="278.00" arrivalLane="c2e_1" arrivalPos="990.00" arrivalPosLat="0.00" arrivalSpeed="15.58" duration="135.00" routeLength="1986.69" waitingTime="0.00" waitingCount="0" stopTime="0.00" timeLoss="12.54" rerouteNo="1" devices="tripinfo_car_s2e_143 routing_car_s2e_143" vType="Car" speedFactor="1.18" vaporized=""/>
    <tripinfo id="car_s2e_144" depart="145.00" departLane="s2sep_1" departPos="3.60" departPosLat="0.00" departSpeed="13.90" departDelay="1.00" arrival="280.00" arrivalLane="c2e_1" arrivalPos="990.00" arrivalPosLat="0.00" arrivalSpeed="15.56" duration="135.00" routeLength="1986.69" waitingTime="0.00" waitingCount="0" stopTime="0.00" timeLoss="10.28" rerouteNo="1" devices="tripinfo_car_s2e_144 routing_car_s2e_144" vType="Car" speedFactor="1.15" vaporized=""/>
    <tripinfo id="car_s2w_94" depart="94.00" departLane="s2sep_1" departPos="3.60" departPosLat="0.00" departSpeed="13.90" departDelay="0.00" arrival="282.00" arrivalLane="c2w_1" arrivalPos="990.00" arrivalPosLat="0.00" arrivalSpeed="14.49" duration="188.00" routeLength="1996.47" waitingTime="24.00" waitingCount="3" stopTime="0.00" timeLoss="49.34" rerouteNo="1" devices="tripinfo_car_s2w_94 routing_car_s2w_94" vType="Car" speedFactor="1.04" vaporized=""/>
    <tripinfo id="car_s2w_105" depart="105.00" departLane="s2sep_1" departPos="3.60" departPosLat="0.00" departSpeed="13.90" departDelay="0.00" arrival="288.00" arrivalLane="c2w_1" arrivalPos="990.00" arrivalPosLat="0.00" arrivalSpeed="13.90" duration="183.00" routeLength="1996.47" waitingTime="13.00" waitingCount="2" stopTime="0.00" timeLoss="38.23" rerouteNo="1" devices="tripinfo_car_s2w_105 routing_car_s2w_105" vType="Car" speedFactor="1.00" vaporized=""/>
    <tripinfo id="bus_n2e_80" depart="80.00" departLane="n2sep_1" departPos="12.10" departPosLat="0.00" departSpeed="13.90" departDelay="0.00" arrival="292.00" arrivalLane="c2e_1" arrivalPos="990.00" arrivalPosLat="0.00" arrivalSpeed="13.90" duration="212.00" routeLength="1987.97" waitingTime="41.00" waitingCount="3" stopTime="0.00" timeLoss="67.79" rerouteNo="1" devices="tripinfo_bus_n2e_80 routing_bus_n2e_80" vType="Bus" speedFactor="1.00" vaporized=""/>
    <tripinfo id="car_n2e_110" depart="110.00" departLane="n2sep_1" departPos="3.60" departPosLat="0.00" departSpeed="13.90" departDelay="0.00" arrival="296.00" arrivalLane="c2e_1" arrivalPos="990.00" arrivalPosLat="0.00" arrivalSpeed="14.12" duration="186.00" routeLength="1996.47" waitingTime="18.00" waitingCount="2" stopTime="0.00" timeLoss="43.77" rerouteNo="1" devices="tripinfo_car_n2e_110 routing_car_n2e_110" vType="Car" speedFactor="1.02" vaporized=""/>
    <tripinfo id="car_e2n_94" depart="95.00" departLane="e2sep_1" departPos="3.60" departPosLat="0.00" departSpeed="13.90" departDelay="1.00" arrival="297.00" arrivalLane="c2n_1" arrivalPos="990.00" arrivalPosLat="0.00" arrivalSpeed="14.42" duration="202.00" routeLength="1986.69" waitingTime="54.00" waitingCount="1" stopTime="0.00" timeLoss="63.20" rerouteNo="1" devices="tripinfo_car_e2n_94 routing_car_e2n_94" vType="Car" speedFactor="1.04" vaporized=""/>
    <tripinfo id="car_n2e_122" depart="122.00" departLane="n2sep_1" departPos="3.60" departPosLat="0.00" departSpeed="13.90" departDelay="0.00" arrival="298.00" arrivalLane="c2e_1" arrivalPos="990.00" arrivalPosLat="0.00" arrivalSpeed="15.31" duration="176.00" routeLength="1996.47" waitingTime="17.00" waitingCount="2" stopTime="0.00" timeLoss="49.35" rerouteNo="1" devices="tripinfo_car_n2e_122 routing_car_n2e_122" vType="Car" speedFactor="1.14" vaporized=""/>
    <tripinfo id="car_w2e_113" depart="113.00" departLane="w2sep_1" departPos="3.60" departPosLat="0.00" departSpeed="13.90" departDelay="0.00" arrival="302.00" arrivalLane="c2e_1" arrivalPos="990.00" arrivalPosLat="0.00" arrivalSpeed="13.93" duration="189.00" routeLength="1997.01" waitingTime="33.00" waitingCount="1" stopTime="0.00" timeLoss="45.24" rerouteNo="1" devices="tripinfo_car_w2e_113 routing_car_w2e_113" vType="Car" speedFactor="1.00" vaporized=""/>
    <tripinfo id="car_e2n_101" depart="101.00" departLane="e2sep_1" departPos="3.60" departPosLat="0.00" departSpeed="13.90" departDelay="0.00" arrival="303.00" arrivalLane="c2n_1" arrivalPos="990.00" arrivalPosLat="0.00" arrivalSpeed="14.04" duration="202.00" routeLength="1986.69" waitingTime="46.00" waitingCount="1" stopTime="0.00" timeLoss="59.11" rerouteNo="1" devices="tripinfo_car_e2n_101 routing_car_e2n_101" vType="Car" speedFactor="1.01" vaporized=""/>
    <tripinfo id="car_e2s_140" depart="140.00" departLane="e2sep_1" departPos="3.60" departPosLat="0.00" departSpeed="13.90" departDelay="0.00" arrival="304.00" arrivalLane="c2s_1" arrivalPos="990.00" arrivalPosLat="0.00" arrivalSpeed="14.12" duration="164.00" routeLength="1996.47" waitingTime="7.00" waitingCount="1" stopTime="0.00" timeLoss="21.35" rerouteNo="1" devices="tripinfo_car_e2s_140 routing_car_e2s_140" vType="Car" speedFactor="1.02" vaporized=""/>
    <tripinfo id="car_w2e_159" depart="159.00" departLane="w2sep_1" departPos="3.60" departPosLat="0.00" departSpeed="13.90" departDelay="0.00" arrival="305.00" arrivalLane="c2e_1" arrivalPos="990.00" arrivalPosLat="0.00" arrivalSpeed="14.37" duration="146.00" routeLength="1997.01" waitingTime="0.00" waitingCount="0" stopTime="0.00" timeLoss="6.96" rerouteNo="1" devices="tripinfo_car_w2e_159 routing_car_w2e_159" vType="Car" speedFactor="1.04" vaporized=""/>
    <tripinfo id="car_e2n_105" depart="105.00" departLane="e2sep_1" departPos="3.60" departPosLat="0.00" departSpeed="13.90" departDelay="0.00" arrival="307.00" arrivalLane="c2n_1" arrivalPos="990.00" arrivalPosLat="0.00" arrivalSpeed="13.89" duration="202.00" routeLength="1986.69" waitingTime="43.00" waitingCount="1" stopTime="0.00" timeLoss="58.20" rerouteNo="1" devices="tripinfo_car_e2n_105 routing_car_e2n_105" vType="Car" speedFactor="1.00" vaporized=""/>
    <tripinfo id="car_w2e_165" depart="165.00" departLane="w2sep_1" departPos="3.60" departPosLat="0.00" departSpeed="13.90" departDelay="0.00" arrival="308.00" arrivalLane="c2e_1" arrivalPos="990.00" arrivalPosLat="0.00" arrivalSpeed="14.18" duration="143.00" routeLength="1997.01" waitingTime="0.00" waitingCount="0" stopTime="0.00" timeLoss="2.42" rerouteNo="1" devices="tripinfo_car_w2e_165 routing_car_w2e_165" vType="Car" speedFactor="1.02" vaporized=""/>
    <tripinfo id="car_e2n_111" depart="111.00" departLane="e2sep_1" departPos="3.60" departPosLat="0.00" departSpeed="13.90" departDelay="0.00" arrival="309.00" arrivalLane="c2n_1" arrivalPos="990.00" arrivalPosLat="0.00" arrivalSpeed="14.84" duration="198.00" routeLength="1986.69" waitingTime="42.00" waitingCount="1" stopTime="0.00" timeLoss="66.92" rerouteNo="1" devices="tripinfo_car_e2n_111 routing_car_e2n_111" vType="Car" speedFactor="1.10" vaporized=""/>
    <tripinfo id="car_e2w_129" depart="129.00" departLane="e2sep_1" departPos="3.60" departPosLat="0.00" departSpeed="13.90" departDelay="0.00" arrival="309.00" arrivalLane="c2w_1" arrivalPos="990.00" arrivalPosLat="0.00" arrivalSpeed="14.23" duration="180.00" routeLength="1997.01" waitingTime="24.00" waitingCount="1" stopTime="0.00" timeLoss="38.97" rerouteNo="1" devices="tripinfo_car_e2w_129 routing_car_e2w_129" vType="Car" speedFactor="1.02" vaporized=""/>
    <tripinfo id="car_e2w_132" depart="132.00" departLane="e2sep_1" departPos="3.60" departPosLat="0.00" departSpeed="13.90" departDelay="0.00" arrival="311.00" arrivalLane="c2w_1" arrivalPos="990.00" arrivalPosLat="0.00" arrivalSpeed="15.33" duration="179.00" routeLength="1997.01" waitingTime="23.00" waitingCount="1" stopTime="0.00" timeLoss="51.61" rerouteNo="1" devices="tripinfo_car_e2w_132 routing_car_e2w_132" vType="Car" speedFactor="1.13" vaporized=""/>
    <tripinfo id="car_w2e_182" depart="182.00" departLane="w2sep_1" departPos="3.60" departPosLat="0.00" departSpeed="13.90" departDelay="0.00" arrival="314.00" arrivalLane="c2e_1" arrivalPos="990.00" arrivalPosLat="0.00" arrivalSpeed="15.32" duration="132.00" routeLength="1997.01" waitingTime="0.00" waitingCount="0" stopTime="0.00" timeLoss="0.84" rerouteNo="1" devices="tripinfo_car_w2e_182 routing_car_w2e_182" vType="Car" speedFactor="1.10" vaporized=""/>
    <tripinfo id="car_e2n_149" depart="149.00" departLane="e2sep_1" departPos="3.60" departPosLat="0.00" departSpeed="13.90" departDelay="0.00" arrival="315.00" arrivalLane="c2n_1" arrivalPos="990.00" arrivalPosLat="0.00" arrivalSpeed="13.97" duration="166.00" routeLength="1986.69" waitingTime="6.00" waitingCount="1" stopTime="0.00" timeLoss="23.12" rerouteNo="1" devices="tripinfo_car_e2n_149 routing_car_e2n_149" vType="Car" speedFactor="1.01" vaporized=""/>
    <tripinfo id="car_e2n_176" depart="176.00" departLane="e2sep_1" departPos="3.60" departPosLat="0.00" departSpeed="13.90" departDelay="0.00" arrival="317.00" arrivalLane="c2n_1" arrivalPos="990.00" arrivalPosLat="0.00" arrivalSpeed="15.64" duration="141.00" routeLength="1986.69" waitingTime="0.00" waitingCount="0" stopTime="0.00" timeLoss="19.11" rerouteNo="1" devices="tripinfo_car_e2n_176 routing_car_e2n_176" vType="Car" speedFactor="1.18" vaporized=""/>
    <tripinfo id="car_w2n_117" depart="117.00" departLane="w2sep_1" departPos="3.60" departPosLat="0.00" departSpeed="13.90" departDelay="0.00" arrival="322.00" arrivalLane="c2n_1" arrivalPos="990.00" arrivalPosLat="0.00" arrivalSpeed="13.90" duration="205.00" routeLength="1996.47" waitingTime="44.00" waitingCount="2" stopTime="0.00" timeLoss="60.61" rerouteNo="1" devices="tripinfo_car_w2n_117 routing_car_w2n_117" vType="Car" speedFactor="1.00" vaporized=""/>
    <tripinfo id="car_w2e_184" depart="184.00" departLane="w2sep_1" departPos="3.60" departPosLat="0.00" departSpeed="13.90" departDelay="0.00" arrival="325.00" arrivalLane="c2e_1" arrivalPos="990.00" arrivalPosLat="0.00" arrivalSpeed="14.38" duration="141.00" routeLength="1997.01" waitingTime="0.00" waitingCount="0" stopTime="0.00" timeLoss="1.39" rerouteNo="1" devices="tripinfo_car_w2e_184 routing_car_w2e_184" vType="Car" speedFactor="1.03" vaporized=""/>
    <tripinfo id="car_e2n_177" depart="178.00" departLane="e2sep_1" departPos="3.60" departPosLat="0.00" departSpeed="13.90" departDelay="1.00" arrival="326.00" arrivalLane="c2n_1" arrivalPos="990.00" arrivalPosLat="0.00" arrivalSpeed="14.33" duration="148.00" routeLength="1986.69" waitingTime="0.00" waitingCount="0" stopTime="0.00" timeLoss="8.00" rerouteNo="1" devices="tripinfo_car_e2n_177 routing_car_e2n_177" vType="Car" speedFactor="1.03" vaporized=""/>
    <tripinfo id="car_w2n_120" depart="120.00" departLane="w2sep_1" departPos="3.60" departPosLat="0.00" departSpeed="13.90" departDelay="0.00" arrival="330.00" arrivalLane="c2n_1" arrivalPos="990.00" arrivalPosLat="0.00" arrivalSpeed="13.89" duration="210.00" routeLength="1996.47" waitingTime="40.00" waitingCount="2" stopTime="0.00" timeLoss="65.04" rerouteNo="1" devices="tripinfo_car_w2n_120 routing_car_w2n_120" vType="Car" speedFactor="1.00" vaporized=""/>
    <tripinfo id="car_w2n_134" depart="134.00" departLane="w2sep_1" departPos="3.60" departPosLat="0.00" departSpeed="13.90" departDelay="0.00" arrival="332.00" arrivalLane="c2n_1" arrivalPos="990.00" arrivalPosLat="0.00" arrivalSpeed="14.71" duration="198.00" routeLength="1996.47" waitingTime="34.00" waitingCount="2" stopTime="0.00" timeLoss="64.25" rerouteNo="1" devices="tripinfo_car_w2n_134 routing_car_w2n_134" vType="Car" speedFactor="1.08" vaporized=""/>
    <tripinfo id="car_w2n_166" depart="167.00" departLane="w2sep_1" departPos="3.60" departPosLat="0.00" departSpeed="13.90" departDelay="1.00" arrival="336.00" arrivalLane="c2n_1" arrivalPos="990.00" arrivalPosLat="0.00" arrivalSpeed="13.89" duration="169.00" routeLength="1996.47" waitingTime="4.00" waitingCount="1" stopTime="0.00" timeLoss="24.47" rerouteNo="1" devices="tripinfo_car_w2n_166 routing_car_w2n_166" vType="Car" speedFactor="1.00" vaporized=""/>
    <tripinfo id="car_w2n_167" depart="169.00" departLane="w2sep_1" departPos="3.60" departPosLat="0.00" departSpeed="13.90" departDelay="2.00" arrival="340.00" arrivalLane="c2n_1" arrivalPos="990.00" arrivalPosLat="0.00" arrivalSpeed="13.88" duration="171.00" routeLength="1996.47" waitingTime="2.00" waitingCount="1" stopTime="0.00" timeLoss="26.05" rerouteNo="1" devices="tripinfo_car_w2n_167 routing_car_w2n_167" vType="Car" speedFactor="1.00" vaporized=""/>
    <tripinfo id="car_w2n_202" depart="202.00" departLane="w2sep_1" departPos="3.60" departPosLat="0.00" departSpeed="13.90" departDelay="0.00" arrival="342.00" arrivalLane="c2n_1" arrivalPos="990.00" arrivalPosLat="0.00" arrivalSpeed="15.28" duration="140.00" routeLength="1996.47" waitingTime="0.00" waitingCount="0" stopTime="0.00" timeLoss="13.67" rerouteNo="1" devices="tripinfo_car_w2n_202 routing_car_w2n_202" vType="Car" speedFactor="1.15" vaporized=""/>
    <tripinfo id="car_s2n_156" depart="156.00" departLane="s2sep_1" departPos="3.60" departPosLat="0.00" departSpeed="13.90" departDelay="0.00" arrival="343.00" arrivalLane="c2n_1" arrivalPos="990.00" arrivalPosLat="0.00" arrivalSpeed="14.99" duration="187.00" routeLength="1997.01" waitingTime="43.00" waitingCount="1" stopTime="0.00" timeLoss="64.39" rerouteNo="1" devices="tripinfo_car_s2n_156 routing_car_s2n_156" vType="Car" speedFactor="1.17" vaporized=""/>
    <tripinfo id="car_n2w_143" depart="143.00" departLane="n2sep_1" departPos="3.60" departPosLat="0.00" departSpeed="13.90" departDelay="0.00" arrival="344.00" arrivalLane="c2w_1" arrivalPos="990.00" arrivalPosLat="0.00" arrivalSpeed="13.90" duration="201.00" routeLength="1986.69" waitingTime="48.00" waitingCount="1" stopTime="0.00" timeLoss="57.51" rerouteNo="1" devices="tripinfo_car_n2w_143 routing_car_n2w_143" vType="Car" speedFactor="1.00" vaporized=""/>
    <tripinfo id="bus_s2e_148" depart="148.00" departLane="s2sep_1" departPos="12.10" departPosLat="0.00" departSpeed="13.90" departDelay="0.00" arrival="348.00" arrivalLane="c2e_1" arrivalPos="990.00" arrivalPosLat="0.00" arrivalSpeed="13.90" duration="200.00" routeLength="1978.19" waitingTime="43.00" waitingCount="1" stopTime="0.00" timeLoss="56.60" rerouteNo="1" devices="tripinfo_bus_s2e_148 routing_bus_s2e_148" vType="Bus" speedFactor="1.00" vaporized=""/>
    <tripinfo id="car_n2w_166" depart="166.00" departLane="n2sep_1" departPos="3.60" departPosLat="0.00" departSpeed="13.90" departDelay="0.00" arrival="348.00" arrivalLane="c2w_1" arrivalPos="990.00" arrivalPosLat="0.00" arrivalSpeed="14.16" duration="182.00" routeLength="1986.69" waitingTime="27.00" waitingCount="1" stopTime="0.00" timeLoss="40.90" rerouteNo="1" devices="tripinfo_car_n2w_166 routing_car_n2w_166" vType="Car" speedFactor="1.02" vaporized=""/>
    <tripinfo id="car_s2n_166" depart="166.00" departLane="s2sep_1" departPos="3.60" departPosLat="0.00" departSpeed="13.90" departDelay="0.00" arrival="349.00" arrivalLane="c2n_1" arrivalPos="990.00" arrivalPosLat="0.00" arrivalSpeed="14.67" duration="183.00" routeLength="1997.01" waitingTime="32.00" waitingCount="1" stopTime="0.00" timeLoss="46.10" rerouteNo="1" devices="tripinfo_car_s2n_166 routing_car_s2n_166" vType="Car" speedFactor="1.06" vaporized=""/>
    <tripinfo id="car_n2s_199" depart="199.00" departLane="n2sep_1" departPos="3.60" departPosLat="0.00" departSpeed="13.90" departDelay="0.00" arrival="350.00" arrivalLane="c2s_1" arrivalPos="990.00" arrivalPosLat="0.00" arrivalSpeed="14.32" duration="151.00" routeLength="1997.01" waitingTime="0.00" waitingCount="0" stopTime="0.00" timeLoss="11.35" rerouteNo="1" devices="tripinfo_car_n2s_199 routing_car_n2s_199" vType="Car" speedFactor="1.03" vaporized=""/>
    <tripinfo id="car_s2n_183" depart="183.00" departLane="s2sep_1" departPos="3.60" departPosLat="0.00" departSpeed="13.90" departDelay="0.00" arrival="352.00" arrivalLane="c2n_1" arrivalPos="990.00" arrivalPosLat="0.00" arrivalSpeed="15.04" duration="169.00" routeLength="1997.01" waitingTime="18.00" waitingCount="1" stopTime="0.00" timeLoss="36.06" rerouteNo="1" devices="tripinfo_car_s2n_183 routing_car_s2n_183" vType="Car" speedFactor="1.09" vaporized=""/>
    <tripinfo id="car_n2w_196" depart="196.00" departLane="n2sep_1" departPos="3.60" departPosLat="0.00" departSpeed="13.90" departDelay="0.00" arrival="352.00" arrivalLane="c2w_1" arrivalPos="990.00" arrivalPosLat="0.00" arrivalSpeed="14.12" duration="156.00" routeLength="1986.69" waitingTime="0.00" waitingCount="0" stopTime="0.00" timeLoss="14.17" rerouteNo="1" devices="tripinfo_car_n2w_196 routing_car_n2w_196" vType="Car" speedFactor="1.02" vaporized=""/>
    <tripinfo id="car_n2e_159" depart="159.00" departLane="n2sep_1" departPos="3.60" departPosLat="0.00" departSpeed="13.90" departDelay="0.00" arrival="355.00" arrivalLane="c2e_1" arrivalPos="990.00" arrivalPosLat="0.00" arrivalSpeed="14.21" duration="196.00" routeLength="1996.47" waitingTime="38.00" waitingCount="2" stopTime="0.00" timeLoss="54.43" rerouteNo="1" devices="tripinfo_car_n2e_159 routing_car_n2e_159" vType="Car" speedFactor="1.02" vaporized=""/>
    <tripinfo id="car_n2s_203" depart="203.00" departLane="n2sep_1" departPos="3.60" departPosLat="0.00" departSpeed="13.90" departDelay="0.00" arrival="356.00" arrivalLane="c2s_1" arrivalPos="990.00" arrivalPosLat="0.00" arrivalSpeed="13.90" duration="153.00" routeLength="1997.01" waitingTime="0.00" waitingCount="0" stopTime="0.00" timeLoss="8.81" rerouteNo="1" devices="tripinfo_car_n2s_203 routing_car_n2s_203" vType="Car" speedFactor="1.00" vaporized=""/>
    <tripinfo id="car_s2w_205" depart="205.00" departLane="s2sep_1" departPos="3.60" departPosLat="0.00" departSpeed="13.90" departDelay="0.00" arrival="357.00" arrivalLane="c2w_1" arrivalPos="990.00" arrivalPosLat="0.00" arrivalSpeed="13.92" duration="152.00" routeLength="1996.47" waitingTime="0.00" waitingCount="0" stopTime="0.00" timeLoss="7.97" rerouteNo="1" devices="tripinfo_car_s2w_205 routing_car_s2w_205" vType="Car" speedFactor="1.00" vaporized=""/>
    <tripinfo id="car_n2e_182" depart="182.00" departLane="n2sep_1" departPos="3.60" departPosLat="0.00" departSpeed="13.90" departDelay="0.00" arrival="360.00" arrivalLane="c2e_1" arrivalPos="990.00" arrivalPosLat="0.00" arrivalSpeed="14.00" duration="178.00" routeLength="1996.47" waitingTime="15.00" waitingCount="2" stopTime="0.00" timeLoss="34.09" rerouteNo="1" devices="tripinfo_car_n2e_182 routing_car_n2e_182" vType="Car" speedFactor="1.01" vaporized=""/>
    <tripinfo id="car_n2s_235" depart="235.00" departLane="n2sep_1" departPos="3.60" departPosLat="0.00" departSpeed="13.90" departDelay="0.00" arrival="364.00" arrivalLane="c2s_1" arrivalPos="990.00" arrivalPosLat="0.00" arrivalSpeed="15.59" duration="129.00" routeLength="1997.01" waitingTime="0.00" waitingCount="0" stopTime="0.00" timeLoss="0.53" rerouteNo="1" devices="tripinfo_car_n2s_235 routing_car_n2s_235" vType="Car" speedFactor="1.12" vaporized=""/>
    <tripinfo id="car_s2n_232" depart="232.00" departLane="s2sep_1" departPos="3.60" departPosLat="0.00" departSpeed="13.90" departDelay="0.00" arrival="365.00" arrivalLane="c2n_1" arrivalPos="990.00" arrivalPosLat="0.00" arrivalSpeed="15.12" duration="133.00" routeLength="1997.01" waitingTime="0.00" waitingCount="0" stopTime="0.00" timeLoss="0.52" rerouteNo="1" devices="tripinfo_car_s2n_232 routing_car_s2n_232" vType="Car" speedFactor="1.09" vaporized=""/>
    <tripinfo id="car_n2e_220" depart="220.00" departLane="n2sep_1" departPos="3.60" departPosLat="0.00" departSpeed="13.90" departDelay="0.00" arrival="366.00" arrivalLane="c2e_1" arrivalPos="990.00" arrivalPosLat="0.00" arrivalSpeed="14.42" duration="146.00" routeLength="1996.47" waitingTime="0.00" waitingCount="0" stopTime="0.00" timeLoss="5.94" rerouteNo="1" devices="tripinfo_car_n2e_220 routing_car_n2e_220" vType="Car" speedFactor="1.04" vaporized=""/>
    <tripinfo id="car_w2s_227" depart="227.00" departLane="w2sep_1" departPos="3.60" departPosLat="0.00" departSpeed="13.90" departDelay="0.00" arrival="384.00" arrivalLane="c2s_1" arrivalPos="990.00" arrivalPosLat="0.00" arrivalSpeed="15.16" duration="157.00" routeLength="1986.69" waitingTime="14.00" waitingCount="1" stopTime="0.00" timeLoss="24.71" rerouteNo="1" devices="tripinfo_car_w2s_227 routing_car_w2s_227" vType="Car" speedFactor="1.09" vaporized=""/>
    <tripinfo id="car_e2n_187" depart="187.00" departLane="e2sep_1" departPos="3.60" departPosLat="0.00" departSpeed="13.90" departDelay="0.00" arrival="389.00" arrivalLane="c2n_1" arrivalPos="990.00" arrivalPosLat="0.00" arrivalSpeed="13.90" duration="202.00" routeLength="1986.69" waitingTime="49.00" waitingCount="1" stopTime="0.00" timeLoss="58.52" rerouteNo="1" devices="tripinfo_car_e2n_187 routing_car_e2n_187" vType="Car" speedFactor="1.00" vaporized=""/>
    <tripinfo id="car_e2w_210" depart="211.00" departLane="e2sep_1" departPos="3.60" departPosLat="0.00" departSpeed="13.90" departDelay="1.00" arrival="391.00" arrivalLane="c2w_1" arrivalPos="990.00" arrivalPosLat="0.00" arrivalSpeed="14.00" duration="180.00" routeLength="1997.01" waitingTime="26.00" waitingCount="1" stopTime="0.00" timeLoss="37.16" rerouteNo="1" devices="tripinfo_car_e2w_210 routing_car_e2w_210" vType="Car" speedFactor="1.01" vaporized=""/>
    <tripinfo id="car_e2n_211" depart="213.00" departLane="e2sep_1" departPos="3.60" departPosLat="0.00" departSpeed="13.90" departDelay="2.00" arrival="395.00" arrivalLane="c2n_1" arrivalPos="990.00" arrivalPosLat="0.00" arrivalSpeed="14.20" duration="182.00" routeLength="1986.69" waitingTime="24.00" waitingCount="1" stopTime="0.00" timeLoss="40.71" rerouteNo="1" devices="tripinfo_car_e2n_211 routing_car_e2n_211" vType="Car" speedFactor="1.02" vaporized=""/>
    <tripinfo id="car_e2w_216" depart="216.00" departLane="e2sep_1" departPos="3.60" departPosLat="0.00" departSpeed="13.90" departDelay="0.00" arrival="397.00" arrivalLane="c2w_1" arrivalPos="990.00" arrivalPosLat="0.00" arrivalSpeed="14.13" duration="181.00" routeLength="1997.01" waitingTime="23.00" waitingCount="1" stopTime="0.00" timeLoss="39.17" rerouteNo="1" devices="tripinfo_car_e2w_216 routing_car_e2w_216" vType="Car" speedFactor="1.02" vaporized=""/>
    <tripinfo id="car_w2s_248" depart="248.00" departLane="w2sep_1" departPos="3.60" departPosLat="0.00" departSpeed="13.90" departDelay="0.00" arrival="397.00" arrivalLane="c2s_1" arrivalPos="990.00" arrivalPosLat="0.00" arrivalSpeed="13.90" duration="149.00" routeLength="1986.69" waitingTime="0.00" waitingCount="0" stopTime="0.00" timeLoss="5.37" rerouteNo="1" devices="tripinfo_car_w2s_248 routing_car_w2s_248" vType="Car" speedFactor="1.00" vaporized=""/>
    <tripinfo id="car_e2w_218" depart="218.00" departLane="e2sep_1" departPos="3.60" departPosLat="0.00" departSpeed="13.90" departDelay="0.00" arrival="399.00" arrivalLane="c2w_1" arrivalPos="990.00" arrivalPosLat="0.00" arrivalSpeed="14.89" duration="181.00" routeLength="1997.01" waitingTime="22.00" waitingCount="1" stopTime="0.00" timeLoss="49.31" rerouteNo="1" devices="tripinfo_car_e2w_218 routing_car_e2w_218" vType="Car" speedFactor="1.09" vaporized=""/>
    <tripinfo id="car_e2s_209" depart="209.00" departLane="e2sep_1" departPos="3.60" departPosLat="0.00" departSpeed="13.90" departDelay="0.00" arrival="400.00" arrivalLane="c2s_1" arrivalPos="990.00" arrivalPosLat="0.00" arrivalSpeed="14.43" duration="191.00" routeLength="1996.47" waitingTime="31.00" waitingCount="2" stopTime="0.00" timeLoss="52.62" rerouteNo="1" devices="tripinfo_car_e2s_209 routing_car_e2s_209" vType="Car" speedFactor="1.04" vaporized=""/>
    <tripinfo id="car_e2w_220" depart="220.00" departLane="e2sep_1" departPos="3.60" departPosLat="0.00" departSpeed="13.90" departDelay="0.00" arrival="403.00" arrivalLane="c2w_1" arrivalPos="990.00" arrivalPosLat="0.00" arrivalSpeed="14.48" duration="183.00" routeLength="1997.01" waitingTime="21.00" waitingCount="1" stopTime="0.00" timeLoss="44.36" rerouteNo="1" devices="tripinfo_car_e2w_220 routing_car_e2w_220" vType="Car" speedFactor="1.04" vaporized=""/>
    <tripinfo id="car_e2s_230" depart="230.00" departLane="e2sep_1" departPos="3.60" departPosLat="0.00" departSpeed="13.90" departDelay="0.00" arrival="403.00" arrivalLane="c2s_1" arrivalPos="990.00" arrivalPosLat="0.00" arrivalSpeed="14.60" duration="173.00" routeLength="1996.47" waitingTime="12.00" waitingCount="2" stopTime="0.00" timeLoss="36.00" rerouteNo="1" devices="tripinfo_car_e2s_230 routing_car_e2s_230" vType="Car" speedFactor="1.06" vaporized=""/>
    <tripinfo id="car_e2n_231" depart="232.00" departLane="e2sep_1" departPos="3.60" departPosLat="0.00" departSpeed="13.90" departDelay="1.00" arrival="404.00" arrivalLane="c2n_1" arrivalPos="990.00" arrivalPosLat="0.00" arrivalSpeed="14.04" duration="172.00" routeLength="1986.69" waitingTime="13.00" waitingCount="1" stopTime="0.00" timeLoss="29.15" rerouteNo="1" devices="tripinfo_car_e2n_231 routing_car_e2n_231" vType="Car" speedFactor="1.01" vaporized=""/>
    <tripinfo id="car_e2w_240" depart="240.00" departLane="e2sep_1" departPos="3.60" departPosLat="0.00" departSpeed="13.90" departDelay="0.00" arrival="405.00" arrivalLane="c2w_1" arrivalPos="990.00" arrivalPosLat="0.00" arrivalSpeed="14.95" duration="165.00" routeLength="1997.01" waitingTime="11.00" waitingCount="1" stopTime="0.00" timeLoss="33.47" rerouteNo="1" devices="tripinfo_car_e2w_240 routing_car_e2w_240" vType="Car" speedFactor="1.10" vaporized=""/>
    <tripinfo id="car_e2s_243" depart="243.00" departLane="e2sep_1" departPos="3.60" departPosLat="0.00" departSpeed="13.90" departDelay="0.00" arrival="407.00" arrivalLane="c2s_1" arrivalPos="990.00" arrivalPosLat="0.00" arrivalSpeed="13.89" duration="164.00" routeLength="1996.47" waitingTime="1.00" waitingCount="1" stopTime="0.00" timeLoss="19.34" rerouteNo="1" devices="tripinfo_car_e2s_243 routing_car_e2s_243" vType="Car" speedFactor="1.00" vaporized=""/>
    <tripinfo id="car_e2w_251" depart="251.00" departLane="e2sep_1" departPos="3.60" departPosLat="0.00" departSpeed="13.90" departDelay="0.00" arrival="410.00" arrivalLane="c2w_1" arrivalPos="990.00" arrivalPosLat="0.00" arrivalSpeed="13.90" duration="159.00" routeLength="1997.01" waitingTime="0.00" waitingCount="0" stopTime="0.00" timeLoss="14.75" rerouteNo="1" devices="tripinfo_car_e2w_251 routing_car_e2w_251" vType="Car" speedFactor="1.00" vaporized=""/>
    <tripinfo id="car_e2s_252" depart="253.00" departLane="e2sep_1" departPos="3.60" departPosLat="0.00" departSpeed="13.90" departDelay="1.00" arrival="410.00" arrivalLane="c2s_1" arrivalPos="990.00" arrivalPosLat="0.00" arrivalSpeed="13.86" duration="157.00" routeLength="1996.47" waitingTime="0.00" waitingCount="0" stopTime="0.00" timeLoss="12.62" rerouteNo="1" devices="tripinfo_car_e2s_252 routing_car_e2s_252" vType="Car" speedFactor="1.00" vaporized=""/>
    <tripinfo id="car_e2n_257" depart="257.00" departLane="e2sep_1" departPos="3.60" departPosLat="0.00" departSpeed="13.90" departDelay="0.00" arrival="412.00" arrivalLane="c2n_1" arrivalPos="990.00" arrivalPosLat="0.00" arrivalSpeed="13.90" duration="155.00" routeLength="1986.69" waitingTime="0.00" waitingCount="0" stopTime="0.00" timeLoss="10.57" rerouteNo="1" devices="tripinfo_car_e2n_257 routing_car_e2n_257" vType="Car" speedFactor="1.00" vaporized=""/>
    <tripinfo id="car_e2s_274" depart="274.00" departLane="e2sep_1" departPos="3.60" departPosLat="0.00" departSpeed="13.90" departDelay="0.00" arrival="413.00" arrivalLane="c2s_1" arrivalPos="990.00" arrivalPosLat="0.00" arrivalSpeed="15.15" duration="139.00" routeLength="1996.47" waitingTime="0.00" waitingCount="0" stopTime="0.00" timeLoss="7.18" rerouteNo="1" devices="tripinfo_car_e2s_274 routing_car_e2s_274" vType="Car" speedFactor="1.10" vaporized=""/>
    <tripinfo id="car_e2n_265" depart="265.00" departLane="e2sep_1" departPos="3.60" departPosLat="0.00" departSpeed="13.90" departDelay="0.00" arrival="415.00" arrivalLane="c2n_1" arrivalPos="990.00" arrivalPosLat="0.00" arrivalSpeed="14.10" duration="150.00" routeLength="1986.69" waitingTime="0.00" waitingCount="0" stopTime="0.00" timeLoss="8.75" rerouteNo="1" devices="tripinfo_car_e2n_265 routing_car_e2n_265" vType="Car" speedFactor="1.02" vaporized=""/>
    <tripinfo id="car_w2n_255" depart="255.00" departLane="w2sep_1" departPos="3.60" departPosLat="0.00" departSpeed="13.90" departDelay="0.00" arrival="418.00" arrivalLane="c2n_1" arrivalPos="990.00" arrivalPosLat="0.00" arrivalSpeed="14.32" duration="163.00" routeLength="1996.47" waitingTime="10.00" waitingCount="1" stopTime="0.00" timeLoss="23.50" rerouteNo="1" devices="tripinfo_car_w2n_255 routing_car_w2n_255" vType="Car" speedFactor="1.03" vaporized=""/>
    <tripinfo id="car_n2s_241" depart="241.00" departLane="n2sep_1" departPos="3.60" departPosLat="0.00" departSpeed="13.90" departDelay="0.00" arrival="431.00" arrivalLane="c2s_1" arrivalPos="990.00" arrivalPosLat="0.00" arrivalSpeed="14.80" duration="190.00" routeLength="1997.01" waitingTime="44.00" waitingCount="1" stopTime="0.00" timeLoss="54.14" rerouteNo="1" devices="tripinfo_car_n2s_241 routing_car_n2s_241" vType="Car" speedFactor="1.07" vaporized=""/>
    <tripinfo id="car_s2n_254" depart="254.00" departLane="s2sep_1" departPos="3.60" departPosLat="0.00" departSpeed="13.90" departDelay="0.00" arrival="434.00" arrivalLane="c2n_1" arrivalPos="990.00" arrivalPosLat="0.00" arrivalSpeed="14.09" duration="180.00" routeLength="1997.01" waitingTime="28.00" waitingCount="1" stopTime="0.00" timeLoss="37.66" rerouteNo="1" devices="tripinfo_car_s2n_254 routing_car_s2n_254" vType="Car" speedFactor="1.01" vaporized=""/>
    <tripinfo id="car_n2s_254" depart="254.00" departLane="n2sep_1" departPos="3.60" departPosLat="0.00" departSpeed="13.90" departDelay="0.00" arrival="435.00" arrivalLane="c2s_1" arrivalPos="990.00" arrivalPosLat="0.00" arrivalSpeed="14.89" duration="181.00" routeLength="1997.01" waitingTime="33.00" waitingCount="1" stopTime="0.00" timeLoss="46.13" rerouteNo="1" devices="tripinfo_car_n2s_254 routing_car_n2s_254" vType="Car" speedFactor="1.07" vaporized=""/>
    <tripinfo id="car_n2w_256" depart="256.00" departLane="n2sep_1" departPos="3.60" departPosLat="0.00" departSpeed="13.90" departDelay="0.00" arrival="436.00" arrivalLane="c2w_1" arrivalPos="990.00" arrivalPosLat="0.00" arrivalSpeed="14.80" duration="180.00" routeLength="1986.69" waitingTime="30.00" waitingCount="1" stopTime="0.00" timeLoss="44.51" rerouteNo="1" devices="tripinfo_car_n2w_256 routing_car_n2w_256" vType="Car" speedFactor="1.06" vaporized=""/>
    <tripinfo id="car_s2n_262" depart="262.00" departLane="s2sep_1" departPos="3.60" departPosLat="0.00" departSpeed="13.90" departDelay="0.00" arrival="436.00" arrivalLane="c2n_1" arrivalPos="990.00" arrivalPosLat="0.00" arrivalSpeed="15.61" duration="174.00" routeLength="1997.01" waitingTime="27.00" waitingCount="1" stopTime="0.00" timeLoss="50.41" rerouteNo="1" devices="tripinfo_car_s2n_262 routing_car_s2n_262" vType="Car" speedFactor="1.17" vaporized=""/>
    <tripinfo id="car_n2s_279" depart="279.00" departLane="n2sep_1" departPos="3.60" departPosLat="0.00" departSpeed="13.90" departDelay="0.00" arrival="438.00" arrivalLane="c2s_1" arrivalPos="990.00" arrivalPosLat="0.00" arrivalSpeed="15.18" duration="159.00" routeLength="1997.01" waitingTime="12.00" waitingCount="1" stopTime="0.00" timeLoss="27.48" rerouteNo="1" devices="tripinfo_car_n2s_279 routing_car_n2s_279" vType="Car" speedFactor="1.10" vaporized=""/>
    <tripinfo id="car_n2w_297" depart="297.00" departLane="n2sep_1" departPos="3.60" departPosLat="0.00" departSpeed="13.90" departDelay="0.00" arrival="441.00" arrivalLane="c2w_1" arrivalPos="990.00" arrivalPosLat="0.00" arrivalSpeed="15.33" duration="144.00" routeLength="1986.69" waitingTime="0.00" waitingCount="0" stopTime="0.00" timeLoss="13.73" rerouteNo="1" devices="tripinfo_car_n2w_297 routing_car_n2w_297" vType="Car" speedFactor="1.10" vaporized=""/>
    <tripinfo id="car_n2s_294" depart="294.00" departLane="n2sep_1" departPos="3.60" departPosLat="0.00" departSpeed="13.90" departDelay="0.00" arrival="445.00" arrivalLane="c2s_1" arrivalPos="990.00" arrivalPosLat="0.00" arrivalSpeed="13.90" duration="151.00" routeLength="1997.01" waitingTime="0.00" waitingCount="0" stopTime="0.00" timeLoss="7.24" rerouteNo="1" devices="tripinfo_car_n2s_294 routing_car_n2s_294" vType="Car" speedFactor="1.00" vaporized=""/>
    <tripinfo id="car_s2e_309" depart="309.00" departLane="s2sep_1" departPos="3.60" departPosLat="0.00" departSpeed="13.90" departDelay="0.00" arrival="454.00" arrivalLane="c2e_1" arrivalPos="990.00" arrivalPosLat="0.00" arrivalSpeed="14.35" duration="145.00" routeLength="1986.69" waitingTime="0.00" waitingCount="0" stopTime="0.00" timeLoss="5.33" rerouteNo="1" devices="tripinfo_car_s2e_309 routing_car_s2e_309" vType="Car" speedFactor="1.03" vaporized=""/>
    <tripinfo id="car_n2s_311" depart="311.00" departLane="n2sep_1" departPos="3.60" departPosLat="0.00" departSpeed="13.90" departDelay="0.00" arrival="455.00" arrivalLane="c2s_1" arrivalPos="990.00" arrivalPosLat="0.00" arrivalSpeed="14.02" duration="144.00" routeLength="1997.01" waitingTime="0.00" waitingCount="0" stopTime="0.00" timeLoss="0.58" rerouteNo="1" devices="tripinfo_car_n2s_311 routing_car_n2s_311" vType="Car" speedFactor="1.01" vaporized=""/>
    <tripinfo id="car_n2w_319" depart="319.00" departLane="n2sep_1" departPos="3.60" departPosLat="0.00" departSpeed="13.90" departDelay="0.00" arrival="464.00" arrivalLane="c2w_1" arrivalPos="990.00" arrivalPosLat="0.00" arrivalSpeed="14.35" duration="145.00" routeLength="1986.69" waitingTime="0.00" waitingCount="0" stopTime="0.00" timeLoss="5.56" rerouteNo="1" devices="tripinfo_car_n2w_319 routing_car_n2w_319" vType="Car" speedFactor="1.03" vaporized=""/>
    <tripinfo id="car_w2s_304" depart="304.00" departLane="w2sep_1" departPos="3.60" departPosLat="0.00" departSpeed="13.90" departDelay="0.00" arrival="475.00" arrivalLane="c2s_1" arrivalPos="990.00" arrivalPosLat="0.00" arrivalSpeed="14.75" duration="171.00" routeLength="1986.69" waitingTime="26.00" waitingCount="1" stopTime="0.00" timeLoss="35.78" rerouteNo="1" devices="tripinfo_car_w2s_304 routing_car_w2s_304" vType="Car" speedFactor="1.06" vaporized=""/>
    <tripinfo id="car_e2w_281" depart="281.00" departLane="e2sep_1" departPos="3.60" departPosLat="0.00" departSpeed="13.90" departDelay="0.00" arrival="476.00" arrivalLane="c2w_1" arrivalPos="990.00" arrivalPosLat="0.00" arrivalSpeed="15.23" duration="195.00" routeLength="1997.01" waitingTime="49.00" waitingCount="1" stopTime="0.00" timeLoss="63.23" rerouteNo="1" devices="tripinfo_car_e2w_281 routing_car_e2w_281" vType="Car" speedFactor="1.10" vaporized=""/>
    <tripinfo id="car_w2s_321" depart="321.00" departLane="w2sep_1" departPos="3.60" departPosLat="0.00" departSpeed="13.90" departDelay="0.00" arrival="478.00" arrivalLane="c2s_1" arrivalPos="990.00" arrivalPosLat="0.00" arrivalSpeed="15.78" duration="157.00" routeLength="1986.69" waitingTime="15.00" waitingCount="1" stopTime="0.00" timeLoss="31.33" rerouteNo="1" devices="tripinfo_car_w2s_321 routing_car_w2s_321" vType="Car" speedFactor="1.14" vaporized=""/>
    <tripinfo id="car_e2n_276" depart="276.00" departLane="e2sep_1" departPos="3.60" departPosLat="0.00" departSpeed="13.90" departDelay="0.00" arrival="479.00" arrivalLane="c2n_1" arrivalPos="990.00" arrivalPosLat="0.00" arrivalSpeed="14.03" duration="203.00" routeLength="1986.69" waitingTime="50.00" waitingCount="1" stopTime="0.00" timeLoss="60.16" rerouteNo="1" devices="tripinfo_car_e2n_276 routing_car_e2n_276" vType="Car" speedFactor="1.01" vaporized=""/>
    <tripinfo id="car_e2n_283" depart="283.00" departLane="e2sep_1" departPos="3.60" departPosLat="0.00" departSpeed="13.90" departDelay="0.00" arrival="481.00" arrivalLane="c2n_1" arrivalPos="990.00" arrivalPosLat="0.00" arrivalSpeed="15.66" duration="198.00" routeLength="1986.69" waitingTime="49.00" waitingCount="1" stopTime="0.00" timeLoss="75.33" rerouteNo="1" devices="tripinfo_car_e2n_283 routing_car_e2n_283" vType="Car" speedFactor="1.18" vaporized=""/>
    <tripinfo id="car_e2s_309" depart="309.00" departLane="e2sep_1" departPos="3.60" departPosLat="0.00" departSpeed="13.90" departDelay="0.00" arrival="481.00" arrivalLane="c2s_1" arrivalPos="990.00" arrivalPosLat="0.00" arrivalSpeed="15.93" duration="172.00" routeLength="1996.47" waitingTime="25.00" waitingCount="1" stopTime="0.00" timeLoss="46.78" rerouteNo="1" devices="tripinfo_car_e2s_309 routing_car_e2s_309" vType="Car" speedFactor="1.15" vaporized=""/>
    <tripinfo id="car_w2e_310" depart="310.00" departLane="w2sep_1" departPos="3.60" departPosLat="0.00" departSpeed="13.90" departDelay="0.00" arrival="482.00" arrivalLane="c2e_1" arrivalPos="990.00" arrivalPosLat="0.00" arrivalSpeed="13.90" duration="172.00" routeLength="1997.01" waitingTime="17.00" waitingCount="1" stopTime="0.00" timeLoss="27.65" rerouteNo="1" devices="tripinfo_car_w2e_310 routing_car_w2e_310" vType="Car" speedFactor="1.00" vaporized=""/>
    <tripinfo id="car_e2s_319" depart="319.00" departLane="e2sep_1" departPos="3.60" departPosLat="0.00" departSpeed="13.90" departDelay="0.00" arrival="487.00" arrivalLane="c2s_1" arrivalPos="990.00" arrivalPosLat="0.00" arrivalSpeed="14.85" duration="168.00" routeLength="1996.47" waitingTime="12.00" waitingCount="1" stopTime="0.00" timeLoss="32.37" rerouteNo="1" devices="tripinfo_car_e2s_319 routing_car_e2s_319" vType="Car" speedFactor="1.07" vaporized=""/>
    <tripinfo id="car_e2n_286" depart="286.00" departLane="e2sep_1" departPos="3.60" departPosLat="0.00" departSpeed="13.90" departDelay="0.00" arrival="488.00" arrivalLane="c2n_1" arrivalPos="990.00" arrivalPosLat="0.00" arrivalSpeed="13.96" duration="202.00" routeLength="1986.69" waitingTime="44.00" waitingCount="1" stopTime="0.00" timeLoss="59.10" rerouteNo="1" devices="tripinfo_car_e2n_286 routing_car_e2n_286" vType="Car" speedFactor="1.00" vaporized=""/>
    <tripinfo id="car_e2w_289" depart="289.00" departLane="e2sep_1" departPos="3.60" departPosLat="0.00" departSpeed="13.90" departDelay="0.00" arrival="490.00" arrivalLane="c2w_1" arrivalPos="990.00" arrivalPosLat="0.00" arrivalSpeed="13.94" duration="201.00" routeLength="1997.01" waitingTime="41.00" waitingCount="1" stopTime="0.00" timeLoss="57.58" rerouteNo="1" devices="tripinfo_car_e2w_289 routing_car_e2w_289" vType="Car" speedFactor="1.00" vaporized=""/>
    <tripinfo id="car_e2n_290" depart="291.00" departLane="e2sep_1" departPos="3.60" departPosLat="0.00" departSpeed="13.90" departDelay="1.00" arrival="491.00" arrivalLane="c2n_1" arrivalPos="990.00" arrivalPosLat="0.00" arrivalSpeed="14.79" duration="200.00" routeLength="1986.69" waitingTime="40.00" waitingCount="1" stopTime="0.00" timeLoss="65.66" rerouteNo="1" devices="tripinfo_car_e2n_290 routing_car_e2n_290" vType="Car" speedFactor="1.07" vaporized=""/>
    <tripinfo id="amb_w2e_390" depart="390.00" departLane="w2sep_1" departPos="6.60" departPosLat="0.00" departSpeed="13.90" departDelay="0.00" arrival="491.00" arrivalLane="c2e_1" arrivalPos="990.00" arrivalPosLat="0.00" arrivalSpeed="20.85" duration="101.00" routeLength="1994.01" waitingTime="0.00" waitingCount="0" stopTime="0.00" timeLoss="4.83" rerouteNo="1" devices="tripinfo_amb_w2e_390 routing_amb_w2e_390 bluelight_amb_w2e_390" vType="Ambulance" speedFactor="1.50" vaporized="">
        <bluelight/>
    </tripinfo>
    <tripinfo id="car_e2s_333" depart="333.00" departLane="e2sep_1" departPos="3.60" departPosLat="0.00" departSpeed="13.90" departDelay="0.00" arrival="493.00" arrivalLane="c2s_1" arrivalPos="990.00" arrivalPosLat="0.00" arrivalSpeed="14.11" duration="160.00" routeLength="1996.47" waitingTime="0.00" waitingCount="0" stopTime="0.00" timeLoss="16.97" rerouteNo="1" devices="tripinfo_car_e2s_333 routing_car_e2s_333" vType="Car" speedFactor="1.02" vaporized=""/>
    <tripinfo id="car_e2w_298" depart="298.00" departLane="e2sep_1" departPos="3.60" departPosLat="0.00" departSpeed="13.90" departDelay="0.00" arrival="494.00" arrivalLane="c2w_1" arrivalPos="990.00" arrivalPosLat="0.00" arrivalSpeed="14.32" duration="196.00" routeLength="1997.01" waitingTime="38.00" waitingCount="1" stopTime="0.00" timeLoss="56.71" rerouteNo="1" devices="tripinfo_car_e2w_298 routing_car_e2w_298" vType="Car" speedFactor="1.03" vaporized=""/>
    <tripinfo id="car_e2n_331" depart="331.00" departLane="e2sep_1" departPos="3.60" departPosLat="0.00" departSpeed="13.90" departDelay="0.00" arrival="494.00" arrivalLane="c2n_1" arrivalPos="990.00" arrivalPosLat="0.00" arrivalSpeed="15.48" duration="163.00" routeLength="1986.69" waitingTime="13.00" waitingCount="1" stopTime="0.00" timeLoss="34.53" rerouteNo="1" devices="tripinfo_car_e2n_331 routing_car_e2n_331" vType="Car" speedFactor="1.12" vaporized=""/>
    <tripinfo id="car_e2w_299" depart="300.00" departLane="e2sep_1" departPos="3.60" departPosLat="0.00" departSpeed="13.90" departDelay="1.00" arrival="498.00" arrivalLane="c2w_1" arrivalPos="990.00" arrivalPosLat="0.00" arrivalSpeed="14.21" duration="198.00" routeLength="1997.01" waitingTime="35.00" waitingCount="1" stopTime="0.00" timeLoss="57.53" rerouteNo="1" devices="tripinfo_car_e2w_299 routing_car_e2w_299" vType="Car" speedFactor="1.02" vaporized=""/>
    <tripinfo id="car_w2n_311" depart="312.00" departLane="w2sep_1" departPos="3.60" departPosLat="0.00" departSpeed="13.90" departDelay="1.00" arrival="498.00" arrivalLane="c2n_1" arrivalPos="990.00" arrivalPosLat="0.00" arrivalSpeed="15.52" duration="186.00" routeLength="1996.47" waitingTime="35.00" waitingCount="2" stopTime="0.00" timeLoss="56.26" rerouteNo="1" devices="tripinfo_car_w2n_311 routing_car_w2n_311" vType="Car" speedFactor="1.12" vaporized=""/>
    <tripinfo id="car_w2n_328" depart="328.00" departLane="w2sep_1" departPos="3.60" departPosLat="0.00" departSpeed="13.90" departDelay="0.00" arrival="500.00" arrivalLane="c2n_1" arrivalPos="990.00" arrivalPosLat="0.00" arrivalSpeed="16.48" duration="172.00" routeLength="1996.47" waitingTime="25.00" waitingCount="2" stopTime="0.00" timeLoss="53.51" rerouteNo="1" devices="tripinfo_car_w2n_328 routing_car_w2n_328" vType="Car" speedFactor="1.23" vaporized=""/>
    <tripinfo id="car_w2s_351" depart="351.00" departLane="w2sep_1" departPos="3.60" departPosLat="0.00" departSpeed="13.90" departDelay="0.00" arrival="501.00" arrivalLane="c2s_1" arrivalPos="990.00" arrivalPosLat="0.00" arrivalSpeed="13.90" duration="150.00" routeLength="1986.69" waitingTime="0.00" waitingCount="0" stopTime="0.00" timeLoss="5.64" rerouteNo="1" devices="tripinfo_car_w2s_351 routing_car_w2s_351" vType="Car" speedFactor="1.00" vaporized=""/>
    <tripinfo id="car_e2s_344" depart="344.00" departLane="e2sep_1" departPos="3.60" departPosLat="0.00" departSpeed="13.90" departDelay="0.00" arrival="503.00" arrivalLane="c2s_1" arrivalPos="990.00" arrivalPosLat="0.00" arrivalSpeed="15.50" duration="159.00" routeLength="1996.47" waitingTime="1.00" waitingCount="1" stopTime="0.00" timeLoss="34.25" rerouteNo="1" devices="tripinfo_car_e2s_344 routing_car_e2s_344" vType="Car" speedFactor="1.16" vaporized=""/>
    <tripinfo id="car_w2s_374" depart="374.00" departLane="w2sep_1" departPos="3.60" departPosLat="0.00" departSpeed="13.90" departDelay="0.00" arrival="506.00" arrivalLane="c2s_1" arrivalPos="990.00" arrivalPosLat="0.00" arrivalSpeed="15.76" duration="132.00" routeLength="1986.69" waitingTime="0.00" waitingCount="0" stopTime="0.00" timeLoss="5.45" rerouteNo="1" devices="tripinfo_car_w2s_374 routing_car_w2s_374" vType="Car" speedFactor="1.14" vaporized=""/>
    <tripinfo id="bus_e2s_379" depart="379.00" departLane="e2sep_1" departPos="12.10" departPosLat="0.00" departSpeed="13.90" departDelay="0.00" arrival="529.00" arrivalLane="c2s_1" arrivalPos="990.00" arrivalPosLat="0.00" arrivalSpeed="13.90" duration="150.00" routeLength="1987.97" waitingTime="0.00" waitingCount="0" stopTime="0.00" timeLoss="6.00" rerouteNo="1" devices="tripinfo_bus_e2s_379 routing_bus_e2s_379" vType="Bus" speedFactor="1.00" vaporized=""/>
    <tripinfo id="car_s2e_352" depart="352.00" departLane="s2sep_1" departPos="3.60" departPosLat="0.00" departSpeed="13.90" departDelay="0.00" arrival="530.00" arrivalLane="c2e_1" arrivalPos="990.00" arrivalPosLat="0.00" arrivalSpeed="15.69" duration="178.00" routeLength="1986.69" waitingTime="39.00" waitingCount="1" stopTime="0.00" timeLoss="49.97" rerouteNo="1" devices="tripinfo_car_s2e_352 routing_car_s2e_352" vType="Car" speedFactor="1.13" vaporized=""/>
    <tripinfo id="car_s2n_375" depart="375.00" departLane="s2sep_1" departPos="3.60" departPosLat="0.00" departSpeed="13.90" departDelay="0.00" arrival="532.00" arrivalLane="c2n_1" arrivalPos="990.00" arrivalPosLat="0.00" arrivalSpeed="15.56" duration="157.00" routeLength="1997.01" waitingTime="17.00" waitingCount="1" stopTime="0.00" timeLoss="28.52" rerouteNo="1" devices="tripinfo_car_s2n_375 routing_car_s2n_375" vType="Car" speedFactor="1.12" vaporized=""/>
    <tripinfo id="car_n2s_323" depart="323.00" departLane="n2sep_1" departPos="3.60" departPosLat="0.00" departSpeed="13.90" departDelay="0.00" arrival="536.00" arrivalLane="c2s_1" arrivalPos="990.00" arrivalPosLat="0.00" arrivalSpeed="14.42" duration="213.00" routeLength="1997.01" waitingTime="62.00" waitingCount="1" stopTime="0.00" timeLoss="73.77" rerouteNo="1" devices="tripinfo_car_n2s_323 routing_car_n2s_323" vType="Car" speedFactor="1.04" vaporized=""/>
    <tripinfo id="car_n2s_328" depart="328.00" departLane="n2sep_1" departPos="3.60" departPosLat="0.00" departSpeed="13.90" departDelay="0.00" arrival="541.00" arrivalLane="c2s_1" arrivalPos="990.00" arrivalPosLat="0.00" arrivalSpeed="14.06" duration="213.00" routeLength="1997.01" waitingTime="58.00" waitingCount="1" stopTime="0.00" timeLoss="70.38" rerouteNo="1" devices="tripinfo_car_n2s_328 routing_car_n2s_328" vType="Car" speedFactor="1.01" vaporized=""/>
    <tripinfo id="car_n2w_340" depart="340.00" departLane="n2sep_1" departPos="3.60" departPosLat="0.00" departSpeed="13.90" departDelay="0.00" arrival="542.00" arrivalLane="c2w_1" arrivalPos="990.00" arrivalPosLat="0.00" arrivalSpeed="14.23" duration="202.00" routeLength="1986.69" waitingTime="48.00" waitingCount="1" stopTime="0.00" timeLoss="60.68" rerouteNo="1" devices="tripinfo_car_n2w_340 routing_car_n2w_340" vType="Car" speedFactor="1.02" vaporized=""/>
    <tripinfo id="car_n2e_335" depart="335.00" departLane="n2sep_1" departPos="3.60" departPosLat="0.00" departSpeed="13.90" departDelay="0.00" arrival="543.00" arrivalLane="c2e_1" arrivalPos="990.00" arrivalPosLat="0.00" arrivalSpeed="13.95" duration="208.00" routeLength="1996.47" waitingTime="49.00" waitingCount="1" stopTime="0.00" timeLoss="63.63" rerouteNo="1" devices="tripinfo_car_n2e_335 routing_car_n2e_335" vType="Car" speedFactor="1.00" vaporized=""/>
    <tripinfo id="car_n2e_342" depart="342.00" departLane="n2sep_1" departPos="3.60" departPosLat="0.00" departSpeed="13.90" departDelay="0.00" arrival="545.00" arrivalLane="c2e_1" arrivalPos="990.00" arrivalPosLat="0.00" arrivalSpeed="15.08" duration="203.00" routeLength="1996.47" waitingTime="48.00" waitingCount="1" stopTime="0.00" timeLoss="73.03" rerouteNo="1" devices="tripinfo_car_n2e_342 routing_car_n2e_342" vType="Car" speedFactor="1.11" vaporized=""/>
    <tripinfo id="car_n2e_399" depart="399.00" departLane="n2sep_1" departPos="3.60" departPosLat="0.00" departSpeed="13.90" departDelay="0.00" arrival="550.00" arrivalLane="c2e_1" arrivalPos="990.00" arrivalPosLat="0.00" arrivalSpeed="13.96" duration="151.00" routeLength="1996.47" waitingTime="0.00" waitingCount="0" stopTime="0.00" timeLoss="6.60" rerouteNo="1" devices="tripinfo_car_n2e_399 routing_car_n2e_399" vType="Car" speedFactor="1.00" vaporized=""/>
    <tripinfo id="car_n2w_401" depart="401.00" departLane="n2sep_1" departPos="3.60" departPosLat="0.00" departSpeed="13.90" departDelay="0.00" arrival="551.00" arrivalLane="c2w_1" arrivalPos="990.00" arrivalPosLat="0.00" arrivalSpeed="13.90" duration="150.00" routeLength="1986.69" waitingTime="0.00" waitingCount="0" stopTime="0.00" timeLoss="5.45" rerouteNo="1" devices="tripinfo_car_n2w_401 routing_car_n2w_401" vType="Car" speedFactor="1.00" vaporized=""/>
    <tripinfo id="car_s2e_417" depart="417.00" departLane="s2sep_1" departPos="3.60" departPosLat="0.00" departSpeed="13.90" departDelay="0.00" arrival="552.00" arrivalLane="c2e_1" arrivalPos="990.00" arrivalPosLat="0.00" arrivalSpeed="15.46" duration="135.00" routeLength="1986.69" waitingTime="0.00" waitingCount="0" stopTime="0.00" timeLoss="8.74" rerouteNo="1" devices="tripinfo_car_s2e_417 routing_car_s2e_417" vType="Car" speedFactor="1.14" vaporized=""/>
    <tripinfo id="car_s2w_365" depart="365.00" departLane="s2sep_1" departPos="3.60" departPosLat="0.00" departSpeed="13.90" departDelay="0.00" arrival="553.00" arrivalLane="c2w_1" arrivalPos="990.00" arrivalPosLat="0.00" arrivalSpeed="14.76" duration="188.00" routeLength="1996.47" waitingTime="32.00" waitingCount="2" stopTime="0.00" timeLoss="54.31" rerouteNo="1" devices="tripinfo_car_s2w_365 routing_car_s2w_365" vType="Car" speedFactor="1.08" vaporized=""/>
    <tripinfo id="car_s2n_425" depart="425.00" departLane="s2sep_1" departPos="3.60" departPosLat="0.00" departSpeed="13.90" departDelay="0.00" arrival="554.00" arrivalLane="c2n_1" arrivalPos="990.00" arrivalPosLat="0.00" arrivalSpeed="15.66" duration="129.00" routeLength="1997.01" waitingTime="0.00" waitingCount="0" stopTime="0.00" timeLoss="0.87" rerouteNo="1" devices="tripinfo_car_s2n_425 routing_car_s2n_425" vType="Car" speedFactor="1.13" vaporized=""/>
    <tripinfo id="car_s2w_408" depart="408.00" departLane="s2sep_1" departPos="3.60" departPosLat="0.00" departSpeed="13.90" departDelay="0.00" arrival="555.00" arrivalLane="c2w_1" arrivalPos="990.00" arrivalPosLat="0.00" arrivalSpeed="15.18" duration="147.00" routeLength="1996.47" waitingTime="0.00" waitingCount="0" stopTime="0.00" timeLoss="18.14" rerouteNo="1" devices="tripinfo_car_s2w_408 routing_car_s2w_408" vType="Car" speedFactor="1.12" vaporized=""/>
</tripinfos>
