%!PS-Adobe-3.0 EPSF-3.0
%%Creator: (MATLAB, The Mathworks, Inc. Version 9.9.0.1524771 \(R2020b\) Update 2. Operating System: Linux)
%%Title: ../pictures/visualize_cost/D.eps
%%CreationDate: 2021-02-09T17:52:27
%%Pages: (atend)
%%BoundingBox:    20     1   557   282
%%LanguageLevel: 3
%%EndComments
%%BeginProlog
%%BeginResource: procset (Apache XML Graphics Std ProcSet) 1.2 0
%%Version: 1.2 0
%%Copyright: (Copyright 2001-2003,2010 The Apache Software Foundation. License terms: http://www.apache.org/licenses/LICENSE-2.0)
/bd{bind def}bind def
/ld{load def}bd
/GR/grestore ld
/GS/gsave ld
/RM/rmoveto ld
/C/curveto ld
/t/show ld
/L/lineto ld
/ML/setmiterlimit ld
/CT/concat ld
/f/fill ld
/N/newpath ld
/S/stroke ld
/CC/setcmykcolor ld
/A/ashow ld
/cp/closepath ld
/RC/setrgbcolor ld
/LJ/setlinejoin ld
/GC/setgray ld
/LW/setlinewidth ld
/M/moveto ld
/re {4 2 roll M
1 index 0 rlineto
0 exch rlineto
neg 0 rlineto
cp } bd
/_ctm matrix def
/_tm matrix def
/BT { _ctm currentmatrix pop matrix _tm copy pop 0 0 moveto } bd
/ET { _ctm setmatrix } bd
/iTm { _ctm setmatrix _tm concat } bd
/Tm { _tm astore pop iTm 0 0 moveto } bd
/ux 0.0 def
/uy 0.0 def
/F {
  /Tp exch def
  /Tf exch def
  Tf findfont Tp scalefont setfont
  /cf Tf def  /cs Tp def
} bd
/ULS {currentpoint /uy exch def /ux exch def} bd
/ULE {
  /Tcx currentpoint pop def
  gsave
  newpath
  cf findfont cs scalefont dup
  /FontMatrix get 0 get /Ts exch def /FontInfo get dup
  /UnderlinePosition get Ts mul /To exch def
  /UnderlineThickness get Ts mul /Tt exch def
  ux uy To add moveto  Tcx uy To add lineto
  Tt setlinewidth stroke
  grestore
} bd
/OLE {
  /Tcx currentpoint pop def
  gsave
  newpath
  cf findfont cs scalefont dup
  /FontMatrix get 0 get /Ts exch def /FontInfo get dup
  /UnderlinePosition get Ts mul /To exch def
  /UnderlineThickness get Ts mul /Tt exch def
  ux uy To add cs add moveto Tcx uy To add cs add lineto
  Tt setlinewidth stroke
  grestore
} bd
/SOE {
  /Tcx currentpoint pop def
  gsave
  newpath
  cf findfont cs scalefont dup
  /FontMatrix get 0 get /Ts exch def /FontInfo get dup
  /UnderlinePosition get Ts mul /To exch def
  /UnderlineThickness get Ts mul /Tt exch def
  ux uy To add cs 10 mul 26 idiv add moveto Tcx uy To add cs 10 mul 26 idiv add lineto
  Tt setlinewidth stroke
  grestore
} bd
/QT {
/Y22 exch store
/X22 exch store
/Y21 exch store
/X21 exch store
currentpoint
/Y21 load 2 mul add 3 div exch
/X21 load 2 mul add 3 div exch
/X21 load 2 mul /X22 load add 3 div
/Y21 load 2 mul /Y22 load add 3 div
/X22 load /Y22 load curveto
} bd
/SSPD {
dup length /d exch dict def
{
/v exch def
/k exch def
currentpagedevice k known {
/cpdv currentpagedevice k get def
v cpdv ne {
/upd false def
/nullv v type /nulltype eq def
/nullcpdv cpdv type /nulltype eq def
nullv nullcpdv or
{
/upd true def
} {
/sametype v type cpdv type eq def
sametype {
v type /arraytype eq {
/vlen v length def
/cpdvlen cpdv length def
vlen cpdvlen eq {
0 1 vlen 1 sub {
/i exch def
/obj v i get def
/cpdobj cpdv i get def
obj cpdobj ne {
/upd true def
exit
} if
} for
} {
/upd true def
} ifelse
} {
v type /dicttype eq {
v {
/dv exch def
/dk exch def
/cpddv cpdv dk get def
dv cpddv ne {
/upd true def
exit
} if
} forall
} {
/upd true def
} ifelse
} ifelse
} if
} ifelse
upd true eq {
d k v put
} if
} if
} if
} forall
d length 0 gt {
d setpagedevice
} if
} bd
/RE { % /NewFontName [NewEncodingArray] /FontName RE -
  findfont dup length dict begin
  {
    1 index /FID ne
    {def} {pop pop} ifelse
  } forall
  /Encoding exch def
  /FontName 1 index def
  currentdict definefont pop
  end
} bind def
%%EndResource
%%BeginResource: procset (Apache XML Graphics EPS ProcSet) 1.0 0
%%Version: 1.0 0
%%Copyright: (Copyright 2002-2003 The Apache Software Foundation. License terms: http://www.apache.org/licenses/LICENSE-2.0)
/BeginEPSF { %def
/b4_Inc_state save def         % Save state for cleanup
/dict_count countdictstack def % Count objects on dict stack
/op_count count 1 sub def      % Count objects on operand stack
userdict begin                 % Push userdict on dict stack
/showpage { } def              % Redefine showpage, { } = null proc
0 setgray 0 setlinecap         % Prepare graphics state
1 setlinewidth 0 setlinejoin
10 setmiterlimit [ ] 0 setdash newpath
/languagelevel where           % If level not equal to 1 then
{pop languagelevel             % set strokeadjust and
1 ne                           % overprint to their defaults.
{false setstrokeadjust false setoverprint
} if
} if
} bd
/EndEPSF { %def
count op_count sub {pop} repeat            % Clean up stacks
countdictstack dict_count sub {end} repeat
b4_Inc_state restore
} bd
%%EndResource
%FOPBeginFontDict
%%IncludeResource: font Courier-Oblique
%%IncludeResource: font Courier-BoldOblique
%%IncludeResource: font Courier-Bold
%%IncludeResource: font ZapfDingbats
%%IncludeResource: font Symbol
%%IncludeResource: font Helvetica
%%IncludeResource: font Helvetica-Oblique
%%IncludeResource: font Helvetica-Bold
%%IncludeResource: font Helvetica-BoldOblique
%%IncludeResource: font Times-Roman
%%IncludeResource: font Times-Italic
%%IncludeResource: font Times-Bold
%%IncludeResource: font Times-BoldItalic
%%IncludeResource: font Courier
%FOPEndFontDict
%%BeginResource: encoding WinAnsiEncoding
/WinAnsiEncoding [
/.notdef /.notdef /.notdef /.notdef /.notdef
/.notdef /.notdef /.notdef /.notdef /.notdef
/.notdef /.notdef /.notdef /.notdef /.notdef
/.notdef /.notdef /.notdef /.notdef /.notdef
/.notdef /.notdef /.notdef /.notdef /.notdef
/.notdef /.notdef /.notdef /.notdef /.notdef
/.notdef /.notdef /space /exclam /quotedbl
/numbersign /dollar /percent /ampersand /quotesingle
/parenleft /parenright /asterisk /plus /comma
/hyphen /period /slash /zero /one
/two /three /four /five /six
/seven /eight /nine /colon /semicolon
/less /equal /greater /question /at
/A /B /C /D /E
/F /G /H /I /J
/K /L /M /N /O
/P /Q /R /S /T
/U /V /W /X /Y
/Z /bracketleft /backslash /bracketright /asciicircum
/underscore /quoteleft /a /b /c
/d /e /f /g /h
/i /j /k /l /m
/n /o /p /q /r
/s /t /u /v /w
/x /y /z /braceleft /bar
/braceright /asciitilde /bullet /Euro /bullet
/quotesinglbase /florin /quotedblbase /ellipsis /dagger
/daggerdbl /circumflex /perthousand /Scaron /guilsinglleft
/OE /bullet /Zcaron /bullet /bullet
/quoteleft /quoteright /quotedblleft /quotedblright /bullet
/endash /emdash /asciitilde /trademark /scaron
/guilsinglright /oe /bullet /zcaron /Ydieresis
/space /exclamdown /cent /sterling /currency
/yen /brokenbar /section /dieresis /copyright
/ordfeminine /guillemotleft /logicalnot /sfthyphen /registered
/macron /degree /plusminus /twosuperior /threesuperior
/acute /mu /paragraph /middot /cedilla
/onesuperior /ordmasculine /guillemotright /onequarter /onehalf
/threequarters /questiondown /Agrave /Aacute /Acircumflex
/Atilde /Adieresis /Aring /AE /Ccedilla
/Egrave /Eacute /Ecircumflex /Edieresis /Igrave
/Iacute /Icircumflex /Idieresis /Eth /Ntilde
/Ograve /Oacute /Ocircumflex /Otilde /Odieresis
/multiply /Oslash /Ugrave /Uacute /Ucircumflex
/Udieresis /Yacute /Thorn /germandbls /agrave
/aacute /acircumflex /atilde /adieresis /aring
/ae /ccedilla /egrave /eacute /ecircumflex
/edieresis /igrave /iacute /icircumflex /idieresis
/eth /ntilde /ograve /oacute /ocircumflex
/otilde /odieresis /divide /oslash /ugrave
/uacute /ucircumflex /udieresis /yacute /thorn
/ydieresis
] def
%%EndResource
%FOPBeginFontReencode
/Courier-Oblique findfont
dup length dict begin
  {1 index /FID ne {def} {pop pop} ifelse} forall
  /Encoding WinAnsiEncoding def
  currentdict
end
/Courier-Oblique exch definefont pop
/Courier-BoldOblique findfont
dup length dict begin
  {1 index /FID ne {def} {pop pop} ifelse} forall
  /Encoding WinAnsiEncoding def
  currentdict
end
/Courier-BoldOblique exch definefont pop
/Courier-Bold findfont
dup length dict begin
  {1 index /FID ne {def} {pop pop} ifelse} forall
  /Encoding WinAnsiEncoding def
  currentdict
end
/Courier-Bold exch definefont pop
/Helvetica findfont
dup length dict begin
  {1 index /FID ne {def} {pop pop} ifelse} forall
  /Encoding WinAnsiEncoding def
  currentdict
end
/Helvetica exch definefont pop
/Helvetica-Oblique findfont
dup length dict begin
  {1 index /FID ne {def} {pop pop} ifelse} forall
  /Encoding WinAnsiEncoding def
  currentdict
end
/Helvetica-Oblique exch definefont pop
/Helvetica-Bold findfont
dup length dict begin
  {1 index /FID ne {def} {pop pop} ifelse} forall
  /Encoding WinAnsiEncoding def
  currentdict
end
/Helvetica-Bold exch definefont pop
/Helvetica-BoldOblique findfont
dup length dict begin
  {1 index /FID ne {def} {pop pop} ifelse} forall
  /Encoding WinAnsiEncoding def
  currentdict
end
/Helvetica-BoldOblique exch definefont pop
/Times-Roman findfont
dup length dict begin
  {1 index /FID ne {def} {pop pop} ifelse} forall
  /Encoding WinAnsiEncoding def
  currentdict
end
/Times-Roman exch definefont pop
/Times-Italic findfont
dup length dict begin
  {1 index /FID ne {def} {pop pop} ifelse} forall
  /Encoding WinAnsiEncoding def
  currentdict
end
/Times-Italic exch definefont pop
/Times-Bold findfont
dup length dict begin
  {1 index /FID ne {def} {pop pop} ifelse} forall
  /Encoding WinAnsiEncoding def
  currentdict
end
/Times-Bold exch definefont pop
/Times-BoldItalic findfont
dup length dict begin
  {1 index /FID ne {def} {pop pop} ifelse} forall
  /Encoding WinAnsiEncoding def
  currentdict
end
/Times-BoldItalic exch definefont pop
/Courier findfont
dup length dict begin
  {1 index /FID ne {def} {pop pop} ifelse} forall
  /Encoding WinAnsiEncoding def
  currentdict
end
/Courier exch definefont pop
%FOPEndFontReencode
%%EndProlog
%%Page: 1 1
%%PageBoundingBox: 0 0 600 300
%%BeginPageSetup
[1 0 0 -1 0 300] CT
%%EndPageSetup
GS
[0.75 0 0 0.75 0 0] CT
1 GC
N
0 0 800 400 re
f
GR
GS
[0.75 0 0 0.75 0 0] CT
1 GC
N
0 0 800 400 re
f
GR
GS
[0.75 0 0 0.75 0 0] CT
1 GC
N
80 352 M
557 352 L
557 30 L
80 30 L
cp
f
GR
GS
[0.75 0 0 0.75 0 0] CT
0.873 GC
1 LJ
0.667 LW
N
80 352 M
80 30 L
S
GR
GS
[0.75 0 0 0.75 0 0] CT
0.873 GC
1 LJ
0.667 LW
N
170.931 352 M
170.931 30 L
S
GR
GS
[0.75 0 0 0.75 0 0] CT
0.873 GC
1 LJ
0.667 LW
N
261.863 352 M
261.863 30 L
S
GR
GS
[0.75 0 0 0.75 0 0] CT
0.873 GC
1 LJ
0.667 LW
N
352.794 352 M
352.794 30 L
S
GR
GS
[0.75 0 0 0.75 0 0] CT
0.873 GC
1 LJ
0.667 LW
N
443.725 352 M
443.725 30 L
S
GR
GS
[0.75 0 0 0.75 0 0] CT
0.873 GC
1 LJ
0.667 LW
N
534.657 352 M
534.657 30 L
S
GR
GS
[0.75 0 0 0.75 0 0] CT
0.873 GC
1 LJ
0.667 LW
N
557 352 M
80 352 L
S
GR
GS
[0.75 0 0 0.75 0 0] CT
0.873 GC
1 LJ
0.667 LW
N
557 316.222 M
80 316.222 L
S
GR
GS
[0.75 0 0 0.75 0 0] CT
0.873 GC
1 LJ
0.667 LW
N
557 280.444 M
80 280.444 L
S
GR
GS
[0.75 0 0 0.75 0 0] CT
0.873 GC
1 LJ
0.667 LW
N
557 244.667 M
80 244.667 L
S
GR
GS
[0.75 0 0 0.75 0 0] CT
0.873 GC
1 LJ
0.667 LW
N
557 208.889 M
80 208.889 L
S
GR
GS
[0.75 0 0 0.75 0 0] CT
0.873 GC
1 LJ
0.667 LW
N
557 173.111 M
80 173.111 L
S
GR
GS
[0.75 0 0 0.75 0 0] CT
0.873 GC
1 LJ
0.667 LW
N
557 137.333 M
80 137.333 L
S
GR
GS
[0.75 0 0 0.75 0 0] CT
0.873 GC
1 LJ
0.667 LW
N
557 101.556 M
80 101.556 L
S
GR
GS
[0.75 0 0 0.75 0 0] CT
0.873 GC
1 LJ
0.667 LW
N
557 65.778 M
80 65.778 L
S
GR
GS
[0.75 0 0 0.75 0 0] CT
0.873 GC
1 LJ
0.667 LW
N
557 30 M
80 30 L
S
GR
GS
[0.75 0 0 0.75 0 0] CT
0.149 GC
2 setlinecap
1 LJ
0.667 LW
N
80 352 M
557 352 L
S
GR
GS
[0.75 0 0 0.75 0 0] CT
0.149 GC
2 setlinecap
1 LJ
0.667 LW
N
80 352 M
80 347.23 L
S
GR
GS
[0.75 0 0 0.75 0 0] CT
0.149 GC
2 setlinecap
1 LJ
0.667 LW
N
170.931 352 M
170.931 347.23 L
S
GR
GS
[0.75 0 0 0.75 0 0] CT
0.149 GC
2 setlinecap
1 LJ
0.667 LW
N
261.863 352 M
261.863 347.23 L
S
GR
GS
[0.75 0 0 0.75 0 0] CT
0.149 GC
2 setlinecap
1 LJ
0.667 LW
N
352.794 352 M
352.794 347.23 L
S
GR
GS
[0.75 0 0 0.75 0 0] CT
0.149 GC
2 setlinecap
1 LJ
0.667 LW
N
443.725 352 M
443.725 347.23 L
S
GR
GS
[0.75 0 0 0.75 0 0] CT
0.149 GC
2 setlinecap
1 LJ
0.667 LW
N
534.657 352 M
534.657 347.23 L
S
GR
GS
[0.75 0 0 0.75 60 268.00001] CT
0.149 GC
/Helvetica 13.333 F
GS
[1 0 0 1 0 0] CT
-4.5 13 moveto 
1 -1 scale
(0) t 
GR
GR
GS
[0.75 0 0 0.75 128.19852 268.00001] CT
0.149 GC
/Helvetica 13.333 F
GS
[1 0 0 1 0 0] CT
-8.5 13 moveto 
1 -1 scale
(10) t 
GR
GR
GS
[0.75 0 0 0.75 196.39705 268.00001] CT
0.149 GC
/Helvetica 13.333 F
GS
[1 0 0 1 0 0] CT
-8.5 13 moveto 
1 -1 scale
(20) t 
GR
GR
GS
[0.75 0 0 0.75 264.5956 268.00001] CT
0.149 GC
/Helvetica 13.333 F
GS
[1 0 0 1 0 0] CT
-8.5 13 moveto 
1 -1 scale
(30) t 
GR
GR
GS
[0.75 0 0 0.75 332.79412 268.00001] CT
0.149 GC
/Helvetica 13.333 F
GS
[1 0 0 1 0 0] CT
-8.5 13 moveto 
1 -1 scale
(40) t 
GR
GR
GS
[0.75 0 0 0.75 400.99265 268.00001] CT
0.149 GC
/Helvetica 13.333 F
GS
[1 0 0 1 0 0] CT
-8.5 13 moveto 
1 -1 scale
(50) t 
GR
GR
GS
[0.75 0 0 0.75 238.87516 282] CT
0.149 GC
N
-12.62 15.175 M
-12.62 14.878 -12.557 14.628 QT
-11.104 8.878 L
-13.214 8.878 L
-13.417 8.878 -13.417 8.612 QT
-13.339 8.175 -13.151 8.175 QT
-10.932 8.175 L
-10.135 4.909 L
-10.057 4.644 -9.823 4.464 QT
-9.589 4.284 -9.292 4.284 QT
-9.042 4.284 -8.87 4.433 QT
-8.698 4.581 -8.698 4.831 QT
-8.698 4.894 -8.706 4.925 QT
-8.714 4.956 -8.714 5.003 QT
-9.51 8.175 L
-7.464 8.175 L
-7.245 8.175 -7.245 8.441 QT
-7.26 8.487 -7.292 8.605 QT
-7.323 8.722 -7.37 8.8 QT
-7.417 8.878 -7.51 8.878 QT
-9.698 8.878 L
-11.135 14.659 L
-11.276 15.222 -11.276 15.644 QT
-11.276 16.503 -10.682 16.503 QT
-9.807 16.503 -9.128 15.675 QT
-8.448 14.847 -8.089 13.862 QT
-8.01 13.737 -7.932 13.737 QT
-7.698 13.737 L
-7.62 13.737 -7.565 13.792 QT
-7.51 13.847 -7.51 13.925 QT
-7.51 13.956 -7.542 13.972 QT
-7.979 15.191 -8.815 16.105 QT
-9.651 17.019 -10.745 17.019 QT
-11.526 17.019 -12.073 16.503 QT
-12.62 15.987 -12.62 15.175 QT
cp
f
GR
GS
[0.75 0 0 0.75 238.87516 282] CT
0.149 GC
N
-4.273 21.8 M
-4.273 1.8 L
-1.538 1.8 L
-1.538 2.597 L
-3.46 2.597 L
-3.46 21.003 L
-1.538 21.003 L
-1.538 21.8 L
-4.273 21.8 L
cp
f
GR
GS
[0.75 0 0 0.75 238.87516 282] CT
0.149 GC
N
0.658 15.581 M
1.205 16.503 2.814 16.503 QT
3.517 16.503 4.158 16.261 QT
4.799 16.019 5.213 15.542 QT
5.627 15.066 5.627 14.378 QT
5.627 13.862 5.252 13.526 QT
4.877 13.191 4.345 13.081 QT
3.267 12.862 L
2.517 12.675 2.041 12.167 QT
1.564 11.659 1.564 10.941 QT
1.564 10.05 2.049 9.37 QT
2.533 8.691 3.322 8.323 QT
4.111 7.956 4.955 7.956 QT
5.861 7.956 6.58 8.394 QT
7.299 8.831 7.299 9.675 QT
7.299 10.144 7.041 10.495 QT
6.783 10.847 6.33 10.847 QT
6.064 10.847 5.877 10.675 QT
5.689 10.503 5.689 10.237 QT
5.689 10.003 5.814 9.784 QT
5.939 9.566 6.166 9.433 QT
6.392 9.3 6.627 9.3 QT
6.439 8.862 5.955 8.667 QT
5.47 8.472 4.924 8.472 QT
4.408 8.472 3.9 8.683 QT
3.392 8.894 3.088 9.284 QT
2.783 9.675 2.783 10.222 QT
2.783 10.581 3.033 10.855 QT
3.283 11.128 3.658 11.237 QT
4.83 11.472 L
5.377 11.597 5.845 11.894 QT
6.314 12.191 6.58 12.644 QT
6.845 13.097 6.845 13.691 QT
6.845 14.425 6.431 15.151 QT
6.017 15.878 5.408 16.3 QT
4.345 17.019 2.799 17.019 QT
1.736 17.019 0.845 16.534 QT
-0.045 16.05 -0.045 15.081 QT
-0.045 14.534 0.275 14.128 QT
0.595 13.722 1.142 13.722 QT
1.47 13.722 1.689 13.917 QT
1.908 14.112 1.908 14.441 QT
1.908 14.894 1.564 15.237 QT
1.22 15.581 0.767 15.581 QT
0.658 15.581 L
cp
f
GR
GS
[0.75 0 0 0.75 238.87516 282] CT
0.149 GC
N
8.736 21.8 M
8.736 21.003 L
10.689 21.003 L
10.689 2.597 L
8.736 2.597 L
8.736 1.8 L
11.486 1.8 L
11.486 21.8 L
8.736 21.8 L
cp
f
GR
GS
[0.75 0 0 0.75 0 0] CT
0.149 GC
2 setlinecap
1 LJ
0.667 LW
N
80 352 M
80 30 L
S
GR
GS
[0.75 0 0 0.75 0 0] CT
0.149 GC
2 setlinecap
1 LJ
0.667 LW
N
80 352 M
84.77 352 L
S
GR
GS
[0.75 0 0 0.75 0 0] CT
0.149 GC
2 setlinecap
1 LJ
0.667 LW
N
80 316.222 M
84.77 316.222 L
S
GR
GS
[0.75 0 0 0.75 0 0] CT
0.149 GC
2 setlinecap
1 LJ
0.667 LW
N
80 280.444 M
84.77 280.444 L
S
GR
GS
[0.75 0 0 0.75 0 0] CT
0.149 GC
2 setlinecap
1 LJ
0.667 LW
N
80 244.667 M
84.77 244.667 L
S
GR
GS
[0.75 0 0 0.75 0 0] CT
0.149 GC
2 setlinecap
1 LJ
0.667 LW
N
80 208.889 M
84.77 208.889 L
S
GR
GS
[0.75 0 0 0.75 0 0] CT
0.149 GC
2 setlinecap
1 LJ
0.667 LW
N
80 173.111 M
84.77 173.111 L
S
GR
GS
[0.75 0 0 0.75 0 0] CT
0.149 GC
2 setlinecap
1 LJ
0.667 LW
N
80 137.333 M
84.77 137.333 L
S
GR
GS
[0.75 0 0 0.75 0 0] CT
0.149 GC
2 setlinecap
1 LJ
0.667 LW
N
80 101.556 M
84.77 101.556 L
S
GR
GS
[0.75 0 0 0.75 0 0] CT
0.149 GC
2 setlinecap
1 LJ
0.667 LW
N
80 65.778 M
84.77 65.778 L
S
GR
GS
[0.75 0 0 0.75 0 0] CT
0.149 GC
2 setlinecap
1 LJ
0.667 LW
N
80 30 M
84.77 30 L
S
GR
GS
[0.75 0 0 0.75 56 264] CT
0.149 GC
/Helvetica 13.333 F
GS
[1 0 0 1 0 0] CT
-22 4.5 moveto 
1 -1 scale
(0.1) t 
GR
GR
GS
[0.75 0 0 0.75 56 237.16667] CT
0.149 GC
/Helvetica 13.333 F
GS
[1 0 0 1 0 0] CT
-22 4.5 moveto 
1 -1 scale
(0.2) t 
GR
GR
GS
[0.75 0 0 0.75 56 210.33332] CT
0.149 GC
/Helvetica 13.333 F
GS
[1 0 0 1 0 0] CT
-22 4.5 moveto 
1 -1 scale
(0.3) t 
GR
GR
GS
[0.75 0 0 0.75 56 183.5] CT
0.149 GC
/Helvetica 13.333 F
GS
[1 0 0 1 0 0] CT
-22 4.5 moveto 
1 -1 scale
(0.4) t 
GR
GR
GS
[0.75 0 0 0.75 56 156.66666] CT
0.149 GC
/Helvetica 13.333 F
GS
[1 0 0 1 0 0] CT
-22 4.5 moveto 
1 -1 scale
(0.5) t 
GR
GR
GS
[0.75 0 0 0.75 56 129.83332] CT
0.149 GC
/Helvetica 13.333 F
GS
[1 0 0 1 0 0] CT
-22 4.5 moveto 
1 -1 scale
(0.6) t 
GR
GR
GS
[0.75 0 0 0.75 56 103.00001] CT
0.149 GC
/Helvetica 13.333 F
GS
[1 0 0 1 0 0] CT
-22 4.5 moveto 
1 -1 scale
(0.7) t 
GR
GR
GS
[0.75 0 0 0.75 56 76.16666] CT
0.149 GC
/Helvetica 13.333 F
GS
[1 0 0 1 0 0] CT
-22 4.5 moveto 
1 -1 scale
(0.8) t 
GR
GR
GS
[0.75 0 0 0.75 56 49.33334] CT
0.149 GC
/Helvetica 13.333 F
GS
[1 0 0 1 0 0] CT
-22 4.5 moveto 
1 -1 scale
(0.9) t 
GR
GR
GS
[0.75 0 0 0.75 56 22.5] CT
0.149 GC
/Helvetica 13.333 F
GS
[1 0 0 1 0 0] CT
-9 4.5 moveto 
1 -1 scale
(1) t 
GR
GR
GS
[0 -0.75 0.75 0 36.5 143.24989] CT
0.149 GC
N
-4.335 -8.403 M
-4.132 -7.841 -3.608 -7.559 QT
-3.085 -7.278 -2.46 -7.278 QT
-1.835 -7.278 -1.257 -7.716 QT
-0.679 -8.153 -0.273 -8.802 QT
0.134 -9.45 0.29 -10.106 QT
2.649 -19.559 L
2.681 -19.638 2.681 -19.677 QT
2.681 -19.716 2.696 -19.763 QT
2.696 -19.981 2.54 -20.028 QT
2.009 -20.153 0.399 -20.153 QT
0.196 -20.153 0.196 -20.419 QT
0.227 -20.575 0.251 -20.669 QT
0.274 -20.763 0.345 -20.809 QT
0.415 -20.856 0.54 -20.856 QT
5.962 -20.856 L
6.149 -20.856 6.149 -20.606 QT
6.071 -20.153 5.899 -20.153 QT
5.196 -20.153 4.837 -20.052 QT
4.477 -19.95 4.337 -19.481 QT
1.977 -10.028 L
1.743 -9.091 1.056 -8.349 QT
0.368 -7.606 -0.577 -7.184 QT
-1.523 -6.763 -2.476 -6.763 QT
-3.538 -6.763 -4.335 -7.349 QT
-5.132 -7.934 -5.132 -8.934 QT
-5.132 -9.606 -4.773 -10.083 QT
-4.413 -10.559 -3.741 -10.559 QT
-3.366 -10.559 -3.108 -10.325 QT
-2.851 -10.091 -2.851 -9.716 QT
-2.851 -9.184 -3.249 -8.786 QT
-3.648 -8.388 -4.179 -8.388 QT
-4.288 -8.388 -4.335 -8.403 QT
cp
f
GR
GS
[0.75 0 0 0.75 0 0] CT
0 0.447 0.741 RC
1 LJ
2.667 LW
N
80 30 M
81.039 43.08 L
82.078 55.822 L
83.118 68.23 L
84.157 80.31 L
85.196 92.066 L
86.235 103.505 L
87.275 114.629 L
88.314 125.446 L
89.353 135.959 L
90.392 146.173 L
91.431 156.094 L
92.471 165.726 L
93.51 175.075 L
94.549 184.144 L
95.588 192.939 L
96.627 201.464 L
97.667 209.725 L
98.706 217.726 L
99.745 225.472 L
100.784 232.968 L
101.824 240.218 L
102.863 247.227 L
103.902 253.999 L
104.941 260.539 L
105.98 266.853 L
107.02 266.797 L
108.059 266.684 L
109.098 266.572 L
110.137 266.46 L
111.176 266.35 L
112.216 266.239 L
113.255 266.129 L
114.294 266.019 L
115.333 265.911 L
116.373 265.802 L
117.412 265.693 L
118.451 265.575 L
119.49 265.33 L
120.529 265.009 L
121.569 264.649 L
122.608 264.253 L
123.647 263.835 L
124.686 263.406 L
125.725 262.958 L
126.765 262.51 L
127.804 262.049 L
128.843 261.585 L
129.882 261.127 L
130.922 260.663 L
131.961 260.209 L
133 259.751 L
134.039 259.305 L
135.078 258.856 L
136.118 258.414 L
137.157 257.988 L
138.196 257.561 L
139.235 257.152 L
140.275 256.742 L
141.314 256.352 L
142.353 255.959 L
143.392 255.577 L
144.431 255.217 L
145.471 254.855 L
146.51 254.517 L
147.549 254.175 L
148.588 253.858 L
149.627 253.538 L
150.667 253.229 L
151.706 252.944 L
152.745 252.656 L
153.784 252.394 L
154.824 252.126 L
155.863 251.885 L
156.902 251.637 L
157.941 251.398 L
158.98 251.185 L
160.02 250.962 L
161.059 250.764 L
162.098 250.409 L
163.137 249.751 L
164.176 249.006 L
165.216 248.285 L
166.255 247.538 L
167.294 246.879 L
168.333 246.201 L
169.373 245.605 L
170.412 245.036 L
171.451 244.459 L
172.49 243.948 L
173.529 243.436 L
174.569 242.982 L
175.608 242.522 L
176.647 242.114 L
177.686 241.725 L
178.725 241.344 L
179.765 240.993 L
180.804 240.649 L
181.843 240.332 L
182.882 240.022 L
S
GR
GS
[0.75 0 0 0.75 0 0] CT
0.851 0.325 0.098 RC
1 LJ
2.667 LW
N
80 30 M
81.512 42.689 L
83.023 55.059 L
84.535 67.116 L
86.046 78.863 L
87.558 90.306 L
89.07 101.448 L
90.581 112.296 L
92.093 122.852 L
93.604 133.121 L
95.116 143.109 L
96.627 152.82 L
98.139 162.257 L
99.651 171.425 L
101.162 180.33 L
102.674 188.975 L
104.185 197.364 L
105.697 205.502 L
107.209 213.394 L
108.72 221.044 L
110.232 228.455 L
111.743 235.632 L
113.255 236.996 L
114.766 236.553 L
116.278 236.134 L
117.79 235.748 L
119.301 235.394 L
120.813 235.058 L
122.324 234.744 L
123.836 234.452 L
125.348 234.18 L
126.859 233.928 L
128.371 233.696 L
129.882 233.482 L
131.394 233.286 L
132.906 233.107 L
134.417 232.943 L
135.929 232.794 L
137.44 232.658 L
138.952 232.535 L
140.463 232.424 L
141.975 232.322 L
143.487 232.23 L
144.998 232.146 L
146.51 232.07 L
148.021 231.999 L
149.533 231.933 L
151.045 231.871 L
152.556 231.813 L
154.068 231.757 L
155.579 231.703 L
157.091 231.651 L
158.602 231.599 L
160.114 231.549 L
161.626 231.498 L
163.137 231.448 L
164.649 231.398 L
166.16 231.305 L
167.672 230.911 L
169.184 230.371 L
170.695 229.748 L
172.207 229.075 L
173.718 228.371 L
175.23 227.649 L
176.742 226.922 L
178.253 226.196 L
179.765 225.478 L
181.276 224.772 L
182.788 224.086 L
184.299 223.419 L
185.811 222.777 L
187.323 222.159 L
188.834 221.568 L
190.346 221.005 L
191.857 220.472 L
193.369 219.969 L
194.881 219.495 L
196.392 219.052 L
197.904 218.64 L
199.415 218.258 L
200.927 217.906 L
202.439 217.583 L
203.95 217.288 L
205.462 217.019 L
206.973 216.773 L
208.485 216.545 L
209.996 215.906 L
211.508 214.628 L
213.02 213.329 L
214.531 212.133 L
216.043 211.038 L
217.554 210.045 L
219.066 209.147 L
220.578 208.34 L
222.089 207.616 L
223.601 206.97 L
225.112 206.394 L
226.624 205.88 L
228.135 205.419 L
229.647 205.006 L
S
GR
GS
[0.75 0 0 0.75 0 0] CT
0.929 0.694 0.125 RC
1 LJ
2.667 LW
N
80 30 M
81.984 42.493 L
83.968 54.677 L
85.952 66.557 L
87.936 78.138 L
89.92 89.423 L
91.904 100.416 L
93.888 111.123 L
95.872 121.548 L
97.856 131.694 L
99.84 141.567 L
101.824 151.17 L
103.807 160.508 L
105.791 169.585 L
107.775 178.404 L
109.759 186.972 L
111.743 195.29 L
113.727 203.365 L
115.711 211.199 L
117.695 218.798 L
119.679 226.164 L
121.663 228.28 L
123.647 226.487 L
125.631 224.775 L
127.615 223.134 L
129.599 221.566 L
131.583 220.07 L
133.567 218.646 L
135.551 217.291 L
137.535 216.002 L
139.519 214.781 L
141.503 213.628 L
143.487 212.537 L
145.471 211.509 L
147.455 210.542 L
149.439 209.636 L
151.422 208.789 L
153.406 207.999 L
155.39 207.267 L
157.374 206.592 L
159.358 205.971 L
161.342 205.402 L
163.326 204.882 L
165.31 204.432 L
167.294 204.033 L
169.278 203.676 L
171.262 203.361 L
173.246 203.089 L
175.23 202.855 L
177.214 202.659 L
179.198 202.496 L
181.182 202.368 L
183.166 202.267 L
185.15 202.193 L
187.134 202.142 L
189.118 202.111 L
191.102 202.097 L
193.086 202.098 L
195.07 202.109 L
197.053 202.13 L
199.037 202.158 L
201.021 202.19 L
203.005 202.225 L
204.989 202.262 L
206.973 202.298 L
208.957 202.335 L
210.941 202.372 L
212.925 202.357 L
214.909 201.805 L
216.893 201 L
218.877 200.058 L
220.861 199.061 L
222.845 198.025 L
224.829 197.001 L
226.813 195.982 L
228.797 195.008 L
230.781 194.06 L
232.765 193.177 L
234.749 192.352 L
236.733 191.566 L
238.717 190.861 L
240.701 190.199 L
242.684 189.621 L
244.668 189.085 L
246.652 188.636 L
248.636 188.224 L
250.62 187.895 L
252.604 187.594 L
254.588 187.364 L
256.572 186.793 L
258.556 184.849 L
260.54 182.906 L
262.524 181.284 L
264.508 179.796 L
266.492 178.586 L
268.476 177.506 L
270.46 176.64 L
272.444 175.885 L
274.428 175.282 L
276.412 174.764 L
S
GR
GS
[0.75 0 0 0.75 0 0] CT
0.494 0.184 0.557 RC
1 LJ
2.667 LW
N
80 30 M
82.456 42.375 L
84.913 54.448 L
87.369 66.222 L
89.825 77.702 L
92.282 88.892 L
94.738 99.796 L
97.194 110.418 L
99.651 120.764 L
102.107 130.836 L
104.563 140.638 L
107.02 150.177 L
109.476 159.454 L
111.932 168.475 L
114.389 177.243 L
116.845 185.763 L
119.301 194.039 L
121.758 202.074 L
124.214 209.873 L
126.67 217.44 L
129.127 224.779 L
131.583 231.893 L
134.039 238.787 L
136.496 245.465 L
138.952 242.664 L
141.408 238.79 L
143.865 235.011 L
146.321 231.335 L
148.777 227.767 L
151.234 224.309 L
153.69 220.972 L
156.146 217.752 L
158.602 214.655 L
161.059 211.689 L
163.515 208.849 L
165.971 206.146 L
168.428 203.574 L
170.884 201.138 L
173.34 198.834 L
175.797 196.663 L
178.253 194.619 L
180.709 192.703 L
183.166 190.909 L
185.622 189.234 L
188.078 187.678 L
190.535 186.233 L
192.991 184.899 L
195.447 183.68 L
197.904 182.561 L
200.36 181.543 L
202.816 180.631 L
205.273 179.811 L
207.729 179.083 L
210.185 178.449 L
212.642 177.934 L
215.098 177.493 L
217.554 177.129 L
220.011 176.836 L
222.467 176.615 L
224.923 176.455 L
227.38 176.352 L
229.836 176.301 L
232.292 176.295 L
234.749 176.327 L
237.205 176.391 L
239.661 176.48 L
242.118 176.587 L
244.574 176.712 L
247.03 176.845 L
249.487 176.983 L
251.943 177.124 L
254.399 177.264 L
256.856 177.403 L
259.312 177.537 L
261.768 176.906 L
264.225 175.806 L
266.681 174.517 L
269.137 173.153 L
271.594 171.778 L
274.05 170.439 L
276.506 169.162 L
278.963 167.966 L
281.419 166.866 L
283.875 165.871 L
286.332 165.01 L
288.788 164.239 L
291.244 163.581 L
293.701 163.034 L
296.157 162.595 L
298.613 162.255 L
301.07 162 L
303.526 161.221 L
305.982 158.527 L
308.439 156.063 L
310.895 153.905 L
313.351 152.232 L
315.807 150.897 L
318.264 149.849 L
320.72 149.042 L
323.176 148.427 L
S
GR
GS
[0.75 0 0 0.75 0 0] CT
0.467 0.675 0.188 RC
1 LJ
2.667 LW
N
80 30 M
82.929 42.297 L
85.857 54.295 L
88.786 65.999 L
91.715 77.411 L
94.643 88.538 L
97.572 99.382 L
100.501 109.948 L
103.43 120.24 L
106.358 130.262 L
109.287 140.018 L
112.216 149.513 L
115.144 158.75 L
118.073 167.733 L
121.002 176.466 L
123.93 184.955 L
126.859 193.201 L
129.788 201.21 L
132.717 208.985 L
135.645 216.531 L
138.574 223.85 L
141.503 230.948 L
144.431 237.828 L
147.36 244.494 L
150.289 250.95 L
153.217 257.199 L
156.146 263.245 L
159.075 269.093 L
162.004 271.076 L
164.932 265.109 L
167.861 259.208 L
170.79 253.383 L
173.718 247.663 L
176.647 242.042 L
179.576 236.539 L
182.504 231.166 L
185.433 225.931 L
188.362 220.84 L
191.291 215.916 L
194.219 211.154 L
197.148 206.568 L
200.077 202.166 L
203.005 197.953 L
205.934 193.94 L
208.863 190.13 L
211.791 186.529 L
214.72 183.137 L
217.649 179.968 L
220.578 177.004 L
223.506 174.248 L
226.435 171.7 L
229.364 169.341 L
232.292 167.184 L
235.221 165.206 L
238.15 163.41 L
241.078 161.787 L
244.007 160.326 L
246.936 159.045 L
249.865 157.915 L
252.793 156.936 L
255.722 156.1 L
258.651 155.426 L
261.579 154.905 L
264.508 154.498 L
267.437 154.204 L
270.365 154.014 L
273.294 153.919 L
276.223 153.907 L
279.152 153.968 L
282.08 154.088 L
285.009 154.251 L
287.938 154.454 L
290.866 154.68 L
293.795 154.921 L
296.724 155.169 L
299.652 155.422 L
302.581 155.671 L
305.51 155.918 L
308.439 155.344 L
311.367 153.935 L
314.296 152.264 L
317.225 150.504 L
320.153 148.786 L
323.082 147.16 L
326.011 145.644 L
328.939 144.305 L
331.868 143.137 L
334.797 142.124 L
337.725 141.316 L
340.654 140.686 L
343.583 140.195 L
346.512 139.889 L
349.44 139.561 L
352.369 136.457 L
355.298 133.161 L
358.226 130.532 L
361.155 128.587 L
364.084 127.079 L
367.012 126.036 L
369.941 125.283 L
S
GR
GS
[0.75 0 0 0.75 0 0] CT
0.302 0.745 0.933 RC
1 LJ
2.667 LW
N
80 30 M
83.401 42.241 L
86.802 54.186 L
90.203 65.839 L
93.604 77.203 L
97.005 88.284 L
100.406 99.086 L
103.807 109.611 L
107.209 119.865 L
110.61 129.851 L
114.011 139.574 L
117.412 149.038 L
120.813 158.245 L
124.214 167.202 L
127.615 175.91 L
131.016 184.376 L
134.417 192.601 L
137.818 200.591 L
141.219 208.349 L
144.62 215.879 L
148.021 223.185 L
151.422 230.271 L
154.824 237.141 L
158.225 243.798 L
161.626 250.246 L
165.027 256.489 L
168.428 262.531 L
171.829 268.376 L
175.23 274.027 L
178.631 279.489 L
182.032 284.764 L
185.433 289.856 L
188.834 294.77 L
192.235 297.048 L
195.636 289.64 L
199.037 281.998 L
202.439 274.337 L
205.84 266.694 L
209.241 259.118 L
212.642 251.615 L
216.043 244.23 L
219.444 236.971 L
222.845 229.866 L
226.246 222.937 L
229.647 216.203 L
233.048 209.671 L
236.449 203.363 L
239.85 197.296 L
243.251 191.484 L
246.652 185.939 L
250.053 180.665 L
253.455 175.704 L
256.856 171.033 L
260.257 166.675 L
263.658 162.629 L
267.059 158.892 L
270.46 155.466 L
273.861 152.338 L
277.262 149.496 L
280.663 146.932 L
284.064 144.637 L
287.465 142.6 L
290.866 140.813 L
294.267 139.266 L
297.668 137.948 L
301.07 136.853 L
304.471 135.956 L
307.872 135.329 L
311.273 134.858 L
314.674 134.552 L
318.075 134.398 L
321.476 134.375 L
324.877 134.465 L
328.278 134.647 L
331.679 134.9 L
335.08 135.198 L
338.481 135.542 L
341.882 135.9 L
345.283 136.263 L
348.684 136.628 L
352.086 136.984 L
355.487 136.297 L
358.888 134.49 L
362.289 132.369 L
365.69 130.212 L
369.091 128.154 L
372.492 126.3 L
375.893 124.652 L
379.294 123.256 L
382.695 122.118 L
386.096 121.253 L
389.497 120.675 L
392.898 120.295 L
396.299 119.94 L
399.701 115.868 L
403.102 112.057 L
406.503 109.086 L
409.904 107.047 L
413.305 105.668 L
416.706 104.786 L
S
GR
GS
[0.75 0 0 0.75 0 0] CT
0.635 0.078 0.184 RC
1 LJ
2.667 LW
N
80 30 M
83.873 42.199 L
87.747 54.104 L
91.62 65.719 L
95.494 77.048 L
99.367 88.094 L
103.241 98.863 L
107.114 109.359 L
110.988 119.584 L
114.861 129.543 L
118.734 139.241 L
122.608 148.681 L
126.481 157.867 L
130.355 166.803 L
134.228 175.493 L
138.102 183.941 L
141.975 192.15 L
145.848 200.126 L
149.722 207.871 L
153.595 215.389 L
157.469 222.685 L
161.342 229.762 L
165.216 236.623 L
169.089 243.274 L
172.963 249.716 L
176.836 255.955 L
180.709 261.994 L
184.583 267.837 L
188.456 273.486 L
192.33 278.947 L
196.203 284.223 L
200.077 289.316 L
203.95 294.232 L
207.824 298.974 L
211.697 303.544 L
215.57 307.948 L
219.444 312.187 L
223.317 316.267 L
227.191 316.925 L
231.064 308.603 L
234.938 299.69 L
238.811 290.726 L
242.684 281.648 L
246.558 272.327 L
250.431 262.983 L
254.305 253.731 L
258.178 244.558 L
262.052 235.532 L
265.925 226.684 L
269.799 218.05 L
273.672 209.66 L
277.545 201.542 L
281.419 193.725 L
285.292 186.229 L
289.166 179.077 L
293.039 172.297 L
296.913 165.903 L
300.786 159.914 L
304.66 154.35 L
308.533 149.219 L
312.406 144.522 L
316.28 140.248 L
320.153 136.399 L
324.027 132.953 L
327.9 129.888 L
331.774 127.196 L
335.647 124.863 L
339.521 122.869 L
343.394 121.196 L
347.267 119.843 L
351.141 118.769 L
355.014 118.036 L
358.888 117.548 L
362.761 117.232 L
366.635 117.199 L
370.508 117.292 L
374.381 117.522 L
378.255 117.851 L
382.128 118.26 L
386.002 118.712 L
389.875 119.183 L
393.749 119.658 L
397.622 120.13 L
401.496 119.9 L
405.369 117.837 L
409.242 115.298 L
413.116 112.702 L
416.989 110.291 L
420.863 108.165 L
424.736 106.376 L
428.61 104.957 L
432.483 103.871 L
436.357 103.174 L
440.23 102.807 L
444.103 101.418 L
447.977 96.235 L
451.85 92.155 L
455.724 89.31 L
459.597 87.536 L
463.471 86.506 L
S
GR
GS
[0.75 0 0 0.75 0 0] CT
0 0.447 0.741 RC
1 LJ
2.667 LW
N
80 30 M
84.346 42.166 L
88.692 54.04 L
93.037 65.626 L
97.383 76.926 L
101.729 87.947 L
106.075 98.691 L
110.421 109.162 L
114.766 119.365 L
119.112 129.304 L
123.458 138.982 L
127.804 148.403 L
132.15 157.572 L
136.496 166.492 L
140.841 175.168 L
145.187 183.602 L
149.533 191.799 L
153.879 199.764 L
158.225 207.498 L
162.57 215.008 L
166.916 222.295 L
171.262 229.365 L
175.608 236.22 L
179.954 242.865 L
184.299 249.303 L
188.645 255.539 L
192.991 261.575 L
197.337 267.416 L
201.683 273.064 L
206.029 278.525 L
210.374 283.801 L
214.72 288.895 L
219.066 293.813 L
223.412 298.557 L
227.758 303.13 L
232.103 307.537 L
236.449 311.781 L
240.795 315.865 L
245.141 319.792 L
249.487 323.568 L
253.832 327.193 L
258.178 330.674 L
262.524 334.011 L
266.87 327.667 L
271.216 318.709 L
275.561 309.06 L
279.907 298.798 L
284.253 288.181 L
288.599 277.25 L
292.945 266.396 L
297.291 255.336 L
301.636 244.356 L
305.982 233.508 L
310.328 222.891 L
314.674 212.523 L
319.02 202.463 L
323.365 192.749 L
327.711 183.433 L
332.057 174.539 L
336.403 166.107 L
340.749 158.168 L
345.094 150.749 L
349.44 143.881 L
353.786 137.586 L
358.132 131.864 L
362.478 126.719 L
366.824 122.132 L
371.169 118.082 L
375.515 114.538 L
379.861 111.495 L
384.207 108.912 L
388.553 106.778 L
392.898 105.063 L
397.244 103.727 L
401.59 102.857 L
405.936 102.296 L
410.282 102.028 L
414.627 102.018 L
418.973 102.217 L
423.319 102.575 L
427.665 103.054 L
432.011 103.599 L
436.357 104.177 L
440.702 104.765 L
445.048 105.346 L
449.394 104.498 L
453.74 101.77 L
458.086 98.724 L
462.431 95.778 L
466.777 93.161 L
471.123 91.017 L
475.469 89.328 L
479.815 88.13 L
484.16 87.446 L
488.506 87.124 L
492.852 82.867 L
497.198 77.288 L
501.544 73.617 L
505.889 71.349 L
510.235 70.079 L
S
GR
GS
[0.75 0 0 0.75 0 0] CT
0.851 0.325 0.098 RC
1 LJ
2.667 LW
N
80 30 M
84.818 42.14 L
89.636 53.989 L
94.455 65.551 L
99.273 76.829 L
104.091 87.828 L
108.909 98.552 L
113.727 109.005 L
118.545 119.19 L
123.364 129.112 L
128.182 138.774 L
133 148.181 L
137.818 157.336 L
142.636 166.243 L
147.455 174.907 L
152.273 183.331 L
157.091 191.518 L
161.909 199.473 L
166.727 207.2 L
171.545 214.702 L
176.364 221.983 L
181.182 229.047 L
186 235.897 L
190.818 242.538 L
195.636 248.973 L
200.455 255.205 L
205.273 261.239 L
210.091 267.078 L
214.909 272.726 L
219.727 278.186 L
224.545 283.462 L
229.364 288.558 L
234.182 293.477 L
239 298.222 L
243.818 302.798 L
248.636 307.207 L
253.455 311.454 L
258.273 315.542 L
263.091 319.474 L
267.909 323.253 L
272.727 326.884 L
277.545 330.369 L
282.364 333.712 L
287.182 336.917 L
292 339.986 L
296.818 342.923 L
301.636 342.989 L
306.455 337.544 L
311.273 329.417 L
316.091 319.582 L
320.909 308.48 L
325.727 296.802 L
330.545 284.529 L
335.364 271.793 L
340.182 259.16 L
345 246.323 L
349.818 233.611 L
354.636 221.114 L
359.455 208.919 L
364.273 197.091 L
369.091 185.705 L
373.909 174.805 L
378.727 164.444 L
383.545 154.685 L
388.364 145.557 L
393.182 137.111 L
398 129.378 L
402.818 122.387 L
407.636 116.138 L
412.455 110.616 L
417.273 105.796 L
422.091 101.639 L
426.909 98.112 L
431.727 95.192 L
436.545 92.838 L
441.364 91.02 L
446.182 89.729 L
451 88.924 L
455.818 88.517 L
460.636 88.453 L
465.455 88.671 L
470.273 89.101 L
475.091 89.675 L
479.909 90.33 L
484.727 91.02 L
489.545 91.712 L
494.364 91.969 L
499.182 89.24 L
504 85.732 L
508.818 82.292 L
513.636 79.267 L
518.455 76.815 L
523.273 74.998 L
528.091 73.776 L
532.909 73.183 L
537.727 71.63 L
542.545 64.485 L
547.364 59.624 L
552.182 56.746 L
557 55.275 L
S
GR
GS
[0.75 0 0 0.75 0 0] CT
1 GC
N
742 303 M
742 79 L
568 79 L
568 303 L
cp
f
GR
GS
[0.75 0 0 0.75 461.20354 69.75] CT
N
0.984 4.8 M
0.781 4.8 0.781 4.534 QT
0.797 4.487 0.82 4.362 QT
0.844 4.237 0.898 4.167 QT
0.953 4.097 1.031 4.097 QT
2.25 4.097 2.75 3.956 QT
3 3.878 3.109 3.425 QT
5.859 -7.559 L
5.906 -7.763 5.906 -7.841 QT
5.906 -8.059 5.672 -8.075 QT
5.281 -8.153 4.219 -8.153 QT
4.031 -8.153 4.031 -8.419 QT
4.031 -8.466 4.063 -8.591 QT
4.094 -8.716 4.148 -8.786 QT
4.203 -8.856 4.281 -8.856 QT
11.469 -8.856 L
12.859 -8.856 13.906 -8.184 QT
14.953 -7.513 15.508 -6.364 QT
16.063 -5.216 16.063 -3.825 QT
16.063 -2.294 15.43 -0.763 QT
14.797 0.769 13.656 2.042 QT
12.516 3.316 11.047 4.058 QT
9.578 4.8 8.031 4.8 QT
0.984 4.8 L
cp
4.719 3.941 M
4.719 4.097 5.406 4.097 QT
7.719 4.097 L
8.844 4.097 9.875 3.636 QT
10.906 3.175 11.719 2.378 QT
12.469 1.628 13.047 0.409 QT
13.625 -0.809 13.945 -2.138 QT
14.266 -3.466 14.266 -4.591 QT
14.266 -5.403 14.023 -6.052 QT
13.781 -6.7 13.344 -7.169 QT
12.906 -7.638 12.258 -7.895 QT
11.609 -8.153 10.781 -8.153 QT
8.578 -8.153 L
8.031 -8.153 7.859 -8.067 QT
7.688 -7.981 7.547 -7.481 QT
4.813 3.503 L
4.719 3.737 4.719 3.941 QT
cp
f
GR
GS
[0.75 0 0 0.75 461.20354 69.75] CT
N
20.058 8.112 M
18.34 8.112 17.722 6.698 QT
17.105 5.284 17.105 3.331 QT
17.105 2.112 17.324 1.042 QT
17.543 -0.028 18.207 -0.778 QT
18.871 -1.528 20.058 -1.528 QT
20.98 -1.528 21.566 -1.075 QT
22.152 -0.622 22.465 0.089 QT
22.777 0.8 22.886 1.62 QT
22.996 2.441 22.996 3.331 QT
22.996 4.534 22.777 5.589 QT
22.558 6.644 21.91 7.378 QT
21.261 8.112 20.058 8.112 QT
cp
20.058 7.737 M
20.84 7.737 21.222 6.941 QT
21.605 6.144 21.691 5.175 QT
21.777 4.206 21.777 3.112 QT
21.777 2.05 21.691 1.167 QT
21.605 0.284 21.222 -0.442 QT
20.84 -1.169 20.058 -1.169 QT
19.261 -1.169 18.879 -0.442 QT
18.496 0.284 18.41 1.167 QT
18.324 2.05 18.324 3.112 QT
18.324 3.894 18.363 4.581 QT
18.402 5.269 18.566 6.003 QT
18.73 6.737 19.097 7.237 QT
19.465 7.737 20.058 7.737 QT
cp
f
GR
GS
[0.75 0 0 0.75 461.20354 69.75] CT
N
31.614 2.144 M
31.457 2.144 31.348 2.019 QT
31.239 1.894 31.239 1.737 QT
31.239 1.581 31.348 1.464 QT
31.457 1.347 31.614 1.347 QT
44.176 1.347 L
44.317 1.347 44.426 1.464 QT
44.536 1.581 44.536 1.737 QT
44.536 1.894 44.426 2.019 QT
44.317 2.144 44.176 2.144 QT
31.614 2.144 L
cp
31.614 -1.747 M
31.457 -1.747 31.348 -1.864 QT
31.239 -1.981 31.239 -2.138 QT
31.239 -2.294 31.348 -2.419 QT
31.457 -2.544 31.614 -2.544 QT
44.176 -2.544 L
44.317 -2.544 44.426 -2.419 QT
44.536 -2.294 44.536 -2.138 QT
44.536 -1.981 44.426 -1.864 QT
44.317 -1.747 44.176 -1.747 QT
31.614 -1.747 L
cp
f
GR
GS
[0.75 0 0 0.75 461.20354 69.75] CT
N
52.225 4.8 M
52.225 4.269 L
52.225 4.206 52.256 4.159 QT
55.365 0.722 L
56.069 -0.044 56.506 -0.559 QT
56.944 -1.075 57.373 -1.755 QT
57.803 -2.434 58.053 -3.13 QT
58.303 -3.825 58.303 -4.606 QT
58.303 -5.419 57.998 -6.169 QT
57.694 -6.919 57.1 -7.372 QT
56.506 -7.825 55.647 -7.825 QT
54.787 -7.825 54.092 -7.302 QT
53.397 -6.778 53.115 -5.95 QT
53.194 -5.966 53.319 -5.966 QT
53.772 -5.966 54.092 -5.661 QT
54.412 -5.356 54.412 -4.872 QT
54.412 -4.419 54.092 -4.099 QT
53.772 -3.778 53.319 -3.778 QT
52.85 -3.778 52.537 -4.106 QT
52.225 -4.434 52.225 -4.872 QT
52.225 -5.638 52.506 -6.294 QT
52.787 -6.95 53.319 -7.466 QT
53.85 -7.981 54.522 -8.255 QT
55.194 -8.528 55.944 -8.528 QT
57.084 -8.528 58.069 -8.044 QT
59.053 -7.559 59.631 -6.677 QT
60.209 -5.794 60.209 -4.606 QT
60.209 -3.731 59.826 -2.95 QT
59.444 -2.169 58.85 -1.528 QT
58.256 -0.888 57.326 -0.083 QT
56.397 0.722 56.115 1.003 QT
53.85 3.175 L
55.772 3.175 L
57.178 3.175 58.131 3.151 QT
59.084 3.128 59.147 3.081 QT
59.381 2.831 59.631 1.237 QT
60.209 1.237 L
59.647 4.8 L
52.225 4.8 L
cp
f
GR
GS
[0.75 0 0 0.75 461.20354 69.75] CT
N
66.225 5.237 M
63.772 5.237 62.889 3.222 QT
62.006 1.206 62.006 -1.575 QT
62.006 -3.309 62.326 -4.849 QT
62.647 -6.388 63.584 -7.458 QT
64.522 -8.528 66.225 -8.528 QT
67.537 -8.528 68.381 -7.88 QT
69.225 -7.231 69.662 -6.208 QT
70.1 -5.184 70.264 -4.02 QT
70.428 -2.856 70.428 -1.575 QT
70.428 0.144 70.108 1.644 QT
69.787 3.144 68.858 4.191 QT
67.928 5.237 66.225 5.237 QT
cp
66.225 4.722 M
67.334 4.722 67.881 3.581 QT
68.428 2.441 68.561 1.05 QT
68.694 -0.341 68.694 -1.903 QT
68.694 -3.403 68.561 -4.677 QT
68.428 -5.95 67.889 -6.974 QT
67.35 -7.997 66.225 -7.997 QT
65.1 -7.997 64.553 -6.966 QT
64.006 -5.934 63.873 -4.669 QT
63.74 -3.403 63.74 -1.903 QT
63.74 -0.794 63.795 0.198 QT
63.85 1.191 64.084 2.237 QT
64.319 3.284 64.842 4.003 QT
65.365 4.722 66.225 4.722 QT
cp
f
GR
GS
[0.75 0 0 0.75 461.20354 69.75] CT
N
76.225 5.237 M
73.772 5.237 72.889 3.222 QT
72.006 1.206 72.006 -1.575 QT
72.006 -3.309 72.326 -4.849 QT
72.647 -6.388 73.584 -7.458 QT
74.522 -8.528 76.225 -8.528 QT
77.537 -8.528 78.381 -7.88 QT
79.225 -7.231 79.662 -6.208 QT
80.1 -5.184 80.264 -4.02 QT
80.428 -2.856 80.428 -1.575 QT
80.428 0.144 80.108 1.644 QT
79.787 3.144 78.858 4.191 QT
77.928 5.237 76.225 5.237 QT
cp
76.225 4.722 M
77.334 4.722 77.881 3.581 QT
78.428 2.441 78.561 1.05 QT
78.694 -0.341 78.694 -1.903 QT
78.694 -3.403 78.561 -4.677 QT
78.428 -5.95 77.889 -6.974 QT
77.35 -7.997 76.225 -7.997 QT
75.1 -7.997 74.553 -6.966 QT
74.006 -5.934 73.873 -4.669 QT
73.74 -3.403 73.74 -1.903 QT
73.74 -0.794 73.795 0.198 QT
73.85 1.191 74.084 2.237 QT
74.319 3.284 74.842 4.003 QT
75.365 4.722 76.225 4.722 QT
cp
f
GR
GS
[0.75 0 0 0.75 461.20354 69.75] CT
N
86.917 9.8 M
86.917 -10.2 L
89.652 -10.2 L
89.652 -9.403 L
87.73 -9.403 L
87.73 9.003 L
89.652 9.003 L
89.652 9.8 L
86.917 9.8 L
cp
f
GR
GS
[0.75 0 0 0.75 461.20354 69.75] CT
N
91.661 4.456 M
91.661 4.347 91.676 4.284 QT
93.176 -1.684 L
93.317 -2.247 93.317 -2.669 QT
93.317 -3.528 92.739 -3.528 QT
92.114 -3.528 91.809 -2.778 QT
91.504 -2.028 91.223 -0.888 QT
91.223 -0.825 91.161 -0.794 QT
91.098 -0.763 91.051 -0.763 QT
90.817 -0.763 L
90.754 -0.763 90.7 -0.833 QT
90.645 -0.903 90.645 -0.966 QT
90.864 -1.825 91.067 -2.434 QT
91.27 -3.044 91.692 -3.544 QT
92.114 -4.044 92.754 -4.044 QT
93.504 -4.044 94.082 -3.567 QT
94.661 -3.091 94.661 -2.356 QT
95.254 -3.138 96.051 -3.591 QT
96.848 -4.044 97.754 -4.044 QT
98.692 -4.044 99.387 -3.559 QT
100.082 -3.075 100.082 -2.184 QT
100.692 -3.059 101.52 -3.552 QT
102.348 -4.044 103.317 -4.044 QT
104.348 -4.044 104.981 -3.481 QT
105.614 -2.919 105.614 -1.888 QT
105.614 -1.059 105.246 0.105 QT
104.879 1.269 104.332 2.706 QT
104.051 3.394 104.051 3.894 QT
104.051 4.503 104.52 4.503 QT
105.301 4.503 105.817 3.659 QT
106.332 2.816 106.551 1.862 QT
106.614 1.737 106.723 1.737 QT
106.957 1.737 L
107.036 1.737 107.082 1.792 QT
107.129 1.847 107.129 1.925 QT
107.129 1.941 107.114 1.972 QT
106.848 3.112 106.168 4.066 QT
105.489 5.019 104.473 5.019 QT
103.77 5.019 103.27 4.534 QT
102.77 4.05 102.77 3.362 QT
102.77 3.019 102.942 2.581 QT
103.504 1.081 103.879 -0.099 QT
104.254 -1.278 104.254 -2.184 QT
104.254 -2.747 104.028 -3.138 QT
103.801 -3.528 103.286 -3.528 QT
102.192 -3.528 101.387 -2.856 QT
100.582 -2.184 100.004 -1.075 QT
99.957 -0.888 99.942 -0.778 QT
98.645 4.362 L
98.582 4.628 98.34 4.823 QT
98.098 5.019 97.817 5.019 QT
97.582 5.019 97.395 4.862 QT
97.207 4.706 97.207 4.456 QT
97.207 4.347 97.239 4.284 QT
98.52 -0.809 L
98.723 -1.638 98.723 -2.184 QT
98.723 -2.747 98.489 -3.138 QT
98.254 -3.528 97.707 -3.528 QT
96.973 -3.528 96.364 -3.2 QT
95.754 -2.872 95.293 -2.341 QT
94.832 -1.809 94.457 -1.075 QT
93.098 4.362 L
93.02 4.628 92.786 4.823 QT
92.551 5.019 92.254 5.019 QT
92.004 5.019 91.832 4.862 QT
91.661 4.706 91.661 4.456 QT
cp
f
GR
GS
[0.75 0 0 0.75 461.20354 69.75] CT
N
108.111 9.8 M
108.111 9.003 L
110.065 9.003 L
110.065 -9.403 L
108.111 -9.403 L
108.111 -10.2 L
110.861 -10.2 L
110.861 9.8 L
108.111 9.8 L
cp
f
GR
GS
[0.75 0 0 0.75 0 0] CT
0 0.447 0.741 RC
1 LJ
2.667 LW
N
571.995 93 M
611.942 93 L
S
GR
GS
[0.75 0 0 0.75 461.20354 88.125] CT
N
/f2042911848{0.984 4.8 M
0.781 4.8 0.781 4.534 QT
0.797 4.487 0.82 4.362 QT
0.844 4.237 0.898 4.167 QT
0.953 4.097 1.031 4.097 QT
2.25 4.097 2.75 3.956 QT
3 3.878 3.109 3.425 QT
5.859 -7.559 L
5.906 -7.763 5.906 -7.841 QT
5.906 -8.059 5.672 -8.075 QT
5.281 -8.153 4.219 -8.153 QT
4.031 -8.153 4.031 -8.419 QT
4.031 -8.466 4.063 -8.591 QT
4.094 -8.716 4.148 -8.786 QT
4.203 -8.856 4.281 -8.856 QT
11.469 -8.856 L
12.859 -8.856 13.906 -8.184 QT
14.953 -7.513 15.508 -6.364 QT
16.063 -5.216 16.063 -3.825 QT
16.063 -2.294 15.43 -0.763 QT
14.797 0.769 13.656 2.042 QT
12.516 3.316 11.047 4.058 QT
9.578 4.8 8.031 4.8 QT
0.984 4.8 L
cp
4.719 3.941 M
4.719 4.097 5.406 4.097 QT
7.719 4.097 L
8.844 4.097 9.875 3.636 QT
10.906 3.175 11.719 2.378 QT
12.469 1.628 13.047 0.409 QT
13.625 -0.809 13.945 -2.138 QT
14.266 -3.466 14.266 -4.591 QT
14.266 -5.403 14.023 -6.052 QT
13.781 -6.7 13.344 -7.169 QT
12.906 -7.638 12.258 -7.895 QT
11.609 -8.153 10.781 -8.153 QT
8.578 -8.153 L
8.031 -8.153 7.859 -8.067 QT
7.688 -7.981 7.547 -7.481 QT
4.813 3.503 L
4.719 3.737 4.719 3.941 QT
cp}def
f2042911848
f
GR
GS
[0.75 0 0 0.75 461.20354 88.125] CT
N
/f880184827{20.058 8.112 M
18.34 8.112 17.722 6.698 QT
17.105 5.284 17.105 3.331 QT
17.105 2.112 17.324 1.042 QT
17.543 -0.028 18.207 -0.778 QT
18.871 -1.528 20.058 -1.528 QT
20.98 -1.528 21.566 -1.075 QT
22.152 -0.622 22.465 0.089 QT
22.777 0.8 22.886 1.62 QT
22.996 2.441 22.996 3.331 QT
22.996 4.534 22.777 5.589 QT
22.558 6.644 21.91 7.378 QT
21.261 8.112 20.058 8.112 QT
cp
20.058 7.737 M
20.84 7.737 21.222 6.941 QT
21.605 6.144 21.691 5.175 QT
21.777 4.206 21.777 3.112 QT
21.777 2.05 21.691 1.167 QT
21.605 0.284 21.222 -0.442 QT
20.84 -1.169 20.058 -1.169 QT
19.261 -1.169 18.879 -0.442 QT
18.496 0.284 18.41 1.167 QT
18.324 2.05 18.324 3.112 QT
18.324 3.894 18.363 4.581 QT
18.402 5.269 18.566 6.003 QT
18.73 6.737 19.097 7.237 QT
19.465 7.737 20.058 7.737 QT
cp}def
f880184827
f
GR
GS
[0.75 0 0 0.75 461.20354 88.125] CT
N
/f1514185711{31.614 2.144 M
31.457 2.144 31.348 2.019 QT
31.239 1.894 31.239 1.737 QT
31.239 1.581 31.348 1.464 QT
31.457 1.347 31.614 1.347 QT
44.176 1.347 L
44.317 1.347 44.426 1.464 QT
44.536 1.581 44.536 1.737 QT
44.536 1.894 44.426 2.019 QT
44.317 2.144 44.176 2.144 QT
31.614 2.144 L
cp
31.614 -1.747 M
31.457 -1.747 31.348 -1.864 QT
31.239 -1.981 31.239 -2.138 QT
31.239 -2.294 31.348 -2.419 QT
31.457 -2.544 31.614 -2.544 QT
44.176 -2.544 L
44.317 -2.544 44.426 -2.419 QT
44.536 -2.294 44.536 -2.138 QT
44.536 -1.981 44.426 -1.864 QT
44.317 -1.747 44.176 -1.747 QT
31.614 -1.747 L
cp}def
f1514185711
f
GR
GS
[0.75 0 0 0.75 461.20354 88.125] CT
N
/f1961353353{53.131 3.253 M
53.6 3.941 54.389 4.269 QT
55.178 4.597 56.084 4.597 QT
57.256 4.597 57.74 3.612 QT
58.225 2.628 58.225 1.362 QT
58.225 0.8 58.123 0.23 QT
58.022 -0.341 57.779 -0.825 QT
57.537 -1.309 57.108 -1.606 QT
56.678 -1.903 56.069 -1.903 QT
54.74 -1.903 L
54.569 -1.903 54.569 -2.091 QT
54.569 -2.263 L
54.569 -2.419 54.74 -2.419 QT
55.85 -2.513 L
56.553 -2.513 57.014 -3.036 QT
57.475 -3.559 57.694 -4.317 QT
57.912 -5.075 57.912 -5.763 QT
57.912 -6.716 57.459 -7.333 QT
57.006 -7.95 56.084 -7.95 QT
55.334 -7.95 54.639 -7.661 QT
53.944 -7.372 53.537 -6.778 QT
53.569 -6.794 53.6 -6.802 QT
53.631 -6.809 53.662 -6.809 QT
54.115 -6.809 54.42 -6.497 QT
54.725 -6.184 54.725 -5.731 QT
54.725 -5.309 54.42 -4.997 QT
54.115 -4.684 53.662 -4.684 QT
53.225 -4.684 52.912 -4.997 QT
52.6 -5.309 52.6 -5.731 QT
52.6 -6.591 53.115 -7.231 QT
53.631 -7.872 54.451 -8.2 QT
55.272 -8.528 56.084 -8.528 QT
56.694 -8.528 57.365 -8.341 QT
58.037 -8.153 58.584 -7.817 QT
59.131 -7.481 59.483 -6.958 QT
59.834 -6.434 59.834 -5.763 QT
59.834 -4.919 59.459 -4.208 QT
59.084 -3.497 58.428 -2.974 QT
57.772 -2.45 56.99 -2.2 QT
57.85 -2.044 58.631 -1.552 QT
59.412 -1.059 59.889 -0.302 QT
60.365 0.456 60.365 1.347 QT
60.365 2.441 59.764 3.339 QT
59.162 4.237 58.17 4.737 QT
57.178 5.237 56.084 5.237 QT
55.147 5.237 54.209 4.878 QT
53.272 4.519 52.67 3.808 QT
52.069 3.097 52.069 2.097 QT
52.069 1.612 52.397 1.276 QT
52.725 0.941 53.225 0.941 QT
53.553 0.941 53.819 1.089 QT
54.084 1.237 54.24 1.511 QT
54.397 1.784 54.397 2.097 QT
54.397 2.597 54.053 2.925 QT
53.709 3.253 53.225 3.253 QT
53.131 3.253 L
cp}def
f1961353353
f
GR
GS
[0.75 0 0 0.75 461.20354 88.125] CT
N
/f-1865952902{66.225 5.237 M
63.772 5.237 62.889 3.222 QT
62.006 1.206 62.006 -1.575 QT
62.006 -3.309 62.326 -4.849 QT
62.647 -6.388 63.584 -7.458 QT
64.522 -8.528 66.225 -8.528 QT
67.537 -8.528 68.381 -7.88 QT
69.225 -7.231 69.662 -6.208 QT
70.1 -5.184 70.264 -4.02 QT
70.428 -2.856 70.428 -1.575 QT
70.428 0.144 70.108 1.644 QT
69.787 3.144 68.858 4.191 QT
67.928 5.237 66.225 5.237 QT
cp
66.225 4.722 M
67.334 4.722 67.881 3.581 QT
68.428 2.441 68.561 1.05 QT
68.694 -0.341 68.694 -1.903 QT
68.694 -3.403 68.561 -4.677 QT
68.428 -5.95 67.889 -6.974 QT
67.35 -7.997 66.225 -7.997 QT
65.1 -7.997 64.553 -6.966 QT
64.006 -5.934 63.873 -4.669 QT
63.74 -3.403 63.74 -1.903 QT
63.74 -0.794 63.795 0.198 QT
63.85 1.191 64.084 2.237 QT
64.319 3.284 64.842 4.003 QT
65.365 4.722 66.225 4.722 QT
cp}def
f-1865952902
f
GR
GS
[0.75 0 0 0.75 461.20354 88.125] CT
N
/f1168260730{76.225 5.237 M
73.772 5.237 72.889 3.222 QT
72.006 1.206 72.006 -1.575 QT
72.006 -3.309 72.326 -4.849 QT
72.647 -6.388 73.584 -7.458 QT
74.522 -8.528 76.225 -8.528 QT
77.537 -8.528 78.381 -7.88 QT
79.225 -7.231 79.662 -6.208 QT
80.1 -5.184 80.264 -4.02 QT
80.428 -2.856 80.428 -1.575 QT
80.428 0.144 80.108 1.644 QT
79.787 3.144 78.858 4.191 QT
77.928 5.237 76.225 5.237 QT
cp
76.225 4.722 M
77.334 4.722 77.881 3.581 QT
78.428 2.441 78.561 1.05 QT
78.694 -0.341 78.694 -1.903 QT
78.694 -3.403 78.561 -4.677 QT
78.428 -5.95 77.889 -6.974 QT
77.35 -7.997 76.225 -7.997 QT
75.1 -7.997 74.553 -6.966 QT
74.006 -5.934 73.873 -4.669 QT
73.74 -3.403 73.74 -1.903 QT
73.74 -0.794 73.795 0.198 QT
73.85 1.191 74.084 2.237 QT
74.319 3.284 74.842 4.003 QT
75.365 4.722 76.225 4.722 QT
cp}def
f1168260730
f
GR
GS
[0.75 0 0 0.75 461.20354 88.125] CT
N
/f-1568560040{86.917 9.8 M
86.917 -10.2 L
89.652 -10.2 L
89.652 -9.403 L
87.73 -9.403 L
87.73 9.003 L
89.652 9.003 L
89.652 9.8 L
86.917 9.8 L
cp}def
f-1568560040
f
GR
GS
[0.75 0 0 0.75 461.20354 88.125] CT
N
/f-266026311{91.661 4.456 M
91.661 4.347 91.676 4.284 QT
93.176 -1.684 L
93.317 -2.247 93.317 -2.669 QT
93.317 -3.528 92.739 -3.528 QT
92.114 -3.528 91.809 -2.778 QT
91.504 -2.028 91.223 -0.888 QT
91.223 -0.825 91.161 -0.794 QT
91.098 -0.763 91.051 -0.763 QT
90.817 -0.763 L
90.754 -0.763 90.7 -0.833 QT
90.645 -0.903 90.645 -0.966 QT
90.864 -1.825 91.067 -2.434 QT
91.27 -3.044 91.692 -3.544 QT
92.114 -4.044 92.754 -4.044 QT
93.504 -4.044 94.082 -3.567 QT
94.661 -3.091 94.661 -2.356 QT
95.254 -3.138 96.051 -3.591 QT
96.848 -4.044 97.754 -4.044 QT
98.692 -4.044 99.387 -3.559 QT
100.082 -3.075 100.082 -2.184 QT
100.692 -3.059 101.52 -3.552 QT
102.348 -4.044 103.317 -4.044 QT
104.348 -4.044 104.981 -3.481 QT
105.614 -2.919 105.614 -1.888 QT
105.614 -1.059 105.246 0.105 QT
104.879 1.269 104.332 2.706 QT
104.051 3.394 104.051 3.894 QT
104.051 4.503 104.52 4.503 QT
105.301 4.503 105.817 3.659 QT
106.332 2.816 106.551 1.862 QT
106.614 1.737 106.723 1.737 QT
106.957 1.737 L
107.036 1.737 107.082 1.792 QT
107.129 1.847 107.129 1.925 QT
107.129 1.941 107.114 1.972 QT
106.848 3.112 106.168 4.066 QT
105.489 5.019 104.473 5.019 QT
103.77 5.019 103.27 4.534 QT
102.77 4.05 102.77 3.362 QT
102.77 3.019 102.942 2.581 QT
103.504 1.081 103.879 -0.099 QT
104.254 -1.278 104.254 -2.184 QT
104.254 -2.747 104.028 -3.138 QT
103.801 -3.528 103.286 -3.528 QT
102.192 -3.528 101.387 -2.856 QT
100.582 -2.184 100.004 -1.075 QT
99.957 -0.888 99.942 -0.778 QT
98.645 4.362 L
98.582 4.628 98.34 4.823 QT
98.098 5.019 97.817 5.019 QT
97.582 5.019 97.395 4.862 QT
97.207 4.706 97.207 4.456 QT
97.207 4.347 97.239 4.284 QT
98.52 -0.809 L
98.723 -1.638 98.723 -2.184 QT
98.723 -2.747 98.489 -3.138 QT
98.254 -3.528 97.707 -3.528 QT
96.973 -3.528 96.364 -3.2 QT
95.754 -2.872 95.293 -2.341 QT
94.832 -1.809 94.457 -1.075 QT
93.098 4.362 L
93.02 4.628 92.786 4.823 QT
92.551 5.019 92.254 5.019 QT
92.004 5.019 91.832 4.862 QT
91.661 4.706 91.661 4.456 QT
cp}def
f-266026311
f
GR
GS
[0.75 0 0 0.75 461.20354 88.125] CT
N
/f1350615609{108.111 9.8 M
108.111 9.003 L
110.065 9.003 L
110.065 -9.403 L
108.111 -9.403 L
108.111 -10.2 L
110.861 -10.2 L
110.861 9.8 L
108.111 9.8 L
cp}def
f1350615609
f
GR
GS
[0.75 0 0 0.75 0 0] CT
0.851 0.325 0.098 RC
1 LJ
2.667 LW
N
571.995 117.5 M
611.942 117.5 L
S
GR
GS
[0.75 0 0 0.75 461.20354 106.5] CT
N
f2042911848
f
GR
GS
[0.75 0 0 0.75 461.20354 106.5] CT
N
f880184827
f
GR
GS
[0.75 0 0 0.75 461.20354 106.5] CT
N
f1514185711
f
GR
GS
[0.75 0 0 0.75 461.20354 106.5] CT
N
/f1876778571{51.787 1.503 M
51.787 0.8 L
57.959 -8.419 L
58.037 -8.528 58.162 -8.528 QT
58.459 -8.528 L
58.694 -8.528 58.694 -8.294 QT
58.694 0.8 L
60.647 0.8 L
60.647 1.503 L
58.694 1.503 L
58.694 3.456 L
58.694 3.878 59.279 3.987 QT
59.865 4.097 60.631 4.097 QT
60.631 4.8 L
55.115 4.8 L
55.115 4.097 L
55.897 4.097 56.483 3.987 QT
57.069 3.878 57.069 3.456 QT
57.069 1.503 L
51.787 1.503 L
cp
52.444 0.8 M
57.178 0.8 L
57.178 -6.278 L
52.444 0.8 L
cp}def
f1876778571
f
GR
GS
[0.75 0 0 0.75 461.20354 106.5] CT
N
f-1865952902
f
GR
GS
[0.75 0 0 0.75 461.20354 106.5] CT
N
f1168260730
f
GR
GS
[0.75 0 0 0.75 461.20354 106.5] CT
N
f-1568560040
f
GR
GS
[0.75 0 0 0.75 461.20354 106.5] CT
N
f-266026311
f
GR
GS
[0.75 0 0 0.75 461.20354 106.5] CT
N
f1350615609
f
GR
GS
[0.75 0 0 0.75 0 0] CT
0.929 0.694 0.125 RC
1 LJ
2.667 LW
N
571.995 142 M
611.942 142 L
S
GR
GS
[0.75 0 0 0.75 461.20354 124.875] CT
N
f2042911848
f
GR
GS
[0.75 0 0 0.75 461.20354 124.875] CT
N
f880184827
f
GR
GS
[0.75 0 0 0.75 461.20354 124.875] CT
N
f1514185711
f
GR
GS
[0.75 0 0 0.75 461.20354 124.875] CT
N
/f-1521000191{52.959 2.519 M
53.162 3.112 53.592 3.589 QT
54.022 4.066 54.6 4.331 QT
55.178 4.597 55.803 4.597 QT
57.256 4.597 57.803 3.48 QT
58.35 2.362 58.35 0.753 QT
58.35 0.066 58.326 -0.411 QT
58.303 -0.888 58.194 -1.325 QT
58.006 -2.028 57.537 -2.552 QT
57.069 -3.075 56.397 -3.075 QT
55.725 -3.075 55.24 -2.872 QT
54.756 -2.669 54.459 -2.395 QT
54.162 -2.122 53.928 -1.817 QT
53.694 -1.513 53.631 -1.497 QT
53.397 -1.497 L
53.35 -1.497 53.279 -1.559 QT
53.209 -1.622 53.209 -1.684 QT
53.209 -8.372 L
53.209 -8.419 53.272 -8.474 QT
53.334 -8.528 53.397 -8.528 QT
53.459 -8.528 L
54.803 -7.872 56.319 -7.872 QT
57.803 -7.872 59.178 -8.528 QT
59.24 -8.528 L
59.319 -8.528 59.373 -8.474 QT
59.428 -8.419 59.428 -8.372 QT
59.428 -8.184 L
59.428 -8.075 59.397 -8.075 QT
58.709 -7.169 57.678 -6.661 QT
56.647 -6.153 55.537 -6.153 QT
54.74 -6.153 53.897 -6.388 QT
53.897 -2.606 L
54.569 -3.138 55.092 -3.372 QT
55.615 -3.606 56.428 -3.606 QT
57.522 -3.606 58.397 -2.966 QT
59.272 -2.325 59.74 -1.309 QT
60.209 -0.294 60.209 0.769 QT
60.209 1.972 59.615 3.003 QT
59.022 4.034 58.006 4.636 QT
56.99 5.237 55.803 5.237 QT
54.819 5.237 53.99 4.73 QT
53.162 4.222 52.694 3.362 QT
52.225 2.503 52.225 1.534 QT
52.225 1.081 52.514 0.8 QT
52.803 0.519 53.24 0.519 QT
53.694 0.519 53.99 0.808 QT
54.287 1.097 54.287 1.534 QT
54.287 1.972 53.99 2.269 QT
53.694 2.566 53.24 2.566 QT
53.178 2.566 53.092 2.55 QT
53.006 2.534 52.959 2.519 QT
cp}def
f-1521000191
f
GR
GS
[0.75 0 0 0.75 461.20354 124.875] CT
N
f-1865952902
f
GR
GS
[0.75 0 0 0.75 461.20354 124.875] CT
N
f1168260730
f
GR
GS
[0.75 0 0 0.75 461.20354 124.875] CT
N
f-1568560040
f
GR
GS
[0.75 0 0 0.75 461.20354 124.875] CT
N
f-266026311
f
GR
GS
[0.75 0 0 0.75 461.20354 124.875] CT
N
f1350615609
f
GR
GS
[0.75 0 0 0.75 0 0] CT
0.494 0.184 0.557 RC
1 LJ
2.667 LW
N
571.995 166.5 M
611.942 166.5 L
S
GR
GS
[0.75 0 0 0.75 461.20354 143.25] CT
N
f2042911848
f
GR
GS
[0.75 0 0 0.75 461.20354 143.25] CT
N
f880184827
f
GR
GS
[0.75 0 0 0.75 461.20354 143.25] CT
N
f1514185711
f
GR
GS
[0.75 0 0 0.75 461.20354 143.25] CT
N
/f584335321{56.225 5.237 M
54.99 5.237 54.154 4.581 QT
53.319 3.925 52.865 2.87 QT
52.412 1.816 52.24 0.667 QT
52.069 -0.481 52.069 -1.669 QT
52.069 -3.247 52.686 -4.841 QT
53.303 -6.434 54.498 -7.481 QT
55.694 -8.528 57.334 -8.528 QT
58.006 -8.528 58.6 -8.263 QT
59.194 -7.997 59.529 -7.497 QT
59.865 -6.997 59.865 -6.278 QT
59.865 -5.872 59.592 -5.599 QT
59.319 -5.325 58.897 -5.325 QT
58.506 -5.325 58.225 -5.606 QT
57.944 -5.888 57.944 -6.278 QT
57.944 -6.669 58.225 -6.958 QT
58.506 -7.247 58.897 -7.247 QT
59.006 -7.247 L
58.756 -7.606 58.295 -7.778 QT
57.834 -7.95 57.334 -7.95 QT
56.725 -7.95 56.209 -7.684 QT
55.694 -7.419 55.287 -6.966 QT
54.881 -6.513 54.608 -5.974 QT
54.334 -5.434 54.178 -4.739 QT
54.022 -4.044 53.983 -3.442 QT
53.944 -2.841 53.944 -1.919 QT
54.303 -2.747 54.944 -3.263 QT
55.584 -3.778 56.397 -3.778 QT
57.287 -3.778 58.022 -3.419 QT
58.756 -3.059 59.279 -2.419 QT
59.803 -1.778 60.084 -0.958 QT
60.365 -0.138 60.365 0.691 QT
60.365 1.862 59.842 2.925 QT
59.319 3.987 58.373 4.612 QT
57.428 5.237 56.225 5.237 QT
cp
56.225 4.597 M
56.99 4.597 57.459 4.245 QT
57.928 3.894 58.154 3.316 QT
58.381 2.737 58.428 2.144 QT
58.475 1.55 58.475 0.691 QT
58.475 -0.434 58.373 -1.239 QT
58.272 -2.044 57.787 -2.653 QT
57.303 -3.263 56.319 -3.263 QT
55.506 -3.263 54.99 -2.716 QT
54.475 -2.169 54.233 -1.333 QT
53.99 -0.497 53.99 0.284 QT
53.99 0.534 54.006 0.675 QT
54.006 0.706 54.006 0.73 QT
54.006 0.753 53.99 0.769 QT
53.99 1.628 54.162 2.511 QT
54.334 3.394 54.834 3.995 QT
55.334 4.597 56.225 4.597 QT
cp}def
f584335321
f
GR
GS
[0.75 0 0 0.75 461.20354 143.25] CT
N
f-1865952902
f
GR
GS
[0.75 0 0 0.75 461.20354 143.25] CT
N
f1168260730
f
GR
GS
[0.75 0 0 0.75 461.20354 143.25] CT
N
f-1568560040
f
GR
GS
[0.75 0 0 0.75 461.20354 143.25] CT
N
f-266026311
f
GR
GS
[0.75 0 0 0.75 461.20354 143.25] CT
N
f1350615609
f
GR
GS
[0.75 0 0 0.75 0 0] CT
0.467 0.675 0.188 RC
1 LJ
2.667 LW
N
571.995 191 M
611.942 191 L
S
GR
GS
[0.75 0 0 0.75 461.20354 161.625] CT
N
f2042911848
f
GR
GS
[0.75 0 0 0.75 461.20354 161.625] CT
N
f880184827
f
GR
GS
[0.75 0 0 0.75 461.20354 161.625] CT
N
f1514185711
f
GR
GS
[0.75 0 0 0.75 461.20354 161.625] CT
N
/f1670528427{54.709 4.284 M
54.709 3.175 54.904 2.105 QT
55.1 1.034 55.475 -0.005 QT
55.85 -1.044 56.381 -2.044 QT
56.912 -3.044 57.537 -3.919 QT
59.365 -6.466 L
57.084 -6.466 L
53.537 -6.466 53.428 -6.356 QT
53.162 -6.044 52.928 -4.513 QT
52.35 -4.513 L
53.006 -8.716 L
53.584 -8.716 L
53.584 -8.653 L
53.584 -8.294 54.811 -8.184 QT
56.037 -8.075 57.209 -8.075 QT
60.928 -8.075 L
60.928 -7.559 L
60.928 -7.544 60.92 -7.536 QT
60.912 -7.528 60.897 -7.513 QT
58.147 -3.638 L
57.131 -2.138 56.881 -0.302 QT
56.631 1.534 56.631 4.284 QT
56.631 4.675 56.342 4.956 QT
56.053 5.237 55.662 5.237 QT
55.272 5.237 54.99 4.956 QT
54.709 4.675 54.709 4.284 QT
cp}def
f1670528427
f
GR
GS
[0.75 0 0 0.75 461.20354 161.625] CT
N
f-1865952902
f
GR
GS
[0.75 0 0 0.75 461.20354 161.625] CT
N
f1168260730
f
GR
GS
[0.75 0 0 0.75 461.20354 161.625] CT
N
f-1568560040
f
GR
GS
[0.75 0 0 0.75 461.20354 161.625] CT
N
f-266026311
f
GR
GS
[0.75 0 0 0.75 461.20354 161.625] CT
N
f1350615609
f
GR
GS
[0.75 0 0 0.75 0 0] CT
0.302 0.745 0.933 RC
1 LJ
2.667 LW
N
571.995 215.5 M
611.942 215.5 L
S
GR
GS
[0.75 0 0 0.75 461.20354 180] CT
N
f2042911848
f
GR
GS
[0.75 0 0 0.75 461.20354 180] CT
N
f880184827
f
GR
GS
[0.75 0 0 0.75 461.20354 180] CT
N
f1514185711
f
GR
GS
[0.75 0 0 0.75 461.20354 180] CT
N
/f1293668663{52.069 1.769 M
52.069 0.566 52.858 -0.356 QT
53.647 -1.278 54.881 -1.903 QT
54.147 -2.372 L
53.459 -2.825 53.029 -3.575 QT
52.6 -4.325 52.6 -5.138 QT
52.6 -6.106 53.108 -6.872 QT
53.615 -7.638 54.444 -8.083 QT
55.272 -8.528 56.225 -8.528 QT
57.115 -8.528 57.944 -8.161 QT
58.772 -7.794 59.303 -7.122 QT
59.834 -6.45 59.834 -5.528 QT
59.834 -4.856 59.514 -4.278 QT
59.194 -3.7 58.639 -3.239 QT
58.084 -2.778 57.459 -2.45 QT
58.615 -1.731 L
59.397 -1.2 59.881 -0.364 QT
60.365 0.472 60.365 1.394 QT
60.365 2.487 59.787 3.378 QT
59.209 4.269 58.248 4.753 QT
57.287 5.237 56.225 5.237 QT
55.194 5.237 54.233 4.816 QT
53.272 4.394 52.67 3.597 QT
52.069 2.8 52.069 1.769 QT
cp
53.147 1.769 M
53.147 2.55 53.584 3.206 QT
54.022 3.862 54.733 4.23 QT
55.444 4.597 56.225 4.597 QT
57.381 4.597 58.334 3.925 QT
59.287 3.253 59.287 2.128 QT
59.287 1.737 59.131 1.362 QT
58.975 0.987 58.709 0.683 QT
58.444 0.378 58.115 0.175 QT
55.428 -1.559 L
54.803 -1.231 54.279 -0.724 QT
53.756 -0.216 53.451 0.425 QT
53.147 1.066 53.147 1.769 QT
cp
54.522 -4.341 M
56.944 -2.778 L
57.787 -3.263 58.326 -3.958 QT
58.865 -4.653 58.865 -5.528 QT
58.865 -6.2 58.49 -6.763 QT
58.115 -7.325 57.506 -7.638 QT
56.897 -7.95 56.209 -7.95 QT
55.6 -7.95 54.983 -7.716 QT
54.365 -7.481 53.967 -7.013 QT
53.569 -6.544 53.569 -5.919 QT
53.569 -4.981 54.522 -4.341 QT
cp}def
f1293668663
f
GR
GS
[0.75 0 0 0.75 461.20354 180] CT
N
f-1865952902
f
GR
GS
[0.75 0 0 0.75 461.20354 180] CT
N
f1168260730
f
GR
GS
[0.75 0 0 0.75 461.20354 180] CT
N
f-1568560040
f
GR
GS
[0.75 0 0 0.75 461.20354 180] CT
N
f-266026311
f
GR
GS
[0.75 0 0 0.75 461.20354 180] CT
N
f1350615609
f
GR
GS
[0.75 0 0 0.75 0 0] CT
0.635 0.078 0.184 RC
1 LJ
2.667 LW
N
571.995 240 M
611.942 240 L
S
GR
GS
[0.75 0 0 0.75 461.20354 198.375] CT
N
f2042911848
f
GR
GS
[0.75 0 0 0.75 461.20354 198.375] CT
N
f880184827
f
GR
GS
[0.75 0 0 0.75 461.20354 198.375] CT
N
f1514185711
f
GR
GS
[0.75 0 0 0.75 461.20354 198.375] CT
N
/f95233205{53.475 3.956 M
54.022 4.597 55.381 4.597 QT
56.147 4.597 56.803 4.081 QT
57.459 3.566 57.834 2.816 QT
58.24 1.972 58.358 1.011 QT
58.475 0.05 58.475 -1.388 QT
58.147 -0.575 57.506 -0.059 QT
56.865 0.456 56.037 0.456 QT
54.865 0.456 53.951 -0.169 QT
53.037 -0.794 52.553 -1.825 QT
52.069 -2.856 52.069 -4.013 QT
52.069 -5.216 52.615 -6.255 QT
53.162 -7.294 54.131 -7.911 QT
55.1 -8.528 56.319 -8.528 QT
57.537 -8.528 58.35 -7.864 QT
59.162 -7.2 59.592 -6.161 QT
60.022 -5.122 60.194 -3.958 QT
60.365 -2.794 60.365 -1.669 QT
60.365 -0.122 59.803 1.487 QT
59.24 3.097 58.108 4.167 QT
56.975 5.237 55.381 5.237 QT
54.209 5.237 53.389 4.683 QT
52.569 4.128 52.569 3.003 QT
52.569 2.597 52.842 2.316 QT
53.115 2.034 53.537 2.034 QT
53.928 2.034 54.209 2.316 QT
54.49 2.597 54.49 3.003 QT
54.49 3.394 54.209 3.675 QT
53.928 3.956 53.537 3.956 QT
53.475 3.956 L
cp
56.115 -0.059 M
56.928 -0.059 57.451 -0.614 QT
57.975 -1.169 58.209 -1.989 QT
58.444 -2.809 58.444 -3.622 QT
58.444 -3.997 L
58.444 -4.075 L
58.444 -5.575 58.006 -6.763 QT
57.569 -7.95 56.319 -7.95 QT
55.537 -7.95 55.045 -7.599 QT
54.553 -7.247 54.319 -6.677 QT
54.084 -6.106 54.014 -5.45 QT
53.944 -4.794 53.944 -4.013 QT
53.944 -2.888 54.053 -2.083 QT
54.162 -1.278 54.639 -0.669 QT
55.115 -0.059 56.115 -0.059 QT
cp}def
f95233205
f
GR
GS
[0.75 0 0 0.75 461.20354 198.375] CT
N
f-1865952902
f
GR
GS
[0.75 0 0 0.75 461.20354 198.375] CT
N
f1168260730
f
GR
GS
[0.75 0 0 0.75 461.20354 198.375] CT
N
f-1568560040
f
GR
GS
[0.75 0 0 0.75 461.20354 198.375] CT
N
f-266026311
f
GR
GS
[0.75 0 0 0.75 461.20354 198.375] CT
N
f1350615609
f
GR
GS
[0.75 0 0 0.75 0 0] CT
0 0.447 0.741 RC
1 LJ
2.667 LW
N
571.995 264.5 M
611.942 264.5 L
S
GR
GS
[0.75 0 0 0.75 461.20354 216.75] CT
N
f2042911848
f
GR
GS
[0.75 0 0 0.75 461.20354 216.75] CT
N
f880184827
f
GR
GS
[0.75 0 0 0.75 461.20354 216.75] CT
N
f1514185711
f
GR
GS
[0.75 0 0 0.75 461.20354 216.75] CT
N
/f498361571{53.084 4.8 M
53.084 4.097 L
55.584 4.097 55.584 3.456 QT
55.584 -7.044 L
54.553 -6.544 52.959 -6.544 QT
52.959 -7.247 L
55.412 -7.247 56.662 -8.528 QT
56.944 -8.528 L
57.022 -8.528 57.084 -8.474 QT
57.147 -8.419 57.147 -8.341 QT
57.147 3.456 L
57.147 4.097 59.647 4.097 QT
59.647 4.8 L
53.084 4.8 L
cp}def
f498361571
f
GR
GS
[0.75 0 0 0.75 461.20354 216.75] CT
N
f-1865952902
f
GR
GS
[0.75 0 0 0.75 461.20354 216.75] CT
N
f1168260730
f
GR
GS
[0.75 0 0 0.75 461.20354 216.75] CT
N
/f-92492934{86.225 5.237 M
83.772 5.237 82.889 3.222 QT
82.006 1.206 82.006 -1.575 QT
82.006 -3.309 82.326 -4.849 QT
82.647 -6.388 83.584 -7.458 QT
84.522 -8.528 86.225 -8.528 QT
87.537 -8.528 88.381 -7.88 QT
89.225 -7.231 89.662 -6.208 QT
90.1 -5.184 90.264 -4.02 QT
90.428 -2.856 90.428 -1.575 QT
90.428 0.144 90.108 1.644 QT
89.787 3.144 88.858 4.191 QT
87.928 5.237 86.225 5.237 QT
cp
86.225 4.722 M
87.334 4.722 87.881 3.581 QT
88.428 2.441 88.561 1.05 QT
88.694 -0.341 88.694 -1.903 QT
88.694 -3.403 88.561 -4.677 QT
88.428 -5.95 87.889 -6.974 QT
87.35 -7.997 86.225 -7.997 QT
85.1 -7.997 84.553 -6.966 QT
84.006 -5.934 83.873 -4.669 QT
83.74 -3.403 83.74 -1.903 QT
83.74 -0.794 83.795 0.198 QT
83.85 1.191 84.084 2.237 QT
84.319 3.284 84.842 4.003 QT
85.365 4.722 86.225 4.722 QT
cp}def
f-92492934
f
GR
GS
[0.75 0 0 0.75 461.20354 216.75] CT
N
/f-203536936{96.918 9.8 M
96.918 -10.2 L
99.652 -10.2 L
99.652 -9.403 L
97.73 -9.403 L
97.73 9.003 L
99.652 9.003 L
99.652 9.8 L
96.918 9.8 L
cp}def
f-203536936
f
GR
GS
[0.75 0 0 0.75 461.20354 216.75] CT
N
/f-422211965{101.661 4.456 M
101.661 4.347 101.676 4.284 QT
103.176 -1.684 L
103.317 -2.247 103.317 -2.669 QT
103.317 -3.528 102.739 -3.528 QT
102.114 -3.528 101.809 -2.778 QT
101.504 -2.028 101.223 -0.888 QT
101.223 -0.825 101.161 -0.794 QT
101.098 -0.763 101.051 -0.763 QT
100.817 -0.763 L
100.754 -0.763 100.7 -0.833 QT
100.645 -0.903 100.645 -0.966 QT
100.864 -1.825 101.067 -2.434 QT
101.27 -3.044 101.692 -3.544 QT
102.114 -4.044 102.754 -4.044 QT
103.504 -4.044 104.082 -3.567 QT
104.661 -3.091 104.661 -2.356 QT
105.254 -3.138 106.051 -3.591 QT
106.848 -4.044 107.754 -4.044 QT
108.692 -4.044 109.387 -3.559 QT
110.082 -3.075 110.082 -2.184 QT
110.692 -3.059 111.52 -3.552 QT
112.348 -4.044 113.317 -4.044 QT
114.348 -4.044 114.981 -3.481 QT
115.614 -2.919 115.614 -1.888 QT
115.614 -1.059 115.247 0.105 QT
114.879 1.269 114.332 2.706 QT
114.051 3.394 114.051 3.894 QT
114.051 4.503 114.52 4.503 QT
115.301 4.503 115.817 3.659 QT
116.332 2.816 116.551 1.862 QT
116.614 1.737 116.723 1.737 QT
116.957 1.737 L
117.036 1.737 117.082 1.792 QT
117.129 1.847 117.129 1.925 QT
117.129 1.941 117.114 1.972 QT
116.848 3.112 116.168 4.066 QT
115.489 5.019 114.473 5.019 QT
113.77 5.019 113.27 4.534 QT
112.77 4.05 112.77 3.362 QT
112.77 3.019 112.942 2.581 QT
113.504 1.081 113.879 -0.099 QT
114.254 -1.278 114.254 -2.184 QT
114.254 -2.747 114.028 -3.138 QT
113.801 -3.528 113.286 -3.528 QT
112.192 -3.528 111.387 -2.856 QT
110.582 -2.184 110.004 -1.075 QT
109.957 -0.888 109.942 -0.778 QT
108.645 4.362 L
108.582 4.628 108.34 4.823 QT
108.098 5.019 107.817 5.019 QT
107.582 5.019 107.395 4.862 QT
107.207 4.706 107.207 4.456 QT
107.207 4.347 107.239 4.284 QT
108.52 -0.809 L
108.723 -1.638 108.723 -2.184 QT
108.723 -2.747 108.489 -3.138 QT
108.254 -3.528 107.707 -3.528 QT
106.973 -3.528 106.364 -3.2 QT
105.754 -2.872 105.293 -2.341 QT
104.832 -1.809 104.457 -1.075 QT
103.098 4.362 L
103.02 4.628 102.786 4.823 QT
102.551 5.019 102.254 5.019 QT
102.004 5.019 101.832 4.862 QT
101.661 4.706 101.661 4.456 QT
cp}def
f-422211965
f
GR
GS
[0.75 0 0 0.75 461.20354 216.75] CT
N
/f-1487366432{118.111 9.8 M
118.111 9.003 L
120.065 9.003 L
120.065 -9.403 L
118.111 -9.403 L
118.111 -10.2 L
120.861 -10.2 L
120.861 9.8 L
118.111 9.8 L
cp}def
f-1487366432
f
GR
GS
[0.75 0 0 0.75 0 0] CT
0.851 0.325 0.098 RC
1 LJ
2.667 LW
N
571.995 289 M
611.942 289 L
S
GR
GS
[0.75 0 0 0.75 0 0] CT
0.149 GC
10.0 ML
0.667 LW
N
568 303 M
568 79 L
742 79 L
742 303 L
cp
S
GR
%%Trailer
%%Pages: 1
%%EOF
