%!PS-Adobe-3.0 EPSF-3.0
%%Creator: (MATLAB, The Mathworks, Inc. Version 9.9.0.1524771 \(R2020b\) Update 2. Operating System: Linux)
%%Title: ../pictures/visualize_cost/P_CZ.eps
%%CreationDate: 2021-02-09T17:51:21
%%Pages: (atend)
%%BoundingBox:     9     1   565   282
%%LanguageLevel: 3
%%EndComments
%%BeginProlog
%%BeginResource: procset (Apache XML Graphics Std ProcSet) 1.2 0
%%Version: 1.2 0
%%Copyright: (Copyright 2001-2003,2010 The Apache Software Foundation. License terms: http://www.apache.org/licenses/LICENSE-2.0)
/bd{bind def}bind def
/ld{load def}bd
/GR/grestore ld
/GS/gsave ld
/RM/rmoveto ld
/C/curveto ld
/t/show ld
/L/lineto ld
/ML/setmiterlimit ld
/CT/concat ld
/f/fill ld
/N/newpath ld
/S/stroke ld
/CC/setcmykcolor ld
/A/ashow ld
/cp/closepath ld
/RC/setrgbcolor ld
/LJ/setlinejoin ld
/GC/setgray ld
/LW/setlinewidth ld
/M/moveto ld
/re {4 2 roll M
1 index 0 rlineto
0 exch rlineto
neg 0 rlineto
cp } bd
/_ctm matrix def
/_tm matrix def
/BT { _ctm currentmatrix pop matrix _tm copy pop 0 0 moveto } bd
/ET { _ctm setmatrix } bd
/iTm { _ctm setmatrix _tm concat } bd
/Tm { _tm astore pop iTm 0 0 moveto } bd
/ux 0.0 def
/uy 0.0 def
/F {
  /Tp exch def
  /Tf exch def
  Tf findfont Tp scalefont setfont
  /cf Tf def  /cs Tp def
} bd
/ULS {currentpoint /uy exch def /ux exch def} bd
/ULE {
  /Tcx currentpoint pop def
  gsave
  newpath
  cf findfont cs scalefont dup
  /FontMatrix get 0 get /Ts exch def /FontInfo get dup
  /UnderlinePosition get Ts mul /To exch def
  /UnderlineThickness get Ts mul /Tt exch def
  ux uy To add moveto  Tcx uy To add lineto
  Tt setlinewidth stroke
  grestore
} bd
/OLE {
  /Tcx currentpoint pop def
  gsave
  newpath
  cf findfont cs scalefont dup
  /FontMatrix get 0 get /Ts exch def /FontInfo get dup
  /UnderlinePosition get Ts mul /To exch def
  /UnderlineThickness get Ts mul /Tt exch def
  ux uy To add cs add moveto Tcx uy To add cs add lineto
  Tt setlinewidth stroke
  grestore
} bd
/SOE {
  /Tcx currentpoint pop def
  gsave
  newpath
  cf findfont cs scalefont dup
  /FontMatrix get 0 get /Ts exch def /FontInfo get dup
  /UnderlinePosition get Ts mul /To exch def
  /UnderlineThickness get Ts mul /Tt exch def
  ux uy To add cs 10 mul 26 idiv add moveto Tcx uy To add cs 10 mul 26 idiv add lineto
  Tt setlinewidth stroke
  grestore
} bd
/QT {
/Y22 exch store
/X22 exch store
/Y21 exch store
/X21 exch store
currentpoint
/Y21 load 2 mul add 3 div exch
/X21 load 2 mul add 3 div exch
/X21 load 2 mul /X22 load add 3 div
/Y21 load 2 mul /Y22 load add 3 div
/X22 load /Y22 load curveto
} bd
/SSPD {
dup length /d exch dict def
{
/v exch def
/k exch def
currentpagedevice k known {
/cpdv currentpagedevice k get def
v cpdv ne {
/upd false def
/nullv v type /nulltype eq def
/nullcpdv cpdv type /nulltype eq def
nullv nullcpdv or
{
/upd true def
} {
/sametype v type cpdv type eq def
sametype {
v type /arraytype eq {
/vlen v length def
/cpdvlen cpdv length def
vlen cpdvlen eq {
0 1 vlen 1 sub {
/i exch def
/obj v i get def
/cpdobj cpdv i get def
obj cpdobj ne {
/upd true def
exit
} if
} for
} {
/upd true def
} ifelse
} {
v type /dicttype eq {
v {
/dv exch def
/dk exch def
/cpddv cpdv dk get def
dv cpddv ne {
/upd true def
exit
} if
} forall
} {
/upd true def
} ifelse
} ifelse
} if
} ifelse
upd true eq {
d k v put
} if
} if
} if
} forall
d length 0 gt {
d setpagedevice
} if
} bd
/RE { % /NewFontName [NewEncodingArray] /FontName RE -
  findfont dup length dict begin
  {
    1 index /FID ne
    {def} {pop pop} ifelse
  } forall
  /Encoding exch def
  /FontName 1 index def
  currentdict definefont pop
  end
} bind def
%%EndResource
%%BeginResource: procset (Apache XML Graphics EPS ProcSet) 1.0 0
%%Version: 1.0 0
%%Copyright: (Copyright 2002-2003 The Apache Software Foundation. License terms: http://www.apache.org/licenses/LICENSE-2.0)
/BeginEPSF { %def
/b4_Inc_state save def         % Save state for cleanup
/dict_count countdictstack def % Count objects on dict stack
/op_count count 1 sub def      % Count objects on operand stack
userdict begin                 % Push userdict on dict stack
/showpage { } def              % Redefine showpage, { } = null proc
0 setgray 0 setlinecap         % Prepare graphics state
1 setlinewidth 0 setlinejoin
10 setmiterlimit [ ] 0 setdash newpath
/languagelevel where           % If level not equal to 1 then
{pop languagelevel             % set strokeadjust and
1 ne                           % overprint to their defaults.
{false setstrokeadjust false setoverprint
} if
} if
} bd
/EndEPSF { %def
count op_count sub {pop} repeat            % Clean up stacks
countdictstack dict_count sub {end} repeat
b4_Inc_state restore
} bd
%%EndResource
%FOPBeginFontDict
%%IncludeResource: font Courier-Oblique
%%IncludeResource: font Courier-BoldOblique
%%IncludeResource: font Courier-Bold
%%IncludeResource: font ZapfDingbats
%%IncludeResource: font Symbol
%%IncludeResource: font Helvetica
%%IncludeResource: font Helvetica-Oblique
%%IncludeResource: font Helvetica-Bold
%%IncludeResource: font Helvetica-BoldOblique
%%IncludeResource: font Times-Roman
%%IncludeResource: font Times-Italic
%%IncludeResource: font Times-Bold
%%IncludeResource: font Times-BoldItalic
%%IncludeResource: font Courier
%FOPEndFontDict
%%BeginResource: encoding WinAnsiEncoding
/WinAnsiEncoding [
/.notdef /.notdef /.notdef /.notdef /.notdef
/.notdef /.notdef /.notdef /.notdef /.notdef
/.notdef /.notdef /.notdef /.notdef /.notdef
/.notdef /.notdef /.notdef /.notdef /.notdef
/.notdef /.notdef /.notdef /.notdef /.notdef
/.notdef /.notdef /.notdef /.notdef /.notdef
/.notdef /.notdef /space /exclam /quotedbl
/numbersign /dollar /percent /ampersand /quotesingle
/parenleft /parenright /asterisk /plus /comma
/hyphen /period /slash /zero /one
/two /three /four /five /six
/seven /eight /nine /colon /semicolon
/less /equal /greater /question /at
/A /B /C /D /E
/F /G /H /I /J
/K /L /M /N /O
/P /Q /R /S /T
/U /V /W /X /Y
/Z /bracketleft /backslash /bracketright /asciicircum
/underscore /quoteleft /a /b /c
/d /e /f /g /h
/i /j /k /l /m
/n /o /p /q /r
/s /t /u /v /w
/x /y /z /braceleft /bar
/braceright /asciitilde /bullet /Euro /bullet
/quotesinglbase /florin /quotedblbase /ellipsis /dagger
/daggerdbl /circumflex /perthousand /Scaron /guilsinglleft
/OE /bullet /Zcaron /bullet /bullet
/quoteleft /quoteright /quotedblleft /quotedblright /bullet
/endash /emdash /asciitilde /trademark /scaron
/guilsinglright /oe /bullet /zcaron /Ydieresis
/space /exclamdown /cent /sterling /currency
/yen /brokenbar /section /dieresis /copyright
/ordfeminine /guillemotleft /logicalnot /sfthyphen /registered
/macron /degree /plusminus /twosuperior /threesuperior
/acute /mu /paragraph /middot /cedilla
/onesuperior /ordmasculine /guillemotright /onequarter /onehalf
/threequarters /questiondown /Agrave /Aacute /Acircumflex
/Atilde /Adieresis /Aring /AE /Ccedilla
/Egrave /Eacute /Ecircumflex /Edieresis /Igrave
/Iacute /Icircumflex /Idieresis /Eth /Ntilde
/Ograve /Oacute /Ocircumflex /Otilde /Odieresis
/multiply /Oslash /Ugrave /Uacute /Ucircumflex
/Udieresis /Yacute /Thorn /germandbls /agrave
/aacute /acircumflex /atilde /adieresis /aring
/ae /ccedilla /egrave /eacute /ecircumflex
/edieresis /igrave /iacute /icircumflex /idieresis
/eth /ntilde /ograve /oacute /ocircumflex
/otilde /odieresis /divide /oslash /ugrave
/uacute /ucircumflex /udieresis /yacute /thorn
/ydieresis
] def
%%EndResource
%FOPBeginFontReencode
/Courier-Oblique findfont
dup length dict begin
  {1 index /FID ne {def} {pop pop} ifelse} forall
  /Encoding WinAnsiEncoding def
  currentdict
end
/Courier-Oblique exch definefont pop
/Courier-BoldOblique findfont
dup length dict begin
  {1 index /FID ne {def} {pop pop} ifelse} forall
  /Encoding WinAnsiEncoding def
  currentdict
end
/Courier-BoldOblique exch definefont pop
/Courier-Bold findfont
dup length dict begin
  {1 index /FID ne {def} {pop pop} ifelse} forall
  /Encoding WinAnsiEncoding def
  currentdict
end
/Courier-Bold exch definefont pop
/Helvetica findfont
dup length dict begin
  {1 index /FID ne {def} {pop pop} ifelse} forall
  /Encoding WinAnsiEncoding def
  currentdict
end
/Helvetica exch definefont pop
/Helvetica-Oblique findfont
dup length dict begin
  {1 index /FID ne {def} {pop pop} ifelse} forall
  /Encoding WinAnsiEncoding def
  currentdict
end
/Helvetica-Oblique exch definefont pop
/Helvetica-Bold findfont
dup length dict begin
  {1 index /FID ne {def} {pop pop} ifelse} forall
  /Encoding WinAnsiEncoding def
  currentdict
end
/Helvetica-Bold exch definefont pop
/Helvetica-BoldOblique findfont
dup length dict begin
  {1 index /FID ne {def} {pop pop} ifelse} forall
  /Encoding WinAnsiEncoding def
  currentdict
end
/Helvetica-BoldOblique exch definefont pop
/Times-Roman findfont
dup length dict begin
  {1 index /FID ne {def} {pop pop} ifelse} forall
  /Encoding WinAnsiEncoding def
  currentdict
end
/Times-Roman exch definefont pop
/Times-Italic findfont
dup length dict begin
  {1 index /FID ne {def} {pop pop} ifelse} forall
  /Encoding WinAnsiEncoding def
  currentdict
end
/Times-Italic exch definefont pop
/Times-Bold findfont
dup length dict begin
  {1 index /FID ne {def} {pop pop} ifelse} forall
  /Encoding WinAnsiEncoding def
  currentdict
end
/Times-Bold exch definefont pop
/Times-BoldItalic findfont
dup length dict begin
  {1 index /FID ne {def} {pop pop} ifelse} forall
  /Encoding WinAnsiEncoding def
  currentdict
end
/Times-BoldItalic exch definefont pop
/Courier findfont
dup length dict begin
  {1 index /FID ne {def} {pop pop} ifelse} forall
  /Encoding WinAnsiEncoding def
  currentdict
end
/Courier exch definefont pop
%FOPEndFontReencode
%%EndProlog
%%Page: 1 1
%%PageBoundingBox: 0 0 600 300
%%BeginPageSetup
[1 0 0 -1 0 300] CT
%%EndPageSetup
GS
[0.75 0 0 0.75 0 0] CT
1 GC
N
0 0 800 400 re
f
GR
GS
[0.75 0 0 0.75 0 0] CT
1 GC
N
0 0 800 400 re
f
GR
GS
[0.75 0 0 0.75 0 0] CT
1 GC
N
65 352 M
456 352 L
456 30 L
65 30 L
cp
f
GR
GS
[0.75 0 0 0.75 0 0] CT
0.873 GC
1 LJ
0.667 LW
N
65 352 M
65 30 L
S
GR
GS
[0.75 0 0 0.75 0 0] CT
0.873 GC
1 LJ
0.667 LW
N
139.537 352 M
139.537 30 L
S
GR
GS
[0.75 0 0 0.75 0 0] CT
0.873 GC
1 LJ
0.667 LW
N
214.074 352 M
214.074 30 L
S
GR
GS
[0.75 0 0 0.75 0 0] CT
0.873 GC
1 LJ
0.667 LW
N
288.611 352 M
288.611 30 L
S
GR
GS
[0.75 0 0 0.75 0 0] CT
0.873 GC
1 LJ
0.667 LW
N
363.148 352 M
363.148 30 L
S
GR
GS
[0.75 0 0 0.75 0 0] CT
0.873 GC
1 LJ
0.667 LW
N
437.685 352 M
437.685 30 L
S
GR
GS
[0.75 0 0 0.75 0 0] CT
0.873 GC
1 LJ
0.667 LW
N
456 352 M
65 352 L
S
GR
GS
[0.75 0 0 0.75 0 0] CT
0.873 GC
1 LJ
0.667 LW
N
456 319.8 M
65 319.8 L
S
GR
GS
[0.75 0 0 0.75 0 0] CT
0.873 GC
1 LJ
0.667 LW
N
456 287.6 M
65 287.6 L
S
GR
GS
[0.75 0 0 0.75 0 0] CT
0.873 GC
1 LJ
0.667 LW
N
456 255.4 M
65 255.4 L
S
GR
GS
[0.75 0 0 0.75 0 0] CT
0.873 GC
1 LJ
0.667 LW
N
456 223.2 M
65 223.2 L
S
GR
GS
[0.75 0 0 0.75 0 0] CT
0.873 GC
1 LJ
0.667 LW
N
456 191 M
65 191 L
S
GR
GS
[0.75 0 0 0.75 0 0] CT
0.873 GC
1 LJ
0.667 LW
N
456 158.8 M
65 158.8 L
S
GR
GS
[0.75 0 0 0.75 0 0] CT
0.873 GC
1 LJ
0.667 LW
N
456 126.6 M
65 126.6 L
S
GR
GS
[0.75 0 0 0.75 0 0] CT
0.873 GC
1 LJ
0.667 LW
N
456 94.4 M
65 94.4 L
S
GR
GS
[0.75 0 0 0.75 0 0] CT
0.873 GC
1 LJ
0.667 LW
N
456 62.2 M
65 62.2 L
S
GR
GS
[0.75 0 0 0.75 0 0] CT
0.873 GC
1 LJ
0.667 LW
N
456 30 M
65 30 L
S
GR
GS
[0.75 0 0 0.75 0 0] CT
0.149 GC
2 setlinecap
1 LJ
0.667 LW
N
65 352 M
456 352 L
S
GR
GS
[0.75 0 0 0.75 0 0] CT
0.149 GC
2 setlinecap
1 LJ
0.667 LW
N
65 352 M
65 348.09 L
S
GR
GS
[0.75 0 0 0.75 0 0] CT
0.149 GC
2 setlinecap
1 LJ
0.667 LW
N
139.537 352 M
139.537 348.09 L
S
GR
GS
[0.75 0 0 0.75 0 0] CT
0.149 GC
2 setlinecap
1 LJ
0.667 LW
N
214.074 352 M
214.074 348.09 L
S
GR
GS
[0.75 0 0 0.75 0 0] CT
0.149 GC
2 setlinecap
1 LJ
0.667 LW
N
288.611 352 M
288.611 348.09 L
S
GR
GS
[0.75 0 0 0.75 0 0] CT
0.149 GC
2 setlinecap
1 LJ
0.667 LW
N
363.148 352 M
363.148 348.09 L
S
GR
GS
[0.75 0 0 0.75 0 0] CT
0.149 GC
2 setlinecap
1 LJ
0.667 LW
N
437.685 352 M
437.685 348.09 L
S
GR
GS
[0.75 0 0 0.75 48.75 268.00001] CT
0.149 GC
/Helvetica 13.333 F
GS
[1 0 0 1 0 0] CT
-4.5 13 moveto 
1 -1 scale
(0) t 
GR
GR
GS
[0.75 0 0 0.75 104.65277 268.00001] CT
0.149 GC
/Helvetica 13.333 F
GS
[1 0 0 1 0 0] CT
-8.5 13 moveto 
1 -1 scale
(10) t 
GR
GR
GS
[0.75 0 0 0.75 160.55556 268.00001] CT
0.149 GC
/Helvetica 13.333 F
GS
[1 0 0 1 0 0] CT
-8.5 13 moveto 
1 -1 scale
(20) t 
GR
GR
GS
[0.75 0 0 0.75 216.45834 268.00001] CT
0.149 GC
/Helvetica 13.333 F
GS
[1 0 0 1 0 0] CT
-8.5 13 moveto 
1 -1 scale
(30) t 
GR
GR
GS
[0.75 0 0 0.75 272.36112 268.00001] CT
0.149 GC
/Helvetica 13.333 F
GS
[1 0 0 1 0 0] CT
-8.5 13 moveto 
1 -1 scale
(40) t 
GR
GR
GS
[0.75 0 0 0.75 328.26389 268.00001] CT
0.149 GC
/Helvetica 13.333 F
GS
[1 0 0 1 0 0] CT
-8.5 13 moveto 
1 -1 scale
(50) t 
GR
GR
GS
[0.75 0 0 0.75 195.37514 282] CT
0.149 GC
N
-12.62 15.175 M
-12.62 14.878 -12.557 14.628 QT
-11.104 8.878 L
-13.214 8.878 L
-13.417 8.878 -13.417 8.612 QT
-13.339 8.175 -13.151 8.175 QT
-10.932 8.175 L
-10.135 4.909 L
-10.057 4.644 -9.823 4.464 QT
-9.589 4.284 -9.292 4.284 QT
-9.042 4.284 -8.87 4.433 QT
-8.698 4.581 -8.698 4.831 QT
-8.698 4.894 -8.706 4.925 QT
-8.714 4.956 -8.714 5.003 QT
-9.51 8.175 L
-7.464 8.175 L
-7.245 8.175 -7.245 8.441 QT
-7.26 8.487 -7.292 8.605 QT
-7.323 8.722 -7.37 8.8 QT
-7.417 8.878 -7.51 8.878 QT
-9.698 8.878 L
-11.135 14.659 L
-11.276 15.222 -11.276 15.644 QT
-11.276 16.503 -10.682 16.503 QT
-9.807 16.503 -9.128 15.675 QT
-8.448 14.847 -8.089 13.862 QT
-8.01 13.737 -7.932 13.737 QT
-7.698 13.737 L
-7.62 13.737 -7.565 13.792 QT
-7.51 13.847 -7.51 13.925 QT
-7.51 13.956 -7.542 13.972 QT
-7.979 15.191 -8.815 16.105 QT
-9.651 17.019 -10.745 17.019 QT
-11.526 17.019 -12.073 16.503 QT
-12.62 15.987 -12.62 15.175 QT
cp
f
GR
GS
[0.75 0 0 0.75 195.37514 282] CT
0.149 GC
N
-4.273 21.8 M
-4.273 1.8 L
-1.538 1.8 L
-1.538 2.597 L
-3.46 2.597 L
-3.46 21.003 L
-1.538 21.003 L
-1.538 21.8 L
-4.273 21.8 L
cp
f
GR
GS
[0.75 0 0 0.75 195.37514 282] CT
0.149 GC
N
0.658 15.581 M
1.205 16.503 2.814 16.503 QT
3.517 16.503 4.158 16.261 QT
4.799 16.019 5.213 15.542 QT
5.627 15.066 5.627 14.378 QT
5.627 13.862 5.252 13.526 QT
4.877 13.191 4.345 13.081 QT
3.267 12.862 L
2.517 12.675 2.041 12.167 QT
1.564 11.659 1.564 10.941 QT
1.564 10.05 2.049 9.37 QT
2.533 8.691 3.322 8.323 QT
4.111 7.956 4.955 7.956 QT
5.861 7.956 6.58 8.394 QT
7.299 8.831 7.299 9.675 QT
7.299 10.144 7.041 10.495 QT
6.783 10.847 6.33 10.847 QT
6.064 10.847 5.877 10.675 QT
5.689 10.503 5.689 10.237 QT
5.689 10.003 5.814 9.784 QT
5.939 9.566 6.166 9.433 QT
6.392 9.3 6.627 9.3 QT
6.439 8.862 5.955 8.667 QT
5.47 8.472 4.924 8.472 QT
4.408 8.472 3.9 8.683 QT
3.392 8.894 3.088 9.284 QT
2.783 9.675 2.783 10.222 QT
2.783 10.581 3.033 10.855 QT
3.283 11.128 3.658 11.237 QT
4.83 11.472 L
5.377 11.597 5.845 11.894 QT
6.314 12.191 6.58 12.644 QT
6.845 13.097 6.845 13.691 QT
6.845 14.425 6.431 15.151 QT
6.017 15.878 5.408 16.3 QT
4.345 17.019 2.799 17.019 QT
1.736 17.019 0.845 16.534 QT
-0.045 16.05 -0.045 15.081 QT
-0.045 14.534 0.275 14.128 QT
0.595 13.722 1.142 13.722 QT
1.47 13.722 1.689 13.917 QT
1.908 14.112 1.908 14.441 QT
1.908 14.894 1.564 15.237 QT
1.22 15.581 0.767 15.581 QT
0.658 15.581 L
cp
f
GR
GS
[0.75 0 0 0.75 195.37514 282] CT
0.149 GC
N
8.736 21.8 M
8.736 21.003 L
10.689 21.003 L
10.689 2.597 L
8.736 2.597 L
8.736 1.8 L
11.486 1.8 L
11.486 21.8 L
8.736 21.8 L
cp
f
GR
GS
[0.75 0 0 0.75 0 0] CT
0.149 GC
2 setlinecap
1 LJ
0.667 LW
N
65 352 M
65 30 L
S
GR
GS
[0.75 0 0 0.75 0 0] CT
0.149 GC
2 setlinecap
1 LJ
0.667 LW
N
65 352 M
68.91 352 L
S
GR
GS
[0.75 0 0 0.75 0 0] CT
0.149 GC
2 setlinecap
1 LJ
0.667 LW
N
65 319.8 M
68.91 319.8 L
S
GR
GS
[0.75 0 0 0.75 0 0] CT
0.149 GC
2 setlinecap
1 LJ
0.667 LW
N
65 287.6 M
68.91 287.6 L
S
GR
GS
[0.75 0 0 0.75 0 0] CT
0.149 GC
2 setlinecap
1 LJ
0.667 LW
N
65 255.4 M
68.91 255.4 L
S
GR
GS
[0.75 0 0 0.75 0 0] CT
0.149 GC
2 setlinecap
1 LJ
0.667 LW
N
65 223.2 M
68.91 223.2 L
S
GR
GS
[0.75 0 0 0.75 0 0] CT
0.149 GC
2 setlinecap
1 LJ
0.667 LW
N
65 191 M
68.91 191 L
S
GR
GS
[0.75 0 0 0.75 0 0] CT
0.149 GC
2 setlinecap
1 LJ
0.667 LW
N
65 158.8 M
68.91 158.8 L
S
GR
GS
[0.75 0 0 0.75 0 0] CT
0.149 GC
2 setlinecap
1 LJ
0.667 LW
N
65 126.6 M
68.91 126.6 L
S
GR
GS
[0.75 0 0 0.75 0 0] CT
0.149 GC
2 setlinecap
1 LJ
0.667 LW
N
65 94.4 M
68.91 94.4 L
S
GR
GS
[0.75 0 0 0.75 0 0] CT
0.149 GC
2 setlinecap
1 LJ
0.667 LW
N
65 62.2 M
68.91 62.2 L
S
GR
GS
[0.75 0 0 0.75 0 0] CT
0.149 GC
2 setlinecap
1 LJ
0.667 LW
N
65 30 M
68.91 30 L
S
GR
GS
[0.75 0 0 0.75 44.75 264] CT
0.149 GC
/Helvetica 13.333 F
GS
[1 0 0 1 0 0] CT
-9 4.5 moveto 
1 -1 scale
(0) t 
GR
GR
GS
[0.75 0 0 0.75 44.75 239.84999] CT
0.149 GC
/Helvetica 13.333 F
GS
[1 0 0 1 0 0] CT
-22 4.5 moveto 
1 -1 scale
(0.1) t 
GR
GR
GS
[0.75 0 0 0.75 44.75 215.7] CT
0.149 GC
/Helvetica 13.333 F
GS
[1 0 0 1 0 0] CT
-22 4.5 moveto 
1 -1 scale
(0.2) t 
GR
GR
GS
[0.75 0 0 0.75 44.75 191.55] CT
0.149 GC
/Helvetica 13.333 F
GS
[1 0 0 1 0 0] CT
-22 4.5 moveto 
1 -1 scale
(0.3) t 
GR
GR
GS
[0.75 0 0 0.75 44.75 167.4] CT
0.149 GC
/Helvetica 13.333 F
GS
[1 0 0 1 0 0] CT
-22 4.5 moveto 
1 -1 scale
(0.4) t 
GR
GR
GS
[0.75 0 0 0.75 44.75 143.25] CT
0.149 GC
/Helvetica 13.333 F
GS
[1 0 0 1 0 0] CT
-22 4.5 moveto 
1 -1 scale
(0.5) t 
GR
GR
GS
[0.75 0 0 0.75 44.75 119.09999] CT
0.149 GC
/Helvetica 13.333 F
GS
[1 0 0 1 0 0] CT
-22 4.5 moveto 
1 -1 scale
(0.6) t 
GR
GR
GS
[0.75 0 0 0.75 44.75 94.95] CT
0.149 GC
/Helvetica 13.333 F
GS
[1 0 0 1 0 0] CT
-22 4.5 moveto 
1 -1 scale
(0.7) t 
GR
GR
GS
[0.75 0 0 0.75 44.75 70.8] CT
0.149 GC
/Helvetica 13.333 F
GS
[1 0 0 1 0 0] CT
-22 4.5 moveto 
1 -1 scale
(0.8) t 
GR
GR
GS
[0.75 0 0 0.75 44.75 46.65001] CT
0.149 GC
/Helvetica 13.333 F
GS
[1 0 0 1 0 0] CT
-22 4.5 moveto 
1 -1 scale
(0.9) t 
GR
GR
GS
[0.75 0 0 0.75 44.75 22.5] CT
0.149 GC
/Helvetica 13.333 F
GS
[1 0 0 1 0 0] CT
-9 4.5 moveto 
1 -1 scale
(1) t 
GR
GR
GS
[0 -0.75 0.75 0 25.25 143.24989] CT
0.149 GC
N
-4.335 -8.403 M
-4.132 -7.841 -3.608 -7.559 QT
-3.085 -7.278 -2.46 -7.278 QT
-1.835 -7.278 -1.257 -7.716 QT
-0.679 -8.153 -0.273 -8.802 QT
0.134 -9.45 0.29 -10.106 QT
2.649 -19.559 L
2.681 -19.638 2.681 -19.677 QT
2.681 -19.716 2.696 -19.763 QT
2.696 -19.981 2.54 -20.028 QT
2.009 -20.153 0.399 -20.153 QT
0.196 -20.153 0.196 -20.419 QT
0.227 -20.575 0.251 -20.669 QT
0.274 -20.763 0.345 -20.809 QT
0.415 -20.856 0.54 -20.856 QT
5.962 -20.856 L
6.149 -20.856 6.149 -20.606 QT
6.071 -20.153 5.899 -20.153 QT
5.196 -20.153 4.837 -20.052 QT
4.477 -19.95 4.337 -19.481 QT
1.977 -10.028 L
1.743 -9.091 1.056 -8.349 QT
0.368 -7.606 -0.577 -7.184 QT
-1.523 -6.763 -2.476 -6.763 QT
-3.538 -6.763 -4.335 -7.349 QT
-5.132 -7.934 -5.132 -8.934 QT
-5.132 -9.606 -4.773 -10.083 QT
-4.413 -10.559 -3.741 -10.559 QT
-3.366 -10.559 -3.108 -10.325 QT
-2.851 -10.091 -2.851 -9.716 QT
-2.851 -9.184 -3.249 -8.786 QT
-3.648 -8.388 -4.179 -8.388 QT
-4.288 -8.388 -4.335 -8.403 QT
cp
f
GR
GS
[0.75 0 0 0.75 0 0] CT
1 LJ
2.667 LW
N
65 352 M
68.949 352 L
72.899 352 L
76.848 352 L
80.798 352 L
84.747 352 L
88.697 352 L
92.646 352 L
96.596 352 L
100.545 352 L
104.495 352 L
108.444 352 L
112.394 352 L
116.343 352 L
120.293 352 L
124.242 352 L
128.192 352 L
132.141 352 L
136.091 352 L
140.04 352 L
143.99 352 L
147.939 352 L
151.889 352 L
155.838 352 L
159.788 352 L
163.737 352 L
167.687 352 L
171.636 352 L
175.586 352 L
179.535 352 L
183.485 352 L
187.434 352 L
191.384 352 L
195.333 352 L
199.283 352 L
203.232 352 L
207.182 352 L
211.131 352 L
215.081 352 L
219.03 352 L
222.98 352 L
226.929 351.732 L
230.879 343.788 L
234.828 333.173 L
238.778 324.178 L
242.727 317.15 L
246.677 311.69 L
250.626 306.79 L
254.576 299.475 L
258.525 290.624 L
262.475 280.632 L
266.424 270.122 L
270.374 259.076 L
274.323 247.613 L
278.273 236.244 L
282.222 224.691 L
286.172 213.25 L
290.121 202.003 L
294.071 191.027 L
298.02 180.382 L
301.97 170.135 L
305.919 160.324 L
309.869 151 L
313.818 142.216 L
317.768 134.001 L
321.717 126.4 L
325.667 119.44 L
329.616 113.148 L
333.566 107.524 L
337.515 102.555 L
341.465 98.217 L
345.414 94.475 L
349.364 91.301 L
353.313 88.673 L
357.263 86.555 L
361.212 84.918 L
365.162 83.756 L
369.111 83.031 L
373.061 82.666 L
377.01 82.608 L
380.96 82.804 L
384.909 83.191 L
388.859 83.707 L
392.808 84.297 L
396.758 84.918 L
400.707 85.541 L
404.657 85.772 L
408.606 83.316 L
412.556 80.159 L
416.505 77.063 L
420.455 74.341 L
424.404 72.133 L
428.354 70.498 L
432.303 69.398 L
436.253 68.865 L
440.202 67.467 L
444.151 61.037 L
448.101 56.662 L
452.051 54.072 L
456 52.747 L
S
GR
GS
[0.75 0 0 0.75 0 0] CT
[8 8] 0 setdash
2 LJ
2.667 LW
N
65 30 M
68.949 33.318 L
72.899 36.635 L
76.848 39.953 L
80.798 43.27 L
84.747 46.588 L
88.697 49.905 L
92.646 53.223 L
96.596 56.541 L
100.545 59.858 L
104.495 63.176 L
108.444 66.493 L
112.394 69.811 L
116.343 73.128 L
120.293 76.446 L
124.242 79.764 L
128.192 83.081 L
132.141 86.399 L
136.091 89.716 L
140.04 93.034 L
143.99 96.352 L
147.939 99.669 L
151.889 102.987 L
155.838 106.304 L
159.788 109.622 L
163.737 112.939 L
167.687 116.257 L
171.636 119.575 L
175.586 122.892 L
179.535 126.21 L
183.485 129.527 L
187.434 132.845 L
191.384 136.162 L
195.333 139.48 L
199.283 142.798 L
203.232 146.115 L
207.182 149.433 L
211.131 152.75 L
215.081 156.068 L
219.03 159.385 L
222.98 162.703 L
226.929 166.021 L
230.879 169.338 L
234.828 172.656 L
238.778 175.973 L
242.727 179.291 L
246.677 182.608 L
250.626 185.926 L
254.576 189.244 L
258.525 192.561 L
262.475 195.879 L
266.424 199.196 L
270.374 202.514 L
274.323 205.832 L
278.273 209.149 L
282.222 212.467 L
286.172 215.784 L
290.121 219.102 L
294.071 222.419 L
298.02 225.737 L
301.97 229.055 L
305.919 232.372 L
309.869 235.69 L
313.818 239.007 L
317.768 242.325 L
321.717 245.642 L
325.667 248.96 L
329.616 252.278 L
333.566 255.595 L
337.515 258.913 L
341.465 262.23 L
345.414 265.548 L
349.364 268.865 L
353.313 272.183 L
357.263 275.501 L
361.212 278.818 L
365.162 282.136 L
369.111 285.453 L
373.061 288.771 L
377.01 292.088 L
380.96 295.406 L
384.909 298.724 L
388.859 302.041 L
392.808 305.359 L
396.758 308.676 L
400.707 311.994 L
404.657 315.312 L
408.606 318.629 L
412.556 321.947 L
416.505 325.264 L
420.455 328.582 L
424.404 331.899 L
428.354 335.217 L
432.303 338.535 L
436.253 341.852 L
440.202 345.17 L
444.151 348.487 L
448.101 351.805 L
452.051 352 L
456 352 L
S
GR
GS
[0.75 0 0 0.75 0 0] CT
0.929 0.694 0.125 RC
[8 8] 0 setdash
2 LJ
2.667 LW
N
65 30 M
68.949 33.318 L
72.899 36.635 L
76.848 39.953 L
80.798 43.27 L
84.747 46.588 L
88.697 49.905 L
92.646 53.223 L
96.596 56.541 L
100.545 59.858 L
104.495 63.176 L
108.444 66.493 L
112.394 69.811 L
116.343 73.128 L
120.293 76.446 L
124.242 79.764 L
128.192 83.081 L
132.141 86.399 L
136.091 89.716 L
140.04 93.034 L
143.99 96.352 L
147.939 99.669 L
151.889 102.987 L
155.838 106.304 L
159.788 109.622 L
163.737 112.939 L
167.687 116.257 L
171.636 119.575 L
175.586 122.892 L
179.535 126.21 L
183.485 129.527 L
187.434 132.845 L
191.384 136.162 L
195.333 139.48 L
199.283 142.798 L
203.232 146.115 L
207.182 149.433 L
211.131 152.75 L
215.081 156.068 L
219.03 159.385 L
222.98 162.703 L
226.929 166.021 L
230.879 169.338 L
234.828 172.656 L
238.778 175.973 L
242.727 179.291 L
246.677 182.608 L
250.626 185.926 L
254.576 189.244 L
258.525 192.561 L
262.475 195.879 L
266.424 199.196 L
270.374 202.514 L
274.323 205.832 L
278.273 209.149 L
282.222 212.467 L
286.172 215.784 L
290.121 219.102 L
294.071 222.419 L
298.02 225.737 L
301.97 229.055 L
305.919 232.372 L
309.869 235.69 L
313.818 239.007 L
317.768 242.325 L
321.717 245.642 L
325.667 248.96 L
329.616 252.278 L
333.566 255.595 L
337.515 258.913 L
341.465 262.23 L
345.414 265.548 L
349.364 268.865 L
353.313 272.183 L
357.263 275.501 L
361.212 278.818 L
365.162 282.136 L
369.111 285.453 L
373.061 288.771 L
377.01 292.088 L
380.96 295.406 L
384.909 298.724 L
388.859 302.041 L
392.808 305.359 L
396.758 308.676 L
400.707 311.994 L
404.657 315.312 L
408.606 318.629 L
412.556 321.947 L
416.505 325.264 L
420.455 328.582 L
424.404 331.899 L
428.354 335.217 L
432.303 338.535 L
436.253 341.852 L
440.202 345.17 L
444.151 348.487 L
448.101 351.805 L
452.051 352 L
456 352 L
S
GR
GS
[0.75 0 0 0.75 0 0] CT
0.494 0.184 0.557 RC
[8 8] 0 setdash
2 LJ
2.667 LW
N
65 30 M
68.949 33.684 L
72.899 37.364 L
76.848 41.039 L
80.798 44.711 L
84.747 48.377 L
88.697 52.04 L
92.646 55.698 L
96.596 59.351 L
100.545 63 L
104.495 66.644 L
108.444 70.284 L
112.394 73.919 L
116.343 77.549 L
120.293 81.174 L
124.242 84.795 L
128.192 88.41 L
132.141 92.021 L
136.091 95.627 L
140.04 99.227 L
143.99 102.823 L
147.939 106.413 L
151.889 109.998 L
155.838 113.578 L
159.788 117.152 L
163.737 120.721 L
167.687 124.285 L
171.636 127.842 L
175.586 131.395 L
179.535 134.941 L
183.485 138.482 L
187.434 142.017 L
191.384 145.546 L
195.333 149.069 L
199.283 152.585 L
203.232 156.096 L
207.182 159.6 L
211.131 163.098 L
215.081 166.59 L
219.03 170.075 L
222.98 173.553 L
226.929 177.025 L
230.879 180.489 L
234.828 183.947 L
238.778 187.397 L
242.727 190.841 L
246.677 194.277 L
250.626 197.705 L
254.576 201.126 L
258.525 204.539 L
262.475 207.945 L
266.424 211.342 L
270.374 214.731 L
274.323 218.112 L
278.273 221.484 L
282.222 224.848 L
286.172 228.202 L
290.121 231.548 L
294.071 234.884 L
298.02 238.211 L
301.97 241.528 L
305.919 244.835 L
309.869 248.132 L
313.818 251.419 L
317.768 254.695 L
321.717 257.96 L
325.667 261.213 L
329.616 264.455 L
333.566 267.685 L
337.515 270.903 L
341.465 274.108 L
345.414 277.3 L
349.364 280.478 L
353.313 283.642 L
357.263 286.792 L
361.212 289.926 L
365.162 293.045 L
369.111 296.147 L
373.061 299.232 L
377.01 302.299 L
380.96 305.348 L
384.909 308.376 L
388.859 311.384 L
392.808 314.37 L
396.758 317.332 L
400.707 320.269 L
404.657 323.179 L
408.606 326.059 L
412.556 328.908 L
416.505 331.723 L
420.455 334.499 L
424.404 337.231 L
428.354 339.913 L
432.303 342.537 L
436.253 345.089 L
440.202 347.549 L
444.151 349.874 L
448.101 351.914 L
452.051 352 L
456 352 L
S
GR
GS
[0.75 0 0 0.75 0 0] CT
0.467 0.675 0.188 RC
[8 8] 0 setdash
2 LJ
2.667 LW
N
65 30 M
68.949 34.142 L
72.899 38.272 L
76.848 42.392 L
80.798 46.502 L
84.747 50.6 L
88.697 54.686 L
92.646 58.762 L
96.596 62.827 L
100.545 66.88 L
104.495 70.921 L
108.444 74.951 L
112.394 78.969 L
116.343 82.976 L
120.293 86.97 L
124.242 90.953 L
128.192 94.923 L
132.141 98.882 L
136.091 102.828 L
140.04 106.761 L
143.99 110.682 L
147.939 114.59 L
151.889 118.485 L
155.838 122.368 L
159.788 126.237 L
163.737 130.093 L
167.687 133.936 L
171.636 137.765 L
175.586 141.58 L
179.535 145.382 L
183.485 149.17 L
187.434 152.944 L
191.384 156.703 L
195.333 160.448 L
199.283 164.179 L
203.232 167.895 L
207.182 171.595 L
211.131 175.281 L
215.081 178.951 L
219.03 182.606 L
222.98 186.245 L
226.929 189.869 L
230.879 193.476 L
234.828 197.066 L
238.778 200.641 L
242.727 204.198 L
246.677 207.738 L
250.626 211.262 L
254.576 214.767 L
258.525 218.255 L
262.475 221.724 L
266.424 225.176 L
270.374 228.608 L
274.323 232.022 L
278.273 235.416 L
282.222 238.79 L
286.172 242.145 L
290.121 245.479 L
294.071 248.793 L
298.02 252.085 L
301.97 255.356 L
305.919 258.604 L
309.869 261.831 L
313.818 265.034 L
317.768 268.214 L
321.717 271.37 L
325.667 274.501 L
329.616 277.608 L
333.566 280.688 L
337.515 283.743 L
341.465 286.77 L
345.414 289.769 L
349.364 292.74 L
353.313 295.681 L
357.263 298.592 L
361.212 301.471 L
365.162 304.318 L
369.111 307.131 L
373.061 309.91 L
377.01 312.652 L
380.96 315.356 L
384.909 318.021 L
388.859 320.645 L
392.808 323.226 L
396.758 325.761 L
400.707 328.248 L
404.657 330.684 L
408.606 333.066 L
412.556 335.389 L
416.505 337.648 L
420.455 339.839 L
424.404 341.953 L
428.354 343.981 L
432.303 345.911 L
436.253 347.724 L
440.202 349.393 L
444.151 350.865 L
448.101 351.969 L
452.051 352 L
456 352 L
S
GR
GS
[0.75 0 0 0.75 0 0] CT
0.302 0.745 0.933 RC
[8 8] 0 setdash
2 LJ
2.667 LW
N
65 30 M
68.949 34.729 L
72.899 39.437 L
76.848 44.123 L
80.798 48.789 L
84.747 53.433 L
88.697 58.055 L
92.646 62.656 L
96.596 67.235 L
100.545 71.791 L
104.495 76.326 L
108.444 80.839 L
112.394 85.329 L
116.343 89.796 L
120.293 94.241 L
124.242 98.663 L
128.192 103.062 L
132.141 107.437 L
136.091 111.789 L
140.04 116.118 L
143.99 120.423 L
147.939 124.704 L
151.889 128.962 L
155.838 133.194 L
159.788 137.403 L
163.737 141.587 L
167.687 145.746 L
171.636 149.88 L
175.586 153.989 L
179.535 158.072 L
183.485 162.13 L
187.434 166.162 L
191.384 170.167 L
195.333 174.147 L
199.283 178.1 L
203.232 182.026 L
207.182 185.925 L
211.131 189.797 L
215.081 193.642 L
219.03 197.458 L
222.98 201.247 L
226.929 205.007 L
230.879 208.738 L
234.828 212.441 L
238.778 216.114 L
242.727 219.758 L
246.677 223.372 L
250.626 226.956 L
254.576 230.509 L
258.525 234.031 L
262.475 237.522 L
266.424 240.981 L
270.374 244.409 L
274.323 247.804 L
278.273 251.166 L
282.222 254.494 L
286.172 257.789 L
290.121 261.05 L
294.071 264.276 L
298.02 267.467 L
301.97 270.622 L
305.919 273.741 L
309.869 276.823 L
313.818 279.867 L
317.768 282.873 L
321.717 285.841 L
325.667 288.769 L
329.616 291.658 L
333.566 294.505 L
337.515 297.31 L
341.465 300.073 L
345.414 302.793 L
349.364 305.468 L
353.313 308.098 L
357.263 310.681 L
361.212 313.217 L
365.162 315.704 L
369.111 318.141 L
373.061 320.527 L
377.01 322.859 L
380.96 325.137 L
384.909 327.358 L
388.859 329.52 L
392.808 331.622 L
396.758 333.661 L
400.707 335.634 L
404.657 337.537 L
408.606 339.369 L
412.556 341.124 L
416.505 342.797 L
420.455 344.384 L
424.404 345.877 L
428.354 347.268 L
432.303 348.546 L
436.253 349.694 L
440.202 350.69 L
444.151 351.493 L
448.101 351.992 L
452.051 352 L
456 352 L
S
GR
GS
[0.75 0 0 0.75 0 0] CT
0.635 0.078 0.184 RC
[8 8] 0 setdash
2 LJ
2.667 LW
N
65 30 M
68.949 35.51 L
72.899 40.982 L
76.848 46.416 L
80.798 51.812 L
84.747 57.169 L
88.697 62.487 L
92.646 67.767 L
96.596 73.008 L
100.545 78.209 L
104.495 83.371 L
108.444 88.494 L
112.394 93.578 L
116.343 98.622 L
120.293 103.625 L
124.242 108.589 L
128.192 113.513 L
132.141 118.396 L
136.091 123.239 L
140.04 128.042 L
143.99 132.803 L
147.939 137.523 L
151.889 142.202 L
155.838 146.84 L
159.788 151.436 L
163.737 155.991 L
167.687 160.503 L
171.636 164.974 L
175.586 169.402 L
179.535 173.787 L
183.485 178.13 L
187.434 182.43 L
191.384 186.687 L
195.333 190.9 L
199.283 195.07 L
203.232 199.195 L
207.182 203.277 L
211.131 207.314 L
215.081 211.307 L
219.03 215.255 L
222.98 219.158 L
226.929 223.016 L
230.879 226.827 L
234.828 230.594 L
238.778 234.313 L
242.727 237.987 L
246.677 241.614 L
250.626 245.193 L
254.576 248.726 L
258.525 252.21 L
262.475 255.647 L
266.424 259.035 L
270.374 262.375 L
274.323 265.665 L
278.273 268.906 L
282.222 272.098 L
286.172 275.239 L
290.121 278.329 L
294.071 281.369 L
298.02 284.357 L
301.97 287.293 L
305.919 290.177 L
309.869 293.008 L
313.818 295.786 L
317.768 298.51 L
321.717 301.179 L
325.667 303.793 L
329.616 306.352 L
333.566 308.855 L
337.515 311.301 L
341.465 313.69 L
345.414 316.02 L
349.364 318.292 L
353.313 320.504 L
357.263 322.656 L
361.212 324.746 L
365.162 326.774 L
369.111 328.738 L
373.061 330.639 L
377.01 332.474 L
380.96 334.243 L
384.909 335.943 L
388.859 337.575 L
392.808 339.136 L
396.758 340.624 L
400.707 342.039 L
404.657 343.377 L
408.606 344.637 L
412.556 345.816 L
416.505 346.912 L
420.455 347.92 L
424.404 348.837 L
428.354 349.658 L
432.303 350.378 L
436.253 350.988 L
440.202 351.477 L
444.151 351.827 L
448.101 351.999 L
452.051 352 L
456 352 L
S
GR
GS
[0.75 0 0 0.75 0 0] CT
0 0.447 0.741 RC
[8 8] 0 setdash
2 LJ
2.667 LW
N
65 30 M
68.949 36.601 L
72.899 43.134 L
76.848 49.598 L
80.798 55.994 L
84.747 62.321 L
88.697 68.58 L
92.646 74.771 L
96.596 80.894 L
100.545 86.948 L
104.495 92.933 L
108.444 98.851 L
112.394 104.7 L
116.343 110.48 L
120.293 116.193 L
124.242 121.837 L
128.192 127.412 L
132.141 132.919 L
136.091 138.358 L
140.04 143.729 L
143.99 149.031 L
147.939 154.264 L
151.889 159.43 L
155.838 164.527 L
159.788 169.555 L
163.737 174.516 L
167.687 179.408 L
171.636 184.231 L
175.586 188.986 L
179.535 193.673 L
183.485 198.292 L
187.434 202.842 L
191.384 207.323 L
195.333 211.737 L
199.283 216.082 L
203.232 220.358 L
207.182 224.567 L
211.131 228.707 L
215.081 232.778 L
219.03 236.781 L
222.98 240.716 L
226.929 244.583 L
230.879 248.381 L
234.828 252.111 L
238.778 255.772 L
242.727 259.365 L
246.677 262.89 L
250.626 266.346 L
254.576 269.734 L
258.525 273.054 L
262.475 276.305 L
266.424 279.488 L
270.374 282.602 L
274.323 285.648 L
278.273 288.626 L
282.222 291.536 L
286.172 294.377 L
290.121 297.149 L
294.071 299.854 L
298.02 302.49 L
301.97 305.057 L
305.919 307.556 L
309.869 309.987 L
313.818 312.35 L
317.768 314.644 L
321.717 316.87 L
325.667 319.027 L
329.616 321.116 L
333.566 323.137 L
337.515 325.089 L
341.465 326.973 L
345.414 328.789 L
349.364 330.536 L
353.313 332.215 L
357.263 333.826 L
361.212 335.368 L
365.162 336.842 L
369.111 338.247 L
373.061 339.584 L
377.01 340.853 L
380.96 342.053 L
384.909 343.185 L
388.859 344.249 L
392.808 345.244 L
396.758 346.171 L
400.707 347.03 L
404.657 347.82 L
408.606 348.542 L
412.556 349.195 L
416.505 349.78 L
420.455 350.297 L
424.404 350.745 L
428.354 351.125 L
432.303 351.437 L
436.253 351.68 L
440.202 351.855 L
444.151 351.962 L
448.101 352 L
452.051 352 L
456 352 L
S
GR
GS
[0.75 0 0 0.75 0 0] CT
0.851 0.325 0.098 RC
[8 8] 0 setdash
2 LJ
2.667 LW
N
65 30 M
68.949 38.23 L
72.899 46.332 L
76.848 54.308 L
80.798 62.157 L
84.747 69.881 L
88.697 77.48 L
92.646 84.955 L
96.596 92.307 L
100.545 99.535 L
104.495 106.642 L
108.444 113.627 L
112.394 120.492 L
116.343 127.236 L
120.293 133.861 L
124.242 140.368 L
128.192 146.757 L
132.141 153.028 L
136.091 159.184 L
140.04 165.223 L
143.99 171.148 L
147.939 176.958 L
151.889 182.655 L
155.838 188.239 L
159.788 193.711 L
163.737 199.072 L
167.687 204.323 L
171.636 209.464 L
175.586 214.496 L
179.535 219.42 L
183.485 224.236 L
187.434 228.946 L
191.384 233.55 L
195.333 238.05 L
199.283 242.445 L
203.232 246.737 L
207.182 250.926 L
211.131 255.014 L
215.081 259.001 L
219.03 262.887 L
222.98 266.675 L
226.929 270.365 L
230.879 273.957 L
234.828 277.452 L
238.778 280.852 L
242.727 284.157 L
246.677 287.368 L
250.626 290.487 L
254.576 293.513 L
258.525 296.448 L
262.475 299.293 L
266.424 302.048 L
270.374 304.716 L
274.323 307.296 L
278.273 309.789 L
282.222 312.197 L
286.172 314.521 L
290.121 316.762 L
294.071 318.92 L
298.02 320.997 L
301.97 322.993 L
305.919 324.911 L
309.869 326.75 L
313.818 328.512 L
317.768 330.198 L
321.717 331.81 L
325.667 333.348 L
329.616 334.813 L
333.566 336.207 L
337.515 337.531 L
341.465 338.786 L
345.414 339.973 L
349.364 341.094 L
353.313 342.15 L
357.263 343.141 L
361.212 344.071 L
365.162 344.939 L
369.111 345.748 L
373.061 346.498 L
377.01 347.192 L
380.96 347.83 L
384.909 348.414 L
388.859 348.947 L
392.808 349.429 L
396.758 349.862 L
400.707 350.248 L
404.657 350.589 L
408.606 350.887 L
412.556 351.143 L
416.505 351.36 L
420.455 351.541 L
424.404 351.686 L
428.354 351.8 L
432.303 351.885 L
436.253 351.943 L
440.202 351.979 L
444.151 351.996 L
448.101 352 L
452.051 352 L
456 352 L
S
GR
GS
[0.75 0 0 0.75 0 0] CT
0.929 0.694 0.125 RC
[8 8] 0 setdash
2 LJ
2.667 LW
N
65 30 M
68.949 40.926 L
72.899 51.59 L
76.848 61.996 L
80.798 72.146 L
84.747 82.046 L
88.697 91.697 L
92.646 101.104 L
96.596 110.271 L
100.545 119.2 L
104.495 127.897 L
108.444 136.363 L
112.394 144.602 L
116.343 152.619 L
120.293 160.416 L
124.242 167.998 L
128.192 175.366 L
132.141 182.526 L
136.091 189.48 L
140.04 196.232 L
143.99 202.785 L
147.939 209.142 L
151.889 215.307 L
155.838 221.284 L
159.788 227.075 L
163.737 232.685 L
167.687 238.115 L
171.636 243.37 L
175.586 248.453 L
179.535 253.367 L
183.485 258.116 L
187.434 262.702 L
191.384 267.129 L
195.333 271.4 L
199.283 275.518 L
203.232 279.487 L
207.182 283.309 L
211.131 286.988 L
215.081 290.526 L
219.03 293.928 L
222.98 297.196 L
226.929 300.332 L
230.879 303.341 L
234.828 306.225 L
238.778 308.987 L
242.727 311.63 L
246.677 314.158 L
250.626 316.572 L
254.576 318.877 L
258.525 321.075 L
262.475 323.168 L
266.424 325.16 L
270.374 327.054 L
274.323 328.852 L
278.273 330.557 L
282.222 332.173 L
286.172 333.701 L
290.121 335.145 L
294.071 336.507 L
298.02 337.79 L
301.97 338.997 L
305.919 340.13 L
309.869 341.192 L
313.818 342.186 L
317.768 343.114 L
321.717 343.979 L
325.667 344.783 L
329.616 345.529 L
333.566 346.219 L
337.515 346.856 L
341.465 347.442 L
345.414 347.98 L
349.364 348.471 L
353.313 348.919 L
357.263 349.326 L
361.212 349.693 L
365.162 350.024 L
369.111 350.32 L
373.061 350.583 L
377.01 350.816 L
380.96 351.021 L
384.909 351.199 L
388.859 351.354 L
392.808 351.486 L
396.758 351.598 L
400.707 351.692 L
404.657 351.769 L
408.606 351.832 L
412.556 351.881 L
416.505 351.92 L
420.455 351.948 L
424.404 351.969 L
428.354 351.983 L
432.303 351.992 L
436.253 351.997 L
440.202 351.999 L
444.151 352 L
448.101 352 L
452.051 352 L
456 352 L
S
GR
GS
[0.75 0 0 0.75 0 0] CT
0.494 0.184 0.557 RC
[8 8] 0 setdash
2 LJ
2.667 LW
N
65 30 M
68.949 46.25 L
72.899 61.836 L
76.848 76.781 L
80.798 91.103 L
84.747 104.823 L
88.697 117.96 L
92.646 130.531 L
96.596 142.557 L
100.545 154.055 L
104.495 165.042 L
108.444 175.535 L
112.394 185.552 L
116.343 195.109 L
120.293 204.222 L
124.242 212.906 L
128.192 221.178 L
132.141 229.05 L
136.091 236.54 L
140.04 243.66 L
143.99 250.424 L
147.939 256.846 L
151.889 262.939 L
155.838 268.715 L
159.788 274.188 L
163.737 279.37 L
167.687 284.272 L
171.636 288.905 L
175.586 293.281 L
179.535 297.411 L
183.485 301.306 L
187.434 304.974 L
191.384 308.428 L
195.333 311.675 L
199.283 314.726 L
203.232 317.589 L
207.182 320.273 L
211.131 322.788 L
215.081 325.14 L
219.03 327.338 L
222.98 329.39 L
226.929 331.303 L
230.879 333.085 L
234.828 334.741 L
238.778 336.279 L
242.727 337.706 L
246.677 339.027 L
250.626 340.249 L
254.576 341.377 L
258.525 342.416 L
262.475 343.372 L
266.424 344.251 L
270.374 345.056 L
274.323 345.794 L
278.273 346.467 L
282.222 347.08 L
286.172 347.638 L
290.121 348.144 L
294.071 348.602 L
298.02 349.015 L
301.97 349.387 L
305.919 349.721 L
309.869 350.02 L
313.818 350.287 L
317.768 350.524 L
321.717 350.734 L
325.667 350.92 L
329.616 351.083 L
333.566 351.225 L
337.515 351.35 L
341.465 351.458 L
345.414 351.551 L
349.364 351.631 L
353.313 351.699 L
357.263 351.756 L
361.212 351.805 L
365.162 351.845 L
369.111 351.879 L
373.061 351.906 L
377.01 351.928 L
380.96 351.946 L
384.909 351.96 L
388.859 351.971 L
392.808 351.979 L
396.758 351.986 L
400.707 351.99 L
404.657 351.994 L
408.606 351.996 L
412.556 351.998 L
416.505 351.999 L
420.455 351.999 L
424.404 352 L
428.354 352 L
432.303 352 L
436.253 352 L
440.202 352 L
444.151 352 L
448.101 352 L
452.051 352 L
456 352 L
S
GR
GS
[0.75 0 0 0.75 0 0] CT
0.467 0.675 0.188 RC
[8 8] 0 setdash
2 LJ
2.667 LW
N
65 30 M
68.949 61.679 L
72.899 90.525 L
76.848 116.765 L
80.798 140.612 L
84.747 162.26 L
88.697 181.892 L
92.646 199.676 L
96.596 215.769 L
100.545 230.316 L
104.495 243.449 L
108.444 255.293 L
112.394 265.96 L
116.343 275.557 L
120.293 284.179 L
124.242 291.916 L
128.192 298.849 L
132.141 305.054 L
136.091 310.599 L
140.04 315.548 L
143.99 319.957 L
147.939 323.881 L
151.889 327.367 L
155.838 330.459 L
159.788 333.197 L
163.737 335.618 L
167.687 337.754 L
171.636 339.637 L
175.586 341.292 L
179.535 342.746 L
183.485 344.019 L
187.434 345.132 L
191.384 346.104 L
195.333 346.95 L
199.283 347.685 L
203.232 348.323 L
207.182 348.874 L
211.131 349.35 L
215.081 349.759 L
219.03 350.111 L
222.98 350.412 L
226.929 350.67 L
230.879 350.889 L
234.828 351.075 L
238.778 351.232 L
242.727 351.365 L
246.677 351.477 L
250.626 351.571 L
254.576 351.65 L
258.525 351.715 L
262.475 351.769 L
266.424 351.814 L
270.374 351.85 L
274.323 351.88 L
278.273 351.905 L
282.222 351.925 L
286.172 351.941 L
290.121 351.954 L
294.071 351.964 L
298.02 351.972 L
301.97 351.979 L
305.919 351.984 L
309.869 351.988 L
313.818 351.991 L
317.768 351.993 L
321.717 351.995 L
325.667 351.996 L
329.616 351.997 L
333.566 351.998 L
337.515 351.999 L
341.465 351.999 L
345.414 351.999 L
349.364 352 L
353.313 352 L
357.263 352 L
361.212 352 L
365.162 352 L
369.111 352 L
373.061 352 L
377.01 352 L
380.96 352 L
384.909 352 L
388.859 352 L
392.808 352 L
396.758 352 L
400.707 352 L
404.657 352 L
408.606 352 L
412.556 352 L
416.505 352 L
420.455 352 L
424.404 352 L
428.354 352 L
432.303 352 L
436.253 352 L
440.202 352 L
444.151 352 L
448.101 352 L
452.051 352 L
456 352 L
S
GR
GS
[0.75 0 0 0.75 0 0] CT
0.302 0.745 0.933 RC
[8 8] 0 setdash
2 LJ
2.667 LW
N
65 30 M
68.949 237.691 L
72.899 311.858 L
76.848 338.059 L
80.798 347.212 L
84.747 350.375 L
88.697 351.455 L
92.646 351.819 L
96.596 351.941 L
100.545 351.981 L
104.495 351.994 L
108.444 351.998 L
112.394 351.999 L
116.343 352 L
120.293 352 L
124.242 352 L
128.192 352 L
132.141 352 L
136.091 352 L
140.04 352 L
143.99 352 L
147.939 352 L
151.889 352 L
155.838 352 L
159.788 352 L
163.737 352 L
167.687 352 L
171.636 352 L
175.586 352 L
179.535 352 L
183.485 352 L
187.434 352 L
191.384 352 L
195.333 352 L
199.283 352 L
203.232 352 L
207.182 352 L
211.131 352 L
215.081 352 L
219.03 352 L
222.98 352 L
226.929 352 L
230.879 352 L
234.828 352 L
238.778 352 L
242.727 352 L
246.677 352 L
250.626 352 L
254.576 352 L
258.525 352 L
262.475 352 L
266.424 352 L
270.374 352 L
274.323 352 L
278.273 352 L
282.222 352 L
286.172 352 L
290.121 352 L
294.071 352 L
298.02 352 L
301.97 352 L
305.919 352 L
309.869 352 L
313.818 352 L
317.768 352 L
321.717 352 L
325.667 352 L
329.616 352 L
333.566 352 L
337.515 352 L
341.465 352 L
345.414 352 L
349.364 352 L
353.313 352 L
357.263 352 L
361.212 352 L
365.162 352 L
369.111 352 L
373.061 352 L
377.01 352 L
380.96 352 L
384.909 352 L
388.859 352 L
392.808 352 L
396.758 352 L
400.707 352 L
404.657 352 L
408.606 352 L
412.556 352 L
416.505 352 L
420.455 352 L
424.404 352 L
428.354 352 L
432.303 352 L
436.253 352 L
440.202 352 L
444.151 352 L
448.101 352 L
452.051 352 L
456 352 L
S
GR
GS
[0.75 0 0 0.75 0 0] CT
1 GC
N
753 352 M
753 30 L
467 30 L
467 352 L
cp
f
GR
GS
[0.75 0 0 0.75 385.52051 33] CT
N
4.984 5.019 M
3.766 5.019 2.781 4.394 QT
1.797 3.769 1.234 2.714 QT
0.672 1.659 0.672 0.487 QT
0.672 -0.7 1.227 -1.786 QT
1.781 -2.872 2.773 -3.52 QT
3.766 -4.169 4.984 -4.169 QT
6.156 -4.169 7.117 -3.708 QT
8.078 -3.247 8.078 -2.2 QT
8.078 -1.809 7.797 -1.52 QT
7.516 -1.231 7.125 -1.231 QT
6.719 -1.231 6.438 -1.52 QT
6.156 -1.809 6.156 -2.2 QT
6.156 -2.559 6.383 -2.817 QT
6.609 -3.075 6.938 -3.138 QT
6.25 -3.575 5 -3.575 QT
4.047 -3.575 3.461 -2.942 QT
2.875 -2.309 2.641 -1.372 QT
2.406 -0.434 2.406 0.487 QT
2.406 1.456 2.695 2.355 QT
2.984 3.253 3.625 3.847 QT
4.266 4.441 5.219 4.441 QT
6.172 4.441 6.836 3.855 QT
7.5 3.269 7.75 2.331 QT
7.75 2.222 7.906 2.222 QT
8.141 2.222 L
8.203 2.222 8.25 2.276 QT
8.297 2.331 8.297 2.394 QT
8.297 2.456 L
8 3.644 7.102 4.331 QT
6.203 5.019 4.984 5.019 QT
cp
f
GR
GS
[0.75 0 0 0.75 385.52051 33] CT
N
13.873 5.019 M
12.655 5.019 11.631 4.378 QT
10.608 3.737 10.03 2.675 QT
9.451 1.612 9.451 0.409 QT
9.451 -0.763 9.983 -1.817 QT
10.514 -2.872 11.467 -3.52 QT
12.42 -4.169 13.592 -4.169 QT
14.498 -4.169 15.178 -3.856 QT
15.858 -3.544 16.303 -2.997 QT
16.748 -2.45 16.967 -1.708 QT
17.186 -0.966 17.186 -0.091 QT
17.186 0.175 16.983 0.175 QT
11.201 0.175 L
11.201 0.394 L
11.201 2.05 11.865 3.245 QT
12.53 4.441 14.045 4.441 QT
14.655 4.441 15.178 4.167 QT
15.701 3.894 16.092 3.401 QT
16.483 2.909 16.608 2.362 QT
16.639 2.284 16.694 2.23 QT
16.748 2.175 16.811 2.175 QT
16.983 2.175 L
17.186 2.175 17.186 2.441 QT
16.905 3.566 15.967 4.292 QT
15.03 5.019 13.873 5.019 QT
cp
11.217 -0.325 M
15.78 -0.325 L
15.78 -1.075 15.569 -1.841 QT
15.358 -2.606 14.865 -3.122 QT
14.373 -3.638 13.592 -3.638 QT
12.451 -3.638 11.834 -2.575 QT
11.217 -1.513 11.217 -0.325 QT
cp
f
GR
GS
[0.75 0 0 0.75 385.52051 33] CT
N
18.372 4.8 M
18.372 4.097 L
19.059 4.097 19.497 3.987 QT
19.934 3.878 19.934 3.456 QT
19.934 -1.997 L
19.934 -2.528 19.778 -2.77 QT
19.622 -3.013 19.317 -3.067 QT
19.012 -3.122 18.372 -3.122 QT
18.372 -3.825 L
21.278 -4.044 L
21.278 -2.091 L
21.668 -2.95 22.457 -3.497 QT
23.247 -4.044 24.168 -4.044 QT
25.559 -4.044 26.262 -3.38 QT
26.965 -2.716 26.965 -1.341 QT
26.965 3.456 L
26.965 3.878 27.403 3.987 QT
27.84 4.097 28.528 4.097 QT
28.528 4.8 L
23.934 4.8 L
23.934 4.097 L
24.622 4.097 25.059 3.987 QT
25.497 3.878 25.497 3.456 QT
25.497 -1.278 L
25.497 -2.263 25.215 -2.895 QT
24.934 -3.528 24.059 -3.528 QT
22.903 -3.528 22.153 -2.599 QT
21.403 -1.669 21.403 -0.481 QT
21.403 3.456 L
21.403 3.878 21.84 3.987 QT
22.278 4.097 22.95 4.097 QT
22.95 4.8 L
18.372 4.8 L
cp
f
GR
GS
[0.75 0 0 0.75 385.52051 33] CT
N
29.686 2.831 M
29.686 1.644 30.623 0.894 QT
31.561 0.144 32.873 -0.161 QT
34.186 -0.466 35.373 -0.466 QT
35.373 -1.278 L
35.373 -1.856 35.123 -2.403 QT
34.873 -2.95 34.389 -3.294 QT
33.905 -3.638 33.326 -3.638 QT
31.998 -3.638 31.311 -3.044 QT
31.686 -3.044 31.936 -2.755 QT
32.186 -2.466 32.186 -2.091 QT
32.186 -1.684 31.905 -1.403 QT
31.623 -1.122 31.233 -1.122 QT
30.826 -1.122 30.545 -1.403 QT
30.264 -1.684 30.264 -2.091 QT
30.264 -3.138 31.225 -3.653 QT
32.186 -4.169 33.326 -4.169 QT
34.139 -4.169 34.959 -3.817 QT
35.78 -3.466 36.303 -2.825 QT
36.826 -2.184 36.826 -1.325 QT
36.826 3.175 L
36.826 3.566 36.99 3.894 QT
37.155 4.222 37.514 4.222 QT
37.842 4.222 38.006 3.894 QT
38.17 3.566 38.17 3.175 QT
38.17 1.894 L
38.748 1.894 L
38.748 3.175 L
38.748 3.628 38.514 4.034 QT
38.28 4.441 37.889 4.683 QT
37.498 4.925 37.03 4.925 QT
36.451 4.925 36.022 4.464 QT
35.592 4.003 35.545 3.378 QT
35.186 4.128 34.459 4.573 QT
33.733 5.019 32.92 5.019 QT
32.155 5.019 31.412 4.8 QT
30.67 4.581 30.178 4.097 QT
29.686 3.612 29.686 2.831 QT
cp
31.311 2.831 M
31.311 3.534 31.826 4.019 QT
32.342 4.503 33.045 4.503 QT
33.701 4.503 34.225 4.175 QT
34.748 3.847 35.061 3.292 QT
35.373 2.737 35.373 2.128 QT
35.373 0.05 L
34.467 0.05 33.514 0.347 QT
32.561 0.644 31.936 1.276 QT
31.311 1.909 31.311 2.831 QT
cp
f
GR
GS
[0.75 0 0 0.75 385.52051 33] CT
N
46.337 4.8 M
46.118 4.8 46.118 4.581 QT
46.118 4.425 L
46.118 4.347 46.165 4.284 QT
51.759 -3.294 L
49.962 -3.294 L
49.118 -3.294 48.563 -3.184 QT
48.009 -3.075 47.649 -2.778 QT
47.29 -2.481 47.134 -1.958 QT
46.977 -1.434 46.977 -0.528 QT
46.399 -0.528 L
46.618 -3.825 L
53.321 -3.825 L
53.415 -3.825 53.477 -3.763 QT
53.54 -3.7 53.54 -3.606 QT
53.54 -3.481 L
53.54 -3.419 53.493 -3.341 QT
47.899 4.222 L
49.821 4.222 L
50.681 4.222 51.267 4.112 QT
51.852 4.003 52.259 3.597 QT
52.634 3.222 52.774 2.573 QT
52.915 1.925 52.993 0.987 QT
53.571 0.987 L
53.227 4.8 L
46.337 4.8 L
cp
f
GR
GS
[0.75 0 0 0.75 385.52051 33] CT
N
55.241 2.831 M
55.241 1.644 56.179 0.894 QT
57.116 0.144 58.429 -0.161 QT
59.741 -0.466 60.929 -0.466 QT
60.929 -1.278 L
60.929 -1.856 60.679 -2.403 QT
60.429 -2.95 59.944 -3.294 QT
59.46 -3.638 58.882 -3.638 QT
57.554 -3.638 56.866 -3.044 QT
57.241 -3.044 57.491 -2.755 QT
57.741 -2.466 57.741 -2.091 QT
57.741 -1.684 57.46 -1.403 QT
57.179 -1.122 56.788 -1.122 QT
56.382 -1.122 56.101 -1.403 QT
55.819 -1.684 55.819 -2.091 QT
55.819 -3.138 56.78 -3.653 QT
57.741 -4.169 58.882 -4.169 QT
59.694 -4.169 60.515 -3.817 QT
61.335 -3.466 61.859 -2.825 QT
62.382 -2.184 62.382 -1.325 QT
62.382 3.175 L
62.382 3.566 62.546 3.894 QT
62.71 4.222 63.069 4.222 QT
63.398 4.222 63.562 3.894 QT
63.726 3.566 63.726 3.175 QT
63.726 1.894 L
64.304 1.894 L
64.304 3.175 L
64.304 3.628 64.069 4.034 QT
63.835 4.441 63.444 4.683 QT
63.054 4.925 62.585 4.925 QT
62.007 4.925 61.577 4.464 QT
61.148 4.003 61.101 3.378 QT
60.741 4.128 60.015 4.573 QT
59.288 5.019 58.476 5.019 QT
57.71 5.019 56.968 4.8 QT
56.226 4.581 55.734 4.097 QT
55.241 3.612 55.241 2.831 QT
cp
56.866 2.831 M
56.866 3.534 57.382 4.019 QT
57.898 4.503 58.601 4.503 QT
59.257 4.503 59.78 4.175 QT
60.304 3.847 60.616 3.292 QT
60.929 2.737 60.929 2.128 QT
60.929 0.05 L
60.023 0.05 59.069 0.347 QT
58.116 0.644 57.491 1.276 QT
56.866 1.909 56.866 2.831 QT
cp
f
GR
GS
[0.75 0 0 0.75 385.52051 33] CT
N
73.189 4.8 M
73.189 -7.044 L
73.189 -7.575 73.033 -7.817 QT
72.877 -8.059 72.572 -8.106 QT
72.267 -8.153 71.627 -8.153 QT
71.627 -8.856 L
74.596 -9.075 L
74.596 -2.825 L
74.924 -3.184 75.369 -3.466 QT
75.814 -3.747 76.322 -3.895 QT
76.83 -4.044 77.346 -4.044 QT
78.252 -4.044 79.017 -3.677 QT
79.783 -3.309 80.353 -2.677 QT
80.924 -2.044 81.236 -1.224 QT
81.549 -0.403 81.549 0.487 QT
81.549 1.691 80.963 2.737 QT
80.377 3.784 79.353 4.401 QT
78.33 5.019 77.111 5.019 QT
76.346 5.019 75.635 4.628 QT
74.924 4.237 74.455 3.597 QT
73.767 4.8 L
73.189 4.8 L
cp
74.642 2.831 M
74.986 3.566 75.611 4.034 QT
76.236 4.503 76.986 4.503 QT
78.033 4.503 78.666 3.901 QT
79.299 3.3 79.556 2.394 QT
79.814 1.487 79.814 0.487 QT
79.814 -1.2 79.377 -2.091 QT
79.174 -2.481 78.838 -2.809 QT
78.502 -3.138 78.088 -3.333 QT
77.674 -3.528 77.221 -3.528 QT
76.408 -3.528 75.728 -3.099 QT
75.049 -2.669 74.642 -1.966 QT
74.642 2.831 L
cp
f
GR
GS
[0.75 0 0 0.75 385.52051 33] CT
N
82.738 4.8 M
82.738 4.097 L
83.425 4.097 83.863 3.987 QT
84.3 3.878 84.3 3.456 QT
84.3 -1.997 L
84.3 -2.528 84.144 -2.77 QT
83.988 -3.013 83.683 -3.067 QT
83.379 -3.122 82.738 -3.122 QT
82.738 -3.825 L
85.597 -4.044 L
85.597 -2.091 L
85.925 -2.95 86.519 -3.497 QT
87.113 -4.044 87.972 -4.044 QT
88.566 -4.044 89.035 -3.692 QT
89.504 -3.341 89.504 -2.763 QT
89.504 -2.403 89.246 -2.13 QT
88.988 -1.856 88.597 -1.856 QT
88.222 -1.856 87.965 -2.122 QT
87.707 -2.388 87.707 -2.763 QT
87.707 -3.294 88.082 -3.528 QT
87.972 -3.528 L
87.16 -3.528 86.644 -2.942 QT
86.129 -2.356 85.918 -1.481 QT
85.707 -0.606 85.707 0.175 QT
85.707 3.456 L
85.707 4.097 87.644 4.097 QT
87.644 4.8 L
82.738 4.8 L
cp
f
GR
GS
[0.75 0 0 0.75 385.52051 33] CT
N
91.844 -7.528 M
92.156 -7.997 L
94.5 -6.638 L
96.828 -7.997 L
97.141 -7.528 L
94.5 -5.497 L
91.844 -7.528 L
cp
f
GR
GS
[0.75 0 0 0.75 385.52051 33] CT
N
90.837 4.8 M
90.618 4.8 90.618 4.581 QT
90.618 4.425 L
90.618 4.347 90.665 4.284 QT
96.259 -3.294 L
94.462 -3.294 L
93.618 -3.294 93.063 -3.184 QT
92.509 -3.075 92.149 -2.778 QT
91.79 -2.481 91.634 -1.958 QT
91.478 -1.434 91.478 -0.528 QT
90.899 -0.528 L
91.118 -3.825 L
97.821 -3.825 L
97.915 -3.825 97.978 -3.763 QT
98.04 -3.7 98.04 -3.606 QT
98.04 -3.481 L
98.04 -3.419 97.993 -3.341 QT
92.399 4.222 L
94.321 4.222 L
95.181 4.222 95.767 4.112 QT
96.353 4.003 96.759 3.597 QT
97.134 3.222 97.274 2.573 QT
97.415 1.925 97.493 0.987 QT
98.071 0.987 L
97.728 4.8 L
90.837 4.8 L
cp
f
GR
GS
[0.75 0 0 0.75 385.52051 33] CT
N
103.835 5.019 M
102.648 5.019 101.671 4.378 QT
100.695 3.737 100.155 2.698 QT
99.616 1.659 99.616 0.487 QT
99.616 -0.731 100.202 -1.77 QT
100.788 -2.809 101.804 -3.427 QT
102.82 -4.044 104.038 -4.044 QT
104.773 -4.044 105.429 -3.731 QT
106.085 -3.419 106.57 -2.872 QT
106.57 -7.044 L
106.57 -7.575 106.405 -7.817 QT
106.241 -8.059 105.945 -8.106 QT
105.648 -8.153 105.007 -8.153 QT
105.007 -8.856 L
107.976 -9.075 L
107.976 2.987 L
107.976 3.503 108.132 3.745 QT
108.288 3.987 108.585 4.042 QT
108.882 4.097 109.523 4.097 QT
109.523 4.8 L
106.507 5.019 L
106.507 3.769 L
105.991 4.362 105.273 4.691 QT
104.554 5.019 103.835 5.019 QT
cp
101.788 3.066 M
102.132 3.722 102.702 4.112 QT
103.273 4.503 103.945 4.503 QT
104.773 4.503 105.468 4.019 QT
106.163 3.534 106.507 2.784 QT
106.507 -2.013 L
106.273 -2.45 105.913 -2.802 QT
105.554 -3.153 105.109 -3.341 QT
104.663 -3.528 104.163 -3.528 QT
103.132 -3.528 102.491 -2.934 QT
101.851 -2.341 101.601 -1.419 QT
101.351 -0.497 101.351 0.503 QT
101.351 1.3 101.429 1.894 QT
101.507 2.487 101.788 3.066 QT
cp
f
GR
GS
[0.75 0 0 0.75 385.52051 33] CT
N
111.844 -7.528 M
112.156 -7.997 L
114.5 -6.638 L
116.828 -7.997 L
117.141 -7.528 L
114.5 -5.497 L
111.844 -7.528 L
cp
f
GR
GS
[0.75 0 0 0.75 385.52051 33] CT
N
115.04 5.019 M
113.821 5.019 112.798 4.378 QT
111.774 3.737 111.196 2.675 QT
110.618 1.612 110.618 0.409 QT
110.618 -0.763 111.149 -1.817 QT
111.681 -2.872 112.634 -3.52 QT
113.587 -4.169 114.759 -4.169 QT
115.665 -4.169 116.345 -3.856 QT
117.024 -3.544 117.47 -2.997 QT
117.915 -2.45 118.134 -1.708 QT
118.353 -0.966 118.353 -0.091 QT
118.353 0.175 118.149 0.175 QT
112.368 0.175 L
112.368 0.394 L
112.368 2.05 113.032 3.245 QT
113.696 4.441 115.212 4.441 QT
115.821 4.441 116.345 4.167 QT
116.868 3.894 117.259 3.401 QT
117.649 2.909 117.774 2.362 QT
117.806 2.284 117.86 2.23 QT
117.915 2.175 117.978 2.175 QT
118.149 2.175 L
118.353 2.175 118.353 2.441 QT
118.071 3.566 117.134 4.292 QT
116.196 5.019 115.04 5.019 QT
cp
112.384 -0.325 M
116.946 -0.325 L
116.946 -1.075 116.735 -1.841 QT
116.524 -2.606 116.032 -3.122 QT
115.54 -3.638 114.759 -3.638 QT
113.618 -3.638 113.001 -2.575 QT
112.384 -1.513 112.384 -0.325 QT
cp
f
GR
GS
[0.75 0 0 0.75 385.52051 33] CT
N
119.538 4.8 M
119.538 4.097 L
120.226 4.097 120.663 3.987 QT
121.101 3.878 121.101 3.456 QT
121.101 -1.997 L
121.101 -2.528 120.945 -2.77 QT
120.788 -3.013 120.484 -3.067 QT
120.179 -3.122 119.538 -3.122 QT
119.538 -3.825 L
122.445 -4.044 L
122.445 -2.091 L
122.835 -2.95 123.624 -3.497 QT
124.413 -4.044 125.335 -4.044 QT
126.726 -4.044 127.429 -3.38 QT
128.132 -2.716 128.132 -1.341 QT
128.132 3.456 L
128.132 3.878 128.57 3.987 QT
129.007 4.097 129.695 4.097 QT
129.695 4.8 L
125.101 4.8 L
125.101 4.097 L
125.788 4.097 126.226 3.987 QT
126.663 3.878 126.663 3.456 QT
126.663 -1.278 L
126.663 -2.263 126.382 -2.895 QT
126.101 -3.528 125.226 -3.528 QT
124.07 -3.528 123.32 -2.599 QT
122.57 -1.669 122.57 -0.481 QT
122.57 3.456 L
122.57 3.878 123.007 3.987 QT
123.445 4.097 124.116 4.097 QT
124.116 4.8 L
119.538 4.8 L
cp
f
GR
GS
[0.75 0 0 0.75 385.52051 33] CT
N
131.943 -5.778 M
134.333 -8.856 L
134.568 -9.169 134.912 -9.169 QT
135.224 -9.169 135.451 -8.942 QT
135.677 -8.716 135.677 -8.403 QT
135.677 -8.091 135.396 -7.841 QT
132.349 -5.372 L
131.943 -5.778 L
cp
f
GR
GS
[0.75 0 0 0.75 385.52051 33] CT
N
130.665 4.8 M
130.665 4.097 L
131.353 4.097 131.79 3.987 QT
132.228 3.878 132.228 3.456 QT
132.228 -1.997 L
132.228 -2.763 131.931 -2.942 QT
131.634 -3.122 130.759 -3.122 QT
130.759 -3.825 L
133.634 -4.044 L
133.634 3.456 L
133.634 3.878 134.017 3.987 QT
134.399 4.097 135.04 4.097 QT
135.04 4.8 L
130.665 4.8 L
cp
f
GR
GS
[0.75 0 0 0.75 0 0] CT
1 LJ
2.667 LW
N
471.002 44 M
511.026 44 L
S
GR
GS
[0.75 0 0 0.75 385.52051 51.37499] CT
N
/f-1983251996{4.984 5.019 M
3.766 5.019 2.781 4.394 QT
1.797 3.769 1.234 2.714 QT
0.672 1.659 0.672 0.487 QT
0.672 -0.7 1.227 -1.786 QT
1.781 -2.872 2.773 -3.52 QT
3.766 -4.169 4.984 -4.169 QT
6.156 -4.169 7.117 -3.708 QT
8.078 -3.247 8.078 -2.2 QT
8.078 -1.809 7.797 -1.52 QT
7.516 -1.231 7.125 -1.231 QT
6.719 -1.231 6.438 -1.52 QT
6.156 -1.809 6.156 -2.2 QT
6.156 -2.559 6.383 -2.817 QT
6.609 -3.075 6.938 -3.138 QT
6.25 -3.575 5 -3.575 QT
4.047 -3.575 3.461 -2.942 QT
2.875 -2.309 2.641 -1.372 QT
2.406 -0.434 2.406 0.487 QT
2.406 1.456 2.695 2.355 QT
2.984 3.253 3.625 3.847 QT
4.266 4.441 5.219 4.441 QT
6.172 4.441 6.836 3.855 QT
7.5 3.269 7.75 2.331 QT
7.75 2.222 7.906 2.222 QT
8.141 2.222 L
8.203 2.222 8.25 2.276 QT
8.297 2.331 8.297 2.394 QT
8.297 2.456 L
8 3.644 7.102 4.331 QT
6.203 5.019 4.984 5.019 QT
cp}def
f-1983251996
f
GR
GS
[0.75 0 0 0.75 385.52051 51.37499] CT
N
/f265761673{13.873 5.019 M
12.655 5.019 11.631 4.378 QT
10.608 3.737 10.03 2.675 QT
9.451 1.612 9.451 0.409 QT
9.451 -0.763 9.983 -1.817 QT
10.514 -2.872 11.467 -3.52 QT
12.42 -4.169 13.592 -4.169 QT
14.498 -4.169 15.178 -3.856 QT
15.858 -3.544 16.303 -2.997 QT
16.748 -2.45 16.967 -1.708 QT
17.186 -0.966 17.186 -0.091 QT
17.186 0.175 16.983 0.175 QT
11.201 0.175 L
11.201 0.394 L
11.201 2.05 11.865 3.245 QT
12.53 4.441 14.045 4.441 QT
14.655 4.441 15.178 4.167 QT
15.701 3.894 16.092 3.401 QT
16.483 2.909 16.608 2.362 QT
16.639 2.284 16.694 2.23 QT
16.748 2.175 16.811 2.175 QT
16.983 2.175 L
17.186 2.175 17.186 2.441 QT
16.905 3.566 15.967 4.292 QT
15.03 5.019 13.873 5.019 QT
cp
11.217 -0.325 M
15.78 -0.325 L
15.78 -1.075 15.569 -1.841 QT
15.358 -2.606 14.865 -3.122 QT
14.373 -3.638 13.592 -3.638 QT
12.451 -3.638 11.834 -2.575 QT
11.217 -1.513 11.217 -0.325 QT
cp}def
f265761673
f
GR
GS
[0.75 0 0 0.75 385.52051 51.37499] CT
N
/f-1882016182{18.372 4.8 M
18.372 4.097 L
19.059 4.097 19.497 3.987 QT
19.934 3.878 19.934 3.456 QT
19.934 -1.997 L
19.934 -2.528 19.778 -2.77 QT
19.622 -3.013 19.317 -3.067 QT
19.012 -3.122 18.372 -3.122 QT
18.372 -3.825 L
21.278 -4.044 L
21.278 -2.091 L
21.668 -2.95 22.457 -3.497 QT
23.247 -4.044 24.168 -4.044 QT
25.559 -4.044 26.262 -3.38 QT
26.965 -2.716 26.965 -1.341 QT
26.965 3.456 L
26.965 3.878 27.403 3.987 QT
27.84 4.097 28.528 4.097 QT
28.528 4.8 L
23.934 4.8 L
23.934 4.097 L
24.622 4.097 25.059 3.987 QT
25.497 3.878 25.497 3.456 QT
25.497 -1.278 L
25.497 -2.263 25.215 -2.895 QT
24.934 -3.528 24.059 -3.528 QT
22.903 -3.528 22.153 -2.599 QT
21.403 -1.669 21.403 -0.481 QT
21.403 3.456 L
21.403 3.878 21.84 3.987 QT
22.278 4.097 22.95 4.097 QT
22.95 4.8 L
18.372 4.8 L
cp}def
f-1882016182
f
GR
GS
[0.75 0 0 0.75 385.52051 51.37499] CT
N
/f-1660582890{29.686 2.831 M
29.686 1.644 30.623 0.894 QT
31.561 0.144 32.873 -0.161 QT
34.186 -0.466 35.373 -0.466 QT
35.373 -1.278 L
35.373 -1.856 35.123 -2.403 QT
34.873 -2.95 34.389 -3.294 QT
33.905 -3.638 33.326 -3.638 QT
31.998 -3.638 31.311 -3.044 QT
31.686 -3.044 31.936 -2.755 QT
32.186 -2.466 32.186 -2.091 QT
32.186 -1.684 31.905 -1.403 QT
31.623 -1.122 31.233 -1.122 QT
30.826 -1.122 30.545 -1.403 QT
30.264 -1.684 30.264 -2.091 QT
30.264 -3.138 31.225 -3.653 QT
32.186 -4.169 33.326 -4.169 QT
34.139 -4.169 34.959 -3.817 QT
35.78 -3.466 36.303 -2.825 QT
36.826 -2.184 36.826 -1.325 QT
36.826 3.175 L
36.826 3.566 36.99 3.894 QT
37.155 4.222 37.514 4.222 QT
37.842 4.222 38.006 3.894 QT
38.17 3.566 38.17 3.175 QT
38.17 1.894 L
38.748 1.894 L
38.748 3.175 L
38.748 3.628 38.514 4.034 QT
38.28 4.441 37.889 4.683 QT
37.498 4.925 37.03 4.925 QT
36.451 4.925 36.022 4.464 QT
35.592 4.003 35.545 3.378 QT
35.186 4.128 34.459 4.573 QT
33.733 5.019 32.92 5.019 QT
32.155 5.019 31.412 4.8 QT
30.67 4.581 30.178 4.097 QT
29.686 3.612 29.686 2.831 QT
cp
31.311 2.831 M
31.311 3.534 31.826 4.019 QT
32.342 4.503 33.045 4.503 QT
33.701 4.503 34.225 4.175 QT
34.748 3.847 35.061 3.292 QT
35.373 2.737 35.373 2.128 QT
35.373 0.05 L
34.467 0.05 33.514 0.347 QT
32.561 0.644 31.936 1.276 QT
31.311 1.909 31.311 2.831 QT
cp}def
f-1660582890
f
GR
GS
[0.75 0 0 0.75 385.52051 51.37499] CT
N
/f1397089790{46.337 4.8 M
46.118 4.8 46.118 4.581 QT
46.118 4.425 L
46.118 4.347 46.165 4.284 QT
51.759 -3.294 L
49.962 -3.294 L
49.118 -3.294 48.563 -3.184 QT
48.009 -3.075 47.649 -2.778 QT
47.29 -2.481 47.134 -1.958 QT
46.977 -1.434 46.977 -0.528 QT
46.399 -0.528 L
46.618 -3.825 L
53.321 -3.825 L
53.415 -3.825 53.477 -3.763 QT
53.54 -3.7 53.54 -3.606 QT
53.54 -3.481 L
53.54 -3.419 53.493 -3.341 QT
47.899 4.222 L
49.821 4.222 L
50.681 4.222 51.267 4.112 QT
51.852 4.003 52.259 3.597 QT
52.634 3.222 52.774 2.573 QT
52.915 1.925 52.993 0.987 QT
53.571 0.987 L
53.227 4.8 L
46.337 4.8 L
cp}def
f1397089790
f
GR
GS
[0.75 0 0 0.75 385.52051 51.37499] CT
N
/f-649568178{55.241 2.831 M
55.241 1.644 56.179 0.894 QT
57.116 0.144 58.429 -0.161 QT
59.741 -0.466 60.929 -0.466 QT
60.929 -1.278 L
60.929 -1.856 60.679 -2.403 QT
60.429 -2.95 59.944 -3.294 QT
59.46 -3.638 58.882 -3.638 QT
57.554 -3.638 56.866 -3.044 QT
57.241 -3.044 57.491 -2.755 QT
57.741 -2.466 57.741 -2.091 QT
57.741 -1.684 57.46 -1.403 QT
57.179 -1.122 56.788 -1.122 QT
56.382 -1.122 56.101 -1.403 QT
55.819 -1.684 55.819 -2.091 QT
55.819 -3.138 56.78 -3.653 QT
57.741 -4.169 58.882 -4.169 QT
59.694 -4.169 60.515 -3.817 QT
61.335 -3.466 61.859 -2.825 QT
62.382 -2.184 62.382 -1.325 QT
62.382 3.175 L
62.382 3.566 62.546 3.894 QT
62.71 4.222 63.069 4.222 QT
63.398 4.222 63.562 3.894 QT
63.726 3.566 63.726 3.175 QT
63.726 1.894 L
64.304 1.894 L
64.304 3.175 L
64.304 3.628 64.069 4.034 QT
63.835 4.441 63.444 4.683 QT
63.054 4.925 62.585 4.925 QT
62.007 4.925 61.577 4.464 QT
61.148 4.003 61.101 3.378 QT
60.741 4.128 60.015 4.573 QT
59.288 5.019 58.476 5.019 QT
57.71 5.019 56.968 4.8 QT
56.226 4.581 55.734 4.097 QT
55.241 3.612 55.241 2.831 QT
cp
56.866 2.831 M
56.866 3.534 57.382 4.019 QT
57.898 4.503 58.601 4.503 QT
59.257 4.503 59.78 4.175 QT
60.304 3.847 60.616 3.292 QT
60.929 2.737 60.929 2.128 QT
60.929 0.05 L
60.023 0.05 59.069 0.347 QT
58.116 0.644 57.491 1.276 QT
56.866 1.909 56.866 2.831 QT
cp}def
f-649568178
f
GR
GS
[0.75 0 0 0.75 385.52051 51.37499] CT
N
/f-1529780539{71.627 8.675 M
71.627 7.987 L
72.314 7.987 72.752 7.87 QT
73.189 7.753 73.189 7.347 QT
73.189 -2.294 L
73.189 -2.841 72.799 -2.981 QT
72.408 -3.122 71.627 -3.122 QT
71.627 -3.825 L
74.596 -4.044 L
74.596 -2.794 L
75.142 -3.403 75.869 -3.724 QT
76.596 -4.044 77.408 -4.044 QT
78.596 -4.044 79.541 -3.403 QT
80.486 -2.763 81.017 -1.724 QT
81.549 -0.684 81.549 0.487 QT
81.549 1.691 80.963 2.737 QT
80.377 3.784 79.353 4.401 QT
78.33 5.019 77.111 5.019 QT
75.658 5.019 74.642 3.847 QT
74.642 7.347 L
74.642 7.753 75.088 7.87 QT
75.533 7.987 76.205 7.987 QT
76.205 8.675 L
71.627 8.675 L
cp
74.642 2.862 M
75.002 3.566 75.627 4.034 QT
76.252 4.503 76.986 4.503 QT
77.689 4.503 78.221 4.128 QT
78.752 3.753 79.111 3.128 QT
79.471 2.503 79.642 1.816 QT
79.814 1.128 79.814 0.487 QT
79.814 -0.325 79.525 -1.255 QT
79.236 -2.184 78.642 -2.825 QT
78.049 -3.466 77.221 -3.466 QT
76.408 -3.466 75.728 -3.052 QT
75.049 -2.638 74.642 -1.919 QT
74.642 2.862 L
cp}def
f-1529780539
f
GR
GS
[0.75 0 0 0.75 385.52051 51.37499] CT
N
/f1724082257{83.483 -7.528 M
83.795 -7.997 L
86.139 -6.638 L
88.467 -7.997 L
88.78 -7.528 L
86.139 -5.497 L
83.483 -7.528 L
cp}def
f1724082257
f
GR
GS
[0.75 0 0 0.75 385.52051 51.37499] CT
N
/f1931575791{82.738 4.8 M
82.738 4.097 L
83.425 4.097 83.863 3.987 QT
84.3 3.878 84.3 3.456 QT
84.3 -1.997 L
84.3 -2.528 84.144 -2.77 QT
83.988 -3.013 83.683 -3.067 QT
83.379 -3.122 82.738 -3.122 QT
82.738 -3.825 L
85.597 -4.044 L
85.597 -2.091 L
85.925 -2.95 86.519 -3.497 QT
87.113 -4.044 87.972 -4.044 QT
88.566 -4.044 89.035 -3.692 QT
89.504 -3.341 89.504 -2.763 QT
89.504 -2.403 89.246 -2.13 QT
88.988 -1.856 88.597 -1.856 QT
88.222 -1.856 87.965 -2.122 QT
87.707 -2.388 87.707 -2.763 QT
87.707 -3.294 88.082 -3.528 QT
87.972 -3.528 L
87.16 -3.528 86.644 -2.942 QT
86.129 -2.356 85.918 -1.481 QT
85.707 -0.606 85.707 0.175 QT
85.707 3.456 L
85.707 4.097 87.644 4.097 QT
87.644 4.8 L
82.738 4.8 L
cp}def
f1931575791
f
GR
GS
[0.75 0 0 0.75 385.52051 51.37499] CT
N
/f569440830{95.04 5.019 M
93.821 5.019 92.798 4.378 QT
91.774 3.737 91.196 2.675 QT
90.618 1.612 90.618 0.409 QT
90.618 -0.763 91.149 -1.817 QT
91.681 -2.872 92.634 -3.52 QT
93.587 -4.169 94.759 -4.169 QT
95.665 -4.169 96.345 -3.856 QT
97.024 -3.544 97.47 -2.997 QT
97.915 -2.45 98.134 -1.708 QT
98.353 -0.966 98.353 -0.091 QT
98.353 0.175 98.149 0.175 QT
92.368 0.175 L
92.368 0.394 L
92.368 2.05 93.032 3.245 QT
93.696 4.441 95.212 4.441 QT
95.821 4.441 96.345 4.167 QT
96.868 3.894 97.259 3.401 QT
97.649 2.909 97.774 2.362 QT
97.806 2.284 97.86 2.23 QT
97.915 2.175 97.978 2.175 QT
98.149 2.175 L
98.353 2.175 98.353 2.441 QT
98.071 3.566 97.134 4.292 QT
96.196 5.019 95.04 5.019 QT
cp
92.384 -0.325 M
96.946 -0.325 L
96.946 -1.075 96.735 -1.841 QT
96.524 -2.606 96.032 -3.122 QT
95.54 -3.638 94.759 -3.638 QT
93.618 -3.638 93.001 -2.575 QT
92.384 -1.513 92.384 -0.325 QT
cp}def
f569440830
f
GR
GS
[0.75 0 0 0.75 385.52051 51.37499] CT
N
/f505479896{103.835 5.019 M
102.648 5.019 101.671 4.378 QT
100.695 3.737 100.155 2.698 QT
99.616 1.659 99.616 0.487 QT
99.616 -0.731 100.202 -1.77 QT
100.788 -2.809 101.804 -3.427 QT
102.82 -4.044 104.038 -4.044 QT
104.773 -4.044 105.429 -3.731 QT
106.085 -3.419 106.57 -2.872 QT
106.57 -7.044 L
106.57 -7.575 106.405 -7.817 QT
106.241 -8.059 105.945 -8.106 QT
105.648 -8.153 105.007 -8.153 QT
105.007 -8.856 L
107.976 -9.075 L
107.976 2.987 L
107.976 3.503 108.132 3.745 QT
108.288 3.987 108.585 4.042 QT
108.882 4.097 109.523 4.097 QT
109.523 4.8 L
106.507 5.019 L
106.507 3.769 L
105.991 4.362 105.273 4.691 QT
104.554 5.019 103.835 5.019 QT
cp
101.788 3.066 M
102.132 3.722 102.702 4.112 QT
103.273 4.503 103.945 4.503 QT
104.773 4.503 105.468 4.019 QT
106.163 3.534 106.507 2.784 QT
106.507 -2.013 L
106.273 -2.45 105.913 -2.802 QT
105.554 -3.153 105.109 -3.341 QT
104.663 -3.528 104.163 -3.528 QT
103.132 -3.528 102.491 -2.934 QT
101.851 -2.341 101.601 -1.419 QT
101.351 -0.497 101.351 0.503 QT
101.351 1.3 101.429 1.894 QT
101.507 2.487 101.788 3.066 QT
cp}def
f505479896
f
GR
GS
[0.75 0 0 0.75 385.52051 51.37499] CT
N
/f1498646898{111.844 -7.528 M
112.156 -7.997 L
114.5 -6.638 L
116.828 -7.997 L
117.141 -7.528 L
114.5 -5.497 L
111.844 -7.528 L
cp}def
f1498646898
f
GR
GS
[0.75 0 0 0.75 385.52051 51.37499] CT
N
/f-1149792252{115.04 5.019 M
113.821 5.019 112.837 4.394 QT
111.853 3.769 111.29 2.714 QT
110.728 1.659 110.728 0.487 QT
110.728 -0.7 111.282 -1.786 QT
111.837 -2.872 112.829 -3.52 QT
113.821 -4.169 115.04 -4.169 QT
116.212 -4.169 117.173 -3.708 QT
118.134 -3.247 118.134 -2.2 QT
118.134 -1.809 117.853 -1.52 QT
117.571 -1.231 117.181 -1.231 QT
116.774 -1.231 116.493 -1.52 QT
116.212 -1.809 116.212 -2.2 QT
116.212 -2.559 116.439 -2.817 QT
116.665 -3.075 116.993 -3.138 QT
116.306 -3.575 115.056 -3.575 QT
114.103 -3.575 113.517 -2.942 QT
112.931 -2.309 112.696 -1.372 QT
112.462 -0.434 112.462 0.487 QT
112.462 1.456 112.751 2.355 QT
113.04 3.253 113.681 3.847 QT
114.321 4.441 115.274 4.441 QT
116.228 4.441 116.892 3.855 QT
117.556 3.269 117.806 2.331 QT
117.806 2.222 117.962 2.222 QT
118.196 2.222 L
118.259 2.222 118.306 2.276 QT
118.353 2.331 118.353 2.394 QT
118.353 2.456 L
118.056 3.644 117.157 4.331 QT
116.259 5.019 115.04 5.019 QT
cp}def
f-1149792252
f
GR
GS
[0.75 0 0 0.75 385.52051 51.37499] CT
N
/f467272633{119.741 2.831 M
119.741 1.644 120.679 0.894 QT
121.616 0.144 122.929 -0.161 QT
124.241 -0.466 125.429 -0.466 QT
125.429 -1.278 L
125.429 -1.856 125.179 -2.403 QT
124.929 -2.95 124.445 -3.294 QT
123.96 -3.638 123.382 -3.638 QT
122.054 -3.638 121.366 -3.044 QT
121.741 -3.044 121.991 -2.755 QT
122.241 -2.466 122.241 -2.091 QT
122.241 -1.684 121.96 -1.403 QT
121.679 -1.122 121.288 -1.122 QT
120.882 -1.122 120.601 -1.403 QT
120.32 -1.684 120.32 -2.091 QT
120.32 -3.138 121.281 -3.653 QT
122.241 -4.169 123.382 -4.169 QT
124.195 -4.169 125.015 -3.817 QT
125.835 -3.466 126.359 -2.825 QT
126.882 -2.184 126.882 -1.325 QT
126.882 3.175 L
126.882 3.566 127.046 3.894 QT
127.21 4.222 127.57 4.222 QT
127.898 4.222 128.062 3.894 QT
128.226 3.566 128.226 3.175 QT
128.226 1.894 L
128.804 1.894 L
128.804 3.175 L
128.804 3.628 128.57 4.034 QT
128.335 4.441 127.945 4.683 QT
127.554 4.925 127.085 4.925 QT
126.507 4.925 126.077 4.464 QT
125.648 4.003 125.601 3.378 QT
125.241 4.128 124.515 4.573 QT
123.788 5.019 122.976 5.019 QT
122.21 5.019 121.468 4.8 QT
120.726 4.581 120.234 4.097 QT
119.741 3.612 119.741 2.831 QT
cp
121.366 2.831 M
121.366 3.534 121.882 4.019 QT
122.398 4.503 123.101 4.503 QT
123.757 4.503 124.281 4.175 QT
124.804 3.847 125.116 3.292 QT
125.429 2.737 125.429 2.128 QT
125.429 0.05 L
124.523 0.05 123.57 0.347 QT
122.616 0.644 121.991 1.276 QT
121.366 1.909 121.366 2.831 QT
cp}def
f467272633
f
GR
GS
[0.75 0 0 0.75 385.52051 51.37499] CT
N
/f-986605712{129.616 4.862 M
129.616 1.597 L
129.616 1.441 129.788 1.441 QT
130.023 1.441 L
130.148 1.441 130.179 1.597 QT
130.741 4.503 132.882 4.503 QT
133.835 4.503 134.468 4.073 QT
135.101 3.644 135.101 2.737 QT
135.101 2.097 134.609 1.644 QT
134.116 1.191 133.429 1.019 QT
132.085 0.753 L
131.413 0.612 130.866 0.308 QT
130.32 0.003 129.968 -0.497 QT
129.616 -0.997 129.616 -1.669 QT
129.616 -2.544 130.077 -3.106 QT
130.538 -3.669 131.281 -3.919 QT
132.023 -4.169 132.882 -4.169 QT
133.913 -4.169 134.663 -3.622 QT
135.241 -4.122 L
135.241 -4.169 135.335 -4.169 QT
135.491 -4.169 L
135.554 -4.169 135.601 -4.114 QT
135.648 -4.059 135.648 -3.997 QT
135.648 -1.388 L
135.648 -1.2 135.491 -1.2 QT
135.241 -1.2 L
135.07 -1.2 135.07 -1.388 QT
135.07 -2.434 134.491 -3.067 QT
133.913 -3.7 132.866 -3.7 QT
131.96 -3.7 131.304 -3.364 QT
130.648 -3.028 130.648 -2.216 QT
130.648 -1.669 131.116 -1.309 QT
131.585 -0.95 132.226 -0.794 QT
133.585 -0.544 L
134.273 -0.388 134.859 -0.013 QT
135.445 0.362 135.796 0.925 QT
136.148 1.487 136.148 2.206 QT
136.148 2.925 135.898 3.456 QT
135.648 3.987 135.202 4.339 QT
134.757 4.691 134.148 4.855 QT
133.538 5.019 132.882 5.019 QT
131.632 5.019 130.741 4.191 QT
130.007 4.972 L
130.007 5.019 129.898 5.019 QT
129.788 5.019 L
129.616 5.019 129.616 4.862 QT
cp}def
f-986605712
f
GR
GS
[0.75 0 0 0.75 385.52051 51.37499] CT
N
/f-1315281312{137.427 4.8 M
137.427 4.097 L
138.115 4.097 138.552 3.987 QT
138.99 3.878 138.99 3.456 QT
138.99 -1.997 L
138.99 -2.528 138.833 -2.77 QT
138.677 -3.013 138.373 -3.067 QT
138.068 -3.122 137.427 -3.122 QT
137.427 -3.825 L
140.333 -4.044 L
140.333 -2.091 L
140.724 -2.95 141.513 -3.497 QT
142.302 -4.044 143.224 -4.044 QT
144.615 -4.044 145.318 -3.38 QT
146.021 -2.716 146.021 -1.341 QT
146.021 3.456 L
146.021 3.878 146.458 3.987 QT
146.896 4.097 147.583 4.097 QT
147.583 4.8 L
142.99 4.8 L
142.99 4.097 L
143.677 4.097 144.115 3.987 QT
144.552 3.878 144.552 3.456 QT
144.552 -1.278 L
144.552 -2.263 144.271 -2.895 QT
143.99 -3.528 143.115 -3.528 QT
141.958 -3.528 141.208 -2.599 QT
140.458 -1.669 140.458 -0.481 QT
140.458 3.456 L
140.458 3.878 140.896 3.987 QT
141.333 4.097 142.005 4.097 QT
142.005 4.8 L
137.427 4.8 L
cp}def
f-1315281312
f
GR
GS
[0.75 0 0 0.75 385.52051 51.37499] CT
N
/f-1670348492{151.498 -5.778 M
153.889 -8.856 L
154.123 -9.169 154.467 -9.169 QT
154.78 -9.169 155.006 -8.942 QT
155.233 -8.716 155.233 -8.403 QT
155.233 -8.091 154.952 -7.841 QT
151.905 -5.372 L
151.498 -5.778 L
cp}def
f-1670348492
f
GR
GS
[0.75 0 0 0.75 385.52051 51.37499] CT
N
/f55200843{152.929 5.019 M
151.71 5.019 150.687 4.378 QT
149.663 3.737 149.085 2.675 QT
148.507 1.612 148.507 0.409 QT
148.507 -0.763 149.038 -1.817 QT
149.57 -2.872 150.523 -3.52 QT
151.476 -4.169 152.648 -4.169 QT
153.554 -4.169 154.234 -3.856 QT
154.913 -3.544 155.359 -2.997 QT
155.804 -2.45 156.023 -1.708 QT
156.242 -0.966 156.242 -0.091 QT
156.242 0.175 156.038 0.175 QT
150.257 0.175 L
150.257 0.394 L
150.257 2.05 150.921 3.245 QT
151.585 4.441 153.101 4.441 QT
153.71 4.441 154.234 4.167 QT
154.757 3.894 155.148 3.401 QT
155.538 2.909 155.663 2.362 QT
155.695 2.284 155.749 2.23 QT
155.804 2.175 155.867 2.175 QT
156.038 2.175 L
156.242 2.175 156.242 2.441 QT
155.96 3.566 155.023 4.292 QT
154.085 5.019 152.929 5.019 QT
cp
150.273 -0.325 M
154.835 -0.325 L
154.835 -1.075 154.624 -1.841 QT
154.413 -2.606 153.921 -3.122 QT
153.429 -3.638 152.648 -3.638 QT
151.507 -3.638 150.89 -2.575 QT
150.273 -1.513 150.273 -0.325 QT
cp}def
f55200843
f
GR
GS
[0.75 0 0 0.75 385.52051 51.37499] CT
N
/f938515561{164.172 4.862 M
164.172 1.597 L
164.172 1.441 164.344 1.441 QT
164.578 1.441 L
164.703 1.441 164.735 1.597 QT
165.297 4.503 167.438 4.503 QT
168.391 4.503 169.024 4.073 QT
169.656 3.644 169.656 2.737 QT
169.656 2.097 169.164 1.644 QT
168.672 1.191 167.985 1.019 QT
166.641 0.753 L
165.969 0.612 165.422 0.308 QT
164.875 0.003 164.524 -0.497 QT
164.172 -0.997 164.172 -1.669 QT
164.172 -2.544 164.633 -3.106 QT
165.094 -3.669 165.836 -3.919 QT
166.578 -4.169 167.438 -4.169 QT
168.469 -4.169 169.219 -3.622 QT
169.797 -4.122 L
169.797 -4.169 169.891 -4.169 QT
170.047 -4.169 L
170.11 -4.169 170.156 -4.114 QT
170.203 -4.059 170.203 -3.997 QT
170.203 -1.388 L
170.203 -1.2 170.047 -1.2 QT
169.797 -1.2 L
169.625 -1.2 169.625 -1.388 QT
169.625 -2.434 169.047 -3.067 QT
168.469 -3.7 167.422 -3.7 QT
166.516 -3.7 165.86 -3.364 QT
165.203 -3.028 165.203 -2.216 QT
165.203 -1.669 165.672 -1.309 QT
166.141 -0.95 166.781 -0.794 QT
168.141 -0.544 L
168.828 -0.388 169.414 -0.013 QT
170 0.362 170.352 0.925 QT
170.703 1.487 170.703 2.206 QT
170.703 2.925 170.453 3.456 QT
170.203 3.987 169.758 4.339 QT
169.313 4.691 168.703 4.855 QT
168.094 5.019 167.438 5.019 QT
166.188 5.019 165.297 4.191 QT
164.563 4.972 L
164.563 5.019 164.453 5.019 QT
164.344 5.019 L
164.172 5.019 164.172 4.862 QT
cp}def
f938515561
f
GR
GS
[0.75 0 0 0.75 385.52051 51.37499] CT
N
/f1230812839{171.905 8.675 M
171.905 7.987 L
172.592 7.987 173.03 7.87 QT
173.467 7.753 173.467 7.347 QT
173.467 -2.294 L
173.467 -2.841 173.077 -2.981 QT
172.686 -3.122 171.905 -3.122 QT
171.905 -3.825 L
174.873 -4.044 L
174.873 -2.794 L
175.42 -3.403 176.147 -3.724 QT
176.873 -4.044 177.686 -4.044 QT
178.873 -4.044 179.819 -3.403 QT
180.764 -2.763 181.295 -1.724 QT
181.827 -0.684 181.827 0.487 QT
181.827 1.691 181.241 2.737 QT
180.655 3.784 179.631 4.401 QT
178.608 5.019 177.389 5.019 QT
175.936 5.019 174.92 3.847 QT
174.92 7.347 L
174.92 7.753 175.366 7.87 QT
175.811 7.987 176.483 7.987 QT
176.483 8.675 L
171.905 8.675 L
cp
174.92 2.862 M
175.28 3.566 175.905 4.034 QT
176.53 4.503 177.264 4.503 QT
177.967 4.503 178.498 4.128 QT
179.03 3.753 179.389 3.128 QT
179.748 2.503 179.92 1.816 QT
180.092 1.128 180.092 0.487 QT
180.092 -0.325 179.803 -1.255 QT
179.514 -2.184 178.92 -2.825 QT
178.327 -3.466 177.498 -3.466 QT
176.686 -3.466 176.006 -3.052 QT
175.327 -2.638 174.92 -1.919 QT
174.92 2.862 L
cp}def
f1230812839
f
GR
GS
[0.75 0 0 0.75 385.52051 51.37499] CT
N
/f983854{184.656 2.409 M
184.656 -1.997 L
184.656 -2.528 184.5 -2.77 QT
184.344 -3.013 184.039 -3.067 QT
183.735 -3.122 183.094 -3.122 QT
183.094 -3.825 L
186.125 -4.044 L
186.125 2.409 L
186.125 3.191 186.235 3.628 QT
186.344 4.066 186.711 4.284 QT
187.078 4.503 187.875 4.503 QT
188.953 4.503 189.586 3.605 QT
190.219 2.706 190.219 1.55 QT
190.219 -1.997 L
190.219 -2.528 190.055 -2.77 QT
189.891 -3.013 189.594 -3.067 QT
189.297 -3.122 188.656 -3.122 QT
188.656 -3.825 L
191.688 -4.044 L
191.688 2.987 L
191.688 3.503 191.844 3.745 QT
192 3.987 192.305 4.042 QT
192.61 4.097 193.25 4.097 QT
193.25 4.8 L
190.281 5.019 L
190.281 3.331 L
189.906 4.081 189.242 4.55 QT
188.578 5.019 187.781 5.019 QT
186.344 5.019 185.5 4.409 QT
184.656 3.8 184.656 2.409 QT
cp}def
f983854
f
GR
GS
[0.75 0 0 0.75 385.52051 51.37499] CT
N
/f-2111252456{194.9 -7.528 M
195.212 -7.997 L
197.556 -6.638 L
199.884 -7.997 L
200.196 -7.528 L
197.556 -5.497 L
194.9 -7.528 L
cp}def
f-2111252456
f
GR
GS
[0.75 0 0 0.75 385.52051 51.37499] CT
N
/f-1297267303{194.283 4.862 M
194.283 1.597 L
194.283 1.441 194.455 1.441 QT
194.689 1.441 L
194.814 1.441 194.846 1.597 QT
195.408 4.503 197.549 4.503 QT
198.502 4.503 199.135 4.073 QT
199.768 3.644 199.768 2.737 QT
199.768 2.097 199.275 1.644 QT
198.783 1.191 198.096 1.019 QT
196.752 0.753 L
196.08 0.612 195.533 0.308 QT
194.986 0.003 194.635 -0.497 QT
194.283 -0.997 194.283 -1.669 QT
194.283 -2.544 194.744 -3.106 QT
195.205 -3.669 195.947 -3.919 QT
196.689 -4.169 197.549 -4.169 QT
198.58 -4.169 199.33 -3.622 QT
199.908 -4.122 L
199.908 -4.169 200.002 -4.169 QT
200.158 -4.169 L
200.221 -4.169 200.268 -4.114 QT
200.314 -4.059 200.314 -3.997 QT
200.314 -1.388 L
200.314 -1.2 200.158 -1.2 QT
199.908 -1.2 L
199.736 -1.2 199.736 -1.388 QT
199.736 -2.434 199.158 -3.067 QT
198.58 -3.7 197.533 -3.7 QT
196.627 -3.7 195.971 -3.364 QT
195.314 -3.028 195.314 -2.216 QT
195.314 -1.669 195.783 -1.309 QT
196.252 -0.95 196.893 -0.794 QT
198.252 -0.544 L
198.939 -0.388 199.525 -0.013 QT
200.111 0.362 200.463 0.925 QT
200.814 1.487 200.814 2.206 QT
200.814 2.925 200.564 3.456 QT
200.314 3.987 199.869 4.339 QT
199.424 4.691 198.814 4.855 QT
198.205 5.019 197.549 5.019 QT
196.299 5.019 195.408 4.191 QT
194.674 4.972 L
194.674 5.019 194.564 5.019 QT
194.455 5.019 L
194.283 5.019 194.283 4.862 QT
cp}def
f-1297267303
f
GR
GS
[0.75 0 0 0.75 385.52051 51.37499] CT
N
/f-726111576{203.547 2.394 M
203.547 -3.122 L
201.875 -3.122 L
201.875 -3.638 L
203.188 -3.638 203.805 -4.856 QT
204.422 -6.075 204.422 -7.513 QT
205 -7.513 L
205 -3.825 L
207.813 -3.825 L
207.813 -3.122 L
205 -3.122 L
205 2.362 L
205 3.191 205.274 3.816 QT
205.547 4.441 206.281 4.441 QT
206.953 4.441 207.258 3.776 QT
207.563 3.112 207.563 2.362 QT
207.563 1.175 L
208.141 1.175 L
208.141 2.394 L
208.141 3.019 207.914 3.628 QT
207.688 4.237 207.235 4.628 QT
206.781 5.019 206.141 5.019 QT
204.938 5.019 204.242 4.3 QT
203.547 3.581 203.547 2.394 QT
cp}def
f-726111576
f
GR
GS
[0.75 0 0 0.75 385.52051 51.37499] CT
N
/f1375902548{211.066 -7.528 M
211.379 -7.997 L
213.722 -6.638 L
216.051 -7.997 L
216.363 -7.528 L
213.722 -5.497 L
211.066 -7.528 L
cp}def
f1375902548
f
GR
GS
[0.75 0 0 0.75 385.52051 51.37499] CT
N
/f413755601{214.262 5.019 M
213.044 5.019 212.02 4.378 QT
210.997 3.737 210.419 2.675 QT
209.841 1.612 209.841 0.409 QT
209.841 -0.763 210.372 -1.817 QT
210.903 -2.872 211.856 -3.52 QT
212.809 -4.169 213.981 -4.169 QT
214.887 -4.169 215.567 -3.856 QT
216.247 -3.544 216.692 -2.997 QT
217.137 -2.45 217.356 -1.708 QT
217.575 -0.966 217.575 -0.091 QT
217.575 0.175 217.372 0.175 QT
211.591 0.175 L
211.591 0.394 L
211.591 2.05 212.255 3.245 QT
212.919 4.441 214.434 4.441 QT
215.044 4.441 215.567 4.167 QT
216.091 3.894 216.481 3.401 QT
216.872 2.909 216.997 2.362 QT
217.028 2.284 217.083 2.23 QT
217.137 2.175 217.2 2.175 QT
217.372 2.175 L
217.575 2.175 217.575 2.441 QT
217.294 3.566 216.356 4.292 QT
215.419 5.019 214.262 5.019 QT
cp
211.606 -0.325 M
216.169 -0.325 L
216.169 -1.075 215.958 -1.841 QT
215.747 -2.606 215.255 -3.122 QT
214.762 -3.638 213.981 -3.638 QT
212.841 -3.638 212.223 -2.575 QT
211.606 -1.513 211.606 -0.325 QT
cp}def
f413755601
f
GR
GS
[0.75 0 0 0.75 385.52051 51.37499] CT
N
/f-263686975{218.761 4.8 M
218.761 4.097 L
219.448 4.097 219.886 3.987 QT
220.323 3.878 220.323 3.456 QT
220.323 -1.997 L
220.323 -2.528 220.167 -2.77 QT
220.011 -3.013 219.706 -3.067 QT
219.401 -3.122 218.761 -3.122 QT
218.761 -3.825 L
221.667 -4.044 L
221.667 -2.091 L
222.058 -2.95 222.847 -3.497 QT
223.636 -4.044 224.558 -4.044 QT
225.948 -4.044 226.651 -3.38 QT
227.354 -2.716 227.354 -1.341 QT
227.354 3.456 L
227.354 3.878 227.792 3.987 QT
228.229 4.097 228.917 4.097 QT
228.917 4.8 L
224.323 4.8 L
224.323 4.097 L
225.011 4.097 225.448 3.987 QT
225.886 3.878 225.886 3.456 QT
225.886 -1.278 L
225.886 -2.263 225.604 -2.895 QT
225.323 -3.528 224.448 -3.528 QT
223.292 -3.528 222.542 -2.599 QT
221.792 -1.669 221.792 -0.481 QT
221.792 3.456 L
221.792 3.878 222.229 3.987 QT
222.667 4.097 223.339 4.097 QT
223.339 4.8 L
218.761 4.8 L
cp}def
f-263686975
f
GR
GS
[0.75 0 0 0.75 385.52051 51.37499] CT
N
/f1241123755{231.165 -5.778 M
233.556 -8.856 L
233.79 -9.169 234.134 -9.169 QT
234.446 -9.169 234.673 -8.942 QT
234.9 -8.716 234.9 -8.403 QT
234.9 -8.091 234.618 -7.841 QT
231.571 -5.372 L
231.165 -5.778 L
cp}def
f1241123755
f
GR
GS
[0.75 0 0 0.75 385.52051 51.37499] CT
N
/f992436318{229.887 4.8 M
229.887 4.097 L
230.575 4.097 231.012 3.987 QT
231.45 3.878 231.45 3.456 QT
231.45 -1.997 L
231.45 -2.763 231.153 -2.942 QT
230.856 -3.122 229.981 -3.122 QT
229.981 -3.825 L
232.856 -4.044 L
232.856 3.456 L
232.856 3.878 233.239 3.987 QT
233.622 4.097 234.262 4.097 QT
234.262 4.8 L
229.887 4.8 L
cp}def
f992436318
f
GR
GS
[0.75 0 0 0.75 0 0] CT
[8 8] 0 setdash
2 LJ
2.667 LW
N
471.002 68.5 M
511.026 68.5 L
S
GR
GS
[0.75 0 0 0.75 385.52051 69.75001] CT
N
/f1730393676{0.672 4.8 M
0.672 4.097 L
2.719 4.097 2.719 3.456 QT
2.719 -7.528 L
2.719 -8.153 0.672 -8.153 QT
0.672 -8.856 L
7.781 -8.856 L
8.875 -8.856 9.969 -8.411 QT
11.063 -7.966 11.773 -7.106 QT
12.484 -6.247 12.484 -5.106 QT
12.484 -3.997 11.773 -3.153 QT
11.063 -2.309 9.977 -1.872 QT
8.891 -1.434 7.781 -1.434 QT
4.578 -1.434 L
4.578 3.456 L
4.578 4.097 6.641 4.097 QT
6.641 4.8 L
0.672 4.8 L
cp
4.516 -2.044 M
7.234 -2.044 L
8.344 -2.044 9.023 -2.356 QT
9.703 -2.669 10.023 -3.341 QT
10.344 -4.013 10.344 -5.106 QT
10.344 -6.731 9.625 -7.442 QT
8.906 -8.153 7.234 -8.153 QT
5.531 -8.153 L
5.172 -8.153 4.977 -8.13 QT
4.781 -8.106 4.648 -7.966 QT
4.516 -7.825 4.516 -7.528 QT
4.516 -2.044 L
cp}def
f1730393676
f
GR
GS
[0.75 0 0 0.75 385.52051 69.75001] CT
N
/f1687837501{15.111 2.144 M
14.955 2.144 14.846 2.019 QT
14.736 1.894 14.736 1.737 QT
14.736 1.581 14.846 1.464 QT
14.955 1.347 15.111 1.347 QT
27.674 1.347 L
27.814 1.347 27.924 1.464 QT
28.033 1.581 28.033 1.737 QT
28.033 1.894 27.924 2.019 QT
27.814 2.144 27.674 2.144 QT
15.111 2.144 L
cp
15.111 -1.747 M
14.955 -1.747 14.846 -1.864 QT
14.736 -1.981 14.736 -2.138 QT
14.736 -2.294 14.846 -2.419 QT
14.955 -2.544 15.111 -2.544 QT
27.674 -2.544 L
27.814 -2.544 27.924 -2.419 QT
28.033 -2.294 28.033 -2.138 QT
28.033 -1.981 27.924 -1.864 QT
27.814 -1.747 27.674 -1.747 QT
15.111 -1.747 L
cp}def
f1687837501
f
GR
GS
[0.75 0 0 0.75 385.52051 69.75001] CT
N
/f-2146618269{34.167 5.237 M
31.714 5.237 30.831 3.222 QT
29.948 1.206 29.948 -1.575 QT
29.948 -3.309 30.268 -4.849 QT
30.589 -6.388 31.526 -7.458 QT
32.464 -8.528 34.167 -8.528 QT
35.479 -8.528 36.323 -7.88 QT
37.167 -7.231 37.604 -6.208 QT
38.042 -5.184 38.206 -4.02 QT
38.37 -2.856 38.37 -1.575 QT
38.37 0.144 38.05 1.644 QT
37.729 3.144 36.8 4.191 QT
35.87 5.237 34.167 5.237 QT
cp
34.167 4.722 M
35.276 4.722 35.823 3.581 QT
36.37 2.441 36.503 1.05 QT
36.635 -0.341 36.635 -1.903 QT
36.635 -3.403 36.503 -4.677 QT
36.37 -5.95 35.831 -6.974 QT
35.292 -7.997 34.167 -7.997 QT
33.042 -7.997 32.495 -6.966 QT
31.948 -5.934 31.815 -4.669 QT
31.682 -3.403 31.682 -1.903 QT
31.682 -0.794 31.737 0.198 QT
31.792 1.191 32.026 2.237 QT
32.26 3.284 32.784 4.003 QT
33.307 4.722 34.167 4.722 QT
cp}def
f-2146618269
f
GR
GS
[0.75 0 0 0.75 385.52051 69.75001] CT
N
/f401423307{40.854 3.691 M
40.854 3.253 41.182 2.925 QT
41.511 2.597 41.948 2.597 QT
42.229 2.597 42.487 2.745 QT
42.745 2.894 42.893 3.159 QT
43.042 3.425 43.042 3.691 QT
43.042 4.128 42.721 4.464 QT
42.401 4.8 41.948 4.8 QT
41.511 4.8 41.182 4.464 QT
40.854 4.128 40.854 3.691 QT
cp}def
f401423307
f
GR
GS
[0.75 0 0 0.75 385.52051 69.75001] CT
N
/f-1754281974{49.722 5.237 M
47.269 5.237 46.386 3.222 QT
45.504 1.206 45.504 -1.575 QT
45.504 -3.309 45.824 -4.849 QT
46.144 -6.388 47.082 -7.458 QT
48.019 -8.528 49.722 -8.528 QT
51.035 -8.528 51.879 -7.88 QT
52.722 -7.231 53.16 -6.208 QT
53.597 -5.184 53.761 -4.02 QT
53.925 -2.856 53.925 -1.575 QT
53.925 0.144 53.605 1.644 QT
53.285 3.144 52.355 4.191 QT
51.425 5.237 49.722 5.237 QT
cp
49.722 4.722 M
50.832 4.722 51.379 3.581 QT
51.925 2.441 52.058 1.05 QT
52.191 -0.341 52.191 -1.903 QT
52.191 -3.403 52.058 -4.677 QT
51.925 -5.95 51.386 -6.974 QT
50.847 -7.997 49.722 -7.997 QT
48.597 -7.997 48.05 -6.966 QT
47.504 -5.934 47.371 -4.669 QT
47.238 -3.403 47.238 -1.903 QT
47.238 -0.794 47.293 0.198 QT
47.347 1.191 47.582 2.237 QT
47.816 3.284 48.34 4.003 QT
48.863 4.722 49.722 4.722 QT
cp}def
f-1754281974
f
GR
GS
[0.75 0 0 0.75 0 0] CT
0.929 0.694 0.125 RC
[8 8] 0 setdash
2 LJ
2.667 LW
N
471.002 93 M
511.026 93 L
S
GR
GS
[0.75 0 0 0.75 385.52051 88.125] CT
N
f1730393676
f
GR
GS
[0.75 0 0 0.75 385.52051 88.125] CT
N
f1687837501
f
GR
GS
[0.75 0 0 0.75 385.52051 88.125] CT
N
f-2146618269
f
GR
GS
[0.75 0 0 0.75 385.52051 88.125] CT
N
f401423307
f
GR
GS
[0.75 0 0 0.75 385.52051 88.125] CT
N
/f-1738646863{46.582 4.8 M
46.582 4.097 L
49.082 4.097 49.082 3.456 QT
49.082 -7.044 L
48.05 -6.544 46.457 -6.544 QT
46.457 -7.247 L
48.91 -7.247 50.16 -8.528 QT
50.441 -8.528 L
50.519 -8.528 50.582 -8.474 QT
50.644 -8.419 50.644 -8.341 QT
50.644 3.456 L
50.644 4.097 53.144 4.097 QT
53.144 4.8 L
46.582 4.8 L
cp}def
f-1738646863
f
GR
GS
[0.75 0 0 0.75 0 0] CT
0.494 0.184 0.557 RC
[8 8] 0 setdash
2 LJ
2.667 LW
N
471.002 117.5 M
511.026 117.5 L
S
GR
GS
[0.75 0 0 0.75 385.52051 106.5] CT
N
f1730393676
f
GR
GS
[0.75 0 0 0.75 385.52051 106.5] CT
N
f1687837501
f
GR
GS
[0.75 0 0 0.75 385.52051 106.5] CT
N
f-2146618269
f
GR
GS
[0.75 0 0 0.75 385.52051 106.5] CT
N
f401423307
f
GR
GS
[0.75 0 0 0.75 385.52051 106.5] CT
N
/f-2109306167{45.722 4.8 M
45.722 4.269 L
45.722 4.206 45.754 4.159 QT
48.863 0.722 L
49.566 -0.044 50.004 -0.559 QT
50.441 -1.075 50.871 -1.755 QT
51.3 -2.434 51.55 -3.13 QT
51.8 -3.825 51.8 -4.606 QT
51.8 -5.419 51.496 -6.169 QT
51.191 -6.919 50.597 -7.372 QT
50.004 -7.825 49.144 -7.825 QT
48.285 -7.825 47.59 -7.302 QT
46.894 -6.778 46.613 -5.95 QT
46.691 -5.966 46.816 -5.966 QT
47.269 -5.966 47.59 -5.661 QT
47.91 -5.356 47.91 -4.872 QT
47.91 -4.419 47.59 -4.099 QT
47.269 -3.778 46.816 -3.778 QT
46.347 -3.778 46.035 -4.106 QT
45.722 -4.434 45.722 -4.872 QT
45.722 -5.638 46.004 -6.294 QT
46.285 -6.95 46.816 -7.466 QT
47.347 -7.981 48.019 -8.255 QT
48.691 -8.528 49.441 -8.528 QT
50.582 -8.528 51.566 -8.044 QT
52.55 -7.559 53.129 -6.677 QT
53.707 -5.794 53.707 -4.606 QT
53.707 -3.731 53.324 -2.95 QT
52.941 -2.169 52.347 -1.528 QT
51.754 -0.888 50.824 -0.083 QT
49.894 0.722 49.613 1.003 QT
47.347 3.175 L
49.269 3.175 L
50.675 3.175 51.629 3.151 QT
52.582 3.128 52.644 3.081 QT
52.879 2.831 53.129 1.237 QT
53.707 1.237 L
53.144 4.8 L
45.722 4.8 L
cp}def
f-2109306167
f
GR
GS
[0.75 0 0 0.75 0 0] CT
0.467 0.675 0.188 RC
[8 8] 0 setdash
2 LJ
2.667 LW
N
471.002 142 M
511.026 142 L
S
GR
GS
[0.75 0 0 0.75 385.52051 124.875] CT
N
f1730393676
f
GR
GS
[0.75 0 0 0.75 385.52051 124.875] CT
N
f1687837501
f
GR
GS
[0.75 0 0 0.75 385.52051 124.875] CT
N
f-2146618269
f
GR
GS
[0.75 0 0 0.75 385.52051 124.875] CT
N
f401423307
f
GR
GS
[0.75 0 0 0.75 385.52051 124.875] CT
N
/f871180319{46.629 3.253 M
47.097 3.941 47.886 4.269 QT
48.675 4.597 49.582 4.597 QT
50.754 4.597 51.238 3.612 QT
51.722 2.628 51.722 1.362 QT
51.722 0.8 51.621 0.23 QT
51.519 -0.341 51.277 -0.825 QT
51.035 -1.309 50.605 -1.606 QT
50.175 -1.903 49.566 -1.903 QT
48.238 -1.903 L
48.066 -1.903 48.066 -2.091 QT
48.066 -2.263 L
48.066 -2.419 48.238 -2.419 QT
49.347 -2.513 L
50.05 -2.513 50.511 -3.036 QT
50.972 -3.559 51.191 -4.317 QT
51.41 -5.075 51.41 -5.763 QT
51.41 -6.716 50.957 -7.333 QT
50.504 -7.95 49.582 -7.95 QT
48.832 -7.95 48.136 -7.661 QT
47.441 -7.372 47.035 -6.778 QT
47.066 -6.794 47.097 -6.802 QT
47.129 -6.809 47.16 -6.809 QT
47.613 -6.809 47.918 -6.497 QT
48.222 -6.184 48.222 -5.731 QT
48.222 -5.309 47.918 -4.997 QT
47.613 -4.684 47.16 -4.684 QT
46.722 -4.684 46.41 -4.997 QT
46.097 -5.309 46.097 -5.731 QT
46.097 -6.591 46.613 -7.231 QT
47.129 -7.872 47.949 -8.2 QT
48.769 -8.528 49.582 -8.528 QT
50.191 -8.528 50.863 -8.341 QT
51.535 -8.153 52.082 -7.817 QT
52.629 -7.481 52.98 -6.958 QT
53.332 -6.434 53.332 -5.763 QT
53.332 -4.919 52.957 -4.208 QT
52.582 -3.497 51.925 -2.974 QT
51.269 -2.45 50.488 -2.2 QT
51.347 -2.044 52.129 -1.552 QT
52.91 -1.059 53.386 -0.302 QT
53.863 0.456 53.863 1.347 QT
53.863 2.441 53.261 3.339 QT
52.66 4.237 51.668 4.737 QT
50.675 5.237 49.582 5.237 QT
48.644 5.237 47.707 4.878 QT
46.769 4.519 46.168 3.808 QT
45.566 3.097 45.566 2.097 QT
45.566 1.612 45.894 1.276 QT
46.222 0.941 46.722 0.941 QT
47.05 0.941 47.316 1.089 QT
47.582 1.237 47.738 1.511 QT
47.894 1.784 47.894 2.097 QT
47.894 2.597 47.55 2.925 QT
47.207 3.253 46.722 3.253 QT
46.629 3.253 L
cp}def
f871180319
f
GR
GS
[0.75 0 0 0.75 0 0] CT
0.302 0.745 0.933 RC
[8 8] 0 setdash
2 LJ
2.667 LW
N
471.002 166.5 M
511.026 166.5 L
S
GR
GS
[0.75 0 0 0.75 385.52051 143.25] CT
N
f1730393676
f
GR
GS
[0.75 0 0 0.75 385.52051 143.25] CT
N
f1687837501
f
GR
GS
[0.75 0 0 0.75 385.52051 143.25] CT
N
f-2146618269
f
GR
GS
[0.75 0 0 0.75 385.52051 143.25] CT
N
f401423307
f
GR
GS
[0.75 0 0 0.75 385.52051 143.25] CT
N
/f1623521873{45.285 1.503 M
45.285 0.8 L
51.457 -8.419 L
51.535 -8.528 51.66 -8.528 QT
51.957 -8.528 L
52.191 -8.528 52.191 -8.294 QT
52.191 0.8 L
54.144 0.8 L
54.144 1.503 L
52.191 1.503 L
52.191 3.456 L
52.191 3.878 52.777 3.987 QT
53.363 4.097 54.129 4.097 QT
54.129 4.8 L
48.613 4.8 L
48.613 4.097 L
49.394 4.097 49.98 3.987 QT
50.566 3.878 50.566 3.456 QT
50.566 1.503 L
45.285 1.503 L
cp
45.941 0.8 M
50.675 0.8 L
50.675 -6.278 L
45.941 0.8 L
cp}def
f1623521873
f
GR
GS
[0.75 0 0 0.75 0 0] CT
0.635 0.078 0.184 RC
[8 8] 0 setdash
2 LJ
2.667 LW
N
471.002 191 M
511.026 191 L
S
GR
GS
[0.75 0 0 0.75 385.52051 161.625] CT
N
f1730393676
f
GR
GS
[0.75 0 0 0.75 385.52051 161.625] CT
N
f1687837501
f
GR
GS
[0.75 0 0 0.75 385.52051 161.625] CT
N
f-2146618269
f
GR
GS
[0.75 0 0 0.75 385.52051 161.625] CT
N
f401423307
f
GR
GS
[0.75 0 0 0.75 385.52051 161.625] CT
N
/f1779472197{46.457 2.519 M
46.66 3.112 47.09 3.589 QT
47.519 4.066 48.097 4.331 QT
48.675 4.597 49.3 4.597 QT
50.754 4.597 51.3 3.48 QT
51.847 2.362 51.847 0.753 QT
51.847 0.066 51.824 -0.411 QT
51.8 -0.888 51.691 -1.325 QT
51.504 -2.028 51.035 -2.552 QT
50.566 -3.075 49.894 -3.075 QT
49.222 -3.075 48.738 -2.872 QT
48.254 -2.669 47.957 -2.395 QT
47.66 -2.122 47.425 -1.817 QT
47.191 -1.513 47.129 -1.497 QT
46.894 -1.497 L
46.847 -1.497 46.777 -1.559 QT
46.707 -1.622 46.707 -1.684 QT
46.707 -8.372 L
46.707 -8.419 46.769 -8.474 QT
46.832 -8.528 46.894 -8.528 QT
46.957 -8.528 L
48.3 -7.872 49.816 -7.872 QT
51.3 -7.872 52.675 -8.528 QT
52.738 -8.528 L
52.816 -8.528 52.871 -8.474 QT
52.925 -8.419 52.925 -8.372 QT
52.925 -8.184 L
52.925 -8.075 52.894 -8.075 QT
52.207 -7.169 51.175 -6.661 QT
50.144 -6.153 49.035 -6.153 QT
48.238 -6.153 47.394 -6.388 QT
47.394 -2.606 L
48.066 -3.138 48.59 -3.372 QT
49.113 -3.606 49.925 -3.606 QT
51.019 -3.606 51.894 -2.966 QT
52.769 -2.325 53.238 -1.309 QT
53.707 -0.294 53.707 0.769 QT
53.707 1.972 53.113 3.003 QT
52.519 4.034 51.504 4.636 QT
50.488 5.237 49.3 5.237 QT
48.316 5.237 47.488 4.73 QT
46.66 4.222 46.191 3.362 QT
45.722 2.503 45.722 1.534 QT
45.722 1.081 46.011 0.8 QT
46.3 0.519 46.738 0.519 QT
47.191 0.519 47.488 0.808 QT
47.785 1.097 47.785 1.534 QT
47.785 1.972 47.488 2.269 QT
47.191 2.566 46.738 2.566 QT
46.675 2.566 46.59 2.55 QT
46.504 2.534 46.457 2.519 QT
cp}def
f1779472197
f
GR
GS
[0.75 0 0 0.75 0 0] CT
0 0.447 0.741 RC
[8 8] 0 setdash
2 LJ
2.667 LW
N
471.002 215.5 M
511.026 215.5 L
S
GR
GS
[0.75 0 0 0.75 385.52051 180] CT
N
f1730393676
f
GR
GS
[0.75 0 0 0.75 385.52051 180] CT
N
f1687837501
f
GR
GS
[0.75 0 0 0.75 385.52051 180] CT
N
f-2146618269
f
GR
GS
[0.75 0 0 0.75 385.52051 180] CT
N
f401423307
f
GR
GS
[0.75 0 0 0.75 385.52051 180] CT
N
/f-664310275{49.722 5.237 M
48.488 5.237 47.652 4.581 QT
46.816 3.925 46.363 2.87 QT
45.91 1.816 45.738 0.667 QT
45.566 -0.481 45.566 -1.669 QT
45.566 -3.247 46.183 -4.841 QT
46.8 -6.434 47.996 -7.481 QT
49.191 -8.528 50.832 -8.528 QT
51.504 -8.528 52.097 -8.263 QT
52.691 -7.997 53.027 -7.497 QT
53.363 -6.997 53.363 -6.278 QT
53.363 -5.872 53.09 -5.599 QT
52.816 -5.325 52.394 -5.325 QT
52.004 -5.325 51.722 -5.606 QT
51.441 -5.888 51.441 -6.278 QT
51.441 -6.669 51.722 -6.958 QT
52.004 -7.247 52.394 -7.247 QT
52.504 -7.247 L
52.254 -7.606 51.793 -7.778 QT
51.332 -7.95 50.832 -7.95 QT
50.222 -7.95 49.707 -7.684 QT
49.191 -7.419 48.785 -6.966 QT
48.379 -6.513 48.105 -5.974 QT
47.832 -5.434 47.675 -4.739 QT
47.519 -4.044 47.48 -3.442 QT
47.441 -2.841 47.441 -1.919 QT
47.8 -2.747 48.441 -3.263 QT
49.082 -3.778 49.894 -3.778 QT
50.785 -3.778 51.519 -3.419 QT
52.254 -3.059 52.777 -2.419 QT
53.3 -1.778 53.582 -0.958 QT
53.863 -0.138 53.863 0.691 QT
53.863 1.862 53.34 2.925 QT
52.816 3.987 51.871 4.612 QT
50.925 5.237 49.722 5.237 QT
cp
49.722 4.597 M
50.488 4.597 50.957 4.245 QT
51.425 3.894 51.652 3.316 QT
51.879 2.737 51.925 2.144 QT
51.972 1.55 51.972 0.691 QT
51.972 -0.434 51.871 -1.239 QT
51.769 -2.044 51.285 -2.653 QT
50.8 -3.263 49.816 -3.263 QT
49.004 -3.263 48.488 -2.716 QT
47.972 -2.169 47.73 -1.333 QT
47.488 -0.497 47.488 0.284 QT
47.488 0.534 47.504 0.675 QT
47.504 0.706 47.504 0.73 QT
47.504 0.753 47.488 0.769 QT
47.488 1.628 47.66 2.511 QT
47.832 3.394 48.332 3.995 QT
48.832 4.597 49.722 4.597 QT
cp}def
f-664310275
f
GR
GS
[0.75 0 0 0.75 0 0] CT
0.851 0.325 0.098 RC
[8 8] 0 setdash
2 LJ
2.667 LW
N
471.002 240 M
511.026 240 L
S
GR
GS
[0.75 0 0 0.75 385.52051 198.375] CT
N
f1730393676
f
GR
GS
[0.75 0 0 0.75 385.52051 198.375] CT
N
f1687837501
f
GR
GS
[0.75 0 0 0.75 385.52051 198.375] CT
N
f-2146618269
f
GR
GS
[0.75 0 0 0.75 385.52051 198.375] CT
N
f401423307
f
GR
GS
[0.75 0 0 0.75 385.52051 198.375] CT
N
/f-619426210{48.207 4.284 M
48.207 3.175 48.402 2.105 QT
48.597 1.034 48.972 -0.005 QT
49.347 -1.044 49.879 -2.044 QT
50.41 -3.044 51.035 -3.919 QT
52.863 -6.466 L
50.582 -6.466 L
47.035 -6.466 46.925 -6.356 QT
46.66 -6.044 46.425 -4.513 QT
45.847 -4.513 L
46.504 -8.716 L
47.082 -8.716 L
47.082 -8.653 L
47.082 -8.294 48.308 -8.184 QT
49.535 -8.075 50.707 -8.075 QT
54.425 -8.075 L
54.425 -7.559 L
54.425 -7.544 54.418 -7.536 QT
54.41 -7.528 54.394 -7.513 QT
51.644 -3.638 L
50.629 -2.138 50.379 -0.302 QT
50.129 1.534 50.129 4.284 QT
50.129 4.675 49.84 4.956 QT
49.55 5.237 49.16 5.237 QT
48.769 5.237 48.488 4.956 QT
48.207 4.675 48.207 4.284 QT
cp}def
f-619426210
f
GR
GS
[0.75 0 0 0.75 0 0] CT
0.929 0.694 0.125 RC
[8 8] 0 setdash
2 LJ
2.667 LW
N
471.002 264.5 M
511.026 264.5 L
S
GR
GS
[0.75 0 0 0.75 385.52051 216.75] CT
N
f1730393676
f
GR
GS
[0.75 0 0 0.75 385.52051 216.75] CT
N
f1687837501
f
GR
GS
[0.75 0 0 0.75 385.52051 216.75] CT
N
f-2146618269
f
GR
GS
[0.75 0 0 0.75 385.52051 216.75] CT
N
f401423307
f
GR
GS
[0.75 0 0 0.75 385.52051 216.75] CT
N
/f1165747981{45.566 1.769 M
45.566 0.566 46.355 -0.356 QT
47.144 -1.278 48.379 -1.903 QT
47.644 -2.372 L
46.957 -2.825 46.527 -3.575 QT
46.097 -4.325 46.097 -5.138 QT
46.097 -6.106 46.605 -6.872 QT
47.113 -7.638 47.941 -8.083 QT
48.769 -8.528 49.722 -8.528 QT
50.613 -8.528 51.441 -8.161 QT
52.269 -7.794 52.8 -7.122 QT
53.332 -6.45 53.332 -5.528 QT
53.332 -4.856 53.011 -4.278 QT
52.691 -3.7 52.136 -3.239 QT
51.582 -2.778 50.957 -2.45 QT
52.113 -1.731 L
52.894 -1.2 53.379 -0.364 QT
53.863 0.472 53.863 1.394 QT
53.863 2.487 53.285 3.378 QT
52.707 4.269 51.746 4.753 QT
50.785 5.237 49.722 5.237 QT
48.691 5.237 47.73 4.816 QT
46.769 4.394 46.168 3.597 QT
45.566 2.8 45.566 1.769 QT
cp
46.644 1.769 M
46.644 2.55 47.082 3.206 QT
47.519 3.862 48.23 4.23 QT
48.941 4.597 49.722 4.597 QT
50.879 4.597 51.832 3.925 QT
52.785 3.253 52.785 2.128 QT
52.785 1.737 52.629 1.362 QT
52.472 0.987 52.207 0.683 QT
51.941 0.378 51.613 0.175 QT
48.925 -1.559 L
48.3 -1.231 47.777 -0.724 QT
47.254 -0.216 46.949 0.425 QT
46.644 1.066 46.644 1.769 QT
cp
48.019 -4.341 M
50.441 -2.778 L
51.285 -3.263 51.824 -3.958 QT
52.363 -4.653 52.363 -5.528 QT
52.363 -6.2 51.988 -6.763 QT
51.613 -7.325 51.004 -7.638 QT
50.394 -7.95 49.707 -7.95 QT
49.097 -7.95 48.48 -7.716 QT
47.863 -7.481 47.465 -7.013 QT
47.066 -6.544 47.066 -5.919 QT
47.066 -4.981 48.019 -4.341 QT
cp}def
f1165747981
f
GR
GS
[0.75 0 0 0.75 0 0] CT
0.494 0.184 0.557 RC
[8 8] 0 setdash
2 LJ
2.667 LW
N
471.002 289 M
511.026 289 L
S
GR
GS
[0.75 0 0 0.75 385.52051 235.125] CT
N
f1730393676
f
GR
GS
[0.75 0 0 0.75 385.52051 235.125] CT
N
f1687837501
f
GR
GS
[0.75 0 0 0.75 385.52051 235.125] CT
N
f-2146618269
f
GR
GS
[0.75 0 0 0.75 385.52051 235.125] CT
N
f401423307
f
GR
GS
[0.75 0 0 0.75 385.52051 235.125] CT
N
/f846562813{46.972 3.956 M
47.519 4.597 48.879 4.597 QT
49.644 4.597 50.3 4.081 QT
50.957 3.566 51.332 2.816 QT
51.738 1.972 51.855 1.011 QT
51.972 0.05 51.972 -1.388 QT
51.644 -0.575 51.004 -0.059 QT
50.363 0.456 49.535 0.456 QT
48.363 0.456 47.449 -0.169 QT
46.535 -0.794 46.05 -1.825 QT
45.566 -2.856 45.566 -4.013 QT
45.566 -5.216 46.113 -6.255 QT
46.66 -7.294 47.629 -7.911 QT
48.597 -8.528 49.816 -8.528 QT
51.035 -8.528 51.847 -7.864 QT
52.66 -7.2 53.09 -6.161 QT
53.519 -5.122 53.691 -3.958 QT
53.863 -2.794 53.863 -1.669 QT
53.863 -0.122 53.3 1.487 QT
52.738 3.097 51.605 4.167 QT
50.472 5.237 48.879 5.237 QT
47.707 5.237 46.886 4.683 QT
46.066 4.128 46.066 3.003 QT
46.066 2.597 46.34 2.316 QT
46.613 2.034 47.035 2.034 QT
47.425 2.034 47.707 2.316 QT
47.988 2.597 47.988 3.003 QT
47.988 3.394 47.707 3.675 QT
47.425 3.956 47.035 3.956 QT
46.972 3.956 L
cp
49.613 -0.059 M
50.425 -0.059 50.949 -0.614 QT
51.472 -1.169 51.707 -1.989 QT
51.941 -2.809 51.941 -3.622 QT
51.941 -3.997 L
51.941 -4.075 L
51.941 -5.575 51.504 -6.763 QT
51.066 -7.95 49.816 -7.95 QT
49.035 -7.95 48.543 -7.599 QT
48.05 -7.247 47.816 -6.677 QT
47.582 -6.106 47.511 -5.45 QT
47.441 -4.794 47.441 -4.013 QT
47.441 -2.888 47.55 -2.083 QT
47.66 -1.278 48.136 -0.669 QT
48.613 -0.059 49.613 -0.059 QT
cp}def
f846562813
f
GR
GS
[0.75 0 0 0.75 0 0] CT
0.467 0.675 0.188 RC
[8 8] 0 setdash
2 LJ
2.667 LW
N
471.002 313.5 M
511.026 313.5 L
S
GR
GS
[0.75 0 0 0.75 385.52051 253.5] CT
N
f1730393676
f
GR
GS
[0.75 0 0 0.75 385.52051 253.5] CT
N
f1687837501
f
GR
GS
[0.75 0 0 0.75 385.52051 253.5] CT
N
/f-659895163{31.026 4.8 M
31.026 4.097 L
33.526 4.097 33.526 3.456 QT
33.526 -7.044 L
32.495 -6.544 30.901 -6.544 QT
30.901 -7.247 L
33.354 -7.247 34.604 -8.528 QT
34.885 -8.528 L
34.964 -8.528 35.026 -8.474 QT
35.089 -8.419 35.089 -8.341 QT
35.089 3.456 L
35.089 4.097 37.589 4.097 QT
37.589 4.8 L
31.026 4.8 L
cp}def
f-659895163
f
GR
GS
[0.75 0 0 0.75 385.52051 253.5] CT
N
f401423307
f
GR
GS
[0.75 0 0 0.75 385.52051 253.5] CT
N
f-1754281974
f
GR
GS
[0.75 0 0 0.75 0 0] CT
0.302 0.745 0.933 RC
[8 8] 0 setdash
2 LJ
2.667 LW
N
471.002 338 M
511.026 338 L
S
GR
GS
[0.75 0 0 0.75 0 0] CT
0.149 GC
10.0 ML
0.667 LW
N
467 352 M
467 30 L
753 30 L
753 352 L
cp
S
GR
%%Trailer
%%Pages: 1
%%EOF
