<?xml version="1.0" encoding="UTF-8"?>

<!-- generated on Sat Apr 24 18:18:53 2021 by Eclipse SUMO Version 1.4.0
<configuration xmlns:xsi="http://www.w3.org/2001/XMLSchema-instance" xsi:noNamespaceSchemaLocation="http://sumo.dlr.de/xsd/sumoConfiguration.xsd">

    <input>
        <net-file value="sumofiles/junction.net.xml"/>
        <route-files value="sumofiles/junction_preemption_104.rou.xml"/>
        <additional-files value="sumofiles/junction.det.xml"/>
    </input>

    <output>
        <tripinfo-output value="sumofiles/output/tripinfo_preemption_104.xml"/>
    </output>

    <time>
        <begin value="0"/>
        <end value="10000"/>
        <step-length value="0.05"/>
    </time>

    <processing>
        <lateral-resolution value="0.1"/>
    </processing>

    <report>
        <no-warnings value="true"/>
        <error-log value="sumofiles/output/errorlog_preemption_104.log"/>
        <no-step-log value="true"/>
    </report>

    <traci_server>
        <remote-port value="54095"/>
    </traci_server>

    <gui_only>
        <gui-settings-file value="sumofiles/junction-gui.settings.xml"/>
        <tracker-interval value="0.05"/>
    </gui_only>

</configuration>
-->

<tripinfos xmlns:xsi="http://www.w3.org/2001/XMLSchema-instance" xsi:noNamespaceSchemaLocation="http://sumo.dlr.de/xsd/tripinfo_file.xsd">
    <tripinfo id="car_e2s_3" depart="3.00" departLane="e2sep_1" departPos="3.60" departPosLat="0.00" departSpeed="13.90" departDelay="0.00" arrival="142.70" arrivalLane="c2s_1" arrivalPos="990.00" arrivalPosLat="0.00" arrivalSpeed="14.73" duration="139.70" routeLength="1996.47" waitingTime="0.00" waitingCount="0" stopTime="0.00" timeLoss="3.53" rerouteNo="1" devices="tripinfo_car_e2s_3 routing_car_e2s_3" vType="Car" speedFactor="1.06" vaporized=""/>
    <tripinfo id="car_n2s_5" depart="5.00" departLane="n2sep_1" departPos="3.60" departPosLat="0.00" departSpeed="13.90" departDelay="0.00" arrival="161.80" arrivalLane="c2s_1" arrivalPos="990.00" arrivalPosLat="0.00" arrivalSpeed="14.73" duration="156.80" routeLength="1997.01" waitingTime="13.75" waitingCount="1" stopTime="0.00" timeLoss="21.25" rerouteNo="1" devices="tripinfo_car_n2s_5 routing_car_n2s_5" vType="Car" speedFactor="1.06" vaporized=""/>
    <tripinfo id="car_s2n_5" depart="5.00" departLane="s2sep_1" departPos="3.60" departPosLat="0.00" departSpeed="13.90" departDelay="0.00" arrival="165.00" arrivalLane="c2n_1" arrivalPos="990.00" arrivalPosLat="0.00" arrivalSpeed="14.04" duration="160.00" routeLength="1997.01" waitingTime="10.65" waitingCount="1" stopTime="0.00" timeLoss="17.77" rerouteNo="1" devices="tripinfo_car_s2n_5 routing_car_s2n_5" vType="Car" speedFactor="1.01" vaporized=""/>
    <tripinfo id="bus_n2s_7" depart="7.00" departLane="n2sep_1" departPos="12.10" departPosLat="0.00" departSpeed="13.90" departDelay="0.00" arrival="171.15" arrivalLane="c2s_1" arrivalPos="990.00" arrivalPosLat="0.00" arrivalSpeed="13.90" duration="164.15" routeLength="1988.51" waitingTime="8.95" waitingCount="1" stopTime="0.00" timeLoss="21.05" rerouteNo="1" devices="tripinfo_bus_n2s_7 routing_bus_n2s_7" vType="Bus" speedFactor="1.00" vaporized=""/>
    <tripinfo id="car_s2w_7" depart="7.00" departLane="s2sep_1" departPos="3.60" departPosLat="0.00" departSpeed="13.90" departDelay="0.00" arrival="171.55" arrivalLane="c2w_1" arrivalPos="990.00" arrivalPosLat="0.00" arrivalSpeed="15.05" duration="164.55" routeLength="1996.47" waitingTime="15.15" waitingCount="2" stopTime="0.00" timeLoss="31.26" rerouteNo="1" devices="tripinfo_car_s2w_7 routing_car_s2w_7" vType="Car" speedFactor="1.08" vaporized=""/>
    <tripinfo id="car_n2s_14" depart="14.00" departLane="n2sep_1" departPos="3.60" departPosLat="0.00" departSpeed="13.90" departDelay="0.00" arrival="175.90" arrivalLane="c2s_1" arrivalPos="990.00" arrivalPosLat="0.00" arrivalSpeed="13.89" duration="161.90" routeLength="1997.01" waitingTime="3.55" waitingCount="1" stopTime="0.00" timeLoss="18.19" rerouteNo="1" devices="tripinfo_car_n2s_14 routing_car_n2s_14" vType="Car" speedFactor="1.00" vaporized=""/>
    <tripinfo id="car_n2s_18" depart="18.00" departLane="n2sep_1" departPos="3.60" departPosLat="0.00" departSpeed="13.90" departDelay="0.00" arrival="178.10" arrivalLane="c2s_1" arrivalPos="990.00" arrivalPosLat="0.00" arrivalSpeed="14.72" duration="160.10" routeLength="1997.01" waitingTime="2.65" waitingCount="1" stopTime="0.00" timeLoss="27.38" rerouteNo="1" devices="tripinfo_car_n2s_18 routing_car_n2s_18" vType="Car" speedFactor="1.08" vaporized=""/>
    <tripinfo id="car_s2w_20" depart="20.00" departLane="s2sep_1" departPos="3.60" departPosLat="0.00" departSpeed="13.90" departDelay="0.00" arrival="178.15" arrivalLane="c2w_1" arrivalPos="990.00" arrivalPosLat="0.00" arrivalSpeed="14.32" duration="158.15" routeLength="1996.47" waitingTime="5.85" waitingCount="1" stopTime="0.00" timeLoss="18.04" rerouteNo="1" devices="tripinfo_car_s2w_20 routing_car_s2w_20" vType="Car" speedFactor="1.03" vaporized=""/>
    <tripinfo id="car_s2w_28" depart="28.00" departLane="s2sep_1" departPos="3.60" departPosLat="0.00" departSpeed="13.90" departDelay="0.00" arrival="180.40" arrivalLane="c2w_1" arrivalPos="990.00" arrivalPosLat="0.00" arrivalSpeed="15.28" duration="152.40" routeLength="1996.47" waitingTime="3.70" waitingCount="1" stopTime="0.00" timeLoss="23.86" rerouteNo="1" devices="tripinfo_car_s2w_28 routing_car_s2w_28" vType="Car" speedFactor="1.12" vaporized=""/>
    <tripinfo id="car_s2w_33" depart="33.00" departLane="s2sep_1" departPos="3.60" departPosLat="0.00" departSpeed="13.90" departDelay="0.00" arrival="183.90" arrivalLane="c2w_1" arrivalPos="990.00" arrivalPosLat="0.00" arrivalSpeed="14.50" duration="150.90" routeLength="1996.47" waitingTime="0.00" waitingCount="0" stopTime="0.00" timeLoss="12.91" rerouteNo="1" devices="tripinfo_car_s2w_33 routing_car_s2w_33" vType="Car" speedFactor="1.05" vaporized=""/>
    <tripinfo id="car_s2w_45" depart="45.00" departLane="s2sep_1" departPos="3.60" departPosLat="0.00" departSpeed="13.90" departDelay="0.00" arrival="185.90" arrivalLane="c2w_1" arrivalPos="990.00" arrivalPosLat="0.00" arrivalSpeed="15.53" duration="140.90" routeLength="1996.47" waitingTime="0.00" waitingCount="0" stopTime="0.00" timeLoss="16.31" rerouteNo="1" devices="tripinfo_car_s2w_45 routing_car_s2w_45" vType="Car" speedFactor="1.16" vaporized=""/>
    <tripinfo id="car_s2e_41" depart="41.00" departLane="s2sep_1" departPos="3.60" departPosLat="0.00" departSpeed="13.90" departDelay="0.00" arrival="188.30" arrivalLane="c2e_1" arrivalPos="990.00" arrivalPosLat="0.00" arrivalSpeed="13.90" duration="147.30" routeLength="1986.69" waitingTime="0.00" waitingCount="0" stopTime="0.00" timeLoss="3.64" rerouteNo="1" devices="tripinfo_car_s2e_41 routing_car_s2e_41" vType="Car" speedFactor="1.00" vaporized=""/>
    <tripinfo id="car_n2s_49" depart="49.00" departLane="n2sep_1" departPos="3.60" departPosLat="0.00" departSpeed="13.90" departDelay="0.00" arrival="191.90" arrivalLane="c2s_1" arrivalPos="990.00" arrivalPosLat="0.00" arrivalSpeed="14.04" duration="142.90" routeLength="1997.01" waitingTime="0.00" waitingCount="0" stopTime="0.00" timeLoss="0.66" rerouteNo="1" devices="tripinfo_car_n2s_49 routing_car_n2s_49" vType="Car" speedFactor="1.01" vaporized=""/>
    <tripinfo id="car_n2e_41" depart="41.00" departLane="n2sep_1" departPos="3.60" departPosLat="0.00" departSpeed="13.90" departDelay="0.00" arrival="192.65" arrivalLane="c2e_1" arrivalPos="990.00" arrivalPosLat="0.00" arrivalSpeed="13.89" duration="151.65" routeLength="1996.47" waitingTime="0.00" waitingCount="0" stopTime="0.00" timeLoss="7.33" rerouteNo="1" devices="tripinfo_car_n2e_41 routing_car_n2e_41" vType="Car" speedFactor="1.00" vaporized=""/>
    <tripinfo id="car_s2w_48" depart="48.00" departLane="s2sep_1" departPos="3.60" departPosLat="0.00" departSpeed="13.90" departDelay="0.00" arrival="194.50" arrivalLane="c2w_1" arrivalPos="990.00" arrivalPosLat="0.00" arrivalSpeed="14.15" duration="146.50" routeLength="1996.47" waitingTime="0.00" waitingCount="0" stopTime="0.00" timeLoss="4.76" rerouteNo="1" devices="tripinfo_car_s2w_48 routing_car_s2w_48" vType="Car" speedFactor="1.02" vaporized=""/>
    <tripinfo id="car_e2w_22" depart="22.00" departLane="e2sep_1" departPos="3.60" departPosLat="0.00" departSpeed="13.90" departDelay="0.00" arrival="205.10" arrivalLane="c2w_1" arrivalPos="990.00" arrivalPosLat="0.00" arrivalSpeed="15.16" duration="183.10" routeLength="1997.01" waitingTime="43.70" waitingCount="1" stopTime="0.00" timeLoss="51.34" rerouteNo="1" devices="tripinfo_car_e2w_22 routing_car_e2w_22" vType="Car" speedFactor="1.09" vaporized=""/>
    <tripinfo id="car_w2s_10" depart="10.00" departLane="w2sep_1" departPos="3.60" departPosLat="0.00" departSpeed="13.90" departDelay="0.00" arrival="208.60" arrivalLane="c2s_1" arrivalPos="990.00" arrivalPosLat="0.00" arrivalSpeed="14.32" duration="198.60" routeLength="1986.69" waitingTime="52.30" waitingCount="1" stopTime="0.00" timeLoss="59.19" rerouteNo="1" devices="tripinfo_car_w2s_10 routing_car_w2s_10" vType="Car" speedFactor="1.03" vaporized=""/>
    <tripinfo id="car_e2n_51" depart="51.00" departLane="e2sep_1" departPos="3.60" departPosLat="0.00" departSpeed="13.90" departDelay="0.00" arrival="209.35" arrivalLane="c2n_1" arrivalPos="990.00" arrivalPosLat="0.00" arrivalSpeed="15.16" duration="158.35" routeLength="1986.69" waitingTime="16.10" waitingCount="1" stopTime="0.00" timeLoss="26.63" rerouteNo="1" devices="tripinfo_car_e2n_51 routing_car_e2n_51" vType="Car" speedFactor="1.09" vaporized=""/>
    <tripinfo id="car_w2s_15" depart="15.00" departLane="w2sep_1" departPos="3.60" departPosLat="0.00" departSpeed="13.90" departDelay="0.00" arrival="212.45" arrivalLane="c2s_1" arrivalPos="990.00" arrivalPosLat="0.00" arrivalSpeed="14.51" duration="197.45" routeLength="1986.69" waitingTime="48.30" waitingCount="1" stopTime="0.00" timeLoss="60.09" rerouteNo="1" devices="tripinfo_car_w2s_15 routing_car_w2s_15" vType="Car" speedFactor="1.05" vaporized=""/>
    <tripinfo id="car_e2w_30" depart="30.00" departLane="e2sep_1" departPos="3.60" departPosLat="0.00" departSpeed="13.90" departDelay="0.00" arrival="213.60" arrivalLane="c2w_1" arrivalPos="990.00" arrivalPosLat="0.00" arrivalSpeed="13.90" duration="183.60" routeLength="1997.01" waitingTime="30.80" waitingCount="1" stopTime="0.00" timeLoss="39.93" rerouteNo="1" devices="tripinfo_car_e2w_30 routing_car_e2w_30" vType="Car" speedFactor="1.00" vaporized=""/>
    <tripinfo id="car_e2w_57" depart="57.00" departLane="e2sep_1" departPos="3.60" departPosLat="0.00" departSpeed="13.90" departDelay="0.00" arrival="215.70" arrivalLane="c2w_1" arrivalPos="990.00" arrivalPosLat="0.00" arrivalSpeed="15.13" duration="158.70" routeLength="1997.01" waitingTime="13.05" waitingCount="1" stopTime="0.00" timeLoss="30.72" rerouteNo="1" devices="tripinfo_car_e2w_57 routing_car_e2w_57" vType="Car" speedFactor="1.12" vaporized=""/>
    <tripinfo id="car_w2s_25" depart="26.45" departLane="w2sep_1" departPos="3.60" departPosLat="0.00" departSpeed="13.90" departDelay="1.45" arrival="215.85" arrivalLane="c2s_1" arrivalPos="990.00" arrivalPosLat="0.00" arrivalSpeed="14.51" duration="189.40" routeLength="1986.69" waitingTime="35.10" waitingCount="1" stopTime="0.00" timeLoss="52.19" rerouteNo="1" devices="tripinfo_car_w2s_25 routing_car_w2s_25" vType="Car" speedFactor="1.05" vaporized=""/>
    <tripinfo id="car_w2n_18" depart="18.00" departLane="w2sep_1" departPos="3.60" departPosLat="0.00" departSpeed="13.90" departDelay="0.00" arrival="219.45" arrivalLane="c2n_1" arrivalPos="990.00" arrivalPosLat="0.00" arrivalSpeed="14.04" duration="201.45" routeLength="1996.47" waitingTime="46.50" waitingCount="2" stopTime="0.00" timeLoss="58.59" rerouteNo="1" devices="tripinfo_car_w2n_18 routing_car_w2n_18" vType="Car" speedFactor="1.01" vaporized=""/>
    <tripinfo id="bus_w2e_56" depart="56.00" departLane="w2sep_1" departPos="12.10" departPosLat="0.00" departSpeed="13.90" departDelay="0.00" arrival="219.60" arrivalLane="c2e_1" arrivalPos="990.00" arrivalPosLat="0.00" arrivalSpeed="13.90" duration="163.60" routeLength="1988.51" waitingTime="6.85" waitingCount="1" stopTime="0.00" timeLoss="20.53" rerouteNo="1" devices="tripinfo_bus_w2e_56 routing_bus_w2e_56" vType="Bus" speedFactor="1.00" vaporized=""/>
    <tripinfo id="car_w2e_66" depart="66.00" departLane="w2sep_1" departPos="3.60" departPosLat="0.00" departSpeed="13.90" departDelay="0.00" arrival="222.05" arrivalLane="c2e_1" arrivalPos="990.00" arrivalPosLat="0.00" arrivalSpeed="15.54" duration="156.05" routeLength="1997.01" waitingTime="5.65" waitingCount="1" stopTime="0.00" timeLoss="31.61" rerouteNo="1" devices="tripinfo_car_w2e_66 routing_car_w2e_66" vType="Car" speedFactor="1.15" vaporized=""/>
    <tripinfo id="car_w2n_25" depart="25.00" departLane="w2sep_1" departPos="3.60" departPosLat="0.00" departSpeed="13.90" departDelay="0.00" arrival="223.15" arrivalLane="c2n_1" arrivalPos="990.00" arrivalPosLat="0.00" arrivalSpeed="14.24" duration="198.15" routeLength="1996.47" waitingTime="40.90" waitingCount="2" stopTime="0.00" timeLoss="57.50" rerouteNo="1" devices="tripinfo_car_w2n_25 routing_car_w2n_25" vType="Car" speedFactor="1.03" vaporized=""/>
    <tripinfo id="car_e2s_41" depart="41.00" departLane="e2sep_1" departPos="3.60" departPosLat="0.00" departSpeed="13.90" departDelay="0.00" arrival="226.10" arrivalLane="c2s_1" arrivalPos="990.00" arrivalPosLat="0.00" arrivalSpeed="13.90" duration="185.10" routeLength="1996.47" waitingTime="29.60" waitingCount="2" stopTime="0.00" timeLoss="40.77" rerouteNo="1" devices="tripinfo_car_e2s_41 routing_car_e2s_41" vType="Car" speedFactor="1.00" vaporized=""/>
    <tripinfo id="car_w2e_70" depart="70.00" departLane="w2sep_1" departPos="3.60" departPosLat="0.00" departSpeed="13.90" departDelay="0.00" arrival="226.25" arrivalLane="c2e_1" arrivalPos="990.00" arrivalPosLat="0.00" arrivalSpeed="13.96" duration="156.25" routeLength="1997.01" waitingTime="0.00" waitingCount="0" stopTime="0.00" timeLoss="13.31" rerouteNo="1" devices="tripinfo_car_w2e_70 routing_car_w2e_70" vType="Car" speedFactor="1.01" vaporized=""/>
    <tripinfo id="car_w2n_54" depart="54.00" departLane="w2sep_1" departPos="3.60" departPosLat="0.00" departSpeed="13.90" departDelay="0.00" arrival="226.45" arrivalLane="c2n_1" arrivalPos="990.00" arrivalPosLat="0.00" arrivalSpeed="14.22" duration="172.45" routeLength="1996.47" waitingTime="11.05" waitingCount="2" stopTime="0.00" timeLoss="31.80" rerouteNo="1" devices="tripinfo_car_w2n_54 routing_car_w2n_54" vType="Car" speedFactor="1.03" vaporized=""/>
    <tripinfo id="car_w2n_89" depart="89.00" departLane="w2sep_1" departPos="3.60" departPosLat="0.00" departSpeed="13.90" departDelay="0.00" arrival="228.30" arrivalLane="c2n_1" arrivalPos="990.00" arrivalPosLat="0.00" arrivalSpeed="15.35" duration="139.30" routeLength="1996.47" waitingTime="0.00" waitingCount="0" stopTime="0.00" timeLoss="14.71" rerouteNo="1" devices="tripinfo_car_w2n_89 routing_car_w2n_89" vType="Car" speedFactor="1.16" vaporized=""/>
    <tripinfo id="car_e2s_61" depart="61.00" departLane="e2sep_1" departPos="3.60" departPosLat="0.00" departSpeed="13.90" departDelay="0.00" arrival="230.40" arrivalLane="c2s_1" arrivalPos="990.00" arrivalPosLat="0.00" arrivalSpeed="13.89" duration="169.40" routeLength="1996.47" waitingTime="9.80" waitingCount="1" stopTime="0.00" timeLoss="25.07" rerouteNo="1" devices="tripinfo_car_e2s_61 routing_car_e2s_61" vType="Car" speedFactor="1.00" vaporized=""/>
    <tripinfo id="car_e2s_63" depart="63.00" departLane="e2sep_1" departPos="3.60" departPosLat="0.00" departSpeed="13.90" departDelay="0.00" arrival="233.95" arrivalLane="c2s_1" arrivalPos="990.00" arrivalPosLat="0.00" arrivalSpeed="13.87" duration="170.95" routeLength="1996.47" waitingTime="7.55" waitingCount="1" stopTime="0.00" timeLoss="26.62" rerouteNo="1" devices="tripinfo_car_e2s_63 routing_car_e2s_63" vType="Car" speedFactor="1.00" vaporized=""/>
    <tripinfo id="car_w2s_91" depart="91.00" departLane="w2sep_1" departPos="3.60" departPosLat="0.00" departSpeed="13.90" departDelay="0.00" arrival="236.95" arrivalLane="c2s_1" arrivalPos="990.00" arrivalPosLat="0.00" arrivalSpeed="14.25" duration="145.95" routeLength="1986.69" waitingTime="0.00" waitingCount="0" stopTime="0.00" timeLoss="6.52" rerouteNo="1" devices="tripinfo_car_w2s_91 routing_car_w2s_91" vType="Car" speedFactor="1.03" vaporized=""/>
    <tripinfo id="car_e2s_65" depart="65.00" departLane="e2sep_1" departPos="3.60" departPosLat="0.00" departSpeed="13.90" departDelay="0.00" arrival="238.75" arrivalLane="c2s_1" arrivalPos="990.00" arrivalPosLat="0.00" arrivalSpeed="15.46" duration="173.75" routeLength="1996.47" waitingTime="10.40" waitingCount="2" stopTime="0.00" timeLoss="51.30" rerouteNo="1" devices="tripinfo_car_e2s_65 routing_car_e2s_65" vType="Car" speedFactor="1.18" vaporized=""/>
    <tripinfo id="car_e2s_84" depart="84.00" departLane="e2sep_1" departPos="3.60" departPosLat="0.00" departSpeed="13.90" departDelay="0.00" arrival="240.60" arrivalLane="c2s_1" arrivalPos="990.00" arrivalPosLat="0.00" arrivalSpeed="15.60" duration="156.60" routeLength="1996.47" waitingTime="9.15" waitingCount="2" stopTime="0.00" timeLoss="34.27" rerouteNo="1" devices="tripinfo_car_e2s_84 routing_car_e2s_84" vType="Car" speedFactor="1.18" vaporized=""/>
    <tripinfo id="car_e2s_85" depart="85.25" departLane="e2sep_1" departPos="3.60" departPosLat="0.00" departSpeed="13.90" departDelay="0.25" arrival="242.90" arrivalLane="c2s_1" arrivalPos="990.00" arrivalPosLat="0.00" arrivalSpeed="15.05" duration="157.65" routeLength="1996.47" waitingTime="2.10" waitingCount="2" stopTime="0.00" timeLoss="26.72" rerouteNo="1" devices="tripinfo_car_e2s_85 routing_car_e2s_85" vType="Car" speedFactor="1.10" vaporized=""/>
    <tripinfo id="car_w2n_103" depart="103.00" departLane="w2sep_1" departPos="3.60" departPosLat="0.00" departSpeed="13.90" departDelay="0.00" arrival="244.95" arrivalLane="c2n_1" arrivalPos="990.00" arrivalPosLat="0.00" arrivalSpeed="14.50" duration="141.95" routeLength="1996.47" waitingTime="0.00" waitingCount="0" stopTime="0.00" timeLoss="3.64" rerouteNo="1" devices="tripinfo_car_w2n_103 routing_car_w2n_103" vType="Car" speedFactor="1.04" vaporized=""/>
    <tripinfo id="car_s2n_70" depart="70.00" departLane="s2sep_1" departPos="3.60" departPosLat="0.00" departSpeed="13.90" departDelay="0.00" arrival="247.50" arrivalLane="c2n_1" arrivalPos="990.00" arrivalPosLat="0.00" arrivalSpeed="16.04" duration="177.50" routeLength="1997.01" waitingTime="44.90" waitingCount="1" stopTime="0.00" timeLoss="54.87" rerouteNo="1" devices="tripinfo_car_s2n_70 routing_car_s2n_70" vType="Car" speedFactor="1.17" vaporized=""/>
    <tripinfo id="car_n2s_57" depart="57.00" departLane="n2sep_1" departPos="3.60" departPosLat="0.00" departSpeed="13.90" departDelay="0.00" arrival="252.75" arrivalLane="c2s_1" arrivalPos="990.00" arrivalPosLat="0.00" arrivalSpeed="14.55" duration="195.75" routeLength="1997.01" waitingTime="51.10" waitingCount="1" stopTime="0.00" timeLoss="58.54" rerouteNo="1" devices="tripinfo_car_n2s_57 routing_car_n2s_57" vType="Car" speedFactor="1.05" vaporized=""/>
    <tripinfo id="car_s2e_97" depart="98.45" departLane="s2sep_1" departPos="3.60" departPosLat="0.00" departSpeed="13.90" departDelay="1.45" arrival="256.40" arrivalLane="c2e_1" arrivalPos="990.00" arrivalPosLat="0.00" arrivalSpeed="15.18" duration="157.95" routeLength="1986.69" waitingTime="10.20" waitingCount="1" stopTime="0.00" timeLoss="26.38" rerouteNo="1" devices="tripinfo_car_s2e_97 routing_car_s2e_97" vType="Car" speedFactor="1.09" vaporized=""/>
    <tripinfo id="car_s2n_80" depart="80.00" departLane="s2sep_1" departPos="3.60" departPosLat="0.00" departSpeed="13.90" departDelay="0.00" arrival="257.00" arrivalLane="c2n_1" arrivalPos="990.00" arrivalPosLat="0.00" arrivalSpeed="14.17" duration="177.00" routeLength="1997.01" waitingTime="26.70" waitingCount="1" stopTime="0.00" timeLoss="36.06" rerouteNo="1" devices="tripinfo_car_s2n_80 routing_car_s2n_80" vType="Car" speedFactor="1.02" vaporized=""/>
    <tripinfo id="car_s2e_112" depart="112.00" departLane="s2sep_1" departPos="3.60" departPosLat="0.00" departSpeed="13.90" departDelay="0.00" arrival="259.10" arrivalLane="c2e_1" arrivalPos="990.00" arrivalPosLat="0.00" arrivalSpeed="16.07" duration="147.10" routeLength="1986.69" waitingTime="0.00" waitingCount="0" stopTime="0.00" timeLoss="24.20" rerouteNo="1" devices="tripinfo_car_s2e_112 routing_car_s2e_112" vType="Car" speedFactor="1.17" vaporized=""/>
    <tripinfo id="car_n2s_83" depart="83.00" departLane="n2sep_1" departPos="3.60" departPosLat="0.00" departSpeed="13.90" departDelay="0.00" arrival="259.15" arrivalLane="c2s_1" arrivalPos="990.00" arrivalPosLat="0.00" arrivalSpeed="13.90" duration="176.15" routeLength="1997.01" waitingTime="22.80" waitingCount="1" stopTime="0.00" timeLoss="32.44" rerouteNo="1" devices="tripinfo_car_n2s_83 routing_car_n2s_83" vType="Car" speedFactor="1.00" vaporized=""/>
    <tripinfo id="car_s2n_97" depart="97.00" departLane="s2sep_1" departPos="3.60" departPosLat="0.00" departSpeed="13.90" departDelay="0.00" arrival="261.20" arrivalLane="c2n_1" arrivalPos="990.00" arrivalPosLat="0.00" arrivalSpeed="14.14" duration="164.20" routeLength="1997.01" waitingTime="11.15" waitingCount="1" stopTime="0.00" timeLoss="23.05" rerouteNo="1" devices="tripinfo_car_s2n_97 routing_car_s2n_97" vType="Car" speedFactor="1.02" vaporized=""/>
    <tripinfo id="bus_n2w_93" depart="93.00" departLane="n2sep_1" departPos="12.10" departPosLat="0.00" departSpeed="13.90" departDelay="0.00" arrival="263.40" arrivalLane="c2w_1" arrivalPos="990.00" arrivalPosLat="0.00" arrivalSpeed="13.90" duration="170.40" routeLength="1978.19" waitingTime="15.25" waitingCount="1" stopTime="0.00" timeLoss="27.34" rerouteNo="1" devices="tripinfo_bus_n2w_93 routing_bus_n2w_93" vType="Bus" speedFactor="1.00" vaporized=""/>
    <tripinfo id="car_n2s_120" depart="120.00" departLane="n2sep_1" departPos="3.60" departPosLat="0.00" departSpeed="13.90" departDelay="0.00" arrival="264.25" arrivalLane="c2s_1" arrivalPos="990.00" arrivalPosLat="0.00" arrivalSpeed="14.13" duration="144.25" routeLength="1997.01" waitingTime="0.00" waitingCount="0" stopTime="0.00" timeLoss="2.91" rerouteNo="1" devices="tripinfo_car_n2s_120 routing_car_n2s_120" vType="Car" speedFactor="1.02" vaporized=""/>
    <tripinfo id="car_s2n_109" depart="109.00" departLane="s2sep_1" departPos="3.60" departPosLat="0.00" departSpeed="13.90" departDelay="0.00" arrival="265.65" arrivalLane="c2n_1" arrivalPos="990.00" arrivalPosLat="0.00" arrivalSpeed="13.89" duration="156.65" routeLength="1997.01" waitingTime="0.00" waitingCount="0" stopTime="0.00" timeLoss="12.97" rerouteNo="1" devices="tripinfo_car_s2n_109 routing_car_s2n_109" vType="Car" speedFactor="1.00" vaporized=""/>
    <tripinfo id="car_s2e_135" depart="135.00" departLane="s2sep_1" departPos="3.60" departPosLat="0.00" departSpeed="13.90" departDelay="0.00" arrival="265.70" arrivalLane="c2e_1" arrivalPos="990.00" arrivalPosLat="0.00" arrivalSpeed="15.88" duration="130.70" routeLength="1986.69" waitingTime="0.00" waitingCount="0" stopTime="0.00" timeLoss="4.95" rerouteNo="1" devices="tripinfo_car_s2e_135 routing_car_s2e_135" vType="Car" speedFactor="1.14" vaporized=""/>
    <tripinfo id="car_s2w_73" depart="73.00" departLane="s2sep_1" departPos="3.60" departPosLat="0.00" departSpeed="13.90" departDelay="0.00" arrival="269.00" arrivalLane="c2w_1" arrivalPos="990.00" arrivalPosLat="0.00" arrivalSpeed="13.90" duration="196.00" routeLength="1996.47" waitingTime="39.45" waitingCount="2" stopTime="0.00" timeLoss="51.69" rerouteNo="1" devices="tripinfo_car_s2w_73 routing_car_s2w_73" vType="Car" speedFactor="1.00" vaporized=""/>
    <tripinfo id="car_n2w_126" depart="126.00" departLane="n2sep_1" departPos="3.60" departPosLat="0.00" departSpeed="13.90" departDelay="0.00" arrival="274.50" arrivalLane="c2w_1" arrivalPos="990.00" arrivalPosLat="0.00" arrivalSpeed="13.90" duration="148.50" routeLength="1986.69" waitingTime="0.00" waitingCount="0" stopTime="0.00" timeLoss="4.81" rerouteNo="1" devices="tripinfo_car_n2w_126 routing_car_n2w_126" vType="Car" speedFactor="1.00" vaporized=""/>
    <tripinfo id="car_n2e_62" depart="62.00" departLane="n2sep_1" departPos="3.60" departPosLat="0.00" departSpeed="13.90" departDelay="0.00" arrival="277.45" arrivalLane="c2e_1" arrivalPos="990.00" arrivalPosLat="0.00" arrivalSpeed="13.90" duration="215.45" routeLength="1996.47" waitingTime="59.80" waitingCount="3" stopTime="0.00" timeLoss="71.10" rerouteNo="1" devices="tripinfo_car_n2e_62 routing_car_n2e_62" vType="Car" speedFactor="1.00" vaporized=""/>
    <tripinfo id="car_s2w_106" depart="106.00" departLane="s2sep_1" departPos="3.60" departPosLat="0.00" departSpeed="13.90" departDelay="0.00" arrival="278.15" arrivalLane="c2w_1" arrivalPos="990.00" arrivalPosLat="0.00" arrivalSpeed="14.01" duration="172.15" routeLength="1996.47" waitingTime="8.75" waitingCount="2" stopTime="0.00" timeLoss="29.28" rerouteNo="1" devices="tripinfo_car_s2w_106 routing_car_s2w_106" vType="Car" speedFactor="1.01" vaporized=""/>
    <tripinfo id="car_n2e_63" depart="63.50" departLane="n2sep_1" departPos="3.60" departPosLat="0.00" departSpeed="13.90" departDelay="0.50" arrival="279.45" arrivalLane="c2e_1" arrivalPos="990.00" arrivalPosLat="0.00" arrivalSpeed="15.18" duration="215.95" routeLength="1996.47" waitingTime="57.80" waitingCount="2" stopTime="0.00" timeLoss="88.44" rerouteNo="1" devices="tripinfo_car_n2e_63 routing_car_n2e_63" vType="Car" speedFactor="1.13" vaporized=""/>
    <tripinfo id="car_n2e_100" depart="100.00" departLane="n2sep_1" departPos="3.60" departPosLat="0.00" departSpeed="13.90" departDelay="0.00" arrival="282.65" arrivalLane="c2e_1" arrivalPos="990.00" arrivalPosLat="0.00" arrivalSpeed="14.37" duration="182.65" routeLength="1996.47" waitingTime="22.50" waitingCount="2" stopTime="0.00" timeLoss="43.60" rerouteNo="1" devices="tripinfo_car_n2e_100 routing_car_n2e_100" vType="Car" speedFactor="1.04" vaporized=""/>
    <tripinfo id="car_n2e_140" depart="140.00" departLane="n2sep_1" departPos="3.60" departPosLat="0.00" departSpeed="13.90" departDelay="0.00" arrival="286.50" arrivalLane="c2e_1" arrivalPos="990.00" arrivalPosLat="0.00" arrivalSpeed="14.21" duration="146.50" routeLength="1996.47" waitingTime="0.00" waitingCount="0" stopTime="0.00" timeLoss="5.51" rerouteNo="1" devices="tripinfo_car_n2e_140 routing_car_n2e_140" vType="Car" speedFactor="1.02" vaporized=""/>
    <tripinfo id="car_s2w_155" depart="155.00" departLane="s2sep_1" departPos="3.60" departPosLat="0.00" departSpeed="13.90" departDelay="0.00" arrival="287.95" arrivalLane="c2w_1" arrivalPos="990.00" arrivalPosLat="0.00" arrivalSpeed="15.56" duration="132.95" routeLength="1996.47" waitingTime="0.00" waitingCount="0" stopTime="0.00" timeLoss="3.99" rerouteNo="1" devices="tripinfo_car_s2w_155 routing_car_s2w_155" vType="Car" speedFactor="1.12" vaporized=""/>
    <tripinfo id="car_e2w_123" depart="123.00" departLane="e2sep_1" departPos="3.60" departPosLat="0.00" departSpeed="13.90" departDelay="0.00" arrival="295.10" arrivalLane="c2w_1" arrivalPos="990.00" arrivalPosLat="0.00" arrivalSpeed="15.23" duration="172.10" routeLength="1997.01" waitingTime="32.55" waitingCount="1" stopTime="0.00" timeLoss="40.97" rerouteNo="1" devices="tripinfo_car_e2w_123 routing_car_e2w_123" vType="Car" speedFactor="1.10" vaporized=""/>
    <tripinfo id="car_w2e_106" depart="106.00" departLane="w2sep_1" departPos="3.60" departPosLat="0.00" departSpeed="13.90" departDelay="0.00" arrival="295.30" arrivalLane="c2e_1" arrivalPos="990.00" arrivalPosLat="0.00" arrivalSpeed="15.12" duration="189.30" routeLength="1997.01" waitingTime="47.05" waitingCount="1" stopTime="0.00" timeLoss="57.24" rerouteNo="1" devices="tripinfo_car_w2e_106 routing_car_w2e_106" vType="Car" speedFactor="1.09" vaporized=""/>
    <tripinfo id="car_e2w_148" depart="148.00" departLane="e2sep_1" departPos="3.60" departPosLat="0.00" departSpeed="13.90" departDelay="0.00" arrival="300.50" arrivalLane="c2w_1" arrivalPos="990.00" arrivalPosLat="0.00" arrivalSpeed="15.04" duration="152.50" routeLength="1997.01" waitingTime="9.00" waitingCount="1" stopTime="0.00" timeLoss="19.75" rerouteNo="1" devices="tripinfo_car_e2w_148 routing_car_e2w_148" vType="Car" speedFactor="1.08" vaporized=""/>
    <tripinfo id="car_e2n_129" depart="129.00" departLane="e2sep_1" departPos="3.60" departPosLat="0.00" departSpeed="13.90" departDelay="0.00" arrival="302.95" arrivalLane="c2n_1" arrivalPos="990.00" arrivalPosLat="0.00" arrivalSpeed="13.90" duration="173.95" routeLength="1986.69" waitingTime="21.70" waitingCount="1" stopTime="0.00" timeLoss="30.31" rerouteNo="1" devices="tripinfo_car_e2n_129 routing_car_e2n_129" vType="Car" speedFactor="1.00" vaporized=""/>
    <tripinfo id="car_e2w_165" depart="165.00" departLane="e2sep_1" departPos="3.60" departPosLat="0.00" departSpeed="13.90" departDelay="0.00" arrival="303.30" arrivalLane="c2w_1" arrivalPos="990.00" arrivalPosLat="0.00" arrivalSpeed="16.22" duration="138.30" routeLength="1997.01" waitingTime="0.00" waitingCount="0" stopTime="0.00" timeLoss="16.40" rerouteNo="1" devices="tripinfo_car_e2w_165 routing_car_e2w_165" vType="Car" speedFactor="1.18" vaporized=""/>
    <tripinfo id="bus_w2e_122" depart="122.00" departLane="w2sep_1" departPos="12.10" departPosLat="0.00" departSpeed="13.90" departDelay="0.00" arrival="306.05" arrivalLane="c2e_1" arrivalPos="990.00" arrivalPosLat="0.00" arrivalSpeed="13.90" duration="184.05" routeLength="1988.51" waitingTime="30.05" waitingCount="1" stopTime="0.00" timeLoss="40.97" rerouteNo="1" devices="tripinfo_bus_w2e_122 routing_bus_w2e_122" vType="Bus" speedFactor="1.00" vaporized=""/>
    <tripinfo id="car_e2s_108" depart="108.00" departLane="e2sep_1" departPos="3.60" departPosLat="0.00" departSpeed="13.90" departDelay="0.00" arrival="308.20" arrivalLane="c2s_1" arrivalPos="990.00" arrivalPosLat="0.00" arrivalSpeed="13.90" duration="200.20" routeLength="1996.47" waitingTime="45.15" waitingCount="2" stopTime="0.00" timeLoss="55.85" rerouteNo="1" devices="tripinfo_car_e2s_108 routing_car_e2s_108" vType="Car" speedFactor="1.00" vaporized=""/>
    <tripinfo id="car_w2e_188" depart="188.00" departLane="w2sep_1" departPos="3.60" departPosLat="0.00" departSpeed="13.90" departDelay="0.00" arrival="310.85" arrivalLane="c2e_1" arrivalPos="990.00" arrivalPosLat="0.00" arrivalSpeed="16.37" duration="122.85" routeLength="1997.01" waitingTime="0.00" waitingCount="0" stopTime="0.00" timeLoss="1.07" rerouteNo="1" devices="tripinfo_car_w2e_188 routing_car_w2e_188" vType="Car" speedFactor="1.18" vaporized=""/>
    <tripinfo id="car_e2n_163" depart="163.00" departLane="e2sep_1" departPos="3.60" departPosLat="0.00" departSpeed="13.90" departDelay="0.00" arrival="310.95" arrivalLane="c2n_1" arrivalPos="990.00" arrivalPosLat="0.00" arrivalSpeed="13.90" duration="147.95" routeLength="1986.69" waitingTime="0.00" waitingCount="0" stopTime="0.00" timeLoss="4.26" rerouteNo="1" devices="tripinfo_car_e2n_163 routing_car_e2n_163" vType="Car" speedFactor="1.00" vaporized=""/>
    <tripinfo id="car_e2s_110" depart="110.00" departLane="e2sep_1" departPos="3.60" departPosLat="0.00" departSpeed="13.90" departDelay="0.00" arrival="312.60" arrivalLane="c2s_1" arrivalPos="990.00" arrivalPosLat="0.00" arrivalSpeed="13.89" duration="202.60" routeLength="1996.47" waitingTime="40.95" waitingCount="2" stopTime="0.00" timeLoss="58.27" rerouteNo="1" devices="tripinfo_car_e2s_110 routing_car_e2s_110" vType="Car" speedFactor="1.00" vaporized=""/>
    <tripinfo id="car_e2n_168" depart="168.00" departLane="e2sep_1" departPos="3.60" departPosLat="0.00" departSpeed="13.90" departDelay="0.00" arrival="316.90" arrivalLane="c2n_1" arrivalPos="990.00" arrivalPosLat="0.00" arrivalSpeed="13.97" duration="148.90" routeLength="1986.69" waitingTime="0.00" waitingCount="0" stopTime="0.00" timeLoss="5.95" rerouteNo="1" devices="tripinfo_car_e2n_168 routing_car_e2n_168" vType="Car" speedFactor="1.01" vaporized=""/>
    <tripinfo id="car_w2n_107" depart="107.40" departLane="w2sep_1" departPos="3.60" departPosLat="0.00" departSpeed="13.90" departDelay="0.40" arrival="321.20" arrivalLane="c2n_1" arrivalPos="990.00" arrivalPosLat="0.00" arrivalSpeed="13.89" duration="213.80" routeLength="1996.47" waitingTime="53.80" waitingCount="2" stopTime="0.00" timeLoss="69.46" rerouteNo="1" devices="tripinfo_car_w2n_107 routing_car_w2n_107" vType="Car" speedFactor="1.00" vaporized=""/>
    <tripinfo id="car_w2n_125" depart="125.00" departLane="w2sep_1" departPos="3.60" departPosLat="0.00" departSpeed="13.90" departDelay="0.00" arrival="324.65" arrivalLane="c2n_1" arrivalPos="990.00" arrivalPosLat="0.00" arrivalSpeed="13.91" duration="199.65" routeLength="1996.47" waitingTime="36.45" waitingCount="2" stopTime="0.00" timeLoss="55.78" rerouteNo="1" devices="tripinfo_car_w2n_125 routing_car_w2n_125" vType="Car" speedFactor="1.00" vaporized=""/>
    <tripinfo id="car_w2n_146" depart="146.00" departLane="w2sep_1" departPos="3.60" departPosLat="0.00" departSpeed="13.90" departDelay="0.00" arrival="326.55" arrivalLane="c2n_1" arrivalPos="990.00" arrivalPosLat="0.00" arrivalSpeed="15.05" duration="180.55" routeLength="1996.47" waitingTime="23.90" waitingCount="2" stopTime="0.00" timeLoss="53.05" rerouteNo="1" devices="tripinfo_car_w2n_146 routing_car_w2n_146" vType="Car" speedFactor="1.13" vaporized=""/>
    <tripinfo id="car_w2n_170" depart="170.00" departLane="w2sep_1" departPos="3.60" departPosLat="0.00" departSpeed="13.90" departDelay="0.00" arrival="328.40" arrivalLane="c2n_1" arrivalPos="990.00" arrivalPosLat="0.00" arrivalSpeed="15.45" duration="158.40" routeLength="1996.47" waitingTime="9.60" waitingCount="1" stopTime="0.00" timeLoss="35.22" rerouteNo="1" devices="tripinfo_car_w2n_170 routing_car_w2n_170" vType="Car" speedFactor="1.17" vaporized=""/>
    <tripinfo id="car_n2w_172" depart="172.00" departLane="n2sep_1" departPos="3.60" departPosLat="0.00" departSpeed="13.90" departDelay="0.00" arrival="342.95" arrivalLane="c2w_1" arrivalPos="990.00" arrivalPosLat="0.00" arrivalSpeed="14.46" duration="170.95" routeLength="1986.69" waitingTime="25.55" waitingCount="1" stopTime="0.00" timeLoss="32.80" rerouteNo="1" devices="tripinfo_car_n2w_172 routing_car_n2w_172" vType="Car" speedFactor="1.04" vaporized=""/>
    <tripinfo id="car_s2e_155" depart="156.30" departLane="s2sep_1" departPos="3.60" departPosLat="0.00" departSpeed="13.90" departDelay="1.30" arrival="344.55" arrivalLane="c2e_1" arrivalPos="990.00" arrivalPosLat="0.00" arrivalSpeed="14.12" duration="188.25" routeLength="1986.69" waitingTime="38.70" waitingCount="1" stopTime="0.00" timeLoss="46.80" rerouteNo="1" devices="tripinfo_car_s2e_155 routing_car_s2e_155" vType="Car" speedFactor="1.02" vaporized=""/>
    <tripinfo id="car_n2s_177" depart="177.00" departLane="n2sep_1" departPos="3.60" departPosLat="0.00" departSpeed="13.90" departDelay="0.00" arrival="347.80" arrivalLane="c2s_1" arrivalPos="990.00" arrivalPosLat="0.00" arrivalSpeed="13.90" duration="170.80" routeLength="1997.01" waitingTime="18.55" waitingCount="1" stopTime="0.00" timeLoss="27.11" rerouteNo="1" devices="tripinfo_car_n2s_177 routing_car_n2s_177" vType="Car" speedFactor="1.00" vaporized=""/>
    <tripinfo id="car_s2n_176" depart="176.00" departLane="s2sep_1" departPos="3.60" departPosLat="0.00" departSpeed="13.90" departDelay="0.00" arrival="348.55" arrivalLane="c2n_1" arrivalPos="990.00" arrivalPosLat="0.00" arrivalSpeed="14.22" duration="172.55" routeLength="1997.01" waitingTime="21.30" waitingCount="1" stopTime="0.00" timeLoss="32.11" rerouteNo="1" devices="tripinfo_car_s2n_176 routing_car_s2n_176" vType="Car" speedFactor="1.02" vaporized=""/>
    <tripinfo id="car_s2e_173" depart="173.00" departLane="s2sep_1" departPos="3.60" departPosLat="0.00" departSpeed="13.90" departDelay="0.00" arrival="348.75" arrivalLane="c2e_1" arrivalPos="990.00" arrivalPosLat="0.00" arrivalSpeed="14.19" duration="175.75" routeLength="1986.69" waitingTime="24.25" waitingCount="1" stopTime="0.00" timeLoss="35.21" rerouteNo="1" devices="tripinfo_car_s2e_173 routing_car_s2e_173" vType="Car" speedFactor="1.02" vaporized=""/>
    <tripinfo id="car_n2w_179" depart="179.00" departLane="n2sep_1" departPos="3.60" departPosLat="0.00" departSpeed="13.90" departDelay="0.00" arrival="349.65" arrivalLane="c2w_1" arrivalPos="990.00" arrivalPosLat="0.00" arrivalSpeed="14.17" duration="170.65" routeLength="1986.69" waitingTime="16.60" waitingCount="1" stopTime="0.00" timeLoss="29.76" rerouteNo="1" devices="tripinfo_car_n2w_179 routing_car_n2w_179" vType="Car" speedFactor="1.02" vaporized=""/>
    <tripinfo id="car_s2e_192" depart="192.00" departLane="s2sep_1" departPos="3.60" departPosLat="0.00" departSpeed="13.90" departDelay="0.00" arrival="351.05" arrivalLane="c2e_1" arrivalPos="990.00" arrivalPosLat="0.00" arrivalSpeed="15.02" duration="159.05" routeLength="1986.69" waitingTime="11.65" waitingCount="1" stopTime="0.00" timeLoss="28.70" rerouteNo="1" devices="tripinfo_car_s2e_192 routing_car_s2e_192" vType="Car" speedFactor="1.10" vaporized=""/>
    <tripinfo id="car_s2n_194" depart="194.00" departLane="s2sep_1" departPos="3.60" departPosLat="0.00" departSpeed="13.90" departDelay="0.00" arrival="351.40" arrivalLane="c2n_1" arrivalPos="990.00" arrivalPosLat="0.00" arrivalSpeed="14.99" duration="157.40" routeLength="1997.01" waitingTime="9.20" waitingCount="1" stopTime="0.00" timeLoss="25.22" rerouteNo="1" devices="tripinfo_car_s2n_194 routing_car_s2n_194" vType="Car" speedFactor="1.09" vaporized=""/>
    <tripinfo id="car_n2w_208" depart="208.00" departLane="n2sep_1" departPos="3.60" departPosLat="0.00" departSpeed="13.90" departDelay="0.00" arrival="351.70" arrivalLane="c2w_1" arrivalPos="990.00" arrivalPosLat="0.00" arrivalSpeed="15.42" duration="143.70" routeLength="1986.69" waitingTime="0.00" waitingCount="0" stopTime="0.00" timeLoss="18.50" rerouteNo="1" devices="tripinfo_car_n2w_208 routing_car_n2w_208" vType="Car" speedFactor="1.15" vaporized=""/>
    <tripinfo id="car_n2s_200" depart="200.00" departLane="n2sep_1" departPos="3.60" departPosLat="0.00" departSpeed="13.90" departDelay="0.00" arrival="353.20" arrivalLane="c2s_1" arrivalPos="990.00" arrivalPosLat="0.00" arrivalSpeed="13.90" duration="153.20" routeLength="1997.01" waitingTime="0.00" waitingCount="0" stopTime="0.00" timeLoss="9.50" rerouteNo="1" devices="tripinfo_car_n2s_200 routing_car_n2s_200" vType="Car" speedFactor="1.00" vaporized=""/>
    <tripinfo id="car_n2e_179" depart="180.65" departLane="n2sep_1" departPos="3.60" departPosLat="0.00" departSpeed="13.90" departDelay="1.65" arrival="356.15" arrivalLane="c2e_1" arrivalPos="990.00" arrivalPosLat="0.00" arrivalSpeed="14.67" duration="175.50" routeLength="1996.47" waitingTime="20.85" waitingCount="2" stopTime="0.00" timeLoss="38.79" rerouteNo="1" devices="tripinfo_car_n2e_179 routing_car_n2e_179" vType="Car" speedFactor="1.06" vaporized=""/>
    <tripinfo id="car_s2n_203" depart="203.00" departLane="s2sep_1" departPos="3.60" departPosLat="0.00" departSpeed="13.90" departDelay="0.00" arrival="356.15" arrivalLane="c2n_1" arrivalPos="990.00" arrivalPosLat="0.00" arrivalSpeed="14.32" duration="153.15" routeLength="1997.01" waitingTime="0.00" waitingCount="0" stopTime="0.00" timeLoss="13.67" rerouteNo="1" devices="tripinfo_car_s2n_203 routing_car_s2n_203" vType="Car" speedFactor="1.03" vaporized=""/>
    <tripinfo id="car_n2w_215" depart="215.00" departLane="n2sep_1" departPos="3.60" departPosLat="0.00" departSpeed="13.90" departDelay="0.00" arrival="357.55" arrivalLane="c2w_1" arrivalPos="990.00" arrivalPosLat="0.00" arrivalSpeed="14.49" duration="142.55" routeLength="1986.69" waitingTime="0.00" waitingCount="0" stopTime="0.00" timeLoss="4.78" rerouteNo="1" devices="tripinfo_car_n2w_215 routing_car_n2w_215" vType="Car" speedFactor="1.04" vaporized=""/>
    <tripinfo id="car_s2w_166" depart="166.00" departLane="s2sep_1" departPos="3.60" departPosLat="0.00" departSpeed="13.90" departDelay="0.00" arrival="359.70" arrivalLane="c2w_1" arrivalPos="990.00" arrivalPosLat="0.00" arrivalSpeed="15.62" duration="193.70" routeLength="1996.47" waitingTime="51.50" waitingCount="2" stopTime="0.00" timeLoss="68.69" rerouteNo="1" devices="tripinfo_car_s2w_166 routing_car_s2w_166" vType="Car" speedFactor="1.15" vaporized=""/>
    <tripinfo id="car_n2s_216" depart="216.40" departLane="n2sep_1" departPos="3.60" departPosLat="0.00" departSpeed="13.90" departDelay="0.40" arrival="360.55" arrivalLane="c2s_1" arrivalPos="990.00" arrivalPosLat="0.00" arrivalSpeed="14.21" duration="144.15" routeLength="1997.01" waitingTime="0.00" waitingCount="0" stopTime="0.00" timeLoss="3.56" rerouteNo="1" devices="tripinfo_car_n2s_216 routing_car_n2s_216" vType="Car" speedFactor="1.02" vaporized=""/>
    <tripinfo id="bus_s2n_218" depart="218.00" departLane="s2sep_1" departPos="12.10" departPosLat="0.00" departSpeed="13.90" departDelay="0.00" arrival="362.85" arrivalLane="c2n_1" arrivalPos="990.00" arrivalPosLat="0.00" arrivalSpeed="13.89" duration="144.85" routeLength="1988.51" waitingTime="0.00" waitingCount="0" stopTime="0.00" timeLoss="1.77" rerouteNo="1" devices="tripinfo_bus_s2n_218 routing_bus_s2n_218" vType="Bus" speedFactor="1.00" vaporized=""/>
    <tripinfo id="car_s2n_219" depart="219.45" departLane="s2sep_1" departPos="3.60" departPosLat="0.00" departSpeed="13.90" departDelay="0.45" arrival="367.15" arrivalLane="c2n_1" arrivalPos="990.00" arrivalPosLat="0.00" arrivalSpeed="14.11" duration="147.70" routeLength="1997.01" waitingTime="0.00" waitingCount="0" stopTime="0.00" timeLoss="6.35" rerouteNo="1" devices="tripinfo_car_s2n_219 routing_car_s2n_219" vType="Car" speedFactor="1.02" vaporized=""/>
    <tripinfo id="car_s2w_183" depart="183.00" departLane="s2sep_1" departPos="3.60" departPosLat="0.00" departSpeed="13.90" departDelay="0.00" arrival="367.85" arrivalLane="c2w_1" arrivalPos="990.00" arrivalPosLat="0.00" arrivalSpeed="13.90" duration="184.85" routeLength="1996.47" waitingTime="26.45" waitingCount="2" stopTime="0.00" timeLoss="40.53" rerouteNo="1" devices="tripinfo_car_s2w_183 routing_car_s2w_183" vType="Car" speedFactor="1.00" vaporized=""/>
    <tripinfo id="car_n2e_226" depart="226.00" departLane="n2sep_1" departPos="3.60" departPosLat="0.00" departSpeed="13.90" departDelay="0.00" arrival="369.00" arrivalLane="c2e_1" arrivalPos="990.00" arrivalPosLat="0.00" arrivalSpeed="14.42" duration="143.00" routeLength="1996.47" waitingTime="0.00" waitingCount="0" stopTime="0.00" timeLoss="3.91" rerouteNo="1" devices="tripinfo_car_n2e_226 routing_car_n2e_226" vType="Car" speedFactor="1.04" vaporized=""/>
    <tripinfo id="car_s2w_223" depart="223.00" departLane="s2sep_1" departPos="3.60" departPosLat="0.00" departSpeed="13.90" departDelay="0.00" arrival="370.15" arrivalLane="c2w_1" arrivalPos="990.00" arrivalPosLat="0.00" arrivalSpeed="14.89" duration="147.15" routeLength="1996.47" waitingTime="0.00" waitingCount="0" stopTime="0.00" timeLoss="14.97" rerouteNo="1" devices="tripinfo_car_s2w_223 routing_car_s2w_223" vType="Car" speedFactor="1.09" vaporized=""/>
    <tripinfo id="car_s2n_233" depart="233.00" departLane="s2sep_1" departPos="3.60" departPosLat="0.00" departSpeed="13.90" departDelay="0.00" arrival="373.20" arrivalLane="c2n_1" arrivalPos="990.00" arrivalPosLat="0.00" arrivalSpeed="14.69" duration="140.20" routeLength="1997.01" waitingTime="0.00" waitingCount="0" stopTime="0.00" timeLoss="4.24" rerouteNo="1" devices="tripinfo_car_s2n_233 routing_car_s2n_233" vType="Car" speedFactor="1.06" vaporized=""/>
    <tripinfo id="bus_s2w_226" depart="226.00" departLane="s2sep_1" departPos="12.10" departPosLat="0.00" departSpeed="13.90" departDelay="0.00" arrival="377.65" arrivalLane="c2w_1" arrivalPos="990.00" arrivalPosLat="0.00" arrivalSpeed="13.89" duration="151.65" routeLength="1987.97" waitingTime="0.00" waitingCount="0" stopTime="0.00" timeLoss="7.94" rerouteNo="1" devices="tripinfo_bus_s2w_226 routing_bus_s2w_226" vType="Bus" speedFactor="1.00" vaporized=""/>
    <tripinfo id="car_s2w_231" depart="231.00" departLane="s2sep_1" departPos="3.60" departPosLat="0.00" departSpeed="13.90" departDelay="0.00" arrival="380.50" arrivalLane="c2w_1" arrivalPos="990.00" arrivalPosLat="0.00" arrivalSpeed="14.96" duration="149.50" routeLength="1996.47" waitingTime="0.00" waitingCount="0" stopTime="0.00" timeLoss="17.20" rerouteNo="1" devices="tripinfo_car_s2w_231 routing_car_s2w_231" vType="Car" speedFactor="1.09" vaporized=""/>
    <tripinfo id="bus_n2e_230" depart="230.00" departLane="n2sep_1" departPos="12.10" departPosLat="0.00" departSpeed="13.90" departDelay="0.00" arrival="381.90" arrivalLane="c2e_1" arrivalPos="990.00" arrivalPosLat="0.00" arrivalSpeed="13.90" duration="151.90" routeLength="1987.97" waitingTime="0.00" waitingCount="0" stopTime="0.00" timeLoss="8.18" rerouteNo="1" devices="tripinfo_bus_n2e_230 routing_bus_n2e_230" vType="Bus" speedFactor="1.00" vaporized=""/>
    <tripinfo id="car_w2e_192" depart="192.00" departLane="w2sep_1" departPos="3.60" departPosLat="0.00" departSpeed="13.90" departDelay="0.00" arrival="389.00" arrivalLane="c2e_1" arrivalPos="990.00" arrivalPosLat="0.00" arrivalSpeed="14.35" duration="197.00" routeLength="1997.01" waitingTime="50.55" waitingCount="1" stopTime="0.00" timeLoss="57.82" rerouteNo="1" devices="tripinfo_car_w2e_192 routing_car_w2e_192" vType="Car" speedFactor="1.03" vaporized=""/>
    <tripinfo id="car_e2w_214" depart="214.00" departLane="e2sep_1" departPos="3.60" departPosLat="0.00" departSpeed="13.90" departDelay="0.00" arrival="390.90" arrivalLane="c2w_1" arrivalPos="990.00" arrivalPosLat="0.00" arrivalSpeed="13.90" duration="176.90" routeLength="1997.01" waitingTime="25.95" waitingCount="1" stopTime="0.00" timeLoss="33.22" rerouteNo="1" devices="tripinfo_car_e2w_214 routing_car_e2w_214" vType="Car" speedFactor="1.00" vaporized=""/>
    <tripinfo id="car_w2s_243" depart="243.00" departLane="w2sep_1" departPos="3.60" departPosLat="0.00" departSpeed="13.90" departDelay="0.00" arrival="393.60" arrivalLane="c2s_1" arrivalPos="990.00" arrivalPosLat="0.00" arrivalSpeed="15.12" duration="150.60" routeLength="1986.69" waitingTime="6.75" waitingCount="1" stopTime="0.00" timeLoss="18.57" rerouteNo="1" devices="tripinfo_car_w2s_243 routing_car_w2s_243" vType="Car" speedFactor="1.09" vaporized=""/>
    <tripinfo id="car_e2w_226" depart="226.00" departLane="e2sep_1" departPos="3.60" departPosLat="0.00" departSpeed="13.90" departDelay="0.00" arrival="393.90" arrivalLane="c2w_1" arrivalPos="990.00" arrivalPosLat="0.00" arrivalSpeed="14.42" duration="167.90" routeLength="1997.01" waitingTime="17.55" waitingCount="1" stopTime="0.00" timeLoss="30.18" rerouteNo="1" devices="tripinfo_car_e2w_226 routing_car_e2w_226" vType="Car" speedFactor="1.04" vaporized=""/>
    <tripinfo id="car_w2e_193" depart="193.40" departLane="w2sep_1" departPos="3.60" departPosLat="0.00" departSpeed="13.90" departDelay="0.40" arrival="394.10" arrivalLane="c2e_1" arrivalPos="990.00" arrivalPosLat="0.00" arrivalSpeed="14.00" duration="200.70" routeLength="1997.01" waitingTime="46.00" waitingCount="1" stopTime="0.00" timeLoss="58.07" rerouteNo="1" devices="tripinfo_car_w2e_193 routing_car_w2e_193" vType="Car" speedFactor="1.01" vaporized=""/>
    <tripinfo id="car_w2n_203" depart="203.00" departLane="w2sep_1" departPos="3.60" departPosLat="0.00" departSpeed="13.90" departDelay="0.00" arrival="394.35" arrivalLane="c2n_1" arrivalPos="990.00" arrivalPosLat="0.00" arrivalSpeed="14.13" duration="191.35" routeLength="1996.47" waitingTime="38.35" waitingCount="2" stopTime="0.00" timeLoss="49.43" rerouteNo="1" devices="tripinfo_car_w2n_203 routing_car_w2n_203" vType="Car" speedFactor="1.02" vaporized=""/>
    <tripinfo id="car_w2e_215" depart="215.00" departLane="w2sep_1" departPos="3.60" departPosLat="0.00" departSpeed="13.90" departDelay="0.00" arrival="398.00" arrivalLane="c2e_1" arrivalPos="990.00" arrivalPosLat="0.00" arrivalSpeed="13.91" duration="183.00" routeLength="1997.01" waitingTime="27.05" waitingCount="1" stopTime="0.00" timeLoss="39.56" rerouteNo="1" devices="tripinfo_car_w2e_215 routing_car_w2e_215" vType="Car" speedFactor="1.00" vaporized=""/>
    <tripinfo id="car_e2s_198" depart="198.00" departLane="e2sep_1" departPos="3.60" departPosLat="0.00" departSpeed="13.90" departDelay="0.00" arrival="400.40" arrivalLane="c2s_1" arrivalPos="990.00" arrivalPosLat="0.00" arrivalSpeed="14.38" duration="202.40" routeLength="1996.47" waitingTime="50.75" waitingCount="3" stopTime="0.00" timeLoss="62.88" rerouteNo="1" devices="tripinfo_car_e2s_198 routing_car_e2s_198" vType="Car" speedFactor="1.03" vaporized=""/>
    <tripinfo id="car_w2e_216" depart="216.45" departLane="w2sep_1" departPos="3.60" departPosLat="0.00" departSpeed="13.90" departDelay="0.45" arrival="401.20" arrivalLane="c2e_1" arrivalPos="990.00" arrivalPosLat="0.00" arrivalSpeed="13.95" duration="184.75" routeLength="1997.01" waitingTime="24.70" waitingCount="1" stopTime="0.00" timeLoss="42.06" rerouteNo="1" devices="tripinfo_car_w2e_216 routing_car_w2e_216" vType="Car" speedFactor="1.01" vaporized=""/>
    <tripinfo id="car_e2s_235" depart="235.00" departLane="e2sep_1" departPos="3.60" departPosLat="0.00" departSpeed="13.90" departDelay="0.00" arrival="405.30" arrivalLane="c2s_1" arrivalPos="990.00" arrivalPosLat="0.00" arrivalSpeed="14.03" duration="170.30" routeLength="1996.47" waitingTime="11.20" waitingCount="2" stopTime="0.00" timeLoss="27.38" rerouteNo="1" devices="tripinfo_car_e2s_235 routing_car_e2s_235" vType="Car" speedFactor="1.01" vaporized=""/>
    <tripinfo id="car_e2n_258" depart="258.00" departLane="e2sep_1" departPos="3.60" departPosLat="0.00" departSpeed="13.90" departDelay="0.00" arrival="405.50" arrivalLane="c2n_1" arrivalPos="990.00" arrivalPosLat="0.00" arrivalSpeed="13.90" duration="147.50" routeLength="1986.69" waitingTime="0.00" waitingCount="0" stopTime="0.00" timeLoss="3.82" rerouteNo="1" devices="tripinfo_car_e2n_258 routing_car_e2n_258" vType="Car" speedFactor="1.00" vaporized=""/>
    <tripinfo id="car_w2n_278" depart="278.00" departLane="w2sep_1" departPos="3.60" departPosLat="0.00" departSpeed="13.90" departDelay="0.00" arrival="416.25" arrivalLane="c2n_1" arrivalPos="990.00" arrivalPosLat="0.00" arrivalSpeed="14.91" duration="138.25" routeLength="1996.47" waitingTime="0.00" waitingCount="0" stopTime="0.00" timeLoss="3.71" rerouteNo="1" devices="tripinfo_car_w2n_278 routing_car_w2n_278" vType="Car" speedFactor="1.07" vaporized=""/>
    <tripinfo id="car_w2e_299" depart="299.00" departLane="w2sep_1" departPos="3.60" departPosLat="0.00" departSpeed="13.90" departDelay="0.00" arrival="422.30" arrivalLane="c2e_1" arrivalPos="990.00" arrivalPosLat="0.00" arrivalSpeed="16.25" duration="123.30" routeLength="1997.01" waitingTime="0.00" waitingCount="0" stopTime="0.00" timeLoss="0.35" rerouteNo="1" devices="tripinfo_car_w2e_299 routing_car_w2e_299" vType="Car" speedFactor="1.17" vaporized=""/>
    <tripinfo id="amb_w2e_300" depart="302.20" departLane="w2sep_1" departPos="6.60" departPosLat="0.00" departSpeed="13.90" departDelay="2.20" arrival="423.85" arrivalLane="c2e_1" arrivalPos="990.00" arrivalPosLat="-0.95" arrivalSpeed="18.34" duration="121.65" routeLength="1994.01" waitingTime="0.00" waitingCount="0" stopTime="0.00" timeLoss="25.99" rerouteNo="1" devices="tripinfo_amb_w2e_300 routing_amb_w2e_300 bluelight_amb_w2e_300 fcd_amb_w2e_300" vType="Ambulance" speedFactor="1.50" vaporized="">
        <example_device customValue1="0.00" customValue2="-1.00"/>
    </tripinfo>
    <tripinfo id="car_e2n_273" depart="273.00" departLane="e2sep_1" departPos="3.60" departPosLat="0.00" departSpeed="13.90" departDelay="0.00" arrival="440.25" arrivalLane="c2n_1" arrivalPos="990.00" arrivalPosLat="0.00" arrivalSpeed="13.90" duration="167.25" routeLength="1986.69" waitingTime="18.70" waitingCount="1" stopTime="0.00" timeLoss="23.58" rerouteNo="1" devices="tripinfo_car_e2n_273 routing_car_e2n_273" vType="Car" speedFactor="1.00" vaporized=""/>
    <tripinfo id="car_w2e_300" depart="300.25" departLane="w2sep_1" departPos="3.60" departPosLat="0.00" departSpeed="13.90" departDelay="0.25" arrival="442.50" arrivalLane="c2e_1" arrivalPos="990.00" arrivalPosLat="0.00" arrivalSpeed="14.13" duration="142.25" routeLength="1997.01" waitingTime="0.00" waitingCount="0" stopTime="0.00" timeLoss="0.92" rerouteNo="1" devices="tripinfo_car_w2e_300 routing_car_w2e_300" vType="Car" speedFactor="1.02" vaporized=""/>
    <tripinfo id="car_e2n_297" depart="297.00" departLane="e2sep_1" departPos="3.60" departPosLat="0.00" departSpeed="13.90" departDelay="0.00" arrival="445.55" arrivalLane="c2n_1" arrivalPos="990.00" arrivalPosLat="0.00" arrivalSpeed="13.90" duration="148.55" routeLength="1986.69" waitingTime="0.00" waitingCount="0" stopTime="0.00" timeLoss="4.88" rerouteNo="1" devices="tripinfo_car_e2n_297 routing_car_e2n_297" vType="Car" speedFactor="1.00" vaporized=""/>
    <tripinfo id="car_e2s_278" depart="278.00" departLane="e2sep_1" departPos="3.60" departPosLat="0.00" departSpeed="13.90" departDelay="0.00" arrival="446.05" arrivalLane="c2s_1" arrivalPos="990.00" arrivalPosLat="0.00" arrivalSpeed="14.09" duration="168.05" routeLength="1996.47" waitingTime="14.15" waitingCount="2" stopTime="0.00" timeLoss="25.69" rerouteNo="1" devices="tripinfo_car_e2s_278 routing_car_e2s_278" vType="Car" speedFactor="1.01" vaporized=""/>
    <tripinfo id="car_e2s_300" depart="300.00" departLane="e2sep_1" departPos="3.60" departPosLat="0.00" departSpeed="13.90" departDelay="0.00" arrival="448.45" arrivalLane="c2s_1" arrivalPos="990.00" arrivalPosLat="0.00" arrivalSpeed="15.02" duration="148.45" routeLength="1996.47" waitingTime="0.00" waitingCount="0" stopTime="0.00" timeLoss="17.04" rerouteNo="1" devices="tripinfo_car_e2s_300 routing_car_e2s_300" vType="Car" speedFactor="1.10" vaporized=""/>
    <tripinfo id="car_s2n_246" depart="246.00" departLane="s2sep_1" departPos="3.60" departPosLat="0.00" departSpeed="13.90" departDelay="0.00" arrival="450.60" arrivalLane="c2n_1" arrivalPos="990.00" arrivalPosLat="0.00" arrivalSpeed="15.58" duration="204.60" routeLength="1997.01" waitingTime="68.00" waitingCount="1" stopTime="0.00" timeLoss="76.47" rerouteNo="1" devices="tripinfo_car_s2n_246 routing_car_s2n_246" vType="Car" speedFactor="1.12" vaporized=""/>
    <tripinfo id="car_n2w_249" depart="249.00" departLane="n2sep_1" departPos="3.60" departPosLat="0.00" departSpeed="13.90" departDelay="0.00" arrival="451.30" arrivalLane="c2w_1" arrivalPos="990.00" arrivalPosLat="0.00" arrivalSpeed="15.25" duration="202.30" routeLength="1986.69" waitingTime="63.80" waitingCount="1" stopTime="0.00" timeLoss="71.37" rerouteNo="1" devices="tripinfo_car_n2w_249 routing_car_n2w_249" vType="Car" speedFactor="1.10" vaporized=""/>
    <tripinfo id="car_s2n_257" depart="257.00" departLane="s2sep_1" departPos="3.60" departPosLat="0.00" departSpeed="13.90" departDelay="0.00" arrival="456.65" arrivalLane="c2n_1" arrivalPos="990.00" arrivalPosLat="0.00" arrivalSpeed="14.80" duration="199.65" routeLength="1997.01" waitingTime="54.75" waitingCount="1" stopTime="0.00" timeLoss="64.71" rerouteNo="1" devices="tripinfo_car_s2n_257 routing_car_s2n_257" vType="Car" speedFactor="1.07" vaporized=""/>
    <tripinfo id="car_s2w_279" depart="279.00" departLane="s2sep_1" departPos="3.60" departPosLat="0.00" departSpeed="13.90" departDelay="0.00" arrival="458.20" arrivalLane="c2w_1" arrivalPos="990.00" arrivalPosLat="0.00" arrivalSpeed="14.38" duration="179.20" routeLength="1996.47" waitingTime="27.60" waitingCount="1" stopTime="0.00" timeLoss="39.67" rerouteNo="1" devices="tripinfo_car_s2w_279 routing_car_s2w_279" vType="Car" speedFactor="1.03" vaporized=""/>
    <tripinfo id="car_s2e_267" depart="267.00" departLane="s2sep_1" departPos="3.60" departPosLat="0.00" departSpeed="13.90" departDelay="0.00" arrival="462.05" arrivalLane="c2e_1" arrivalPos="990.00" arrivalPosLat="0.00" arrivalSpeed="13.90" duration="195.05" routeLength="1986.69" waitingTime="41.80" waitingCount="1" stopTime="0.00" timeLoss="51.38" rerouteNo="1" devices="tripinfo_car_s2e_267 routing_car_s2e_267" vType="Car" speedFactor="1.00" vaporized=""/>
    <tripinfo id="bus_s2w_284" depart="284.00" departLane="s2sep_1" departPos="12.10" departPosLat="0.00" departSpeed="13.90" departDelay="0.00" arrival="465.00" arrivalLane="c2w_1" arrivalPos="990.00" arrivalPosLat="0.00" arrivalSpeed="13.89" duration="181.00" routeLength="1987.97" waitingTime="24.25" waitingCount="1" stopTime="0.00" timeLoss="37.28" rerouteNo="1" devices="tripinfo_bus_s2w_284 routing_bus_s2w_284" vType="Bus" speedFactor="1.00" vaporized=""/>
    <tripinfo id="car_s2e_276" depart="276.00" departLane="s2sep_1" departPos="3.60" departPosLat="0.00" departSpeed="13.90" departDelay="0.00" arrival="466.50" arrivalLane="c2e_1" arrivalPos="990.00" arrivalPosLat="0.00" arrivalSpeed="13.89" duration="190.50" routeLength="1986.69" waitingTime="33.95" waitingCount="1" stopTime="0.00" timeLoss="46.86" rerouteNo="1" devices="tripinfo_car_s2e_276 routing_car_s2e_276" vType="Car" speedFactor="1.00" vaporized=""/>
    <tripinfo id="car_s2n_313" depart="313.00" departLane="s2sep_1" departPos="3.60" departPosLat="0.00" departSpeed="13.90" departDelay="0.00" arrival="466.50" arrivalLane="c2n_1" arrivalPos="990.00" arrivalPosLat="0.00" arrivalSpeed="13.90" duration="153.50" routeLength="1997.01" waitingTime="0.00" waitingCount="0" stopTime="0.00" timeLoss="9.81" rerouteNo="1" devices="tripinfo_car_s2n_313 routing_car_s2n_313" vType="Car" speedFactor="1.00" vaporized=""/>
    <tripinfo id="car_s2e_318" depart="318.00" departLane="s2sep_1" departPos="3.60" departPosLat="0.00" departSpeed="13.90" departDelay="0.00" arrival="469.55" arrivalLane="c2e_1" arrivalPos="990.00" arrivalPosLat="0.00" arrivalSpeed="14.26" duration="151.55" routeLength="1986.69" waitingTime="0.00" waitingCount="0" stopTime="0.00" timeLoss="12.25" rerouteNo="1" devices="tripinfo_car_s2e_318 routing_car_s2e_318" vType="Car" speedFactor="1.03" vaporized=""/>
    <tripinfo id="car_n2e_280" depart="280.00" departLane="n2sep_1" departPos="3.60" departPosLat="0.00" departSpeed="13.90" departDelay="0.00" arrival="472.05" arrivalLane="c2e_1" arrivalPos="990.00" arrivalPosLat="0.00" arrivalSpeed="14.62" duration="192.05" routeLength="1996.47" waitingTime="40.80" waitingCount="2" stopTime="0.00" timeLoss="56.48" rerouteNo="1" devices="tripinfo_car_n2e_280 routing_car_n2e_280" vType="Car" speedFactor="1.06" vaporized=""/>
    <tripinfo id="car_s2n_345" depart="345.00" departLane="s2sep_1" departPos="3.60" departPosLat="0.00" departSpeed="13.90" departDelay="0.00" arrival="474.10" arrivalLane="c2n_1" arrivalPos="990.00" arrivalPosLat="0.00" arrivalSpeed="15.55" duration="129.10" routeLength="1997.01" waitingTime="0.00" waitingCount="0" stopTime="0.00" timeLoss="0.61" rerouteNo="1" devices="tripinfo_car_s2n_345 routing_car_s2n_345" vType="Car" speedFactor="1.12" vaporized=""/>
</tripinfos>
