<?xml version="1.0" encoding="UTF-8"?>

<!-- generated on Sat Apr 24 18:12:02 2021 by Eclipse SUMO Version 1.4.0
<configuration xmlns:xsi="http://www.w3.org/2001/XMLSchema-instance" xsi:noNamespaceSchemaLocation="http://sumo.dlr.de/xsd/sumoConfiguration.xsd">

    <input>
        <net-file value="sumofiles/junction.net.xml"/>
        <route-files value="sumofiles/junction_preemption_95.rou.xml"/>
        <additional-files value="sumofiles/junction.det.xml"/>
    </input>

    <output>
        <tripinfo-output value="sumofiles/output/tripinfo_preemption_95.xml"/>
    </output>

    <time>
        <begin value="0"/>
        <end value="10000"/>
        <step-length value="0.05"/>
    </time>

    <processing>
        <lateral-resolution value="0.1"/>
    </processing>

    <report>
        <no-warnings value="true"/>
        <error-log value="sumofiles/output/errorlog_preemption_95.log"/>
        <no-step-log value="true"/>
    </report>

    <traci_server>
        <remote-port value="54259"/>
    </traci_server>

    <gui_only>
        <gui-settings-file value="sumofiles/junction-gui.settings.xml"/>
        <tracker-interval value="0.05"/>
    </gui_only>

</configuration>
-->

<tripinfos xmlns:xsi="http://www.w3.org/2001/XMLSchema-instance" xsi:noNamespaceSchemaLocation="http://sumo.dlr.de/xsd/tripinfo_file.xsd">
    <tripinfo id="car_e2s_5" depart="5.00" departLane="e2sep_1" departPos="3.60" departPosLat="0.00" departSpeed="13.90" departDelay="0.00" arrival="144.70" arrivalLane="c2s_1" arrivalPos="990.00" arrivalPosLat="0.00" arrivalSpeed="14.73" duration="139.70" routeLength="1996.47" waitingTime="0.00" waitingCount="0" stopTime="0.00" timeLoss="3.54" rerouteNo="1" devices="tripinfo_car_e2s_5 routing_car_e2s_5" vType="Car" speedFactor="1.06" vaporized=""/>
    <tripinfo id="car_e2s_6" depart="8.15" departLane="e2sep_1" departPos="3.60" departPosLat="0.00" departSpeed="13.90" departDelay="2.15" arrival="152.05" arrivalLane="c2s_1" arrivalPos="990.00" arrivalPosLat="0.00" arrivalSpeed="15.05" duration="143.90" routeLength="1996.47" waitingTime="0.00" waitingCount="0" stopTime="0.00" timeLoss="10.57" rerouteNo="1" devices="tripinfo_car_e2s_6 routing_car_e2s_6" vType="Car" speedFactor="1.08" vaporized=""/>
    <tripinfo id="car_n2e_0" depart="0.00" departLane="n2sep_1" departPos="3.60" departPosLat="0.00" departSpeed="13.90" departDelay="0.00" arrival="162.80" arrivalLane="c2e_1" arrivalPos="990.00" arrivalPosLat="0.00" arrivalSpeed="14.73" duration="162.80" routeLength="1996.47" waitingTime="18.75" waitingCount="1" stopTime="0.00" timeLoss="26.65" rerouteNo="1" devices="tripinfo_car_n2e_0 routing_car_n2e_0" vType="Car" speedFactor="1.06" vaporized=""/>
    <tripinfo id="car_n2w_8" depart="8.00" departLane="n2sep_1" departPos="3.60" departPosLat="0.00" departSpeed="13.90" departDelay="0.00" arrival="163.55" arrivalLane="c2w_1" arrivalPos="990.00" arrivalPosLat="0.00" arrivalSpeed="14.32" duration="155.55" routeLength="1986.69" waitingTime="8.80" waitingCount="1" stopTime="0.00" timeLoss="16.13" rerouteNo="1" devices="tripinfo_car_n2w_8 routing_car_n2w_8" vType="Car" speedFactor="1.03" vaporized=""/>
    <tripinfo id="car_n2w_12" depart="12.00" departLane="n2sep_1" departPos="3.60" departPosLat="0.00" departSpeed="13.90" departDelay="0.00" arrival="167.45" arrivalLane="c2w_1" arrivalPos="990.00" arrivalPosLat="0.00" arrivalSpeed="14.51" duration="155.45" routeLength="1986.69" waitingTime="5.80" waitingCount="1" stopTime="0.00" timeLoss="18.06" rerouteNo="1" devices="tripinfo_car_n2w_12 routing_car_n2w_12" vType="Car" speedFactor="1.05" vaporized=""/>
    <tripinfo id="car_n2e_16" depart="16.00" departLane="n2sep_1" departPos="3.60" departPosLat="0.00" departSpeed="13.90" departDelay="0.00" arrival="169.60" arrivalLane="c2e_1" arrivalPos="990.00" arrivalPosLat="0.00" arrivalSpeed="14.04" duration="153.60" routeLength="1996.47" waitingTime="0.00" waitingCount="0" stopTime="0.00" timeLoss="10.75" rerouteNo="1" devices="tripinfo_car_n2e_16 routing_car_n2e_16" vType="Car" speedFactor="1.01" vaporized=""/>
    <tripinfo id="car_s2n_28" depart="29.30" departLane="s2sep_1" departPos="3.60" departPosLat="0.00" departSpeed="13.90" departDelay="1.30" arrival="171.15" arrivalLane="c2n_1" arrivalPos="990.00" arrivalPosLat="0.00" arrivalSpeed="14.27" duration="141.85" routeLength="1997.01" waitingTime="0.00" waitingCount="0" stopTime="0.00" timeLoss="1.84" rerouteNo="1" devices="tripinfo_car_s2n_28 routing_car_s2n_28" vType="Car" speedFactor="1.03" vaporized=""/>
    <tripinfo id="car_n2w_22" depart="22.00" departLane="n2sep_1" departPos="3.60" departPosLat="0.00" departSpeed="13.90" departDelay="0.00" arrival="171.30" arrivalLane="c2w_1" arrivalPos="990.00" arrivalPosLat="0.00" arrivalSpeed="14.30" duration="149.30" routeLength="1986.69" waitingTime="0.00" waitingCount="0" stopTime="0.00" timeLoss="9.85" rerouteNo="1" devices="tripinfo_car_n2w_22 routing_car_n2w_22" vType="Car" speedFactor="1.03" vaporized=""/>
    <tripinfo id="car_s2e_29" depart="31.05" departLane="s2sep_1" departPos="3.60" departPosLat="0.00" departSpeed="13.90" departDelay="2.05" arrival="172.35" arrivalLane="c2e_1" arrivalPos="990.00" arrivalPosLat="0.00" arrivalSpeed="15.45" duration="141.30" routeLength="1986.69" waitingTime="0.00" waitingCount="0" stopTime="0.00" timeLoss="13.35" rerouteNo="1" devices="tripinfo_car_s2e_29 routing_car_s2e_29" vType="Car" speedFactor="1.12" vaporized=""/>
    <tripinfo id="car_s2w_20" depart="20.00" departLane="s2sep_1" departPos="3.60" departPosLat="0.00" departSpeed="13.90" departDelay="0.00" arrival="173.75" arrivalLane="c2w_1" arrivalPos="990.00" arrivalPosLat="0.00" arrivalSpeed="14.84" duration="153.75" routeLength="1996.47" waitingTime="3.60" waitingCount="2" stopTime="0.00" timeLoss="20.44" rerouteNo="1" devices="tripinfo_car_s2w_20 routing_car_s2w_20" vType="Car" speedFactor="1.08" vaporized=""/>
    <tripinfo id="car_s2w_28" depart="28.00" departLane="s2sep_1" departPos="3.60" departPosLat="0.00" departSpeed="13.90" departDelay="0.00" arrival="176.15" arrivalLane="c2w_1" arrivalPos="990.00" arrivalPosLat="0.00" arrivalSpeed="14.94" duration="148.15" routeLength="1996.47" waitingTime="1.00" waitingCount="1" stopTime="0.00" timeLoss="15.82" rerouteNo="1" devices="tripinfo_car_s2w_28 routing_car_s2w_28" vType="Car" speedFactor="1.09" vaporized=""/>
    <tripinfo id="car_n2w_35" depart="35.00" departLane="n2sep_1" departPos="3.60" departPosLat="0.00" departSpeed="13.90" departDelay="0.00" arrival="182.90" arrivalLane="c2w_1" arrivalPos="990.00" arrivalPosLat="0.00" arrivalSpeed="13.90" duration="147.90" routeLength="1986.69" waitingTime="0.00" waitingCount="0" stopTime="0.00" timeLoss="4.20" rerouteNo="1" devices="tripinfo_car_n2w_35 routing_car_n2w_35" vType="Car" speedFactor="1.00" vaporized=""/>
    <tripinfo id="car_n2s_39" depart="39.00" departLane="n2sep_1" departPos="3.60" departPosLat="0.00" departSpeed="13.90" departDelay="0.00" arrival="184.50" arrivalLane="c2s_1" arrivalPos="990.00" arrivalPosLat="0.00" arrivalSpeed="13.90" duration="145.50" routeLength="1997.01" waitingTime="0.00" waitingCount="0" stopTime="0.00" timeLoss="1.80" rerouteNo="1" devices="tripinfo_car_n2s_39 routing_car_n2s_39" vType="Car" speedFactor="1.00" vaporized=""/>
    <tripinfo id="car_n2e_42" depart="42.00" departLane="n2sep_1" departPos="3.60" departPosLat="0.00" departSpeed="13.90" departDelay="0.00" arrival="191.60" arrivalLane="c2e_1" arrivalPos="990.00" arrivalPosLat="0.00" arrivalSpeed="13.90" duration="149.60" routeLength="1996.47" waitingTime="0.00" waitingCount="0" stopTime="0.00" timeLoss="5.28" rerouteNo="1" devices="tripinfo_car_n2e_42 routing_car_n2e_42" vType="Car" speedFactor="1.00" vaporized=""/>
    <tripinfo id="car_e2n_6" depart="6.35" departLane="e2sep_1" departPos="3.60" departPosLat="0.00" departSpeed="13.90" departDelay="0.35" arrival="209.90" arrivalLane="c2n_1" arrivalPos="990.00" arrivalPosLat="0.00" arrivalSpeed="14.04" duration="203.55" routeLength="1986.69" waitingTime="52.95" waitingCount="1" stopTime="0.00" timeLoss="61.37" rerouteNo="1" devices="tripinfo_car_e2n_6 routing_car_e2n_6" vType="Car" speedFactor="1.01" vaporized=""/>
    <tripinfo id="car_w2s_11" depart="11.00" departLane="w2sep_1" departPos="3.60" departPosLat="0.00" departSpeed="13.90" departDelay="0.00" arrival="210.65" arrivalLane="c2s_1" arrivalPos="990.00" arrivalPosLat="0.00" arrivalSpeed="13.90" duration="199.65" routeLength="1986.69" waitingTime="49.30" waitingCount="1" stopTime="0.00" timeLoss="55.97" rerouteNo="1" devices="tripinfo_car_w2s_11 routing_car_w2s_11" vType="Car" speedFactor="1.00" vaporized=""/>
    <tripinfo id="car_w2e_51" depart="51.00" departLane="w2sep_1" departPos="3.60" departPosLat="0.00" departSpeed="13.90" departDelay="0.00" arrival="211.60" arrivalLane="c2e_1" arrivalPos="990.00" arrivalPosLat="0.00" arrivalSpeed="14.15" duration="160.60" routeLength="1997.01" waitingTime="11.05" waitingCount="1" stopTime="0.00" timeLoss="19.46" rerouteNo="1" devices="tripinfo_car_w2e_51 routing_car_w2e_51" vType="Car" speedFactor="1.02" vaporized=""/>
    <tripinfo id="car_w2e_78" depart="78.00" departLane="w2sep_1" departPos="3.60" departPosLat="0.00" departSpeed="13.90" departDelay="0.00" arrival="213.75" arrivalLane="c2e_1" arrivalPos="990.00" arrivalPosLat="0.00" arrivalSpeed="15.31" duration="135.75" routeLength="1997.01" waitingTime="0.00" waitingCount="0" stopTime="0.00" timeLoss="8.78" rerouteNo="1" devices="tripinfo_car_w2e_78 routing_car_w2e_78" vType="Car" speedFactor="1.13" vaporized=""/>
    <tripinfo id="car_e2w_29" depart="29.00" departLane="e2sep_1" departPos="3.60" departPosLat="0.00" departSpeed="13.90" departDelay="0.00" arrival="214.60" arrivalLane="c2w_1" arrivalPos="990.00" arrivalPosLat="0.00" arrivalSpeed="14.55" duration="185.60" routeLength="1997.01" waitingTime="36.85" waitingCount="1" stopTime="0.00" timeLoss="48.39" rerouteNo="1" devices="tripinfo_car_e2w_29 routing_car_e2w_29" vType="Car" speedFactor="1.05" vaporized=""/>
    <tripinfo id="car_e2s_36" depart="36.00" departLane="e2sep_1" departPos="3.60" departPosLat="0.00" departSpeed="13.90" departDelay="0.00" arrival="216.00" arrivalLane="c2s_1" arrivalPos="990.00" arrivalPosLat="0.00" arrivalSpeed="14.53" duration="180.00" routeLength="1996.47" waitingTime="29.85" waitingCount="2" stopTime="0.00" timeLoss="42.00" rerouteNo="1" devices="tripinfo_car_e2s_36 routing_car_e2s_36" vType="Car" speedFactor="1.05" vaporized=""/>
    <tripinfo id="car_e2w_43" depart="43.00" departLane="e2sep_1" departPos="3.60" departPosLat="0.00" departSpeed="13.90" departDelay="0.00" arrival="216.80" arrivalLane="c2w_1" arrivalPos="990.00" arrivalPosLat="0.00" arrivalSpeed="15.70" duration="173.80" routeLength="1997.01" waitingTime="22.30" waitingCount="1" stopTime="0.00" timeLoss="49.76" rerouteNo="1" devices="tripinfo_car_e2w_43 routing_car_e2w_43" vType="Car" speedFactor="1.16" vaporized=""/>
    <tripinfo id="bus_e2n_17" depart="17.00" departLane="e2sep_1" departPos="12.10" departPosLat="0.00" departSpeed="13.90" departDelay="0.00" arrival="216.95" arrivalLane="c2n_1" arrivalPos="990.00" arrivalPosLat="0.00" arrivalSpeed="13.89" duration="199.95" routeLength="1978.19" waitingTime="44.95" waitingCount="1" stopTime="0.00" timeLoss="56.89" rerouteNo="1" devices="tripinfo_bus_e2n_17 routing_bus_e2n_17" vType="Bus" speedFactor="1.00" vaporized=""/>
    <tripinfo id="car_e2s_69" depart="69.00" departLane="e2sep_1" departPos="3.60" departPosLat="0.00" departSpeed="13.90" departDelay="0.00" arrival="219.90" arrivalLane="c2s_1" arrivalPos="990.00" arrivalPosLat="0.00" arrivalSpeed="14.53" duration="150.90" routeLength="1996.47" waitingTime="0.00" waitingCount="0" stopTime="0.00" timeLoss="13.08" rerouteNo="1" devices="tripinfo_car_e2s_69 routing_car_e2s_69" vType="Car" speedFactor="1.05" vaporized=""/>
    <tripinfo id="car_e2n_41" depart="41.00" departLane="e2sep_1" departPos="3.60" departPosLat="0.00" departSpeed="13.90" departDelay="0.00" arrival="222.05" arrivalLane="c2n_1" arrivalPos="990.00" arrivalPosLat="0.00" arrivalSpeed="13.89" duration="181.05" routeLength="1986.69" waitingTime="22.85" waitingCount="1" stopTime="0.00" timeLoss="37.37" rerouteNo="1" devices="tripinfo_car_e2n_41 routing_car_e2n_41" vType="Car" speedFactor="1.00" vaporized=""/>
    <tripinfo id="car_e2w_60" depart="60.00" departLane="e2sep_1" departPos="3.60" departPosLat="0.00" departSpeed="13.90" departDelay="0.00" arrival="224.10" arrivalLane="c2w_1" arrivalPos="990.00" arrivalPosLat="0.00" arrivalSpeed="14.04" duration="164.10" routeLength="1997.01" waitingTime="7.45" waitingCount="1" stopTime="0.00" timeLoss="21.87" rerouteNo="1" devices="tripinfo_car_e2w_60 routing_car_e2w_60" vType="Car" speedFactor="1.01" vaporized=""/>
    <tripinfo id="car_e2w_62" depart="62.00" departLane="e2sep_1" departPos="3.60" departPosLat="0.00" departSpeed="13.90" departDelay="0.00" arrival="226.50" arrivalLane="c2w_1" arrivalPos="990.00" arrivalPosLat="0.00" arrivalSpeed="14.92" duration="164.50" routeLength="1997.01" waitingTime="6.65" waitingCount="1" stopTime="0.00" timeLoss="32.74" rerouteNo="1" devices="tripinfo_car_e2w_62 routing_car_e2w_62" vType="Car" speedFactor="1.09" vaporized=""/>
    <tripinfo id="car_w2s_94" depart="94.00" departLane="w2sep_1" departPos="3.60" departPosLat="0.00" departSpeed="13.90" departDelay="0.00" arrival="228.10" arrivalLane="c2s_1" arrivalPos="990.00" arrivalPosLat="0.00" arrivalSpeed="16.40" duration="134.10" routeLength="1986.69" waitingTime="0.00" waitingCount="0" stopTime="0.00" timeLoss="12.33" rerouteNo="1" devices="tripinfo_car_w2s_94 routing_car_w2s_94" vType="Car" speedFactor="1.18" vaporized=""/>
    <tripinfo id="car_e2w_64" depart="64.00" departLane="e2sep_1" departPos="3.60" departPosLat="0.00" departSpeed="13.90" departDelay="0.00" arrival="229.95" arrivalLane="c2w_1" arrivalPos="990.00" arrivalPosLat="0.00" arrivalSpeed="14.23" duration="165.95" routeLength="1997.01" waitingTime="4.55" waitingCount="1" stopTime="0.00" timeLoss="25.94" rerouteNo="1" devices="tripinfo_car_e2w_64 routing_car_e2w_64" vType="Car" speedFactor="1.03" vaporized=""/>
    <tripinfo id="car_e2n_71" depart="71.00" departLane="e2sep_1" departPos="3.60" departPosLat="0.00" departSpeed="13.90" departDelay="0.00" arrival="230.50" arrivalLane="c2n_1" arrivalPos="990.00" arrivalPosLat="0.00" arrivalSpeed="13.90" duration="159.50" routeLength="1986.69" waitingTime="0.00" waitingCount="0" stopTime="0.00" timeLoss="15.84" rerouteNo="1" devices="tripinfo_car_e2n_71 routing_car_e2n_71" vType="Car" speedFactor="1.00" vaporized=""/>
    <tripinfo id="car_w2e_91" depart="91.00" departLane="w2sep_1" departPos="3.60" departPosLat="0.00" departSpeed="13.90" departDelay="0.00" arrival="232.20" arrivalLane="c2e_1" arrivalPos="990.00" arrivalPosLat="0.00" arrivalSpeed="14.17" duration="141.20" routeLength="1997.01" waitingTime="0.00" waitingCount="0" stopTime="0.00" timeLoss="0.28" rerouteNo="1" devices="tripinfo_car_w2e_91 routing_car_w2e_91" vType="Car" speedFactor="1.02" vaporized=""/>
    <tripinfo id="car_e2n_79" depart="79.00" departLane="e2sep_1" departPos="3.60" departPosLat="0.00" departSpeed="13.90" departDelay="0.00" arrival="234.80" arrivalLane="c2n_1" arrivalPos="990.00" arrivalPosLat="0.00" arrivalSpeed="13.89" duration="155.80" routeLength="1986.69" waitingTime="0.00" waitingCount="0" stopTime="0.00" timeLoss="12.14" rerouteNo="1" devices="tripinfo_car_e2n_79 routing_car_e2n_79" vType="Car" speedFactor="1.00" vaporized=""/>
    <tripinfo id="car_e2n_85" depart="85.00" departLane="e2sep_1" departPos="3.60" departPosLat="0.00" departSpeed="13.90" departDelay="0.00" arrival="236.60" arrivalLane="c2n_1" arrivalPos="990.00" arrivalPosLat="0.00" arrivalSpeed="15.41" duration="151.60" routeLength="1986.69" waitingTime="0.00" waitingCount="0" stopTime="0.00" timeLoss="29.71" rerouteNo="1" devices="tripinfo_car_e2n_85 routing_car_e2n_85" vType="Car" speedFactor="1.18" vaporized=""/>
    <tripinfo id="car_e2w_87" depart="88.00" departLane="e2sep_1" departPos="3.60" departPosLat="0.00" departSpeed="13.90" departDelay="1.00" arrival="239.00" arrivalLane="c2w_1" arrivalPos="990.00" arrivalPosLat="0.00" arrivalSpeed="13.90" duration="151.00" routeLength="1997.01" waitingTime="0.00" waitingCount="0" stopTime="0.00" timeLoss="7.31" rerouteNo="1" devices="tripinfo_car_e2w_87 routing_car_e2w_87" vType="Car" speedFactor="1.00" vaporized=""/>
    <tripinfo id="car_e2n_86" depart="86.25" departLane="e2sep_1" departPos="3.60" departPosLat="0.00" departSpeed="13.90" departDelay="0.25" arrival="240.10" arrivalLane="c2n_1" arrivalPos="990.00" arrivalPosLat="0.00" arrivalSpeed="13.94" duration="153.85" routeLength="1986.69" waitingTime="0.00" waitingCount="0" stopTime="0.00" timeLoss="10.94" rerouteNo="1" devices="tripinfo_car_e2n_86 routing_car_e2n_86" vType="Car" speedFactor="1.01" vaporized=""/>
    <tripinfo id="car_e2n_92" depart="92.00" departLane="e2sep_1" departPos="3.60" departPosLat="0.00" departSpeed="13.90" departDelay="0.00" arrival="243.85" arrivalLane="c2n_1" arrivalPos="990.00" arrivalPosLat="0.00" arrivalSpeed="13.88" duration="151.85" routeLength="1986.69" waitingTime="0.00" waitingCount="0" stopTime="0.00" timeLoss="8.19" rerouteNo="1" devices="tripinfo_car_e2n_92 routing_car_e2n_92" vType="Car" speedFactor="1.00" vaporized=""/>
    <tripinfo id="car_w2n_70" depart="70.00" departLane="w2sep_1" departPos="3.60" departPosLat="0.00" departSpeed="13.90" departDelay="0.00" arrival="245.85" arrivalLane="c2n_1" arrivalPos="990.00" arrivalPosLat="0.00" arrivalSpeed="15.03" duration="175.85" routeLength="1996.47" waitingTime="28.80" waitingCount="1" stopTime="0.00" timeLoss="47.30" rerouteNo="1" devices="tripinfo_car_w2n_70 routing_car_w2n_70" vType="Car" speedFactor="1.12" vaporized=""/>
    <tripinfo id="car_w2n_86" depart="86.00" departLane="w2sep_1" departPos="3.60" departPosLat="0.00" departSpeed="13.90" departDelay="0.00" arrival="247.70" arrivalLane="c2n_1" arrivalPos="990.00" arrivalPosLat="0.00" arrivalSpeed="15.32" duration="161.70" routeLength="1996.47" waitingTime="16.45" waitingCount="1" stopTime="0.00" timeLoss="36.69" rerouteNo="1" devices="tripinfo_car_w2n_86 routing_car_w2n_86" vType="Car" speedFactor="1.15" vaporized=""/>
    <tripinfo id="car_w2n_96" depart="96.00" departLane="w2sep_1" departPos="3.60" departPosLat="0.00" departSpeed="13.90" departDelay="0.00" arrival="249.85" arrivalLane="c2n_1" arrivalPos="990.00" arrivalPosLat="0.00" arrivalSpeed="14.96" duration="153.85" routeLength="1996.47" waitingTime="0.00" waitingCount="0" stopTime="0.00" timeLoss="22.93" rerouteNo="1" devices="tripinfo_car_w2n_96 routing_car_w2n_96" vType="Car" speedFactor="1.10" vaporized=""/>
    <tripinfo id="car_n2s_74" depart="74.00" departLane="n2sep_1" departPos="3.60" departPosLat="0.00" departSpeed="13.90" departDelay="0.00" arrival="255.70" arrivalLane="c2s_1" arrivalPos="990.00" arrivalPosLat="0.00" arrivalSpeed="13.90" duration="181.70" routeLength="1997.01" waitingTime="31.00" waitingCount="1" stopTime="0.00" timeLoss="38.02" rerouteNo="1" devices="tripinfo_car_n2s_74 routing_car_n2s_74" vType="Car" speedFactor="1.00" vaporized=""/>
    <tripinfo id="car_n2s_108" depart="108.00" departLane="n2sep_1" departPos="3.60" departPosLat="0.00" departSpeed="13.90" departDelay="0.00" arrival="258.75" arrivalLane="c2s_1" arrivalPos="990.00" arrivalPosLat="0.00" arrivalSpeed="14.43" duration="150.75" routeLength="1997.01" waitingTime="0.60" waitingCount="1" stopTime="0.00" timeLoss="13.03" rerouteNo="1" devices="tripinfo_car_n2s_108 routing_car_n2s_108" vType="Car" speedFactor="1.04" vaporized=""/>
    <tripinfo id="car_n2w_109" depart="109.40" departLane="n2sep_1" departPos="3.60" departPosLat="0.00" departSpeed="13.90" departDelay="0.40" arrival="259.20" arrivalLane="c2w_1" arrivalPos="990.00" arrivalPosLat="0.00" arrivalSpeed="14.04" duration="149.80" routeLength="1986.69" waitingTime="0.00" waitingCount="0" stopTime="0.00" timeLoss="7.55" rerouteNo="1" devices="tripinfo_car_n2w_109 routing_car_n2w_109" vType="Car" speedFactor="1.01" vaporized=""/>
    <tripinfo id="bus_s2n_85" depart="85.00" departLane="s2sep_1" departPos="12.10" departPosLat="0.00" departSpeed="13.90" departDelay="0.00" arrival="259.40" arrivalLane="c2n_1" arrivalPos="990.00" arrivalPosLat="0.00" arrivalSpeed="13.90" duration="174.40" routeLength="1988.51" waitingTime="20.30" waitingCount="1" stopTime="0.00" timeLoss="31.34" rerouteNo="1" devices="tripinfo_bus_s2n_85 routing_bus_s2n_85" vType="Bus" speedFactor="1.00" vaporized=""/>
    <tripinfo id="car_s2e_101" depart="101.00" departLane="s2sep_1" departPos="3.60" departPosLat="0.00" departSpeed="13.90" departDelay="0.00" arrival="260.45" arrivalLane="c2e_1" arrivalPos="990.00" arrivalPosLat="0.00" arrivalSpeed="14.32" duration="159.45" routeLength="1986.69" waitingTime="8.70" waitingCount="1" stopTime="0.00" timeLoss="19.99" rerouteNo="1" devices="tripinfo_car_s2e_101 routing_car_s2e_101" vType="Car" speedFactor="1.03" vaporized=""/>
    <tripinfo id="car_s2n_86" depart="86.45" departLane="s2sep_1" departPos="3.60" departPosLat="0.00" departSpeed="13.90" departDelay="0.45" arrival="261.80" arrivalLane="c2n_1" arrivalPos="990.00" arrivalPosLat="0.00" arrivalSpeed="15.68" duration="175.35" routeLength="1997.01" waitingTime="19.45" waitingCount="1" stopTime="0.00" timeLoss="52.74" rerouteNo="1" devices="tripinfo_car_s2n_86 routing_car_s2n_86" vType="Car" speedFactor="1.17" vaporized=""/>
    <tripinfo id="car_n2s_118" depart="118.00" departLane="n2sep_1" departPos="3.60" departPosLat="0.00" departSpeed="13.90" departDelay="0.00" arrival="264.60" arrivalLane="c2s_1" arrivalPos="990.00" arrivalPosLat="0.00" arrivalSpeed="13.94" duration="146.60" routeLength="1997.01" waitingTime="0.00" waitingCount="0" stopTime="0.00" timeLoss="3.37" rerouteNo="1" devices="tripinfo_car_n2s_118 routing_car_n2s_118" vType="Car" speedFactor="1.00" vaporized=""/>
    <tripinfo id="car_s2n_102" depart="102.40" departLane="s2sep_1" departPos="3.60" departPosLat="0.00" departSpeed="13.90" departDelay="0.40" arrival="265.65" arrivalLane="c2n_1" arrivalPos="990.00" arrivalPosLat="0.00" arrivalSpeed="14.13" duration="163.25" routeLength="1997.01" waitingTime="5.80" waitingCount="1" stopTime="0.00" timeLoss="22.11" rerouteNo="1" devices="tripinfo_car_s2n_102 routing_car_s2n_102" vType="Car" speedFactor="1.02" vaporized=""/>
    <tripinfo id="car_s2n_104" depart="104.20" departLane="s2sep_1" departPos="3.60" departPosLat="0.00" departSpeed="13.90" departDelay="0.20" arrival="267.90" arrivalLane="c2n_1" arrivalPos="990.00" arrivalPosLat="0.00" arrivalSpeed="14.87" duration="163.70" routeLength="1997.01" waitingTime="4.90" waitingCount="1" stopTime="0.00" timeLoss="32.10" rerouteNo="1" devices="tripinfo_car_s2n_104 routing_car_s2n_104" vType="Car" speedFactor="1.09" vaporized=""/>
    <tripinfo id="car_s2e_119" depart="119.00" departLane="s2sep_1" departPos="3.60" departPosLat="0.00" departSpeed="13.90" departDelay="0.00" arrival="269.00" arrivalLane="c2e_1" arrivalPos="990.00" arrivalPosLat="0.00" arrivalSpeed="13.90" duration="150.00" routeLength="1986.69" waitingTime="0.00" waitingCount="0" stopTime="0.00" timeLoss="6.31" rerouteNo="1" devices="tripinfo_car_s2e_119 routing_car_s2e_119" vType="Car" speedFactor="1.00" vaporized=""/>
    <tripinfo id="car_n2w_126" depart="126.00" departLane="n2sep_1" departPos="3.60" departPosLat="0.00" departSpeed="13.90" departDelay="0.00" arrival="270.80" arrivalLane="c2w_1" arrivalPos="990.00" arrivalPosLat="0.00" arrivalSpeed="14.23" duration="144.80" routeLength="1986.69" waitingTime="0.00" waitingCount="0" stopTime="0.00" timeLoss="4.42" rerouteNo="1" devices="tripinfo_car_n2w_126 routing_car_n2w_126" vType="Car" speedFactor="1.02" vaporized=""/>
    <tripinfo id="car_n2e_98" depart="98.00" departLane="n2sep_1" departPos="3.60" departPosLat="0.00" departSpeed="13.90" departDelay="0.00" arrival="270.90" arrivalLane="c2e_1" arrivalPos="990.00" arrivalPosLat="0.00" arrivalSpeed="15.37" duration="172.90" routeLength="1996.47" waitingTime="30.70" waitingCount="2" stopTime="0.00" timeLoss="48.28" rerouteNo="1" devices="tripinfo_car_n2e_98 routing_car_n2e_98" vType="Car" speedFactor="1.16" vaporized=""/>
    <tripinfo id="car_s2n_120" depart="120.45" departLane="s2sep_1" departPos="3.60" departPosLat="0.00" departSpeed="13.90" departDelay="0.45" arrival="272.05" arrivalLane="c2n_1" arrivalPos="990.00" arrivalPosLat="0.00" arrivalSpeed="13.89" duration="151.60" routeLength="1997.01" waitingTime="0.00" waitingCount="0" stopTime="0.00" timeLoss="7.93" rerouteNo="1" devices="tripinfo_car_s2n_120 routing_car_s2n_120" vType="Car" speedFactor="1.00" vaporized=""/>
    <tripinfo id="car_n2w_129" depart="129.00" departLane="n2sep_1" departPos="3.60" departPosLat="0.00" departSpeed="13.90" departDelay="0.00" arrival="272.95" arrivalLane="c2w_1" arrivalPos="990.00" arrivalPosLat="0.00" arrivalSpeed="15.33" duration="143.95" routeLength="1986.69" waitingTime="0.00" waitingCount="0" stopTime="0.00" timeLoss="17.02" rerouteNo="1" devices="tripinfo_car_n2w_129 routing_car_n2w_129" vType="Car" speedFactor="1.13" vaporized=""/>
    <tripinfo id="car_s2n_123" depart="123.00" departLane="s2sep_1" departPos="3.60" departPosLat="0.00" departSpeed="13.90" departDelay="0.00" arrival="273.95" arrivalLane="c2n_1" arrivalPos="990.00" arrivalPosLat="0.00" arrivalSpeed="15.17" duration="150.95" routeLength="1997.01" waitingTime="0.00" waitingCount="0" stopTime="0.00" timeLoss="25.20" rerouteNo="1" devices="tripinfo_car_s2n_123 routing_car_s2n_123" vType="Car" speedFactor="1.14" vaporized=""/>
    <tripinfo id="car_n2e_109" depart="111.20" departLane="n2sep_1" departPos="3.60" departPosLat="0.00" departSpeed="13.90" departDelay="2.20" arrival="277.70" arrivalLane="c2e_1" arrivalPos="990.00" arrivalPosLat="0.00" arrivalSpeed="13.90" duration="166.50" routeLength="1996.47" waitingTime="10.15" waitingCount="1" stopTime="0.00" timeLoss="22.16" rerouteNo="1" devices="tripinfo_car_n2e_109 routing_car_n2e_109" vType="Car" speedFactor="1.00" vaporized=""/>
    <tripinfo id="car_s2w_111" depart="111.00" departLane="s2sep_1" departPos="3.60" departPosLat="0.00" departSpeed="13.90" departDelay="0.00" arrival="278.90" arrivalLane="c2w_1" arrivalPos="990.00" arrivalPosLat="0.00" arrivalSpeed="13.90" duration="167.90" routeLength="1996.47" waitingTime="14.85" waitingCount="2" stopTime="0.00" timeLoss="23.58" rerouteNo="1" devices="tripinfo_car_s2w_111 routing_car_s2w_111" vType="Car" speedFactor="1.00" vaporized=""/>
    <tripinfo id="car_n2e_112" depart="113.05" departLane="n2sep_1" departPos="3.60" departPosLat="0.00" departSpeed="13.90" departDelay="1.05" arrival="279.55" arrivalLane="c2e_1" arrivalPos="990.00" arrivalPosLat="0.00" arrivalSpeed="15.41" duration="166.50" routeLength="1996.47" waitingTime="7.80" waitingCount="1" stopTime="0.00" timeLoss="43.02" rerouteNo="1" devices="tripinfo_car_n2e_112 routing_car_n2e_112" vType="Car" speedFactor="1.17" vaporized=""/>
    <tripinfo id="car_s2w_130" depart="130.00" departLane="s2sep_1" departPos="3.60" departPosLat="0.00" departSpeed="13.90" departDelay="0.00" arrival="281.25" arrivalLane="c2w_1" arrivalPos="990.00" arrivalPosLat="0.00" arrivalSpeed="14.78" duration="151.25" routeLength="1996.47" waitingTime="0.55" waitingCount="1" stopTime="0.00" timeLoss="17.90" rerouteNo="1" devices="tripinfo_car_s2w_130 routing_car_s2w_130" vType="Car" speedFactor="1.08" vaporized=""/>
    <tripinfo id="car_s2e_149" depart="149.00" departLane="s2sep_1" departPos="3.60" departPosLat="0.00" departSpeed="13.90" departDelay="0.00" arrival="281.45" arrivalLane="c2e_1" arrivalPos="990.00" arrivalPosLat="0.00" arrivalSpeed="15.64" duration="132.45" routeLength="1986.69" waitingTime="0.00" waitingCount="0" stopTime="0.00" timeLoss="10.52" rerouteNo="1" devices="tripinfo_car_s2e_149 routing_car_s2e_149" vType="Car" speedFactor="1.18" vaporized=""/>
    <tripinfo id="car_n2e_138" depart="138.00" departLane="n2sep_1" departPos="3.60" departPosLat="0.00" departSpeed="13.90" departDelay="0.00" arrival="287.75" arrivalLane="c2e_1" arrivalPos="990.00" arrivalPosLat="0.00" arrivalSpeed="14.12" duration="149.75" routeLength="1996.47" waitingTime="0.00" waitingCount="0" stopTime="0.00" timeLoss="7.65" rerouteNo="1" devices="tripinfo_car_n2e_138 routing_car_n2e_138" vType="Car" speedFactor="1.02" vaporized=""/>
    <tripinfo id="car_e2w_106" depart="106.00" departLane="e2sep_1" departPos="3.60" departPosLat="0.00" departSpeed="13.90" departDelay="0.00" arrival="298.25" arrivalLane="c2w_1" arrivalPos="990.00" arrivalPosLat="0.00" arrivalSpeed="14.42" duration="192.25" routeLength="1997.01" waitingTime="46.40" waitingCount="1" stopTime="0.00" timeLoss="53.77" rerouteNo="1" devices="tripinfo_car_e2w_106 routing_car_e2w_106" vType="Car" speedFactor="1.04" vaporized=""/>
    <tripinfo id="car_w2s_110" depart="110.00" departLane="w2sep_1" departPos="3.60" departPosLat="0.00" departSpeed="13.90" departDelay="0.00" arrival="300.65" arrivalLane="c2s_1" arrivalPos="990.00" arrivalPosLat="0.00" arrivalSpeed="13.90" duration="190.65" routeLength="1986.69" waitingTime="40.00" waitingCount="1" stopTime="0.00" timeLoss="46.95" rerouteNo="1" devices="tripinfo_car_w2s_110 routing_car_w2s_110" vType="Car" speedFactor="1.00" vaporized=""/>
    <tripinfo id="car_e2w_108" depart="108.00" departLane="e2sep_1" departPos="3.60" departPosLat="0.00" departSpeed="13.90" departDelay="0.00" arrival="301.10" arrivalLane="c2w_1" arrivalPos="990.00" arrivalPosLat="0.00" arrivalSpeed="15.01" duration="193.10" routeLength="1997.01" waitingTime="44.80" waitingCount="1" stopTime="0.00" timeLoss="61.05" rerouteNo="1" devices="tripinfo_car_e2w_108 routing_car_e2w_108" vType="Car" speedFactor="1.09" vaporized=""/>
    <tripinfo id="car_w2s_132" depart="132.00" departLane="w2sep_1" departPos="3.60" departPosLat="0.00" departSpeed="13.90" departDelay="0.00" arrival="302.75" arrivalLane="c2s_1" arrivalPos="990.00" arrivalPosLat="0.00" arrivalSpeed="15.11" duration="170.75" routeLength="1986.69" waitingTime="25.85" waitingCount="1" stopTime="0.00" timeLoss="42.39" rerouteNo="1" devices="tripinfo_car_w2s_132 routing_car_w2s_132" vType="Car" speedFactor="1.12" vaporized=""/>
    <tripinfo id="car_e2n_117" depart="117.00" departLane="e2sep_1" departPos="3.60" departPosLat="0.00" departSpeed="13.90" departDelay="0.00" arrival="304.00" arrivalLane="c2n_1" arrivalPos="990.00" arrivalPosLat="0.00" arrivalSpeed="14.13" duration="187.00" routeLength="1986.69" waitingTime="36.00" waitingCount="1" stopTime="0.00" timeLoss="45.72" rerouteNo="1" devices="tripinfo_car_e2n_117 routing_car_e2n_117" vType="Car" speedFactor="1.02" vaporized=""/>
    <tripinfo id="car_w2e_151" depart="151.00" departLane="w2sep_1" departPos="3.60" departPosLat="0.00" departSpeed="13.90" departDelay="0.00" arrival="304.80" arrivalLane="c2e_1" arrivalPos="990.00" arrivalPosLat="0.00" arrivalSpeed="13.97" duration="153.80" routeLength="1997.01" waitingTime="1.35" waitingCount="1" stopTime="0.00" timeLoss="10.84" rerouteNo="1" devices="tripinfo_car_w2e_151 routing_car_w2e_151" vType="Car" speedFactor="1.01" vaporized=""/>
    <tripinfo id="car_e2s_117" depart="118.45" departLane="e2sep_1" departPos="3.60" departPosLat="0.00" departSpeed="13.90" departDelay="1.45" arrival="305.20" arrivalLane="c2s_1" arrivalPos="990.00" arrivalPosLat="0.00" arrivalSpeed="15.03" duration="186.75" routeLength="1996.47" waitingTime="34.70" waitingCount="2" stopTime="0.00" timeLoss="55.04" rerouteNo="1" devices="tripinfo_car_e2s_117 routing_car_e2s_117" vType="Car" speedFactor="1.10" vaporized=""/>
    <tripinfo id="car_e2w_163" depart="163.00" departLane="e2sep_1" departPos="3.60" departPosLat="0.00" departSpeed="13.90" departDelay="0.00" arrival="306.45" arrivalLane="c2w_1" arrivalPos="990.00" arrivalPosLat="0.00" arrivalSpeed="14.22" duration="143.45" routeLength="1997.01" waitingTime="0.00" waitingCount="0" stopTime="0.00" timeLoss="3.01" rerouteNo="1" devices="tripinfo_car_e2w_163 routing_car_e2w_163" vType="Car" speedFactor="1.02" vaporized=""/>
    <tripinfo id="car_w2e_174" depart="174.00" departLane="w2sep_1" departPos="3.60" departPosLat="0.00" departSpeed="13.90" departDelay="0.00" arrival="311.05" arrivalLane="c2e_1" arrivalPos="990.00" arrivalPosLat="0.00" arrivalSpeed="14.67" duration="137.05" routeLength="1997.01" waitingTime="0.00" waitingCount="0" stopTime="0.00" timeLoss="0.96" rerouteNo="1" devices="tripinfo_car_w2e_174 routing_car_w2e_174" vType="Car" speedFactor="1.06" vaporized=""/>
    <tripinfo id="car_e2s_143" depart="143.00" departLane="e2sep_1" departPos="3.60" departPosLat="0.00" departSpeed="13.90" departDelay="0.00" arrival="311.30" arrivalLane="c2s_1" arrivalPos="990.00" arrivalPosLat="0.00" arrivalSpeed="13.90" duration="168.30" routeLength="1996.47" waitingTime="9.70" waitingCount="2" stopTime="0.00" timeLoss="23.98" rerouteNo="1" devices="tripinfo_car_e2s_143 routing_car_e2s_143" vType="Car" speedFactor="1.00" vaporized=""/>
    <tripinfo id="car_w2e_176" depart="176.00" departLane="w2sep_1" departPos="3.60" departPosLat="0.00" departSpeed="13.90" departDelay="0.00" arrival="313.10" arrivalLane="c2e_1" arrivalPos="990.00" arrivalPosLat="0.00" arrivalSpeed="15.86" duration="137.10" routeLength="1997.01" waitingTime="0.00" waitingCount="0" stopTime="0.00" timeLoss="15.31" rerouteNo="1" devices="tripinfo_car_w2e_176 routing_car_w2e_176" vType="Car" speedFactor="1.18" vaporized=""/>
    <tripinfo id="car_e2s_152" depart="152.00" departLane="e2sep_1" departPos="3.60" departPosLat="0.00" departSpeed="13.90" departDelay="0.00" arrival="313.25" arrivalLane="c2s_1" arrivalPos="990.00" arrivalPosLat="0.00" arrivalSpeed="15.56" duration="161.25" routeLength="1996.47" waitingTime="11.20" waitingCount="2" stopTime="0.00" timeLoss="38.05" rerouteNo="1" devices="tripinfo_car_e2s_152 routing_car_e2s_152" vType="Car" speedFactor="1.17" vaporized=""/>
    <tripinfo id="car_e2w_171" depart="171.00" departLane="e2sep_1" departPos="3.60" departPosLat="0.00" departSpeed="13.90" departDelay="0.00" arrival="315.90" arrivalLane="c2w_1" arrivalPos="990.00" arrivalPosLat="0.00" arrivalSpeed="14.17" duration="144.90" routeLength="1997.01" waitingTime="0.00" waitingCount="0" stopTime="0.00" timeLoss="4.00" rerouteNo="1" devices="tripinfo_car_e2w_171 routing_car_e2w_171" vType="Car" speedFactor="1.02" vaporized=""/>
    <tripinfo id="bus_e2n_163" depart="165.00" departLane="e2sep_1" departPos="12.10" departPosLat="0.00" departSpeed="13.90" departDelay="2.00" arrival="316.05" arrivalLane="c2n_1" arrivalPos="990.00" arrivalPosLat="0.00" arrivalSpeed="13.90" duration="151.05" routeLength="1978.19" waitingTime="0.00" waitingCount="0" stopTime="0.00" timeLoss="8.01" rerouteNo="1" devices="tripinfo_bus_e2n_163 routing_bus_e2n_163" vType="Bus" speedFactor="1.00" vaporized=""/>
    <tripinfo id="car_e2w_178" depart="178.00" departLane="e2sep_1" departPos="3.60" departPosLat="0.00" departSpeed="13.90" departDelay="0.00" arrival="321.05" arrivalLane="c2w_1" arrivalPos="990.00" arrivalPosLat="0.00" arrivalSpeed="14.35" duration="143.05" routeLength="1997.01" waitingTime="0.00" waitingCount="0" stopTime="0.00" timeLoss="3.86" rerouteNo="1" devices="tripinfo_car_e2w_178 routing_car_e2w_178" vType="Car" speedFactor="1.03" vaporized=""/>
    <tripinfo id="car_w2n_112" depart="112.00" departLane="w2sep_1" departPos="3.60" departPosLat="0.00" departSpeed="13.90" departDelay="0.00" arrival="325.95" arrivalLane="c2n_1" arrivalPos="990.00" arrivalPosLat="0.00" arrivalSpeed="13.90" duration="213.95" routeLength="1996.47" waitingTime="56.35" waitingCount="3" stopTime="0.00" timeLoss="69.61" rerouteNo="1" devices="tripinfo_car_w2n_112 routing_car_w2n_112" vType="Car" speedFactor="1.00" vaporized=""/>
    <tripinfo id="car_w2s_180" depart="180.00" departLane="w2sep_1" departPos="3.60" departPosLat="0.00" departSpeed="13.90" departDelay="0.00" arrival="326.85" arrivalLane="c2s_1" arrivalPos="990.00" arrivalPosLat="0.00" arrivalSpeed="14.00" duration="146.85" routeLength="1986.69" waitingTime="0.00" waitingCount="0" stopTime="0.00" timeLoss="4.22" rerouteNo="1" devices="tripinfo_car_w2s_180 routing_car_w2s_180" vType="Car" speedFactor="1.01" vaporized=""/>
    <tripinfo id="car_e2s_155" depart="155.00" departLane="e2sep_1" departPos="3.60" departPosLat="0.00" departSpeed="13.90" departDelay="0.00" arrival="330.25" arrivalLane="c2s_1" arrivalPos="990.00" arrivalPosLat="0.00" arrivalSpeed="14.41" duration="175.25" routeLength="1996.47" waitingTime="8.50" waitingCount="2" stopTime="0.00" timeLoss="36.48" rerouteNo="1" devices="tripinfo_car_e2s_155 routing_car_e2s_155" vType="Car" speedFactor="1.04" vaporized=""/>
    <tripinfo id="car_e2w_186" depart="186.00" departLane="e2sep_1" departPos="3.60" departPosLat="0.00" departSpeed="13.90" departDelay="0.00" arrival="330.75" arrivalLane="c2w_1" arrivalPos="990.00" arrivalPosLat="0.00" arrivalSpeed="13.90" duration="144.75" routeLength="1997.01" waitingTime="0.00" waitingCount="0" stopTime="0.00" timeLoss="1.08" rerouteNo="1" devices="tripinfo_car_e2w_186 routing_car_e2w_186" vType="Car" speedFactor="1.00" vaporized=""/>
    <tripinfo id="car_e2s_174" depart="174.00" departLane="e2sep_1" departPos="3.60" departPosLat="0.00" departSpeed="13.90" departDelay="0.00" arrival="334.85" arrivalLane="c2s_1" arrivalPos="990.00" arrivalPosLat="0.00" arrivalSpeed="13.89" duration="160.85" routeLength="1996.47" waitingTime="4.55" waitingCount="1" stopTime="0.00" timeLoss="16.52" rerouteNo="1" devices="tripinfo_car_e2s_174 routing_car_e2s_174" vType="Car" speedFactor="1.00" vaporized=""/>
    <tripinfo id="car_n2w_150" depart="150.00" departLane="n2sep_1" departPos="3.60" departPosLat="0.00" departSpeed="13.90" departDelay="0.00" arrival="336.75" arrivalLane="c2w_1" arrivalPos="990.00" arrivalPosLat="0.00" arrivalSpeed="16.04" duration="186.75" routeLength="1986.69" waitingTime="53.90" waitingCount="1" stopTime="0.00" timeLoss="62.30" rerouteNo="1" devices="tripinfo_car_n2w_150 routing_car_n2w_150" vType="Car" speedFactor="1.15" vaporized=""/>
    <tripinfo id="car_e2s_178" depart="179.45" departLane="e2sep_1" departPos="3.60" departPosLat="0.00" departSpeed="13.90" departDelay="1.45" arrival="336.95" arrivalLane="c2s_1" arrivalPos="990.00" arrivalPosLat="0.00" arrivalSpeed="14.90" duration="157.50" routeLength="1996.47" waitingTime="0.00" waitingCount="0" stopTime="0.00" timeLoss="26.58" rerouteNo="1" devices="tripinfo_car_e2s_178 routing_car_e2s_178" vType="Car" speedFactor="1.10" vaporized=""/>
    <tripinfo id="bus_w2n_113" depart="114.40" departLane="w2sep_1" departPos="12.10" departPosLat="0.00" departSpeed="13.90" departDelay="1.40" arrival="337.50" arrivalLane="c2n_1" arrivalPos="990.00" arrivalPosLat="0.00" arrivalSpeed="13.90" duration="223.10" routeLength="1987.97" waitingTime="56.70" waitingCount="3" stopTime="0.00" timeLoss="79.39" rerouteNo="1" devices="tripinfo_bus_w2n_113 routing_bus_w2n_113" vType="Bus" speedFactor="1.00" vaporized=""/>
    <tripinfo id="car_e2s_187" depart="189.30" departLane="e2sep_1" departPos="3.60" departPosLat="0.00" departSpeed="13.90" departDelay="2.30" arrival="340.35" arrivalLane="c2s_1" arrivalPos="990.00" arrivalPosLat="0.00" arrivalSpeed="14.28" duration="151.05" routeLength="1996.47" waitingTime="0.00" waitingCount="0" stopTime="0.00" timeLoss="10.96" rerouteNo="1" devices="tripinfo_car_e2s_187 routing_car_e2s_187" vType="Car" speedFactor="1.03" vaporized=""/>
    <tripinfo id="car_w2n_161" depart="161.00" departLane="w2sep_1" departPos="3.60" departPosLat="0.00" departSpeed="13.90" departDelay="0.00" arrival="341.55" arrivalLane="c2n_1" arrivalPos="990.00" arrivalPosLat="0.00" arrivalSpeed="14.18" duration="180.55" routeLength="1996.47" waitingTime="19.45" waitingCount="2" stopTime="0.00" timeLoss="39.36" rerouteNo="1" devices="tripinfo_car_w2n_161 routing_car_w2n_161" vType="Car" speedFactor="1.02" vaporized=""/>
    <tripinfo id="car_s2e_197" depart="197.00" departLane="s2sep_1" departPos="3.60" departPosLat="0.00" departSpeed="13.90" departDelay="0.00" arrival="342.75" arrivalLane="c2e_1" arrivalPos="990.00" arrivalPosLat="0.00" arrivalSpeed="14.49" duration="145.75" routeLength="1986.69" waitingTime="0.70" waitingCount="1" stopTime="0.00" timeLoss="8.00" rerouteNo="1" devices="tripinfo_car_s2e_197 routing_car_s2e_197" vType="Car" speedFactor="1.04" vaporized=""/>
    <tripinfo id="car_w2n_183" depart="183.00" departLane="w2sep_1" departPos="3.60" departPosLat="0.00" departSpeed="13.90" departDelay="0.00" arrival="343.85" arrivalLane="c2n_1" arrivalPos="990.00" arrivalPosLat="0.00" arrivalSpeed="14.83" duration="160.85" routeLength="1996.47" waitingTime="1.05" waitingCount="1" stopTime="0.00" timeLoss="28.07" rerouteNo="1" devices="tripinfo_car_w2n_183 routing_car_w2n_183" vType="Car" speedFactor="1.09" vaporized=""/>
    <tripinfo id="car_s2e_207" depart="207.00" departLane="s2sep_1" departPos="3.60" departPosLat="0.00" departSpeed="13.90" departDelay="0.00" arrival="345.80" arrivalLane="c2e_1" arrivalPos="990.00" arrivalPosLat="0.00" arrivalSpeed="15.09" duration="138.80" routeLength="1986.69" waitingTime="0.00" waitingCount="0" stopTime="0.00" timeLoss="7.23" rerouteNo="1" devices="tripinfo_car_s2e_207 routing_car_s2e_207" vType="Car" speedFactor="1.09" vaporized=""/>
    <tripinfo id="car_n2e_188" depart="188.00" departLane="n2sep_1" departPos="3.60" departPosLat="0.00" departSpeed="13.90" departDelay="0.00" arrival="348.50" arrivalLane="c2e_1" arrivalPos="990.00" arrivalPosLat="0.00" arrivalSpeed="15.78" duration="160.50" routeLength="1996.47" waitingTime="20.60" waitingCount="2" stopTime="0.00" timeLoss="34.74" rerouteNo="1" devices="tripinfo_car_n2e_188 routing_car_n2e_188" vType="Car" speedFactor="1.15" vaporized=""/>
    <tripinfo id="car_n2w_167" depart="167.00" departLane="n2sep_1" departPos="3.60" departPosLat="0.00" departSpeed="13.90" departDelay="0.00" arrival="348.55" arrivalLane="c2w_1" arrivalPos="990.00" arrivalPosLat="0.00" arrivalSpeed="13.90" duration="181.55" routeLength="1986.69" waitingTime="28.90" waitingCount="1" stopTime="0.00" timeLoss="37.90" rerouteNo="1" devices="tripinfo_car_n2w_167 routing_car_n2w_167" vType="Car" speedFactor="1.00" vaporized=""/>
    <tripinfo id="car_s2n_209" depart="209.00" departLane="s2sep_1" departPos="3.60" departPosLat="0.00" departSpeed="13.90" departDelay="0.00" arrival="349.85" arrivalLane="c2n_1" arrivalPos="990.00" arrivalPosLat="0.00" arrivalSpeed="14.42" duration="140.85" routeLength="1997.01" waitingTime="0.00" waitingCount="0" stopTime="0.00" timeLoss="2.38" rerouteNo="1" devices="tripinfo_car_s2n_209 routing_car_s2n_209" vType="Car" speedFactor="1.04" vaporized=""/>
    <tripinfo id="car_n2w_196" depart="196.00" departLane="n2sep_1" departPos="3.60" departPosLat="0.00" departSpeed="13.90" departDelay="0.00" arrival="352.90" arrivalLane="c2w_1" arrivalPos="990.00" arrivalPosLat="0.00" arrivalSpeed="13.89" duration="156.90" routeLength="1986.69" waitingTime="0.95" waitingCount="1" stopTime="0.00" timeLoss="13.27" rerouteNo="1" devices="tripinfo_car_n2w_196 routing_car_n2w_196" vType="Car" speedFactor="1.00" vaporized=""/>
    <tripinfo id="car_s2w_218" depart="218.00" departLane="s2sep_1" departPos="3.60" departPosLat="0.00" departSpeed="13.90" departDelay="0.00" arrival="355.95" arrivalLane="c2w_1" arrivalPos="990.00" arrivalPosLat="0.00" arrivalSpeed="15.07" duration="137.95" routeLength="1996.47" waitingTime="0.00" waitingCount="0" stopTime="0.00" timeLoss="5.67" rerouteNo="1" devices="tripinfo_car_s2w_218 routing_car_s2w_218" vType="Car" speedFactor="1.09" vaporized=""/>
    <tripinfo id="car_n2e_237" depart="237.00" departLane="n2sep_1" departPos="3.60" departPosLat="0.00" departSpeed="13.90" departDelay="0.00" arrival="386.80" arrivalLane="c2e_1" arrivalPos="990.00" arrivalPosLat="0.00" arrivalSpeed="13.90" duration="149.80" routeLength="1996.47" waitingTime="0.00" waitingCount="0" stopTime="0.00" timeLoss="5.49" rerouteNo="1" devices="tripinfo_car_n2e_237 routing_car_n2e_237" vType="Car" speedFactor="1.00" vaporized=""/>
    <tripinfo id="car_e2w_187" depart="187.50" departLane="e2sep_1" departPos="3.60" departPosLat="0.00" departSpeed="13.90" departDelay="0.50" arrival="389.55" arrivalLane="c2w_1" arrivalPos="990.00" arrivalPosLat="0.00" arrivalSpeed="14.13" duration="202.05" routeLength="1997.01" waitingTime="50.40" waitingCount="1" stopTime="0.00" timeLoss="60.75" rerouteNo="1" devices="tripinfo_car_e2w_187 routing_car_e2w_187" vType="Car" speedFactor="1.02" vaporized=""/>
    <tripinfo id="car_w2s_199" depart="199.00" departLane="w2sep_1" departPos="3.60" departPosLat="0.00" departSpeed="13.90" departDelay="0.00" arrival="390.15" arrivalLane="c2s_1" arrivalPos="990.00" arrivalPosLat="0.00" arrivalSpeed="14.00" duration="191.15" routeLength="1986.69" waitingTime="41.45" waitingCount="1" stopTime="0.00" timeLoss="48.47" rerouteNo="1" devices="tripinfo_car_w2s_199 routing_car_w2s_199" vType="Car" speedFactor="1.01" vaporized=""/>
    <tripinfo id="car_w2e_201" depart="201.00" departLane="w2sep_1" departPos="3.60" departPosLat="0.00" departSpeed="13.90" departDelay="0.00" arrival="392.10" arrivalLane="c2e_1" arrivalPos="990.00" arrivalPosLat="0.00" arrivalSpeed="14.20" duration="191.10" routeLength="1997.01" waitingTime="39.00" waitingCount="1" stopTime="0.00" timeLoss="50.52" rerouteNo="1" devices="tripinfo_car_w2e_201 routing_car_w2e_201" vType="Car" speedFactor="1.02" vaporized=""/>
    <tripinfo id="car_w2s_222" depart="222.30" departLane="w2sep_1" departPos="3.60" departPosLat="0.00" departSpeed="13.90" departDelay="0.30" arrival="392.50" arrivalLane="c2s_1" arrivalPos="990.00" arrivalPosLat="0.00" arrivalSpeed="15.30" duration="170.20" routeLength="1986.69" waitingTime="24.90" waitingCount="1" stopTime="0.00" timeLoss="42.10" rerouteNo="1" devices="tripinfo_car_w2s_222 routing_car_w2s_222" vType="Car" speedFactor="1.12" vaporized=""/>
    <tripinfo id="car_e2n_197" depart="197.00" departLane="e2sep_1" departPos="3.60" departPosLat="0.00" departSpeed="13.90" departDelay="0.00" arrival="392.85" arrivalLane="c2n_1" arrivalPos="990.00" arrivalPosLat="0.00" arrivalSpeed="13.92" duration="195.85" routeLength="1986.69" waitingTime="43.25" waitingCount="1" stopTime="0.00" timeLoss="52.44" rerouteNo="1" devices="tripinfo_car_e2n_197 routing_car_e2n_197" vType="Car" speedFactor="1.00" vaporized=""/>
    <tripinfo id="car_w2e_221" depart="221.00" departLane="w2sep_1" departPos="3.60" departPosLat="0.00" departSpeed="13.90" departDelay="0.00" arrival="394.60" arrivalLane="c2e_1" arrivalPos="990.00" arrivalPosLat="0.00" arrivalSpeed="14.92" duration="173.60" routeLength="1997.01" waitingTime="26.35" waitingCount="1" stopTime="0.00" timeLoss="41.53" rerouteNo="1" devices="tripinfo_car_w2e_221 routing_car_w2e_221" vType="Car" speedFactor="1.09" vaporized=""/>
    <tripinfo id="car_e2w_220" depart="220.00" departLane="e2sep_1" departPos="3.60" departPosLat="0.00" departSpeed="13.90" departDelay="0.00" arrival="396.25" arrivalLane="c2w_1" arrivalPos="990.00" arrivalPosLat="0.00" arrivalSpeed="14.69" duration="176.25" routeLength="1997.01" waitingTime="27.15" waitingCount="1" stopTime="0.00" timeLoss="40.29" rerouteNo="1" devices="tripinfo_car_e2w_220 routing_car_e2w_220" vType="Car" speedFactor="1.06" vaporized=""/>
    <tripinfo id="car_e2n_207" depart="207.00" departLane="e2sep_1" departPos="3.60" departPosLat="0.00" departSpeed="13.90" departDelay="0.00" arrival="396.75" arrivalLane="c2n_1" arrivalPos="990.00" arrivalPosLat="0.00" arrivalSpeed="14.11" duration="189.75" routeLength="1986.69" waitingTime="36.00" waitingCount="1" stopTime="0.00" timeLoss="48.43" rerouteNo="1" devices="tripinfo_car_e2n_207 routing_car_e2n_207" vType="Car" speedFactor="1.02" vaporized=""/>
    <tripinfo id="car_w2e_225" depart="225.00" departLane="w2sep_1" departPos="3.60" departPosLat="0.00" departSpeed="13.90" departDelay="0.00" arrival="397.05" arrivalLane="c2e_1" arrivalPos="990.00" arrivalPosLat="0.00" arrivalSpeed="15.04" duration="172.05" routeLength="1997.01" waitingTime="22.80" waitingCount="1" stopTime="0.00" timeLoss="41.08" rerouteNo="1" devices="tripinfo_car_w2e_225 routing_car_w2e_225" vType="Car" speedFactor="1.10" vaporized=""/>
    <tripinfo id="car_e2n_216" depart="216.00" departLane="e2sep_1" departPos="3.60" departPosLat="0.00" departSpeed="13.90" departDelay="0.00" arrival="399.60" arrivalLane="c2n_1" arrivalPos="990.00" arrivalPosLat="0.00" arrivalSpeed="14.41" duration="183.60" routeLength="1986.69" waitingTime="29.85" waitingCount="1" stopTime="0.00" timeLoss="45.89" rerouteNo="1" devices="tripinfo_car_e2n_216 routing_car_e2n_216" vType="Car" speedFactor="1.04" vaporized=""/>
    <tripinfo id="car_w2e_227" depart="227.00" departLane="w2sep_1" departPos="3.60" departPosLat="0.00" departSpeed="13.90" departDelay="0.00" arrival="400.10" arrivalLane="c2e_1" arrivalPos="990.00" arrivalPosLat="0.00" arrivalSpeed="14.73" duration="173.10" routeLength="1997.01" waitingTime="20.25" waitingCount="1" stopTime="0.00" timeLoss="38.19" rerouteNo="1" devices="tripinfo_car_w2e_227 routing_car_w2e_227" vType="Car" speedFactor="1.07" vaporized=""/>
    <tripinfo id="car_e2n_220" depart="221.40" departLane="e2sep_1" departPos="3.60" departPosLat="0.00" departSpeed="13.90" departDelay="1.40" arrival="403.40" arrivalLane="c2n_1" arrivalPos="990.00" arrivalPosLat="0.00" arrivalSpeed="14.02" duration="182.00" routeLength="1986.69" waitingTime="23.20" waitingCount="1" stopTime="0.00" timeLoss="39.73" rerouteNo="1" devices="tripinfo_car_e2n_220 routing_car_e2n_220" vType="Car" speedFactor="1.01" vaporized=""/>
    <tripinfo id="car_w2s_249" depart="249.00" departLane="w2sep_1" departPos="3.60" departPosLat="0.00" departSpeed="13.90" departDelay="0.00" arrival="403.90" arrivalLane="c2s_1" arrivalPos="990.00" arrivalPosLat="0.00" arrivalSpeed="13.90" duration="154.90" routeLength="1986.69" waitingTime="0.00" waitingCount="0" stopTime="0.00" timeLoss="11.21" rerouteNo="1" devices="tripinfo_car_w2s_249 routing_car_w2s_249" vType="Car" speedFactor="1.00" vaporized=""/>
    <tripinfo id="car_e2w_246" depart="246.00" departLane="e2sep_1" departPos="3.60" departPosLat="0.00" departSpeed="13.90" departDelay="0.00" arrival="404.20" arrivalLane="c2w_1" arrivalPos="990.00" arrivalPosLat="0.00" arrivalSpeed="14.38" duration="158.20" routeLength="1997.01" waitingTime="2.15" waitingCount="1" stopTime="0.00" timeLoss="19.32" rerouteNo="1" devices="tripinfo_car_e2w_246 routing_car_e2w_246" vType="Car" speedFactor="1.03" vaporized=""/>
    <tripinfo id="amb_w2e_300" depart="300.45" departLane="w2sep_1" departPos="6.60" departPosLat="0.00" departSpeed="13.90" departDelay="0.45" arrival="405.20" arrivalLane="c2e_1" arrivalPos="990.00" arrivalPosLat="-0.95" arrivalSpeed="20.80" duration="104.75" routeLength="1994.01" waitingTime="0.00" waitingCount="0" stopTime="0.00" timeLoss="9.10" rerouteNo="1" devices="tripinfo_amb_w2e_300 routing_amb_w2e_300 bluelight_amb_w2e_300 fcd_amb_w2e_300" vType="Ambulance" speedFactor="1.50" vaporized="">
        <example_device customValue1="0.00" customValue2="-1.00"/>
    </tripinfo>
    <tripinfo id="car_w2s_260" depart="260.00" departLane="w2sep_1" departPos="3.60" departPosLat="0.00" departSpeed="13.90" departDelay="0.00" arrival="406.15" arrivalLane="c2s_1" arrivalPos="990.00" arrivalPosLat="0.00" arrivalSpeed="14.94" duration="146.15" routeLength="1986.69" waitingTime="0.00" waitingCount="0" stopTime="0.00" timeLoss="15.35" rerouteNo="1" devices="tripinfo_car_w2s_260 routing_car_w2s_260" vType="Car" speedFactor="1.10" vaporized=""/>
    <tripinfo id="car_e2n_244" depart="244.00" departLane="e2sep_1" departPos="3.60" departPosLat="0.00" departSpeed="13.90" departDelay="0.00" arrival="406.75" arrivalLane="c2n_1" arrivalPos="990.00" arrivalPosLat="0.00" arrivalSpeed="14.05" duration="162.75" routeLength="1986.69" waitingTime="3.95" waitingCount="1" stopTime="0.00" timeLoss="21.06" rerouteNo="1" devices="tripinfo_car_e2n_244 routing_car_e2n_244" vType="Car" speedFactor="1.01" vaporized=""/>
    <tripinfo id="car_w2s_262" depart="262.00" departLane="w2sep_1" departPos="3.60" departPosLat="0.00" departSpeed="13.90" departDelay="0.00" arrival="408.45" arrivalLane="c2s_1" arrivalPos="990.00" arrivalPosLat="0.00" arrivalSpeed="14.98" duration="146.45" routeLength="1986.69" waitingTime="0.00" waitingCount="0" stopTime="0.00" timeLoss="15.42" rerouteNo="1" devices="tripinfo_car_w2s_262 routing_car_w2s_262" vType="Car" speedFactor="1.10" vaporized=""/>
    <tripinfo id="car_e2n_259" depart="259.00" departLane="e2sep_1" departPos="3.60" departPosLat="0.00" departSpeed="13.90" departDelay="0.00" arrival="410.05" arrivalLane="c2n_1" arrivalPos="990.00" arrivalPosLat="0.00" arrivalSpeed="14.09" duration="151.05" routeLength="1986.69" waitingTime="0.00" waitingCount="0" stopTime="0.00" timeLoss="9.73" rerouteNo="1" devices="tripinfo_car_e2n_259 routing_car_e2n_259" vType="Car" speedFactor="1.02" vaporized=""/>
    <tripinfo id="car_e2s_247" depart="247.60" departLane="e2sep_1" departPos="3.60" departPosLat="0.00" departSpeed="13.90" departDelay="0.60" arrival="411.20" arrivalLane="c2s_1" arrivalPos="990.00" arrivalPosLat="0.00" arrivalSpeed="14.69" duration="163.60" routeLength="1996.47" waitingTime="11.25" waitingCount="1" stopTime="0.00" timeLoss="28.06" rerouteNo="1" devices="tripinfo_car_e2s_247 routing_car_e2s_247" vType="Car" speedFactor="1.06" vaporized=""/>
    <tripinfo id="car_e2n_261" depart="262.70" departLane="e2sep_1" departPos="3.60" departPosLat="0.00" departSpeed="13.90" departDelay="1.70" arrival="414.40" arrivalLane="c2n_1" arrivalPos="990.00" arrivalPosLat="0.00" arrivalSpeed="14.01" duration="151.70" routeLength="1986.69" waitingTime="0.00" waitingCount="0" stopTime="0.00" timeLoss="9.30" rerouteNo="1" devices="tripinfo_car_e2n_261 routing_car_e2n_261" vType="Car" speedFactor="1.01" vaporized=""/>
    <tripinfo id="car_w2s_277" depart="277.00" departLane="w2sep_1" departPos="3.60" departPosLat="0.00" departSpeed="13.90" departDelay="0.00" arrival="415.90" arrivalLane="c2s_1" arrivalPos="990.00" arrivalPosLat="0.00" arrivalSpeed="14.88" duration="138.90" routeLength="1986.69" waitingTime="0.00" waitingCount="0" stopTime="0.00" timeLoss="4.72" rerouteNo="1" devices="tripinfo_car_w2s_277 routing_car_w2s_277" vType="Car" speedFactor="1.07" vaporized=""/>
    <tripinfo id="car_w2n_184" depart="184.40" departLane="w2sep_1" departPos="3.60" departPosLat="0.00" departSpeed="13.90" departDelay="0.40" arrival="417.55" arrivalLane="c2n_1" arrivalPos="990.00" arrivalPosLat="0.00" arrivalSpeed="14.32" duration="233.15" routeLength="1996.47" waitingTime="68.60" waitingCount="3" stopTime="0.00" timeLoss="93.64" rerouteNo="1" devices="tripinfo_car_w2n_184 routing_car_w2n_184" vType="Car" speedFactor="1.03" vaporized=""/>
    <tripinfo id="car_w2n_250" depart="250.45" departLane="w2sep_1" departPos="3.60" departPosLat="0.00" departSpeed="13.90" departDelay="0.45" arrival="419.45" arrivalLane="c2n_1" arrivalPos="990.00" arrivalPosLat="0.00" arrivalSpeed="15.48" duration="169.00" routeLength="1996.47" waitingTime="16.55" waitingCount="1" stopTime="0.00" timeLoss="45.51" rerouteNo="1" devices="tripinfo_car_w2n_250 routing_car_w2n_250" vType="Car" speedFactor="1.17" vaporized=""/>
    <tripinfo id="car_e2n_286" depart="286.40" departLane="e2sep_1" departPos="3.60" departPosLat="0.00" departSpeed="13.90" departDelay="0.40" arrival="433.40" arrivalLane="c2n_1" arrivalPos="990.00" arrivalPosLat="0.00" arrivalSpeed="14.23" duration="147.00" routeLength="1986.69" waitingTime="0.00" waitingCount="0" stopTime="0.00" timeLoss="6.57" rerouteNo="1" devices="tripinfo_car_e2n_286 routing_car_e2n_286" vType="Car" speedFactor="1.02" vaporized=""/>
    <tripinfo id="bus_e2s_259" depart="261.05" departLane="e2sep_1" departPos="12.10" departPosLat="0.00" departSpeed="13.90" departDelay="2.05" arrival="442.80" arrivalLane="c2s_1" arrivalPos="990.00" arrivalPosLat="0.00" arrivalSpeed="13.90" duration="181.75" routeLength="1987.97" waitingTime="23.45" waitingCount="2" stopTime="0.00" timeLoss="38.05" rerouteNo="1" devices="tripinfo_bus_e2s_259 routing_bus_e2s_259" vType="Bus" speedFactor="1.00" vaporized=""/>
    <tripinfo id="car_e2s_265" depart="265.00" departLane="e2sep_1" departPos="3.60" departPosLat="0.00" departSpeed="13.90" departDelay="0.00" arrival="445.65" arrivalLane="c2s_1" arrivalPos="990.00" arrivalPosLat="0.00" arrivalSpeed="15.02" duration="180.65" routeLength="1996.47" waitingTime="22.00" waitingCount="1" stopTime="0.00" timeLoss="48.95" rerouteNo="1" devices="tripinfo_car_e2s_265 routing_car_e2s_265" vType="Car" speedFactor="1.10" vaporized=""/>
    <tripinfo id="car_e2s_271" depart="271.00" departLane="e2sep_1" departPos="3.60" departPosLat="0.00" departSpeed="13.90" departDelay="0.00" arrival="449.75" arrivalLane="c2s_1" arrivalPos="990.00" arrivalPosLat="0.00" arrivalSpeed="13.95" duration="178.75" routeLength="1996.47" waitingTime="19.45" waitingCount="1" stopTime="0.00" timeLoss="35.07" rerouteNo="1" devices="tripinfo_car_e2s_271 routing_car_e2s_271" vType="Car" speedFactor="1.00" vaporized=""/>
    <tripinfo id="car_s2n_238" depart="238.00" departLane="s2sep_1" departPos="3.60" departPosLat="0.00" departSpeed="13.90" departDelay="0.00" arrival="452.10" arrivalLane="c2n_1" arrivalPos="990.00" arrivalPosLat="0.00" arrivalSpeed="13.90" duration="214.10" routeLength="1997.01" waitingTime="63.60" waitingCount="1" stopTime="0.00" timeLoss="70.41" rerouteNo="1" devices="tripinfo_car_s2n_238 routing_car_s2n_238" vType="Car" speedFactor="1.00" vaporized=""/>
    <tripinfo id="car_e2s_285" depart="285.00" departLane="e2sep_1" departPos="3.60" departPosLat="0.00" departSpeed="13.90" departDelay="0.00" arrival="452.60" arrivalLane="c2s_1" arrivalPos="990.00" arrivalPosLat="0.00" arrivalSpeed="14.24" duration="167.60" routeLength="1996.47" waitingTime="9.75" waitingCount="1" stopTime="0.00" timeLoss="27.64" rerouteNo="1" devices="tripinfo_car_e2s_285 routing_car_e2s_285" vType="Car" speedFactor="1.03" vaporized=""/>
    <tripinfo id="car_s2n_292" depart="292.00" departLane="s2sep_1" departPos="3.60" departPosLat="0.00" departSpeed="13.90" departDelay="0.00" arrival="454.00" arrivalLane="c2n_1" arrivalPos="990.00" arrivalPosLat="0.00" arrivalSpeed="15.32" duration="162.00" routeLength="1997.01" waitingTime="18.95" waitingCount="1" stopTime="0.00" timeLoss="37.38" rerouteNo="1" devices="tripinfo_car_s2n_292 routing_car_s2n_292" vType="Car" speedFactor="1.15" vaporized=""/>
    <tripinfo id="car_n2w_243" depart="243.00" departLane="n2sep_1" departPos="3.60" departPosLat="0.00" departSpeed="13.90" departDelay="0.00" arrival="454.35" arrivalLane="c2w_1" arrivalPos="990.00" arrivalPosLat="0.00" arrivalSpeed="13.90" duration="211.35" routeLength="1986.69" waitingTime="58.35" waitingCount="1" stopTime="0.00" timeLoss="67.65" rerouteNo="1" devices="tripinfo_car_n2w_243 routing_car_n2w_243" vType="Car" speedFactor="1.00" vaporized=""/>
    <tripinfo id="car_n2s_235" depart="235.00" departLane="n2sep_1" departPos="3.60" departPosLat="0.00" departSpeed="13.90" departDelay="0.00" arrival="455.90" arrivalLane="c2s_1" arrivalPos="990.00" arrivalPosLat="0.00" arrivalSpeed="13.86" duration="220.90" routeLength="1997.01" waitingTime="66.90" waitingCount="1" stopTime="0.00" timeLoss="77.21" rerouteNo="1" devices="tripinfo_car_n2s_235 routing_car_n2s_235" vType="Car" speedFactor="1.00" vaporized=""/>
    <tripinfo id="car_n2w_244" depart="244.50" departLane="n2sep_1" departPos="3.60" departPosLat="0.00" departSpeed="13.90" departDelay="0.50" arrival="456.85" arrivalLane="c2w_1" arrivalPos="990.00" arrivalPosLat="0.00" arrivalSpeed="14.72" duration="212.35" routeLength="1986.69" waitingTime="57.40" waitingCount="1" stopTime="0.00" timeLoss="78.44" rerouteNo="1" devices="tripinfo_car_n2w_244 routing_car_n2w_244" vType="Car" speedFactor="1.07" vaporized=""/>
    <tripinfo id="car_n2e_279" depart="279.00" departLane="n2sep_1" departPos="3.60" departPosLat="0.00" departSpeed="13.90" departDelay="0.00" arrival="456.85" arrivalLane="c2e_1" arrivalPos="990.00" arrivalPosLat="0.00" arrivalSpeed="13.90" duration="177.85" routeLength="1996.47" waitingTime="22.35" waitingCount="2" stopTime="0.00" timeLoss="33.50" rerouteNo="1" devices="tripinfo_car_n2e_279 routing_car_n2e_279" vType="Car" speedFactor="1.00" vaporized=""/>
    <tripinfo id="car_n2s_272" depart="272.00" departLane="n2sep_1" departPos="3.60" departPosLat="0.00" departSpeed="13.90" departDelay="0.00" arrival="459.80" arrivalLane="c2s_1" arrivalPos="990.00" arrivalPosLat="0.00" arrivalSpeed="13.92" duration="187.80" routeLength="1997.01" waitingTime="32.75" waitingCount="1" stopTime="0.00" timeLoss="44.54" rerouteNo="1" devices="tripinfo_car_n2s_272 routing_car_n2s_272" vType="Car" speedFactor="1.00" vaporized=""/>
    <tripinfo id="car_n2w_291" depart="291.00" departLane="n2sep_1" departPos="3.60" departPosLat="0.00" departSpeed="13.90" departDelay="0.00" arrival="460.45" arrivalLane="c2w_1" arrivalPos="990.00" arrivalPosLat="0.00" arrivalSpeed="14.71" duration="169.45" routeLength="1986.69" waitingTime="19.75" waitingCount="1" stopTime="0.00" timeLoss="34.04" rerouteNo="1" devices="tripinfo_car_n2w_291 routing_car_n2w_291" vType="Car" speedFactor="1.06" vaporized=""/>
    <tripinfo id="car_s2n_321" depart="321.00" departLane="s2sep_1" departPos="3.60" departPosLat="0.00" departSpeed="13.90" departDelay="0.00" arrival="460.45" arrivalLane="c2n_1" arrivalPos="990.00" arrivalPosLat="0.00" arrivalSpeed="14.42" duration="139.45" routeLength="1997.01" waitingTime="0.00" waitingCount="0" stopTime="0.00" timeLoss="0.96" rerouteNo="1" devices="tripinfo_car_s2n_321 routing_car_s2n_321" vType="Car" speedFactor="1.04" vaporized=""/>
    <tripinfo id="car_n2e_311" depart="311.00" departLane="n2sep_1" departPos="3.60" departPosLat="0.00" departSpeed="13.90" departDelay="0.00" arrival="460.90" arrivalLane="c2e_1" arrivalPos="990.00" arrivalPosLat="0.00" arrivalSpeed="14.00" duration="149.90" routeLength="1996.47" waitingTime="0.00" waitingCount="0" stopTime="0.00" timeLoss="6.77" rerouteNo="1" devices="tripinfo_car_n2e_311 routing_car_n2e_311" vType="Car" speedFactor="1.01" vaporized=""/>
    <tripinfo id="car_n2s_282" depart="282.00" departLane="n2sep_1" departPos="3.60" departPosLat="0.00" departSpeed="13.90" departDelay="0.00" arrival="461.85" arrivalLane="c2s_1" arrivalPos="990.00" arrivalPosLat="0.00" arrivalSpeed="14.88" duration="179.85" routeLength="1997.01" waitingTime="24.70" waitingCount="1" stopTime="0.00" timeLoss="49.62" rerouteNo="1" devices="tripinfo_car_n2s_282 routing_car_n2s_282" vType="Car" speedFactor="1.10" vaporized=""/>
    <tripinfo id="car_n2e_318" depart="318.00" departLane="n2sep_1" departPos="3.60" departPosLat="0.00" departSpeed="13.90" departDelay="0.00" arrival="463.70" arrivalLane="c2e_1" arrivalPos="990.00" arrivalPosLat="0.00" arrivalSpeed="14.73" duration="145.70" routeLength="1996.47" waitingTime="0.30" waitingCount="1" stopTime="0.00" timeLoss="10.57" rerouteNo="1" devices="tripinfo_car_n2e_318 routing_car_n2e_318" vType="Car" speedFactor="1.07" vaporized=""/>
    <tripinfo id="car_s2w_270" depart="270.00" departLane="s2sep_1" departPos="3.60" departPosLat="0.00" departSpeed="13.90" departDelay="0.00" arrival="464.70" arrivalLane="c2w_1" arrivalPos="990.00" arrivalPosLat="0.00" arrivalSpeed="16.33" duration="194.70" routeLength="1996.47" waitingTime="59.20" waitingCount="2" stopTime="0.00" timeLoss="72.09" rerouteNo="1" devices="tripinfo_car_s2w_270 routing_car_s2w_270" vType="Car" speedFactor="1.18" vaporized=""/>
    <tripinfo id="car_n2s_324" depart="324.00" departLane="n2sep_1" departPos="3.60" departPosLat="0.00" departSpeed="13.90" departDelay="0.00" arrival="467.15" arrivalLane="c2s_1" arrivalPos="990.00" arrivalPosLat="0.00" arrivalSpeed="14.11" duration="143.15" routeLength="1997.01" waitingTime="0.00" waitingCount="0" stopTime="0.00" timeLoss="1.59" rerouteNo="1" devices="tripinfo_car_n2s_324 routing_car_n2s_324" vType="Car" speedFactor="1.02" vaporized=""/>
</tripinfos>
