<?xml version="1.0" encoding="UTF-8"?>

<!-- generated on 2021-05-18 05:44:53 by Eclipse SUMO sumo Version 1.9.1
<configuration xmlns:xsi="http://www.w3.org/2001/XMLSchema-instance" xsi:noNamespaceSchemaLocation="http://sumo.dlr.de/xsd/sumoConfiguration.xsd">

    <input>
        <net-file value="sumofiles/junction.net.xml"/>
        <route-files value="sumofiles/junction_none_17.rou.xml"/>
        <additional-files value="sumofiles/junction.det.xml"/>
    </input>

    <output>
        <tripinfo-output value="sumofiles/output/tripinfo_none_17.xml"/>
    </output>

    <time>
        <begin value="0"/>
        <end value="10000"/>
        <step-length value="1.0"/>
    </time>

    <processing>
        <lateral-resolution value="0.5"/>
    </processing>

    <report>
        <no-warnings value="true"/>
        <error-log value="sumofiles/output/errorlog_none_17.log"/>
        <no-step-log value="true"/>
    </report>

    <traci_server>
        <remote-port value="58341"/>
    </traci_server>

    <gui_only>
        <gui-settings-file value="sumofiles/junction-gui.settings.xml"/>
        <tracker-interval value="1"/>
    </gui_only>

</configuration>
-->

<tripinfos xmlns:xsi="http://www.w3.org/2001/XMLSchema-instance" xsi:noNamespaceSchemaLocation="http://sumo.dlr.de/xsd/tripinfo_file.xsd">
    <tripinfo id="car_e2n_1" depart="1.00" departLane="e2sep_1" departPos="3.60" departPosLat="0.00" departSpeed="13.90" departDelay="0.00" arrival="142.00" arrivalLane="c2n_1" arrivalPos="990.00" arrivalPosLat="0.00" arrivalSpeed="14.73" duration="141.00" routeLength="1986.69" waitingTime="0.00" waitingCount="0" stopTime="0.00" timeLoss="5.41" rerouteNo="1" devices="tripinfo_car_e2n_1 routing_car_e2n_1" vType="Car" speedFactor="1.06" vaporized=""/>
    <tripinfo id="car_e2s_6" depart="6.00" departLane="e2sep_1" departPos="3.60" departPosLat="0.00" departSpeed="13.90" departDelay="0.00" arrival="152.00" arrivalLane="c2s_1" arrivalPos="990.00" arrivalPosLat="0.00" arrivalSpeed="14.32" duration="146.00" routeLength="1996.47" waitingTime="0.00" waitingCount="0" stopTime="0.00" timeLoss="4.94" rerouteNo="1" devices="tripinfo_car_e2s_6 routing_car_e2s_6" vType="Car" speedFactor="1.03" vaporized=""/>
    <tripinfo id="car_e2s_20" depart="20.00" departLane="e2sep_1" departPos="3.60" departPosLat="0.00" departSpeed="13.90" departDelay="0.00" arrival="154.00" arrivalLane="c2s_1" arrivalPos="990.00" arrivalPosLat="0.00" arrivalSpeed="15.35" duration="134.00" routeLength="1996.47" waitingTime="0.00" waitingCount="0" stopTime="0.00" timeLoss="5.16" rerouteNo="1" devices="tripinfo_car_e2s_20 routing_car_e2s_20" vType="Car" speedFactor="1.12" vaporized=""/>
    <tripinfo id="car_w2n_7" depart="7.00" departLane="w2sep_1" departPos="3.60" departPosLat="0.00" departSpeed="13.90" departDelay="0.00" arrival="155.00" arrivalLane="c2n_1" arrivalPos="990.00" arrivalPosLat="0.00" arrivalSpeed="13.90" duration="148.00" routeLength="1996.47" waitingTime="0.00" waitingCount="0" stopTime="0.00" timeLoss="2.93" rerouteNo="1" devices="tripinfo_car_w2n_7 routing_car_w2n_7" vType="Car" speedFactor="1.00" vaporized=""/>
    <tripinfo id="car_n2w_6" depart="6.00" departLane="n2sep_1" departPos="3.60" departPosLat="0.00" departSpeed="13.90" departDelay="0.00" arrival="159.00" arrivalLane="c2w_1" arrivalPos="990.00" arrivalPosLat="0.00" arrivalSpeed="15.05" duration="153.00" routeLength="1986.69" waitingTime="10.00" waitingCount="1" stopTime="0.00" timeLoss="20.15" rerouteNo="1" devices="tripinfo_car_n2w_6 routing_car_n2w_6" vType="Car" speedFactor="1.08" vaporized=""/>
    <tripinfo id="car_w2n_14" depart="14.00" departLane="w2sep_1" departPos="3.60" departPosLat="0.00" departSpeed="13.90" departDelay="0.00" arrival="159.00" arrivalLane="c2n_1" arrivalPos="990.00" arrivalPosLat="0.00" arrivalSpeed="14.31" duration="145.00" routeLength="1996.47" waitingTime="0.00" waitingCount="0" stopTime="0.00" timeLoss="4.35" rerouteNo="1" devices="tripinfo_car_w2n_14 routing_car_w2n_14" vType="Car" speedFactor="1.03" vaporized=""/>
    <tripinfo id="car_n2s_20" depart="21.00" departLane="n2sep_1" departPos="3.60" departPosLat="0.00" departSpeed="13.90" departDelay="1.00" arrival="163.00" arrivalLane="c2s_1" arrivalPos="990.00" arrivalPosLat="0.00" arrivalSpeed="14.55" duration="142.00" routeLength="1997.01" waitingTime="0.00" waitingCount="0" stopTime="0.00" timeLoss="4.61" rerouteNo="1" devices="tripinfo_car_n2s_20 routing_car_n2s_20" vType="Car" speedFactor="1.05" vaporized=""/>
    <tripinfo id="car_s2e_9" depart="9.00" departLane="s2sep_1" departPos="3.60" departPosLat="0.00" departSpeed="13.90" departDelay="0.00" arrival="164.00" arrivalLane="c2e_1" arrivalPos="990.00" arrivalPosLat="0.00" arrivalSpeed="14.04" duration="155.00" routeLength="1986.69" waitingTime="2.00" waitingCount="1" stopTime="0.00" timeLoss="12.25" rerouteNo="1" devices="tripinfo_car_s2e_9 routing_car_s2e_9" vType="Car" speedFactor="1.01" vaporized=""/>
    <tripinfo id="car_n2e_0" depart="0.00" departLane="n2sep_1" departPos="3.60" departPosLat="0.00" departSpeed="13.90" departDelay="0.00" arrival="167.00" arrivalLane="c2e_1" arrivalPos="990.00" arrivalPosLat="0.00" arrivalSpeed="14.66" duration="167.00" routeLength="1996.47" waitingTime="14.00" waitingCount="1" stopTime="0.00" timeLoss="30.01" rerouteNo="1" devices="tripinfo_car_n2e_0 routing_car_n2e_0" vType="Car" speedFactor="1.06" vaporized=""/>
    <tripinfo id="car_s2w_2" depart="2.00" departLane="s2sep_1" departPos="3.60" departPosLat="0.00" departSpeed="13.90" departDelay="0.00" arrival="169.00" arrivalLane="c2w_1" arrivalPos="990.00" arrivalPosLat="0.00" arrivalSpeed="14.04" duration="167.00" routeLength="1996.47" waitingTime="9.00" waitingCount="1" stopTime="0.00" timeLoss="23.26" rerouteNo="1" devices="tripinfo_car_s2w_2 routing_car_s2w_2" vType="Car" speedFactor="1.01" vaporized=""/>
    <tripinfo id="car_n2e_13" depart="13.00" departLane="n2sep_1" departPos="3.60" departPosLat="0.00" departSpeed="13.90" departDelay="0.00" arrival="169.00" arrivalLane="c2e_1" arrivalPos="990.00" arrivalPosLat="0.00" arrivalSpeed="14.82" duration="156.00" routeLength="1996.47" waitingTime="4.00" waitingCount="1" stopTime="0.00" timeLoss="22.37" rerouteNo="1" devices="tripinfo_car_n2e_13 routing_car_n2e_13" vType="Car" speedFactor="1.08" vaporized=""/>
    <tripinfo id="car_s2w_7" depart="7.00" departLane="s2sep_1" departPos="3.60" departPosLat="0.00" departSpeed="13.90" departDelay="0.00" arrival="173.00" arrivalLane="c2w_1" arrivalPos="990.00" arrivalPosLat="0.00" arrivalSpeed="14.52" duration="166.00" routeLength="1996.47" waitingTime="7.00" waitingCount="1" stopTime="0.00" timeLoss="27.50" rerouteNo="1" devices="tripinfo_car_s2w_7 routing_car_s2w_7" vType="Car" speedFactor="1.05" vaporized=""/>
    <tripinfo id="car_n2e_19" depart="19.00" departLane="n2sep_1" departPos="3.60" departPosLat="0.00" departSpeed="13.90" departDelay="0.00" arrival="173.00" arrivalLane="c2e_1" arrivalPos="990.00" arrivalPosLat="0.00" arrivalSpeed="14.25" duration="154.00" routeLength="1996.47" waitingTime="0.00" waitingCount="0" stopTime="0.00" timeLoss="12.92" rerouteNo="1" devices="tripinfo_car_n2e_19 routing_car_n2e_19" vType="Car" speedFactor="1.03" vaporized=""/>
    <tripinfo id="car_n2s_28" depart="28.00" departLane="n2sep_1" departPos="3.60" departPosLat="0.00" departSpeed="13.90" departDelay="0.00" arrival="173.00" arrivalLane="c2s_1" arrivalPos="990.00" arrivalPosLat="0.00" arrivalSpeed="13.90" duration="145.00" routeLength="1997.01" waitingTime="0.00" waitingCount="0" stopTime="0.00" timeLoss="1.00" rerouteNo="1" devices="tripinfo_car_n2s_28 routing_car_n2s_28" vType="Car" speedFactor="1.00" vaporized=""/>
    <tripinfo id="car_s2w_21" depart="21.00" departLane="s2sep_1" departPos="3.60" departPosLat="0.00" departSpeed="13.90" departDelay="0.00" arrival="179.00" arrivalLane="c2w_1" arrivalPos="990.00" arrivalPosLat="0.00" arrivalSpeed="13.90" duration="158.00" routeLength="1996.47" waitingTime="0.00" waitingCount="0" stopTime="0.00" timeLoss="12.98" rerouteNo="1" devices="tripinfo_car_s2w_21 routing_car_s2w_21" vType="Car" speedFactor="1.00" vaporized=""/>
    <tripinfo id="bus_s2w_27" depart="27.00" departLane="s2sep_1" departPos="12.10" departPosLat="0.00" departSpeed="13.90" departDelay="0.00" arrival="184.00" arrivalLane="c2w_1" arrivalPos="990.00" arrivalPosLat="0.00" arrivalSpeed="13.87" duration="157.00" routeLength="1987.97" waitingTime="0.00" waitingCount="0" stopTime="0.00" timeLoss="12.69" rerouteNo="1" devices="tripinfo_bus_s2w_27 routing_bus_s2w_27" vType="Bus" speedFactor="1.00" vaporized=""/>
    <tripinfo id="car_n2s_61" depart="61.00" departLane="n2sep_1" departPos="3.60" departPosLat="0.00" departSpeed="13.90" departDelay="0.00" arrival="186.00" arrivalLane="c2s_1" arrivalPos="990.00" arrivalPosLat="0.00" arrivalSpeed="16.05" duration="125.00" routeLength="1997.01" waitingTime="0.00" waitingCount="0" stopTime="0.00" timeLoss="0.40" rerouteNo="1" devices="tripinfo_car_n2s_61 routing_car_n2s_61" vType="Car" speedFactor="1.15" vaporized=""/>
    <tripinfo id="car_s2w_42" depart="42.00" departLane="s2sep_1" departPos="3.60" departPosLat="0.00" departSpeed="13.90" departDelay="0.00" arrival="187.00" arrivalLane="c2w_1" arrivalPos="990.00" arrivalPosLat="0.00" arrivalSpeed="14.99" duration="145.00" routeLength="1996.47" waitingTime="0.00" waitingCount="0" stopTime="0.00" timeLoss="11.64" rerouteNo="1" devices="tripinfo_car_s2w_42 routing_car_s2w_42" vType="Car" speedFactor="1.09" vaporized=""/>
    <tripinfo id="car_s2e_42" depart="44.00" departLane="s2sep_1" departPos="3.60" departPosLat="0.00" departSpeed="13.90" departDelay="2.00" arrival="190.00" arrivalLane="c2e_1" arrivalPos="990.00" arrivalPosLat="0.00" arrivalSpeed="14.27" duration="146.00" routeLength="1986.69" waitingTime="0.00" waitingCount="0" stopTime="0.00" timeLoss="5.07" rerouteNo="1" devices="tripinfo_car_s2e_42 routing_car_s2e_42" vType="Car" speedFactor="1.03" vaporized=""/>
    <tripinfo id="car_n2e_40" depart="40.00" departLane="n2sep_1" departPos="3.60" departPosLat="0.00" departSpeed="13.90" departDelay="0.00" arrival="195.00" arrivalLane="c2e_1" arrivalPos="990.00" arrivalPosLat="0.00" arrivalSpeed="14.04" duration="155.00" routeLength="1996.47" waitingTime="0.00" waitingCount="0" stopTime="0.00" timeLoss="11.28" rerouteNo="1" devices="tripinfo_car_n2e_40 routing_car_n2e_40" vType="Car" speedFactor="1.01" vaporized=""/>
    <tripinfo id="car_n2e_47" depart="47.00" departLane="n2sep_1" departPos="3.60" departPosLat="0.00" departSpeed="13.90" departDelay="0.00" arrival="197.00" arrivalLane="c2e_1" arrivalPos="990.00" arrivalPosLat="0.00" arrivalSpeed="14.39" duration="150.00" routeLength="1996.47" waitingTime="0.00" waitingCount="0" stopTime="0.00" timeLoss="12.14" rerouteNo="1" devices="tripinfo_car_n2e_47 routing_car_n2e_47" vType="Car" speedFactor="1.05" vaporized=""/>
    <tripinfo id="car_s2w_55" depart="55.00" departLane="s2sep_1" departPos="3.60" departPosLat="0.00" departSpeed="13.90" departDelay="0.00" arrival="202.00" arrivalLane="c2w_1" arrivalPos="990.00" arrivalPosLat="0.00" arrivalSpeed="13.90" duration="147.00" routeLength="1996.47" waitingTime="0.00" waitingCount="0" stopTime="0.00" timeLoss="2.35" rerouteNo="1" devices="tripinfo_car_s2w_55 routing_car_s2w_55" vType="Car" speedFactor="1.00" vaporized=""/>
    <tripinfo id="car_w2e_18" depart="18.00" departLane="w2sep_1" departPos="3.60" departPosLat="0.00" departSpeed="13.90" departDelay="0.00" arrival="204.00" arrivalLane="c2e_1" arrivalPos="990.00" arrivalPosLat="0.00" arrivalSpeed="15.16" duration="186.00" routeLength="1997.01" waitingTime="43.00" waitingCount="1" stopTime="0.00" timeLoss="54.09" rerouteNo="1" devices="tripinfo_car_w2e_18 routing_car_w2e_18" vType="Car" speedFactor="1.09" vaporized=""/>
    <tripinfo id="car_e2w_48" depart="48.00" departLane="e2sep_1" departPos="3.60" departPosLat="0.00" departSpeed="13.90" departDelay="0.00" arrival="205.00" arrivalLane="c2w_1" arrivalPos="990.00" arrivalPosLat="0.00" arrivalSpeed="15.44" duration="157.00" routeLength="1997.01" waitingTime="15.00" waitingCount="1" stopTime="0.00" timeLoss="28.09" rerouteNo="1" devices="tripinfo_car_e2w_48 routing_car_e2w_48" vType="Car" speedFactor="1.12" vaporized=""/>
    <tripinfo id="car_e2n_56" depart="56.00" departLane="e2sep_1" departPos="3.60" departPosLat="0.00" departSpeed="13.90" departDelay="0.00" arrival="207.00" arrivalLane="c2n_1" arrivalPos="990.00" arrivalPosLat="0.00" arrivalSpeed="15.73" duration="151.00" routeLength="1986.69" waitingTime="5.00" waitingCount="1" stopTime="0.00" timeLoss="23.65" rerouteNo="1" devices="tripinfo_car_e2n_56 routing_car_e2n_56" vType="Car" speedFactor="1.13" vaporized=""/>
    <tripinfo id="car_w2s_21" depart="23.00" departLane="w2sep_1" departPos="3.60" departPosLat="0.00" departSpeed="13.90" departDelay="2.00" arrival="212.00" arrivalLane="c2s_1" arrivalPos="990.00" arrivalPosLat="0.00" arrivalSpeed="14.54" duration="189.00" routeLength="1986.69" waitingTime="35.00" waitingCount="1" stopTime="0.00" timeLoss="51.24" rerouteNo="1" devices="tripinfo_car_w2s_21 routing_car_w2s_21" vType="Car" speedFactor="1.05" vaporized=""/>
    <tripinfo id="car_w2e_21" depart="21.00" departLane="w2sep_1" departPos="3.60" departPosLat="0.00" departSpeed="13.90" departDelay="0.00" arrival="213.00" arrivalLane="c2e_1" arrivalPos="990.00" arrivalPosLat="0.00" arrivalSpeed="13.90" duration="192.00" routeLength="1997.01" waitingTime="36.00" waitingCount="1" stopTime="0.00" timeLoss="47.58" rerouteNo="1" devices="tripinfo_car_w2e_21 routing_car_w2e_21" vType="Car" speedFactor="1.00" vaporized=""/>
    <tripinfo id="car_e2w_52" depart="52.00" departLane="e2sep_1" departPos="3.60" departPosLat="0.00" departSpeed="13.90" departDelay="0.00" arrival="213.00" arrivalLane="c2w_1" arrivalPos="990.00" arrivalPosLat="0.00" arrivalSpeed="13.90" duration="161.00" routeLength="1997.01" waitingTime="5.00" waitingCount="1" stopTime="0.00" timeLoss="16.49" rerouteNo="1" devices="tripinfo_car_e2w_52 routing_car_e2w_52" vType="Car" speedFactor="1.00" vaporized=""/>
    <tripinfo id="car_w2s_33" depart="33.00" departLane="w2sep_1" departPos="3.60" departPosLat="0.00" departSpeed="13.90" departDelay="0.00" arrival="214.00" arrivalLane="c2s_1" arrivalPos="990.00" arrivalPosLat="0.00" arrivalSpeed="15.67" duration="181.00" routeLength="1986.69" waitingTime="34.00" waitingCount="1" stopTime="0.00" timeLoss="56.75" rerouteNo="1" devices="tripinfo_car_w2s_33 routing_car_w2s_33" vType="Car" speedFactor="1.16" vaporized=""/>
    <tripinfo id="car_w2e_61" depart="61.00" departLane="w2sep_1" departPos="3.60" departPosLat="0.00" departSpeed="13.90" departDelay="0.00" arrival="215.00" arrivalLane="c2e_1" arrivalPos="990.00" arrivalPosLat="0.00" arrivalSpeed="15.64" duration="154.00" routeLength="1997.01" waitingTime="10.00" waitingCount="1" stopTime="0.00" timeLoss="31.27" rerouteNo="1" devices="tripinfo_car_w2e_61 routing_car_w2e_61" vType="Car" speedFactor="1.18" vaporized=""/>
    <tripinfo id="car_e2w_73" depart="73.00" departLane="e2sep_1" departPos="3.60" departPosLat="0.00" departSpeed="13.90" departDelay="0.00" arrival="215.00" arrivalLane="c2w_1" arrivalPos="990.00" arrivalPosLat="0.00" arrivalSpeed="15.62" duration="142.00" routeLength="1997.01" waitingTime="0.00" waitingCount="0" stopTime="0.00" timeLoss="19.28" rerouteNo="1" devices="tripinfo_car_e2w_73 routing_car_e2w_73" vType="Car" speedFactor="1.18" vaporized=""/>
    <tripinfo id="car_w2e_76" depart="76.00" departLane="w2sep_1" departPos="3.60" departPosLat="0.00" departSpeed="13.90" departDelay="0.00" arrival="218.00" arrivalLane="c2e_1" arrivalPos="990.00" arrivalPosLat="0.00" arrivalSpeed="15.25" duration="142.00" routeLength="1997.01" waitingTime="0.00" waitingCount="0" stopTime="0.00" timeLoss="11.07" rerouteNo="1" devices="tripinfo_car_w2e_76 routing_car_w2e_76" vType="Car" speedFactor="1.10" vaporized=""/>
    <tripinfo id="car_w2n_37" depart="37.00" departLane="w2sep_1" departPos="3.60" departPosLat="0.00" departSpeed="13.90" departDelay="0.00" arrival="219.00" arrivalLane="c2n_1" arrivalPos="990.00" arrivalPosLat="0.00" arrivalSpeed="14.15" duration="182.00" routeLength="1996.47" waitingTime="24.00" waitingCount="2" stopTime="0.00" timeLoss="39.82" rerouteNo="1" devices="tripinfo_car_w2n_37 routing_car_w2n_37" vType="Car" speedFactor="1.02" vaporized=""/>
    <tripinfo id="car_w2n_64" depart="64.00" departLane="w2sep_1" departPos="3.60" departPosLat="0.00" departSpeed="13.90" departDelay="0.00" arrival="224.00" arrivalLane="c2n_1" arrivalPos="990.00" arrivalPosLat="0.00" arrivalSpeed="13.97" duration="160.00" routeLength="1996.47" waitingTime="3.00" waitingCount="1" stopTime="0.00" timeLoss="15.93" rerouteNo="1" devices="tripinfo_car_w2n_64 routing_car_w2n_64" vType="Car" speedFactor="1.01" vaporized=""/>
    <tripinfo id="car_e2s_26" depart="26.00" departLane="e2sep_1" departPos="3.60" departPosLat="0.00" departSpeed="13.90" departDelay="0.00" arrival="225.00" arrivalLane="c2s_1" arrivalPos="990.00" arrivalPosLat="0.00" arrivalSpeed="13.90" duration="199.00" routeLength="1996.47" waitingTime="39.00" waitingCount="2" stopTime="0.00" timeLoss="54.48" rerouteNo="1" devices="tripinfo_car_e2s_26 routing_car_e2s_26" vType="Car" speedFactor="1.00" vaporized=""/>
    <tripinfo id="car_e2w_92" depart="92.00" departLane="e2sep_1" departPos="3.60" departPosLat="0.00" departSpeed="13.90" departDelay="0.00" arrival="225.00" arrivalLane="c2w_1" arrivalPos="990.00" arrivalPosLat="0.00" arrivalSpeed="15.18" duration="133.00" routeLength="1997.01" waitingTime="0.00" waitingCount="0" stopTime="0.00" timeLoss="0.50" rerouteNo="1" devices="tripinfo_car_e2w_92 routing_car_e2w_92" vType="Car" speedFactor="1.09" vaporized=""/>
    <tripinfo id="car_e2s_58" depart="58.00" departLane="e2sep_1" departPos="3.60" departPosLat="0.00" departSpeed="13.90" departDelay="0.00" arrival="230.00" arrivalLane="c2s_1" arrivalPos="990.00" arrivalPosLat="0.00" arrivalSpeed="13.90" duration="172.00" routeLength="1996.47" waitingTime="8.00" waitingCount="1" stopTime="0.00" timeLoss="26.85" rerouteNo="1" devices="tripinfo_car_e2s_58 routing_car_e2s_58" vType="Car" speedFactor="1.00" vaporized=""/>
    <tripinfo id="car_e2n_94" depart="94.00" departLane="e2sep_1" departPos="3.60" departPosLat="0.00" departSpeed="13.90" departDelay="0.00" arrival="238.00" arrivalLane="c2n_1" arrivalPos="990.00" arrivalPosLat="0.00" arrivalSpeed="14.50" duration="144.00" routeLength="1986.69" waitingTime="0.00" waitingCount="0" stopTime="0.00" timeLoss="6.34" rerouteNo="1" devices="tripinfo_car_e2n_94 routing_car_e2n_94" vType="Car" speedFactor="1.04" vaporized=""/>
    <tripinfo id="car_s2e_65" depart="65.00" departLane="s2sep_1" departPos="3.60" departPosLat="0.00" departSpeed="13.90" departDelay="0.00" arrival="244.00" arrivalLane="c2e_1" arrivalPos="990.00" arrivalPosLat="0.00" arrivalSpeed="16.29" duration="179.00" routeLength="1986.69" waitingTime="45.00" waitingCount="1" stopTime="0.00" timeLoss="56.41" rerouteNo="1" devices="tripinfo_car_s2e_65 routing_car_s2e_65" vType="Car" speedFactor="1.17" vaporized=""/>
    <tripinfo id="car_n2w_70" depart="70.00" departLane="n2sep_1" departPos="3.60" departPosLat="0.00" departSpeed="13.90" departDelay="0.00" arrival="254.00" arrivalLane="c2w_1" arrivalPos="990.00" arrivalPosLat="0.00" arrivalSpeed="13.90" duration="184.00" routeLength="1986.69" waitingTime="31.00" waitingCount="1" stopTime="0.00" timeLoss="40.51" rerouteNo="1" devices="tripinfo_car_n2w_70 routing_car_n2w_70" vType="Car" speedFactor="1.00" vaporized=""/>
    <tripinfo id="car_n2s_70" depart="72.00" departLane="n2sep_1" departPos="3.60" departPosLat="0.00" departSpeed="13.90" departDelay="2.00" arrival="255.00" arrivalLane="c2s_1" arrivalPos="990.00" arrivalPosLat="0.00" arrivalSpeed="14.17" duration="183.00" routeLength="1997.01" waitingTime="29.00" waitingCount="1" stopTime="0.00" timeLoss="42.08" rerouteNo="1" devices="tripinfo_car_n2s_70 routing_car_n2s_70" vType="Car" speedFactor="1.02" vaporized=""/>
    <tripinfo id="car_n2w_79" depart="79.00" departLane="n2sep_1" departPos="3.60" departPosLat="0.00" departSpeed="13.90" departDelay="0.00" arrival="256.00" arrivalLane="c2w_1" arrivalPos="990.00" arrivalPosLat="0.00" arrivalSpeed="15.46" duration="177.00" routeLength="1986.69" waitingTime="29.00" waitingCount="1" stopTime="0.00" timeLoss="52.92" rerouteNo="1" devices="tripinfo_car_n2w_79 routing_car_n2w_79" vType="Car" speedFactor="1.16" vaporized=""/>
    <tripinfo id="car_s2e_70" depart="70.00" departLane="s2sep_1" departPos="3.60" departPosLat="0.00" departSpeed="13.90" departDelay="0.00" arrival="258.00" arrivalLane="c2e_1" arrivalPos="990.00" arrivalPosLat="0.00" arrivalSpeed="13.90" duration="188.00" routeLength="1986.69" waitingTime="32.00" waitingCount="1" stopTime="0.00" timeLoss="43.42" rerouteNo="1" devices="tripinfo_car_s2e_70 routing_car_s2e_70" vType="Car" speedFactor="1.00" vaporized=""/>
    <tripinfo id="car_s2e_98" depart="98.00" departLane="s2sep_1" departPos="3.60" departPosLat="0.00" departSpeed="13.90" departDelay="0.00" arrival="261.00" arrivalLane="c2e_1" arrivalPos="990.00" arrivalPosLat="0.00" arrivalSpeed="15.06" duration="163.00" routeLength="1986.69" waitingTime="13.00" waitingCount="1" stopTime="0.00" timeLoss="30.34" rerouteNo="1" devices="tripinfo_car_s2e_98 routing_car_s2e_98" vType="Car" speedFactor="1.09" vaporized=""/>
    <tripinfo id="car_s2w_80" depart="80.00" departLane="s2sep_1" departPos="3.60" departPosLat="0.00" departSpeed="13.90" departDelay="0.00" arrival="262.00" arrivalLane="c2w_1" arrivalPos="990.00" arrivalPosLat="0.00" arrivalSpeed="14.32" duration="182.00" routeLength="1996.47" waitingTime="23.00" waitingCount="1" stopTime="0.00" timeLoss="41.09" rerouteNo="1" devices="tripinfo_car_s2w_80 routing_car_s2w_80" vType="Car" speedFactor="1.03" vaporized=""/>
    <tripinfo id="bus_s2n_85" depart="85.00" departLane="s2sep_1" departPos="12.10" departPosLat="0.00" departSpeed="13.90" departDelay="0.00" arrival="262.00" arrivalLane="c2n_1" arrivalPos="990.00" arrivalPosLat="0.00" arrivalSpeed="13.90" duration="177.00" routeLength="1988.51" waitingTime="20.00" waitingCount="1" stopTime="0.00" timeLoss="33.47" rerouteNo="1" devices="tripinfo_bus_s2n_85 routing_bus_s2n_85" vType="Bus" speedFactor="1.00" vaporized=""/>
    <tripinfo id="car_s2n_119" depart="119.00" departLane="s2sep_1" departPos="3.60" departPosLat="0.00" departSpeed="13.90" departDelay="0.00" arrival="264.00" arrivalLane="c2n_1" arrivalPos="990.00" arrivalPosLat="0.00" arrivalSpeed="15.59" duration="145.00" routeLength="1997.01" waitingTime="0.00" waitingCount="0" stopTime="0.00" timeLoss="22.08" rerouteNo="1" devices="tripinfo_car_s2n_119 routing_car_s2n_119" vType="Car" speedFactor="1.17" vaporized=""/>
    <tripinfo id="bus_s2w_102" depart="102.00" departLane="s2sep_1" departPos="12.10" departPosLat="0.00" departSpeed="13.90" departDelay="0.00" arrival="268.00" arrivalLane="c2w_1" arrivalPos="990.00" arrivalPosLat="0.00" arrivalSpeed="13.89" duration="166.00" routeLength="1987.97" waitingTime="1.00" waitingCount="1" stopTime="0.00" timeLoss="21.80" rerouteNo="1" devices="tripinfo_bus_s2w_102 routing_bus_s2w_102" vType="Bus" speedFactor="1.00" vaporized=""/>
    <tripinfo id="car_s2n_125" depart="125.00" departLane="s2sep_1" departPos="3.60" departPosLat="0.00" departSpeed="13.90" departDelay="0.00" arrival="268.00" arrivalLane="c2n_1" arrivalPos="990.00" arrivalPosLat="0.00" arrivalSpeed="15.21" duration="143.00" routeLength="1997.01" waitingTime="0.00" waitingCount="0" stopTime="0.00" timeLoss="11.53" rerouteNo="1" devices="tripinfo_car_s2n_125 routing_car_s2n_125" vType="Car" speedFactor="1.10" vaporized=""/>
    <tripinfo id="car_s2e_104" depart="104.00" departLane="s2sep_1" departPos="3.60" departPosLat="0.00" departSpeed="13.90" departDelay="0.00" arrival="269.00" arrivalLane="c2e_1" arrivalPos="990.00" arrivalPosLat="0.00" arrivalSpeed="13.90" duration="165.00" routeLength="1986.69" waitingTime="3.00" waitingCount="1" stopTime="0.00" timeLoss="20.70" rerouteNo="1" devices="tripinfo_car_s2e_104 routing_car_s2e_104" vType="Car" speedFactor="1.00" vaporized=""/>
    <tripinfo id="car_s2w_123" depart="123.00" departLane="s2sep_1" departPos="3.60" departPosLat="0.00" departSpeed="13.90" departDelay="0.00" arrival="272.00" arrivalLane="c2w_1" arrivalPos="990.00" arrivalPosLat="0.00" arrivalSpeed="14.12" duration="149.00" routeLength="1996.47" waitingTime="0.00" waitingCount="0" stopTime="0.00" timeLoss="6.90" rerouteNo="1" devices="tripinfo_car_s2w_123 routing_car_s2w_123" vType="Car" speedFactor="1.02" vaporized=""/>
    <tripinfo id="car_n2e_86" depart="86.00" departLane="n2sep_1" departPos="3.60" departPosLat="0.00" departSpeed="13.90" departDelay="0.00" arrival="275.00" arrivalLane="c2e_1" arrivalPos="990.00" arrivalPosLat="0.00" arrivalSpeed="14.15" duration="189.00" routeLength="1996.47" waitingTime="30.00" waitingCount="2" stopTime="0.00" timeLoss="46.32" rerouteNo="1" devices="tripinfo_car_n2e_86 routing_car_n2e_86" vType="Car" speedFactor="1.02" vaporized=""/>
    <tripinfo id="car_n2e_94" depart="94.00" departLane="n2sep_1" departPos="3.60" departPosLat="0.00" departSpeed="13.90" departDelay="0.00" arrival="278.00" arrivalLane="c2e_1" arrivalPos="990.00" arrivalPosLat="0.00" arrivalSpeed="14.38" duration="184.00" routeLength="1996.47" waitingTime="23.00" waitingCount="2" stopTime="0.00" timeLoss="44.44" rerouteNo="1" devices="tripinfo_car_n2e_94 routing_car_n2e_94" vType="Car" speedFactor="1.04" vaporized=""/>
    <tripinfo id="car_n2e_137" depart="137.00" departLane="n2sep_1" departPos="3.60" departPosLat="0.00" departSpeed="13.90" departDelay="0.00" arrival="280.00" arrivalLane="c2e_1" arrivalPos="990.00" arrivalPosLat="0.00" arrivalSpeed="15.37" duration="143.00" routeLength="1996.47" waitingTime="0.00" waitingCount="0" stopTime="0.00" timeLoss="16.07" rerouteNo="1" devices="tripinfo_car_n2e_137 routing_car_n2e_137" vType="Car" speedFactor="1.14" vaporized=""/>
    <tripinfo id="car_n2e_159" depart="159.00" departLane="n2sep_1" departPos="3.60" departPosLat="0.00" departSpeed="13.90" departDelay="0.00" arrival="285.00" arrivalLane="c2e_1" arrivalPos="990.00" arrivalPosLat="0.00" arrivalSpeed="16.37" duration="126.00" routeLength="1996.47" waitingTime="0.00" waitingCount="0" stopTime="0.00" timeLoss="3.35" rerouteNo="1" devices="tripinfo_car_n2e_159 routing_car_n2e_159" vType="Car" speedFactor="1.18" vaporized=""/>
    <tripinfo id="car_e2n_147" depart="147.00" departLane="e2sep_1" departPos="3.60" departPosLat="0.00" departSpeed="13.90" departDelay="0.00" arrival="297.00" arrivalLane="c2n_1" arrivalPos="990.00" arrivalPosLat="0.00" arrivalSpeed="15.05" duration="150.00" routeLength="1986.69" waitingTime="5.00" waitingCount="1" stopTime="0.00" timeLoss="16.77" rerouteNo="1" devices="tripinfo_car_e2n_147 routing_car_e2n_147" vType="Car" speedFactor="1.08" vaporized=""/>
    <tripinfo id="car_w2s_103" depart="103.00" departLane="w2sep_1" departPos="3.60" departPosLat="0.00" departSpeed="13.90" departDelay="0.00" arrival="299.00" arrivalLane="c2s_1" arrivalPos="990.00" arrivalPosLat="0.00" arrivalSpeed="14.04" duration="196.00" routeLength="1986.69" waitingTime="43.00" waitingCount="1" stopTime="0.00" timeLoss="53.25" rerouteNo="1" devices="tripinfo_car_w2s_103 routing_car_w2s_103" vType="Car" speedFactor="1.01" vaporized=""/>
    <tripinfo id="car_e2w_112" depart="112.00" departLane="e2sep_1" departPos="3.60" departPosLat="0.00" departSpeed="13.90" departDelay="0.00" arrival="300.00" arrivalLane="c2w_1" arrivalPos="990.00" arrivalPosLat="0.00" arrivalSpeed="13.90" duration="188.00" routeLength="1997.01" waitingTime="34.00" waitingCount="1" stopTime="0.00" timeLoss="43.58" rerouteNo="1" devices="tripinfo_car_e2w_112 routing_car_e2w_112" vType="Car" speedFactor="1.00" vaporized=""/>
    <tripinfo id="car_w2s_109" depart="109.00" departLane="w2sep_1" departPos="3.60" departPosLat="0.00" departSpeed="13.90" departDelay="0.00" arrival="304.00" arrivalLane="c2s_1" arrivalPos="990.00" arrivalPosLat="0.00" arrivalSpeed="13.90" duration="195.00" routeLength="1986.69" waitingTime="38.00" waitingCount="1" stopTime="0.00" timeLoss="50.71" rerouteNo="1" devices="tripinfo_car_w2s_109 routing_car_w2s_109" vType="Car" speedFactor="1.00" vaporized=""/>
    <tripinfo id="car_w2n_150" depart="151.00" departLane="w2sep_1" departPos="3.60" departPosLat="0.00" departSpeed="13.90" departDelay="1.00" arrival="304.00" arrivalLane="c2n_1" arrivalPos="990.00" arrivalPosLat="0.00" arrivalSpeed="14.12" duration="153.00" routeLength="1996.47" waitingTime="0.00" waitingCount="0" stopTime="0.00" timeLoss="10.70" rerouteNo="1" devices="tripinfo_car_w2n_150 routing_car_w2n_150" vType="Car" speedFactor="1.02" vaporized=""/>
    <tripinfo id="car_w2e_137" depart="137.00" departLane="w2sep_1" departPos="3.60" departPosLat="0.00" departSpeed="13.90" departDelay="0.00" arrival="307.00" arrivalLane="c2e_1" arrivalPos="990.00" arrivalPosLat="0.00" arrivalSpeed="13.90" duration="170.00" routeLength="1997.01" waitingTime="13.00" waitingCount="1" stopTime="0.00" timeLoss="26.17" rerouteNo="1" devices="tripinfo_car_w2e_137 routing_car_w2e_137" vType="Car" speedFactor="1.00" vaporized=""/>
    <tripinfo id="car_w2s_128" depart="128.00" departLane="w2sep_1" departPos="3.60" departPosLat="0.00" departSpeed="13.90" departDelay="0.00" arrival="308.00" arrivalLane="c2s_1" arrivalPos="990.00" arrivalPosLat="0.00" arrivalSpeed="13.89" duration="180.00" routeLength="1986.69" waitingTime="21.00" waitingCount="1" stopTime="0.00" timeLoss="35.68" rerouteNo="1" devices="tripinfo_car_w2s_128 routing_car_w2s_128" vType="Car" speedFactor="1.00" vaporized=""/>
    <tripinfo id="car_w2e_147" depart="147.00" departLane="w2sep_1" departPos="3.60" departPosLat="0.00" departSpeed="13.90" departDelay="0.00" arrival="309.00" arrivalLane="c2e_1" arrivalPos="990.00" arrivalPosLat="0.00" arrivalSpeed="15.23" duration="162.00" routeLength="1997.01" waitingTime="12.00" waitingCount="1" stopTime="0.00" timeLoss="34.91" rerouteNo="1" devices="tripinfo_car_w2e_147 routing_car_w2e_147" vType="Car" speedFactor="1.13" vaporized=""/>
    <tripinfo id="car_w2s_149" depart="149.00" departLane="w2sep_1" departPos="3.60" departPosLat="0.00" departSpeed="13.90" departDelay="0.00" arrival="310.00" arrivalLane="c2s_1" arrivalPos="990.00" arrivalPosLat="0.00" arrivalSpeed="15.06" duration="161.00" routeLength="1986.69" waitingTime="9.00" waitingCount="1" stopTime="0.00" timeLoss="31.99" rerouteNo="1" devices="tripinfo_car_w2s_149 routing_car_w2s_149" vType="Car" speedFactor="1.12" vaporized=""/>
    <tripinfo id="car_w2s_154" depart="154.00" departLane="w2sep_1" departPos="3.60" departPosLat="0.00" departSpeed="13.90" departDelay="0.00" arrival="316.00" arrivalLane="c2s_1" arrivalPos="990.00" arrivalPosLat="0.00" arrivalSpeed="13.90" duration="162.00" routeLength="1986.69" waitingTime="0.00" waitingCount="0" stopTime="0.00" timeLoss="17.99" rerouteNo="1" devices="tripinfo_car_w2s_154 routing_car_w2s_154" vType="Car" speedFactor="1.00" vaporized=""/>
    <tripinfo id="car_w2s_166" depart="166.00" departLane="w2sep_1" departPos="3.60" departPosLat="0.00" departSpeed="13.90" departDelay="0.00" arrival="319.00" arrivalLane="c2s_1" arrivalPos="990.00" arrivalPosLat="0.00" arrivalSpeed="14.39" duration="153.00" routeLength="1986.69" waitingTime="0.00" waitingCount="0" stopTime="0.00" timeLoss="14.24" rerouteNo="1" devices="tripinfo_car_w2s_166 routing_car_w2s_166" vType="Car" speedFactor="1.04" vaporized=""/>
    <tripinfo id="car_e2s_117" depart="117.00" departLane="e2sep_1" departPos="3.60" departPosLat="0.00" departSpeed="13.90" departDelay="0.00" arrival="323.00" arrivalLane="c2s_1" arrivalPos="990.00" arrivalPosLat="0.00" arrivalSpeed="13.89" duration="206.00" routeLength="1996.47" waitingTime="42.00" waitingCount="2" stopTime="0.00" timeLoss="61.40" rerouteNo="1" devices="tripinfo_car_e2s_117 routing_car_e2s_117" vType="Car" speedFactor="1.00" vaporized=""/>
    <tripinfo id="car_e2s_126" depart="126.00" departLane="e2sep_1" departPos="3.60" departPosLat="0.00" departSpeed="13.90" departDelay="0.00" arrival="326.00" arrivalLane="c2s_1" arrivalPos="990.00" arrivalPosLat="0.00" arrivalSpeed="13.90" duration="200.00" routeLength="1996.47" waitingTime="33.00" waitingCount="2" stopTime="0.00" timeLoss="56.05" rerouteNo="1" devices="tripinfo_car_e2s_126 routing_car_e2s_126" vType="Car" speedFactor="1.00" vaporized=""/>
    <tripinfo id="car_e2s_164" depart="164.00" departLane="e2sep_1" departPos="3.60" departPosLat="0.00" departSpeed="13.90" departDelay="0.00" arrival="328.00" arrivalLane="c2s_1" arrivalPos="990.00" arrivalPosLat="0.00" arrivalSpeed="15.46" duration="164.00" routeLength="1996.47" waitingTime="12.00" waitingCount="1" stopTime="0.00" timeLoss="40.62" rerouteNo="1" devices="tripinfo_car_e2s_164 routing_car_e2s_164" vType="Car" speedFactor="1.17" vaporized=""/>
    <tripinfo id="car_e2n_181" depart="181.00" departLane="e2sep_1" departPos="3.60" departPosLat="0.00" departSpeed="13.90" departDelay="0.00" arrival="330.00" arrivalLane="c2n_1" arrivalPos="990.00" arrivalPosLat="0.00" arrivalSpeed="13.90" duration="149.00" routeLength="1986.69" waitingTime="0.00" waitingCount="0" stopTime="0.00" timeLoss="5.24" rerouteNo="1" devices="tripinfo_car_e2n_181 routing_car_e2n_181" vType="Car" speedFactor="1.00" vaporized=""/>
    <tripinfo id="car_e2s_178" depart="178.00" departLane="e2sep_1" departPos="3.60" departPosLat="0.00" departSpeed="13.90" departDelay="0.00" arrival="331.00" arrivalLane="c2s_1" arrivalPos="990.00" arrivalPosLat="0.00" arrivalSpeed="14.11" duration="153.00" routeLength="1996.47" waitingTime="0.00" waitingCount="0" stopTime="0.00" timeLoss="11.02" rerouteNo="1" devices="tripinfo_car_e2s_178 routing_car_e2s_178" vType="Car" speedFactor="1.02" vaporized=""/>
    <tripinfo id="car_w2n_193" depart="193.00" departLane="w2sep_1" departPos="3.60" departPosLat="0.00" departSpeed="13.90" departDelay="0.00" arrival="339.00" arrivalLane="c2n_1" arrivalPos="990.00" arrivalPosLat="0.00" arrivalSpeed="14.00" duration="146.00" routeLength="1996.47" waitingTime="0.00" waitingCount="0" stopTime="0.00" timeLoss="2.76" rerouteNo="1" devices="tripinfo_car_w2n_193 routing_car_w2n_193" vType="Car" speedFactor="1.01" vaporized=""/>
    <tripinfo id="car_s2n_159" depart="159.00" departLane="s2sep_1" departPos="3.60" departPosLat="0.00" departSpeed="13.90" departDelay="0.00" arrival="341.00" arrivalLane="c2n_1" arrivalPos="990.00" arrivalPosLat="0.00" arrivalSpeed="15.49" duration="182.00" routeLength="1997.01" waitingTime="42.00" waitingCount="1" stopTime="0.00" timeLoss="57.52" rerouteNo="1" devices="tripinfo_car_s2n_159 routing_car_s2n_159" vType="Car" speedFactor="1.15" vaporized=""/>
    <tripinfo id="car_s2e_145" depart="145.00" departLane="s2sep_1" departPos="3.60" departPosLat="0.00" departSpeed="13.90" departDelay="0.00" arrival="343.00" arrivalLane="c2e_1" arrivalPos="990.00" arrivalPosLat="0.00" arrivalSpeed="14.23" duration="198.00" routeLength="1986.69" waitingTime="47.00" waitingCount="1" stopTime="0.00" timeLoss="57.21" rerouteNo="1" devices="tripinfo_car_s2e_145 routing_car_s2e_145" vType="Car" speedFactor="1.02" vaporized=""/>
    <tripinfo id="car_n2s_163" depart="163.00" departLane="n2sep_1" departPos="3.60" departPosLat="0.00" departSpeed="13.90" departDelay="0.00" arrival="344.00" arrivalLane="c2s_1" arrivalPos="990.00" arrivalPosLat="0.00" arrivalSpeed="13.97" duration="181.00" routeLength="1997.01" waitingTime="28.00" waitingCount="1" stopTime="0.00" timeLoss="38.06" rerouteNo="1" devices="tripinfo_car_n2s_163 routing_car_n2s_163" vType="Car" speedFactor="1.01" vaporized=""/>
    <tripinfo id="car_n2w_171" depart="171.00" departLane="n2sep_1" departPos="3.60" departPosLat="0.00" departSpeed="13.90" departDelay="0.00" arrival="346.00" arrivalLane="c2w_1" arrivalPos="990.00" arrivalPosLat="0.00" arrivalSpeed="14.21" duration="175.00" routeLength="1986.69" waitingTime="22.00" waitingCount="1" stopTime="0.00" timeLoss="33.73" rerouteNo="1" devices="tripinfo_car_n2w_171 routing_car_n2w_171" vType="Car" speedFactor="1.02" vaporized=""/>
    <tripinfo id="car_n2w_173" depart="173.00" departLane="n2sep_1" departPos="3.60" departPosLat="0.00" departSpeed="13.90" departDelay="0.00" arrival="350.00" arrivalLane="c2w_1" arrivalPos="990.00" arrivalPosLat="0.00" arrivalSpeed="14.21" duration="177.00" routeLength="1986.69" waitingTime="20.00" waitingCount="1" stopTime="0.00" timeLoss="36.54" rerouteNo="1" devices="tripinfo_car_n2w_173 routing_car_n2w_173" vType="Car" speedFactor="1.02" vaporized=""/>
    <tripinfo id="car_s2e_177" depart="177.00" departLane="s2sep_1" departPos="3.60" departPosLat="0.00" departSpeed="13.90" departDelay="0.00" arrival="351.00" arrivalLane="c2e_1" arrivalPos="990.00" arrivalPosLat="0.00" arrivalSpeed="13.90" duration="174.00" routeLength="1986.69" waitingTime="17.00" waitingCount="1" stopTime="0.00" timeLoss="29.71" rerouteNo="1" devices="tripinfo_car_s2e_177 routing_car_s2e_177" vType="Car" speedFactor="1.00" vaporized=""/>
    <tripinfo id="car_n2w_183" depart="183.00" departLane="n2sep_1" departPos="3.60" departPosLat="0.00" departSpeed="13.90" departDelay="0.00" arrival="352.00" arrivalLane="c2w_1" arrivalPos="990.00" arrivalPosLat="0.00" arrivalSpeed="15.69" duration="169.00" routeLength="1986.69" waitingTime="20.00" waitingCount="1" stopTime="0.00" timeLoss="47.04" rerouteNo="1" devices="tripinfo_car_n2w_183 routing_car_n2w_183" vType="Car" speedFactor="1.18" vaporized=""/>
    <tripinfo id="car_s2e_178" depart="179.00" departLane="s2sep_1" departPos="3.60" departPosLat="0.00" departSpeed="13.90" departDelay="1.00" arrival="353.00" arrivalLane="c2e_1" arrivalPos="990.00" arrivalPosLat="0.00" arrivalSpeed="14.49" duration="174.00" routeLength="1986.69" waitingTime="16.00" waitingCount="1" stopTime="0.00" timeLoss="38.05" rerouteNo="1" devices="tripinfo_car_s2e_178 routing_car_s2e_178" vType="Car" speedFactor="1.06" vaporized=""/>
    <tripinfo id="car_n2w_192" depart="192.00" departLane="n2sep_1" departPos="3.60" departPosLat="0.00" departSpeed="13.90" departDelay="0.00" arrival="355.00" arrivalLane="c2w_1" arrivalPos="990.00" arrivalPosLat="0.00" arrivalSpeed="15.18" duration="163.00" routeLength="1986.69" waitingTime="10.00" waitingCount="1" stopTime="0.00" timeLoss="31.66" rerouteNo="1" devices="tripinfo_car_n2w_192 routing_car_n2w_192" vType="Car" speedFactor="1.10" vaporized=""/>
    <tripinfo id="car_s2e_191" depart="191.00" departLane="s2sep_1" departPos="3.60" departPosLat="0.00" departSpeed="13.90" departDelay="0.00" arrival="357.00" arrivalLane="c2e_1" arrivalPos="990.00" arrivalPosLat="0.00" arrivalSpeed="14.33" duration="166.00" routeLength="1986.69" waitingTime="7.00" waitingCount="1" stopTime="0.00" timeLoss="26.07" rerouteNo="1" devices="tripinfo_car_s2e_191 routing_car_s2e_191" vType="Car" speedFactor="1.03" vaporized=""/>
    <tripinfo id="car_n2w_206" depart="206.00" departLane="n2sep_1" departPos="3.60" departPosLat="0.00" departSpeed="13.90" departDelay="0.00" arrival="357.00" arrivalLane="c2w_1" arrivalPos="990.00" arrivalPosLat="0.00" arrivalSpeed="15.51" duration="151.00" routeLength="1986.69" waitingTime="0.00" waitingCount="0" stopTime="0.00" timeLoss="24.96" rerouteNo="1" devices="tripinfo_car_n2w_206 routing_car_n2w_206" vType="Car" speedFactor="1.15" vaporized=""/>
    <tripinfo id="car_s2e_201" depart="201.00" departLane="s2sep_1" departPos="3.60" departPosLat="0.00" departSpeed="13.90" departDelay="0.00" arrival="361.00" arrivalLane="c2e_1" arrivalPos="990.00" arrivalPosLat="0.00" arrivalSpeed="13.89" duration="160.00" routeLength="1986.69" waitingTime="0.00" waitingCount="0" stopTime="0.00" timeLoss="15.96" rerouteNo="1" devices="tripinfo_car_s2e_201 routing_car_s2e_201" vType="Car" speedFactor="1.00" vaporized=""/>
    <tripinfo id="car_n2w_223" depart="223.00" departLane="n2sep_1" departPos="3.60" departPosLat="0.00" departSpeed="13.90" departDelay="0.00" arrival="361.00" arrivalLane="c2w_1" arrivalPos="990.00" arrivalPosLat="0.00" arrivalSpeed="15.16" duration="138.00" routeLength="1986.69" waitingTime="0.00" waitingCount="0" stopTime="0.00" timeLoss="6.20" rerouteNo="1" devices="tripinfo_car_n2w_223 routing_car_n2w_223" vType="Car" speedFactor="1.09" vaporized=""/>
    <tripinfo id="car_n2e_202" depart="202.00" departLane="n2sep_1" departPos="3.60" departPosLat="0.00" departSpeed="13.90" departDelay="0.00" arrival="364.00" arrivalLane="c2e_1" arrivalPos="990.00" arrivalPosLat="0.00" arrivalSpeed="14.08" duration="162.00" routeLength="1996.47" waitingTime="5.00" waitingCount="1" stopTime="0.00" timeLoss="20.07" rerouteNo="1" devices="tripinfo_car_n2e_202 routing_car_n2e_202" vType="Car" speedFactor="1.02" vaporized=""/>
    <tripinfo id="car_n2e_215" depart="215.00" departLane="n2sep_1" departPos="3.60" departPosLat="0.00" departSpeed="13.90" departDelay="0.00" arrival="368.00" arrivalLane="c2e_1" arrivalPos="990.00" arrivalPosLat="0.00" arrivalSpeed="13.98" duration="153.00" routeLength="1996.47" waitingTime="0.00" waitingCount="0" stopTime="0.00" timeLoss="8.83" rerouteNo="1" devices="tripinfo_car_n2e_215 routing_car_n2e_215" vType="Car" speedFactor="1.01" vaporized=""/>
    <tripinfo id="car_n2s_229" depart="229.00" departLane="n2sep_1" departPos="3.60" departPosLat="0.00" departSpeed="13.90" departDelay="0.00" arrival="369.00" arrivalLane="c2s_1" arrivalPos="990.00" arrivalPosLat="0.00" arrivalSpeed="14.42" duration="140.00" routeLength="1997.01" waitingTime="0.00" waitingCount="0" stopTime="0.00" timeLoss="1.12" rerouteNo="1" devices="tripinfo_car_n2s_229 routing_car_n2s_229" vType="Car" speedFactor="1.04" vaporized=""/>
    <tripinfo id="car_s2w_207" depart="207.00" departLane="s2sep_1" departPos="3.60" departPosLat="0.00" departSpeed="13.90" departDelay="0.00" arrival="370.00" arrivalLane="c2w_1" arrivalPos="990.00" arrivalPosLat="0.00" arrivalSpeed="13.90" duration="163.00" routeLength="1996.47" waitingTime="8.00" waitingCount="1" stopTime="0.00" timeLoss="17.97" rerouteNo="1" devices="tripinfo_car_s2w_207 routing_car_s2w_207" vType="Car" speedFactor="1.00" vaporized=""/>
    <tripinfo id="car_s2w_244" depart="244.00" departLane="s2sep_1" departPos="3.60" departPosLat="0.00" departSpeed="13.90" departDelay="0.00" arrival="379.00" arrivalLane="c2w_1" arrivalPos="990.00" arrivalPosLat="0.00" arrivalSpeed="15.25" duration="135.00" routeLength="1996.47" waitingTime="0.00" waitingCount="0" stopTime="0.00" timeLoss="2.76" rerouteNo="1" devices="tripinfo_car_s2w_244 routing_car_s2w_244" vType="Car" speedFactor="1.10" vaporized=""/>
    <tripinfo id="car_e2w_197" depart="197.00" departLane="e2sep_1" departPos="3.60" departPosLat="0.00" departSpeed="13.90" departDelay="0.00" arrival="385.00" arrivalLane="c2w_1" arrivalPos="990.00" arrivalPosLat="0.00" arrivalSpeed="15.11" duration="188.00" routeLength="1997.01" waitingTime="44.00" waitingCount="1" stopTime="0.00" timeLoss="55.18" rerouteNo="1" devices="tripinfo_car_e2w_197 routing_car_e2w_197" vType="Car" speedFactor="1.09" vaporized=""/>
    <tripinfo id="car_w2e_215" depart="215.00" departLane="w2sep_1" departPos="3.60" departPosLat="0.00" departSpeed="13.90" departDelay="0.00" arrival="387.00" arrivalLane="c2e_1" arrivalPos="990.00" arrivalPosLat="0.00" arrivalSpeed="14.49" duration="172.00" routeLength="1997.01" waitingTime="23.00" waitingCount="1" stopTime="0.00" timeLoss="33.65" rerouteNo="1" devices="tripinfo_car_w2e_215 routing_car_w2e_215" vType="Car" speedFactor="1.04" vaporized=""/>
    <tripinfo id="car_w2e_230" depart="230.00" departLane="w2sep_1" departPos="3.60" departPosLat="0.00" departSpeed="13.90" departDelay="0.00" arrival="390.00" arrivalLane="c2e_1" arrivalPos="990.00" arrivalPosLat="0.00" arrivalSpeed="15.10" duration="160.00" routeLength="1997.01" waitingTime="14.00" waitingCount="1" stopTime="0.00" timeLoss="28.11" rerouteNo="1" devices="tripinfo_car_w2e_230 routing_car_w2e_230" vType="Car" speedFactor="1.09" vaporized=""/>
    <tripinfo id="car_e2w_200" depart="200.00" departLane="e2sep_1" departPos="3.60" departPosLat="0.00" departSpeed="13.90" departDelay="0.00" arrival="391.00" arrivalLane="c2w_1" arrivalPos="990.00" arrivalPosLat="0.00" arrivalSpeed="14.38" duration="191.00" routeLength="1997.01" waitingTime="39.00" waitingCount="1" stopTime="0.00" timeLoss="51.58" rerouteNo="1" devices="tripinfo_car_e2w_200 routing_car_e2w_200" vType="Car" speedFactor="1.03" vaporized=""/>
    <tripinfo id="car_w2s_223" depart="223.00" departLane="w2sep_1" departPos="3.60" departPosLat="0.00" departSpeed="13.90" departDelay="0.00" arrival="391.00" arrivalLane="c2s_1" arrivalPos="990.00" arrivalPosLat="0.00" arrivalSpeed="14.13" duration="168.00" routeLength="1986.69" waitingTime="15.00" waitingCount="1" stopTime="0.00" timeLoss="26.38" rerouteNo="1" devices="tripinfo_car_w2s_223 routing_car_w2s_223" vType="Car" speedFactor="1.02" vaporized=""/>
    <tripinfo id="car_e2n_203" depart="203.00" departLane="e2sep_1" departPos="3.60" departPosLat="0.00" departSpeed="13.90" departDelay="0.00" arrival="393.00" arrivalLane="c2n_1" arrivalPos="990.00" arrivalPosLat="0.00" arrivalSpeed="14.32" duration="190.00" routeLength="1986.69" waitingTime="36.00" waitingCount="1" stopTime="0.00" timeLoss="50.16" rerouteNo="1" devices="tripinfo_car_e2n_203 routing_car_e2n_203" vType="Car" speedFactor="1.03" vaporized=""/>
    <tripinfo id="car_e2w_214" depart="214.00" departLane="e2sep_1" departPos="3.60" departPosLat="0.00" departSpeed="13.90" departDelay="0.00" arrival="398.00" arrivalLane="c2w_1" arrivalPos="990.00" arrivalPosLat="0.00" arrivalSpeed="13.92" duration="184.00" routeLength="1997.01" waitingTime="26.00" waitingCount="1" stopTime="0.00" timeLoss="39.98" rerouteNo="1" devices="tripinfo_car_e2w_214 routing_car_e2w_214" vType="Car" speedFactor="1.00" vaporized=""/>
    <tripinfo id="car_e2n_238" depart="238.00" departLane="e2sep_1" departPos="3.60" departPosLat="0.00" departSpeed="13.90" departDelay="0.00" arrival="398.00" arrivalLane="c2n_1" arrivalPos="990.00" arrivalPosLat="0.00" arrivalSpeed="14.68" duration="160.00" routeLength="1986.69" waitingTime="7.00" waitingCount="1" stopTime="0.00" timeLoss="23.30" rerouteNo="1" devices="tripinfo_car_e2n_238 routing_car_e2n_238" vType="Car" speedFactor="1.06" vaporized=""/>
    <tripinfo id="bus_w2s_241" depart="241.00" departLane="w2sep_1" departPos="12.10" departPosLat="0.00" departSpeed="13.90" departDelay="0.00" arrival="400.00" arrivalLane="c2s_1" arrivalPos="990.00" arrivalPosLat="0.00" arrivalSpeed="13.90" duration="159.00" routeLength="1978.19" waitingTime="0.00" waitingCount="0" stopTime="0.00" timeLoss="15.97" rerouteNo="1" devices="tripinfo_bus_w2s_241 routing_bus_w2s_241" vType="Bus" speedFactor="1.00" vaporized=""/>
    <tripinfo id="car_e2n_244" depart="246.00" departLane="e2sep_1" departPos="3.60" departPosLat="0.00" departSpeed="13.90" departDelay="2.00" arrival="400.00" arrivalLane="c2n_1" arrivalPos="990.00" arrivalPosLat="0.00" arrivalSpeed="15.36" duration="154.00" routeLength="1986.69" waitingTime="1.00" waitingCount="1" stopTime="0.00" timeLoss="25.82" rerouteNo="1" devices="tripinfo_car_e2n_244 routing_car_e2n_244" vType="Car" speedFactor="1.12" vaporized=""/>
    <tripinfo id="car_w2e_251" depart="251.00" departLane="w2sep_1" departPos="3.60" departPosLat="0.00" departSpeed="13.90" departDelay="0.00" arrival="402.00" arrivalLane="c2e_1" arrivalPos="990.00" arrivalPosLat="0.00" arrivalSpeed="13.90" duration="151.00" routeLength="1997.01" waitingTime="0.00" waitingCount="0" stopTime="0.00" timeLoss="6.44" rerouteNo="1" devices="tripinfo_car_w2e_251 routing_car_w2e_251" vType="Car" speedFactor="1.00" vaporized=""/>
    <tripinfo id="car_e2w_241" depart="241.00" departLane="e2sep_1" departPos="3.60" departPosLat="0.00" departSpeed="13.90" departDelay="0.00" arrival="403.00" arrivalLane="c2w_1" arrivalPos="990.00" arrivalPosLat="0.00" arrivalSpeed="14.03" duration="162.00" routeLength="1997.01" waitingTime="2.00" waitingCount="1" stopTime="0.00" timeLoss="18.99" rerouteNo="1" devices="tripinfo_car_e2w_241 routing_car_e2w_241" vType="Car" speedFactor="1.01" vaporized=""/>
    <tripinfo id="car_e2s_220" depart="220.00" departLane="e2sep_1" departPos="3.60" departPosLat="0.00" departSpeed="13.90" departDelay="0.00" arrival="405.00" arrivalLane="c2s_1" arrivalPos="990.00" arrivalPosLat="0.00" arrivalSpeed="14.20" duration="185.00" routeLength="1996.47" waitingTime="25.00" waitingCount="2" stopTime="0.00" timeLoss="43.05" rerouteNo="1" devices="tripinfo_car_e2s_220 routing_car_e2s_220" vType="Car" speedFactor="1.02" vaporized=""/>
    <tripinfo id="car_e2n_253" depart="253.00" departLane="e2sep_1" departPos="3.60" departPosLat="0.00" departSpeed="13.90" departDelay="0.00" arrival="405.00" arrivalLane="c2n_1" arrivalPos="990.00" arrivalPosLat="0.00" arrivalSpeed="14.91" duration="152.00" routeLength="1986.69" waitingTime="0.00" waitingCount="0" stopTime="0.00" timeLoss="17.62" rerouteNo="1" devices="tripinfo_car_e2n_253 routing_car_e2n_253" vType="Car" speedFactor="1.07" vaporized=""/>
    <tripinfo id="car_e2w_270" depart="270.00" departLane="e2sep_1" departPos="3.60" departPosLat="0.00" departSpeed="13.90" departDelay="0.00" arrival="406.00" arrivalLane="c2w_1" arrivalPos="990.00" arrivalPosLat="0.00" arrivalSpeed="15.17" duration="136.00" routeLength="1997.01" waitingTime="0.00" waitingCount="0" stopTime="0.00" timeLoss="4.30" rerouteNo="1" devices="tripinfo_car_e2w_270 routing_car_e2w_270" vType="Car" speedFactor="1.10" vaporized=""/>
    <tripinfo id="car_e2s_229" depart="229.00" departLane="e2sep_1" departPos="3.60" departPosLat="0.00" departSpeed="13.90" departDelay="0.00" arrival="408.00" arrivalLane="c2s_1" arrivalPos="990.00" arrivalPosLat="0.00" arrivalSpeed="14.44" duration="179.00" routeLength="1996.47" waitingTime="18.00" waitingCount="2" stopTime="0.00" timeLoss="39.93" rerouteNo="1" devices="tripinfo_car_e2s_229 routing_car_e2s_229" vType="Car" speedFactor="1.04" vaporized=""/>
    <tripinfo id="car_w2n_245" depart="245.00" departLane="w2sep_1" departPos="3.60" departPosLat="0.00" departSpeed="13.90" departDelay="0.00" arrival="410.00" arrivalLane="c2n_1" arrivalPos="990.00" arrivalPosLat="0.00" arrivalSpeed="14.80" duration="165.00" routeLength="1996.47" waitingTime="17.00" waitingCount="1" stopTime="0.00" timeLoss="28.89" rerouteNo="1" devices="tripinfo_car_w2n_245 routing_car_w2n_245" vType="Car" speedFactor="1.07" vaporized=""/>
    <tripinfo id="bus_e2s_241" depart="244.00" departLane="e2sep_1" departPos="12.10" departPosLat="0.00" departSpeed="13.90" departDelay="3.00" arrival="413.00" arrivalLane="c2s_1" arrivalPos="990.00" arrivalPosLat="0.00" arrivalSpeed="13.87" duration="169.00" routeLength="1987.97" waitingTime="5.00" waitingCount="2" stopTime="0.00" timeLoss="24.92" rerouteNo="1" devices="tripinfo_bus_e2s_241 routing_bus_e2s_241" vType="Bus" speedFactor="1.00" vaporized=""/>
    <tripinfo id="car_e2s_267" depart="267.00" departLane="e2sep_1" departPos="3.60" departPosLat="0.00" departSpeed="13.90" departDelay="0.00" arrival="417.00" arrivalLane="c2s_1" arrivalPos="990.00" arrivalPosLat="0.00" arrivalSpeed="14.11" duration="150.00" routeLength="1996.47" waitingTime="0.00" waitingCount="0" stopTime="0.00" timeLoss="7.55" rerouteNo="1" devices="tripinfo_car_e2s_267 routing_car_e2s_267" vType="Car" speedFactor="1.02" vaporized=""/>
    <tripinfo id="car_e2s_272" depart="272.00" departLane="e2sep_1" departPos="3.60" departPosLat="0.00" departSpeed="13.90" departDelay="0.00" arrival="422.00" arrivalLane="c2s_1" arrivalPos="990.00" arrivalPosLat="0.00" arrivalSpeed="14.02" duration="150.00" routeLength="1996.47" waitingTime="0.00" waitingCount="0" stopTime="0.00" timeLoss="6.32" rerouteNo="1" devices="tripinfo_car_e2s_272 routing_car_e2s_272" vType="Car" speedFactor="1.01" vaporized=""/>
    <tripinfo id="bus_w2n_271" depart="271.00" departLane="w2sep_1" departPos="12.10" departPosLat="0.00" departSpeed="13.90" departDelay="0.00" arrival="423.00" arrivalLane="c2n_1" arrivalPos="990.00" arrivalPosLat="0.00" arrivalSpeed="13.90" duration="152.00" routeLength="1987.97" waitingTime="0.00" waitingCount="0" stopTime="0.00" timeLoss="7.63" rerouteNo="1" devices="tripinfo_bus_w2n_271 routing_bus_w2n_271" vType="Bus" speedFactor="1.00" vaporized=""/>
    <tripinfo id="car_w2n_276" depart="276.00" departLane="w2sep_1" departPos="3.60" departPosLat="0.00" departSpeed="13.90" departDelay="0.00" arrival="426.00" arrivalLane="c2n_1" arrivalPos="990.00" arrivalPosLat="0.00" arrivalSpeed="15.07" duration="150.00" routeLength="1996.47" waitingTime="0.00" waitingCount="0" stopTime="0.00" timeLoss="17.50" rerouteNo="1" devices="tripinfo_car_w2n_276 routing_car_w2n_276" vType="Car" speedFactor="1.10" vaporized=""/>
    <tripinfo id="car_n2w_244" depart="244.00" departLane="n2sep_1" departPos="3.60" departPosLat="0.00" departSpeed="13.90" departDelay="0.00" arrival="429.00" arrivalLane="c2w_1" arrivalPos="990.00" arrivalPosLat="0.00" arrivalSpeed="15.12" duration="185.00" routeLength="1986.69" waitingTime="42.00" waitingCount="1" stopTime="0.00" timeLoss="52.52" rerouteNo="1" devices="tripinfo_car_n2w_244 routing_car_n2w_244" vType="Car" speedFactor="1.09" vaporized=""/>
    <tripinfo id="car_e2s_283" depart="283.00" departLane="e2sep_1" departPos="3.60" departPosLat="0.00" departSpeed="13.90" departDelay="0.00" arrival="430.00" arrivalLane="c2s_1" arrivalPos="990.00" arrivalPosLat="0.00" arrivalSpeed="13.96" duration="147.00" routeLength="1996.47" waitingTime="0.00" waitingCount="0" stopTime="0.00" timeLoss="2.81" rerouteNo="1" devices="tripinfo_car_e2s_283 routing_car_e2s_283" vType="Car" speedFactor="1.00" vaporized=""/>
    <tripinfo id="car_s2e_246" depart="246.00" departLane="s2sep_1" departPos="3.60" departPosLat="0.00" departSpeed="13.90" departDelay="0.00" arrival="434.00" arrivalLane="c2e_1" arrivalPos="990.00" arrivalPosLat="0.00" arrivalSpeed="13.90" duration="188.00" routeLength="1986.69" waitingTime="34.00" waitingCount="1" stopTime="0.00" timeLoss="44.51" rerouteNo="1" devices="tripinfo_car_s2e_246 routing_car_s2e_246" vType="Car" speedFactor="1.00" vaporized=""/>
    <tripinfo id="car_n2s_259" depart="259.00" departLane="n2sep_1" departPos="3.60" departPosLat="0.00" departSpeed="13.90" departDelay="0.00" arrival="437.00" arrivalLane="c2s_1" arrivalPos="990.00" arrivalPosLat="0.00" arrivalSpeed="14.38" duration="178.00" routeLength="1997.01" waitingTime="27.00" waitingCount="1" stopTime="0.00" timeLoss="38.94" rerouteNo="1" devices="tripinfo_car_n2s_259 routing_car_n2s_259" vType="Car" speedFactor="1.03" vaporized=""/>
    <tripinfo id="car_n2w_250" depart="250.00" departLane="n2sep_1" departPos="3.60" departPosLat="0.00" departSpeed="13.90" departDelay="0.00" arrival="438.00" arrivalLane="c2w_1" arrivalPos="990.00" arrivalPosLat="0.00" arrivalSpeed="13.90" duration="188.00" routeLength="1986.69" waitingTime="32.00" waitingCount="1" stopTime="0.00" timeLoss="43.76" rerouteNo="1" devices="tripinfo_car_n2w_250 routing_car_n2w_250" vType="Car" speedFactor="1.00" vaporized=""/>
    <tripinfo id="car_s2n_258" depart="258.00" departLane="s2sep_1" departPos="3.60" departPosLat="0.00" departSpeed="13.90" departDelay="0.00" arrival="438.00" arrivalLane="c2n_1" arrivalPos="990.00" arrivalPosLat="0.00" arrivalSpeed="14.09" duration="180.00" routeLength="1997.01" waitingTime="26.00" waitingCount="1" stopTime="0.00" timeLoss="38.26" rerouteNo="1" devices="tripinfo_car_s2n_258 routing_car_s2n_258" vType="Car" speedFactor="1.01" vaporized=""/>
    <tripinfo id="car_s2e_251" depart="251.00" departLane="s2sep_1" departPos="3.60" departPosLat="0.00" departSpeed="13.90" departDelay="0.00" arrival="439.00" arrivalLane="c2e_1" arrivalPos="990.00" arrivalPosLat="0.00" arrivalSpeed="13.90" duration="188.00" routeLength="1986.69" waitingTime="31.00" waitingCount="1" stopTime="0.00" timeLoss="43.94" rerouteNo="1" devices="tripinfo_car_s2e_251 routing_car_s2e_251" vType="Car" speedFactor="1.00" vaporized=""/>
    <tripinfo id="car_n2w_261" depart="261.00" departLane="n2sep_1" departPos="3.60" departPosLat="0.00" departSpeed="13.90" departDelay="0.00" arrival="441.00" arrivalLane="c2w_1" arrivalPos="990.00" arrivalPosLat="0.00" arrivalSpeed="14.71" duration="180.00" routeLength="1986.69" waitingTime="25.00" waitingCount="1" stopTime="0.00" timeLoss="44.30" rerouteNo="1" devices="tripinfo_car_n2w_261 routing_car_n2w_261" vType="Car" speedFactor="1.06" vaporized=""/>
    <tripinfo id="car_s2e_266" depart="266.00" departLane="s2sep_1" departPos="3.60" departPosLat="0.00" departSpeed="13.90" departDelay="0.00" arrival="441.00" arrivalLane="c2e_1" arrivalPos="990.00" arrivalPosLat="0.00" arrivalSpeed="15.50" duration="175.00" routeLength="1986.69" waitingTime="26.00" waitingCount="1" stopTime="0.00" timeLoss="51.51" rerouteNo="1" devices="tripinfo_car_s2e_266 routing_car_s2e_266" vType="Car" speedFactor="1.17" vaporized=""/>
    <tripinfo id="car_s2n_294" depart="294.00" departLane="s2sep_1" departPos="3.60" departPosLat="0.00" departSpeed="13.90" departDelay="0.00" arrival="443.00" arrivalLane="c2n_1" arrivalPos="990.00" arrivalPosLat="0.00" arrivalSpeed="14.34" duration="149.00" routeLength="1997.01" waitingTime="0.00" waitingCount="0" stopTime="0.00" timeLoss="9.45" rerouteNo="1" devices="tripinfo_car_s2n_294 routing_car_s2n_294" vType="Car" speedFactor="1.03" vaporized=""/>
    <tripinfo id="car_n2s_264" depart="264.00" departLane="n2sep_1" departPos="3.60" departPosLat="0.00" departSpeed="13.90" departDelay="0.00" arrival="445.00" arrivalLane="c2s_1" arrivalPos="990.00" arrivalPosLat="0.00" arrivalSpeed="13.90" duration="181.00" routeLength="1997.01" waitingTime="21.00" waitingCount="1" stopTime="0.00" timeLoss="36.60" rerouteNo="1" devices="tripinfo_car_n2s_264 routing_car_n2s_264" vType="Car" speedFactor="1.00" vaporized=""/>
    <tripinfo id="car_n2w_288" depart="288.00" departLane="n2sep_1" departPos="3.60" departPosLat="0.00" departSpeed="13.90" departDelay="0.00" arrival="448.00" arrivalLane="c2w_1" arrivalPos="990.00" arrivalPosLat="0.00" arrivalSpeed="13.90" duration="160.00" routeLength="1986.69" waitingTime="0.00" waitingCount="0" stopTime="0.00" timeLoss="15.72" rerouteNo="1" devices="tripinfo_car_n2w_288 routing_car_n2w_288" vType="Car" speedFactor="1.00" vaporized=""/>
    <tripinfo id="car_s2w_275" depart="275.00" departLane="s2sep_1" departPos="3.60" departPosLat="0.00" departSpeed="13.90" departDelay="0.00" arrival="450.00" arrivalLane="c2w_1" arrivalPos="990.00" arrivalPosLat="0.00" arrivalSpeed="14.89" duration="175.00" routeLength="1996.47" waitingTime="19.00" waitingCount="2" stopTime="0.00" timeLoss="43.05" rerouteNo="1" devices="tripinfo_car_s2w_275 routing_car_s2w_275" vType="Car" speedFactor="1.10" vaporized=""/>
    <tripinfo id="car_s2e_303" depart="303.00" departLane="s2sep_1" departPos="3.60" departPosLat="0.00" departSpeed="13.90" departDelay="0.00" arrival="451.00" arrivalLane="c2e_1" arrivalPos="990.00" arrivalPosLat="0.00" arrivalSpeed="14.02" duration="148.00" routeLength="1986.69" waitingTime="0.00" waitingCount="0" stopTime="0.00" timeLoss="4.93" rerouteNo="1" devices="tripinfo_car_s2e_303 routing_car_s2e_303" vType="Car" speedFactor="1.01" vaporized=""/>
    <tripinfo id="car_s2w_305" depart="307.00" departLane="s2sep_1" departPos="3.60" departPosLat="0.00" departSpeed="13.90" departDelay="2.00" arrival="452.00" arrivalLane="c2w_1" arrivalPos="990.00" arrivalPosLat="0.00" arrivalSpeed="15.35" duration="145.00" routeLength="1996.47" waitingTime="0.00" waitingCount="0" stopTime="0.00" timeLoss="18.22" rerouteNo="1" devices="tripinfo_car_s2w_305 routing_car_s2w_305" vType="Car" speedFactor="1.14" vaporized=""/>
    <tripinfo id="car_s2e_304" depart="305.00" departLane="s2sep_1" departPos="3.60" departPosLat="0.00" departSpeed="13.90" departDelay="1.00" arrival="455.00" arrivalLane="c2e_1" arrivalPos="990.00" arrivalPosLat="0.00" arrivalSpeed="14.33" duration="150.00" routeLength="1986.69" waitingTime="0.00" waitingCount="0" stopTime="0.00" timeLoss="10.04" rerouteNo="1" devices="tripinfo_car_s2e_304 routing_car_s2e_304" vType="Car" speedFactor="1.03" vaporized=""/>
    <tripinfo id="car_n2e_279" depart="279.00" departLane="n2sep_1" departPos="3.60" departPosLat="0.00" departSpeed="13.90" departDelay="0.00" arrival="457.00" arrivalLane="c2e_1" arrivalPos="990.00" arrivalPosLat="0.00" arrivalSpeed="15.69" duration="178.00" routeLength="1996.47" waitingTime="27.00" waitingCount="2" stopTime="0.00" timeLoss="54.74" rerouteNo="1" devices="tripinfo_car_n2e_279 routing_car_n2e_279" vType="Car" speedFactor="1.18" vaporized=""/>
    <tripinfo id="car_s2w_312" depart="312.00" departLane="s2sep_1" departPos="3.60" departPosLat="0.00" departSpeed="13.90" departDelay="0.00" arrival="460.00" arrivalLane="c2w_1" arrivalPos="990.00" arrivalPosLat="0.00" arrivalSpeed="14.06" duration="148.00" routeLength="1996.47" waitingTime="0.00" waitingCount="0" stopTime="0.00" timeLoss="4.79" rerouteNo="1" devices="tripinfo_car_s2w_312 routing_car_s2w_312" vType="Car" speedFactor="1.01" vaporized=""/>
    <tripinfo id="car_n2e_284" depart="284.00" departLane="n2sep_1" departPos="3.60" departPosLat="0.00" departSpeed="13.90" departDelay="0.00" arrival="461.00" arrivalLane="c2e_1" arrivalPos="990.00" arrivalPosLat="0.00" arrivalSpeed="13.94" duration="177.00" routeLength="1996.47" waitingTime="14.00" waitingCount="1" stopTime="0.00" timeLoss="33.05" rerouteNo="1" devices="tripinfo_car_n2e_284 routing_car_n2e_284" vType="Car" speedFactor="1.00" vaporized=""/>
    <tripinfo id="car_n2e_291" depart="291.00" departLane="n2sep_1" departPos="3.60" departPosLat="0.00" departSpeed="13.90" departDelay="0.00" arrival="464.00" arrivalLane="c2e_1" arrivalPos="990.00" arrivalPosLat="0.00" arrivalSpeed="14.27" duration="173.00" routeLength="1996.47" waitingTime="14.00" waitingCount="1" stopTime="0.00" timeLoss="33.05" rerouteNo="1" devices="tripinfo_car_n2e_291 routing_car_n2e_291" vType="Car" speedFactor="1.03" vaporized=""/>
    <tripinfo id="car_n2e_305" depart="305.00" departLane="n2sep_1" departPos="3.60" departPosLat="0.00" departSpeed="13.90" departDelay="0.00" arrival="467.00" arrivalLane="c2e_1" arrivalPos="990.00" arrivalPosLat="0.00" arrivalSpeed="14.72" duration="162.00" routeLength="1996.47" waitingTime="5.00" waitingCount="1" stopTime="0.00" timeLoss="26.19" rerouteNo="1" devices="tripinfo_car_n2e_305 routing_car_n2e_305" vType="Car" speedFactor="1.07" vaporized=""/>
    <tripinfo id="car_w2e_286" depart="286.00" departLane="w2sep_1" departPos="3.60" departPosLat="0.00" departSpeed="13.90" departDelay="0.00" arrival="475.00" arrivalLane="c2e_1" arrivalPos="990.00" arrivalPosLat="0.00" arrivalSpeed="14.89" duration="189.00" routeLength="1997.01" waitingTime="44.00" waitingCount="1" stopTime="0.00" timeLoss="54.72" rerouteNo="1" devices="tripinfo_car_w2e_286 routing_car_w2e_286" vType="Car" speedFactor="1.07" vaporized=""/>
    <tripinfo id="car_e2n_292" depart="292.00" departLane="e2sep_1" departPos="3.60" departPosLat="0.00" departSpeed="13.90" departDelay="0.00" arrival="475.00" arrivalLane="c2n_1" arrivalPos="990.00" arrivalPosLat="0.00" arrivalSpeed="14.75" duration="183.00" routeLength="1986.69" waitingTime="38.00" waitingCount="1" stopTime="0.00" timeLoss="47.75" rerouteNo="1" devices="tripinfo_car_e2n_292 routing_car_e2n_292" vType="Car" speedFactor="1.06" vaporized=""/>
    <tripinfo id="car_w2s_291" depart="291.00" departLane="w2sep_1" departPos="3.60" departPosLat="0.00" departSpeed="13.90" departDelay="0.00" arrival="476.00" arrivalLane="c2s_1" arrivalPos="990.00" arrivalPosLat="0.00" arrivalSpeed="15.33" duration="185.00" routeLength="1986.69" waitingTime="42.00" waitingCount="1" stopTime="0.00" timeLoss="54.06" rerouteNo="1" devices="tripinfo_car_w2s_291 routing_car_w2s_291" vType="Car" speedFactor="1.10" vaporized=""/>
    <tripinfo id="car_e2w_306" depart="306.00" departLane="e2sep_1" departPos="3.60" departPosLat="0.00" departSpeed="13.90" departDelay="0.00" arrival="482.00" arrivalLane="c2w_1" arrivalPos="990.00" arrivalPosLat="0.00" arrivalSpeed="14.42" duration="176.00" routeLength="1997.01" waitingTime="25.00" waitingCount="1" stopTime="0.00" timeLoss="36.80" rerouteNo="1" devices="tripinfo_car_e2w_306 routing_car_e2w_306" vType="Car" speedFactor="1.04" vaporized=""/>
    <tripinfo id="car_e2n_295" depart="296.00" departLane="e2sep_1" departPos="3.60" departPosLat="0.00" departSpeed="13.90" departDelay="1.00" arrival="483.00" arrivalLane="c2n_1" arrivalPos="990.00" arrivalPosLat="0.00" arrivalSpeed="13.90" duration="187.00" routeLength="1986.69" waitingTime="31.00" waitingCount="1" stopTime="0.00" timeLoss="42.97" rerouteNo="1" devices="tripinfo_car_e2n_295 routing_car_e2n_295" vType="Car" speedFactor="1.00" vaporized=""/>
    <tripinfo id="car_w2s_292" depart="293.00" departLane="w2sep_1" departPos="3.60" departPosLat="0.00" departSpeed="13.90" departDelay="1.00" arrival="484.00" arrivalLane="c2s_1" arrivalPos="990.00" arrivalPosLat="0.00" arrivalSpeed="14.23" duration="191.00" routeLength="1986.69" waitingTime="36.00" waitingCount="1" stopTime="0.00" timeLoss="50.51" rerouteNo="1" devices="tripinfo_car_w2s_292 routing_car_w2s_292" vType="Car" speedFactor="1.02" vaporized=""/>
    <tripinfo id="car_e2w_319" depart="319.00" departLane="e2sep_1" departPos="3.60" departPosLat="0.00" departSpeed="13.90" departDelay="0.00" arrival="484.00" arrivalLane="c2w_1" arrivalPos="990.00" arrivalPosLat="0.00" arrivalSpeed="15.27" duration="165.00" routeLength="1997.01" waitingTime="18.00" waitingCount="1" stopTime="0.00" timeLoss="36.40" rerouteNo="1" devices="tripinfo_car_e2w_319 routing_car_e2w_319" vType="Car" speedFactor="1.12" vaporized=""/>
    <tripinfo id="car_e2n_341" depart="341.00" departLane="e2sep_1" departPos="3.60" departPosLat="0.00" departSpeed="13.90" departDelay="0.00" arrival="485.00" arrivalLane="c2n_1" arrivalPos="990.00" arrivalPosLat="0.00" arrivalSpeed="15.11" duration="144.00" routeLength="1986.69" waitingTime="0.00" waitingCount="0" stopTime="0.00" timeLoss="14.84" rerouteNo="1" devices="tripinfo_car_e2n_341 routing_car_e2n_341" vType="Car" speedFactor="1.11" vaporized=""/>
    <tripinfo id="car_w2s_311" depart="311.00" departLane="w2sep_1" departPos="3.60" departPosLat="0.00" departSpeed="13.90" departDelay="0.00" arrival="486.00" arrivalLane="c2s_1" arrivalPos="990.00" arrivalPosLat="0.00" arrivalSpeed="16.11" duration="175.00" routeLength="1986.69" waitingTime="31.00" waitingCount="1" stopTime="0.00" timeLoss="57.47" rerouteNo="1" devices="tripinfo_car_w2s_311 routing_car_w2s_311" vType="Car" speedFactor="1.23" vaporized=""/>
    <tripinfo id="car_e2w_342" depart="343.00" departLane="e2sep_1" departPos="3.60" departPosLat="0.00" departSpeed="13.90" departDelay="1.00" arrival="486.00" arrivalLane="c2w_1" arrivalPos="990.00" arrivalPosLat="0.00" arrivalSpeed="15.72" duration="143.00" routeLength="1997.01" waitingTime="0.00" waitingCount="0" stopTime="0.00" timeLoss="19.46" rerouteNo="1" devices="tripinfo_car_e2w_342 routing_car_e2w_342" vType="Car" speedFactor="1.16" vaporized=""/>
    <tripinfo id="car_w2n_298" depart="298.00" departLane="w2sep_1" departPos="3.60" departPosLat="0.00" departSpeed="13.90" departDelay="0.00" arrival="488.00" arrivalLane="c2n_1" arrivalPos="990.00" arrivalPosLat="0.00" arrivalSpeed="15.46" duration="190.00" routeLength="1996.47" waitingTime="43.00" waitingCount="2" stopTime="0.00" timeLoss="60.88" rerouteNo="1" devices="tripinfo_car_w2n_298 routing_car_w2n_298" vType="Car" speedFactor="1.12" vaporized=""/>
    <tripinfo id="car_w2s_345" depart="345.00" departLane="w2sep_1" departPos="3.60" departPosLat="0.00" departSpeed="13.90" departDelay="0.00" arrival="488.00" arrivalLane="c2s_1" arrivalPos="990.00" arrivalPosLat="0.00" arrivalSpeed="15.36" duration="143.00" routeLength="1986.69" waitingTime="0.00" waitingCount="0" stopTime="0.00" timeLoss="15.46" rerouteNo="1" devices="tripinfo_car_w2s_345 routing_car_w2s_345" vType="Car" speedFactor="1.13" vaporized=""/>
    <tripinfo id="car_e2s_294" depart="294.00" departLane="e2sep_1" departPos="3.60" departPosLat="0.00" departSpeed="13.90" departDelay="0.00" arrival="490.00" arrivalLane="c2s_1" arrivalPos="990.00" arrivalPosLat="0.00" arrivalSpeed="15.58" duration="196.00" routeLength="1996.47" waitingTime="46.00" waitingCount="2" stopTime="0.00" timeLoss="70.84" rerouteNo="1" devices="tripinfo_car_e2s_294 routing_car_e2s_294" vType="Car" speedFactor="1.15" vaporized=""/>
    <tripinfo id="car_w2n_346" depart="347.00" departLane="w2sep_1" departPos="3.60" departPosLat="0.00" departSpeed="13.90" departDelay="1.00" arrival="492.00" arrivalLane="c2n_1" arrivalPos="990.00" arrivalPosLat="0.00" arrivalSpeed="15.83" duration="145.00" routeLength="1996.47" waitingTime="2.00" waitingCount="1" stopTime="0.00" timeLoss="18.50" rerouteNo="1" devices="tripinfo_car_w2n_346 routing_car_w2n_346" vType="Car" speedFactor="1.14" vaporized=""/>
    <tripinfo id="car_e2w_355" depart="355.00" departLane="e2sep_1" departPos="3.60" departPosLat="0.00" departSpeed="13.90" departDelay="0.00" arrival="495.00" arrivalLane="c2w_1" arrivalPos="990.00" arrivalPosLat="0.00" arrivalSpeed="14.45" duration="140.00" routeLength="1997.01" waitingTime="0.00" waitingCount="0" stopTime="0.00" timeLoss="1.13" rerouteNo="1" devices="tripinfo_car_e2w_355 routing_car_e2w_355" vType="Car" speedFactor="1.04" vaporized=""/>
    <tripinfo id="car_e2s_324" depart="324.00" departLane="e2sep_1" departPos="3.60" departPosLat="0.00" departSpeed="13.90" departDelay="0.00" arrival="496.00" arrivalLane="c2s_1" arrivalPos="990.00" arrivalPosLat="0.00" arrivalSpeed="14.11" duration="172.00" routeLength="1996.47" waitingTime="9.00" waitingCount="2" stopTime="0.00" timeLoss="29.52" rerouteNo="1" devices="tripinfo_car_e2s_324 routing_car_e2s_324" vType="Car" speedFactor="1.02" vaporized=""/>
    <tripinfo id="car_w2n_349" depart="349.00" departLane="w2sep_1" departPos="3.60" departPosLat="0.00" departSpeed="13.90" departDelay="0.00" arrival="503.00" arrivalLane="c2n_1" arrivalPos="990.00" arrivalPosLat="0.00" arrivalSpeed="13.93" duration="154.00" routeLength="1996.47" waitingTime="0.00" waitingCount="0" stopTime="0.00" timeLoss="9.44" rerouteNo="1" devices="tripinfo_car_w2n_349 routing_car_w2n_349" vType="Car" speedFactor="1.00" vaporized=""/>
    <tripinfo id="car_n2w_345" depart="345.00" departLane="n2sep_1" departPos="3.60" departPosLat="0.00" departSpeed="13.90" departDelay="0.00" arrival="522.00" arrivalLane="c2w_1" arrivalPos="990.00" arrivalPosLat="0.00" arrivalSpeed="15.05" duration="177.00" routeLength="1986.69" waitingTime="32.00" waitingCount="1" stopTime="0.00" timeLoss="43.77" rerouteNo="1" devices="tripinfo_car_n2w_345 routing_car_n2w_345" vType="Car" speedFactor="1.08" vaporized=""/>
    <tripinfo id="car_s2e_339" depart="339.00" departLane="s2sep_1" departPos="3.60" departPosLat="0.00" departSpeed="13.90" departDelay="0.00" arrival="523.00" arrivalLane="c2e_1" arrivalPos="990.00" arrivalPosLat="1.00" arrivalSpeed="14.23" duration="184.00" routeLength="1986.69" waitingTime="33.00" waitingCount="1" stopTime="0.00" timeLoss="43.20" rerouteNo="1" devices="tripinfo_car_s2e_339 routing_car_s2e_339" vType="Car" speedFactor="1.02" vaporized=""/>
    <tripinfo id="car_n2s_336" depart="336.00" departLane="n2sep_1" departPos="3.60" departPosLat="0.00" departSpeed="13.90" departDelay="0.00" arrival="524.00" arrivalLane="c2s_1" arrivalPos="990.00" arrivalPosLat="0.00" arrivalSpeed="13.95" duration="188.00" routeLength="1997.01" waitingTime="35.00" waitingCount="1" stopTime="0.00" timeLoss="44.87" rerouteNo="1" devices="tripinfo_car_n2s_336 routing_car_n2s_336" vType="Car" speedFactor="1.00" vaporized=""/>
    <tripinfo id="car_s2n_342" depart="342.00" departLane="s2sep_1" departPos="3.60" departPosLat="0.00" departSpeed="13.90" departDelay="0.00" arrival="527.00" arrivalLane="c2n_1" arrivalPos="990.00" arrivalPosLat="0.00" arrivalSpeed="13.90" duration="185.00" routeLength="1997.01" waitingTime="29.00" waitingCount="1" stopTime="0.00" timeLoss="40.66" rerouteNo="1" devices="tripinfo_car_s2n_342 routing_car_s2n_342" vType="Car" speedFactor="1.00" vaporized=""/>
    <tripinfo id="car_n2e_347" depart="347.00" departLane="n2sep_1" departPos="3.60" departPosLat="0.00" departSpeed="13.90" departDelay="0.00" arrival="529.00" arrivalLane="c2e_1" arrivalPos="990.00" arrivalPosLat="1.00" arrivalSpeed="15.56" duration="182.00" routeLength="1996.47" waitingTime="35.00" waitingCount="2" stopTime="0.00" timeLoss="52.71" rerouteNo="1" devices="tripinfo_car_n2e_347 routing_car_n2e_347" vType="Car" speedFactor="1.12" vaporized=""/>
    <tripinfo id="car_s2n_375" depart="375.00" departLane="s2sep_1" departPos="3.60" departPosLat="0.00" departSpeed="13.90" departDelay="0.00" arrival="529.00" arrivalLane="c2n_1" arrivalPos="990.00" arrivalPosLat="0.00" arrivalSpeed="14.58" duration="154.00" routeLength="1997.01" waitingTime="3.00" waitingCount="1" stopTime="0.00" timeLoss="19.03" rerouteNo="1" devices="tripinfo_car_s2n_375 routing_car_s2n_375" vType="Car" speedFactor="1.06" vaporized=""/>
    <tripinfo id="amb_w2e_390" depart="390.00" departLane="w2sep_1" departPos="6.60" departPosLat="0.00" departSpeed="13.90" departDelay="0.00" arrival="531.00" arrivalLane="c2e_1" arrivalPos="990.00" arrivalPosLat="1.00" arrivalSpeed="18.43" duration="141.00" routeLength="1994.01" waitingTime="2.00" waitingCount="1" stopTime="0.00" timeLoss="44.57" rerouteNo="1" devices="tripinfo_amb_w2e_390 routing_amb_w2e_390 bluelight_amb_w2e_390" vType="Ambulance" speedFactor="1.50" vaporized="">
        <bluelight/>
    </tripinfo>
    <tripinfo id="bus_n2w_349" depart="349.00" departLane="n2sep_1" departPos="12.10" departPosLat="0.00" departSpeed="13.90" departDelay="0.00" arrival="533.00" arrivalLane="c2w_1" arrivalPos="990.00" arrivalPosLat="0.00" arrivalSpeed="13.90" duration="184.00" routeLength="1978.19" waitingTime="25.00" waitingCount="1" stopTime="0.00" timeLoss="41.12" rerouteNo="1" devices="tripinfo_bus_n2w_349 routing_bus_n2w_349" vType="Bus" speedFactor="1.00" vaporized=""/>
    <tripinfo id="car_s2n_388" depart="388.00" departLane="s2sep_1" departPos="3.60" departPosLat="0.00" departSpeed="13.90" departDelay="0.00" arrival="534.00" arrivalLane="c2n_1" arrivalPos="990.00" arrivalPosLat="0.00" arrivalSpeed="13.90" duration="146.00" routeLength="1997.01" waitingTime="0.00" waitingCount="0" stopTime="0.00" timeLoss="2.22" rerouteNo="1" devices="tripinfo_car_s2n_388 routing_car_s2n_388" vType="Car" speedFactor="1.00" vaporized=""/>
    <tripinfo id="car_n2w_357" depart="357.00" departLane="n2sep_1" departPos="3.60" departPosLat="0.00" departSpeed="13.90" departDelay="0.00" arrival="538.00" arrivalLane="c2w_1" arrivalPos="990.00" arrivalPosLat="0.00" arrivalSpeed="13.90" duration="181.00" routeLength="1986.69" waitingTime="19.00" waitingCount="1" stopTime="0.00" timeLoss="37.20" rerouteNo="1" devices="tripinfo_car_n2w_357 routing_car_n2w_357" vType="Car" speedFactor="1.00" vaporized=""/>
    <tripinfo id="car_n2s_368" depart="368.00" departLane="n2sep_1" departPos="3.60" departPosLat="0.00" departSpeed="13.90" departDelay="0.00" arrival="540.00" arrivalLane="c2s_1" arrivalPos="990.00" arrivalPosLat="0.00" arrivalSpeed="13.96" duration="172.00" routeLength="1997.01" waitingTime="9.00" waitingCount="1" stopTime="0.00" timeLoss="28.65" rerouteNo="1" devices="tripinfo_car_n2s_368 routing_car_n2s_368" vType="Car" speedFactor="1.00" vaporized=""/>
    <tripinfo id="car_s2e_391" depart="391.00" departLane="s2sep_1" departPos="3.60" departPosLat="0.00" departSpeed="13.90" departDelay="0.00" arrival="542.00" arrivalLane="c2e_1" arrivalPos="990.00" arrivalPosLat="1.00" arrivalSpeed="13.90" duration="151.00" routeLength="1986.69" waitingTime="0.00" waitingCount="0" stopTime="0.00" timeLoss="6.54" rerouteNo="1" devices="tripinfo_car_s2e_391 routing_car_s2e_391" vType="Car@car_s2e_391" speedFactor="1.00" vaporized=""/>
    <tripinfo id="car_s2w_351" depart="351.00" departLane="s2sep_1" departPos="3.60" departPosLat="0.00" departSpeed="13.90" departDelay="0.00" arrival="543.00" arrivalLane="c2w_1" arrivalPos="990.00" arrivalPosLat="0.00" arrivalSpeed="14.11" duration="192.00" routeLength="1996.47" waitingTime="33.00" waitingCount="2" stopTime="0.00" timeLoss="49.47" rerouteNo="1" devices="tripinfo_car_s2w_351 routing_car_s2w_351" vType="Car" speedFactor="1.02" vaporized=""/>
    <tripinfo id="car_s2n_399" depart="399.00" departLane="s2sep_1" departPos="3.60" departPosLat="0.00" departSpeed="13.90" departDelay="0.00" arrival="544.00" arrivalLane="c2n_1" arrivalPos="990.00" arrivalPosLat="0.00" arrivalSpeed="13.90" duration="145.00" routeLength="1997.01" waitingTime="0.00" waitingCount="0" stopTime="0.00" timeLoss="1.27" rerouteNo="1" devices="tripinfo_car_s2n_399 routing_car_s2n_399" vType="Car" speedFactor="1.00" vaporized=""/>
    <tripinfo id="car_s2w_376" depart="377.00" departLane="s2sep_1" departPos="3.60" departPosLat="0.00" departSpeed="13.90" departDelay="1.00" arrival="545.00" arrivalLane="c2w_1" arrivalPos="990.00" arrivalPosLat="0.00" arrivalSpeed="15.17" duration="168.00" routeLength="1996.47" waitingTime="13.00" waitingCount="2" stopTime="0.00" timeLoss="39.25" rerouteNo="1" devices="tripinfo_car_s2w_376 routing_car_s2w_376" vType="Car" speedFactor="1.12" vaporized=""/>
    <tripinfo id="car_s2w_424" depart="424.00" departLane="s2sep_1" departPos="3.60" departPosLat="0.00" departSpeed="13.90" departDelay="0.00" arrival="554.00" arrivalLane="c2w_1" arrivalPos="990.00" arrivalPosLat="0.00" arrivalSpeed="15.87" duration="130.00" routeLength="1996.47" waitingTime="0.00" waitingCount="0" stopTime="0.00" timeLoss="3.07" rerouteNo="1" devices="tripinfo_car_s2w_424 routing_car_s2w_424" vType="Car" speedFactor="1.14" vaporized=""/>
</tripinfos>
