<?xml version="1.0" encoding="UTF-8"?>

<!-- generated on 2021-05-18 05:44:53 by Eclipse SUMO sumo Version 1.9.1
<configuration xmlns:xsi="http://www.w3.org/2001/XMLSchema-instance" xsi:noNamespaceSchemaLocation="http://sumo.dlr.de/xsd/sumoConfiguration.xsd">

    <input>
        <net-file value="sumofiles/junction.net.xml"/>
        <route-files value="sumofiles/junction_none_23.rou.xml"/>
        <additional-files value="sumofiles/junction.det.xml"/>
    </input>

    <output>
        <tripinfo-output value="sumofiles/output/tripinfo_none_23.xml"/>
    </output>

    <time>
        <begin value="0"/>
        <end value="10000"/>
        <step-length value="1.0"/>
    </time>

    <processing>
        <lateral-resolution value="0.5"/>
    </processing>

    <report>
        <no-warnings value="true"/>
        <error-log value="sumofiles/output/errorlog_none_23.log"/>
        <no-step-log value="true"/>
    </report>

    <traci_server>
        <remote-port value="43007"/>
    </traci_server>

    <gui_only>
        <gui-settings-file value="sumofiles/junction-gui.settings.xml"/>
        <tracker-interval value="1"/>
    </gui_only>

</configuration>
-->

<tripinfos xmlns:xsi="http://www.w3.org/2001/XMLSchema-instance" xsi:noNamespaceSchemaLocation="http://sumo.dlr.de/xsd/tripinfo_file.xsd">
    <tripinfo id="car_e2w_0" depart="0.00" departLane="e2sep_1" departPos="3.60" departPosLat="0.00" departSpeed="13.90" departDelay="0.00" arrival="136.00" arrivalLane="c2w_1" arrivalPos="990.00" arrivalPosLat="0.00" arrivalSpeed="14.73" duration="136.00" routeLength="1997.01" waitingTime="0.00" waitingCount="0" stopTime="0.00" timeLoss="0.13" rerouteNo="1" devices="tripinfo_car_e2w_0 routing_car_e2w_0" vType="Car" speedFactor="1.06" vaporized=""/>
    <tripinfo id="car_n2s_27" depart="27.00" departLane="n2sep_1" departPos="3.60" departPosLat="0.00" departSpeed="13.90" departDelay="0.00" arrival="160.00" arrivalLane="c2s_1" arrivalPos="990.00" arrivalPosLat="0.00" arrivalSpeed="15.16" duration="133.00" routeLength="1997.01" waitingTime="0.00" waitingCount="0" stopTime="0.00" timeLoss="0.75" rerouteNo="1" devices="tripinfo_car_n2s_27 routing_car_n2s_27" vType="Car" speedFactor="1.09" vaporized=""/>
    <tripinfo id="bus_w2n_14" depart="14.00" departLane="w2sep_1" departPos="12.10" departPosLat="0.00" departSpeed="13.90" departDelay="0.00" arrival="162.00" arrivalLane="c2n_1" arrivalPos="990.00" arrivalPosLat="0.00" arrivalSpeed="13.90" duration="148.00" routeLength="1987.97" waitingTime="0.00" waitingCount="0" stopTime="0.00" timeLoss="3.42" rerouteNo="1" devices="tripinfo_bus_w2n_14 routing_bus_w2n_14" vType="Bus" speedFactor="1.00" vaporized=""/>
    <tripinfo id="car_s2n_2" depart="2.00" departLane="s2sep_1" departPos="3.60" departPosLat="0.00" departSpeed="13.90" departDelay="0.00" arrival="165.00" arrivalLane="c2n_1" arrivalPos="990.00" arrivalPosLat="0.00" arrivalSpeed="14.64" duration="163.00" routeLength="1997.01" waitingTime="12.00" waitingCount="1" stopTime="0.00" timeLoss="26.90" rerouteNo="1" devices="tripinfo_car_s2n_2 routing_car_s2n_2" vType="Car" speedFactor="1.06" vaporized=""/>
    <tripinfo id="car_n2e_8" depart="8.00" departLane="n2sep_1" departPos="3.60" departPosLat="0.00" departSpeed="13.90" departDelay="0.00" arrival="166.00" arrivalLane="c2e_1" arrivalPos="990.00" arrivalPosLat="0.00" arrivalSpeed="14.04" duration="158.00" routeLength="1996.47" waitingTime="3.00" waitingCount="1" stopTime="0.00" timeLoss="14.58" rerouteNo="1" devices="tripinfo_car_n2e_8 routing_car_n2e_8" vType="Car" speedFactor="1.01" vaporized=""/>
    <tripinfo id="car_s2w_18" depart="18.00" departLane="s2sep_1" departPos="3.60" departPosLat="0.00" departSpeed="13.90" departDelay="0.00" arrival="166.00" arrivalLane="c2w_1" arrivalPos="990.00" arrivalPosLat="0.00" arrivalSpeed="14.32" duration="148.00" routeLength="1996.47" waitingTime="0.00" waitingCount="0" stopTime="0.00" timeLoss="7.16" rerouteNo="1" devices="tripinfo_car_s2w_18 routing_car_s2w_18" vType="Car" speedFactor="1.03" vaporized=""/>
    <tripinfo id="car_s2w_24" depart="24.00" departLane="s2sep_1" departPos="3.60" departPosLat="0.00" departSpeed="13.90" departDelay="0.00" arrival="169.00" arrivalLane="c2w_1" arrivalPos="990.00" arrivalPosLat="0.00" arrivalSpeed="14.97" duration="145.00" routeLength="1996.47" waitingTime="0.00" waitingCount="0" stopTime="0.00" timeLoss="10.79" rerouteNo="1" devices="tripinfo_car_s2w_24 routing_car_s2w_24" vType="Car" speedFactor="1.08" vaporized=""/>
    <tripinfo id="car_s2e_24" depart="26.00" departLane="s2sep_1" departPos="3.60" departPosLat="0.00" departSpeed="13.90" departDelay="2.00" arrival="172.00" arrivalLane="c2e_1" arrivalPos="990.00" arrivalPosLat="0.00" arrivalSpeed="14.32" duration="146.00" routeLength="1986.69" waitingTime="0.00" waitingCount="0" stopTime="0.00" timeLoss="5.97" rerouteNo="1" devices="tripinfo_car_s2e_24 routing_car_s2e_24" vType="Car" speedFactor="1.03" vaporized=""/>
    <tripinfo id="car_s2w_41" depart="41.00" departLane="s2sep_1" departPos="3.60" departPosLat="0.00" departSpeed="13.90" departDelay="0.00" arrival="185.00" arrivalLane="c2w_1" arrivalPos="990.00" arrivalPosLat="0.00" arrivalSpeed="14.54" duration="144.00" routeLength="1996.47" waitingTime="0.00" waitingCount="0" stopTime="0.00" timeLoss="5.08" rerouteNo="1" devices="tripinfo_car_s2w_41 routing_car_s2w_41" vType="Car" speedFactor="1.05" vaporized=""/>
    <tripinfo id="car_s2n_46" depart="48.00" departLane="s2sep_1" departPos="3.60" departPosLat="0.00" departSpeed="13.90" departDelay="2.00" arrival="185.00" arrivalLane="c2n_1" arrivalPos="990.00" arrivalPosLat="0.00" arrivalSpeed="16.10" duration="137.00" routeLength="1997.01" waitingTime="0.00" waitingCount="0" stopTime="0.00" timeLoss="12.27" rerouteNo="1" devices="tripinfo_car_s2n_46 routing_car_s2n_46" vType="Car" speedFactor="1.16" vaporized=""/>
    <tripinfo id="car_s2e_42" depart="43.00" departLane="s2sep_1" departPos="3.60" departPosLat="0.00" departSpeed="13.90" departDelay="1.00" arrival="192.00" arrivalLane="c2e_1" arrivalPos="990.00" arrivalPosLat="0.00" arrivalSpeed="13.90" duration="149.00" routeLength="1986.69" waitingTime="0.00" waitingCount="0" stopTime="0.00" timeLoss="5.21" rerouteNo="1" devices="tripinfo_car_s2e_42 routing_car_s2e_42" vType="Car" speedFactor="1.00" vaporized=""/>
    <tripinfo id="car_n2w_49" depart="49.00" departLane="n2sep_1" departPos="3.60" departPosLat="0.00" departSpeed="13.90" departDelay="0.00" arrival="196.00" arrivalLane="c2w_1" arrivalPos="990.00" arrivalPosLat="0.00" arrivalSpeed="14.15" duration="147.00" routeLength="1986.69" waitingTime="0.00" waitingCount="0" stopTime="0.00" timeLoss="5.52" rerouteNo="1" devices="tripinfo_car_n2w_49 routing_car_n2w_49" vType="Car" speedFactor="1.02" vaporized=""/>
    <tripinfo id="car_s2w_46" depart="46.00" departLane="s2sep_1" departPos="3.60" departPosLat="0.00" departSpeed="13.90" departDelay="0.00" arrival="201.00" arrivalLane="c2w_1" arrivalPos="990.00" arrivalPosLat="0.00" arrivalSpeed="13.90" duration="155.00" routeLength="1996.47" waitingTime="0.00" waitingCount="0" stopTime="0.00" timeLoss="10.45" rerouteNo="1" devices="tripinfo_car_s2w_46 routing_car_s2w_46" vType="Car" speedFactor="1.00" vaporized=""/>
    <tripinfo id="car_w2s_11" depart="11.00" departLane="w2sep_1" departPos="3.60" departPosLat="0.00" departSpeed="13.90" departDelay="0.00" arrival="204.00" arrivalLane="c2s_1" arrivalPos="990.00" arrivalPosLat="0.00" arrivalSpeed="15.05" duration="193.00" routeLength="1986.69" waitingTime="50.00" waitingCount="1" stopTime="0.00" timeLoss="60.15" rerouteNo="1" devices="tripinfo_car_w2s_11 routing_car_w2s_11" vType="Car" speedFactor="1.08" vaporized=""/>
    <tripinfo id="car_e2n_23" depart="24.00" departLane="e2sep_1" departPos="3.60" departPosLat="0.00" departSpeed="13.90" departDelay="1.00" arrival="206.00" arrivalLane="c2n_1" arrivalPos="990.00" arrivalPosLat="0.00" arrivalSpeed="14.54" duration="182.00" routeLength="1986.69" waitingTime="34.00" waitingCount="1" stopTime="0.00" timeLoss="44.77" rerouteNo="1" devices="tripinfo_car_e2n_23 routing_car_e2n_23" vType="Car" speedFactor="1.05" vaporized=""/>
    <tripinfo id="car_w2e_32" depart="32.00" departLane="w2sep_1" departPos="3.60" departPosLat="0.00" departSpeed="13.90" departDelay="0.00" arrival="209.00" arrivalLane="c2e_1" arrivalPos="990.00" arrivalPosLat="0.00" arrivalSpeed="14.55" duration="177.00" routeLength="1997.01" waitingTime="28.00" waitingCount="1" stopTime="0.00" timeLoss="39.02" rerouteNo="1" devices="tripinfo_car_w2e_32 routing_car_w2e_32" vType="Car" speedFactor="1.05" vaporized=""/>
    <tripinfo id="car_w2s_73" depart="73.00" departLane="w2sep_1" departPos="3.60" departPosLat="0.00" departSpeed="13.90" departDelay="0.00" arrival="209.00" arrivalLane="c2s_1" arrivalPos="990.00" arrivalPosLat="0.00" arrivalSpeed="16.04" duration="136.00" routeLength="1986.69" waitingTime="0.00" waitingCount="0" stopTime="0.00" timeLoss="10.88" rerouteNo="1" devices="tripinfo_car_w2s_73 routing_car_w2s_73" vType="Car" speedFactor="1.15" vaporized=""/>
    <tripinfo id="car_e2w_36" depart="36.00" departLane="e2sep_1" departPos="3.60" departPosLat="0.00" departSpeed="13.90" departDelay="0.00" arrival="210.00" arrivalLane="c2w_1" arrivalPos="990.00" arrivalPosLat="0.00" arrivalSpeed="15.61" duration="174.00" routeLength="1997.01" waitingTime="27.00" waitingCount="1" stopTime="0.00" timeLoss="45.46" rerouteNo="1" devices="tripinfo_car_e2w_36 routing_car_e2w_36" vType="Car" speedFactor="1.12" vaporized=""/>
    <tripinfo id="car_e2n_24" depart="26.00" departLane="e2sep_1" departPos="3.60" departPosLat="0.00" departSpeed="13.90" departDelay="2.00" arrival="213.00" arrivalLane="c2n_1" arrivalPos="990.00" arrivalPosLat="0.00" arrivalSpeed="14.04" duration="187.00" routeLength="1986.69" waitingTime="30.00" waitingCount="1" stopTime="0.00" timeLoss="44.01" rerouteNo="1" devices="tripinfo_car_e2n_24 routing_car_e2n_24" vType="Car" speedFactor="1.01" vaporized=""/>
    <tripinfo id="car_w2e_39" depart="39.00" departLane="w2sep_1" departPos="3.60" departPosLat="0.00" departSpeed="13.90" departDelay="0.00" arrival="215.00" arrivalLane="c2e_1" arrivalPos="990.00" arrivalPosLat="0.00" arrivalSpeed="13.90" duration="176.00" routeLength="1997.01" waitingTime="19.00" waitingCount="1" stopTime="0.00" timeLoss="32.07" rerouteNo="1" devices="tripinfo_car_w2e_39 routing_car_w2e_39" vType="Car" speedFactor="1.00" vaporized=""/>
    <tripinfo id="car_e2w_53" depart="53.00" departLane="e2sep_1" departPos="3.60" departPosLat="0.00" departSpeed="13.90" departDelay="0.00" arrival="215.00" arrivalLane="c2w_1" arrivalPos="990.00" arrivalPosLat="0.00" arrivalSpeed="15.16" duration="162.00" routeLength="1997.01" waitingTime="14.00" waitingCount="1" stopTime="0.00" timeLoss="29.88" rerouteNo="1" devices="tripinfo_car_e2w_53 routing_car_e2w_53" vType="Car" speedFactor="1.09" vaporized=""/>
    <tripinfo id="car_e2n_31" depart="31.00" departLane="e2sep_1" departPos="3.60" departPosLat="0.00" departSpeed="13.90" departDelay="0.00" arrival="216.00" arrivalLane="c2n_1" arrivalPos="990.00" arrivalPosLat="0.00" arrivalSpeed="14.22" duration="185.00" routeLength="1986.69" waitingTime="28.00" waitingCount="1" stopTime="0.00" timeLoss="44.85" rerouteNo="1" devices="tripinfo_car_e2n_31 routing_car_e2n_31" vType="Car" speedFactor="1.03" vaporized=""/>
    <tripinfo id="car_e2w_56" depart="56.00" departLane="e2sep_1" departPos="3.60" departPosLat="0.00" departSpeed="13.90" departDelay="0.00" arrival="218.00" arrivalLane="c2w_1" arrivalPos="990.00" arrivalPosLat="0.00" arrivalSpeed="15.52" duration="162.00" routeLength="1997.01" waitingTime="12.00" waitingCount="1" stopTime="0.00" timeLoss="33.58" rerouteNo="1" devices="tripinfo_car_e2w_56 routing_car_e2w_56" vType="Car" speedFactor="1.12" vaporized=""/>
    <tripinfo id="car_e2n_56" depart="58.00" departLane="e2sep_1" departPos="3.60" departPosLat="0.00" departSpeed="13.90" departDelay="2.00" arrival="225.00" arrivalLane="c2n_1" arrivalPos="990.00" arrivalPosLat="0.00" arrivalSpeed="13.90" duration="167.00" routeLength="1986.69" waitingTime="6.00" waitingCount="1" stopTime="0.00" timeLoss="22.50" rerouteNo="1" devices="tripinfo_car_e2n_56 routing_car_e2n_56" vType="Car" speedFactor="1.00" vaporized=""/>
    <tripinfo id="car_w2s_76" depart="76.00" departLane="w2sep_1" departPos="3.60" departPosLat="0.00" departSpeed="13.90" departDelay="0.00" arrival="225.00" arrivalLane="c2s_1" arrivalPos="990.00" arrivalPosLat="0.00" arrivalSpeed="13.90" duration="149.00" routeLength="1986.69" waitingTime="0.00" waitingCount="0" stopTime="0.00" timeLoss="5.27" rerouteNo="1" devices="tripinfo_car_w2s_76 routing_car_w2s_76" vType="Car" speedFactor="1.00" vaporized=""/>
    <tripinfo id="car_e2w_69" depart="69.00" departLane="e2sep_1" departPos="3.60" departPosLat="0.00" departSpeed="13.90" departDelay="0.00" arrival="227.00" arrivalLane="c2w_1" arrivalPos="990.00" arrivalPosLat="0.00" arrivalSpeed="13.90" duration="158.00" routeLength="1997.01" waitingTime="0.00" waitingCount="0" stopTime="0.00" timeLoss="13.63" rerouteNo="1" devices="tripinfo_car_e2w_69 routing_car_e2w_69" vType="Car" speedFactor="1.00" vaporized=""/>
    <tripinfo id="car_w2s_86" depart="86.00" departLane="w2sep_1" departPos="3.60" departPosLat="0.00" departSpeed="13.90" departDelay="0.00" arrival="228.00" arrivalLane="c2s_1" arrivalPos="990.00" arrivalPosLat="0.00" arrivalSpeed="15.04" duration="142.00" routeLength="1986.69" waitingTime="0.00" waitingCount="0" stopTime="0.00" timeLoss="9.60" rerouteNo="1" devices="tripinfo_car_w2s_86 routing_car_w2s_86" vType="Car" speedFactor="1.09" vaporized=""/>
    <tripinfo id="car_e2w_71" depart="74.00" departLane="e2sep_1" departPos="3.60" departPosLat="0.00" departSpeed="13.90" departDelay="3.00" arrival="229.00" arrivalLane="c2w_1" arrivalPos="990.00" arrivalPosLat="0.00" arrivalSpeed="15.62" duration="155.00" routeLength="1997.01" waitingTime="0.00" waitingCount="0" stopTime="0.00" timeLoss="32.29" rerouteNo="1" devices="tripinfo_car_e2w_71 routing_car_e2w_71" vType="Car" speedFactor="1.18" vaporized=""/>
    <tripinfo id="car_e2w_79" depart="79.00" departLane="e2sep_1" departPos="3.60" departPosLat="0.00" departSpeed="13.90" departDelay="0.00" arrival="231.00" arrivalLane="c2w_1" arrivalPos="990.00" arrivalPosLat="0.00" arrivalSpeed="15.06" duration="152.00" routeLength="1997.01" waitingTime="0.00" waitingCount="0" stopTime="0.00" timeLoss="21.35" rerouteNo="1" devices="tripinfo_car_e2w_79 routing_car_e2w_79" vType="Car" speedFactor="1.10" vaporized=""/>
    <tripinfo id="bus_e2n_70" depart="72.00" departLane="e2sep_1" departPos="12.10" departPosLat="0.00" departSpeed="13.90" departDelay="2.00" arrival="232.00" arrivalLane="c2n_1" arrivalPos="990.00" arrivalPosLat="0.00" arrivalSpeed="13.89" duration="160.00" routeLength="1978.19" waitingTime="0.00" waitingCount="0" stopTime="0.00" timeLoss="16.19" rerouteNo="1" devices="tripinfo_bus_e2n_70 routing_bus_e2n_70" vType="Bus" speedFactor="1.00" vaporized=""/>
    <tripinfo id="car_w2e_93" depart="93.00" departLane="w2sep_1" departPos="3.60" departPosLat="0.00" departSpeed="13.90" departDelay="0.00" arrival="233.00" arrivalLane="c2e_1" arrivalPos="990.00" arrivalPosLat="0.00" arrivalSpeed="14.42" duration="140.00" routeLength="1997.01" waitingTime="0.00" waitingCount="0" stopTime="0.00" timeLoss="1.12" rerouteNo="1" devices="tripinfo_car_w2e_93 routing_car_w2e_93" vType="Car" speedFactor="1.04" vaporized=""/>
    <tripinfo id="car_e2s_22" depart="22.00" departLane="e2sep_1" departPos="3.60" departPosLat="0.00" departSpeed="13.90" departDelay="0.00" arrival="234.00" arrivalLane="c2s_1" arrivalPos="990.00" arrivalPosLat="0.00" arrivalSpeed="13.90" duration="212.00" routeLength="1996.47" waitingTime="51.00" waitingCount="2" stopTime="0.00" timeLoss="67.29" rerouteNo="1" devices="tripinfo_car_e2s_22 routing_car_e2s_22" vType="Car" speedFactor="1.00" vaporized=""/>
    <tripinfo id="car_e2n_83" depart="83.00" departLane="e2sep_1" departPos="3.60" departPosLat="0.00" departSpeed="13.90" departDelay="0.00" arrival="237.00" arrivalLane="c2n_1" arrivalPos="990.00" arrivalPosLat="0.00" arrivalSpeed="14.32" duration="154.00" routeLength="1986.69" waitingTime="0.00" waitingCount="0" stopTime="0.00" timeLoss="14.03" rerouteNo="1" devices="tripinfo_car_e2n_83 routing_car_e2n_83" vType="Car" speedFactor="1.03" vaporized=""/>
    <tripinfo id="car_e2s_43" depart="43.00" departLane="e2sep_1" departPos="3.60" departPosLat="0.00" departSpeed="13.90" departDelay="0.00" arrival="239.00" arrivalLane="c2s_1" arrivalPos="990.00" arrivalPosLat="0.00" arrivalSpeed="13.90" duration="196.00" routeLength="1996.47" waitingTime="30.00" waitingCount="2" stopTime="0.00" timeLoss="51.20" rerouteNo="1" devices="tripinfo_car_e2s_43 routing_car_e2s_43" vType="Car" speedFactor="1.00" vaporized=""/>
    <tripinfo id="car_w2n_51" depart="51.00" departLane="w2sep_1" departPos="3.60" departPosLat="0.00" departSpeed="13.90" departDelay="0.00" arrival="242.00" arrivalLane="c2n_1" arrivalPos="990.00" arrivalPosLat="0.00" arrivalSpeed="14.04" duration="191.00" routeLength="1996.47" waitingTime="28.00" waitingCount="2" stopTime="0.00" timeLoss="47.55" rerouteNo="1" devices="tripinfo_car_w2n_51 routing_car_w2n_51" vType="Car" speedFactor="1.01" vaporized=""/>
    <tripinfo id="car_e2s_61" depart="61.00" departLane="e2sep_1" departPos="3.60" departPosLat="0.00" departSpeed="13.90" departDelay="0.00" arrival="243.00" arrivalLane="c2s_1" arrivalPos="990.00" arrivalPosLat="0.00" arrivalSpeed="13.89" duration="182.00" routeLength="1996.47" waitingTime="16.00" waitingCount="1" stopTime="0.00" timeLoss="37.18" rerouteNo="1" devices="tripinfo_car_e2s_61 routing_car_e2s_61" vType="Car" speedFactor="1.00" vaporized=""/>
    <tripinfo id="car_w2n_54" depart="54.00" departLane="w2sep_1" departPos="3.60" departPosLat="0.00" departSpeed="13.90" departDelay="0.00" arrival="245.00" arrivalLane="c2n_1" arrivalPos="990.00" arrivalPosLat="0.00" arrivalSpeed="14.21" duration="191.00" routeLength="1996.47" waitingTime="25.00" waitingCount="2" stopTime="0.00" timeLoss="49.84" rerouteNo="1" devices="tripinfo_car_w2n_54 routing_car_w2n_54" vType="Car" speedFactor="1.03" vaporized=""/>
    <tripinfo id="bus_e2s_62" depart="64.00" departLane="e2sep_1" departPos="12.10" departPosLat="0.00" departSpeed="13.90" departDelay="2.00" arrival="247.00" arrivalLane="c2s_1" arrivalPos="990.00" arrivalPosLat="0.00" arrivalSpeed="13.83" duration="183.00" routeLength="1987.97" waitingTime="17.00" waitingCount="1" stopTime="0.00" timeLoss="39.11" rerouteNo="1" devices="tripinfo_bus_e2s_62 routing_bus_e2s_62" vType="Bus" speedFactor="1.00" vaporized=""/>
    <tripinfo id="car_w2n_56" depart="56.00" departLane="w2sep_1" departPos="3.60" departPosLat="0.00" departSpeed="13.90" departDelay="0.00" arrival="248.00" arrivalLane="c2n_1" arrivalPos="990.00" arrivalPosLat="0.00" arrivalSpeed="14.47" duration="192.00" routeLength="1996.47" waitingTime="24.00" waitingCount="2" stopTime="0.00" timeLoss="53.42" rerouteNo="1" devices="tripinfo_car_w2n_56 routing_car_w2n_56" vType="Car" speedFactor="1.05" vaporized=""/>
    <tripinfo id="car_e2s_66" depart="66.00" departLane="e2sep_1" departPos="3.60" departPosLat="0.00" departSpeed="13.90" departDelay="0.00" arrival="250.00" arrivalLane="c2s_1" arrivalPos="990.00" arrivalPosLat="0.00" arrivalSpeed="15.44" duration="184.00" routeLength="1996.47" waitingTime="16.00" waitingCount="1" stopTime="0.00" timeLoss="55.78" rerouteNo="1" devices="tripinfo_car_e2s_66 routing_car_e2s_66" vType="Car" speedFactor="1.13" vaporized=""/>
    <tripinfo id="car_e2s_75" depart="76.00" departLane="e2sep_1" departPos="3.60" departPosLat="0.00" departSpeed="13.90" departDelay="1.00" arrival="253.00" arrivalLane="c2s_1" arrivalPos="990.00" arrivalPosLat="0.00" arrivalSpeed="13.87" duration="177.00" routeLength="1996.47" waitingTime="10.00" waitingCount="1" stopTime="0.00" timeLoss="32.81" rerouteNo="1" devices="tripinfo_car_e2s_75 routing_car_e2s_75" vType="Car" speedFactor="1.00" vaporized=""/>
    <tripinfo id="car_s2n_75" depart="75.00" departLane="s2sep_1" departPos="3.60" departPosLat="0.00" departSpeed="13.90" departDelay="0.00" arrival="254.00" arrivalLane="c2n_1" arrivalPos="990.00" arrivalPosLat="0.00" arrivalSpeed="14.17" duration="179.00" routeLength="1997.01" waitingTime="27.00" waitingCount="1" stopTime="0.00" timeLoss="37.52" rerouteNo="1" devices="tripinfo_car_s2n_75 routing_car_s2n_75" vType="Car" speedFactor="1.02" vaporized=""/>
    <tripinfo id="car_n2e_100" depart="100.00" departLane="n2sep_1" departPos="3.60" departPosLat="0.00" departSpeed="13.90" departDelay="0.00" arrival="254.00" arrivalLane="c2e_1" arrivalPos="990.00" arrivalPosLat="0.00" arrivalSpeed="15.12" duration="154.00" routeLength="1996.47" waitingTime="6.00" waitingCount="1" stopTime="0.00" timeLoss="21.31" rerouteNo="1" devices="tripinfo_car_n2e_100 routing_car_n2e_100" vType="Car" speedFactor="1.09" vaporized=""/>
    <tripinfo id="car_n2s_73" depart="73.00" departLane="n2sep_1" departPos="3.60" departPosLat="0.00" departSpeed="13.90" departDelay="0.00" arrival="257.00" arrivalLane="c2s_1" arrivalPos="990.00" arrivalPosLat="0.00" arrivalSpeed="13.95" duration="184.00" routeLength="1997.01" waitingTime="28.00" waitingCount="1" stopTime="0.00" timeLoss="40.36" rerouteNo="1" devices="tripinfo_car_n2s_73 routing_car_n2s_73" vType="Car" speedFactor="1.01" vaporized=""/>
    <tripinfo id="car_s2n_95" depart="95.00" departLane="s2sep_1" departPos="3.60" departPosLat="0.00" departSpeed="13.90" departDelay="0.00" arrival="257.00" arrivalLane="c2n_1" arrivalPos="990.00" arrivalPosLat="0.00" arrivalSpeed="14.45" duration="162.00" routeLength="1997.01" waitingTime="10.00" waitingCount="1" stopTime="0.00" timeLoss="24.06" rerouteNo="1" devices="tripinfo_car_s2n_95 routing_car_s2n_95" vType="Car" speedFactor="1.04" vaporized=""/>
    <tripinfo id="car_n2e_112" depart="112.00" departLane="n2sep_1" departPos="3.60" departPosLat="0.00" departSpeed="13.90" departDelay="0.00" arrival="258.00" arrivalLane="c2e_1" arrivalPos="990.00" arrivalPosLat="0.00" arrivalSpeed="15.21" duration="146.00" routeLength="1996.47" waitingTime="0.00" waitingCount="0" stopTime="0.00" timeLoss="14.25" rerouteNo="1" devices="tripinfo_car_n2e_112 routing_car_n2e_112" vType="Car" speedFactor="1.10" vaporized=""/>
    <tripinfo id="car_n2s_80" depart="80.00" departLane="n2sep_1" departPos="3.60" departPosLat="0.00" departSpeed="13.90" departDelay="0.00" arrival="259.00" arrivalLane="c2s_1" arrivalPos="990.00" arrivalPosLat="0.00" arrivalSpeed="15.38" duration="179.00" routeLength="1997.01" waitingTime="28.00" waitingCount="1" stopTime="0.00" timeLoss="54.14" rerouteNo="1" devices="tripinfo_car_n2s_80 routing_car_n2s_80" vType="Car" speedFactor="1.16" vaporized=""/>
    <tripinfo id="car_n2w_84" depart="84.00" departLane="n2sep_1" departPos="3.60" departPosLat="0.00" departSpeed="13.90" departDelay="0.00" arrival="259.00" arrivalLane="c2w_1" arrivalPos="990.00" arrivalPosLat="0.00" arrivalSpeed="14.15" duration="175.00" routeLength="1986.69" waitingTime="21.00" waitingCount="1" stopTime="0.00" timeLoss="33.30" rerouteNo="1" devices="tripinfo_car_n2w_84 routing_car_n2w_84" vType="Car" speedFactor="1.02" vaporized=""/>
    <tripinfo id="car_s2w_73" depart="73.00" departLane="s2sep_1" departPos="3.60" departPosLat="0.00" departSpeed="13.90" departDelay="0.00" arrival="261.00" arrivalLane="c2w_1" arrivalPos="990.00" arrivalPosLat="0.00" arrivalSpeed="15.66" duration="188.00" routeLength="1996.47" waitingTime="41.00" waitingCount="2" stopTime="0.00" timeLoss="64.38" rerouteNo="1" devices="tripinfo_car_s2w_73 routing_car_s2w_73" vType="Car" speedFactor="1.17" vaporized=""/>
    <tripinfo id="car_n2s_125" depart="125.00" departLane="n2sep_1" departPos="3.60" departPosLat="0.00" departSpeed="13.90" departDelay="0.00" arrival="261.00" arrivalLane="c2s_1" arrivalPos="990.00" arrivalPosLat="0.00" arrivalSpeed="15.31" duration="136.00" routeLength="1997.01" waitingTime="0.00" waitingCount="0" stopTime="0.00" timeLoss="9.39" rerouteNo="1" devices="tripinfo_car_n2s_125 routing_car_n2s_125" vType="Car" speedFactor="1.14" vaporized=""/>
    <tripinfo id="car_s2w_77" depart="77.00" departLane="s2sep_1" departPos="3.60" departPosLat="0.00" departSpeed="13.90" departDelay="0.00" arrival="263.00" arrivalLane="c2w_1" arrivalPos="990.00" arrivalPosLat="0.00" arrivalSpeed="15.82" duration="186.00" routeLength="1996.47" waitingTime="37.00" waitingCount="2" stopTime="0.00" timeLoss="63.24" rerouteNo="1" devices="tripinfo_car_s2w_77 routing_car_s2w_77" vType="Car" speedFactor="1.18" vaporized=""/>
    <tripinfo id="car_s2n_131" depart="131.00" departLane="s2sep_1" departPos="3.60" departPosLat="0.00" departSpeed="13.90" departDelay="0.00" arrival="268.00" arrivalLane="c2n_1" arrivalPos="990.00" arrivalPosLat="0.00" arrivalSpeed="15.73" duration="137.00" routeLength="1997.01" waitingTime="0.00" waitingCount="0" stopTime="0.00" timeLoss="9.81" rerouteNo="1" devices="tripinfo_car_s2n_131 routing_car_s2n_131" vType="Car" speedFactor="1.13" vaporized=""/>
    <tripinfo id="car_s2w_102" depart="102.00" departLane="s2sep_1" departPos="3.60" departPosLat="0.00" departSpeed="13.90" departDelay="0.00" arrival="270.00" arrivalLane="c2w_1" arrivalPos="990.00" arrivalPosLat="0.00" arrivalSpeed="14.04" duration="168.00" routeLength="1996.47" waitingTime="5.00" waitingCount="2" stopTime="0.00" timeLoss="24.47" rerouteNo="1" devices="tripinfo_car_s2w_102 routing_car_s2w_102" vType="Car" speedFactor="1.01" vaporized=""/>
    <tripinfo id="car_s2w_109" depart="109.00" departLane="s2sep_1" departPos="3.60" departPosLat="0.00" departSpeed="13.90" departDelay="0.00" arrival="274.00" arrivalLane="c2w_1" arrivalPos="990.00" arrivalPosLat="0.00" arrivalSpeed="13.89" duration="165.00" routeLength="1996.47" waitingTime="3.00" waitingCount="1" stopTime="0.00" timeLoss="20.63" rerouteNo="1" devices="tripinfo_car_s2w_109 routing_car_s2w_109" vType="Car" speedFactor="1.00" vaporized=""/>
    <tripinfo id="car_s2e_124" depart="125.00" departLane="s2sep_1" departPos="3.60" departPosLat="0.00" departSpeed="13.90" departDelay="1.00" arrival="274.00" arrivalLane="c2e_1" arrivalPos="990.00" arrivalPosLat="0.00" arrivalSpeed="13.90" duration="149.00" routeLength="1986.69" waitingTime="0.00" waitingCount="0" stopTime="0.00" timeLoss="5.22" rerouteNo="1" devices="tripinfo_car_s2e_124 routing_car_s2e_124" vType="Car" speedFactor="1.00" vaporized=""/>
    <tripinfo id="car_s2e_139" depart="139.00" departLane="s2sep_1" departPos="3.60" departPosLat="0.00" departSpeed="13.90" departDelay="0.00" arrival="276.00" arrivalLane="c2e_1" arrivalPos="990.00" arrivalPosLat="0.00" arrivalSpeed="15.43" duration="137.00" routeLength="1986.69" waitingTime="0.00" waitingCount="0" stopTime="0.00" timeLoss="12.19" rerouteNo="1" devices="tripinfo_car_s2e_139 routing_car_s2e_139" vType="Car" speedFactor="1.15" vaporized=""/>
    <tripinfo id="car_s2w_123" depart="123.00" departLane="s2sep_1" departPos="3.60" departPosLat="0.00" departSpeed="13.90" departDelay="0.00" arrival="278.00" arrivalLane="c2w_1" arrivalPos="990.00" arrivalPosLat="0.00" arrivalSpeed="13.89" duration="155.00" routeLength="1996.47" waitingTime="0.00" waitingCount="0" stopTime="0.00" timeLoss="10.43" rerouteNo="1" devices="tripinfo_car_s2w_123 routing_car_s2w_123" vType="Car" speedFactor="1.00" vaporized=""/>
    <tripinfo id="car_s2w_128" depart="128.00" departLane="s2sep_1" departPos="3.60" departPosLat="0.00" departSpeed="13.90" departDelay="0.00" arrival="281.00" arrivalLane="c2w_1" arrivalPos="990.00" arrivalPosLat="0.00" arrivalSpeed="14.16" duration="153.00" routeLength="1996.47" waitingTime="0.00" waitingCount="0" stopTime="0.00" timeLoss="11.63" rerouteNo="1" devices="tripinfo_car_s2w_128 routing_car_s2w_128" vType="Car" speedFactor="1.02" vaporized=""/>
    <tripinfo id="car_n2e_122" depart="122.00" departLane="n2sep_1" departPos="3.60" departPosLat="0.00" departSpeed="13.90" departDelay="0.00" arrival="283.00" arrivalLane="c2e_1" arrivalPos="990.00" arrivalPosLat="0.00" arrivalSpeed="13.94" duration="161.00" routeLength="1996.47" waitingTime="5.00" waitingCount="1" stopTime="0.00" timeLoss="16.85" rerouteNo="1" devices="tripinfo_car_n2e_122 routing_car_n2e_122" vType="Car" speedFactor="1.00" vaporized=""/>
    <tripinfo id="car_w2s_139" depart="139.00" departLane="w2sep_1" departPos="3.60" departPosLat="0.00" departSpeed="13.90" departDelay="0.00" arrival="299.00" arrivalLane="c2s_1" arrivalPos="990.00" arrivalPosLat="0.00" arrivalSpeed="13.90" duration="160.00" routeLength="1986.69" waitingTime="7.00" waitingCount="1" stopTime="0.00" timeLoss="16.51" rerouteNo="1" devices="tripinfo_car_w2s_139 routing_car_w2s_139" vType="Car" speedFactor="1.00" vaporized=""/>
    <tripinfo id="car_e2w_106" depart="106.00" departLane="e2sep_1" departPos="3.60" departPosLat="0.00" departSpeed="13.90" departDelay="0.00" arrival="300.00" arrivalLane="c2w_1" arrivalPos="990.00" arrivalPosLat="0.00" arrivalSpeed="13.90" duration="194.00" routeLength="1997.01" waitingTime="40.00" waitingCount="1" stopTime="0.00" timeLoss="49.62" rerouteNo="1" devices="tripinfo_car_e2w_106 routing_car_e2w_106" vType="Car" speedFactor="1.00" vaporized=""/>
    <tripinfo id="car_e2n_107" depart="108.00" departLane="e2sep_1" departPos="3.60" departPosLat="0.00" departSpeed="13.90" departDelay="1.00" arrival="302.00" arrivalLane="c2n_1" arrivalPos="990.00" arrivalPosLat="0.00" arrivalSpeed="13.90" duration="194.00" routeLength="1986.69" waitingTime="37.00" waitingCount="1" stopTime="0.00" timeLoss="50.15" rerouteNo="1" devices="tripinfo_car_e2n_107 routing_car_e2n_107" vType="Car" speedFactor="1.00" vaporized=""/>
    <tripinfo id="car_e2n_136" depart="136.00" departLane="e2sep_1" departPos="3.60" departPosLat="0.00" departSpeed="13.90" departDelay="0.00" arrival="304.00" arrivalLane="c2n_1" arrivalPos="990.00" arrivalPosLat="0.00" arrivalSpeed="15.13" duration="168.00" routeLength="1986.69" waitingTime="21.00" waitingCount="1" stopTime="0.00" timeLoss="39.56" rerouteNo="1" devices="tripinfo_car_e2n_136 routing_car_e2n_136" vType="Car" speedFactor="1.12" vaporized=""/>
    <tripinfo id="car_e2w_108" depart="110.00" departLane="e2sep_1" departPos="3.60" departPosLat="0.00" departSpeed="13.90" departDelay="2.00" arrival="305.00" arrivalLane="c2w_1" arrivalPos="990.00" arrivalPosLat="0.00" arrivalSpeed="13.90" duration="195.00" routeLength="1997.01" waitingTime="35.00" waitingCount="1" stopTime="0.00" timeLoss="51.08" rerouteNo="1" devices="tripinfo_car_e2w_108 routing_car_e2w_108" vType="Car" speedFactor="1.00" vaporized=""/>
    <tripinfo id="car_w2s_159" depart="159.00" departLane="w2sep_1" departPos="3.60" departPosLat="0.00" departSpeed="13.90" departDelay="0.00" arrival="305.00" arrivalLane="c2s_1" arrivalPos="990.00" arrivalPosLat="0.00" arrivalSpeed="14.21" duration="146.00" routeLength="1986.69" waitingTime="0.00" waitingCount="0" stopTime="0.00" timeLoss="5.32" rerouteNo="1" devices="tripinfo_car_w2s_159 routing_car_w2s_159" vType="Car" speedFactor="1.02" vaporized=""/>
    <tripinfo id="car_e2s_110" depart="112.00" departLane="e2sep_1" departPos="3.60" departPosLat="0.00" departSpeed="13.90" departDelay="2.00" arrival="307.00" arrivalLane="c2s_1" arrivalPos="990.00" arrivalPosLat="0.00" arrivalSpeed="15.63" duration="195.00" routeLength="1996.47" waitingTime="44.00" waitingCount="2" stopTime="0.00" timeLoss="71.43" rerouteNo="1" devices="tripinfo_car_e2s_110 routing_car_e2s_110" vType="Car" speedFactor="1.17" vaporized=""/>
    <tripinfo id="car_e2n_137" depart="138.00" departLane="e2sep_1" departPos="3.60" departPosLat="0.00" departSpeed="13.90" departDelay="1.00" arrival="310.00" arrivalLane="c2n_1" arrivalPos="990.00" arrivalPosLat="0.00" arrivalSpeed="14.12" duration="172.00" routeLength="1986.69" waitingTime="14.00" waitingCount="1" stopTime="0.00" timeLoss="30.30" rerouteNo="1" devices="tripinfo_car_e2n_137 routing_car_e2n_137" vType="Car" speedFactor="1.02" vaporized=""/>
    <tripinfo id="car_e2s_111" depart="114.00" departLane="e2sep_1" departPos="3.60" departPosLat="0.00" departSpeed="13.90" departDelay="3.00" arrival="312.00" arrivalLane="c2s_1" arrivalPos="990.00" arrivalPosLat="0.00" arrivalSpeed="14.13" duration="198.00" routeLength="1996.47" waitingTime="34.00" waitingCount="2" stopTime="0.00" timeLoss="55.32" rerouteNo="1" devices="tripinfo_car_e2s_111 routing_car_e2s_111" vType="Car" speedFactor="1.02" vaporized=""/>
    <tripinfo id="car_e2s_139" depart="140.00" departLane="e2sep_1" departPos="3.60" departPosLat="0.00" departSpeed="13.90" departDelay="1.00" arrival="314.00" arrivalLane="c2s_1" arrivalPos="990.00" arrivalPosLat="0.00" arrivalSpeed="15.66" duration="174.00" routeLength="1996.47" waitingTime="18.00" waitingCount="2" stopTime="0.00" timeLoss="50.69" rerouteNo="1" devices="tripinfo_car_e2s_139 routing_car_e2s_139" vType="Car" speedFactor="1.18" vaporized=""/>
    <tripinfo id="car_e2n_143" depart="143.00" departLane="e2sep_1" departPos="3.60" departPosLat="0.00" departSpeed="13.90" departDelay="0.00" arrival="315.00" arrivalLane="c2n_1" arrivalPos="990.00" arrivalPosLat="0.00" arrivalSpeed="13.97" duration="172.00" routeLength="1986.69" waitingTime="10.00" waitingCount="1" stopTime="0.00" timeLoss="28.15" rerouteNo="1" devices="tripinfo_car_e2n_143 routing_car_e2n_143" vType="Car" speedFactor="1.01" vaporized=""/>
    <tripinfo id="car_e2s_150" depart="150.00" departLane="e2sep_1" departPos="3.60" departPosLat="0.00" departSpeed="13.90" departDelay="0.00" arrival="316.00" arrivalLane="c2s_1" arrivalPos="990.00" arrivalPosLat="0.00" arrivalSpeed="15.68" duration="166.00" routeLength="1996.47" waitingTime="11.00" waitingCount="2" stopTime="0.00" timeLoss="41.89" rerouteNo="1" devices="tripinfo_car_e2s_150 routing_car_e2s_150" vType="Car" speedFactor="1.17" vaporized=""/>
    <tripinfo id="car_w2n_136" depart="136.00" departLane="w2sep_1" departPos="3.60" departPosLat="0.00" departSpeed="13.90" departDelay="0.00" arrival="317.00" arrivalLane="c2n_1" arrivalPos="990.00" arrivalPosLat="0.00" arrivalSpeed="14.81" duration="181.00" routeLength="1996.47" waitingTime="29.00" waitingCount="2" stopTime="0.00" timeLoss="47.51" rerouteNo="1" devices="tripinfo_car_w2n_136 routing_car_w2n_136" vType="Car" speedFactor="1.08" vaporized=""/>
    <tripinfo id="bus_e2w_153" depart="153.00" departLane="e2sep_1" departPos="12.10" departPosLat="0.00" departSpeed="13.90" departDelay="0.00" arrival="318.00" arrivalLane="c2w_1" arrivalPos="990.00" arrivalPosLat="0.00" arrivalSpeed="13.90" duration="165.00" routeLength="1988.51" waitingTime="2.00" waitingCount="1" stopTime="0.00" timeLoss="21.01" rerouteNo="1" devices="tripinfo_bus_e2w_153 routing_bus_e2w_153" vType="Bus" speedFactor="1.00" vaporized=""/>
    <tripinfo id="car_e2s_158" depart="158.00" departLane="e2sep_1" departPos="3.60" departPosLat="0.00" departSpeed="13.90" departDelay="0.00" arrival="319.00" arrivalLane="c2s_1" arrivalPos="990.00" arrivalPosLat="0.00" arrivalSpeed="14.41" duration="161.00" routeLength="1996.47" waitingTime="0.00" waitingCount="0" stopTime="0.00" timeLoss="21.74" rerouteNo="1" devices="tripinfo_car_e2s_158 routing_car_e2s_158" vType="Car" speedFactor="1.04" vaporized=""/>
    <tripinfo id="bus_e2n_176" depart="176.00" departLane="e2sep_1" departPos="12.10" departPosLat="0.00" departSpeed="13.90" departDelay="0.00" arrival="328.00" arrivalLane="c2n_1" arrivalPos="990.00" arrivalPosLat="0.00" arrivalSpeed="13.90" duration="152.00" routeLength="1978.19" waitingTime="0.00" waitingCount="0" stopTime="0.00" timeLoss="8.15" rerouteNo="1" devices="tripinfo_bus_e2n_176 routing_bus_e2n_176" vType="Bus" speedFactor="1.00" vaporized=""/>
    <tripinfo id="car_n2w_192" depart="192.00" departLane="n2sep_1" departPos="3.60" departPosLat="0.00" departSpeed="13.90" departDelay="0.00" arrival="334.00" arrivalLane="c2w_1" arrivalPos="990.00" arrivalPosLat="0.00" arrivalSpeed="16.40" duration="142.00" routeLength="1986.69" waitingTime="9.00" waitingCount="1" stopTime="0.00" timeLoss="19.89" rerouteNo="1" devices="tripinfo_car_n2w_192 routing_car_n2w_192" vType="Car" speedFactor="1.18" vaporized=""/>
    <tripinfo id="car_n2s_198" depart="198.00" departLane="n2sep_1" departPos="3.60" departPosLat="0.00" departSpeed="13.90" departDelay="0.00" arrival="341.00" arrivalLane="c2s_1" arrivalPos="990.00" arrivalPosLat="0.00" arrivalSpeed="15.11" duration="143.00" routeLength="1997.01" waitingTime="0.00" waitingCount="0" stopTime="0.00" timeLoss="10.53" rerouteNo="1" devices="tripinfo_car_n2s_198 routing_car_n2s_198" vType="Car" speedFactor="1.09" vaporized=""/>
    <tripinfo id="car_s2n_165" depart="165.00" departLane="s2sep_1" departPos="3.60" departPosLat="0.00" departSpeed="13.90" departDelay="0.00" arrival="343.00" arrivalLane="c2n_1" arrivalPos="990.00" arrivalPosLat="0.00" arrivalSpeed="14.22" duration="178.00" routeLength="1997.01" waitingTime="27.00" waitingCount="1" stopTime="0.00" timeLoss="37.31" rerouteNo="1" devices="tripinfo_car_s2n_165 routing_car_s2n_165" vType="Car" speedFactor="1.02" vaporized=""/>
    <tripinfo id="car_s2w_199" depart="199.00" departLane="s2sep_1" departPos="3.60" departPosLat="0.00" departSpeed="13.90" departDelay="0.00" arrival="347.00" arrivalLane="c2w_1" arrivalPos="990.00" arrivalPosLat="0.00" arrivalSpeed="14.38" duration="148.00" routeLength="1996.47" waitingTime="0.00" waitingCount="0" stopTime="0.00" timeLoss="7.67" rerouteNo="1" devices="tripinfo_car_s2w_199 routing_car_s2w_199" vType="Car" speedFactor="1.03" vaporized=""/>
    <tripinfo id="car_s2n_169" depart="169.00" departLane="s2sep_1" departPos="3.60" departPosLat="0.00" departSpeed="13.90" departDelay="0.00" arrival="349.00" arrivalLane="c2n_1" arrivalPos="990.00" arrivalPosLat="0.00" arrivalSpeed="13.90" duration="180.00" routeLength="1997.01" waitingTime="23.00" waitingCount="1" stopTime="0.00" timeLoss="35.45" rerouteNo="1" devices="tripinfo_car_s2n_169 routing_car_s2n_169" vType="Car" speedFactor="1.00" vaporized=""/>
    <tripinfo id="car_s2e_179" depart="179.00" departLane="s2sep_1" departPos="3.60" departPosLat="0.00" departSpeed="13.90" departDelay="0.00" arrival="349.00" arrivalLane="c2e_1" arrivalPos="990.00" arrivalPosLat="0.00" arrivalSpeed="14.17" duration="170.00" routeLength="1986.69" waitingTime="16.00" waitingCount="1" stopTime="0.00" timeLoss="28.40" rerouteNo="1" devices="tripinfo_car_s2e_179 routing_car_s2e_179" vType="Car" speedFactor="1.02" vaporized=""/>
    <tripinfo id="car_s2e_188" depart="188.00" departLane="s2sep_1" departPos="3.60" departPosLat="0.00" departSpeed="13.90" departDelay="0.00" arrival="355.00" arrivalLane="c2e_1" arrivalPos="990.00" arrivalPosLat="0.00" arrivalSpeed="13.90" duration="167.00" routeLength="1986.69" waitingTime="7.00" waitingCount="1" stopTime="0.00" timeLoss="22.26" rerouteNo="1" devices="tripinfo_car_s2e_188 routing_car_s2e_188" vType="Car" speedFactor="1.00" vaporized=""/>
    <tripinfo id="car_n2s_218" depart="218.00" departLane="n2sep_1" departPos="3.60" departPosLat="0.00" departSpeed="13.90" departDelay="0.00" arrival="357.00" arrivalLane="c2s_1" arrivalPos="990.00" arrivalPosLat="0.00" arrivalSpeed="14.49" duration="139.00" routeLength="1997.01" waitingTime="0.00" waitingCount="0" stopTime="0.00" timeLoss="0.34" rerouteNo="1" devices="tripinfo_car_n2s_218 routing_car_n2s_218" vType="Car" speedFactor="1.04" vaporized=""/>
    <tripinfo id="bus_n2e_164" depart="164.00" departLane="n2sep_1" departPos="12.10" departPosLat="0.00" departSpeed="13.90" departDelay="0.00" arrival="360.00" arrivalLane="c2e_1" arrivalPos="990.00" arrivalPosLat="0.00" arrivalSpeed="13.87" duration="196.00" routeLength="1987.97" waitingTime="31.00" waitingCount="2" stopTime="0.00" timeLoss="51.46" rerouteNo="1" devices="tripinfo_bus_n2e_164 routing_bus_n2e_164" vType="Bus" speedFactor="1.00" vaporized=""/>
    <tripinfo id="car_n2e_184" depart="184.00" departLane="n2sep_1" departPos="3.60" departPosLat="0.00" departSpeed="13.90" departDelay="0.00" arrival="363.00" arrivalLane="c2e_1" arrivalPos="990.00" arrivalPosLat="0.00" arrivalSpeed="14.57" duration="179.00" routeLength="1996.47" waitingTime="14.00" waitingCount="2" stopTime="0.00" timeLoss="41.62" rerouteNo="1" devices="tripinfo_car_n2e_184 routing_car_n2e_184" vType="Car" speedFactor="1.06" vaporized=""/>
    <tripinfo id="car_n2e_202" depart="202.00" departLane="n2sep_1" departPos="3.60" departPosLat="0.00" departSpeed="13.90" departDelay="0.00" arrival="366.00" arrivalLane="c2e_1" arrivalPos="990.00" arrivalPosLat="0.00" arrivalSpeed="14.09" duration="164.00" routeLength="1996.47" waitingTime="2.00" waitingCount="1" stopTime="0.00" timeLoss="21.61" rerouteNo="1" devices="tripinfo_car_n2e_202 routing_car_n2e_202" vType="Car" speedFactor="1.02" vaporized=""/>
    <tripinfo id="car_n2e_236" depart="236.00" departLane="n2sep_1" departPos="3.60" departPosLat="0.00" departSpeed="13.90" departDelay="0.00" arrival="378.00" arrivalLane="c2e_1" arrivalPos="990.00" arrivalPosLat="0.00" arrivalSpeed="14.42" duration="142.00" routeLength="1996.47" waitingTime="0.00" waitingCount="0" stopTime="0.00" timeLoss="2.72" rerouteNo="1" devices="tripinfo_car_n2e_236 routing_car_n2e_236" vType="Car" speedFactor="1.04" vaporized=""/>
    <tripinfo id="bus_s2w_221" depart="221.00" departLane="s2sep_1" departPos="12.10" departPosLat="0.00" departSpeed="13.90" departDelay="0.00" arrival="380.00" arrivalLane="c2w_1" arrivalPos="990.00" arrivalPosLat="0.00" arrivalSpeed="13.90" duration="159.00" routeLength="1987.97" waitingTime="3.00" waitingCount="1" stopTime="0.00" timeLoss="15.16" rerouteNo="1" devices="tripinfo_bus_s2w_221 routing_bus_s2w_221" vType="Bus" speedFactor="1.00" vaporized=""/>
    <tripinfo id="car_w2s_194" depart="194.00" departLane="w2sep_1" departPos="3.60" departPosLat="0.00" departSpeed="13.90" departDelay="0.00" arrival="383.00" arrivalLane="c2s_1" arrivalPos="990.00" arrivalPosLat="0.00" arrivalSpeed="15.32" duration="189.00" routeLength="1986.69" waitingTime="48.00" waitingCount="1" stopTime="0.00" timeLoss="58.39" rerouteNo="1" devices="tripinfo_car_w2s_194 routing_car_w2s_194" vType="Car" speedFactor="1.10" vaporized=""/>
    <tripinfo id="car_s2w_228" depart="228.00" departLane="s2sep_1" departPos="3.60" departPosLat="0.00" departSpeed="13.90" departDelay="0.00" arrival="385.00" arrivalLane="c2w_1" arrivalPos="990.00" arrivalPosLat="0.00" arrivalSpeed="14.12" duration="157.00" routeLength="1996.47" waitingTime="0.00" waitingCount="0" stopTime="0.00" timeLoss="14.30" rerouteNo="1" devices="tripinfo_car_s2w_228 routing_car_s2w_228" vType="Car" speedFactor="1.02" vaporized=""/>
    <tripinfo id="car_e2n_192" depart="192.00" departLane="e2sep_1" departPos="3.60" departPosLat="0.00" departSpeed="13.90" departDelay="0.00" arrival="387.00" arrivalLane="c2n_1" arrivalPos="990.00" arrivalPosLat="0.00" arrivalSpeed="14.35" duration="195.00" routeLength="1986.69" waitingTime="46.00" waitingCount="1" stopTime="0.00" timeLoss="55.83" rerouteNo="1" devices="tripinfo_car_e2n_192 routing_car_e2n_192" vType="Car" speedFactor="1.03" vaporized=""/>
    <tripinfo id="car_e2w_204" depart="204.00" departLane="e2sep_1" departPos="3.60" departPosLat="0.00" departSpeed="13.90" departDelay="0.00" arrival="390.00" arrivalLane="c2w_1" arrivalPos="990.00" arrivalPosLat="0.00" arrivalSpeed="14.32" duration="186.00" routeLength="1997.01" waitingTime="35.00" waitingCount="1" stopTime="0.00" timeLoss="46.45" rerouteNo="1" devices="tripinfo_car_e2w_204 routing_car_e2w_204" vType="Car" speedFactor="1.03" vaporized=""/>
    <tripinfo id="car_w2s_202" depart="202.00" departLane="w2sep_1" departPos="3.60" departPosLat="0.00" departSpeed="13.90" departDelay="0.00" arrival="393.00" arrivalLane="c2s_1" arrivalPos="990.00" arrivalPosLat="0.00" arrivalSpeed="13.90" duration="191.00" routeLength="1986.69" waitingTime="35.00" waitingCount="1" stopTime="0.00" timeLoss="46.67" rerouteNo="1" devices="tripinfo_car_w2s_202 routing_car_w2s_202" vType="Car" speedFactor="1.00" vaporized=""/>
    <tripinfo id="car_e2w_229" depart="229.00" departLane="e2sep_1" departPos="3.60" departPosLat="0.00" departSpeed="13.90" departDelay="0.00" arrival="393.00" arrivalLane="c2w_1" arrivalPos="990.00" arrivalPosLat="0.00" arrivalSpeed="15.06" duration="164.00" routeLength="1997.01" waitingTime="15.00" waitingCount="1" stopTime="0.00" timeLoss="31.85" rerouteNo="1" devices="tripinfo_car_e2w_229 routing_car_e2w_229" vType="Car" speedFactor="1.09" vaporized=""/>
    <tripinfo id="car_w2e_211" depart="212.00" departLane="w2sep_1" departPos="3.60" departPosLat="0.00" departSpeed="13.90" departDelay="1.00" arrival="394.00" arrivalLane="c2e_1" arrivalPos="990.00" arrivalPosLat="0.00" arrivalSpeed="13.92" duration="182.00" routeLength="1997.01" waitingTime="26.00" waitingCount="1" stopTime="0.00" timeLoss="38.32" rerouteNo="1" devices="tripinfo_car_w2e_211 routing_car_w2e_211" vType="Car" speedFactor="1.00" vaporized=""/>
    <tripinfo id="car_w2n_198" depart="198.00" departLane="w2sep_1" departPos="3.60" departPosLat="0.00" departSpeed="13.90" departDelay="0.00" arrival="397.00" arrivalLane="c2n_1" arrivalPos="990.00" arrivalPosLat="0.00" arrivalSpeed="14.00" duration="199.00" routeLength="1996.47" waitingTime="39.00" waitingCount="2" stopTime="0.00" timeLoss="55.05" rerouteNo="1" devices="tripinfo_car_w2n_198 routing_car_w2n_198" vType="Car" speedFactor="1.01" vaporized=""/>
    <tripinfo id="bus_w2s_220" depart="222.00" departLane="w2sep_1" departPos="12.10" departPosLat="0.00" departSpeed="13.90" departDelay="2.00" arrival="400.00" arrivalLane="c2s_1" arrivalPos="990.00" arrivalPosLat="0.00" arrivalSpeed="13.89" duration="178.00" routeLength="1978.19" waitingTime="19.00" waitingCount="1" stopTime="0.00" timeLoss="35.02" rerouteNo="1" devices="tripinfo_bus_w2s_220 routing_bus_w2s_220" vType="Bus" speedFactor="1.00" vaporized=""/>
    <tripinfo id="car_w2n_210" depart="210.00" departLane="w2sep_1" departPos="3.60" departPosLat="0.00" departSpeed="13.90" departDelay="0.00" arrival="401.00" arrivalLane="c2n_1" arrivalPos="990.00" arrivalPosLat="0.00" arrivalSpeed="13.89" duration="191.00" routeLength="1996.47" waitingTime="27.00" waitingCount="1" stopTime="0.00" timeLoss="46.64" rerouteNo="1" devices="tripinfo_car_w2n_210 routing_car_w2n_210" vType="Car" speedFactor="1.00" vaporized=""/>
    <tripinfo id="car_e2s_208" depart="208.00" departLane="e2sep_1" departPos="3.60" departPosLat="0.00" departSpeed="13.90" departDelay="0.00" arrival="403.00" arrivalLane="c2s_1" arrivalPos="990.00" arrivalPosLat="0.00" arrivalSpeed="15.65" duration="195.00" routeLength="1996.47" waitingTime="42.00" waitingCount="2" stopTime="0.00" timeLoss="68.75" rerouteNo="1" devices="tripinfo_car_e2s_208 routing_car_e2s_208" vType="Car" speedFactor="1.15" vaporized=""/>
    <tripinfo id="car_w2n_219" depart="219.00" departLane="w2sep_1" departPos="3.60" departPosLat="0.00" departSpeed="13.90" departDelay="0.00" arrival="405.00" arrivalLane="c2n_1" arrivalPos="990.00" arrivalPosLat="0.00" arrivalSpeed="13.98" duration="186.00" routeLength="1996.47" waitingTime="20.00" waitingCount="1" stopTime="0.00" timeLoss="41.98" rerouteNo="1" devices="tripinfo_car_w2n_219 routing_car_w2n_219" vType="Car" speedFactor="1.01" vaporized=""/>
    <tripinfo id="car_e2s_223" depart="223.00" departLane="e2sep_1" departPos="3.60" departPosLat="0.00" departSpeed="13.90" departDelay="0.00" arrival="407.00" arrivalLane="c2s_1" arrivalPos="990.00" arrivalPosLat="0.00" arrivalSpeed="14.19" duration="184.00" routeLength="1996.47" waitingTime="21.00" waitingCount="2" stopTime="0.00" timeLoss="41.78" rerouteNo="1" devices="tripinfo_car_e2s_223 routing_car_e2s_223" vType="Car" speedFactor="1.02" vaporized=""/>
    <tripinfo id="car_e2n_261" depart="261.00" departLane="e2sep_1" departPos="3.60" departPosLat="0.00" departSpeed="13.90" departDelay="0.00" arrival="411.00" arrivalLane="c2n_1" arrivalPos="990.00" arrivalPosLat="0.00" arrivalSpeed="13.90" duration="150.00" routeLength="1986.69" waitingTime="0.00" waitingCount="0" stopTime="0.00" timeLoss="5.86" rerouteNo="1" devices="tripinfo_car_e2n_261 routing_car_e2n_261" vType="Car" speedFactor="1.00" vaporized=""/>
    <tripinfo id="car_e2s_282" depart="282.00" departLane="e2sep_1" departPos="3.60" departPosLat="0.00" departSpeed="13.90" departDelay="0.00" arrival="412.00" arrivalLane="c2s_1" arrivalPos="990.00" arrivalPosLat="0.00" arrivalSpeed="16.24" duration="130.00" routeLength="1996.47" waitingTime="0.00" waitingCount="0" stopTime="0.00" timeLoss="6.03" rerouteNo="1" devices="tripinfo_car_e2s_282 routing_car_e2s_282" vType="Car" speedFactor="1.17" vaporized=""/>
    <tripinfo id="car_w2n_259" depart="259.00" departLane="w2sep_1" departPos="3.60" departPosLat="0.00" departSpeed="13.90" departDelay="0.00" arrival="413.00" arrivalLane="c2n_1" arrivalPos="990.00" arrivalPosLat="0.00" arrivalSpeed="14.57" duration="154.00" routeLength="1996.47" waitingTime="3.00" waitingCount="1" stopTime="0.00" timeLoss="18.32" rerouteNo="1" devices="tripinfo_car_w2n_259 routing_car_w2n_259" vType="Car" speedFactor="1.07" vaporized=""/>
    <tripinfo id="car_e2n_272" depart="272.00" departLane="e2sep_1" departPos="3.60" departPosLat="0.00" departSpeed="13.90" departDelay="0.00" arrival="420.00" arrivalLane="c2n_1" arrivalPos="990.00" arrivalPosLat="0.00" arrivalSpeed="14.09" duration="148.00" routeLength="1986.69" waitingTime="0.00" waitingCount="0" stopTime="0.00" timeLoss="5.78" rerouteNo="1" devices="tripinfo_car_e2n_272 routing_car_e2n_272" vType="Car" speedFactor="1.01" vaporized=""/>
    <tripinfo id="car_w2n_287" depart="287.00" departLane="w2sep_1" departPos="3.60" departPosLat="0.00" departSpeed="13.90" departDelay="0.00" arrival="423.00" arrivalLane="c2n_1" arrivalPos="990.00" arrivalPosLat="0.00" arrivalSpeed="15.19" duration="136.00" routeLength="1996.47" waitingTime="0.00" waitingCount="0" stopTime="0.00" timeLoss="4.09" rerouteNo="1" devices="tripinfo_car_w2n_287 routing_car_w2n_287" vType="Car" speedFactor="1.10" vaporized=""/>
    <tripinfo id="car_n2s_243" depart="243.00" departLane="n2sep_1" departPos="3.60" departPosLat="0.00" departSpeed="13.90" departDelay="0.00" arrival="436.00" arrivalLane="c2s_1" arrivalPos="990.00" arrivalPosLat="0.00" arrivalSpeed="15.16" duration="193.00" routeLength="1997.01" waitingTime="46.00" waitingCount="1" stopTime="0.00" timeLoss="61.30" rerouteNo="1" devices="tripinfo_car_n2s_243 routing_car_n2s_243" vType="Car" speedFactor="1.09" vaporized=""/>
    <tripinfo id="car_s2n_246" depart="246.00" departLane="s2sep_1" departPos="3.60" departPosLat="0.00" departSpeed="13.90" departDelay="0.00" arrival="436.00" arrivalLane="c2n_1" arrivalPos="990.00" arrivalPosLat="0.00" arrivalSpeed="14.69" duration="190.00" routeLength="1997.01" waitingTime="40.00" waitingCount="1" stopTime="0.00" timeLoss="53.28" rerouteNo="1" devices="tripinfo_car_s2n_246 routing_car_s2n_246" vType="Car" speedFactor="1.06" vaporized=""/>
    <tripinfo id="bus_n2w_230" depart="230.00" departLane="n2sep_1" departPos="12.10" departPosLat="0.00" departSpeed="13.90" departDelay="0.00" arrival="438.00" arrivalLane="c2w_1" arrivalPos="990.00" arrivalPosLat="0.00" arrivalSpeed="13.90" duration="208.00" routeLength="1978.19" waitingTime="52.00" waitingCount="1" stopTime="0.00" timeLoss="64.58" rerouteNo="1" devices="tripinfo_bus_n2w_230 routing_bus_n2w_230" vType="Bus" speedFactor="1.00" vaporized=""/>
    <tripinfo id="bus_s2e_236" depart="236.00" departLane="s2sep_1" departPos="12.10" departPosLat="0.00" departSpeed="13.90" departDelay="0.00" arrival="438.00" arrivalLane="c2e_1" arrivalPos="990.00" arrivalPosLat="0.00" arrivalSpeed="13.90" duration="202.00" routeLength="1978.19" waitingTime="46.00" waitingCount="1" stopTime="0.00" timeLoss="58.58" rerouteNo="1" devices="tripinfo_bus_s2e_236 routing_bus_s2e_236" vType="Bus" speedFactor="1.00" vaporized=""/>
    <tripinfo id="car_s2n_255" depart="255.00" departLane="s2sep_1" departPos="3.60" departPosLat="0.00" departSpeed="13.90" departDelay="0.00" arrival="439.00" arrivalLane="c2n_1" arrivalPos="990.00" arrivalPosLat="0.00" arrivalSpeed="15.50" duration="184.00" routeLength="1997.01" waitingTime="37.00" waitingCount="1" stopTime="0.00" timeLoss="55.15" rerouteNo="1" devices="tripinfo_car_s2n_255 routing_car_s2n_255" vType="Car" speedFactor="1.12" vaporized=""/>
    <tripinfo id="car_n2s_256" depart="256.00" departLane="n2sep_1" departPos="3.60" departPosLat="0.00" departSpeed="13.90" departDelay="0.00" arrival="440.00" arrivalLane="c2s_1" arrivalPos="990.00" arrivalPosLat="0.00" arrivalSpeed="15.23" duration="184.00" routeLength="1997.01" waitingTime="35.00" waitingCount="1" stopTime="0.00" timeLoss="53.03" rerouteNo="1" devices="tripinfo_car_n2s_256 routing_car_n2s_256" vType="Car" speedFactor="1.10" vaporized=""/>
    <tripinfo id="car_s2e_249" depart="250.00" departLane="s2sep_1" departPos="3.60" departPosLat="0.00" departSpeed="13.90" departDelay="1.00" arrival="441.00" arrivalLane="c2e_1" arrivalPos="990.00" arrivalPosLat="0.00" arrivalSpeed="14.98" duration="191.00" routeLength="1986.69" waitingTime="38.00" waitingCount="1" stopTime="0.00" timeLoss="58.56" rerouteNo="1" devices="tripinfo_car_s2e_249 routing_car_s2e_249" vType="Car" speedFactor="1.09" vaporized=""/>
    <tripinfo id="car_n2w_237" depart="238.00" departLane="n2sep_1" departPos="3.60" departPosLat="0.00" departSpeed="13.90" departDelay="1.00" arrival="442.00" arrivalLane="c2w_1" arrivalPos="990.00" arrivalPosLat="0.00" arrivalSpeed="14.47" duration="204.00" routeLength="1986.69" waitingTime="47.00" waitingCount="1" stopTime="0.00" timeLoss="65.65" rerouteNo="1" devices="tripinfo_car_n2w_237 routing_car_n2w_237" vType="Car" speedFactor="1.04" vaporized=""/>
    <tripinfo id="car_n2s_265" depart="265.00" departLane="n2sep_1" departPos="3.60" departPosLat="0.00" departSpeed="13.90" departDelay="0.00" arrival="448.00" arrivalLane="c2s_1" arrivalPos="990.00" arrivalPosLat="0.00" arrivalSpeed="13.90" duration="183.00" routeLength="1997.01" waitingTime="22.00" waitingCount="1" stopTime="0.00" timeLoss="38.47" rerouteNo="1" devices="tripinfo_car_n2s_265 routing_car_n2s_265" vType="Car" speedFactor="1.00" vaporized=""/>
    <tripinfo id="car_s2e_265" depart="265.00" departLane="s2sep_1" departPos="3.60" departPosLat="0.00" departSpeed="13.90" departDelay="0.00" arrival="448.00" arrivalLane="c2e_1" arrivalPos="990.00" arrivalPosLat="0.00" arrivalSpeed="13.90" duration="183.00" routeLength="1986.69" waitingTime="22.00" waitingCount="1" stopTime="0.00" timeLoss="38.78" rerouteNo="1" devices="tripinfo_car_s2e_265 routing_car_s2e_265" vType="Car" speedFactor="1.00" vaporized=""/>
    <tripinfo id="car_s2n_277" depart="277.00" departLane="s2sep_1" departPos="3.60" departPosLat="0.00" departSpeed="13.90" departDelay="0.00" arrival="448.00" arrivalLane="c2n_1" arrivalPos="990.00" arrivalPosLat="0.00" arrivalSpeed="14.80" duration="171.00" routeLength="1997.01" waitingTime="16.00" waitingCount="1" stopTime="0.00" timeLoss="35.96" rerouteNo="1" devices="tripinfo_car_s2n_277 routing_car_s2n_277" vType="Car" speedFactor="1.06" vaporized=""/>
    <tripinfo id="car_s2w_247" depart="248.00" departLane="s2sep_1" departPos="3.60" departPosLat="0.00" departSpeed="13.90" departDelay="1.00" arrival="449.00" arrivalLane="c2w_1" arrivalPos="990.00" arrivalPosLat="0.00" arrivalSpeed="14.04" duration="201.00" routeLength="1996.47" waitingTime="41.00" waitingCount="2" stopTime="0.00" timeLoss="57.46" rerouteNo="1" devices="tripinfo_car_s2w_247 routing_car_s2w_247" vType="Car" speedFactor="1.01" vaporized=""/>
    <tripinfo id="car_s2e_273" depart="273.00" departLane="s2sep_1" departPos="3.60" departPosLat="0.00" departSpeed="13.90" departDelay="0.00" arrival="451.00" arrivalLane="c2e_1" arrivalPos="990.00" arrivalPosLat="0.00" arrivalSpeed="14.32" duration="178.00" routeLength="1986.69" waitingTime="18.00" waitingCount="1" stopTime="0.00" timeLoss="38.79" rerouteNo="1" devices="tripinfo_car_s2e_273 routing_car_s2e_273" vType="Car" speedFactor="1.03" vaporized=""/>
    <tripinfo id="car_s2n_290" depart="290.00" departLane="s2sep_1" departPos="3.60" departPosLat="0.00" departSpeed="13.90" departDelay="0.00" arrival="451.00" arrivalLane="c2n_1" arrivalPos="990.00" arrivalPosLat="0.00" arrivalSpeed="16.13" duration="161.00" routeLength="1997.01" waitingTime="11.00" waitingCount="1" stopTime="0.00" timeLoss="37.97" rerouteNo="1" devices="tripinfo_car_s2n_290 routing_car_s2n_290" vType="Car" speedFactor="1.18" vaporized=""/>
    <tripinfo id="car_s2e_303" depart="304.00" departLane="s2sep_1" departPos="3.60" departPosLat="0.00" departSpeed="13.90" departDelay="1.00" arrival="455.00" arrivalLane="c2e_1" arrivalPos="990.00" arrivalPosLat="0.00" arrivalSpeed="14.87" duration="151.00" routeLength="1986.69" waitingTime="0.00" waitingCount="0" stopTime="0.00" timeLoss="16.82" rerouteNo="1" devices="tripinfo_car_s2e_303 routing_car_s2e_303" vType="Car" speedFactor="1.07" vaporized=""/>
    <tripinfo id="car_s2n_302" depart="302.00" departLane="s2sep_1" departPos="3.60" departPosLat="0.00" departSpeed="13.90" departDelay="0.00" arrival="457.00" arrivalLane="c2n_1" arrivalPos="990.00" arrivalPosLat="0.00" arrivalSpeed="13.94" duration="155.00" routeLength="1997.01" waitingTime="0.00" waitingCount="0" stopTime="0.00" timeLoss="11.77" rerouteNo="1" devices="tripinfo_car_s2n_302 routing_car_s2n_302" vType="Car" speedFactor="1.00" vaporized=""/>
    <tripinfo id="car_s2n_313" depart="313.00" departLane="s2sep_1" departPos="3.60" departPosLat="0.00" departSpeed="13.90" departDelay="0.00" arrival="459.00" arrivalLane="c2n_1" arrivalPos="990.00" arrivalPosLat="0.00" arrivalSpeed="15.44" duration="146.00" routeLength="1997.01" waitingTime="0.00" waitingCount="0" stopTime="0.00" timeLoss="21.29" rerouteNo="1" devices="tripinfo_car_s2n_313 routing_car_s2n_313" vType="Car" speedFactor="1.15" vaporized=""/>
    <tripinfo id="car_s2e_307" depart="307.00" departLane="s2sep_1" departPos="3.60" departPosLat="0.00" departSpeed="13.90" departDelay="0.00" arrival="462.00" arrivalLane="c2e_1" arrivalPos="990.00" arrivalPosLat="0.00" arrivalSpeed="14.22" duration="155.00" routeLength="1986.69" waitingTime="0.00" waitingCount="0" stopTime="0.00" timeLoss="13.91" rerouteNo="1" devices="tripinfo_car_s2e_307 routing_car_s2e_307" vType="Car" speedFactor="1.02" vaporized=""/>
    <tripinfo id="car_n2e_269" depart="269.00" departLane="n2sep_1" departPos="3.60" departPosLat="0.00" departSpeed="13.90" departDelay="0.00" arrival="468.00" arrivalLane="c2e_1" arrivalPos="990.00" arrivalPosLat="0.00" arrivalSpeed="13.90" duration="199.00" routeLength="1996.47" waitingTime="38.00" waitingCount="2" stopTime="0.00" timeLoss="54.08" rerouteNo="1" devices="tripinfo_car_n2e_269 routing_car_n2e_269" vType="Car" speedFactor="1.00" vaporized=""/>
    <tripinfo id="car_n2e_271" depart="271.00" departLane="n2sep_1" departPos="3.60" departPosLat="0.00" departSpeed="13.90" departDelay="0.00" arrival="470.00" arrivalLane="c2e_1" arrivalPos="990.00" arrivalPosLat="0.00" arrivalSpeed="14.65" duration="199.00" routeLength="1996.47" waitingTime="36.00" waitingCount="2" stopTime="0.00" timeLoss="64.35" rerouteNo="1" devices="tripinfo_car_n2e_271 routing_car_n2e_271" vType="Car" speedFactor="1.07" vaporized=""/>
    <tripinfo id="car_s2w_321" depart="321.00" departLane="s2sep_1" departPos="3.60" departPosLat="0.00" departSpeed="13.90" departDelay="0.00" arrival="470.00" arrivalLane="c2w_1" arrivalPos="990.00" arrivalPosLat="0.00" arrivalSpeed="13.90" duration="149.00" routeLength="1996.47" waitingTime="0.00" waitingCount="0" stopTime="0.00" timeLoss="3.73" rerouteNo="1" devices="tripinfo_car_s2w_321 routing_car_s2w_321" vType="Car" speedFactor="1.00" vaporized=""/>
    <tripinfo id="car_n2e_283" depart="283.00" departLane="n2sep_1" departPos="3.60" departPosLat="0.00" departSpeed="13.90" departDelay="0.00" arrival="474.00" arrivalLane="c2e_1" arrivalPos="990.00" arrivalPosLat="0.00" arrivalSpeed="14.11" duration="191.00" routeLength="1996.47" waitingTime="27.00" waitingCount="2" stopTime="0.00" timeLoss="48.51" rerouteNo="1" devices="tripinfo_car_n2e_283 routing_car_n2e_283" vType="Car" speedFactor="1.02" vaporized=""/>
    <tripinfo id="car_n2e_287" depart="287.00" departLane="n2sep_1" departPos="3.60" departPosLat="0.00" departSpeed="13.90" departDelay="0.00" arrival="477.00" arrivalLane="c2e_1" arrivalPos="990.00" arrivalPosLat="0.00" arrivalSpeed="13.98" duration="190.00" routeLength="1996.47" waitingTime="25.00" waitingCount="1" stopTime="0.00" timeLoss="46.53" rerouteNo="1" devices="tripinfo_car_n2e_287 routing_car_n2e_287" vType="Car" speedFactor="1.01" vaporized=""/>
    <tripinfo id="car_w2s_279" depart="279.00" departLane="w2sep_1" departPos="3.60" departPosLat="0.00" departSpeed="13.90" departDelay="0.00" arrival="479.00" arrivalLane="c2s_1" arrivalPos="990.00" arrivalPosLat="0.00" arrivalSpeed="13.90" duration="200.00" routeLength="1986.69" waitingTime="47.00" waitingCount="1" stopTime="0.00" timeLoss="56.51" rerouteNo="1" devices="tripinfo_car_w2s_279 routing_car_w2s_279" vType="Car" speedFactor="1.00" vaporized=""/>
    <tripinfo id="car_n2e_288" depart="289.00" departLane="n2sep_1" departPos="3.60" departPosLat="0.00" departSpeed="13.90" departDelay="1.00" arrival="479.00" arrivalLane="c2e_1" arrivalPos="990.00" arrivalPosLat="0.00" arrivalSpeed="14.82" duration="190.00" routeLength="1996.47" waitingTime="25.00" waitingCount="1" stopTime="0.00" timeLoss="57.98" rerouteNo="1" devices="tripinfo_car_n2e_288 routing_car_n2e_288" vType="Car" speedFactor="1.10" vaporized=""/>
    <tripinfo id="car_e2w_329" depart="329.00" departLane="e2sep_1" departPos="3.60" departPosLat="0.00" departSpeed="13.90" departDelay="0.00" arrival="479.00" arrivalLane="c2w_1" arrivalPos="990.00" arrivalPosLat="0.00" arrivalSpeed="14.02" duration="150.00" routeLength="1997.01" waitingTime="0.00" waitingCount="0" stopTime="0.00" timeLoss="7.16" rerouteNo="1" devices="tripinfo_car_e2w_329 routing_car_e2w_329" vType="Car" speedFactor="1.01" vaporized=""/>
    <tripinfo id="car_e2n_331" depart="331.00" departLane="e2sep_1" departPos="3.60" departPosLat="0.00" departSpeed="13.90" departDelay="0.00" arrival="480.00" arrivalLane="c2n_1" arrivalPos="990.00" arrivalPosLat="0.00" arrivalSpeed="14.35" duration="149.00" routeLength="1986.69" waitingTime="0.00" waitingCount="0" stopTime="0.00" timeLoss="9.52" rerouteNo="1" devices="tripinfo_car_e2n_331 routing_car_e2n_331" vType="Car" speedFactor="1.03" vaporized=""/>
    <tripinfo id="car_w2s_308" depart="308.00" departLane="w2sep_1" departPos="3.60" departPosLat="0.00" departSpeed="13.90" departDelay="0.00" arrival="482.00" arrivalLane="c2s_1" arrivalPos="990.00" arrivalPosLat="0.00" arrivalSpeed="14.65" duration="174.00" routeLength="1986.69" waitingTime="23.00" waitingCount="1" stopTime="0.00" timeLoss="38.28" rerouteNo="1" devices="tripinfo_car_w2s_308 routing_car_w2s_308" vType="Car" speedFactor="1.06" vaporized=""/>
    <tripinfo id="car_e2w_333" depart="333.00" departLane="e2sep_1" departPos="3.60" departPosLat="0.00" departSpeed="13.90" departDelay="0.00" arrival="482.00" arrivalLane="c2w_1" arrivalPos="990.00" arrivalPosLat="0.00" arrivalSpeed="14.77" duration="149.00" routeLength="1997.01" waitingTime="0.00" waitingCount="0" stopTime="0.00" timeLoss="14.14" rerouteNo="1" devices="tripinfo_car_e2w_333 routing_car_e2w_333" vType="Car" speedFactor="1.07" vaporized=""/>
    <tripinfo id="car_w2n_289" depart="289.00" departLane="w2sep_1" departPos="3.60" departPosLat="0.00" departSpeed="13.90" departDelay="0.00" arrival="484.00" arrivalLane="c2n_1" arrivalPos="990.00" arrivalPosLat="0.00" arrivalSpeed="15.21" duration="195.00" routeLength="1996.47" waitingTime="44.00" waitingCount="2" stopTime="0.00" timeLoss="62.91" rerouteNo="1" devices="tripinfo_car_w2n_289 routing_car_w2n_289" vType="Car" speedFactor="1.10" vaporized=""/>
    <tripinfo id="car_e2w_338" depart="338.00" departLane="e2sep_1" departPos="3.60" departPosLat="0.00" departSpeed="13.90" departDelay="0.00" arrival="486.00" arrivalLane="c2w_1" arrivalPos="990.00" arrivalPosLat="0.00" arrivalSpeed="14.41" duration="148.00" routeLength="1997.01" waitingTime="0.00" waitingCount="0" stopTime="0.00" timeLoss="9.13" rerouteNo="1" devices="tripinfo_car_e2w_338 routing_car_e2w_338" vType="Car" speedFactor="1.04" vaporized=""/>
    <tripinfo id="car_e2n_355" depart="355.00" departLane="e2sep_1" departPos="3.60" departPosLat="0.00" departSpeed="13.90" departDelay="0.00" arrival="489.00" arrivalLane="c2n_1" arrivalPos="990.00" arrivalPosLat="0.00" arrivalSpeed="16.18" duration="134.00" routeLength="1986.69" waitingTime="0.00" waitingCount="0" stopTime="0.00" timeLoss="10.15" rerouteNo="1" devices="tripinfo_car_e2n_355 routing_car_e2n_355" vType="Car" speedFactor="1.16" vaporized=""/>
    <tripinfo id="car_w2s_342" depart="342.00" departLane="w2sep_1" departPos="3.60" departPosLat="0.00" departSpeed="13.90" departDelay="0.00" arrival="490.00" arrivalLane="c2s_1" arrivalPos="990.00" arrivalPosLat="0.00" arrivalSpeed="14.06" duration="148.00" routeLength="1986.69" waitingTime="0.00" waitingCount="0" stopTime="0.00" timeLoss="5.42" rerouteNo="1" devices="tripinfo_car_w2s_342 routing_car_w2s_342" vType="Car" speedFactor="1.01" vaporized=""/>
    <tripinfo id="car_w2e_345" depart="345.00" departLane="w2sep_1" departPos="3.60" departPosLat="0.00" departSpeed="13.90" departDelay="0.00" arrival="491.00" arrivalLane="c2e_1" arrivalPos="990.00" arrivalPosLat="0.00" arrivalSpeed="14.11" duration="146.00" routeLength="1997.01" waitingTime="0.00" waitingCount="0" stopTime="0.00" timeLoss="4.08" rerouteNo="1" devices="tripinfo_car_w2e_345 routing_car_w2e_345" vType="Car" speedFactor="1.02" vaporized=""/>
    <tripinfo id="car_e2w_348" depart="349.00" departLane="e2sep_1" departPos="3.60" departPosLat="0.00" departSpeed="13.90" departDelay="1.00" arrival="492.00" arrivalLane="c2w_1" arrivalPos="990.00" arrivalPosLat="0.00" arrivalSpeed="14.23" duration="143.00" routeLength="1997.01" waitingTime="0.00" waitingCount="0" stopTime="0.00" timeLoss="1.95" rerouteNo="1" devices="tripinfo_car_e2w_348 routing_car_e2w_348" vType="Car" speedFactor="1.02" vaporized=""/>
    <tripinfo id="car_e2s_302" depart="302.00" departLane="e2sep_1" departPos="3.60" departPosLat="0.00" departSpeed="13.90" departDelay="0.00" arrival="496.00" arrivalLane="c2s_1" arrivalPos="990.00" arrivalPosLat="0.00" arrivalSpeed="13.96" duration="194.00" routeLength="1996.47" waitingTime="33.00" waitingCount="2" stopTime="0.00" timeLoss="49.45" rerouteNo="1" devices="tripinfo_car_e2s_302 routing_car_e2s_302" vType="Car" speedFactor="1.00" vaporized=""/>
    <tripinfo id="car_e2n_363" depart="363.00" departLane="e2sep_1" departPos="3.60" departPosLat="0.00" departSpeed="13.90" departDelay="0.00" arrival="496.00" arrivalLane="c2n_1" arrivalPos="990.00" arrivalPosLat="0.00" arrivalSpeed="15.86" duration="133.00" routeLength="1986.69" waitingTime="0.00" waitingCount="0" stopTime="0.00" timeLoss="6.57" rerouteNo="1" devices="tripinfo_car_e2n_363 routing_car_e2n_363" vType="Car" speedFactor="1.14" vaporized=""/>
    <tripinfo id="car_e2s_306" depart="306.00" departLane="e2sep_1" departPos="3.60" departPosLat="0.00" departSpeed="13.90" departDelay="0.00" arrival="500.00" arrivalLane="c2s_1" arrivalPos="990.00" arrivalPosLat="0.00" arrivalSpeed="13.89" duration="194.00" routeLength="1996.47" waitingTime="28.00" waitingCount="2" stopTime="0.00" timeLoss="49.04" rerouteNo="1" devices="tripinfo_car_e2s_306 routing_car_e2s_306" vType="Car" speedFactor="1.00" vaporized=""/>
    <tripinfo id="car_w2n_318" depart="318.00" departLane="w2sep_1" departPos="3.60" departPosLat="0.00" departSpeed="13.90" departDelay="0.00" arrival="505.00" arrivalLane="c2n_1" arrivalPos="990.00" arrivalPosLat="0.00" arrivalSpeed="14.35" duration="187.00" routeLength="1996.47" waitingTime="22.00" waitingCount="3" stopTime="0.00" timeLoss="46.81" rerouteNo="1" devices="tripinfo_car_w2n_318 routing_car_w2n_318" vType="Car" speedFactor="1.03" vaporized=""/>
    <tripinfo id="car_w2s_356" depart="356.00" departLane="w2sep_1" departPos="3.60" departPosLat="0.00" departSpeed="13.90" departDelay="0.00" arrival="506.00" arrivalLane="c2s_1" arrivalPos="990.00" arrivalPosLat="0.00" arrivalSpeed="13.90" duration="150.00" routeLength="1986.69" waitingTime="0.00" waitingCount="0" stopTime="0.00" timeLoss="5.85" rerouteNo="1" devices="tripinfo_car_w2s_356 routing_car_w2s_356" vType="Car" speedFactor="1.00" vaporized=""/>
    <tripinfo id="car_w2n_329" depart="329.00" departLane="w2sep_1" departPos="3.60" departPosLat="0.00" departSpeed="13.90" departDelay="0.00" arrival="507.00" arrivalLane="c2n_1" arrivalPos="990.00" arrivalPosLat="0.00" arrivalSpeed="15.23" duration="178.00" routeLength="1996.47" waitingTime="18.00" waitingCount="3" stopTime="0.00" timeLoss="49.03" rerouteNo="1" devices="tripinfo_car_w2n_329 routing_car_w2n_329" vType="Car" speedFactor="1.12" vaporized=""/>
    <tripinfo id="car_w2s_359" depart="359.00" departLane="w2sep_1" departPos="3.60" departPosLat="0.00" departSpeed="13.90" departDelay="0.00" arrival="508.00" arrivalLane="c2s_1" arrivalPos="990.00" arrivalPosLat="0.00" arrivalSpeed="14.75" duration="149.00" routeLength="1986.69" waitingTime="0.00" waitingCount="0" stopTime="0.00" timeLoss="16.15" rerouteNo="1" devices="tripinfo_car_w2s_359 routing_car_w2s_359" vType="Car" speedFactor="1.08" vaporized=""/>
    <tripinfo id="car_w2s_364" depart="364.00" departLane="w2sep_1" departPos="3.60" departPosLat="0.00" departSpeed="13.90" departDelay="0.00" arrival="510.00" arrivalLane="c2s_1" arrivalPos="990.00" arrivalPosLat="0.00" arrivalSpeed="15.13" duration="146.00" routeLength="1986.69" waitingTime="0.00" waitingCount="0" stopTime="0.00" timeLoss="17.37" rerouteNo="1" devices="tripinfo_car_w2s_364 routing_car_w2s_364" vType="Car" speedFactor="1.12" vaporized=""/>
    <tripinfo id="car_s2n_339" depart="339.00" departLane="s2sep_1" departPos="3.60" departPosLat="0.00" departSpeed="13.90" departDelay="0.00" arrival="512.00" arrivalLane="c2n_1" arrivalPos="990.00" arrivalPosLat="0.00" arrivalSpeed="17.03" duration="173.00" routeLength="1997.01" waitingTime="44.00" waitingCount="1" stopTime="0.00" timeLoss="55.82" rerouteNo="1" devices="tripinfo_car_s2n_339 routing_car_s2n_339" vType="Car" speedFactor="1.23" vaporized=""/>
    <tripinfo id="car_e2s_307" depart="308.00" departLane="e2sep_1" departPos="3.60" departPosLat="0.00" departSpeed="13.90" departDelay="1.00" arrival="514.00" arrivalLane="c2s_1" arrivalPos="990.00" arrivalPosLat="0.00" arrivalSpeed="14.32" duration="206.00" routeLength="1996.47" waitingTime="34.00" waitingCount="3" stopTime="0.00" timeLoss="65.58" rerouteNo="1" devices="tripinfo_car_e2s_307 routing_car_e2s_307" vType="Car" speedFactor="1.03" vaporized=""/>
    <tripinfo id="car_n2w_350" depart="350.00" departLane="n2sep_1" departPos="3.60" departPosLat="0.00" departSpeed="13.90" departDelay="0.00" arrival="517.00" arrivalLane="c2w_1" arrivalPos="990.00" arrivalPosLat="0.00" arrivalSpeed="15.48" duration="167.00" routeLength="1986.69" waitingTime="27.00" waitingCount="1" stopTime="0.00" timeLoss="38.09" rerouteNo="1" devices="tripinfo_car_n2w_350 routing_car_n2w_350" vType="Car" speedFactor="1.11" vaporized=""/>
    <tripinfo id="car_e2s_347" depart="347.00" departLane="e2sep_1" departPos="3.60" departPosLat="0.00" departSpeed="13.90" departDelay="0.00" arrival="518.00" arrivalLane="c2s_1" arrivalPos="990.00" arrivalPosLat="0.00" arrivalSpeed="13.94" duration="171.00" routeLength="1996.47" waitingTime="7.00" waitingCount="1" stopTime="0.00" timeLoss="26.79" rerouteNo="1" devices="tripinfo_car_e2s_347 routing_car_e2s_347" vType="Car" speedFactor="1.00" vaporized=""/>
    <tripinfo id="car_s2n_389" depart="389.00" departLane="s2sep_1" departPos="3.60" departPosLat="0.00" departSpeed="13.90" departDelay="0.00" arrival="519.00" arrivalLane="c2n_1" arrivalPos="990.00" arrivalPosLat="0.00" arrivalSpeed="16.39" duration="130.00" routeLength="1997.01" waitingTime="0.00" waitingCount="0" stopTime="0.00" timeLoss="7.75" rerouteNo="1" devices="tripinfo_car_s2n_389 routing_car_s2n_389" vType="Car" speedFactor="1.18" vaporized=""/>
    <tripinfo id="car_s2e_344" depart="344.00" departLane="s2sep_1" departPos="3.60" departPosLat="0.00" departSpeed="13.90" departDelay="0.00" arrival="520.00" arrivalLane="c2e_1" arrivalPos="990.00" arrivalPosLat="1.00" arrivalSpeed="15.56" duration="176.00" routeLength="1986.69" waitingTime="35.00" waitingCount="1" stopTime="0.00" timeLoss="47.04" rerouteNo="1" devices="tripinfo_car_s2e_344 routing_car_s2e_344" vType="Car" speedFactor="1.12" vaporized=""/>
    <tripinfo id="car_e2s_358" depart="358.00" departLane="e2sep_1" departPos="3.60" departPosLat="0.00" departSpeed="13.90" departDelay="0.00" arrival="520.00" arrivalLane="c2s_1" arrivalPos="990.00" arrivalPosLat="0.00" arrivalSpeed="15.16" duration="162.00" routeLength="1996.47" waitingTime="6.00" waitingCount="1" stopTime="0.00" timeLoss="33.77" rerouteNo="1" devices="tripinfo_car_e2s_358 routing_car_e2s_358" vType="Car" speedFactor="1.13" vaporized=""/>
    <tripinfo id="car_n2e_307" depart="307.00" departLane="n2sep_1" departPos="3.60" departPosLat="0.00" departSpeed="13.90" departDelay="0.00" arrival="526.00" arrivalLane="c2e_1" arrivalPos="990.00" arrivalPosLat="1.00" arrivalSpeed="15.33" duration="219.00" routeLength="1996.47" waitingTime="62.00" waitingCount="3" stopTime="0.00" timeLoss="87.90" rerouteNo="1" devices="tripinfo_car_n2e_307 routing_car_n2e_307" vType="Car" speedFactor="1.10" vaporized=""/>
    <tripinfo id="car_n2w_376" depart="376.00" departLane="n2sep_1" departPos="3.60" departPosLat="0.00" departSpeed="13.90" departDelay="0.00" arrival="527.00" arrivalLane="c2w_1" arrivalPos="990.00" arrivalPosLat="0.00" arrivalSpeed="13.96" duration="151.00" routeLength="1986.69" waitingTime="0.00" waitingCount="0" stopTime="0.00" timeLoss="7.99" rerouteNo="1" devices="tripinfo_car_n2w_376 routing_car_n2w_376" vType="Car" speedFactor="1.00" vaporized=""/>
    <tripinfo id="amb_w2e_390" depart="390.00" departLane="w2sep_1" departPos="6.60" departPosLat="0.00" departSpeed="13.90" departDelay="0.00" arrival="528.00" arrivalLane="c2e_1" arrivalPos="990.00" arrivalPosLat="1.00" arrivalSpeed="18.31" duration="138.00" routeLength="1994.01" waitingTime="2.00" waitingCount="1" stopTime="0.00" timeLoss="41.62" rerouteNo="1" devices="tripinfo_amb_w2e_390 routing_amb_w2e_390 bluelight_amb_w2e_390" vType="Ambulance" speedFactor="1.50" vaporized="">
        <bluelight/>
    </tripinfo>
    <tripinfo id="car_n2e_337" depart="337.00" departLane="n2sep_1" departPos="3.60" departPosLat="0.00" departSpeed="13.90" departDelay="0.00" arrival="531.00" arrivalLane="c2e_1" arrivalPos="990.00" arrivalPosLat="1.00" arrivalSpeed="15.83" duration="194.00" routeLength="1996.47" waitingTime="43.00" waitingCount="2" stopTime="0.00" timeLoss="67.50" rerouteNo="1" devices="tripinfo_car_n2e_337 routing_car_n2e_337" vType="Car@car_n2e_337" speedFactor="1.14" vaporized=""/>
    <tripinfo id="car_n2s_405" depart="405.00" departLane="n2sep_1" departPos="3.60" departPosLat="0.00" departSpeed="13.90" departDelay="0.00" arrival="532.00" arrivalLane="c2s_1" arrivalPos="990.00" arrivalPosLat="0.00" arrivalSpeed="15.87" duration="127.00" routeLength="1997.01" waitingTime="0.00" waitingCount="0" stopTime="0.00" timeLoss="0.59" rerouteNo="1" devices="tripinfo_car_n2s_405 routing_car_n2s_405" vType="Car" speedFactor="1.14" vaporized=""/>
    <tripinfo id="car_n2w_381" depart="381.00" departLane="n2sep_1" departPos="3.60" departPosLat="0.00" departSpeed="13.90" departDelay="0.00" arrival="533.00" arrivalLane="c2w_1" arrivalPos="990.00" arrivalPosLat="0.00" arrivalSpeed="13.90" duration="152.00" routeLength="1986.69" waitingTime="0.00" waitingCount="0" stopTime="0.00" timeLoss="7.26" rerouteNo="1" devices="tripinfo_car_n2w_381 routing_car_n2w_381" vType="Car" speedFactor="1.00" vaporized=""/>
    <tripinfo id="car_n2e_365" depart="365.00" departLane="n2sep_1" departPos="3.60" departPosLat="0.00" departSpeed="13.90" departDelay="0.00" arrival="541.00" arrivalLane="c2e_1" arrivalPos="990.00" arrivalPosLat="1.00" arrivalSpeed="13.93" duration="176.00" routeLength="1996.47" waitingTime="9.00" waitingCount="1" stopTime="0.00" timeLoss="31.38" rerouteNo="1" devices="tripinfo_car_n2e_365 routing_car_n2e_365" vType="Car@car_n2e_365" speedFactor="1.00" vaporized=""/>
    <tripinfo id="car_n2e_385" depart="385.00" departLane="n2sep_1" departPos="3.60" departPosLat="0.00" departSpeed="13.90" departDelay="0.00" arrival="543.00" arrivalLane="c2e_1" arrivalPos="990.00" arrivalPosLat="0.00" arrivalSpeed="15.16" duration="158.00" routeLength="1996.47" waitingTime="0.00" waitingCount="0" stopTime="0.00" timeLoss="28.91" rerouteNo="1" devices="tripinfo_car_n2e_385 routing_car_n2e_385" vType="Car" speedFactor="1.12" vaporized=""/>
    <tripinfo id="bus_s2n_405" depart="405.00" departLane="s2sep_1" departPos="12.10" departPosLat="0.00" departSpeed="13.90" departDelay="0.00" arrival="549.00" arrivalLane="c2n_1" arrivalPos="990.00" arrivalPosLat="0.00" arrivalSpeed="13.90" duration="144.00" routeLength="1988.51" waitingTime="0.00" waitingCount="0" stopTime="0.00" timeLoss="0.35" rerouteNo="1" devices="tripinfo_bus_s2n_405 routing_bus_s2n_405" vType="Bus" speedFactor="1.00" vaporized=""/>
</tripinfos>
