<?xml version="1.0" encoding="UTF-8"?>

<!-- generated on Sat Apr 24 18:28:49 2021 by Eclipse SUMO Version 1.4.0
<configuration xmlns:xsi="http://www.w3.org/2001/XMLSchema-instance" xsi:noNamespaceSchemaLocation="http://sumo.dlr.de/xsd/sumoConfiguration.xsd">

    <input>
        <net-file value="sumofiles/junction.net.xml"/>
        <route-files value="sumofiles/junction_preemption_136.rou.xml"/>
        <additional-files value="sumofiles/junction.det.xml"/>
    </input>

    <output>
        <tripinfo-output value="sumofiles/output/tripinfo_preemption_136.xml"/>
    </output>

    <time>
        <begin value="0"/>
        <end value="10000"/>
        <step-length value="0.05"/>
    </time>

    <processing>
        <lateral-resolution value="0.1"/>
    </processing>

    <report>
        <no-warnings value="true"/>
        <error-log value="sumofiles/output/errorlog_preemption_136.log"/>
        <no-step-log value="true"/>
    </report>

    <traci_server>
        <remote-port value="37125"/>
    </traci_server>

    <gui_only>
        <gui-settings-file value="sumofiles/junction-gui.settings.xml"/>
        <tracker-interval value="0.05"/>
    </gui_only>

</configuration>
-->

<tripinfos xmlns:xsi="http://www.w3.org/2001/XMLSchema-instance" xsi:noNamespaceSchemaLocation="http://sumo.dlr.de/xsd/tripinfo_file.xsd">
    <tripinfo id="car_w2e_8" depart="8.00" departLane="w2sep_1" departPos="3.60" departPosLat="0.00" departSpeed="13.90" departDelay="0.00" arrival="140.85" arrivalLane="c2e_1" arrivalPos="990.00" arrivalPosLat="0.00" arrivalSpeed="15.05" duration="132.85" routeLength="1997.01" waitingTime="0.00" waitingCount="0" stopTime="0.00" timeLoss="0.15" rerouteNo="1" devices="tripinfo_car_w2e_8 routing_car_w2e_8" vType="Car" speedFactor="1.08" vaporized=""/>
    <tripinfo id="car_s2e_0" depart="0.00" departLane="s2sep_1" departPos="3.60" departPosLat="0.00" departSpeed="13.90" departDelay="0.00" arrival="161.70" arrivalLane="c2e_1" arrivalPos="990.00" arrivalPosLat="0.00" arrivalSpeed="14.73" duration="161.70" routeLength="1986.69" waitingTime="18.75" waitingCount="1" stopTime="0.00" timeLoss="26.18" rerouteNo="1" devices="tripinfo_car_s2e_0 routing_car_s2e_0" vType="Car" speedFactor="1.06" vaporized=""/>
    <tripinfo id="car_n2w_4" depart="4.00" departLane="n2sep_1" departPos="3.60" departPosLat="0.00" departSpeed="13.90" departDelay="0.00" arrival="161.70" arrivalLane="c2w_1" arrivalPos="990.00" arrivalPosLat="0.00" arrivalSpeed="14.73" duration="157.70" routeLength="1986.69" waitingTime="14.75" waitingCount="1" stopTime="0.00" timeLoss="22.14" rerouteNo="1" devices="tripinfo_car_n2w_4 routing_car_n2w_4" vType="Car" speedFactor="1.06" vaporized=""/>
    <tripinfo id="car_s2n_19" depart="21.15" departLane="s2sep_1" departPos="3.60" departPosLat="0.00" departSpeed="13.90" departDelay="2.15" arrival="165.70" arrivalLane="c2n_1" arrivalPos="990.00" arrivalPosLat="0.00" arrivalSpeed="14.32" duration="144.55" routeLength="1997.01" waitingTime="0.00" waitingCount="0" stopTime="0.00" timeLoss="5.09" rerouteNo="1" devices="tripinfo_car_s2n_19 routing_car_s2n_19" vType="Car" speedFactor="1.03" vaporized=""/>
    <tripinfo id="car_n2w_29" depart="29.00" departLane="n2sep_1" departPos="3.60" departPosLat="0.00" departSpeed="13.90" departDelay="0.00" arrival="166.30" arrivalLane="c2w_1" arrivalPos="990.00" arrivalPosLat="0.00" arrivalSpeed="15.15" duration="137.30" routeLength="1986.69" waitingTime="0.00" waitingCount="0" stopTime="0.00" timeLoss="5.57" rerouteNo="1" devices="tripinfo_car_n2w_29 routing_car_n2w_29" vType="Car" speedFactor="1.09" vaporized=""/>
    <tripinfo id="car_n2s_6" depart="6.00" departLane="n2sep_1" departPos="3.60" departPosLat="0.00" departSpeed="13.90" departDelay="0.00" arrival="167.05" arrivalLane="c2s_1" arrivalPos="990.00" arrivalPosLat="0.00" arrivalSpeed="14.04" duration="161.05" routeLength="1997.01" waitingTime="9.50" waitingCount="1" stopTime="0.00" timeLoss="18.86" rerouteNo="1" devices="tripinfo_car_n2s_6 routing_car_n2s_6" vType="Car" speedFactor="1.01" vaporized=""/>
    <tripinfo id="car_s2w_10" depart="10.00" departLane="s2sep_1" departPos="3.60" departPosLat="0.00" departSpeed="13.90" departDelay="0.00" arrival="173.10" arrivalLane="c2w_1" arrivalPos="990.00" arrivalPosLat="0.00" arrivalSpeed="14.32" duration="163.10" routeLength="1996.47" waitingTime="11.00" waitingCount="2" stopTime="0.00" timeLoss="23.02" rerouteNo="1" devices="tripinfo_car_s2w_10 routing_car_s2w_10" vType="Car" speedFactor="1.03" vaporized=""/>
    <tripinfo id="car_s2e_29" depart="29.00" departLane="s2sep_1" departPos="3.60" departPosLat="0.00" departSpeed="13.90" departDelay="0.00" arrival="173.65" arrivalLane="c2e_1" arrivalPos="990.00" arrivalPosLat="0.00" arrivalSpeed="14.27" duration="144.65" routeLength="1986.69" waitingTime="0.00" waitingCount="0" stopTime="0.00" timeLoss="4.66" rerouteNo="1" devices="tripinfo_car_s2e_29 routing_car_s2e_29" vType="Car" speedFactor="1.03" vaporized=""/>
    <tripinfo id="car_s2n_32" depart="32.00" departLane="s2sep_1" departPos="3.60" departPosLat="0.00" departSpeed="13.90" departDelay="0.00" arrival="173.85" arrivalLane="c2n_1" arrivalPos="990.00" arrivalPosLat="0.00" arrivalSpeed="14.55" duration="141.85" routeLength="1997.01" waitingTime="0.00" waitingCount="0" stopTime="0.00" timeLoss="4.63" rerouteNo="1" devices="tripinfo_car_s2n_32 routing_car_s2n_32" vType="Car" speedFactor="1.05" vaporized=""/>
    <tripinfo id="car_s2w_18" depart="18.00" departLane="s2sep_1" departPos="3.60" departPosLat="0.00" departSpeed="13.90" departDelay="0.00" arrival="177.90" arrivalLane="c2w_1" arrivalPos="990.00" arrivalPosLat="0.00" arrivalSpeed="14.04" duration="159.90" routeLength="1996.47" waitingTime="3.25" waitingCount="1" stopTime="0.00" timeLoss="17.04" rerouteNo="1" devices="tripinfo_car_s2w_18 routing_car_s2w_18" vType="Car" speedFactor="1.01" vaporized=""/>
    <tripinfo id="car_n2e_16" depart="16.00" departLane="n2sep_1" departPos="3.60" departPosLat="0.00" departSpeed="13.90" departDelay="0.00" arrival="178.15" arrivalLane="c2e_1" arrivalPos="990.00" arrivalPosLat="0.00" arrivalSpeed="14.53" duration="162.15" routeLength="1996.47" waitingTime="11.45" waitingCount="2" stopTime="0.00" timeLoss="24.12" rerouteNo="1" devices="tripinfo_car_n2e_16 routing_car_n2e_16" vType="Car" speedFactor="1.05" vaporized=""/>
    <tripinfo id="car_s2w_19" depart="19.45" departLane="s2sep_1" departPos="3.60" departPosLat="0.00" departSpeed="13.90" departDelay="0.45" arrival="180.25" arrivalLane="c2w_1" arrivalPos="990.00" arrivalPosLat="0.00" arrivalSpeed="14.80" duration="160.80" routeLength="1996.47" waitingTime="1.05" waitingCount="1" stopTime="0.00" timeLoss="27.49" rerouteNo="1" devices="tripinfo_car_s2w_19 routing_car_s2w_19" vType="Car" speedFactor="1.08" vaporized=""/>
    <tripinfo id="car_n2s_43" depart="43.00" departLane="n2sep_1" departPos="3.60" departPosLat="0.00" departSpeed="13.90" departDelay="0.00" arrival="186.85" arrivalLane="c2s_1" arrivalPos="990.00" arrivalPosLat="0.00" arrivalSpeed="13.90" duration="143.85" routeLength="1997.01" waitingTime="0.00" waitingCount="0" stopTime="0.00" timeLoss="0.15" rerouteNo="1" devices="tripinfo_car_n2s_43 routing_car_n2s_43" vType="Car" speedFactor="1.00" vaporized=""/>
    <tripinfo id="car_s2n_53" depart="53.00" departLane="s2sep_1" departPos="3.60" departPosLat="0.00" departSpeed="13.90" departDelay="0.00" arrival="194.25" arrivalLane="c2n_1" arrivalPos="990.00" arrivalPosLat="0.00" arrivalSpeed="14.15" duration="141.25" routeLength="1997.01" waitingTime="0.00" waitingCount="0" stopTime="0.00" timeLoss="0.13" rerouteNo="1" devices="tripinfo_car_s2n_53 routing_car_s2n_53" vType="Car" speedFactor="1.02" vaporized=""/>
    <tripinfo id="car_n2s_51" depart="51.00" departLane="n2sep_1" departPos="3.60" departPosLat="0.00" departSpeed="13.90" departDelay="0.00" arrival="195.40" arrivalLane="c2s_1" arrivalPos="990.00" arrivalPosLat="0.00" arrivalSpeed="13.90" duration="144.40" routeLength="1997.01" waitingTime="0.00" waitingCount="0" stopTime="0.00" timeLoss="0.72" rerouteNo="1" devices="tripinfo_car_n2s_51 routing_car_n2s_51" vType="Car" speedFactor="1.00" vaporized=""/>
    <tripinfo id="car_s2w_54" depart="54.40" departLane="s2sep_1" departPos="3.60" departPosLat="0.00" departSpeed="13.90" departDelay="0.40" arrival="203.10" arrivalLane="c2w_1" arrivalPos="990.00" arrivalPosLat="0.00" arrivalSpeed="14.04" duration="148.70" routeLength="1996.47" waitingTime="0.00" waitingCount="0" stopTime="0.00" timeLoss="5.81" rerouteNo="1" devices="tripinfo_car_s2w_54 routing_car_s2w_54" vType="Car" speedFactor="1.01" vaporized=""/>
    <tripinfo id="car_w2e_56" depart="56.45" departLane="w2sep_1" departPos="3.60" departPosLat="0.00" departSpeed="13.90" departDelay="0.45" arrival="209.65" arrivalLane="c2e_1" arrivalPos="990.00" arrivalPosLat="0.00" arrivalSpeed="14.55" duration="153.20" routeLength="1997.01" waitingTime="4.00" waitingCount="1" stopTime="0.00" timeLoss="15.99" rerouteNo="1" devices="tripinfo_car_w2e_56 routing_car_w2e_56" vType="Car" speedFactor="1.05" vaporized=""/>
    <tripinfo id="car_e2n_13" depart="13.00" departLane="e2sep_1" departPos="3.60" departPosLat="0.00" departSpeed="13.90" departDelay="0.00" arrival="210.70" arrivalLane="c2n_1" arrivalPos="990.00" arrivalPosLat="0.00" arrivalSpeed="13.90" duration="197.70" routeLength="1986.69" waitingTime="47.25" waitingCount="1" stopTime="0.00" timeLoss="54.02" rerouteNo="1" devices="tripinfo_car_e2n_13 routing_car_e2n_13" vType="Car" speedFactor="1.00" vaporized=""/>
    <tripinfo id="car_w2s_45" depart="45.00" departLane="w2sep_1" departPos="3.60" departPosLat="0.00" departSpeed="13.90" departDelay="0.00" arrival="210.70" arrivalLane="c2s_1" arrivalPos="990.00" arrivalPosLat="0.00" arrivalSpeed="13.90" duration="165.70" routeLength="1986.69" waitingTime="14.95" waitingCount="1" stopTime="0.00" timeLoss="22.03" rerouteNo="1" devices="tripinfo_car_w2s_45 routing_car_w2s_45" vType="Car" speedFactor="1.00" vaporized=""/>
    <tripinfo id="car_w2e_65" depart="65.00" departLane="w2sep_1" departPos="3.60" departPosLat="0.00" departSpeed="13.90" departDelay="0.00" arrival="212.05" arrivalLane="c2e_1" arrivalPos="990.00" arrivalPosLat="0.00" arrivalSpeed="15.47" duration="147.05" routeLength="1997.01" waitingTime="2.95" waitingCount="1" stopTime="0.00" timeLoss="20.11" rerouteNo="1" devices="tripinfo_car_w2e_65 routing_car_w2e_65" vType="Car" speedFactor="1.13" vaporized=""/>
    <tripinfo id="car_e2s_40" depart="40.00" departLane="e2sep_1" departPos="3.60" departPosLat="0.00" departSpeed="13.90" departDelay="0.00" arrival="212.95" arrivalLane="c2s_1" arrivalPos="990.00" arrivalPosLat="0.00" arrivalSpeed="15.25" duration="172.95" routeLength="1996.47" waitingTime="25.70" waitingCount="2" stopTime="0.00" timeLoss="44.42" rerouteNo="1" devices="tripinfo_car_e2s_40 routing_car_e2s_40" vType="Car" speedFactor="1.12" vaporized=""/>
    <tripinfo id="bus_e2w_35" depart="35.00" departLane="e2sep_1" departPos="12.10" departPosLat="0.00" departSpeed="13.90" departDelay="0.00" arrival="216.10" arrivalLane="c2w_1" arrivalPos="990.00" arrivalPosLat="0.00" arrivalSpeed="13.90" duration="181.10" routeLength="1988.51" waitingTime="27.10" waitingCount="1" stopTime="0.00" timeLoss="38.03" rerouteNo="1" devices="tripinfo_bus_e2w_35 routing_bus_e2w_35" vType="Bus" speedFactor="1.00" vaporized=""/>
    <tripinfo id="car_w2e_83" depart="83.00" departLane="w2sep_1" departPos="3.60" departPosLat="0.00" departSpeed="13.90" departDelay="0.00" arrival="216.75" arrivalLane="c2e_1" arrivalPos="990.00" arrivalPosLat="0.00" arrivalSpeed="16.38" duration="133.75" routeLength="1997.01" waitingTime="0.00" waitingCount="0" stopTime="0.00" timeLoss="11.94" rerouteNo="1" devices="tripinfo_car_w2e_83 routing_car_w2e_83" vType="Car" speedFactor="1.18" vaporized=""/>
    <tripinfo id="car_e2w_44" depart="44.00" departLane="e2sep_1" departPos="3.60" departPosLat="0.00" departSpeed="13.90" departDelay="0.00" arrival="219.60" arrivalLane="c2w_1" arrivalPos="990.00" arrivalPosLat="0.00" arrivalSpeed="14.48" duration="175.60" routeLength="1997.01" waitingTime="21.25" waitingCount="1" stopTime="0.00" timeLoss="38.22" rerouteNo="1" devices="tripinfo_car_e2w_44 routing_car_e2w_44" vType="Car" speedFactor="1.05" vaporized=""/>
    <tripinfo id="car_e2w_50" depart="50.00" departLane="e2sep_1" departPos="3.60" departPosLat="0.00" departSpeed="13.90" departDelay="0.00" arrival="223.55" arrivalLane="c2w_1" arrivalPos="990.00" arrivalPosLat="0.00" arrivalSpeed="13.88" duration="173.55" routeLength="1997.01" waitingTime="14.00" waitingCount="1" stopTime="0.00" timeLoss="29.89" rerouteNo="1" devices="tripinfo_car_e2w_50 routing_car_e2w_50" vType="Car" speedFactor="1.00" vaporized=""/>
    <tripinfo id="car_w2s_76" depart="77.25" departLane="w2sep_1" departPos="3.60" departPosLat="0.00" departSpeed="13.90" departDelay="1.25" arrival="225.40" arrivalLane="c2s_1" arrivalPos="990.00" arrivalPosLat="0.00" arrivalSpeed="13.90" duration="148.15" routeLength="1986.69" waitingTime="0.00" waitingCount="0" stopTime="0.00" timeLoss="4.47" rerouteNo="1" devices="tripinfo_car_w2s_76 routing_car_w2s_76" vType="Car" speedFactor="1.00" vaporized=""/>
    <tripinfo id="car_e2w_63" depart="63.00" departLane="e2sep_1" departPos="3.60" departPosLat="0.00" departSpeed="13.90" departDelay="0.00" arrival="226.85" arrivalLane="c2w_1" arrivalPos="990.00" arrivalPosLat="0.00" arrivalSpeed="13.86" duration="163.85" routeLength="1997.01" waitingTime="2.45" waitingCount="1" stopTime="0.00" timeLoss="20.17" rerouteNo="1" devices="tripinfo_car_e2w_63 routing_car_e2w_63" vType="Car" speedFactor="1.00" vaporized=""/>
    <tripinfo id="car_e2s_90" depart="90.00" departLane="e2sep_1" departPos="3.60" departPosLat="0.00" departSpeed="13.90" departDelay="0.00" arrival="227.30" arrivalLane="c2s_1" arrivalPos="990.00" arrivalPosLat="0.00" arrivalSpeed="15.36" duration="137.30" routeLength="1996.47" waitingTime="0.00" waitingCount="0" stopTime="0.00" timeLoss="12.69" rerouteNo="1" devices="tripinfo_car_e2s_90 routing_car_e2s_90" vType="Car" speedFactor="1.16" vaporized=""/>
    <tripinfo id="car_e2n_80" depart="80.00" departLane="e2sep_1" departPos="3.60" departPosLat="0.00" departSpeed="13.90" departDelay="0.00" arrival="227.75" arrivalLane="c2n_1" arrivalPos="990.00" arrivalPosLat="0.00" arrivalSpeed="13.90" duration="147.75" routeLength="1986.69" waitingTime="0.00" waitingCount="0" stopTime="0.00" timeLoss="4.04" rerouteNo="1" devices="tripinfo_car_e2n_80 routing_car_e2n_80" vType="Car" speedFactor="1.00" vaporized=""/>
    <tripinfo id="car_e2w_72" depart="72.00" departLane="e2sep_1" departPos="3.60" departPosLat="0.00" departSpeed="13.90" departDelay="0.00" arrival="228.65" arrivalLane="c2w_1" arrivalPos="990.00" arrivalPosLat="0.00" arrivalSpeed="15.16" duration="156.65" routeLength="1997.01" waitingTime="1.75" waitingCount="1" stopTime="0.00" timeLoss="32.20" rerouteNo="1" devices="tripinfo_car_e2w_72 routing_car_e2w_72" vType="Car" speedFactor="1.15" vaporized=""/>
    <tripinfo id="car_w2n_52" depart="52.00" departLane="w2sep_1" departPos="3.60" departPosLat="0.00" departSpeed="13.90" departDelay="0.00" arrival="229.65" arrivalLane="c2n_1" arrivalPos="990.00" arrivalPosLat="0.00" arrivalSpeed="15.36" duration="177.65" routeLength="1996.47" waitingTime="29.30" waitingCount="2" stopTime="0.00" timeLoss="53.03" rerouteNo="1" devices="tripinfo_car_w2n_52 routing_car_w2n_52" vType="Car" speedFactor="1.16" vaporized=""/>
    <tripinfo id="car_w2n_55" depart="55.00" departLane="w2sep_1" departPos="3.60" departPosLat="0.00" departSpeed="13.90" departDelay="0.00" arrival="233.45" arrivalLane="c2n_1" arrivalPos="990.00" arrivalPosLat="0.00" arrivalSpeed="14.24" duration="178.45" routeLength="1996.47" waitingTime="22.00" waitingCount="2" stopTime="0.00" timeLoss="37.85" rerouteNo="1" devices="tripinfo_car_w2n_55 routing_car_w2n_55" vType="Car" speedFactor="1.03" vaporized=""/>
    <tripinfo id="car_w2n_76" depart="76.00" departLane="w2sep_1" departPos="3.60" departPosLat="0.00" departSpeed="13.90" departDelay="0.00" arrival="235.35" arrivalLane="c2n_1" arrivalPos="990.00" arrivalPosLat="0.00" arrivalSpeed="15.53" duration="159.35" routeLength="1996.47" waitingTime="12.55" waitingCount="1" stopTime="0.00" timeLoss="36.18" rerouteNo="1" devices="tripinfo_car_w2n_76 routing_car_w2n_76" vType="Car" speedFactor="1.17" vaporized=""/>
    <tripinfo id="car_w2e_99" depart="99.00" departLane="w2sep_1" departPos="3.60" departPosLat="0.00" departSpeed="13.90" departDelay="0.00" arrival="237.95" arrivalLane="c2e_1" arrivalPos="990.00" arrivalPosLat="0.00" arrivalSpeed="14.50" duration="138.95" routeLength="1997.01" waitingTime="0.00" waitingCount="0" stopTime="0.00" timeLoss="1.22" rerouteNo="1" devices="tripinfo_car_w2e_99 routing_car_w2e_99" vType="Car" speedFactor="1.04" vaporized=""/>
    <tripinfo id="car_w2n_79" depart="79.00" departLane="w2sep_1" departPos="3.60" departPosLat="0.00" departSpeed="13.90" departDelay="0.00" arrival="239.15" arrivalLane="c2n_1" arrivalPos="990.00" arrivalPosLat="0.00" arrivalSpeed="14.15" duration="160.15" routeLength="1996.47" waitingTime="3.30" waitingCount="1" stopTime="0.00" timeLoss="18.61" rerouteNo="1" devices="tripinfo_car_w2n_79 routing_car_w2n_79" vType="Car" speedFactor="1.02" vaporized=""/>
    <tripinfo id="car_w2n_94" depart="94.00" departLane="w2sep_1" departPos="3.60" departPosLat="0.00" departSpeed="13.90" departDelay="0.00" arrival="242.60" arrivalLane="c2n_1" arrivalPos="990.00" arrivalPosLat="0.00" arrivalSpeed="14.12" duration="148.60" routeLength="1996.47" waitingTime="0.00" waitingCount="0" stopTime="0.00" timeLoss="6.85" rerouteNo="1" devices="tripinfo_car_w2n_94 routing_car_w2n_94" vType="Car" speedFactor="1.02" vaporized=""/>
    <tripinfo id="car_w2n_100" depart="100.40" departLane="w2sep_1" departPos="3.60" departPosLat="0.00" departSpeed="13.90" departDelay="0.40" arrival="244.95" arrivalLane="c2n_1" arrivalPos="990.00" arrivalPosLat="0.00" arrivalSpeed="14.86" duration="144.55" routeLength="1996.47" waitingTime="0.00" waitingCount="0" stopTime="0.00" timeLoss="11.90" rerouteNo="1" devices="tripinfo_car_w2n_100 routing_car_w2n_100" vType="Car" speedFactor="1.09" vaporized=""/>
    <tripinfo id="car_s2n_54" depart="56.20" departLane="s2sep_1" departPos="3.60" departPosLat="0.00" departSpeed="13.90" departDelay="2.20" arrival="250.45" arrivalLane="c2n_1" arrivalPos="990.00" arrivalPosLat="0.00" arrivalSpeed="15.16" duration="194.25" routeLength="1997.01" waitingTime="47.00" waitingCount="1" stopTime="0.00" timeLoss="62.51" rerouteNo="1" devices="tripinfo_car_s2n_54 routing_car_s2n_54" vType="Car" speedFactor="1.09" vaporized=""/>
    <tripinfo id="car_s2n_57" depart="58.00" departLane="s2sep_1" departPos="3.60" departPosLat="0.00" departSpeed="13.90" departDelay="1.00" arrival="253.50" arrivalLane="c2n_1" arrivalPos="990.00" arrivalPosLat="0.00" arrivalSpeed="15.52" duration="195.50" routeLength="1997.01" waitingTime="45.80" waitingCount="1" stopTime="0.00" timeLoss="67.55" rerouteNo="1" devices="tripinfo_car_s2n_57 routing_car_s2n_57" vType="Car" speedFactor="1.12" vaporized=""/>
    <tripinfo id="car_n2w_75" depart="75.00" departLane="n2sep_1" departPos="3.60" departPosLat="0.00" departSpeed="13.90" departDelay="0.00" arrival="255.30" arrivalLane="c2w_1" arrivalPos="990.00" arrivalPosLat="0.00" arrivalSpeed="13.97" duration="180.30" routeLength="1986.69" waitingTime="30.20" waitingCount="1" stopTime="0.00" timeLoss="37.35" rerouteNo="1" devices="tripinfo_car_n2w_75 routing_car_n2w_75" vType="Car" speedFactor="1.01" vaporized=""/>
    <tripinfo id="car_s2n_70" depart="70.00" departLane="s2sep_1" departPos="3.60" departPosLat="0.00" departSpeed="13.90" departDelay="0.00" arrival="255.80" arrivalLane="c2n_1" arrivalPos="990.00" arrivalPosLat="0.00" arrivalSpeed="16.06" duration="185.80" routeLength="1997.01" waitingTime="38.20" waitingCount="1" stopTime="0.00" timeLoss="63.89" rerouteNo="1" devices="tripinfo_car_s2n_70 routing_car_s2n_70" vType="Car" speedFactor="1.18" vaporized=""/>
    <tripinfo id="car_n2w_91" depart="91.00" departLane="n2sep_1" departPos="3.60" departPosLat="0.00" departSpeed="13.90" departDelay="0.00" arrival="258.85" arrivalLane="c2w_1" arrivalPos="990.00" arrivalPosLat="0.00" arrivalSpeed="14.29" duration="167.85" routeLength="1986.69" waitingTime="16.80" waitingCount="1" stopTime="0.00" timeLoss="28.42" rerouteNo="1" devices="tripinfo_car_n2w_91 routing_car_n2w_91" vType="Car" speedFactor="1.03" vaporized=""/>
    <tripinfo id="car_s2n_94" depart="94.00" departLane="s2sep_1" departPos="3.60" departPosLat="0.00" departSpeed="13.90" departDelay="0.00" arrival="259.95" arrivalLane="c2n_1" arrivalPos="990.00" arrivalPosLat="0.00" arrivalSpeed="15.16" duration="165.95" routeLength="1997.01" waitingTime="20.90" waitingCount="1" stopTime="0.00" timeLoss="34.34" rerouteNo="1" devices="tripinfo_car_s2n_94 routing_car_s2n_94" vType="Car" speedFactor="1.09" vaporized=""/>
    <tripinfo id="car_s2e_68" depart="68.00" departLane="s2sep_1" departPos="3.60" departPosLat="0.00" departSpeed="13.90" departDelay="0.00" arrival="260.20" arrivalLane="c2e_1" arrivalPos="990.00" arrivalPosLat="0.00" arrivalSpeed="13.90" duration="192.20" routeLength="1986.69" waitingTime="38.80" waitingCount="1" stopTime="0.00" timeLoss="48.52" rerouteNo="1" devices="tripinfo_car_s2e_68 routing_car_s2e_68" vType="Car" speedFactor="1.00" vaporized=""/>
    <tripinfo id="car_s2n_115" depart="115.00" departLane="s2sep_1" departPos="3.60" departPosLat="0.00" departSpeed="13.90" departDelay="0.00" arrival="262.65" arrivalLane="c2n_1" arrivalPos="990.00" arrivalPosLat="0.00" arrivalSpeed="16.07" duration="147.65" routeLength="1997.01" waitingTime="1.00" waitingCount="1" stopTime="0.00" timeLoss="24.73" rerouteNo="1" devices="tripinfo_car_s2n_115 routing_car_s2n_115" vType="Car" speedFactor="1.17" vaporized=""/>
    <tripinfo id="bus_n2s_95" depart="95.00" departLane="n2sep_1" departPos="12.10" departPosLat="0.00" departSpeed="13.90" departDelay="0.00" arrival="262.75" arrivalLane="c2s_1" arrivalPos="990.00" arrivalPosLat="0.00" arrivalSpeed="13.90" duration="167.75" routeLength="1988.51" waitingTime="12.85" waitingCount="1" stopTime="0.00" timeLoss="24.68" rerouteNo="1" devices="tripinfo_bus_n2s_95 routing_bus_n2s_95" vType="Bus" speedFactor="1.00" vaporized=""/>
    <tripinfo id="car_n2w_100" depart="100.00" departLane="n2sep_1" departPos="3.60" departPosLat="0.00" departSpeed="13.90" departDelay="0.00" arrival="264.80" arrivalLane="c2w_1" arrivalPos="990.00" arrivalPosLat="0.00" arrivalSpeed="14.04" duration="164.80" routeLength="1986.69" waitingTime="9.20" waitingCount="1" stopTime="0.00" timeLoss="22.56" rerouteNo="1" devices="tripinfo_car_n2w_100 routing_car_n2w_100" vType="Car" speedFactor="1.01" vaporized=""/>
    <tripinfo id="car_n2w_106" depart="106.00" departLane="n2sep_1" departPos="3.60" departPosLat="0.00" departSpeed="13.90" departDelay="0.00" arrival="269.30" arrivalLane="c2w_1" arrivalPos="990.00" arrivalPosLat="0.00" arrivalSpeed="13.89" duration="163.30" routeLength="1986.69" waitingTime="4.20" waitingCount="1" stopTime="0.00" timeLoss="19.62" rerouteNo="1" devices="tripinfo_car_n2w_106 routing_car_n2w_106" vType="Car" speedFactor="1.00" vaporized=""/>
    <tripinfo id="car_n2s_109" depart="109.00" departLane="n2sep_1" departPos="3.60" departPosLat="0.00" departSpeed="13.90" departDelay="0.00" arrival="269.60" arrivalLane="c2s_1" arrivalPos="990.00" arrivalPosLat="0.00" arrivalSpeed="13.90" duration="160.60" routeLength="1997.01" waitingTime="1.45" waitingCount="1" stopTime="0.00" timeLoss="16.90" rerouteNo="1" devices="tripinfo_car_n2s_109 routing_car_n2s_109" vType="Car" speedFactor="1.00" vaporized=""/>
    <tripinfo id="bus_s2e_110" depart="110.00" departLane="s2sep_1" departPos="12.10" departPosLat="0.00" departSpeed="13.90" departDelay="0.00" arrival="269.65" arrivalLane="c2e_1" arrivalPos="990.00" arrivalPosLat="0.00" arrivalSpeed="13.90" duration="159.65" routeLength="1978.19" waitingTime="2.15" waitingCount="1" stopTime="0.00" timeLoss="16.58" rerouteNo="1" devices="tripinfo_bus_s2e_110 routing_bus_s2e_110" vType="Bus" speedFactor="1.00" vaporized=""/>
    <tripinfo id="car_n2w_125" depart="125.00" departLane="n2sep_1" departPos="3.60" departPosLat="0.00" departSpeed="13.90" departDelay="0.00" arrival="273.80" arrivalLane="c2w_1" arrivalPos="990.00" arrivalPosLat="0.00" arrivalSpeed="13.94" duration="148.80" routeLength="1986.69" waitingTime="0.00" waitingCount="0" stopTime="0.00" timeLoss="5.58" rerouteNo="1" devices="tripinfo_car_n2w_125 routing_car_n2w_125" vType="Car" speedFactor="1.00" vaporized=""/>
    <tripinfo id="bus_n2s_127" depart="127.10" departLane="n2sep_1" departPos="12.10" departPosLat="0.00" departSpeed="13.90" departDelay="0.10" arrival="275.65" arrivalLane="c2s_1" arrivalPos="990.00" arrivalPosLat="0.00" arrivalSpeed="13.88" duration="148.55" routeLength="1988.51" waitingTime="0.00" waitingCount="0" stopTime="0.00" timeLoss="5.46" rerouteNo="1" devices="tripinfo_bus_n2s_127 routing_bus_n2s_127" vType="Bus" speedFactor="1.00" vaporized=""/>
    <tripinfo id="car_s2e_127" depart="127.00" departLane="s2sep_1" departPos="3.60" departPosLat="0.00" departSpeed="13.90" departDelay="0.00" arrival="275.75" arrivalLane="c2e_1" arrivalPos="990.00" arrivalPosLat="0.00" arrivalSpeed="13.90" duration="148.75" routeLength="1986.69" waitingTime="0.00" waitingCount="0" stopTime="0.00" timeLoss="5.06" rerouteNo="1" devices="tripinfo_car_s2e_127 routing_car_s2e_127" vType="Car" speedFactor="1.00" vaporized=""/>
    <tripinfo id="car_s2w_83" depart="83.00" departLane="s2sep_1" departPos="3.60" departPosLat="0.00" departSpeed="13.90" departDelay="0.00" arrival="276.00" arrivalLane="c2w_1" arrivalPos="990.00" arrivalPosLat="0.00" arrivalSpeed="14.96" duration="193.00" routeLength="1996.47" waitingTime="46.35" waitingCount="2" stopTime="0.00" timeLoss="62.07" rerouteNo="1" devices="tripinfo_car_s2w_83 routing_car_s2w_83" vType="Car" speedFactor="1.10" vaporized=""/>
    <tripinfo id="car_n2e_63" depart="63.00" departLane="n2sep_1" departPos="3.60" departPosLat="0.00" departSpeed="13.90" departDelay="0.00" arrival="279.95" arrivalLane="c2e_1" arrivalPos="990.00" arrivalPosLat="0.00" arrivalSpeed="13.89" duration="216.95" routeLength="1996.47" waitingTime="60.10" waitingCount="2" stopTime="0.00" timeLoss="72.63" rerouteNo="1" devices="tripinfo_car_n2e_63 routing_car_n2e_63" vType="Car" speedFactor="1.00" vaporized=""/>
    <tripinfo id="car_s2w_98" depart="98.00" departLane="s2sep_1" departPos="3.60" departPosLat="0.00" departSpeed="13.90" departDelay="0.00" arrival="280.00" arrivalLane="c2w_1" arrivalPos="990.00" arrivalPosLat="0.00" arrivalSpeed="14.41" duration="182.00" routeLength="1996.47" waitingTime="27.20" waitingCount="2" stopTime="0.00" timeLoss="42.90" rerouteNo="1" devices="tripinfo_car_s2w_98 routing_car_s2w_98" vType="Car" speedFactor="1.04" vaporized=""/>
    <tripinfo id="car_s2w_120" depart="120.00" departLane="s2sep_1" departPos="3.60" departPosLat="0.00" departSpeed="13.90" departDelay="0.00" arrival="282.45" arrivalLane="c2w_1" arrivalPos="990.00" arrivalPosLat="0.00" arrivalSpeed="15.02" duration="162.45" routeLength="1996.47" waitingTime="12.80" waitingCount="1" stopTime="0.00" timeLoss="30.72" rerouteNo="1" devices="tripinfo_car_s2w_120 routing_car_s2w_120" vType="Car" speedFactor="1.10" vaporized=""/>
    <tripinfo id="car_n2e_119" depart="119.00" departLane="n2sep_1" departPos="3.60" departPosLat="0.00" departSpeed="13.90" departDelay="0.00" arrival="283.15" arrivalLane="c2e_1" arrivalPos="990.00" arrivalPosLat="0.00" arrivalSpeed="14.08" duration="164.15" routeLength="1996.47" waitingTime="9.90" waitingCount="1" stopTime="0.00" timeLoss="22.19" rerouteNo="1" devices="tripinfo_car_n2e_119 routing_car_n2e_119" vType="Car" speedFactor="1.02" vaporized=""/>
    <tripinfo id="car_s2e_140" depart="140.00" departLane="s2sep_1" departPos="3.60" departPosLat="0.00" departSpeed="13.90" departDelay="0.00" arrival="286.35" arrivalLane="c2e_1" arrivalPos="990.00" arrivalPosLat="0.00" arrivalSpeed="14.18" duration="146.35" routeLength="1986.69" waitingTime="0.00" waitingCount="0" stopTime="0.00" timeLoss="6.01" rerouteNo="1" devices="tripinfo_car_s2e_140 routing_car_s2e_140" vType="Car" speedFactor="1.02" vaporized=""/>
    <tripinfo id="car_e2w_157" depart="157.00" departLane="e2sep_1" departPos="3.60" departPosLat="0.00" departSpeed="13.90" departDelay="0.00" arrival="298.30" arrivalLane="c2w_1" arrivalPos="990.00" arrivalPosLat="0.00" arrivalSpeed="16.05" duration="141.30" routeLength="1997.01" waitingTime="4.05" waitingCount="1" stopTime="0.00" timeLoss="16.83" rerouteNo="1" devices="tripinfo_car_e2w_157 routing_car_e2w_157" vType="Car" speedFactor="1.15" vaporized=""/>
    <tripinfo id="car_w2s_114" depart="114.00" departLane="w2sep_1" departPos="3.60" departPosLat="0.00" departSpeed="13.90" departDelay="0.00" arrival="300.65" arrivalLane="c2s_1" arrivalPos="990.00" arrivalPosLat="0.00" arrivalSpeed="13.90" duration="186.65" routeLength="1986.69" waitingTime="35.95" waitingCount="1" stopTime="0.00" timeLoss="42.97" rerouteNo="1" devices="tripinfo_car_w2s_114 routing_car_w2s_114" vType="Car" speedFactor="1.00" vaporized=""/>
    <tripinfo id="car_w2s_141" depart="141.00" departLane="w2sep_1" departPos="3.60" departPosLat="0.00" departSpeed="13.90" departDelay="0.00" arrival="302.70" arrivalLane="c2s_1" arrivalPos="990.00" arrivalPosLat="0.00" arrivalSpeed="15.20" duration="161.70" routeLength="1986.69" waitingTime="17.60" waitingCount="1" stopTime="0.00" timeLoss="34.75" rerouteNo="1" devices="tripinfo_car_w2s_141 routing_car_w2s_141" vType="Car" speedFactor="1.13" vaporized=""/>
    <tripinfo id="bus_e2n_101" depart="101.00" departLane="e2sep_1" departPos="12.10" departPosLat="0.00" departSpeed="13.90" departDelay="0.00" arrival="303.90" arrivalLane="c2n_1" arrivalPos="990.00" arrivalPosLat="0.00" arrivalSpeed="13.90" duration="202.90" routeLength="1978.19" waitingTime="49.75" waitingCount="1" stopTime="0.00" timeLoss="59.87" rerouteNo="1" devices="tripinfo_bus_e2n_101 routing_bus_e2n_101" vType="Bus" speedFactor="1.00" vaporized=""/>
    <tripinfo id="car_e2s_130" depart="130.00" departLane="e2sep_1" departPos="3.60" departPosLat="0.00" departSpeed="13.90" departDelay="0.00" arrival="307.70" arrivalLane="c2s_1" arrivalPos="990.00" arrivalPosLat="0.00" arrivalSpeed="13.90" duration="177.70" routeLength="1996.47" waitingTime="21.15" waitingCount="2" stopTime="0.00" timeLoss="33.39" rerouteNo="1" devices="tripinfo_car_e2s_130 routing_car_e2s_130" vType="Car" speedFactor="1.00" vaporized=""/>
    <tripinfo id="car_w2e_181" depart="181.00" departLane="w2sep_1" departPos="3.60" departPosLat="0.00" departSpeed="13.90" departDelay="0.00" arrival="308.30" arrivalLane="c2e_1" arrivalPos="990.00" arrivalPosLat="0.00" arrivalSpeed="16.40" duration="127.30" routeLength="1997.01" waitingTime="0.00" waitingCount="0" stopTime="0.00" timeLoss="5.49" rerouteNo="1" devices="tripinfo_car_w2e_181 routing_car_w2e_181" vType="Car" speedFactor="1.18" vaporized=""/>
    <tripinfo id="car_e2n_114" depart="114.00" departLane="e2sep_1" departPos="3.60" departPosLat="0.00" departSpeed="13.90" departDelay="0.00" arrival="308.80" arrivalLane="c2n_1" arrivalPos="990.00" arrivalPosLat="0.00" arrivalSpeed="13.89" duration="194.80" routeLength="1986.69" waitingTime="37.60" waitingCount="1" stopTime="0.00" timeLoss="51.14" rerouteNo="1" devices="tripinfo_car_e2n_114 routing_car_e2n_114" vType="Car" speedFactor="1.00" vaporized=""/>
    <tripinfo id="car_e2w_161" depart="161.70" departLane="e2sep_1" departPos="3.60" departPosLat="0.00" departSpeed="13.90" departDelay="0.70" arrival="309.30" arrivalLane="c2w_1" arrivalPos="990.00" arrivalPosLat="0.00" arrivalSpeed="14.46" duration="147.60" routeLength="1997.01" waitingTime="0.00" waitingCount="0" stopTime="0.00" timeLoss="9.42" rerouteNo="1" devices="tripinfo_car_e2w_161 routing_car_e2w_161" vType="Car" speedFactor="1.04" vaporized=""/>
    <tripinfo id="car_e2n_157" depart="158.25" departLane="e2sep_1" departPos="3.60" departPosLat="0.00" departSpeed="13.90" departDelay="1.25" arrival="312.35" arrivalLane="c2n_1" arrivalPos="990.00" arrivalPosLat="0.00" arrivalSpeed="13.94" duration="154.10" routeLength="1986.69" waitingTime="0.00" waitingCount="0" stopTime="0.00" timeLoss="11.16" rerouteNo="1" devices="tripinfo_car_e2n_157 routing_car_e2n_157" vType="Car" speedFactor="1.01" vaporized=""/>
    <tripinfo id="car_w2s_165" depart="165.40" departLane="w2sep_1" departPos="3.60" departPosLat="0.00" departSpeed="13.90" departDelay="0.40" arrival="312.95" arrivalLane="c2s_1" arrivalPos="990.00" arrivalPosLat="0.00" arrivalSpeed="14.22" duration="147.55" routeLength="1986.69" waitingTime="0.00" waitingCount="0" stopTime="0.00" timeLoss="7.13" rerouteNo="1" devices="tripinfo_car_w2s_165 routing_car_w2s_165" vType="Car" speedFactor="1.02" vaporized=""/>
    <tripinfo id="car_w2n_164" depart="164.00" departLane="w2sep_1" departPos="3.60" departPosLat="0.00" departSpeed="13.90" departDelay="0.00" arrival="315.50" arrivalLane="c2n_1" arrivalPos="990.00" arrivalPosLat="0.00" arrivalSpeed="14.15" duration="151.50" routeLength="1996.47" waitingTime="0.95" waitingCount="1" stopTime="0.00" timeLoss="10.31" rerouteNo="1" devices="tripinfo_car_w2n_164 routing_car_w2n_164" vType="Car" speedFactor="1.02" vaporized=""/>
    <tripinfo id="car_w2s_169" depart="169.00" departLane="w2sep_1" departPos="3.60" departPosLat="0.00" departSpeed="13.90" departDelay="0.00" arrival="317.55" arrivalLane="c2s_1" arrivalPos="990.00" arrivalPosLat="0.00" arrivalSpeed="14.17" duration="148.55" routeLength="1986.69" waitingTime="0.00" waitingCount="0" stopTime="0.00" timeLoss="7.64" rerouteNo="1" devices="tripinfo_car_w2s_169 routing_car_w2s_169" vType="Car" speedFactor="1.02" vaporized=""/>
    <tripinfo id="car_w2n_175" depart="175.00" departLane="w2sep_1" departPos="3.60" departPosLat="0.00" departSpeed="13.90" departDelay="0.00" arrival="318.70" arrivalLane="c2n_1" arrivalPos="990.00" arrivalPosLat="0.00" arrivalSpeed="14.61" duration="143.70" routeLength="1996.47" waitingTime="0.00" waitingCount="0" stopTime="0.00" timeLoss="6.99" rerouteNo="1" devices="tripinfo_car_w2n_175 routing_car_w2n_175" vType="Car" speedFactor="1.06" vaporized=""/>
    <tripinfo id="car_e2s_137" depart="137.00" departLane="e2sep_1" departPos="3.60" departPosLat="0.00" departSpeed="13.90" departDelay="0.00" arrival="319.55" arrivalLane="c2s_1" arrivalPos="990.00" arrivalPosLat="0.00" arrivalSpeed="15.32" duration="182.55" routeLength="1996.47" waitingTime="29.85" waitingCount="2" stopTime="0.00" timeLoss="56.22" rerouteNo="1" devices="tripinfo_car_e2s_137 routing_car_e2s_137" vType="Car" speedFactor="1.14" vaporized=""/>
    <tripinfo id="car_w2e_187" depart="187.00" departLane="w2sep_1" departPos="3.60" departPosLat="0.00" departSpeed="13.90" departDelay="0.00" arrival="320.95" arrivalLane="c2e_1" arrivalPos="990.00" arrivalPosLat="0.00" arrivalSpeed="15.11" duration="133.95" routeLength="1997.01" waitingTime="0.00" waitingCount="0" stopTime="0.00" timeLoss="1.74" rerouteNo="1" devices="tripinfo_car_w2e_187 routing_car_w2e_187" vType="Car" speedFactor="1.09" vaporized=""/>
    <tripinfo id="car_w2n_183" depart="183.00" departLane="w2sep_1" departPos="3.60" departPosLat="0.00" departSpeed="13.90" departDelay="0.00" arrival="321.55" arrivalLane="c2n_1" arrivalPos="990.00" arrivalPosLat="0.00" arrivalSpeed="15.20" duration="138.55" routeLength="1996.47" waitingTime="0.00" waitingCount="0" stopTime="0.00" timeLoss="7.63" rerouteNo="1" devices="tripinfo_car_w2n_183 routing_car_w2n_183" vType="Car" speedFactor="1.10" vaporized=""/>
    <tripinfo id="car_e2s_144" depart="144.00" departLane="e2sep_1" departPos="3.60" departPosLat="0.00" departSpeed="13.90" departDelay="0.00" arrival="323.45" arrivalLane="c2s_1" arrivalPos="990.00" arrivalPosLat="0.00" arrivalSpeed="15.53" duration="179.45" routeLength="1996.47" waitingTime="27.10" waitingCount="3" stopTime="0.00" timeLoss="50.49" rerouteNo="1" devices="tripinfo_car_e2s_144 routing_car_e2s_144" vType="Car" speedFactor="1.12" vaporized=""/>
    <tripinfo id="car_e2s_153" depart="153.00" departLane="e2sep_1" departPos="3.60" departPosLat="0.00" departSpeed="13.90" departDelay="0.00" arrival="325.90" arrivalLane="c2s_1" arrivalPos="990.00" arrivalPosLat="0.00" arrivalSpeed="16.14" duration="172.90" routeLength="1996.47" waitingTime="18.95" waitingCount="3" stopTime="0.00" timeLoss="50.46" rerouteNo="1" devices="tripinfo_car_e2s_153 routing_car_e2s_153" vType="Car" speedFactor="1.18" vaporized=""/>
    <tripinfo id="car_e2s_159" depart="160.00" departLane="e2sep_1" departPos="3.60" departPosLat="0.00" departSpeed="13.90" departDelay="1.00" arrival="328.55" arrivalLane="c2s_1" arrivalPos="990.00" arrivalPosLat="0.00" arrivalSpeed="16.11" duration="168.55" routeLength="1996.47" waitingTime="6.95" waitingCount="1" stopTime="0.00" timeLoss="45.35" rerouteNo="1" devices="tripinfo_car_e2s_159 routing_car_e2s_159" vType="Car" speedFactor="1.17" vaporized=""/>
    <tripinfo id="car_e2s_189" depart="190.45" departLane="e2sep_1" departPos="3.60" departPosLat="0.00" departSpeed="13.90" departDelay="1.45" arrival="339.35" arrivalLane="c2s_1" arrivalPos="990.00" arrivalPosLat="0.00" arrivalSpeed="14.13" duration="148.90" routeLength="1996.47" waitingTime="0.00" waitingCount="0" stopTime="0.00" timeLoss="6.97" rerouteNo="1" devices="tripinfo_car_e2s_189 routing_car_e2s_189" vType="Car" speedFactor="1.02" vaporized=""/>
    <tripinfo id="car_s2n_142" depart="142.00" departLane="s2sep_1" departPos="3.60" departPosLat="0.00" departSpeed="13.90" departDelay="0.00" arrival="340.45" arrivalLane="c2n_1" arrivalPos="990.00" arrivalPosLat="0.00" arrivalSpeed="15.05" duration="198.45" routeLength="1997.01" waitingTime="54.30" waitingCount="1" stopTime="0.00" timeLoss="65.71" rerouteNo="1" devices="tripinfo_car_s2n_142 routing_car_s2n_142" vType="Car" speedFactor="1.08" vaporized=""/>
    <tripinfo id="car_e2s_191" depart="192.25" departLane="e2sep_1" departPos="3.60" departPosLat="0.00" departSpeed="13.90" departDelay="1.25" arrival="341.40" arrivalLane="c2s_1" arrivalPos="990.00" arrivalPosLat="0.00" arrivalSpeed="15.42" duration="149.15" routeLength="1996.47" waitingTime="0.00" waitingCount="0" stopTime="0.00" timeLoss="23.39" rerouteNo="1" devices="tripinfo_car_e2s_191 routing_car_e2s_191" vType="Car" speedFactor="1.15" vaporized=""/>
    <tripinfo id="car_n2w_190" depart="190.00" departLane="n2sep_1" departPos="3.60" departPosLat="0.00" departSpeed="13.90" departDelay="0.00" arrival="343.55" arrivalLane="c2w_1" arrivalPos="990.00" arrivalPosLat="0.00" arrivalSpeed="14.32" duration="153.55" routeLength="1986.69" waitingTime="3.35" waitingCount="1" stopTime="0.00" timeLoss="14.14" rerouteNo="1" devices="tripinfo_car_n2w_190 routing_car_n2w_190" vType="Car" speedFactor="1.03" vaporized=""/>
    <tripinfo id="car_s2e_148" depart="148.00" departLane="s2sep_1" departPos="3.60" departPosLat="0.00" departSpeed="13.90" departDelay="0.00" arrival="346.90" arrivalLane="c2e_1" arrivalPos="990.00" arrivalPosLat="0.00" arrivalSpeed="14.12" duration="198.90" routeLength="1986.69" waitingTime="48.55" waitingCount="1" stopTime="0.00" timeLoss="57.47" rerouteNo="1" devices="tripinfo_car_s2e_148 routing_car_s2e_148" vType="Car" speedFactor="1.02" vaporized=""/>
    <tripinfo id="car_n2w_202" depart="202.00" departLane="n2sep_1" departPos="3.60" departPosLat="0.00" departSpeed="13.90" departDelay="0.00" arrival="348.45" arrivalLane="c2w_1" arrivalPos="990.00" arrivalPosLat="0.00" arrivalSpeed="14.20" duration="146.45" routeLength="1986.69" waitingTime="0.00" waitingCount="0" stopTime="0.00" timeLoss="5.88" rerouteNo="1" devices="tripinfo_car_n2w_202 routing_car_n2w_202" vType="Car" speedFactor="1.02" vaporized=""/>
    <tripinfo id="car_s2n_152" depart="152.00" departLane="s2sep_1" departPos="3.60" departPosLat="0.00" departSpeed="13.90" departDelay="0.00" arrival="350.25" arrivalLane="c2n_1" arrivalPos="990.00" arrivalPosLat="0.00" arrivalSpeed="13.90" duration="198.25" routeLength="1997.01" waitingTime="44.30" waitingCount="1" stopTime="0.00" timeLoss="54.57" rerouteNo="1" devices="tripinfo_car_s2n_152 routing_car_s2n_152" vType="Car" speedFactor="1.00" vaporized=""/>
    <tripinfo id="car_s2w_195" depart="195.00" departLane="s2sep_1" departPos="3.60" departPosLat="0.00" departSpeed="13.90" departDelay="0.00" arrival="351.70" arrivalLane="c2w_1" arrivalPos="990.00" arrivalPosLat="0.00" arrivalSpeed="14.44" duration="156.70" routeLength="1996.47" waitingTime="1.60" waitingCount="1" stopTime="0.00" timeLoss="18.30" rerouteNo="1" devices="tripinfo_car_s2w_195 routing_car_s2w_195" vType="Car" speedFactor="1.04" vaporized=""/>
    <tripinfo id="car_s2w_208" depart="208.00" departLane="s2sep_1" departPos="3.60" departPosLat="0.00" departSpeed="13.90" departDelay="0.00" arrival="354.10" arrivalLane="c2w_1" arrivalPos="990.00" arrivalPosLat="0.00" arrivalSpeed="14.94" duration="146.10" routeLength="1996.47" waitingTime="0.00" waitingCount="0" stopTime="0.00" timeLoss="13.91" rerouteNo="1" devices="tripinfo_car_s2w_208 routing_car_s2w_208" vType="Car" speedFactor="1.09" vaporized=""/>
    <tripinfo id="car_n2s_217" depart="217.00" departLane="n2sep_1" departPos="3.60" departPosLat="0.00" departSpeed="13.90" departDelay="0.00" arrival="355.35" arrivalLane="c2s_1" arrivalPos="990.00" arrivalPosLat="0.00" arrivalSpeed="14.50" duration="138.35" routeLength="1997.01" waitingTime="0.00" waitingCount="0" stopTime="0.00" timeLoss="0.65" rerouteNo="1" devices="tripinfo_car_n2s_217 routing_car_n2s_217" vType="Car" speedFactor="1.04" vaporized=""/>
    <tripinfo id="bus_s2e_163" depart="163.00" departLane="s2sep_1" departPos="12.10" departPosLat="0.00" departSpeed="13.90" departDelay="0.00" arrival="355.85" arrivalLane="c2e_1" arrivalPos="990.00" arrivalPosLat="0.00" arrivalSpeed="13.90" duration="192.85" routeLength="1978.19" waitingTime="36.55" waitingCount="1" stopTime="0.00" timeLoss="49.76" rerouteNo="1" devices="tripinfo_bus_s2e_163 routing_bus_s2e_163" vType="Bus" speedFactor="1.00" vaporized=""/>
    <tripinfo id="car_s2n_193" depart="193.00" departLane="s2sep_1" departPos="3.60" departPosLat="0.00" departSpeed="13.90" departDelay="0.00" arrival="357.30" arrivalLane="c2n_1" arrivalPos="990.00" arrivalPosLat="0.00" arrivalSpeed="13.92" duration="164.30" routeLength="1997.01" waitingTime="7.55" waitingCount="1" stopTime="0.00" timeLoss="20.85" rerouteNo="1" devices="tripinfo_car_s2n_193 routing_car_s2n_193" vType="Car" speedFactor="1.00" vaporized=""/>
    <tripinfo id="car_s2w_215" depart="215.00" departLane="s2sep_1" departPos="3.60" departPosLat="0.00" departSpeed="13.90" departDelay="0.00" arrival="359.00" arrivalLane="c2w_1" arrivalPos="990.00" arrivalPosLat="0.00" arrivalSpeed="14.42" duration="144.00" routeLength="1996.47" waitingTime="0.00" waitingCount="0" stopTime="0.00" timeLoss="4.92" rerouteNo="1" devices="tripinfo_car_s2w_215 routing_car_s2w_215" vType="Car" speedFactor="1.04" vaporized=""/>
    <tripinfo id="car_s2n_198" depart="198.00" departLane="s2sep_1" departPos="3.60" departPosLat="0.00" departSpeed="13.90" departDelay="0.00" arrival="361.20" arrivalLane="c2n_1" arrivalPos="990.00" arrivalPosLat="0.00" arrivalSpeed="13.98" duration="163.20" routeLength="1997.01" waitingTime="2.20" waitingCount="1" stopTime="0.00" timeLoss="20.53" rerouteNo="1" devices="tripinfo_car_s2n_198 routing_car_s2n_198" vType="Car" speedFactor="1.01" vaporized=""/>
    <tripinfo id="car_s2w_223" depart="223.00" departLane="s2sep_1" departPos="3.60" departPosLat="0.00" departSpeed="13.90" departDelay="0.00" arrival="361.95" arrivalLane="c2w_1" arrivalPos="990.00" arrivalPosLat="0.00" arrivalSpeed="15.06" duration="138.95" routeLength="1996.47" waitingTime="0.00" waitingCount="0" stopTime="0.00" timeLoss="6.63" rerouteNo="1" devices="tripinfo_car_s2w_223 routing_car_s2w_223" vType="Car" speedFactor="1.09" vaporized=""/>
    <tripinfo id="car_n2e_166" depart="166.00" departLane="n2sep_1" departPos="3.60" departPosLat="0.00" departSpeed="13.90" departDelay="0.00" arrival="362.40" arrivalLane="c2e_1" arrivalPos="990.00" arrivalPosLat="0.00" arrivalSpeed="13.90" duration="196.40" routeLength="1996.47" waitingTime="40.55" waitingCount="2" stopTime="0.00" timeLoss="52.05" rerouteNo="1" devices="tripinfo_car_n2e_166 routing_car_n2e_166" vType="Car" speedFactor="1.00" vaporized=""/>
    <tripinfo id="car_s2n_226" depart="226.00" departLane="s2sep_1" departPos="3.60" departPosLat="0.00" departSpeed="13.90" departDelay="0.00" arrival="363.50" arrivalLane="c2n_1" arrivalPos="990.00" arrivalPosLat="0.00" arrivalSpeed="14.84" duration="137.50" routeLength="1997.01" waitingTime="0.00" waitingCount="0" stopTime="0.00" timeLoss="5.46" rerouteNo="1" devices="tripinfo_car_s2n_226 routing_car_s2n_226" vType="Car" speedFactor="1.09" vaporized=""/>
    <tripinfo id="car_s2n_229" depart="229.00" departLane="s2sep_1" departPos="3.60" departPosLat="0.00" departSpeed="13.90" departDelay="0.00" arrival="366.00" arrivalLane="c2n_1" arrivalPos="990.00" arrivalPosLat="0.00" arrivalSpeed="15.05" duration="137.00" routeLength="1997.01" waitingTime="0.00" waitingCount="0" stopTime="0.00" timeLoss="6.05" rerouteNo="1" devices="tripinfo_car_s2n_229 routing_car_s2n_229" vType="Car" speedFactor="1.10" vaporized=""/>
    <tripinfo id="car_n2e_179" depart="179.00" departLane="n2sep_1" departPos="3.60" departPosLat="0.00" departSpeed="13.90" departDelay="0.00" arrival="372.75" arrivalLane="c2e_1" arrivalPos="990.00" arrivalPosLat="0.00" arrivalSpeed="13.90" duration="193.75" routeLength="1996.47" waitingTime="33.00" waitingCount="3" stopTime="0.00" timeLoss="49.40" rerouteNo="1" devices="tripinfo_car_n2e_179 routing_car_n2e_179" vType="Car" speedFactor="1.00" vaporized=""/>
    <tripinfo id="car_n2e_182" depart="182.00" departLane="n2sep_1" departPos="3.60" departPosLat="0.00" departSpeed="13.90" departDelay="0.00" arrival="375.95" arrivalLane="c2e_1" arrivalPos="990.00" arrivalPosLat="0.00" arrivalSpeed="14.30" duration="193.95" routeLength="1996.47" waitingTime="27.85" waitingCount="3" stopTime="0.00" timeLoss="54.18" rerouteNo="1" devices="tripinfo_car_n2e_182 routing_car_n2e_182" vType="Car" speedFactor="1.03" vaporized=""/>
    <tripinfo id="car_n2e_184" depart="184.00" departLane="n2sep_1" departPos="3.60" departPosLat="0.00" departSpeed="13.90" departDelay="0.00" arrival="379.75" arrivalLane="c2e_1" arrivalPos="990.00" arrivalPosLat="0.00" arrivalSpeed="13.98" duration="195.75" routeLength="1996.47" waitingTime="22.10" waitingCount="3" stopTime="0.00" timeLoss="52.46" rerouteNo="1" devices="tripinfo_car_n2e_184 routing_car_n2e_184" vType="Car" speedFactor="1.01" vaporized=""/>
    <tripinfo id="car_n2e_187" depart="187.00" departLane="n2sep_1" departPos="3.60" departPosLat="0.00" departSpeed="13.90" departDelay="0.00" arrival="382.50" arrivalLane="c2e_1" arrivalPos="990.00" arrivalPosLat="0.00" arrivalSpeed="14.27" duration="195.50" routeLength="1996.47" waitingTime="19.50" waitingCount="3" stopTime="0.00" timeLoss="55.98" rerouteNo="1" devices="tripinfo_car_n2e_187 routing_car_n2e_187" vType="Car" speedFactor="1.03" vaporized=""/>
    <tripinfo id="car_n2e_208" depart="208.00" departLane="n2sep_1" departPos="3.60" departPosLat="0.00" departSpeed="13.90" departDelay="0.00" arrival="385.50" arrivalLane="c2e_1" arrivalPos="990.00" arrivalPosLat="0.00" arrivalSpeed="14.06" duration="177.50" routeLength="1996.47" waitingTime="7.80" waitingCount="2" stopTime="0.00" timeLoss="35.55" rerouteNo="1" devices="tripinfo_car_n2e_208 routing_car_n2e_208" vType="Car" speedFactor="1.02" vaporized=""/>
    <tripinfo id="car_n2e_224" depart="224.00" departLane="n2sep_1" departPos="3.60" departPosLat="0.00" departSpeed="13.90" departDelay="0.00" arrival="387.85" arrivalLane="c2e_1" arrivalPos="990.00" arrivalPosLat="0.00" arrivalSpeed="14.46" duration="163.85" routeLength="1996.47" waitingTime="0.00" waitingCount="0" stopTime="0.00" timeLoss="27.30" rerouteNo="1" devices="tripinfo_car_n2e_224 routing_car_n2e_224" vType="Car" speedFactor="1.06" vaporized=""/>
    <tripinfo id="car_e2n_189" depart="189.00" departLane="e2sep_1" departPos="3.60" departPosLat="0.00" departSpeed="13.90" departDelay="0.00" arrival="390.65" arrivalLane="c2n_1" arrivalPos="990.00" arrivalPosLat="0.00" arrivalSpeed="13.90" duration="201.65" routeLength="1986.69" waitingTime="51.25" waitingCount="1" stopTime="0.00" timeLoss="57.97" rerouteNo="1" devices="tripinfo_car_e2n_189 routing_car_e2n_189" vType="Car" speedFactor="1.00" vaporized=""/>
    <tripinfo id="car_n2e_225" depart="225.35" departLane="n2sep_1" departPos="3.60" departPosLat="0.00" departSpeed="13.90" departDelay="0.35" arrival="390.85" arrivalLane="c2e_1" arrivalPos="990.00" arrivalPosLat="0.00" arrivalSpeed="13.97" duration="165.50" routeLength="1996.47" waitingTime="0.00" waitingCount="0" stopTime="0.00" timeLoss="22.56" rerouteNo="1" devices="tripinfo_car_n2e_225 routing_car_n2e_225" vType="Car" speedFactor="1.01" vaporized=""/>
    <tripinfo id="car_e2w_193" depart="194.00" departLane="e2sep_1" departPos="3.60" departPosLat="0.00" departSpeed="13.90" departDelay="1.00" arrival="392.80" arrivalLane="c2w_1" arrivalPos="990.00" arrivalPosLat="0.00" arrivalSpeed="13.90" duration="198.80" routeLength="1997.01" waitingTime="42.90" waitingCount="1" stopTime="0.00" timeLoss="55.12" rerouteNo="1" devices="tripinfo_car_e2w_193 routing_car_e2w_193" vType="Car" speedFactor="1.00" vaporized=""/>
    <tripinfo id="bus_e2s_217" depart="217.00" departLane="e2sep_1" departPos="12.10" departPosLat="0.00" departSpeed="13.90" departDelay="0.00" arrival="395.15" arrivalLane="c2s_1" arrivalPos="990.00" arrivalPosLat="0.00" arrivalSpeed="13.90" duration="178.15" routeLength="1987.97" waitingTime="23.30" waitingCount="1" stopTime="0.00" timeLoss="34.43" rerouteNo="1" devices="tripinfo_bus_e2s_217 routing_bus_e2s_217" vType="Bus" speedFactor="1.00" vaporized=""/>
    <tripinfo id="car_e2w_250" depart="250.00" departLane="e2sep_1" departPos="3.60" departPosLat="0.00" departSpeed="13.90" departDelay="0.00" arrival="395.35" arrivalLane="c2w_1" arrivalPos="990.00" arrivalPosLat="0.00" arrivalSpeed="14.73" duration="145.35" routeLength="1997.01" waitingTime="0.00" waitingCount="0" stopTime="0.00" timeLoss="11.39" rerouteNo="1" devices="tripinfo_car_e2w_250 routing_car_e2w_250" vType="Car" speedFactor="1.07" vaporized=""/>
    <tripinfo id="car_e2s_229" depart="229.00" departLane="e2sep_1" departPos="3.60" departPosLat="0.00" departSpeed="13.90" departDelay="0.00" arrival="397.80" arrivalLane="c2s_1" arrivalPos="990.00" arrivalPosLat="0.00" arrivalSpeed="15.27" duration="168.80" routeLength="1996.47" waitingTime="19.70" waitingCount="1" stopTime="0.00" timeLoss="40.10" rerouteNo="1" devices="tripinfo_car_e2s_229 routing_car_e2s_229" vType="Car" speedFactor="1.12" vaporized=""/>
    <tripinfo id="car_e2n_252" depart="252.00" departLane="e2sep_1" departPos="3.60" departPosLat="0.00" departSpeed="13.90" departDelay="0.00" arrival="398.90" arrivalLane="c2n_1" arrivalPos="990.00" arrivalPosLat="0.00" arrivalSpeed="14.09" duration="146.90" routeLength="1986.69" waitingTime="0.00" waitingCount="0" stopTime="0.00" timeLoss="5.22" rerouteNo="1" devices="tripinfo_car_e2n_252 routing_car_e2n_252" vType="Car" speedFactor="1.01" vaporized=""/>
    <tripinfo id="car_e2n_253" depart="253.60" departLane="e2sep_1" departPos="3.60" departPosLat="0.00" departSpeed="13.90" departDelay="0.60" arrival="401.75" arrivalLane="c2n_1" arrivalPos="990.00" arrivalPosLat="0.00" arrivalSpeed="14.69" duration="148.15" routeLength="1986.69" waitingTime="0.00" waitingCount="0" stopTime="0.00" timeLoss="13.21" rerouteNo="1" devices="tripinfo_car_e2n_253 routing_car_e2n_253" vType="Car" speedFactor="1.06" vaporized=""/>
    <tripinfo id="car_e2w_270" depart="270.00" departLane="e2sep_1" departPos="3.60" departPosLat="0.00" departSpeed="13.90" departDelay="0.00" arrival="402.25" arrivalLane="c2w_1" arrivalPos="990.00" arrivalPosLat="0.00" arrivalSpeed="15.23" duration="132.25" routeLength="1997.01" waitingTime="0.00" waitingCount="0" stopTime="0.00" timeLoss="1.14" rerouteNo="1" devices="tripinfo_car_e2w_270 routing_car_e2w_270" vType="Car" speedFactor="1.10" vaporized=""/>
    <tripinfo id="car_w2n_247" depart="247.00" departLane="w2sep_1" departPos="3.60" departPosLat="0.00" departSpeed="13.90" departDelay="0.00" arrival="406.85" arrivalLane="c2n_1" arrivalPos="990.00" arrivalPosLat="0.00" arrivalSpeed="13.90" duration="159.85" routeLength="1996.47" waitingTime="7.05" waitingCount="1" stopTime="0.00" timeLoss="15.50" rerouteNo="1" devices="tripinfo_car_w2n_247 routing_car_w2n_247" vType="Car" speedFactor="1.00" vaporized=""/>
    <tripinfo id="car_w2e_269" depart="269.00" departLane="w2sep_1" departPos="3.60" departPosLat="0.00" departSpeed="13.90" departDelay="0.00" arrival="411.60" arrivalLane="c2e_1" arrivalPos="990.00" arrivalPosLat="0.00" arrivalSpeed="14.03" duration="142.60" routeLength="1997.01" waitingTime="0.00" waitingCount="0" stopTime="0.00" timeLoss="0.21" rerouteNo="1" devices="tripinfo_car_w2e_269 routing_car_w2e_269" vType="Car" speedFactor="1.01" vaporized=""/>
    <tripinfo id="car_w2s_269" depart="270.45" departLane="w2sep_1" departPos="3.60" departPosLat="0.00" departSpeed="13.90" departDelay="1.45" arrival="411.70" arrivalLane="c2s_1" arrivalPos="990.00" arrivalPosLat="0.00" arrivalSpeed="15.24" duration="141.25" routeLength="1986.69" waitingTime="0.00" waitingCount="0" stopTime="0.00" timeLoss="10.20" rerouteNo="1" devices="tripinfo_car_w2s_269 routing_car_w2s_269" vType="Car" speedFactor="1.10" vaporized=""/>
    <tripinfo id="car_w2n_254" depart="254.00" departLane="w2sep_1" departPos="3.60" departPosLat="0.00" departSpeed="13.90" departDelay="0.00" arrival="412.35" arrivalLane="c2n_1" arrivalPos="990.00" arrivalPosLat="0.00" arrivalSpeed="13.90" duration="158.35" routeLength="1996.47" waitingTime="2.05" waitingCount="2" stopTime="0.00" timeLoss="14.01" rerouteNo="1" devices="tripinfo_car_w2n_254 routing_car_w2n_254" vType="Car" speedFactor="1.00" vaporized=""/>
    <tripinfo id="amb_w2e_300" depart="300.00" departLane="w2sep_1" departPos="6.60" departPosLat="0.00" departSpeed="13.90" departDelay="0.00" arrival="413.25" arrivalLane="c2e_1" arrivalPos="990.00" arrivalPosLat="-0.95" arrivalSpeed="18.03" duration="113.25" routeLength="1994.01" waitingTime="0.00" waitingCount="0" stopTime="0.00" timeLoss="17.59" rerouteNo="1" devices="tripinfo_amb_w2e_300 routing_amb_w2e_300 bluelight_amb_w2e_300 fcd_amb_w2e_300" vType="Ambulance" speedFactor="1.50" vaporized="">
        <example_device customValue1="0.00" customValue2="-1.00"/>
    </tripinfo>
    <tripinfo id="car_w2e_271" depart="272.15" departLane="w2sep_1" departPos="3.60" departPosLat="0.00" departSpeed="13.90" departDelay="1.15" arrival="413.50" arrivalLane="c2e_1" arrivalPos="990.00" arrivalPosLat="1.10" arrivalSpeed="15.58" duration="141.35" routeLength="1997.01" waitingTime="0.00" waitingCount="0" stopTime="0.00" timeLoss="19.28" rerouteNo="1" devices="tripinfo_car_w2e_271 routing_car_w2e_271" vType="Car@car_w2e_271" speedFactor="1.18" vaporized=""/>
    <tripinfo id="car_w2n_263" depart="263.00" departLane="w2sep_1" departPos="3.60" departPosLat="0.00" departSpeed="13.90" departDelay="0.00" arrival="414.20" arrivalLane="c2n_1" arrivalPos="990.00" arrivalPosLat="0.00" arrivalSpeed="15.39" duration="151.20" routeLength="1996.47" waitingTime="0.00" waitingCount="0" stopTime="0.00" timeLoss="27.71" rerouteNo="1" devices="tripinfo_car_w2n_263 routing_car_w2n_263" vType="Car" speedFactor="1.17" vaporized=""/>
    <tripinfo id="car_w2e_284" depart="284.00" departLane="w2sep_1" departPos="3.60" departPosLat="0.00" departSpeed="13.90" departDelay="0.00" arrival="424.90" arrivalLane="c2e_1" arrivalPos="990.00" arrivalPosLat="1.10" arrivalSpeed="14.23" duration="140.90" routeLength="1997.01" waitingTime="0.00" waitingCount="0" stopTime="0.00" timeLoss="0.51" rerouteNo="1" devices="tripinfo_car_w2e_284 routing_car_w2e_284" vType="Car@car_w2e_284" speedFactor="1.02" vaporized=""/>
    <tripinfo id="car_e2s_286" depart="286.00" departLane="e2sep_1" departPos="3.60" departPosLat="0.00" departSpeed="13.90" departDelay="0.00" arrival="427.10" arrivalLane="c2s_1" arrivalPos="990.00" arrivalPosLat="0.00" arrivalSpeed="16.02" duration="141.10" routeLength="1996.47" waitingTime="6.50" waitingCount="1" stopTime="0.00" timeLoss="15.91" rerouteNo="1" devices="tripinfo_car_e2s_286 routing_car_e2s_286" vType="Car" speedFactor="1.15" vaporized=""/>
    <tripinfo id="car_e2w_281" depart="281.00" departLane="e2sep_1" departPos="3.60" departPosLat="0.00" departSpeed="13.90" departDelay="0.00" arrival="428.65" arrivalLane="c2w_1" arrivalPos="990.00" arrivalPosLat="0.00" arrivalSpeed="15.33" duration="147.65" routeLength="1997.01" waitingTime="13.55" waitingCount="1" stopTime="0.00" timeLoss="17.38" rerouteNo="1" devices="tripinfo_car_e2w_281 routing_car_e2w_281" vType="Car" speedFactor="1.10" vaporized=""/>
    <tripinfo id="car_e2n_294" depart="294.00" departLane="e2sep_1" departPos="3.60" departPosLat="0.00" departSpeed="13.90" departDelay="0.00" arrival="429.65" arrivalLane="c2n_1" arrivalPos="990.00" arrivalPosLat="0.00" arrivalSpeed="15.55" duration="135.65" routeLength="1986.69" waitingTime="0.00" waitingCount="0" stopTime="0.00" timeLoss="7.18" rerouteNo="1" devices="tripinfo_car_e2n_294 routing_car_e2n_294" vType="Car" speedFactor="1.12" vaporized=""/>
    <tripinfo id="car_w2e_287" depart="287.00" departLane="w2sep_1" departPos="3.60" departPosLat="0.00" departSpeed="13.90" departDelay="0.00" arrival="429.75" arrivalLane="c2e_1" arrivalPos="990.00" arrivalPosLat="0.00" arrivalSpeed="14.34" duration="142.75" routeLength="1997.01" waitingTime="0.00" waitingCount="0" stopTime="0.00" timeLoss="3.56" rerouteNo="1" devices="tripinfo_car_w2e_287 routing_car_w2e_287" vType="Car" speedFactor="1.03" vaporized=""/>
    <tripinfo id="car_s2e_238" depart="238.00" departLane="s2sep_1" departPos="3.60" departPosLat="0.00" departSpeed="13.90" departDelay="0.00" arrival="447.90" arrivalLane="c2e_1" arrivalPos="990.00" arrivalPosLat="0.00" arrivalSpeed="14.80" duration="209.90" routeLength="1986.69" waitingTime="67.70" waitingCount="1" stopTime="0.00" timeLoss="75.02" rerouteNo="1" devices="tripinfo_car_s2e_238 routing_car_s2e_238" vType="Car" speedFactor="1.07" vaporized=""/>
    <tripinfo id="car_n2w_242" depart="242.00" departLane="n2sep_1" departPos="3.60" departPosLat="0.00" departSpeed="13.90" departDelay="0.00" arrival="452.15" arrivalLane="c2w_1" arrivalPos="990.00" arrivalPosLat="0.00" arrivalSpeed="13.90" duration="210.15" routeLength="1986.69" waitingTime="59.55" waitingCount="1" stopTime="0.00" timeLoss="66.47" rerouteNo="1" devices="tripinfo_car_n2w_242 routing_car_n2w_242" vType="Car" speedFactor="1.00" vaporized=""/>
    <tripinfo id="car_s2n_263" depart="263.00" departLane="s2sep_1" departPos="3.60" departPosLat="0.00" departSpeed="13.90" departDelay="0.00" arrival="453.15" arrivalLane="c2n_1" arrivalPos="990.00" arrivalPosLat="0.00" arrivalSpeed="14.13" duration="190.15" routeLength="1997.01" waitingTime="40.45" waitingCount="1" stopTime="0.00" timeLoss="48.84" rerouteNo="1" devices="tripinfo_car_s2n_263 routing_car_s2n_263" vType="Car" speedFactor="1.02" vaporized=""/>
    <tripinfo id="car_n2w_253" depart="253.00" departLane="n2sep_1" departPos="3.60" departPosLat="0.00" departSpeed="13.90" departDelay="0.00" arrival="455.45" arrivalLane="c2w_1" arrivalPos="990.00" arrivalPosLat="0.00" arrivalSpeed="14.33" duration="202.45" routeLength="1986.69" waitingTime="51.15" waitingCount="1" stopTime="0.00" timeLoss="63.55" rerouteNo="1" devices="tripinfo_car_n2w_253 routing_car_n2w_253" vType="Car" speedFactor="1.03" vaporized=""/>
    <tripinfo id="car_n2s_278" depart="278.00" departLane="n2sep_1" departPos="3.60" departPosLat="0.00" departSpeed="13.90" departDelay="0.00" arrival="456.70" arrivalLane="c2s_1" arrivalPos="990.00" arrivalPosLat="0.00" arrivalSpeed="14.89" duration="178.70" routeLength="1997.01" waitingTime="31.40" waitingCount="1" stopTime="0.00" timeLoss="44.52" rerouteNo="1" devices="tripinfo_car_n2s_278 routing_car_n2s_278" vType="Car" speedFactor="1.07" vaporized=""/>
    <tripinfo id="car_s2e_284" depart="284.00" departLane="s2sep_1" departPos="3.60" departPosLat="0.00" departSpeed="13.90" departDelay="0.00" arrival="457.15" arrivalLane="c2e_1" arrivalPos="990.00" arrivalPosLat="0.00" arrivalSpeed="14.75" duration="173.15" routeLength="1986.69" waitingTime="23.10" waitingCount="1" stopTime="0.00" timeLoss="37.70" rerouteNo="1" devices="tripinfo_car_s2e_284 routing_car_s2e_284" vType="Car" speedFactor="1.06" vaporized=""/>
    <tripinfo id="car_n2w_264" depart="264.00" departLane="n2sep_1" departPos="3.60" departPosLat="0.00" departSpeed="13.90" departDelay="0.00" arrival="457.70" arrivalLane="c2w_1" arrivalPos="990.00" arrivalPosLat="0.00" arrivalSpeed="14.96" duration="193.70" routeLength="1986.69" waitingTime="45.35" waitingCount="1" stopTime="0.00" timeLoss="62.90" rerouteNo="1" devices="tripinfo_car_n2w_264 routing_car_n2w_264" vType="Car" speedFactor="1.10" vaporized=""/>
    <tripinfo id="car_s2n_271" depart="271.00" departLane="s2sep_1" departPos="3.60" departPosLat="0.00" departSpeed="13.90" departDelay="0.00" arrival="458.05" arrivalLane="c2n_1" arrivalPos="990.00" arrivalPosLat="0.00" arrivalSpeed="13.96" duration="187.05" routeLength="1997.01" waitingTime="32.65" waitingCount="1" stopTime="0.00" timeLoss="43.97" rerouteNo="1" devices="tripinfo_car_s2n_271 routing_car_s2n_271" vType="Car" speedFactor="1.00" vaporized=""/>
    <tripinfo id="car_s2n_282" depart="282.00" departLane="s2sep_1" departPos="3.60" departPosLat="0.00" departSpeed="13.90" departDelay="0.00" arrival="461.05" arrivalLane="c2n_1" arrivalPos="990.00" arrivalPosLat="0.00" arrivalSpeed="14.26" duration="179.05" routeLength="1997.01" waitingTime="24.70" waitingCount="1" stopTime="0.00" timeLoss="39.71" rerouteNo="1" devices="tripinfo_car_s2n_282 routing_car_s2n_282" vType="Car" speedFactor="1.03" vaporized=""/>
    <tripinfo id="car_n2w_272" depart="272.00" departLane="n2sep_1" departPos="3.60" departPosLat="0.00" departSpeed="13.90" departDelay="0.00" arrival="461.80" arrivalLane="c2w_1" arrivalPos="990.00" arrivalPosLat="0.00" arrivalSpeed="13.93" duration="189.80" routeLength="1986.69" waitingTime="32.95" waitingCount="1" stopTime="0.00" timeLoss="46.59" rerouteNo="1" devices="tripinfo_car_n2w_272 routing_car_n2w_272" vType="Car" speedFactor="1.00" vaporized=""/>
    <tripinfo id="car_s2e_296" depart="296.00" departLane="s2sep_1" departPos="3.60" departPosLat="0.00" departSpeed="13.90" departDelay="0.00" arrival="463.85" arrivalLane="c2e_1" arrivalPos="990.00" arrivalPosLat="0.00" arrivalSpeed="14.02" duration="167.85" routeLength="1986.69" waitingTime="11.85" waitingCount="1" stopTime="0.00" timeLoss="25.36" rerouteNo="1" devices="tripinfo_car_s2e_296 routing_car_s2e_296" vType="Car" speedFactor="1.01" vaporized=""/>
    <tripinfo id="car_n2s_303" depart="304.40" departLane="n2sep_1" departPos="3.60" departPosLat="0.00" departSpeed="13.90" departDelay="1.40" arrival="463.85" arrivalLane="c2s_1" arrivalPos="990.00" arrivalPosLat="0.00" arrivalSpeed="14.85" duration="159.45" routeLength="1997.01" waitingTime="6.30" waitingCount="1" stopTime="0.00" timeLoss="24.94" rerouteNo="1" devices="tripinfo_car_n2s_303 routing_car_n2s_303" vType="Car" speedFactor="1.07" vaporized=""/>
    <tripinfo id="car_n2w_281" depart="281.00" departLane="n2sep_1" departPos="3.60" departPosLat="0.00" departSpeed="13.90" departDelay="0.00" arrival="465.75" arrivalLane="c2w_1" arrivalPos="990.00" arrivalPosLat="0.00" arrivalSpeed="13.88" duration="184.75" routeLength="1986.69" waitingTime="25.80" waitingCount="1" stopTime="0.00" timeLoss="41.06" rerouteNo="1" devices="tripinfo_car_n2w_281 routing_car_n2w_281" vType="Car" speedFactor="1.00" vaporized=""/>
</tripinfos>
