<?xml version="1.0" encoding="UTF-8"?>

<!-- generated on Sat Apr 24 18:25:39 2021 by Eclipse SUMO Version 1.4.0
<configuration xmlns:xsi="http://www.w3.org/2001/XMLSchema-instance" xsi:noNamespaceSchemaLocation="http://sumo.dlr.de/xsd/sumoConfiguration.xsd">

    <input>
        <net-file value="sumofiles/junction.net.xml"/>
        <route-files value="sumofiles/junction_preemption_236.rou.xml"/>
        <additional-files value="sumofiles/junction.det.xml"/>
    </input>

    <output>
        <tripinfo-output value="sumofiles/output/tripinfo_preemption_236.xml"/>
    </output>

    <time>
        <begin value="0"/>
        <end value="10000"/>
        <step-length value="0.05"/>
    </time>

    <processing>
        <lateral-resolution value="0.1"/>
    </processing>

    <report>
        <no-warnings value="true"/>
        <error-log value="sumofiles/output/errorlog_preemption_236.log"/>
        <no-step-log value="true"/>
    </report>

    <traci_server>
        <remote-port value="53501"/>
    </traci_server>

    <gui_only>
        <gui-settings-file value="sumofiles/junction-gui.settings.xml"/>
        <tracker-interval value="0.05"/>
    </gui_only>

</configuration>
-->

<tripinfos xmlns:xsi="http://www.w3.org/2001/XMLSchema-instance" xsi:noNamespaceSchemaLocation="http://sumo.dlr.de/xsd/tripinfo_file.xsd">
    <tripinfo id="car_n2w_12" depart="12.00" departLane="n2sep_1" departPos="3.60" departPosLat="0.00" departSpeed="13.90" departDelay="0.00" arrival="161.70" arrivalLane="c2w_1" arrivalPos="990.00" arrivalPosLat="0.00" arrivalSpeed="14.73" duration="149.70" routeLength="1986.69" waitingTime="6.75" waitingCount="1" stopTime="0.00" timeLoss="14.14" rerouteNo="1" devices="tripinfo_car_n2w_12 routing_car_n2w_12" vType="Car" speedFactor="1.06" vaporized=""/>
    <tripinfo id="car_s2e_16" depart="16.00" departLane="s2sep_1" departPos="3.60" departPosLat="0.00" departSpeed="13.90" departDelay="0.00" arrival="164.75" arrivalLane="c2e_1" arrivalPos="990.00" arrivalPosLat="0.00" arrivalSpeed="14.04" duration="148.75" routeLength="1986.69" waitingTime="0.00" waitingCount="0" stopTime="0.00" timeLoss="6.57" rerouteNo="1" devices="tripinfo_car_s2e_16 routing_car_s2e_16" vType="Car" speedFactor="1.01" vaporized=""/>
    <tripinfo id="car_n2e_14" depart="14.00" departLane="n2sep_1" departPos="3.60" departPosLat="0.00" departSpeed="13.90" departDelay="0.00" arrival="167.65" arrivalLane="c2e_1" arrivalPos="990.00" arrivalPosLat="0.00" arrivalSpeed="14.64" duration="153.65" routeLength="1996.47" waitingTime="2.75" waitingCount="1" stopTime="0.00" timeLoss="17.50" rerouteNo="1" devices="tripinfo_car_n2e_14 routing_car_n2e_14" vType="Car" speedFactor="1.06" vaporized=""/>
    <tripinfo id="bus_n2s_17" depart="17.00" departLane="n2sep_1" departPos="12.10" departPosLat="0.00" departSpeed="13.90" departDelay="0.00" arrival="169.90" arrivalLane="c2s_1" arrivalPos="990.00" arrivalPosLat="0.00" arrivalSpeed="13.90" duration="152.90" routeLength="1988.51" waitingTime="0.00" waitingCount="0" stopTime="0.00" timeLoss="9.80" rerouteNo="1" devices="tripinfo_bus_n2s_17 routing_bus_n2s_17" vType="Bus" speedFactor="1.00" vaporized=""/>
    <tripinfo id="car_n2w_26" depart="26.00" departLane="n2sep_1" departPos="3.60" departPosLat="0.00" departSpeed="13.90" departDelay="0.00" arrival="172.20" arrivalLane="c2w_1" arrivalPos="990.00" arrivalPosLat="0.00" arrivalSpeed="14.54" duration="146.20" routeLength="1986.69" waitingTime="0.00" waitingCount="0" stopTime="0.00" timeLoss="8.84" rerouteNo="1" devices="tripinfo_car_n2w_26 routing_car_n2w_26" vType="Car" speedFactor="1.05" vaporized=""/>
    <tripinfo id="car_n2s_19" depart="19.00" departLane="n2sep_1" departPos="3.60" departPosLat="0.00" departSpeed="13.90" departDelay="0.00" arrival="172.85" arrivalLane="c2s_1" arrivalPos="990.00" arrivalPosLat="0.00" arrivalSpeed="14.89" duration="153.85" routeLength="1997.01" waitingTime="0.00" waitingCount="0" stopTime="0.00" timeLoss="21.14" rerouteNo="1" devices="tripinfo_car_n2s_19 routing_car_n2s_19" vType="Car" speedFactor="1.08" vaporized=""/>
    <tripinfo id="car_n2e_24" depart="24.00" departLane="n2sep_1" departPos="3.60" departPosLat="0.00" departSpeed="13.90" departDelay="0.00" arrival="173.80" arrivalLane="c2e_1" arrivalPos="990.00" arrivalPosLat="0.00" arrivalSpeed="13.90" duration="149.80" routeLength="1996.47" waitingTime="0.00" waitingCount="0" stopTime="0.00" timeLoss="5.46" rerouteNo="1" devices="tripinfo_car_n2e_24 routing_car_n2e_24" vType="Car" speedFactor="1.00" vaporized=""/>
    <tripinfo id="car_n2s_27" depart="27.60" departLane="n2sep_1" departPos="3.60" departPosLat="0.00" departSpeed="13.90" departDelay="0.60" arrival="177.40" arrivalLane="c2s_1" arrivalPos="990.00" arrivalPosLat="0.00" arrivalSpeed="14.04" duration="149.80" routeLength="1997.01" waitingTime="0.00" waitingCount="0" stopTime="0.00" timeLoss="7.58" rerouteNo="1" devices="tripinfo_car_n2s_27 routing_car_n2s_27" vType="Car" speedFactor="1.01" vaporized=""/>
    <tripinfo id="car_s2w_32" depart="32.00" departLane="s2sep_1" departPos="3.60" departPosLat="0.00" departSpeed="13.90" departDelay="0.00" arrival="178.55" arrivalLane="c2w_1" arrivalPos="990.00" arrivalPosLat="0.00" arrivalSpeed="15.16" duration="146.55" routeLength="1996.47" waitingTime="6.30" waitingCount="1" stopTime="0.00" timeLoss="14.21" rerouteNo="1" devices="tripinfo_car_s2w_32 routing_car_s2w_32" vType="Car" speedFactor="1.09" vaporized=""/>
    <tripinfo id="car_n2s_29" depart="29.45" departLane="n2sep_1" departPos="3.60" departPosLat="0.00" departSpeed="13.90" departDelay="0.45" arrival="179.75" arrivalLane="c2s_1" arrivalPos="990.00" arrivalPosLat="0.00" arrivalSpeed="14.79" duration="150.30" routeLength="1997.01" waitingTime="0.00" waitingCount="0" stopTime="0.00" timeLoss="17.56" rerouteNo="1" devices="tripinfo_car_n2s_29 routing_car_n2s_29" vType="Car" speedFactor="1.08" vaporized=""/>
    <tripinfo id="car_n2s_31" depart="31.25" departLane="n2sep_1" departPos="3.60" departPosLat="0.00" departSpeed="13.90" departDelay="0.25" arrival="182.85" arrivalLane="c2s_1" arrivalPos="990.00" arrivalPosLat="0.00" arrivalSpeed="14.26" duration="151.60" routeLength="1997.01" waitingTime="0.00" waitingCount="0" stopTime="0.00" timeLoss="12.15" rerouteNo="1" devices="tripinfo_car_n2s_31 routing_car_n2s_31" vType="Car" speedFactor="1.03" vaporized=""/>
    <tripinfo id="car_n2e_34" depart="34.00" departLane="n2sep_1" departPos="3.60" departPosLat="0.00" departSpeed="13.90" departDelay="0.00" arrival="184.45" arrivalLane="c2e_1" arrivalPos="990.00" arrivalPosLat="0.00" arrivalSpeed="14.27" duration="150.45" routeLength="1996.47" waitingTime="0.00" waitingCount="0" stopTime="0.00" timeLoss="9.81" rerouteNo="1" devices="tripinfo_car_n2e_34 routing_car_n2e_34" vType="Car" speedFactor="1.03" vaporized=""/>
    <tripinfo id="car_n2e_38" depart="38.00" departLane="n2sep_1" departPos="3.60" departPosLat="0.00" departSpeed="13.90" departDelay="0.00" arrival="186.70" arrivalLane="c2e_1" arrivalPos="990.00" arrivalPosLat="0.00" arrivalSpeed="15.28" duration="148.70" routeLength="1996.47" waitingTime="0.00" waitingCount="0" stopTime="0.00" timeLoss="20.17" rerouteNo="1" devices="tripinfo_car_n2e_38 routing_car_n2e_38" vType="Car" speedFactor="1.12" vaporized=""/>
    <tripinfo id="car_n2s_49" depart="49.00" departLane="n2sep_1" departPos="3.60" departPosLat="0.00" departSpeed="13.90" departDelay="0.00" arrival="193.20" arrivalLane="c2s_1" arrivalPos="990.00" arrivalPosLat="0.00" arrivalSpeed="13.90" duration="144.20" routeLength="1997.01" waitingTime="0.00" waitingCount="0" stopTime="0.00" timeLoss="0.49" rerouteNo="1" devices="tripinfo_car_n2s_49 routing_car_n2s_49" vType="Car" speedFactor="1.00" vaporized=""/>
    <tripinfo id="car_e2n_57" depart="57.00" departLane="e2sep_1" departPos="3.60" departPosLat="0.00" departSpeed="13.90" departDelay="0.00" arrival="205.65" arrivalLane="c2n_1" arrivalPos="990.00" arrivalPosLat="0.00" arrivalSpeed="16.10" duration="148.65" routeLength="1986.69" waitingTime="13.90" waitingCount="1" stopTime="0.00" timeLoss="24.60" rerouteNo="1" devices="tripinfo_car_e2n_57 routing_car_e2n_57" vType="Car" speedFactor="1.16" vaporized=""/>
    <tripinfo id="car_w2e_40" depart="40.00" departLane="w2sep_1" departPos="3.60" departPosLat="0.00" departSpeed="13.90" departDelay="0.00" arrival="207.70" arrivalLane="c2e_1" arrivalPos="990.00" arrivalPosLat="0.00" arrivalSpeed="14.54" duration="167.70" routeLength="1997.01" waitingTime="22.90" waitingCount="1" stopTime="0.00" timeLoss="30.29" rerouteNo="1" devices="tripinfo_car_w2e_40 routing_car_w2e_40" vType="Car" speedFactor="1.05" vaporized=""/>
    <tripinfo id="car_e2w_19" depart="19.00" departLane="e2sep_1" departPos="3.60" departPosLat="0.00" departSpeed="13.90" departDelay="0.00" arrival="208.65" arrivalLane="c2w_1" arrivalPos="990.00" arrivalPosLat="0.00" arrivalSpeed="14.32" duration="189.65" routeLength="1997.01" waitingTime="43.10" waitingCount="1" stopTime="0.00" timeLoss="50.20" rerouteNo="1" devices="tripinfo_car_e2w_19 routing_car_e2w_19" vType="Car" speedFactor="1.03" vaporized=""/>
    <tripinfo id="car_e2w_37" depart="37.00" departLane="e2sep_1" departPos="3.60" departPosLat="0.00" departSpeed="13.90" departDelay="0.00" arrival="212.40" arrivalLane="c2w_1" arrivalPos="990.00" arrivalPosLat="0.00" arrivalSpeed="14.53" duration="175.40" routeLength="1997.01" waitingTime="26.85" waitingCount="1" stopTime="0.00" timeLoss="38.17" rerouteNo="1" devices="tripinfo_car_e2w_37 routing_car_e2w_37" vType="Car" speedFactor="1.05" vaporized=""/>
    <tripinfo id="car_e2s_38" depart="38.40" departLane="e2sep_1" departPos="3.60" departPosLat="0.00" departSpeed="13.90" departDelay="0.40" arrival="212.80" arrivalLane="c2s_1" arrivalPos="990.00" arrivalPosLat="0.00" arrivalSpeed="13.90" duration="174.40" routeLength="1996.47" waitingTime="19.95" waitingCount="1" stopTime="0.00" timeLoss="30.09" rerouteNo="1" devices="tripinfo_car_e2s_38 routing_car_e2s_38" vType="Car" speedFactor="1.00" vaporized=""/>
    <tripinfo id="car_e2n_64" depart="64.00" departLane="e2sep_1" departPos="3.60" departPosLat="0.00" departSpeed="13.90" departDelay="0.00" arrival="216.65" arrivalLane="c2n_1" arrivalPos="990.00" arrivalPosLat="0.00" arrivalSpeed="14.55" duration="152.65" routeLength="1986.69" waitingTime="2.45" waitingCount="1" stopTime="0.00" timeLoss="15.44" rerouteNo="1" devices="tripinfo_car_e2n_64 routing_car_e2n_64" vType="Car" speedFactor="1.05" vaporized=""/>
    <tripinfo id="car_e2w_59" depart="59.00" departLane="e2sep_1" departPos="3.60" departPosLat="0.00" departSpeed="13.90" departDelay="0.00" arrival="217.50" arrivalLane="c2w_1" arrivalPos="990.00" arrivalPosLat="0.00" arrivalSpeed="14.04" duration="158.50" routeLength="1997.01" waitingTime="4.45" waitingCount="1" stopTime="0.00" timeLoss="16.26" rerouteNo="1" devices="tripinfo_car_e2w_59 routing_car_e2w_59" vType="Car" speedFactor="1.01" vaporized=""/>
    <tripinfo id="car_e2w_77" depart="77.00" departLane="e2sep_1" departPos="3.60" departPosLat="0.00" departSpeed="13.90" departDelay="0.00" arrival="219.45" arrivalLane="c2w_1" arrivalPos="990.00" arrivalPosLat="0.00" arrivalSpeed="15.37" duration="142.45" routeLength="1997.01" waitingTime="0.00" waitingCount="0" stopTime="0.00" timeLoss="17.96" rerouteNo="1" devices="tripinfo_car_e2w_77 routing_car_e2w_77" vType="Car" speedFactor="1.15" vaporized=""/>
    <tripinfo id="car_e2s_82" depart="82.00" departLane="e2sep_1" departPos="3.60" departPosLat="0.00" departSpeed="13.90" departDelay="0.00" arrival="225.35" arrivalLane="c2s_1" arrivalPos="990.00" arrivalPosLat="0.00" arrivalSpeed="16.29" duration="143.35" routeLength="1996.47" waitingTime="3.85" waitingCount="1" stopTime="0.00" timeLoss="20.16" rerouteNo="1" devices="tripinfo_car_e2s_82 routing_car_e2s_82" vType="Car" speedFactor="1.17" vaporized=""/>
    <tripinfo id="car_e2n_79" depart="79.00" departLane="e2sep_1" departPos="3.60" departPosLat="0.00" departSpeed="13.90" departDelay="0.00" arrival="226.50" arrivalLane="c2n_1" arrivalPos="990.00" arrivalPosLat="0.00" arrivalSpeed="13.97" duration="147.50" routeLength="1986.69" waitingTime="0.00" waitingCount="0" stopTime="0.00" timeLoss="4.58" rerouteNo="1" devices="tripinfo_car_e2n_79 routing_car_e2n_79" vType="Car" speedFactor="1.01" vaporized=""/>
    <tripinfo id="car_w2e_87" depart="87.00" departLane="w2sep_1" departPos="3.60" departPosLat="0.00" departSpeed="13.90" departDelay="0.00" arrival="228.10" arrivalLane="c2e_1" arrivalPos="990.00" arrivalPosLat="0.00" arrivalSpeed="14.17" duration="141.10" routeLength="1997.01" waitingTime="0.00" waitingCount="0" stopTime="0.00" timeLoss="0.17" rerouteNo="1" devices="tripinfo_car_w2e_87 routing_car_w2e_87" vType="Car" speedFactor="1.02" vaporized=""/>
    <tripinfo id="car_w2n_58" depart="58.00" departLane="w2sep_1" departPos="3.60" departPosLat="0.00" departSpeed="13.90" departDelay="0.00" arrival="230.35" arrivalLane="c2n_1" arrivalPos="990.00" arrivalPosLat="0.00" arrivalSpeed="14.13" duration="172.35" routeLength="1996.47" waitingTime="16.00" waitingCount="2" stopTime="0.00" timeLoss="30.58" rerouteNo="1" devices="tripinfo_car_w2n_58 routing_car_w2n_58" vType="Car" speedFactor="1.02" vaporized=""/>
    <tripinfo id="car_w2e_88" depart="88.40" departLane="w2sep_1" departPos="3.60" departPosLat="0.00" departSpeed="13.90" departDelay="0.40" arrival="230.50" arrivalLane="c2e_1" arrivalPos="990.00" arrivalPosLat="0.00" arrivalSpeed="15.08" duration="142.10" routeLength="1997.01" waitingTime="0.00" waitingCount="0" stopTime="0.00" timeLoss="11.75" rerouteNo="1" devices="tripinfo_car_w2e_88 routing_car_w2e_88" vType="Car" speedFactor="1.10" vaporized=""/>
    <tripinfo id="car_e2s_87" depart="87.00" departLane="e2sep_1" departPos="3.60" departPosLat="0.00" departSpeed="13.90" departDelay="0.00" arrival="237.65" arrivalLane="c2s_1" arrivalPos="990.00" arrivalPosLat="0.00" arrivalSpeed="13.90" duration="150.65" routeLength="1996.47" waitingTime="0.00" waitingCount="0" stopTime="0.00" timeLoss="6.33" rerouteNo="1" devices="tripinfo_car_e2s_87 routing_car_e2s_87" vType="Car" speedFactor="1.00" vaporized=""/>
    <tripinfo id="car_s2e_60" depart="60.00" departLane="s2sep_1" departPos="3.60" departPosLat="0.00" departSpeed="13.90" departDelay="0.00" arrival="252.20" arrivalLane="c2e_1" arrivalPos="990.00" arrivalPosLat="0.00" arrivalSpeed="15.16" duration="192.20" routeLength="1986.69" waitingTime="48.05" waitingCount="1" stopTime="0.00" timeLoss="60.48" rerouteNo="1" devices="tripinfo_car_s2e_60 routing_car_s2e_60" vType="Car" speedFactor="1.09" vaporized=""/>
    <tripinfo id="car_s2e_68" depart="68.00" departLane="s2sep_1" departPos="3.60" departPosLat="0.00" departSpeed="13.90" departDelay="0.00" arrival="255.55" arrivalLane="c2e_1" arrivalPos="990.00" arrivalPosLat="0.00" arrivalSpeed="15.55" duration="187.55" routeLength="1986.69" waitingTime="43.20" waitingCount="1" stopTime="0.00" timeLoss="59.59" rerouteNo="1" devices="tripinfo_car_s2e_68 routing_car_s2e_68" vType="Car" speedFactor="1.12" vaporized=""/>
    <tripinfo id="car_s2n_56" depart="56.00" departLane="s2sep_1" departPos="3.60" departPosLat="0.00" departSpeed="13.90" departDelay="0.00" arrival="255.70" arrivalLane="c2n_1" arrivalPos="990.00" arrivalPosLat="0.00" arrivalSpeed="13.90" duration="199.70" routeLength="1997.01" waitingTime="49.45" waitingCount="1" stopTime="0.00" timeLoss="56.03" rerouteNo="1" devices="tripinfo_car_s2n_56 routing_car_s2n_56" vType="Car" speedFactor="1.00" vaporized=""/>
    <tripinfo id="car_n2s_51" depart="51.00" departLane="n2sep_1" departPos="3.60" departPosLat="0.00" departSpeed="13.90" departDelay="0.00" arrival="255.75" arrivalLane="c2s_1" arrivalPos="990.00" arrivalPosLat="0.00" arrivalSpeed="13.90" duration="204.75" routeLength="1997.01" waitingTime="52.50" waitingCount="1" stopTime="0.00" timeLoss="61.06" rerouteNo="1" devices="tripinfo_car_n2s_51 routing_car_n2s_51" vType="Car" speedFactor="1.00" vaporized=""/>
    <tripinfo id="car_n2w_74" depart="74.00" departLane="n2sep_1" departPos="3.60" departPosLat="0.00" departSpeed="13.90" departDelay="0.00" arrival="257.95" arrivalLane="c2w_1" arrivalPos="990.00" arrivalPosLat="0.00" arrivalSpeed="13.90" duration="183.95" routeLength="1986.69" waitingTime="31.85" waitingCount="1" stopTime="0.00" timeLoss="40.31" rerouteNo="1" devices="tripinfo_car_n2w_74 routing_car_n2w_74" vType="Car" speedFactor="1.00" vaporized=""/>
    <tripinfo id="car_n2w_75" depart="75.45" departLane="n2sep_1" departPos="3.60" departPosLat="0.00" departSpeed="13.90" departDelay="0.45" arrival="259.80" arrivalLane="c2w_1" arrivalPos="990.00" arrivalPosLat="0.00" arrivalSpeed="15.50" duration="184.35" routeLength="1986.69" waitingTime="31.20" waitingCount="1" stopTime="0.00" timeLoss="62.44" rerouteNo="1" devices="tripinfo_car_n2w_75 routing_car_n2w_75" vType="Car" speedFactor="1.18" vaporized=""/>
    <tripinfo id="car_s2n_70" depart="71.60" departLane="s2sep_1" departPos="3.60" departPosLat="0.00" departSpeed="13.90" departDelay="1.60" arrival="262.70" arrivalLane="c2n_1" arrivalPos="990.00" arrivalPosLat="0.00" arrivalSpeed="13.90" duration="191.10" routeLength="1997.01" waitingTime="33.60" waitingCount="1" stopTime="0.00" timeLoss="47.43" rerouteNo="1" devices="tripinfo_car_s2n_70 routing_car_s2n_70" vType="Car" speedFactor="1.00" vaporized=""/>
    <tripinfo id="car_n2w_104" depart="104.00" departLane="n2sep_1" departPos="3.60" departPosLat="0.00" departSpeed="13.90" departDelay="0.00" arrival="263.80" arrivalLane="c2w_1" arrivalPos="990.00" arrivalPosLat="0.00" arrivalSpeed="14.14" duration="159.80" routeLength="1986.69" waitingTime="5.20" waitingCount="1" stopTime="0.00" timeLoss="18.68" rerouteNo="1" devices="tripinfo_car_n2w_104 routing_car_n2w_104" vType="Car" speedFactor="1.02" vaporized=""/>
    <tripinfo id="car_s2n_71" depart="73.45" departLane="s2sep_1" departPos="3.60" departPosLat="0.00" departSpeed="13.90" departDelay="2.45" arrival="264.70" arrivalLane="c2n_1" arrivalPos="990.00" arrivalPosLat="0.00" arrivalSpeed="15.17" duration="191.25" routeLength="1997.01" waitingTime="33.00" waitingCount="1" stopTime="0.00" timeLoss="64.32" rerouteNo="1" devices="tripinfo_car_s2n_71 routing_car_s2n_71" vType="Car" speedFactor="1.13" vaporized=""/>
    <tripinfo id="car_s2n_87" depart="87.00" departLane="s2sep_1" departPos="3.60" departPosLat="0.00" departSpeed="13.90" departDelay="0.00" arrival="266.60" arrivalLane="c2n_1" arrivalPos="990.00" arrivalPosLat="0.00" arrivalSpeed="15.64" duration="179.60" routeLength="1997.01" waitingTime="25.15" waitingCount="1" stopTime="0.00" timeLoss="57.78" rerouteNo="1" devices="tripinfo_car_s2n_87 routing_car_s2n_87" vType="Car" speedFactor="1.18" vaporized=""/>
    <tripinfo id="car_s2e_85" depart="85.00" departLane="s2sep_1" departPos="3.60" departPosLat="0.00" departSpeed="13.90" departDelay="0.00" arrival="266.95" arrivalLane="c2e_1" arrivalPos="990.00" arrivalPosLat="0.00" arrivalSpeed="13.90" duration="181.95" routeLength="1986.69" waitingTime="25.65" waitingCount="1" stopTime="0.00" timeLoss="38.26" rerouteNo="1" devices="tripinfo_car_s2e_85 routing_car_s2e_85" vType="Car" speedFactor="1.00" vaporized=""/>
    <tripinfo id="car_s2w_61" depart="61.35" departLane="s2sep_1" departPos="3.60" departPosLat="0.00" departSpeed="13.90" departDelay="0.35" arrival="267.15" arrivalLane="c2w_1" arrivalPos="990.00" arrivalPosLat="0.00" arrivalSpeed="14.22" duration="205.80" routeLength="1996.47" waitingTime="49.00" waitingCount="2" stopTime="0.00" timeLoss="65.17" rerouteNo="1" devices="tripinfo_car_s2w_61 routing_car_s2w_61" vType="Car" speedFactor="1.03" vaporized=""/>
    <tripinfo id="car_s2n_95" depart="95.00" departLane="s2sep_1" departPos="3.60" departPosLat="0.00" departSpeed="13.90" departDelay="0.00" arrival="268.55" arrivalLane="c2n_1" arrivalPos="990.00" arrivalPosLat="0.00" arrivalSpeed="15.52" duration="173.55" routeLength="1997.01" waitingTime="24.60" waitingCount="1" stopTime="0.00" timeLoss="49.51" rerouteNo="1" devices="tripinfo_car_s2n_95 routing_car_s2n_95" vType="Car" speedFactor="1.16" vaporized=""/>
    <tripinfo id="car_s2w_70" depart="70.00" departLane="s2sep_1" departPos="3.60" departPosLat="0.00" departSpeed="13.90" departDelay="0.00" arrival="271.05" arrivalLane="c2w_1" arrivalPos="990.00" arrivalPosLat="0.00" arrivalSpeed="13.88" duration="201.05" routeLength="1996.47" waitingTime="40.05" waitingCount="2" stopTime="0.00" timeLoss="56.74" rerouteNo="1" devices="tripinfo_car_s2w_70 routing_car_s2w_70" vType="Car" speedFactor="1.00" vaporized=""/>
    <tripinfo id="car_s2n_105" depart="105.00" departLane="s2sep_1" departPos="3.60" departPosLat="0.00" departSpeed="13.90" departDelay="0.00" arrival="272.05" arrivalLane="c2n_1" arrivalPos="990.00" arrivalPosLat="0.00" arrivalSpeed="14.39" duration="167.05" routeLength="1997.01" waitingTime="12.05" waitingCount="1" stopTime="0.00" timeLoss="28.61" rerouteNo="1" devices="tripinfo_car_s2n_105 routing_car_s2n_105" vType="Car" speedFactor="1.04" vaporized=""/>
    <tripinfo id="car_s2e_107" depart="107.00" departLane="s2sep_1" departPos="3.60" departPosLat="0.00" departSpeed="13.90" departDelay="0.00" arrival="272.40" arrivalLane="c2e_1" arrivalPos="990.00" arrivalPosLat="0.00" arrivalSpeed="14.50" duration="165.40" routeLength="1986.69" waitingTime="9.85" waitingCount="1" stopTime="0.00" timeLoss="27.68" rerouteNo="1" devices="tripinfo_car_s2e_107 routing_car_s2e_107" vType="Car" speedFactor="1.04" vaporized=""/>
    <tripinfo id="car_s2w_130" depart="130.45" departLane="s2sep_1" departPos="3.60" departPosLat="0.00" departSpeed="13.90" departDelay="0.45" arrival="273.65" arrivalLane="c2w_1" arrivalPos="990.00" arrivalPosLat="0.00" arrivalSpeed="15.04" duration="143.20" routeLength="1996.47" waitingTime="0.00" waitingCount="0" stopTime="0.00" timeLoss="11.49" rerouteNo="1" devices="tripinfo_car_s2w_130 routing_car_s2w_130" vType="Car" speedFactor="1.10" vaporized=""/>
    <tripinfo id="car_s2n_129" depart="129.00" departLane="s2sep_1" departPos="3.60" departPosLat="0.00" departSpeed="13.90" departDelay="0.00" arrival="276.55" arrivalLane="c2n_1" arrivalPos="990.00" arrivalPosLat="0.00" arrivalSpeed="14.12" duration="147.55" routeLength="1997.01" waitingTime="0.00" waitingCount="0" stopTime="0.00" timeLoss="6.25" rerouteNo="1" devices="tripinfo_car_s2n_129 routing_car_s2n_129" vType="Car" speedFactor="1.02" vaporized=""/>
    <tripinfo id="car_s2e_131" depart="132.15" departLane="s2sep_1" departPos="3.60" departPosLat="0.00" departSpeed="13.90" departDelay="1.15" arrival="282.15" arrivalLane="c2e_1" arrivalPos="990.00" arrivalPosLat="0.00" arrivalSpeed="13.94" duration="150.00" routeLength="1986.69" waitingTime="0.00" waitingCount="0" stopTime="0.00" timeLoss="6.77" rerouteNo="1" devices="tripinfo_car_s2e_131 routing_car_s2e_131" vType="Car" speedFactor="1.00" vaporized=""/>
    <tripinfo id="car_n2e_96" depart="96.00" departLane="n2sep_1" departPos="3.60" departPosLat="0.00" departSpeed="13.90" departDelay="0.00" arrival="285.70" arrivalLane="c2e_1" arrivalPos="990.00" arrivalPosLat="0.00" arrivalSpeed="14.29" duration="189.70" routeLength="1996.47" waitingTime="36.05" waitingCount="3" stopTime="0.00" timeLoss="49.61" rerouteNo="1" devices="tripinfo_car_n2e_96 routing_car_n2e_96" vType="Car" speedFactor="1.03" vaporized=""/>
    <tripinfo id="car_n2e_104" depart="105.45" departLane="n2sep_1" departPos="3.60" departPosLat="0.00" departSpeed="13.90" departDelay="1.45" arrival="288.00" arrivalLane="c2e_1" arrivalPos="990.00" arrivalPosLat="0.00" arrivalSpeed="14.91" duration="182.55" routeLength="1996.47" waitingTime="24.90" waitingCount="2" stopTime="0.00" timeLoss="50.40" rerouteNo="1" devices="tripinfo_car_n2e_104 routing_car_n2e_104" vType="Car" speedFactor="1.09" vaporized=""/>
    <tripinfo id="car_n2e_118" depart="118.00" departLane="n2sep_1" departPos="3.60" departPosLat="0.00" departSpeed="13.90" departDelay="0.00" arrival="292.35" arrivalLane="c2e_1" arrivalPos="990.00" arrivalPosLat="0.00" arrivalSpeed="13.89" duration="174.35" routeLength="1996.47" waitingTime="16.85" waitingCount="1" stopTime="0.00" timeLoss="30.02" rerouteNo="1" devices="tripinfo_car_n2e_118 routing_car_n2e_118" vType="Car" speedFactor="1.00" vaporized=""/>
    <tripinfo id="car_w2s_108" depart="108.00" departLane="w2sep_1" departPos="3.60" departPosLat="0.00" departSpeed="13.90" departDelay="0.00" arrival="295.00" arrivalLane="c2s_1" arrivalPos="990.00" arrivalPosLat="0.00" arrivalSpeed="15.12" duration="187.00" routeLength="1986.69" waitingTime="47.70" waitingCount="1" stopTime="0.00" timeLoss="54.96" rerouteNo="1" devices="tripinfo_car_w2s_108 routing_car_w2s_108" vType="Car" speedFactor="1.09" vaporized=""/>
    <tripinfo id="car_e2n_122" depart="122.00" departLane="e2sep_1" departPos="3.60" departPosLat="0.00" departSpeed="13.90" departDelay="0.00" arrival="300.65" arrivalLane="c2n_1" arrivalPos="990.00" arrivalPosLat="0.00" arrivalSpeed="13.90" duration="178.65" routeLength="1986.69" waitingTime="27.95" waitingCount="1" stopTime="0.00" timeLoss="34.97" rerouteNo="1" devices="tripinfo_car_e2n_122 routing_car_e2n_122" vType="Car" speedFactor="1.00" vaporized=""/>
    <tripinfo id="car_w2e_178" depart="178.00" departLane="w2sep_1" departPos="3.60" departPosLat="0.00" departSpeed="13.90" departDelay="0.00" arrival="300.75" arrivalLane="c2e_1" arrivalPos="990.00" arrivalPosLat="0.00" arrivalSpeed="16.40" duration="122.75" routeLength="1997.01" waitingTime="0.00" waitingCount="0" stopTime="0.00" timeLoss="0.94" rerouteNo="1" devices="tripinfo_car_w2e_178 routing_car_w2e_178" vType="Car" speedFactor="1.18" vaporized=""/>
    <tripinfo id="car_w2s_118" depart="118.00" departLane="w2sep_1" departPos="3.60" departPosLat="0.00" departSpeed="13.90" departDelay="0.00" arrival="303.25" arrivalLane="c2s_1" arrivalPos="990.00" arrivalPosLat="0.00" arrivalSpeed="14.04" duration="185.25" routeLength="1986.69" waitingTime="33.55" waitingCount="1" stopTime="0.00" timeLoss="43.02" rerouteNo="1" devices="tripinfo_car_w2s_118 routing_car_w2s_118" vType="Car" speedFactor="1.01" vaporized=""/>
    <tripinfo id="car_e2n_127" depart="127.00" departLane="e2sep_1" departPos="3.60" departPosLat="0.00" departSpeed="13.90" departDelay="0.00" arrival="305.15" arrivalLane="c2n_1" arrivalPos="990.00" arrivalPosLat="0.00" arrivalSpeed="13.89" duration="178.15" routeLength="1986.69" waitingTime="23.35" waitingCount="1" stopTime="0.00" timeLoss="34.50" rerouteNo="1" devices="tripinfo_car_e2n_127 routing_car_e2n_127" vType="Car" speedFactor="1.00" vaporized=""/>
    <tripinfo id="car_e2w_128" depart="128.50" departLane="e2sep_1" departPos="3.60" departPosLat="0.00" departSpeed="13.90" departDelay="0.50" arrival="305.15" arrivalLane="c2w_1" arrivalPos="990.00" arrivalPosLat="0.00" arrivalSpeed="13.90" duration="176.65" routeLength="1997.01" waitingTime="20.85" waitingCount="1" stopTime="0.00" timeLoss="32.95" rerouteNo="1" devices="tripinfo_car_e2w_128 routing_car_e2w_128" vType="Car" speedFactor="1.00" vaporized=""/>
    <tripinfo id="car_e2n_129" depart="130.35" departLane="e2sep_1" departPos="3.60" departPosLat="0.00" departSpeed="13.90" departDelay="1.35" arrival="307.00" arrivalLane="c2n_1" arrivalPos="990.00" arrivalPosLat="0.00" arrivalSpeed="15.37" duration="176.65" routeLength="1986.69" waitingTime="20.20" waitingCount="1" stopTime="0.00" timeLoss="53.72" rerouteNo="1" devices="tripinfo_car_e2n_129 routing_car_e2n_129" vType="Car" speedFactor="1.17" vaporized=""/>
    <tripinfo id="car_e2w_159" depart="159.00" departLane="e2sep_1" departPos="3.60" departPosLat="0.00" departSpeed="13.90" departDelay="0.00" arrival="307.00" arrivalLane="c2w_1" arrivalPos="990.00" arrivalPosLat="0.00" arrivalSpeed="15.50" duration="148.00" routeLength="1997.01" waitingTime="6.60" waitingCount="1" stopTime="0.00" timeLoss="26.06" rerouteNo="1" devices="tripinfo_car_e2w_159 routing_car_e2w_159" vType="Car" speedFactor="1.18" vaporized=""/>
    <tripinfo id="car_e2s_132" depart="132.05" departLane="e2sep_1" departPos="3.60" departPosLat="0.00" departSpeed="13.90" departDelay="0.05" arrival="308.05" arrivalLane="c2s_1" arrivalPos="990.00" arrivalPosLat="0.00" arrivalSpeed="13.89" duration="176.00" routeLength="1996.47" waitingTime="14.65" waitingCount="2" stopTime="0.00" timeLoss="31.69" rerouteNo="1" devices="tripinfo_car_e2s_132 routing_car_e2s_132" vType="Car" speedFactor="1.00" vaporized=""/>
    <tripinfo id="car_e2n_143" depart="143.00" departLane="e2sep_1" departPos="3.60" departPosLat="0.00" departSpeed="13.90" departDelay="0.00" arrival="308.95" arrivalLane="c2n_1" arrivalPos="990.00" arrivalPosLat="0.00" arrivalSpeed="15.31" duration="165.95" routeLength="1986.69" waitingTime="16.60" waitingCount="1" stopTime="0.00" timeLoss="40.21" rerouteNo="1" devices="tripinfo_car_e2n_143 routing_car_e2n_143" vType="Car" speedFactor="1.14" vaporized=""/>
    <tripinfo id="car_w2n_142" depart="142.00" departLane="w2sep_1" departPos="3.60" departPosLat="0.00" departSpeed="13.90" departDelay="0.00" arrival="315.25" arrivalLane="c2n_1" arrivalPos="990.00" arrivalPosLat="0.00" arrivalSpeed="13.90" duration="173.25" routeLength="1996.47" waitingTime="17.45" waitingCount="2" stopTime="0.00" timeLoss="28.92" rerouteNo="1" devices="tripinfo_car_w2n_142 routing_car_w2n_142" vType="Car" speedFactor="1.00" vaporized=""/>
    <tripinfo id="car_w2s_179" depart="179.25" departLane="w2sep_1" departPos="3.60" departPosLat="0.00" departSpeed="13.90" departDelay="0.25" arrival="315.30" arrivalLane="c2s_1" arrivalPos="990.00" arrivalPosLat="0.00" arrivalSpeed="15.32" duration="136.05" routeLength="1986.69" waitingTime="0.00" waitingCount="0" stopTime="0.00" timeLoss="5.74" rerouteNo="1" devices="tripinfo_car_w2s_179 routing_car_w2s_179" vType="Car" speedFactor="1.10" vaporized=""/>
    <tripinfo id="car_e2w_173" depart="173.40" departLane="e2sep_1" departPos="3.60" departPosLat="0.00" departSpeed="13.90" departDelay="0.40" arrival="319.60" arrivalLane="c2w_1" arrivalPos="990.00" arrivalPosLat="0.00" arrivalSpeed="13.90" duration="146.20" routeLength="1997.01" waitingTime="0.00" waitingCount="0" stopTime="0.00" timeLoss="2.53" rerouteNo="1" devices="tripinfo_car_e2w_173 routing_car_e2w_173" vType="Car" speedFactor="1.00" vaporized=""/>
    <tripinfo id="car_e2s_172" depart="172.00" departLane="e2sep_1" departPos="3.60" departPosLat="0.00" departSpeed="13.90" departDelay="0.00" arrival="323.75" arrivalLane="c2s_1" arrivalPos="990.00" arrivalPosLat="0.00" arrivalSpeed="14.21" duration="151.75" routeLength="1996.47" waitingTime="3.10" waitingCount="1" stopTime="0.00" timeLoss="10.52" rerouteNo="1" devices="tripinfo_car_e2s_172 routing_car_e2s_172" vType="Car" speedFactor="1.02" vaporized=""/>
    <tripinfo id="car_e2w_177" depart="177.65" departLane="e2sep_1" departPos="3.60" departPosLat="0.00" departSpeed="13.90" departDelay="0.65" arrival="324.45" arrivalLane="c2w_1" arrivalPos="990.00" arrivalPosLat="0.00" arrivalSpeed="14.67" duration="146.80" routeLength="1997.01" waitingTime="0.00" waitingCount="0" stopTime="0.00" timeLoss="10.69" rerouteNo="1" devices="tripinfo_car_e2w_177 routing_car_e2w_177" vType="Car" speedFactor="1.06" vaporized=""/>
    <tripinfo id="car_e2n_176" depart="176.00" departLane="e2sep_1" departPos="3.60" departPosLat="0.00" departSpeed="13.90" departDelay="0.00" arrival="324.75" arrivalLane="c2n_1" arrivalPos="990.00" arrivalPosLat="0.00" arrivalSpeed="14.17" duration="148.75" routeLength="1986.69" waitingTime="0.00" waitingCount="0" stopTime="0.00" timeLoss="7.88" rerouteNo="1" devices="tripinfo_car_e2n_176 routing_car_e2n_176" vType="Car" speedFactor="1.02" vaporized=""/>
    <tripinfo id="car_w2n_170" depart="170.00" departLane="w2sep_1" departPos="3.60" departPosLat="0.00" departSpeed="13.90" departDelay="0.00" arrival="326.80" arrivalLane="c2n_1" arrivalPos="990.00" arrivalPosLat="0.00" arrivalSpeed="15.72" duration="156.80" routeLength="1996.47" waitingTime="18.25" waitingCount="2" stopTime="0.00" timeLoss="33.65" rerouteNo="1" devices="tripinfo_car_w2n_170 routing_car_w2n_170" vType="Car" speedFactor="1.17" vaporized=""/>
    <tripinfo id="car_e2w_186" depart="186.00" departLane="e2sep_1" departPos="3.60" departPosLat="0.00" departSpeed="13.90" departDelay="0.00" arrival="330.95" arrivalLane="c2w_1" arrivalPos="990.00" arrivalPosLat="0.00" arrivalSpeed="14.00" duration="144.95" routeLength="1997.01" waitingTime="0.00" waitingCount="0" stopTime="0.00" timeLoss="2.29" rerouteNo="1" devices="tripinfo_car_e2w_186 routing_car_e2w_186" vType="Car" speedFactor="1.01" vaporized=""/>
    <tripinfo id="car_w2n_189" depart="189.00" departLane="w2sep_1" departPos="3.60" departPosLat="0.00" departSpeed="13.90" departDelay="0.00" arrival="331.65" arrivalLane="c2n_1" arrivalPos="990.00" arrivalPosLat="0.00" arrivalSpeed="15.10" duration="142.65" routeLength="1996.47" waitingTime="0.00" waitingCount="0" stopTime="0.00" timeLoss="9.86" rerouteNo="1" devices="tripinfo_car_w2n_189 routing_car_w2n_189" vType="Car" speedFactor="1.09" vaporized=""/>
    <tripinfo id="car_s2e_154" depart="154.00" departLane="s2sep_1" departPos="3.60" departPosLat="0.00" departSpeed="13.90" departDelay="0.00" arrival="338.25" arrivalLane="c2e_1" arrivalPos="990.00" arrivalPosLat="0.00" arrivalSpeed="15.56" duration="184.25" routeLength="1986.69" waitingTime="48.35" waitingCount="1" stopTime="0.00" timeLoss="55.87" rerouteNo="1" devices="tripinfo_car_s2e_154 routing_car_s2e_154" vType="Car" speedFactor="1.12" vaporized=""/>
    <tripinfo id="car_n2w_151" depart="151.00" departLane="n2sep_1" departPos="3.60" departPosLat="0.00" departSpeed="13.90" departDelay="0.00" arrival="344.10" arrivalLane="c2w_1" arrivalPos="990.00" arrivalPosLat="0.00" arrivalSpeed="14.23" duration="193.10" routeLength="1986.69" waitingTime="45.75" waitingCount="1" stopTime="0.00" timeLoss="52.76" rerouteNo="1" devices="tripinfo_car_n2w_151 routing_car_n2w_151" vType="Car" speedFactor="1.02" vaporized=""/>
    <tripinfo id="car_n2w_153" depart="153.00" departLane="n2sep_1" departPos="3.60" departPosLat="0.00" departSpeed="13.90" departDelay="0.00" arrival="346.30" arrivalLane="c2w_1" arrivalPos="990.00" arrivalPosLat="0.00" arrivalSpeed="15.35" duration="193.30" routeLength="1986.69" waitingTime="44.65" waitingCount="1" stopTime="0.00" timeLoss="66.36" rerouteNo="1" devices="tripinfo_car_n2w_153 routing_car_n2w_153" vType="Car" speedFactor="1.13" vaporized=""/>
    <tripinfo id="car_s2n_157" depart="157.00" departLane="s2sep_1" departPos="3.60" departPosLat="0.00" departSpeed="13.90" departDelay="0.00" arrival="346.75" arrivalLane="c2n_1" arrivalPos="990.00" arrivalPosLat="0.00" arrivalSpeed="14.12" duration="189.75" routeLength="1997.01" waitingTime="39.60" waitingCount="1" stopTime="0.00" timeLoss="48.31" rerouteNo="1" devices="tripinfo_car_s2n_157 routing_car_s2n_157" vType="Car" speedFactor="1.02" vaporized=""/>
    <tripinfo id="car_s2n_161" depart="161.00" departLane="s2sep_1" departPos="3.60" departPosLat="0.00" departSpeed="13.90" departDelay="0.00" arrival="348.75" arrivalLane="c2n_1" arrivalPos="990.00" arrivalPosLat="0.00" arrivalSpeed="15.45" duration="187.75" routeLength="1997.01" waitingTime="38.85" waitingCount="1" stopTime="0.00" timeLoss="63.30" rerouteNo="1" devices="tripinfo_car_s2n_161 routing_car_s2n_161" vType="Car" speedFactor="1.15" vaporized=""/>
    <tripinfo id="car_n2s_158" depart="158.00" departLane="n2sep_1" departPos="3.60" departPosLat="0.00" departSpeed="13.90" departDelay="0.00" arrival="350.10" arrivalLane="c2s_1" arrivalPos="990.00" arrivalPosLat="0.00" arrivalSpeed="13.90" duration="192.10" routeLength="1997.01" waitingTime="37.65" waitingCount="1" stopTime="0.00" timeLoss="48.41" rerouteNo="1" devices="tripinfo_car_n2s_158 routing_car_n2s_158" vType="Car" speedFactor="1.00" vaporized=""/>
    <tripinfo id="car_n2s_204" depart="204.00" departLane="n2sep_1" departPos="3.60" departPosLat="0.00" departSpeed="13.90" departDelay="0.00" arrival="352.05" arrivalLane="c2s_1" arrivalPos="990.00" arrivalPosLat="0.00" arrivalSpeed="15.30" duration="148.05" routeLength="1997.01" waitingTime="2.70" waitingCount="1" stopTime="0.00" timeLoss="22.86" rerouteNo="1" devices="tripinfo_car_n2s_204 routing_car_n2s_204" vType="Car" speedFactor="1.15" vaporized=""/>
    <tripinfo id="car_s2n_172" depart="172.40" departLane="s2sep_1" departPos="3.60" departPosLat="0.00" departSpeed="13.90" departDelay="0.40" arrival="352.85" arrivalLane="c2n_1" arrivalPos="990.00" arrivalPosLat="0.00" arrivalSpeed="14.21" duration="180.45" routeLength="1997.01" waitingTime="25.00" waitingCount="1" stopTime="0.00" timeLoss="40.01" rerouteNo="1" devices="tripinfo_car_s2n_172 routing_car_s2n_172" vType="Car" speedFactor="1.02" vaporized=""/>
    <tripinfo id="car_s2e_178" depart="178.50" departLane="s2sep_1" departPos="3.60" departPosLat="0.00" departSpeed="13.90" departDelay="0.50" arrival="354.25" arrivalLane="c2e_1" arrivalPos="990.00" arrivalPosLat="0.00" arrivalSpeed="14.35" duration="175.75" routeLength="1986.69" waitingTime="20.20" waitingCount="1" stopTime="0.00" timeLoss="36.61" rerouteNo="1" devices="tripinfo_car_s2e_178 routing_car_s2e_178" vType="Car" speedFactor="1.03" vaporized=""/>
    <tripinfo id="car_s2w_162" depart="162.30" departLane="s2sep_1" departPos="3.60" departPosLat="0.00" departSpeed="13.90" departDelay="0.30" arrival="354.85" arrivalLane="c2w_1" arrivalPos="990.00" arrivalPosLat="0.00" arrivalSpeed="13.97" duration="192.55" routeLength="1996.47" waitingTime="36.15" waitingCount="2" stopTime="0.00" timeLoss="48.94" rerouteNo="1" devices="tripinfo_car_s2w_162 routing_car_s2w_162" vType="Car" speedFactor="1.01" vaporized=""/>
    <tripinfo id="car_s2n_177" depart="177.00" departLane="s2sep_1" departPos="3.60" departPosLat="0.00" departSpeed="13.90" departDelay="0.00" arrival="356.95" arrivalLane="c2n_1" arrivalPos="990.00" arrivalPosLat="0.00" arrivalSpeed="13.89" duration="179.95" routeLength="1997.01" waitingTime="21.60" waitingCount="1" stopTime="0.00" timeLoss="36.26" rerouteNo="1" devices="tripinfo_car_s2n_177 routing_car_s2n_177" vType="Car" speedFactor="1.00" vaporized=""/>
    <tripinfo id="car_n2s_213" depart="214.45" departLane="n2sep_1" departPos="3.60" departPosLat="0.00" departSpeed="13.90" departDelay="1.45" arrival="359.30" arrivalLane="c2s_1" arrivalPos="990.00" arrivalPosLat="0.00" arrivalSpeed="14.49" duration="144.85" routeLength="1997.01" waitingTime="0.00" waitingCount="0" stopTime="0.00" timeLoss="7.04" rerouteNo="1" devices="tripinfo_car_n2s_213 routing_car_n2s_213" vType="Car" speedFactor="1.04" vaporized=""/>
    <tripinfo id="car_s2n_200" depart="200.00" departLane="s2sep_1" departPos="3.60" departPosLat="0.00" departSpeed="13.90" departDelay="0.00" arrival="360.05" arrivalLane="c2n_1" arrivalPos="990.00" arrivalPosLat="0.00" arrivalSpeed="14.07" duration="160.05" routeLength="1997.01" waitingTime="3.20" waitingCount="1" stopTime="0.00" timeLoss="18.76" rerouteNo="1" devices="tripinfo_car_s2n_200 routing_car_s2n_200" vType="Car" speedFactor="1.02" vaporized=""/>
    <tripinfo id="car_n2w_213" depart="213.00" departLane="n2sep_1" departPos="3.60" departPosLat="0.00" departSpeed="13.90" departDelay="0.00" arrival="360.95" arrivalLane="c2w_1" arrivalPos="990.00" arrivalPosLat="0.00" arrivalSpeed="13.92" duration="147.95" routeLength="1986.69" waitingTime="0.00" waitingCount="0" stopTime="0.00" timeLoss="4.52" rerouteNo="1" devices="tripinfo_car_n2w_213 routing_car_n2w_213" vType="Car" speedFactor="1.00" vaporized=""/>
    <tripinfo id="car_s2e_214" depart="215.45" departLane="s2sep_1" departPos="3.60" departPosLat="0.00" departSpeed="13.90" departDelay="1.45" arrival="363.20" arrivalLane="c2e_1" arrivalPos="990.00" arrivalPosLat="0.00" arrivalSpeed="14.21" duration="147.75" routeLength="1986.69" waitingTime="0.00" waitingCount="0" stopTime="0.00" timeLoss="7.20" rerouteNo="1" devices="tripinfo_car_s2e_214 routing_car_s2e_214" vType="Car" speedFactor="1.02" vaporized=""/>
    <tripinfo id="car_n2e_153" depart="154.45" departLane="n2sep_1" departPos="3.60" departPosLat="0.00" departSpeed="13.90" departDelay="1.45" arrival="365.95" arrivalLane="c2e_1" arrivalPos="990.00" arrivalPosLat="0.00" arrivalSpeed="14.91" duration="211.50" routeLength="1996.47" waitingTime="58.60" waitingCount="2" stopTime="0.00" timeLoss="78.16" rerouteNo="1" devices="tripinfo_car_n2e_153 routing_car_n2e_153" vType="Car" speedFactor="1.08" vaporized=""/>
    <tripinfo id="car_n2w_216" depart="216.20" departLane="n2sep_1" departPos="3.60" departPosLat="0.00" departSpeed="13.90" departDelay="0.20" arrival="366.25" arrivalLane="c2w_1" arrivalPos="990.00" arrivalPosLat="0.00" arrivalSpeed="14.13" duration="150.05" routeLength="1986.69" waitingTime="0.00" waitingCount="0" stopTime="0.00" timeLoss="8.70" rerouteNo="1" devices="tripinfo_car_n2w_216 routing_car_n2w_216" vType="Car" speedFactor="1.02" vaporized=""/>
    <tripinfo id="car_s2w_171" depart="171.00" departLane="s2sep_1" departPos="3.60" departPosLat="0.00" departSpeed="13.90" departDelay="0.00" arrival="369.60" arrivalLane="c2w_1" arrivalPos="990.00" arrivalPosLat="0.00" arrivalSpeed="14.41" duration="198.60" routeLength="1996.47" waitingTime="40.50" waitingCount="3" stopTime="0.00" timeLoss="59.83" rerouteNo="1" devices="tripinfo_car_s2w_171 routing_car_s2w_171" vType="Car" speedFactor="1.04" vaporized=""/>
    <tripinfo id="car_s2w_214" depart="214.00" departLane="s2sep_1" departPos="3.60" departPosLat="0.00" departSpeed="13.90" departDelay="0.00" arrival="373.85" arrivalLane="c2w_1" arrivalPos="990.00" arrivalPosLat="0.00" arrivalSpeed="13.99" duration="159.85" routeLength="1996.47" waitingTime="6.15" waitingCount="1" stopTime="0.00" timeLoss="16.55" rerouteNo="1" devices="tripinfo_car_s2w_214 routing_car_s2w_214" vType="Car" speedFactor="1.01" vaporized=""/>
    <tripinfo id="car_s2w_223" depart="223.00" departLane="s2sep_1" departPos="3.60" departPosLat="0.00" departSpeed="13.90" departDelay="0.00" arrival="376.70" arrivalLane="c2w_1" arrivalPos="990.00" arrivalPosLat="0.00" arrivalSpeed="14.33" duration="153.70" routeLength="1996.47" waitingTime="0.00" waitingCount="0" stopTime="0.00" timeLoss="14.62" rerouteNo="1" devices="tripinfo_car_s2w_223 routing_car_s2w_223" vType="Car" speedFactor="1.04" vaporized=""/>
    <tripinfo id="car_s2w_234" depart="234.00" departLane="s2sep_1" departPos="3.60" departPosLat="0.00" departSpeed="13.90" departDelay="0.00" arrival="378.90" arrivalLane="c2w_1" arrivalPos="990.00" arrivalPosLat="0.00" arrivalSpeed="14.83" duration="144.90" routeLength="1996.47" waitingTime="0.00" waitingCount="0" stopTime="0.00" timeLoss="12.60" rerouteNo="1" devices="tripinfo_car_s2w_234 routing_car_s2w_234" vType="Car" speedFactor="1.09" vaporized=""/>
    <tripinfo id="car_e2w_217" depart="217.00" departLane="e2sep_1" departPos="3.60" departPosLat="0.00" departSpeed="13.90" departDelay="0.00" arrival="385.25" arrivalLane="c2w_1" arrivalPos="990.00" arrivalPosLat="0.00" arrivalSpeed="15.18" duration="168.25" routeLength="1997.01" waitingTime="28.55" waitingCount="1" stopTime="0.00" timeLoss="36.65" rerouteNo="1" devices="tripinfo_car_e2w_217 routing_car_e2w_217" vType="Car" speedFactor="1.09" vaporized=""/>
    <tripinfo id="car_w2s_191" depart="191.00" departLane="w2sep_1" departPos="3.60" departPosLat="0.00" departSpeed="13.90" departDelay="0.00" arrival="388.30" arrivalLane="c2s_1" arrivalPos="990.00" arrivalPosLat="0.00" arrivalSpeed="14.38" duration="197.30" routeLength="1986.69" waitingTime="50.30" waitingCount="1" stopTime="0.00" timeLoss="58.43" rerouteNo="1" devices="tripinfo_car_w2s_191 routing_car_w2s_191" vType="Car" speedFactor="1.03" vaporized=""/>
    <tripinfo id="car_e2n_236" depart="236.00" departLane="e2sep_1" departPos="3.60" departPosLat="0.00" departSpeed="13.90" departDelay="0.00" arrival="389.20" arrivalLane="c2n_1" arrivalPos="990.00" arrivalPosLat="0.00" arrivalSpeed="14.69" duration="153.20" routeLength="1986.69" waitingTime="7.95" waitingCount="1" stopTime="0.00" timeLoss="17.25" rerouteNo="1" devices="tripinfo_car_e2n_236 routing_car_e2n_236" vType="Car" speedFactor="1.06" vaporized=""/>
    <tripinfo id="car_e2w_242" depart="242.00" departLane="e2sep_1" departPos="3.60" departPosLat="0.00" departSpeed="13.90" departDelay="0.00" arrival="389.80" arrivalLane="c2w_1" arrivalPos="990.00" arrivalPosLat="0.00" arrivalSpeed="15.24" duration="147.80" routeLength="1997.01" waitingTime="5.30" waitingCount="1" stopTime="0.00" timeLoss="16.86" rerouteNo="1" devices="tripinfo_car_e2w_242 routing_car_e2w_242" vType="Car" speedFactor="1.10" vaporized=""/>
    <tripinfo id="car_w2e_242" depart="242.00" departLane="w2sep_1" departPos="3.60" departPosLat="0.00" departSpeed="13.90" departDelay="0.00" arrival="391.85" arrivalLane="c2e_1" arrivalPos="990.00" arrivalPosLat="0.00" arrivalSpeed="15.12" duration="149.85" routeLength="1997.01" waitingTime="6.55" waitingCount="1" stopTime="0.00" timeLoss="17.77" rerouteNo="1" devices="tripinfo_car_w2e_242 routing_car_w2e_242" vType="Car" speedFactor="1.09" vaporized=""/>
    <tripinfo id="car_w2s_197" depart="197.00" departLane="w2sep_1" departPos="3.60" departPosLat="0.00" departSpeed="13.90" departDelay="0.00" arrival="394.45" arrivalLane="c2s_1" arrivalPos="990.00" arrivalPosLat="0.00" arrivalSpeed="13.90" duration="197.45" routeLength="1986.69" waitingTime="43.60" waitingCount="1" stopTime="0.00" timeLoss="53.77" rerouteNo="1" devices="tripinfo_car_w2s_197 routing_car_w2s_197" vType="Car" speedFactor="1.00" vaporized=""/>
    <tripinfo id="car_e2n_245" depart="246.85" departLane="e2sep_1" departPos="3.60" departPosLat="0.00" departSpeed="13.90" departDelay="1.85" arrival="395.00" arrivalLane="c2n_1" arrivalPos="990.00" arrivalPosLat="0.00" arrivalSpeed="14.91" duration="148.15" routeLength="1986.69" waitingTime="0.00" waitingCount="0" stopTime="0.00" timeLoss="14.23" rerouteNo="1" devices="tripinfo_car_e2n_245 routing_car_e2n_245" vType="Car" speedFactor="1.07" vaporized=""/>
    <tripinfo id="car_e2w_244" depart="245.00" departLane="e2sep_1" departPos="3.60" departPosLat="0.00" departSpeed="13.90" departDelay="1.00" arrival="397.75" arrivalLane="c2w_1" arrivalPos="990.00" arrivalPosLat="0.00" arrivalSpeed="13.90" duration="152.75" routeLength="1997.01" waitingTime="0.00" waitingCount="0" stopTime="0.00" timeLoss="9.06" rerouteNo="1" devices="tripinfo_car_e2w_244 routing_car_e2w_244" vType="Car" speedFactor="1.00" vaporized=""/>
    <tripinfo id="car_w2s_211" depart="211.00" departLane="w2sep_1" departPos="3.60" departPosLat="0.00" departSpeed="13.90" departDelay="0.00" arrival="398.40" arrivalLane="c2s_1" arrivalPos="990.00" arrivalPosLat="0.00" arrivalSpeed="13.88" duration="187.40" routeLength="1986.69" waitingTime="31.00" waitingCount="1" stopTime="0.00" timeLoss="43.74" rerouteNo="1" devices="tripinfo_car_w2s_211 routing_car_w2s_211" vType="Car" speedFactor="1.00" vaporized=""/>
    <tripinfo id="car_w2e_244" depart="245.10" departLane="w2sep_1" departPos="3.60" departPosLat="0.00" departSpeed="13.90" departDelay="1.10" arrival="400.25" arrivalLane="c2e_1" arrivalPos="990.00" arrivalPosLat="0.00" arrivalSpeed="13.90" duration="155.15" routeLength="1997.01" waitingTime="0.00" waitingCount="0" stopTime="0.00" timeLoss="11.47" rerouteNo="1" devices="tripinfo_car_w2e_244 routing_car_w2e_244" vType="Car" speedFactor="1.00" vaporized=""/>
    <tripinfo id="bus_e2w_256" depart="256.00" departLane="e2sep_1" departPos="12.10" departPosLat="0.00" departSpeed="13.90" departDelay="0.00" arrival="402.80" arrivalLane="c2w_1" arrivalPos="990.00" arrivalPosLat="0.00" arrivalSpeed="13.87" duration="146.80" routeLength="1988.51" waitingTime="0.00" waitingCount="0" stopTime="0.00" timeLoss="3.73" rerouteNo="1" devices="tripinfo_bus_e2w_256 routing_bus_e2w_256" vType="Bus" speedFactor="1.00" vaporized=""/>
    <tripinfo id="car_w2e_248" depart="248.00" departLane="w2sep_1" departPos="3.60" departPosLat="0.00" departSpeed="13.90" departDelay="0.00" arrival="403.90" arrivalLane="c2e_1" arrivalPos="990.00" arrivalPosLat="0.67" arrivalSpeed="14.07" duration="155.90" routeLength="1997.01" waitingTime="0.00" waitingCount="0" stopTime="0.00" timeLoss="14.17" rerouteNo="1" devices="tripinfo_car_w2e_248 routing_car_w2e_248" vType="Car@car_w2e_248" speedFactor="1.01" vaporized=""/>
    <tripinfo id="car_w2s_251" depart="251.00" departLane="w2sep_1" departPos="3.60" departPosLat="0.00" departSpeed="13.90" departDelay="0.00" arrival="404.30" arrivalLane="c2s_1" arrivalPos="990.00" arrivalPosLat="0.00" arrivalSpeed="13.90" duration="153.30" routeLength="1986.69" waitingTime="0.00" waitingCount="0" stopTime="0.00" timeLoss="9.62" rerouteNo="1" devices="tripinfo_car_w2s_251 routing_car_w2s_251" vType="Car" speedFactor="1.00" vaporized=""/>
    <tripinfo id="amb_w2e_300" depart="300.00" departLane="w2sep_1" departPos="6.60" departPosLat="0.00" departSpeed="13.90" departDelay="0.00" arrival="405.40" arrivalLane="c2e_1" arrivalPos="990.00" arrivalPosLat="0.95" arrivalSpeed="17.25" duration="105.40" routeLength="1994.01" waitingTime="0.00" waitingCount="0" stopTime="0.00" timeLoss="9.74" rerouteNo="1" devices="tripinfo_amb_w2e_300 routing_amb_w2e_300 bluelight_amb_w2e_300 fcd_amb_w2e_300" vType="Ambulance" speedFactor="1.50" vaporized="">
        <example_device customValue1="0.00" customValue2="-1.00"/>
    </tripinfo>
    <tripinfo id="car_e2n_271" depart="271.00" departLane="e2sep_1" departPos="3.60" departPosLat="0.00" departSpeed="13.90" departDelay="0.00" arrival="406.70" arrivalLane="c2n_1" arrivalPos="990.00" arrivalPosLat="0.00" arrivalSpeed="15.23" duration="135.70" routeLength="1986.69" waitingTime="0.00" waitingCount="0" stopTime="0.00" timeLoss="4.60" rerouteNo="1" devices="tripinfo_car_e2n_271 routing_car_e2n_271" vType="Car" speedFactor="1.10" vaporized=""/>
    <tripinfo id="car_e2w_257" depart="257.50" departLane="e2sep_1" departPos="3.60" departPosLat="0.00" departSpeed="13.90" departDelay="0.50" arrival="407.05" arrivalLane="c2w_1" arrivalPos="990.00" arrivalPosLat="0.00" arrivalSpeed="14.01" duration="149.55" routeLength="1997.01" waitingTime="0.00" waitingCount="0" stopTime="0.00" timeLoss="7.14" rerouteNo="1" devices="tripinfo_car_e2w_257 routing_car_e2w_257" vType="Car" speedFactor="1.01" vaporized=""/>
    <tripinfo id="car_e2s_202" depart="202.00" departLane="e2sep_1" departPos="3.60" departPosLat="0.00" departSpeed="13.90" departDelay="0.00" arrival="407.55" arrivalLane="c2s_1" arrivalPos="990.00" arrivalPosLat="0.00" arrivalSpeed="14.27" duration="205.55" routeLength="1996.47" waitingTime="51.95" waitingCount="2" stopTime="0.00" timeLoss="65.49" rerouteNo="1" devices="tripinfo_car_e2s_202 routing_car_e2s_202" vType="Car" speedFactor="1.03" vaporized=""/>
    <tripinfo id="car_e2s_230" depart="230.00" departLane="e2sep_1" departPos="3.60" departPosLat="0.00" departSpeed="13.90" departDelay="0.00" arrival="410.45" arrivalLane="c2s_1" arrivalPos="990.00" arrivalPosLat="0.00" arrivalSpeed="14.41" duration="180.45" routeLength="1996.47" waitingTime="24.40" waitingCount="2" stopTime="0.00" timeLoss="42.13" rerouteNo="1" devices="tripinfo_car_e2s_230 routing_car_e2s_230" vType="Car" speedFactor="1.04" vaporized=""/>
    <tripinfo id="car_e2s_242" depart="243.30" departLane="e2sep_1" departPos="3.60" departPosLat="0.00" departSpeed="13.90" departDelay="1.30" arrival="413.00" arrivalLane="c2s_1" arrivalPos="990.00" arrivalPosLat="0.00" arrivalSpeed="14.64" duration="169.70" routeLength="1996.47" waitingTime="8.45" waitingCount="1" stopTime="0.00" timeLoss="34.17" rerouteNo="1" devices="tripinfo_car_e2s_242 routing_car_e2s_242" vType="Car" speedFactor="1.07" vaporized=""/>
    <tripinfo id="car_e2s_249" depart="249.00" departLane="e2sep_1" departPos="3.60" departPosLat="0.00" departSpeed="13.90" departDelay="0.00" arrival="415.95" arrivalLane="c2s_1" arrivalPos="990.00" arrivalPosLat="0.00" arrivalSpeed="14.30" duration="166.95" routeLength="1996.47" waitingTime="7.85" waitingCount="1" stopTime="0.00" timeLoss="27.43" rerouteNo="1" devices="tripinfo_car_e2s_249 routing_car_e2s_249" vType="Car" speedFactor="1.03" vaporized=""/>
    <tripinfo id="car_w2n_243" depart="243.30" departLane="w2sep_1" departPos="3.60" departPosLat="0.00" departSpeed="13.90" departDelay="0.30" arrival="416.35" arrivalLane="c2n_1" arrivalPos="990.00" arrivalPosLat="0.00" arrivalSpeed="13.90" duration="173.05" routeLength="1996.47" waitingTime="20.00" waitingCount="2" stopTime="0.00" timeLoss="28.70" rerouteNo="1" devices="tripinfo_car_w2n_243 routing_car_w2n_243" vType="Car" speedFactor="1.00" vaporized=""/>
    <tripinfo id="car_e2s_275" depart="275.00" departLane="e2sep_1" departPos="3.60" departPosLat="0.00" departSpeed="13.90" departDelay="0.00" arrival="417.75" arrivalLane="c2s_1" arrivalPos="990.00" arrivalPosLat="0.00" arrivalSpeed="15.47" duration="142.75" routeLength="1996.47" waitingTime="0.00" waitingCount="0" stopTime="0.00" timeLoss="20.15" rerouteNo="1" devices="tripinfo_car_e2s_275 routing_car_e2s_275" vType="Car" speedFactor="1.18" vaporized=""/>
    <tripinfo id="car_w2n_253" depart="253.00" departLane="w2sep_1" departPos="3.60" departPosLat="0.00" departSpeed="13.90" departDelay="0.00" arrival="418.20" arrivalLane="c2n_1" arrivalPos="990.00" arrivalPosLat="0.00" arrivalSpeed="15.42" duration="165.20" routeLength="1996.47" waitingTime="10.20" waitingCount="1" stopTime="0.00" timeLoss="41.73" rerouteNo="1" devices="tripinfo_car_w2n_253 routing_car_w2n_253" vType="Car" speedFactor="1.17" vaporized=""/>
    <tripinfo id="car_e2w_291" depart="291.00" departLane="e2sep_1" departPos="3.60" departPosLat="0.00" departSpeed="13.90" departDelay="0.00" arrival="423.95" arrivalLane="c2w_1" arrivalPos="990.00" arrivalPosLat="0.00" arrivalSpeed="15.33" duration="132.95" routeLength="1997.01" waitingTime="0.00" waitingCount="0" stopTime="0.00" timeLoss="2.69" rerouteNo="1" devices="tripinfo_car_e2w_291 routing_car_e2w_291" vType="Car" speedFactor="1.10" vaporized=""/>
    <tripinfo id="car_w2e_281" depart="281.00" departLane="w2sep_1" departPos="3.60" departPosLat="0.00" departSpeed="13.90" departDelay="0.00" arrival="424.35" arrivalLane="c2e_1" arrivalPos="990.00" arrivalPosLat="-1.10" arrivalSpeed="13.94" duration="143.35" routeLength="1997.01" waitingTime="0.00" waitingCount="0" stopTime="0.00" timeLoss="0.11" rerouteNo="1" devices="tripinfo_car_w2e_281 routing_car_w2e_281" vType="Car@car_w2e_281" speedFactor="1.00" vaporized=""/>
    <tripinfo id="car_n2s_242" depart="242.00" departLane="n2sep_1" departPos="3.60" departPosLat="0.00" departSpeed="13.90" departDelay="0.00" arrival="441.40" arrivalLane="c2s_1" arrivalPos="990.00" arrivalPosLat="0.00" arrivalSpeed="15.59" duration="199.40" routeLength="1997.01" waitingTime="64.05" waitingCount="1" stopTime="0.00" timeLoss="71.30" rerouteNo="1" devices="tripinfo_car_n2s_242 routing_car_n2s_242" vType="Car" speedFactor="1.12" vaporized=""/>
    <tripinfo id="car_n2s_262" depart="262.00" departLane="n2sep_1" departPos="3.60" departPosLat="0.00" departSpeed="13.90" departDelay="0.00" arrival="446.50" arrivalLane="c2s_1" arrivalPos="990.00" arrivalPosLat="0.00" arrivalSpeed="15.23" duration="184.50" routeLength="1997.01" waitingTime="42.40" waitingCount="1" stopTime="0.00" timeLoss="53.42" rerouteNo="1" devices="tripinfo_car_n2s_262 routing_car_n2s_262" vType="Car" speedFactor="1.10" vaporized=""/>
    <tripinfo id="car_s2e_237" depart="237.00" departLane="s2sep_1" departPos="3.60" departPosLat="0.00" departSpeed="13.90" departDelay="0.00" arrival="448.15" arrivalLane="c2e_1" arrivalPos="990.00" arrivalPosLat="0.00" arrivalSpeed="14.04" duration="211.15" routeLength="1986.69" waitingTime="61.55" waitingCount="1" stopTime="0.00" timeLoss="68.90" rerouteNo="1" devices="tripinfo_car_s2e_237 routing_car_s2e_237" vType="Car" speedFactor="1.01" vaporized=""/>
    <tripinfo id="car_n2s_282" depart="282.00" departLane="n2sep_1" departPos="3.60" departPosLat="0.00" departSpeed="13.90" departDelay="0.00" arrival="450.85" arrivalLane="c2s_1" arrivalPos="990.00" arrivalPosLat="0.00" arrivalSpeed="14.87" duration="168.85" routeLength="1997.01" waitingTime="22.55" waitingCount="1" stopTime="0.00" timeLoss="34.68" rerouteNo="1" devices="tripinfo_car_n2s_282 routing_car_n2s_282" vType="Car" speedFactor="1.07" vaporized=""/>
    <tripinfo id="car_s2n_244" depart="244.00" departLane="s2sep_1" departPos="3.60" departPosLat="0.00" departSpeed="13.90" departDelay="0.00" arrival="451.00" arrivalLane="c2n_1" arrivalPos="990.00" arrivalPosLat="0.00" arrivalSpeed="13.90" duration="207.00" routeLength="1997.01" waitingTime="54.85" waitingCount="1" stopTime="0.00" timeLoss="63.32" rerouteNo="1" devices="tripinfo_car_s2n_244 routing_car_s2n_244" vType="Car" speedFactor="1.00" vaporized=""/>
    <tripinfo id="car_n2e_257" depart="257.00" departLane="n2sep_1" departPos="3.60" departPosLat="0.00" departSpeed="13.90" departDelay="0.00" arrival="452.40" arrivalLane="c2e_1" arrivalPos="990.00" arrivalPosLat="0.00" arrivalSpeed="15.25" duration="195.40" routeLength="1996.47" waitingTime="51.80" waitingCount="2" stopTime="0.00" timeLoss="64.03" rerouteNo="1" devices="tripinfo_car_n2e_257 routing_car_n2e_257" vType="Car" speedFactor="1.10" vaporized=""/>
    <tripinfo id="car_s2n_249" depart="249.00" departLane="s2sep_1" departPos="3.60" departPosLat="0.00" departSpeed="13.90" departDelay="0.00" arrival="453.65" arrivalLane="c2n_1" arrivalPos="990.00" arrivalPosLat="0.00" arrivalSpeed="14.65" duration="204.65" routeLength="1997.01" waitingTime="53.50" waitingCount="1" stopTime="0.00" timeLoss="69.70" rerouteNo="1" devices="tripinfo_car_s2n_249 routing_car_s2n_249" vType="Car" speedFactor="1.06" vaporized=""/>
    <tripinfo id="car_n2e_308" depart="308.00" departLane="n2sep_1" departPos="3.60" departPosLat="0.00" departSpeed="13.90" departDelay="0.00" arrival="455.00" arrivalLane="c2e_1" arrivalPos="990.00" arrivalPosLat="0.00" arrivalSpeed="15.83" duration="147.00" routeLength="1996.47" waitingTime="2.60" waitingCount="1" stopTime="0.00" timeLoss="21.80" rerouteNo="1" devices="tripinfo_car_n2e_308 routing_car_n2e_308" vType="Car" speedFactor="1.15" vaporized=""/>
    <tripinfo id="car_n2s_305" depart="305.00" departLane="n2sep_1" departPos="3.60" departPosLat="0.00" departSpeed="13.90" departDelay="0.00" arrival="455.80" arrivalLane="c2s_1" arrivalPos="990.00" arrivalPosLat="0.00" arrivalSpeed="14.22" duration="150.80" routeLength="1997.01" waitingTime="0.00" waitingCount="0" stopTime="0.00" timeLoss="10.38" rerouteNo="1" devices="tripinfo_car_n2s_305 routing_car_n2s_305" vType="Car" speedFactor="1.02" vaporized=""/>
    <tripinfo id="car_s2w_256" depart="256.00" departLane="s2sep_1" departPos="3.60" departPosLat="0.00" departSpeed="13.90" departDelay="0.00" arrival="456.45" arrivalLane="c2w_1" arrivalPos="990.00" arrivalPosLat="0.00" arrivalSpeed="14.13" duration="200.45" routeLength="1996.47" waitingTime="47.30" waitingCount="2" stopTime="0.00" timeLoss="58.50" rerouteNo="1" devices="tripinfo_car_s2w_256 routing_car_s2w_256" vType="Car" speedFactor="1.02" vaporized=""/>
    <tripinfo id="car_s2n_290" depart="290.00" departLane="s2sep_1" departPos="3.60" departPosLat="0.00" departSpeed="13.90" departDelay="0.00" arrival="457.90" arrivalLane="c2n_1" arrivalPos="990.00" arrivalPosLat="0.00" arrivalSpeed="13.89" duration="167.90" routeLength="1997.01" waitingTime="11.40" waitingCount="1" stopTime="0.00" timeLoss="24.19" rerouteNo="1" devices="tripinfo_car_s2n_290 routing_car_s2n_290" vType="Car" speedFactor="1.00" vaporized=""/>
    <tripinfo id="car_s2w_277" depart="277.00" departLane="s2sep_1" departPos="3.60" departPosLat="0.00" departSpeed="13.90" departDelay="0.00" arrival="461.35" arrivalLane="c2w_1" arrivalPos="990.00" arrivalPosLat="0.00" arrivalSpeed="13.96" duration="184.35" routeLength="1996.47" waitingTime="25.60" waitingCount="2" stopTime="0.00" timeLoss="40.66" rerouteNo="1" devices="tripinfo_car_s2w_277 routing_car_s2w_277" vType="Car" speedFactor="1.00" vaporized=""/>
    <tripinfo id="car_s2w_302" depart="302.00" departLane="s2sep_1" departPos="3.60" departPosLat="0.00" departSpeed="13.90" departDelay="0.00" arrival="464.35" arrivalLane="c2w_1" arrivalPos="990.00" arrivalPosLat="0.00" arrivalSpeed="14.26" duration="162.35" routeLength="1996.47" waitingTime="0.90" waitingCount="1" stopTime="0.00" timeLoss="22.44" rerouteNo="1" devices="tripinfo_car_s2w_302 routing_car_s2w_302" vType="Car" speedFactor="1.03" vaporized=""/>
    <tripinfo id="car_s2w_320" depart="320.00" departLane="s2sep_1" departPos="3.60" departPosLat="0.00" departSpeed="13.90" departDelay="0.00" arrival="466.40" arrivalLane="c2w_1" arrivalPos="990.00" arrivalPosLat="0.00" arrivalSpeed="15.07" duration="146.40" routeLength="1996.47" waitingTime="0.00" waitingCount="0" stopTime="0.00" timeLoss="17.37" rerouteNo="1" devices="tripinfo_car_s2w_320 routing_car_s2w_320" vType="Car" speedFactor="1.12" vaporized=""/>
</tripinfos>
