<?xml version="1.0" encoding="UTF-8"?>

<!-- generated on Sat Apr 24 18:10:49 2021 by Eclipse SUMO Version 1.4.0
<configuration xmlns:xsi="http://www.w3.org/2001/XMLSchema-instance" xsi:noNamespaceSchemaLocation="http://sumo.dlr.de/xsd/sumoConfiguration.xsd">

    <input>
        <net-file value="sumofiles/junction.net.xml"/>
        <route-files value="sumofiles/junction_preemption_73.rou.xml"/>
        <additional-files value="sumofiles/junction.det.xml"/>
    </input>

    <output>
        <tripinfo-output value="sumofiles/output/tripinfo_preemption_73.xml"/>
    </output>

    <time>
        <begin value="0"/>
        <end value="10000"/>
        <step-length value="0.05"/>
    </time>

    <processing>
        <lateral-resolution value="0.1"/>
    </processing>

    <report>
        <no-warnings value="true"/>
        <error-log value="sumofiles/output/errorlog_preemption_73.log"/>
        <no-step-log value="true"/>
    </report>

    <traci_server>
        <remote-port value="48345"/>
    </traci_server>

    <gui_only>
        <gui-settings-file value="sumofiles/junction-gui.settings.xml"/>
        <tracker-interval value="0.05"/>
    </gui_only>

</configuration>
-->

<tripinfos xmlns:xsi="http://www.w3.org/2001/XMLSchema-instance" xsi:noNamespaceSchemaLocation="http://sumo.dlr.de/xsd/tripinfo_file.xsd">
    <tripinfo id="car_e2n_5" depart="5.00" departLane="e2sep_1" departPos="3.60" departPosLat="0.00" departSpeed="13.90" departDelay="0.00" arrival="144.30" arrivalLane="c2n_1" arrivalPos="990.00" arrivalPosLat="0.00" arrivalSpeed="14.73" duration="139.30" routeLength="1986.69" waitingTime="0.00" waitingCount="0" stopTime="0.00" timeLoss="3.74" rerouteNo="1" devices="tripinfo_car_e2n_5 routing_car_e2n_5" vType="Car" speedFactor="1.06" vaporized=""/>
    <tripinfo id="bus_w2s_5" depart="5.00" departLane="w2sep_1" departPos="12.10" departPosLat="0.00" departSpeed="13.90" departDelay="0.00" arrival="153.50" arrivalLane="c2s_1" arrivalPos="990.00" arrivalPosLat="0.00" arrivalSpeed="13.90" duration="148.50" routeLength="1978.19" waitingTime="0.00" waitingCount="0" stopTime="0.00" timeLoss="5.46" rerouteNo="1" devices="tripinfo_bus_w2s_5 routing_bus_w2s_5" vType="Bus" speedFactor="1.00" vaporized=""/>
    <tripinfo id="car_s2n_18" depart="18.45" departLane="s2sep_1" departPos="3.60" departPosLat="0.00" departSpeed="13.90" departDelay="0.45" arrival="163.80" arrivalLane="c2n_1" arrivalPos="990.00" arrivalPosLat="0.00" arrivalSpeed="14.54" duration="145.35" routeLength="1997.01" waitingTime="0.00" waitingCount="0" stopTime="0.00" timeLoss="7.94" rerouteNo="1" devices="tripinfo_car_s2n_18 routing_car_s2n_18" vType="Car" speedFactor="1.05" vaporized=""/>
    <tripinfo id="car_n2s_8" depart="8.00" departLane="n2sep_1" departPos="3.60" departPosLat="0.00" departSpeed="13.90" departDelay="0.00" arrival="165.15" arrivalLane="c2s_1" arrivalPos="990.00" arrivalPosLat="0.00" arrivalSpeed="14.04" duration="157.15" routeLength="1997.01" waitingTime="7.65" waitingCount="1" stopTime="0.00" timeLoss="14.94" rerouteNo="1" devices="tripinfo_car_n2s_8 routing_car_n2s_8" vType="Car" speedFactor="1.01" vaporized=""/>
    <tripinfo id="car_s2e_17" depart="17.00" departLane="s2sep_1" departPos="3.60" departPosLat="0.00" departSpeed="13.90" departDelay="0.00" arrival="165.25" arrivalLane="c2e_1" arrivalPos="990.00" arrivalPosLat="0.00" arrivalSpeed="13.90" duration="148.25" routeLength="1986.69" waitingTime="0.00" waitingCount="0" stopTime="0.00" timeLoss="4.54" rerouteNo="1" devices="tripinfo_car_s2e_17 routing_car_s2e_17" vType="Car" speedFactor="1.00" vaporized=""/>
    <tripinfo id="car_n2e_16" depart="16.00" departLane="n2sep_1" departPos="3.60" departPosLat="0.00" departSpeed="13.90" departDelay="0.00" arrival="167.75" arrivalLane="c2e_1" arrivalPos="990.00" arrivalPosLat="0.00" arrivalSpeed="14.85" duration="151.75" routeLength="1996.47" waitingTime="3.50" waitingCount="1" stopTime="0.00" timeLoss="18.43" rerouteNo="1" devices="tripinfo_car_n2e_16 routing_car_n2e_16" vType="Car" speedFactor="1.08" vaporized=""/>
    <tripinfo id="car_n2s_29" depart="29.40" departLane="n2sep_1" departPos="3.60" departPosLat="0.00" departSpeed="13.90" departDelay="0.40" arrival="168.10" arrivalLane="c2s_1" arrivalPos="990.00" arrivalPosLat="0.00" arrivalSpeed="15.06" duration="138.70" routeLength="1997.01" waitingTime="0.00" waitingCount="0" stopTime="0.00" timeLoss="6.97" rerouteNo="1" devices="tripinfo_car_n2s_29 routing_car_n2s_29" vType="Car" speedFactor="1.09" vaporized=""/>
    <tripinfo id="car_s2n_34" depart="34.00" departLane="s2sep_1" departPos="3.60" departPosLat="0.00" departSpeed="13.90" departDelay="0.00" arrival="171.75" arrivalLane="c2n_1" arrivalPos="990.00" arrivalPosLat="0.00" arrivalSpeed="15.61" duration="137.75" routeLength="1997.01" waitingTime="0.00" waitingCount="0" stopTime="0.00" timeLoss="9.81" rerouteNo="1" devices="tripinfo_car_s2n_34 routing_car_s2n_34" vType="Car" speedFactor="1.12" vaporized=""/>
    <tripinfo id="car_n2s_34" depart="34.00" departLane="n2sep_1" departPos="3.60" departPosLat="0.00" departSpeed="13.90" departDelay="0.00" arrival="174.00" arrivalLane="c2s_1" arrivalPos="990.00" arrivalPosLat="0.00" arrivalSpeed="14.55" duration="140.00" routeLength="1997.01" waitingTime="0.00" waitingCount="0" stopTime="0.00" timeLoss="2.77" rerouteNo="1" devices="tripinfo_car_n2s_34 routing_car_n2s_34" vType="Car" speedFactor="1.05" vaporized=""/>
    <tripinfo id="car_s2e_32" depart="32.00" departLane="s2sep_1" departPos="3.60" departPosLat="0.00" departSpeed="13.90" departDelay="0.00" arrival="176.15" arrivalLane="c2e_1" arrivalPos="990.00" arrivalPosLat="0.00" arrivalSpeed="14.27" duration="144.15" routeLength="1986.69" waitingTime="0.00" waitingCount="0" stopTime="0.00" timeLoss="4.17" rerouteNo="1" devices="tripinfo_car_s2e_32 routing_car_s2e_32" vType="Car" speedFactor="1.03" vaporized=""/>
    <tripinfo id="car_n2e_28" depart="28.00" departLane="n2sep_1" departPos="3.60" departPosLat="0.00" departSpeed="13.90" departDelay="0.00" arrival="181.20" arrivalLane="c2e_1" arrivalPos="990.00" arrivalPosLat="0.00" arrivalSpeed="14.32" duration="153.20" routeLength="1996.47" waitingTime="4.90" waitingCount="1" stopTime="0.00" timeLoss="13.11" rerouteNo="1" devices="tripinfo_car_n2e_28 routing_car_n2e_28" vType="Car" speedFactor="1.03" vaporized=""/>
    <tripinfo id="car_n2w_35" depart="35.40" departLane="n2sep_1" departPos="3.60" departPosLat="0.00" departSpeed="13.90" departDelay="0.40" arrival="184.85" arrivalLane="c2w_1" arrivalPos="990.00" arrivalPosLat="0.00" arrivalSpeed="13.90" duration="149.45" routeLength="1986.69" waitingTime="0.00" waitingCount="0" stopTime="0.00" timeLoss="5.78" rerouteNo="1" devices="tripinfo_car_n2w_35 routing_car_n2w_35" vType="Car" speedFactor="1.00" vaporized=""/>
    <tripinfo id="car_s2n_47" depart="47.00" departLane="s2sep_1" departPos="3.60" departPosLat="0.00" departSpeed="13.90" departDelay="0.00" arrival="188.40" arrivalLane="c2n_1" arrivalPos="990.00" arrivalPosLat="0.00" arrivalSpeed="14.15" duration="141.40" routeLength="1997.01" waitingTime="0.00" waitingCount="0" stopTime="0.00" timeLoss="0.27" rerouteNo="1" devices="tripinfo_car_s2n_47 routing_car_s2n_47" vType="Car" speedFactor="1.02" vaporized=""/>
    <tripinfo id="car_n2e_38" depart="38.00" departLane="n2sep_1" departPos="3.60" departPosLat="0.00" departSpeed="13.90" departDelay="0.00" arrival="193.15" arrivalLane="c2e_1" arrivalPos="990.00" arrivalPosLat="0.00" arrivalSpeed="13.90" duration="155.15" routeLength="1996.47" waitingTime="0.75" waitingCount="1" stopTime="0.00" timeLoss="10.80" rerouteNo="1" devices="tripinfo_car_n2e_38 routing_car_n2e_38" vType="Car" speedFactor="1.00" vaporized=""/>
    <tripinfo id="car_n2e_40" depart="40.00" departLane="n2sep_1" departPos="3.60" departPosLat="0.00" departSpeed="13.90" departDelay="0.00" arrival="197.45" arrivalLane="c2e_1" arrivalPos="990.00" arrivalPosLat="0.00" arrivalSpeed="13.89" duration="157.45" routeLength="1996.47" waitingTime="0.00" waitingCount="0" stopTime="0.00" timeLoss="13.12" rerouteNo="1" devices="tripinfo_car_n2e_40 routing_car_n2e_40" vType="Car" speedFactor="1.00" vaporized=""/>
    <tripinfo id="car_n2e_47" depart="47.00" departLane="n2sep_1" departPos="3.60" departPosLat="0.00" departSpeed="13.90" departDelay="0.00" arrival="199.30" arrivalLane="c2e_1" arrivalPos="990.00" arrivalPosLat="0.00" arrivalSpeed="15.28" duration="152.30" routeLength="1996.47" waitingTime="0.00" waitingCount="0" stopTime="0.00" timeLoss="27.69" rerouteNo="1" devices="tripinfo_car_n2e_47 routing_car_n2e_47" vType="Car" speedFactor="1.16" vaporized=""/>
    <tripinfo id="car_w2e_7" depart="7.00" departLane="w2sep_1" departPos="3.60" departPosLat="0.00" departSpeed="13.90" departDelay="0.00" arrival="207.05" arrivalLane="c2e_1" arrivalPos="990.00" arrivalPosLat="0.00" arrivalSpeed="14.73" duration="200.05" routeLength="1997.01" waitingTime="51.80" waitingCount="1" stopTime="0.00" timeLoss="64.50" rerouteNo="1" devices="tripinfo_car_w2e_7 routing_car_w2e_7" vType="Car" speedFactor="1.06" vaporized=""/>
    <tripinfo id="car_e2n_27" depart="27.00" departLane="e2sep_1" departPos="3.60" departPosLat="0.00" departSpeed="13.90" departDelay="0.00" arrival="207.65" arrivalLane="c2n_1" arrivalPos="990.00" arrivalPosLat="0.00" arrivalSpeed="15.05" duration="180.65" routeLength="1986.69" waitingTime="38.85" waitingCount="1" stopTime="0.00" timeLoss="47.95" rerouteNo="1" devices="tripinfo_car_e2n_27 routing_car_e2n_27" vType="Car" speedFactor="1.08" vaporized=""/>
    <tripinfo id="car_e2w_16" depart="16.00" departLane="e2sep_1" departPos="3.60" departPosLat="0.00" departSpeed="13.90" departDelay="0.00" arrival="208.70" arrivalLane="c2w_1" arrivalPos="990.00" arrivalPosLat="0.00" arrivalSpeed="14.32" duration="192.70" routeLength="1997.01" waitingTime="46.05" waitingCount="1" stopTime="0.00" timeLoss="53.21" rerouteNo="1" devices="tripinfo_car_e2w_16 routing_car_e2w_16" vType="Car" speedFactor="1.03" vaporized=""/>
    <tripinfo id="car_e2w_36" depart="36.00" departLane="e2sep_1" departPos="3.60" departPosLat="0.00" departSpeed="13.90" departDelay="0.00" arrival="213.10" arrivalLane="c2w_1" arrivalPos="990.00" arrivalPosLat="0.00" arrivalSpeed="14.53" duration="177.10" routeLength="1997.01" waitingTime="28.85" waitingCount="1" stopTime="0.00" timeLoss="39.72" rerouteNo="1" devices="tripinfo_car_e2w_36 routing_car_e2w_36" vType="Car" speedFactor="1.05" vaporized=""/>
    <tripinfo id="bus_w2e_16" depart="16.00" departLane="w2sep_1" departPos="12.10" departPosLat="0.00" departSpeed="13.90" departDelay="0.00" arrival="216.15" arrivalLane="c2e_1" arrivalPos="990.00" arrivalPosLat="0.00" arrivalSpeed="13.90" duration="200.15" routeLength="1988.51" waitingTime="46.10" waitingCount="1" stopTime="0.00" timeLoss="57.08" rerouteNo="1" devices="tripinfo_bus_w2e_16 routing_bus_w2e_16" vType="Bus" speedFactor="1.00" vaporized=""/>
    <tripinfo id="car_e2w_43" depart="43.00" departLane="e2sep_1" departPos="3.60" departPosLat="0.00" departSpeed="13.90" departDelay="0.00" arrival="218.60" arrivalLane="c2w_1" arrivalPos="990.00" arrivalPosLat="0.00" arrivalSpeed="13.90" duration="175.60" routeLength="1997.01" waitingTime="20.10" waitingCount="1" stopTime="0.00" timeLoss="31.89" rerouteNo="1" devices="tripinfo_car_e2w_43 routing_car_e2w_43" vType="Car" speedFactor="1.00" vaporized=""/>
    <tripinfo id="car_w2s_71" depart="71.00" departLane="w2sep_1" departPos="3.60" departPosLat="0.00" departSpeed="13.90" departDelay="0.00" arrival="218.75" arrivalLane="c2s_1" arrivalPos="990.00" arrivalPosLat="0.00" arrivalSpeed="13.90" duration="147.75" routeLength="1986.69" waitingTime="0.00" waitingCount="0" stopTime="0.00" timeLoss="4.09" rerouteNo="1" devices="tripinfo_car_w2s_71 routing_car_w2s_71" vType="Car" speedFactor="1.00" vaporized=""/>
    <tripinfo id="car_w2e_74" depart="74.30" departLane="w2sep_1" departPos="3.60" departPosLat="0.00" departSpeed="13.90" departDelay="0.30" arrival="218.75" arrivalLane="c2e_1" arrivalPos="990.00" arrivalPosLat="0.00" arrivalSpeed="15.36" duration="144.45" routeLength="1997.01" waitingTime="0.00" waitingCount="0" stopTime="0.00" timeLoss="17.48" rerouteNo="1" devices="tripinfo_car_w2e_74 routing_car_w2e_74" vType="Car" speedFactor="1.13" vaporized=""/>
    <tripinfo id="car_e2n_49" depart="49.00" departLane="e2sep_1" departPos="3.60" departPosLat="0.00" departSpeed="13.90" departDelay="0.00" arrival="218.95" arrivalLane="c2n_1" arrivalPos="990.00" arrivalPosLat="0.00" arrivalSpeed="14.04" duration="169.95" routeLength="1986.69" waitingTime="15.80" waitingCount="1" stopTime="0.00" timeLoss="27.73" rerouteNo="1" devices="tripinfo_car_e2n_49 routing_car_e2n_49" vType="Car" speedFactor="1.01" vaporized=""/>
    <tripinfo id="car_e2s_55" depart="55.00" departLane="e2sep_1" departPos="3.60" departPosLat="0.00" departSpeed="13.90" departDelay="0.00" arrival="221.25" arrivalLane="c2s_1" arrivalPos="990.00" arrivalPosLat="0.00" arrivalSpeed="14.95" duration="166.25" routeLength="1996.47" waitingTime="17.75" waitingCount="2" stopTime="0.00" timeLoss="33.93" rerouteNo="1" devices="tripinfo_car_e2s_55 routing_car_e2s_55" vType="Car" speedFactor="1.09" vaporized=""/>
    <tripinfo id="car_e2n_68" depart="68.00" departLane="e2sep_1" departPos="3.60" departPosLat="0.00" departSpeed="13.90" departDelay="0.00" arrival="222.10" arrivalLane="c2n_1" arrivalPos="990.00" arrivalPosLat="0.00" arrivalSpeed="14.49" duration="154.10" routeLength="1986.69" waitingTime="0.00" waitingCount="0" stopTime="0.00" timeLoss="16.92" rerouteNo="1" devices="tripinfo_car_e2n_68 routing_car_e2n_68" vType="Car" speedFactor="1.05" vaporized=""/>
    <tripinfo id="car_e2n_70" depart="70.00" departLane="e2sep_1" departPos="3.60" departPosLat="0.00" departSpeed="13.90" departDelay="0.00" arrival="224.25" arrivalLane="c2n_1" arrivalPos="990.00" arrivalPosLat="0.00" arrivalSpeed="15.21" duration="154.25" routeLength="1986.69" waitingTime="0.00" waitingCount="0" stopTime="0.00" timeLoss="26.32" rerouteNo="1" devices="tripinfo_car_e2n_70 routing_car_e2n_70" vType="Car" speedFactor="1.12" vaporized=""/>
    <tripinfo id="car_w2n_20" depart="20.00" departLane="w2sep_1" departPos="3.60" departPosLat="0.00" departSpeed="13.90" departDelay="0.00" arrival="228.55" arrivalLane="c2n_1" arrivalPos="990.00" arrivalPosLat="0.00" arrivalSpeed="14.03" duration="208.55" routeLength="1996.47" waitingTime="51.70" waitingCount="2" stopTime="0.00" timeLoss="65.70" rerouteNo="1" devices="tripinfo_car_w2n_20 routing_car_w2n_20" vType="Car" speedFactor="1.01" vaporized=""/>
    <tripinfo id="car_w2n_72" depart="72.45" departLane="w2sep_1" departPos="3.60" departPosLat="0.00" departSpeed="13.90" departDelay="0.45" arrival="232.40" arrivalLane="c2n_1" arrivalPos="990.00" arrivalPosLat="0.00" arrivalSpeed="13.88" duration="159.95" routeLength="1996.47" waitingTime="2.20" waitingCount="1" stopTime="0.00" timeLoss="15.63" rerouteNo="1" devices="tripinfo_car_w2n_72 routing_car_w2n_72" vType="Car" speedFactor="1.00" vaporized=""/>
    <tripinfo id="car_e2s_87" depart="87.00" departLane="e2sep_1" departPos="3.60" departPosLat="0.00" departSpeed="13.90" departDelay="0.00" arrival="234.05" arrivalLane="c2s_1" arrivalPos="990.00" arrivalPosLat="0.00" arrivalSpeed="13.97" duration="147.05" routeLength="1996.47" waitingTime="0.00" waitingCount="0" stopTime="0.00" timeLoss="3.45" rerouteNo="1" devices="tripinfo_car_e2s_87 routing_car_e2s_87" vType="Car" speedFactor="1.01" vaporized=""/>
    <tripinfo id="car_w2n_80" depart="80.00" departLane="w2sep_1" departPos="3.60" departPosLat="0.00" departSpeed="13.90" departDelay="0.00" arrival="234.20" arrivalLane="c2n_1" arrivalPos="990.00" arrivalPosLat="0.00" arrivalSpeed="15.39" duration="154.20" routeLength="1996.47" waitingTime="0.00" waitingCount="0" stopTime="0.00" timeLoss="31.73" rerouteNo="1" devices="tripinfo_car_w2n_80 routing_car_w2n_80" vType="Car" speedFactor="1.18" vaporized=""/>
    <tripinfo id="car_w2n_90" depart="90.00" departLane="w2sep_1" departPos="3.60" departPosLat="0.00" departSpeed="13.90" departDelay="0.00" arrival="236.05" arrivalLane="c2n_1" arrivalPos="990.00" arrivalPosLat="0.00" arrivalSpeed="15.49" duration="146.05" routeLength="1996.47" waitingTime="0.00" waitingCount="0" stopTime="0.00" timeLoss="22.87" rerouteNo="1" devices="tripinfo_car_w2n_90 routing_car_w2n_90" vType="Car" speedFactor="1.17" vaporized=""/>
    <tripinfo id="car_w2n_99" depart="99.00" departLane="w2sep_1" departPos="3.60" departPosLat="0.00" departSpeed="13.90" departDelay="0.00" arrival="237.90" arrivalLane="c2n_1" arrivalPos="990.00" arrivalPosLat="0.00" arrivalSpeed="15.59" duration="138.90" routeLength="1996.47" waitingTime="0.00" waitingCount="0" stopTime="0.00" timeLoss="16.53" rerouteNo="1" devices="tripinfo_car_w2n_99 routing_car_w2n_99" vType="Car" speedFactor="1.18" vaporized=""/>
    <tripinfo id="car_s2n_81" depart="81.00" departLane="s2sep_1" departPos="3.60" departPosLat="0.00" departSpeed="13.90" departDelay="0.00" arrival="248.65" arrivalLane="c2n_1" arrivalPos="990.00" arrivalPosLat="0.00" arrivalSpeed="16.05" duration="167.65" routeLength="1997.01" waitingTime="33.70" waitingCount="1" stopTime="0.00" timeLoss="43.17" rerouteNo="1" devices="tripinfo_car_s2n_81 routing_car_s2n_81" vType="Car" speedFactor="1.15" vaporized=""/>
    <tripinfo id="car_e2s_103" depart="104.25" departLane="e2sep_1" departPos="3.60" departPosLat="0.00" departSpeed="13.90" departDelay="1.25" arrival="249.05" arrivalLane="c2s_1" arrivalPos="990.00" arrivalPosLat="0.00" arrivalSpeed="14.32" duration="144.80" routeLength="1996.47" waitingTime="0.00" waitingCount="0" stopTime="0.00" timeLoss="4.75" rerouteNo="1" devices="tripinfo_car_e2s_103 routing_car_e2s_103" vType="Car" speedFactor="1.03" vaporized=""/>
    <tripinfo id="car_s2e_67" depart="67.00" departLane="s2sep_1" departPos="3.60" departPosLat="0.00" departSpeed="13.90" departDelay="0.00" arrival="253.85" arrivalLane="c2e_1" arrivalPos="990.00" arrivalPosLat="0.00" arrivalSpeed="14.27" duration="186.85" routeLength="1986.69" waitingTime="39.75" waitingCount="1" stopTime="0.00" timeLoss="46.85" rerouteNo="1" devices="tripinfo_car_s2e_67 routing_car_s2e_67" vType="Car" speedFactor="1.03" vaporized=""/>
    <tripinfo id="car_n2s_75" depart="75.00" departLane="n2sep_1" departPos="3.60" departPosLat="0.00" departSpeed="13.90" departDelay="0.00" arrival="256.30" arrivalLane="c2s_1" arrivalPos="990.00" arrivalPosLat="0.00" arrivalSpeed="13.90" duration="181.30" routeLength="1997.01" waitingTime="30.00" waitingCount="1" stopTime="0.00" timeLoss="37.63" rerouteNo="1" devices="tripinfo_car_n2s_75 routing_car_n2s_75" vType="Car" speedFactor="1.00" vaporized=""/>
    <tripinfo id="car_n2w_91" depart="91.00" departLane="n2sep_1" departPos="3.60" departPosLat="0.00" departSpeed="13.90" departDelay="0.00" arrival="257.95" arrivalLane="c2w_1" arrivalPos="990.00" arrivalPosLat="0.00" arrivalSpeed="13.90" duration="166.95" routeLength="1986.69" waitingTime="14.80" waitingCount="1" stopTime="0.00" timeLoss="23.31" rerouteNo="1" devices="tripinfo_car_n2w_91 routing_car_n2w_91" vType="Car" speedFactor="1.00" vaporized=""/>
    <tripinfo id="car_s2e_94" depart="94.00" departLane="s2sep_1" departPos="3.60" departPosLat="0.00" departSpeed="13.90" departDelay="0.00" arrival="259.80" arrivalLane="c2e_1" arrivalPos="990.00" arrivalPosLat="0.00" arrivalSpeed="14.17" duration="165.80" routeLength="1986.69" waitingTime="14.30" waitingCount="1" stopTime="0.00" timeLoss="24.90" rerouteNo="1" devices="tripinfo_car_s2e_94 routing_car_s2e_94" vType="Car" speedFactor="1.02" vaporized=""/>
    <tripinfo id="car_n2w_113" depart="113.00" departLane="n2sep_1" departPos="3.60" departPosLat="0.00" departSpeed="13.90" departDelay="0.00" arrival="260.30" arrivalLane="c2w_1" arrivalPos="990.00" arrivalPosLat="0.00" arrivalSpeed="14.86" duration="147.30" routeLength="1986.69" waitingTime="0.00" waitingCount="0" stopTime="0.00" timeLoss="15.27" rerouteNo="1" devices="tripinfo_car_n2w_113 routing_car_n2w_113" vType="Car" speedFactor="1.09" vaporized=""/>
    <tripinfo id="car_s2e_101" depart="101.00" departLane="s2sep_1" departPos="3.60" departPosLat="0.00" departSpeed="13.90" departDelay="0.00" arrival="262.10" arrivalLane="c2e_1" arrivalPos="990.00" arrivalPosLat="0.00" arrivalSpeed="15.04" duration="161.10" routeLength="1986.69" waitingTime="12.65" waitingCount="1" stopTime="0.00" timeLoss="30.79" rerouteNo="1" devices="tripinfo_car_s2e_101 routing_car_s2e_101" vType="Car" speedFactor="1.10" vaporized=""/>
    <tripinfo id="car_s2w_105" depart="105.00" departLane="s2sep_1" departPos="3.60" departPosLat="0.00" departSpeed="13.90" departDelay="0.00" arrival="264.35" arrivalLane="c2w_1" arrivalPos="990.00" arrivalPosLat="0.00" arrivalSpeed="14.14" duration="159.35" routeLength="1996.47" waitingTime="4.15" waitingCount="2" stopTime="0.00" timeLoss="17.57" rerouteNo="1" devices="tripinfo_car_s2w_105 routing_car_s2w_105" vType="Car" speedFactor="1.02" vaporized=""/>
    <tripinfo id="car_s2e_105" depart="106.45" departLane="s2sep_1" departPos="3.60" departPosLat="0.00" departSpeed="13.90" departDelay="1.45" arrival="264.60" arrivalLane="c2e_1" arrivalPos="990.00" arrivalPosLat="0.00" arrivalSpeed="14.99" duration="158.15" routeLength="1986.69" waitingTime="3.15" waitingCount="1" stopTime="0.00" timeLoss="26.58" rerouteNo="1" devices="tripinfo_car_s2e_105 routing_car_s2e_105" vType="Car" speedFactor="1.09" vaporized=""/>
    <tripinfo id="car_s2e_126" depart="126.00" departLane="s2sep_1" departPos="3.60" departPosLat="0.00" departSpeed="13.90" departDelay="0.00" arrival="266.55" arrivalLane="c2e_1" arrivalPos="990.00" arrivalPosLat="0.00" arrivalSpeed="15.63" duration="140.55" routeLength="1986.69" waitingTime="0.00" waitingCount="0" stopTime="0.00" timeLoss="17.65" rerouteNo="1" devices="tripinfo_car_s2e_126 routing_car_s2e_126" vType="Car" speedFactor="1.17" vaporized=""/>
    <tripinfo id="car_s2n_119" depart="119.00" departLane="s2sep_1" departPos="3.60" departPosLat="0.00" departSpeed="13.90" departDelay="0.00" arrival="266.75" arrivalLane="c2n_1" arrivalPos="990.00" arrivalPosLat="0.00" arrivalSpeed="13.90" duration="147.75" routeLength="1997.01" waitingTime="0.00" waitingCount="0" stopTime="0.00" timeLoss="4.07" rerouteNo="1" devices="tripinfo_car_s2n_119 routing_car_s2n_119" vType="Car" speedFactor="1.00" vaporized=""/>
    <tripinfo id="car_n2e_110" depart="110.00" departLane="n2sep_1" departPos="3.60" departPosLat="0.00" departSpeed="13.90" departDelay="0.00" arrival="270.80" arrivalLane="c2e_1" arrivalPos="990.00" arrivalPosLat="0.00" arrivalSpeed="14.49" duration="160.80" routeLength="1996.47" waitingTime="12.65" waitingCount="1" stopTime="0.00" timeLoss="22.48" rerouteNo="1" devices="tripinfo_car_n2e_110 routing_car_n2e_110" vType="Car" speedFactor="1.04" vaporized=""/>
    <tripinfo id="car_n2e_116" depart="116.00" departLane="n2sep_1" departPos="3.60" departPosLat="0.00" departSpeed="13.90" departDelay="0.00" arrival="276.20" arrivalLane="c2e_1" arrivalPos="990.00" arrivalPosLat="0.00" arrivalSpeed="13.90" duration="160.20" routeLength="1996.47" waitingTime="5.40" waitingCount="1" stopTime="0.00" timeLoss="15.84" rerouteNo="1" devices="tripinfo_car_n2e_116 routing_car_n2e_116" vType="Car" speedFactor="1.00" vaporized=""/>
    <tripinfo id="car_s2w_130" depart="130.00" departLane="s2sep_1" departPos="3.60" departPosLat="0.00" departSpeed="13.90" departDelay="0.00" arrival="277.45" arrivalLane="c2w_1" arrivalPos="990.00" arrivalPosLat="0.00" arrivalSpeed="13.94" duration="147.45" routeLength="1996.47" waitingTime="0.00" waitingCount="0" stopTime="0.00" timeLoss="3.58" rerouteNo="1" devices="tripinfo_car_s2w_130 routing_car_s2w_130" vType="Car" speedFactor="1.00" vaporized=""/>
    <tripinfo id="car_s2n_130" depart="131.45" departLane="s2sep_1" departPos="3.60" departPosLat="0.00" departSpeed="13.90" departDelay="1.45" arrival="278.30" arrivalLane="c2n_1" arrivalPos="990.00" arrivalPosLat="0.00" arrivalSpeed="13.90" duration="146.85" routeLength="1997.01" waitingTime="0.00" waitingCount="0" stopTime="0.00" timeLoss="3.15" rerouteNo="1" devices="tripinfo_car_s2n_130 routing_car_s2n_130" vType="Car" speedFactor="1.00" vaporized=""/>
    <tripinfo id="car_n2w_148" depart="148.00" departLane="n2sep_1" departPos="3.60" departPosLat="0.00" departSpeed="13.90" departDelay="0.00" arrival="279.35" arrivalLane="c2w_1" arrivalPos="990.00" arrivalPosLat="0.00" arrivalSpeed="15.52" duration="131.35" routeLength="1986.69" waitingTime="0.00" waitingCount="0" stopTime="0.00" timeLoss="8.75" rerouteNo="1" devices="tripinfo_car_n2w_148 routing_car_n2w_148" vType="Car" speedFactor="1.17" vaporized=""/>
    <tripinfo id="car_s2n_146" depart="146.00" departLane="s2sep_1" departPos="3.60" departPosLat="0.00" departSpeed="13.90" departDelay="0.00" arrival="280.10" arrivalLane="c2n_1" arrivalPos="990.00" arrivalPosLat="0.00" arrivalSpeed="15.47" duration="134.10" routeLength="1997.01" waitingTime="0.00" waitingCount="0" stopTime="0.00" timeLoss="12.20" rerouteNo="1" devices="tripinfo_car_s2n_146 routing_car_s2n_146" vType="Car" speedFactor="1.18" vaporized=""/>
    <tripinfo id="car_n2e_127" depart="127.00" departLane="n2sep_1" departPos="3.60" departPosLat="0.00" departSpeed="13.90" departDelay="0.00" arrival="283.35" arrivalLane="c2e_1" arrivalPos="990.00" arrivalPosLat="0.00" arrivalSpeed="14.13" duration="156.35" routeLength="1996.47" waitingTime="4.25" waitingCount="1" stopTime="0.00" timeLoss="14.40" rerouteNo="1" devices="tripinfo_car_n2e_127 routing_car_n2e_127" vType="Car" speedFactor="1.02" vaporized=""/>
    <tripinfo id="car_n2e_132" depart="132.00" departLane="n2sep_1" departPos="3.60" departPosLat="0.00" departSpeed="13.90" departDelay="0.00" arrival="288.20" arrivalLane="c2e_1" arrivalPos="990.00" arrivalPosLat="0.00" arrivalSpeed="13.89" duration="156.20" routeLength="1996.47" waitingTime="1.60" waitingCount="1" stopTime="0.00" timeLoss="11.87" rerouteNo="1" devices="tripinfo_car_n2e_132 routing_car_n2e_132" vType="Car" speedFactor="1.00" vaporized=""/>
    <tripinfo id="car_s2w_147" depart="147.25" departLane="s2sep_1" departPos="3.60" departPosLat="0.00" departSpeed="13.90" departDelay="0.25" arrival="294.90" arrivalLane="c2w_1" arrivalPos="990.00" arrivalPosLat="0.00" arrivalSpeed="13.97" duration="147.65" routeLength="1996.47" waitingTime="0.00" waitingCount="0" stopTime="0.00" timeLoss="4.04" rerouteNo="1" devices="tripinfo_car_s2w_147 routing_car_s2w_147" vType="Car" speedFactor="1.01" vaporized=""/>
    <tripinfo id="car_e2w_103" depart="103.00" departLane="e2sep_1" departPos="3.60" departPosLat="0.00" departSpeed="13.90" departDelay="0.00" arrival="296.90" arrivalLane="c2w_1" arrivalPos="990.00" arrivalPosLat="0.00" arrivalSpeed="15.49" duration="193.90" routeLength="1997.01" waitingTime="53.20" waitingCount="1" stopTime="0.00" timeLoss="69.82" rerouteNo="1" devices="tripinfo_car_e2w_103 routing_car_e2w_103" vType="Car" speedFactor="1.16" vaporized=""/>
    <tripinfo id="car_w2s_135" depart="135.00" departLane="w2sep_1" departPos="3.60" departPosLat="0.00" departSpeed="13.90" departDelay="0.00" arrival="297.05" arrivalLane="c2s_1" arrivalPos="990.00" arrivalPosLat="0.00" arrivalSpeed="15.73" duration="162.05" routeLength="1986.69" waitingTime="23.25" waitingCount="1" stopTime="0.00" timeLoss="35.11" rerouteNo="1" devices="tripinfo_car_w2s_135 routing_car_w2s_135" vType="Car" speedFactor="1.13" vaporized=""/>
    <tripinfo id="car_w2e_115" depart="115.00" departLane="w2sep_1" departPos="3.60" departPosLat="0.00" departSpeed="13.90" departDelay="0.00" arrival="300.15" arrivalLane="c2e_1" arrivalPos="990.00" arrivalPosLat="0.00" arrivalSpeed="14.04" duration="185.15" routeLength="1997.01" waitingTime="35.70" waitingCount="1" stopTime="0.00" timeLoss="42.90" rerouteNo="1" devices="tripinfo_car_w2e_115 routing_car_w2e_115" vType="Car" speedFactor="1.01" vaporized=""/>
    <tripinfo id="car_e2n_96" depart="96.00" departLane="e2sep_1" departPos="3.60" departPosLat="0.00" departSpeed="13.90" departDelay="0.00" arrival="300.65" arrivalLane="c2n_1" arrivalPos="990.00" arrivalPosLat="0.00" arrivalSpeed="13.90" duration="204.65" routeLength="1986.69" waitingTime="54.25" waitingCount="1" stopTime="0.00" timeLoss="60.99" rerouteNo="1" devices="tripinfo_car_e2n_96 routing_car_e2n_96" vType="Car" speedFactor="1.00" vaporized=""/>
    <tripinfo id="car_w2s_140" depart="141.35" departLane="w2sep_1" departPos="3.60" departPosLat="0.00" departSpeed="13.90" departDelay="1.35" arrival="301.75" arrivalLane="c2s_1" arrivalPos="990.00" arrivalPosLat="0.00" arrivalSpeed="15.55" duration="160.40" routeLength="1986.69" waitingTime="15.00" waitingCount="1" stopTime="0.00" timeLoss="32.02" rerouteNo="1" devices="tripinfo_car_w2s_140 routing_car_w2s_140" vType="Car" speedFactor="1.12" vaporized=""/>
    <tripinfo id="car_w2e_133" depart="133.00" departLane="w2sep_1" departPos="3.60" departPosLat="0.00" departSpeed="13.90" departDelay="0.00" arrival="302.15" arrivalLane="c2e_1" arrivalPos="990.00" arrivalPosLat="0.00" arrivalSpeed="15.32" duration="169.15" routeLength="1997.01" waitingTime="26.10" waitingCount="1" stopTime="0.00" timeLoss="43.40" rerouteNo="1" devices="tripinfo_car_w2e_133 routing_car_w2e_133" vType="Car" speedFactor="1.14" vaporized=""/>
    <tripinfo id="car_e2n_106" depart="106.00" departLane="e2sep_1" departPos="3.60" departPosLat="0.00" departSpeed="13.90" departDelay="0.00" arrival="304.40" arrivalLane="c2n_1" arrivalPos="990.00" arrivalPosLat="0.00" arrivalSpeed="14.40" duration="198.40" routeLength="1986.69" waitingTime="45.10" waitingCount="1" stopTime="0.00" timeLoss="59.98" rerouteNo="1" devices="tripinfo_car_e2n_106 routing_car_e2n_106" vType="Car" speedFactor="1.04" vaporized=""/>
    <tripinfo id="car_e2w_115" depart="115.00" departLane="e2sep_1" departPos="3.60" departPosLat="0.00" departSpeed="13.90" departDelay="0.00" arrival="307.40" arrivalLane="c2w_1" arrivalPos="990.00" arrivalPosLat="0.00" arrivalSpeed="13.90" duration="192.40" routeLength="1997.01" waitingTime="38.10" waitingCount="1" stopTime="0.00" timeLoss="48.69" rerouteNo="1" devices="tripinfo_car_e2w_115 routing_car_e2w_115" vType="Car" speedFactor="1.00" vaporized=""/>
    <tripinfo id="car_w2s_141" depart="143.00" departLane="w2sep_1" departPos="3.60" departPosLat="0.00" departSpeed="13.90" departDelay="2.00" arrival="309.80" arrivalLane="c2s_1" arrivalPos="990.00" arrivalPosLat="0.00" arrivalSpeed="14.12" duration="166.80" routeLength="1986.69" waitingTime="10.50" waitingCount="1" stopTime="0.00" timeLoss="25.32" rerouteNo="1" devices="tripinfo_car_w2s_141 routing_car_w2s_141" vType="Car" speedFactor="1.02" vaporized=""/>
    <tripinfo id="car_e2n_116" depart="116.45" departLane="e2sep_1" departPos="3.60" departPosLat="0.00" departSpeed="13.90" departDelay="0.45" arrival="310.55" arrivalLane="c2n_1" arrivalPos="990.00" arrivalPosLat="0.00" arrivalSpeed="13.90" duration="194.10" routeLength="1986.69" waitingTime="35.60" waitingCount="1" stopTime="0.00" timeLoss="50.45" rerouteNo="1" devices="tripinfo_car_e2n_116 routing_car_e2n_116" vType="Car" speedFactor="1.00" vaporized=""/>
    <tripinfo id="car_e2n_130" depart="130.00" departLane="e2sep_1" departPos="3.60" departPosLat="0.00" departSpeed="13.90" departDelay="0.00" arrival="312.80" arrivalLane="c2n_1" arrivalPos="990.00" arrivalPosLat="0.00" arrivalSpeed="14.90" duration="182.80" routeLength="1986.69" waitingTime="31.45" waitingCount="1" stopTime="0.00" timeLoss="51.68" rerouteNo="1" devices="tripinfo_car_e2n_130 routing_car_e2n_130" vType="Car" speedFactor="1.10" vaporized=""/>
    <tripinfo id="car_e2w_134" depart="134.00" departLane="e2sep_1" departPos="3.60" departPosLat="0.00" departSpeed="13.90" departDelay="0.00" arrival="312.95" arrivalLane="c2w_1" arrivalPos="990.00" arrivalPosLat="0.00" arrivalSpeed="14.22" duration="178.95" routeLength="1997.01" waitingTime="24.40" waitingCount="1" stopTime="0.00" timeLoss="38.55" rerouteNo="1" devices="tripinfo_car_e2w_134 routing_car_e2w_134" vType="Car" speedFactor="1.02" vaporized=""/>
    <tripinfo id="car_e2s_153" depart="153.00" departLane="e2sep_1" departPos="3.60" departPosLat="0.00" departSpeed="13.90" departDelay="0.00" arrival="313.90" arrivalLane="c2s_1" arrivalPos="990.00" arrivalPosLat="0.00" arrivalSpeed="14.16" duration="160.90" routeLength="1996.47" waitingTime="8.50" waitingCount="1" stopTime="0.00" timeLoss="19.36" rerouteNo="1" devices="tripinfo_car_e2s_153 routing_car_e2s_153" vType="Car" speedFactor="1.02" vaporized=""/>
    <tripinfo id="car_w2n_140" depart="140.00" departLane="w2sep_1" departPos="3.60" departPosLat="0.00" departSpeed="13.90" departDelay="0.00" arrival="315.25" arrivalLane="c2n_1" arrivalPos="990.00" arrivalPosLat="0.00" arrivalSpeed="14.85" duration="175.25" routeLength="1996.47" waitingTime="26.15" waitingCount="2" stopTime="0.00" timeLoss="41.90" rerouteNo="1" devices="tripinfo_car_w2n_140 routing_car_w2n_140" vType="Car" speedFactor="1.08" vaporized=""/>
    <tripinfo id="car_w2e_184" depart="184.00" departLane="w2sep_1" departPos="3.60" departPosLat="0.00" departSpeed="13.90" departDelay="0.00" arrival="315.45" arrivalLane="c2e_1" arrivalPos="990.00" arrivalPosLat="0.00" arrivalSpeed="15.95" duration="131.45" routeLength="1997.01" waitingTime="0.00" waitingCount="0" stopTime="0.00" timeLoss="6.25" rerouteNo="1" devices="tripinfo_car_w2e_184 routing_car_w2e_184" vType="Car" speedFactor="1.15" vaporized=""/>
    <tripinfo id="car_w2s_173" depart="173.00" departLane="w2sep_1" departPos="3.60" departPosLat="0.00" departSpeed="13.90" departDelay="0.00" arrival="320.05" arrivalLane="c2s_1" arrivalPos="990.00" arrivalPosLat="0.00" arrivalSpeed="14.00" duration="147.05" routeLength="1986.69" waitingTime="0.00" waitingCount="0" stopTime="0.00" timeLoss="4.42" rerouteNo="1" devices="tripinfo_car_w2s_173 routing_car_w2s_173" vType="Car" speedFactor="1.01" vaporized=""/>
    <tripinfo id="car_w2n_142" depart="144.85" departLane="w2sep_1" departPos="3.60" departPosLat="0.00" departSpeed="13.90" departDelay="2.85" arrival="320.40" arrivalLane="c2n_1" arrivalPos="990.00" arrivalPosLat="0.00" arrivalSpeed="13.90" duration="175.55" routeLength="1996.47" waitingTime="13.25" waitingCount="2" stopTime="0.00" timeLoss="31.22" rerouteNo="1" devices="tripinfo_car_w2n_142 routing_car_w2n_142" vType="Car" speedFactor="1.00" vaporized=""/>
    <tripinfo id="car_w2n_147" depart="147.00" departLane="w2sep_1" departPos="3.60" departPosLat="0.00" departSpeed="13.90" departDelay="0.00" arrival="322.30" arrivalLane="c2n_1" arrivalPos="990.00" arrivalPosLat="0.00" arrivalSpeed="15.30" duration="175.30" routeLength="1996.47" waitingTime="10.20" waitingCount="2" stopTime="0.00" timeLoss="50.26" rerouteNo="1" devices="tripinfo_car_w2n_147 routing_car_w2n_147" vType="Car" speedFactor="1.15" vaporized=""/>
    <tripinfo id="car_w2n_152" depart="152.00" departLane="w2sep_1" departPos="3.60" departPosLat="0.00" departSpeed="13.90" departDelay="0.00" arrival="325.55" arrivalLane="c2n_1" arrivalPos="990.00" arrivalPosLat="0.00" arrivalSpeed="14.18" duration="173.55" routeLength="1996.47" waitingTime="7.55" waitingCount="1" stopTime="0.00" timeLoss="32.49" rerouteNo="1" devices="tripinfo_car_w2n_152 routing_car_w2n_152" vType="Car" speedFactor="1.02" vaporized=""/>
    <tripinfo id="car_w2n_179" depart="179.00" departLane="w2sep_1" departPos="3.60" departPosLat="0.00" departSpeed="13.90" departDelay="0.00" arrival="329.50" arrivalLane="c2n_1" arrivalPos="990.00" arrivalPosLat="0.00" arrivalSpeed="13.88" duration="150.50" routeLength="1996.47" waitingTime="0.00" waitingCount="0" stopTime="0.00" timeLoss="6.17" rerouteNo="1" devices="tripinfo_car_w2n_179 routing_car_w2n_179" vType="Car" speedFactor="1.00" vaporized=""/>
    <tripinfo id="car_w2e_186" depart="186.00" departLane="w2sep_1" departPos="3.60" departPosLat="0.00" departSpeed="13.90" departDelay="0.00" arrival="330.95" arrivalLane="c2e_1" arrivalPos="990.00" arrivalPosLat="0.00" arrivalSpeed="13.90" duration="144.95" routeLength="1997.01" waitingTime="0.00" waitingCount="0" stopTime="0.00" timeLoss="1.24" rerouteNo="1" devices="tripinfo_car_w2e_186 routing_car_w2e_186" vType="Car" speedFactor="1.00" vaporized=""/>
    <tripinfo id="car_w2n_193" depart="193.00" departLane="w2sep_1" departPos="3.60" departPosLat="0.00" departSpeed="13.90" departDelay="0.00" arrival="340.30" arrivalLane="c2n_1" arrivalPos="990.00" arrivalPosLat="0.00" arrivalSpeed="14.00" duration="147.30" routeLength="1996.47" waitingTime="0.00" waitingCount="0" stopTime="0.00" timeLoss="3.98" rerouteNo="1" devices="tripinfo_car_w2n_193 routing_car_w2n_193" vType="Car" speedFactor="1.01" vaporized=""/>
    <tripinfo id="car_n2s_148" depart="149.25" departLane="n2sep_1" departPos="3.60" departPosLat="0.00" departSpeed="13.90" departDelay="1.25" arrival="343.05" arrivalLane="c2s_1" arrivalPos="990.00" arrivalPosLat="0.00" arrivalSpeed="14.46" duration="193.80" routeLength="1997.01" waitingTime="47.60" waitingCount="1" stopTime="0.00" timeLoss="55.63" rerouteNo="1" devices="tripinfo_car_n2s_148 routing_car_n2s_148" vType="Car" speedFactor="1.04" vaporized=""/>
    <tripinfo id="car_s2n_170" depart="170.00" departLane="s2sep_1" departPos="3.60" departPosLat="0.00" departSpeed="13.90" departDelay="0.00" arrival="344.70" arrivalLane="c2n_1" arrivalPos="990.00" arrivalPosLat="0.00" arrivalSpeed="14.34" duration="174.70" routeLength="1997.01" waitingTime="26.80" waitingCount="1" stopTime="0.00" timeLoss="35.54" rerouteNo="1" devices="tripinfo_car_s2n_170 routing_car_s2n_170" vType="Car" speedFactor="1.03" vaporized=""/>
    <tripinfo id="car_s2e_181" depart="181.00" departLane="s2sep_1" departPos="3.60" departPosLat="0.00" departSpeed="13.90" departDelay="0.00" arrival="346.00" arrivalLane="c2e_1" arrivalPos="990.00" arrivalPosLat="0.00" arrivalSpeed="14.32" duration="165.00" routeLength="1986.69" waitingTime="16.60" waitingCount="1" stopTime="0.00" timeLoss="25.56" rerouteNo="1" devices="tripinfo_car_s2e_181 routing_car_s2e_181" vType="Car" speedFactor="1.03" vaporized=""/>
    <tripinfo id="car_n2w_151" depart="151.00" departLane="n2sep_1" departPos="3.60" departPosLat="0.00" departSpeed="13.90" departDelay="0.00" arrival="346.45" arrivalLane="c2w_1" arrivalPos="990.00" arrivalPosLat="0.00" arrivalSpeed="14.21" duration="195.45" routeLength="1986.69" waitingTime="43.95" waitingCount="1" stopTime="0.00" timeLoss="54.87" rerouteNo="1" devices="tripinfo_car_n2w_151 routing_car_n2w_151" vType="Car" speedFactor="1.02" vaporized=""/>
    <tripinfo id="car_n2e_171" depart="171.00" departLane="n2sep_1" departPos="3.60" departPosLat="0.00" departSpeed="13.90" departDelay="0.00" arrival="348.55" arrivalLane="c2e_1" arrivalPos="990.00" arrivalPosLat="0.00" arrivalSpeed="15.13" duration="177.55" routeLength="1996.47" waitingTime="28.20" waitingCount="1" stopTime="0.00" timeLoss="46.60" rerouteNo="1" devices="tripinfo_car_n2e_171 routing_car_n2e_171" vType="Car" speedFactor="1.10" vaporized=""/>
    <tripinfo id="car_n2s_160" depart="160.00" departLane="n2sep_1" departPos="3.60" departPosLat="0.00" departSpeed="13.90" departDelay="0.00" arrival="349.15" arrivalLane="c2s_1" arrivalPos="990.00" arrivalPosLat="0.00" arrivalSpeed="14.67" duration="189.15" routeLength="1997.01" waitingTime="39.75" waitingCount="1" stopTime="0.00" timeLoss="53.04" rerouteNo="1" devices="tripinfo_car_n2s_160 routing_car_n2s_160" vType="Car" speedFactor="1.06" vaporized=""/>
    <tripinfo id="car_n2w_152" depart="152.80" departLane="n2sep_1" departPos="3.60" departPosLat="0.00" departSpeed="13.90" departDelay="0.80" arrival="351.95" arrivalLane="c2w_1" arrivalPos="990.00" arrivalPosLat="0.00" arrivalSpeed="13.90" duration="199.15" routeLength="1986.69" waitingTime="41.05" waitingCount="1" stopTime="0.00" timeLoss="55.46" rerouteNo="1" devices="tripinfo_car_n2w_152 routing_car_n2w_152" vType="Car" speedFactor="1.00" vaporized=""/>
    <tripinfo id="car_n2e_176" depart="176.00" departLane="n2sep_1" departPos="3.60" departPosLat="0.00" departSpeed="13.90" departDelay="0.00" arrival="352.70" arrivalLane="c2e_1" arrivalPos="990.00" arrivalPosLat="0.00" arrivalSpeed="14.37" duration="176.70" routeLength="1996.47" waitingTime="21.80" waitingCount="1" stopTime="0.00" timeLoss="37.16" rerouteNo="1" devices="tripinfo_car_n2e_176 routing_car_n2e_176" vType="Car" speedFactor="1.03" vaporized=""/>
    <tripinfo id="car_n2s_180" depart="180.00" departLane="n2sep_1" departPos="3.60" departPosLat="0.00" departSpeed="13.90" departDelay="0.00" arrival="356.05" arrivalLane="c2s_1" arrivalPos="990.00" arrivalPosLat="0.00" arrivalSpeed="14.13" duration="176.05" routeLength="1997.01" waitingTime="21.10" waitingCount="1" stopTime="0.00" timeLoss="34.75" rerouteNo="1" devices="tripinfo_car_n2s_180 routing_car_n2s_180" vType="Car" speedFactor="1.02" vaporized=""/>
    <tripinfo id="car_n2w_164" depart="164.00" departLane="n2sep_1" departPos="3.60" departPosLat="0.00" departSpeed="13.90" departDelay="0.00" arrival="356.35" arrivalLane="c2w_1" arrivalPos="990.00" arrivalPosLat="0.00" arrivalSpeed="13.89" duration="192.35" routeLength="1986.69" waitingTime="35.00" waitingCount="1" stopTime="0.00" timeLoss="48.67" rerouteNo="1" devices="tripinfo_car_n2w_164 routing_car_n2w_164" vType="Car" speedFactor="1.00" vaporized=""/>
    <tripinfo id="car_n2e_189" depart="189.00" departLane="n2sep_1" departPos="3.60" departPosLat="0.00" departSpeed="13.90" departDelay="0.00" arrival="357.15" arrivalLane="c2e_1" arrivalPos="990.00" arrivalPosLat="0.00" arrivalSpeed="13.92" duration="168.15" routeLength="1996.47" waitingTime="8.00" waitingCount="1" stopTime="0.00" timeLoss="24.07" rerouteNo="1" devices="tripinfo_car_n2e_189 routing_car_n2e_189" vType="Car" speedFactor="1.00" vaporized=""/>
    <tripinfo id="car_n2w_204" depart="204.00" departLane="n2sep_1" departPos="3.60" departPosLat="0.00" departSpeed="13.90" departDelay="0.00" arrival="358.60" arrivalLane="c2w_1" arrivalPos="990.00" arrivalPosLat="0.00" arrivalSpeed="14.86" duration="154.60" routeLength="1986.69" waitingTime="4.50" waitingCount="1" stopTime="0.00" timeLoss="23.02" rerouteNo="1" devices="tripinfo_car_n2w_204 routing_car_n2w_204" vType="Car" speedFactor="1.09" vaporized=""/>
    <tripinfo id="car_n2s_196" depart="196.00" departLane="n2sep_1" departPos="3.60" departPosLat="0.00" departSpeed="13.90" departDelay="0.00" arrival="359.90" arrivalLane="c2s_1" arrivalPos="990.00" arrivalPosLat="0.00" arrivalSpeed="14.18" duration="163.90" routeLength="1997.01" waitingTime="7.05" waitingCount="1" stopTime="0.00" timeLoss="23.31" rerouteNo="1" devices="tripinfo_car_n2s_196 routing_car_n2s_196" vType="Car" speedFactor="1.02" vaporized=""/>
    <tripinfo id="car_n2e_206" depart="206.00" departLane="n2sep_1" departPos="3.60" departPosLat="0.00" departSpeed="13.90" departDelay="0.00" arrival="359.90" arrivalLane="c2e_1" arrivalPos="990.00" arrivalPosLat="0.00" arrivalSpeed="14.31" duration="153.90" routeLength="1996.47" waitingTime="0.00" waitingCount="0" stopTime="0.00" timeLoss="14.82" rerouteNo="1" devices="tripinfo_car_n2e_206 routing_car_n2e_206" vType="Car" speedFactor="1.04" vaporized=""/>
    <tripinfo id="car_n2w_227" depart="227.00" departLane="n2sep_1" departPos="3.60" departPosLat="0.00" departSpeed="13.90" departDelay="0.00" arrival="363.10" arrivalLane="c2w_1" arrivalPos="990.00" arrivalPosLat="0.00" arrivalSpeed="15.24" duration="136.10" routeLength="1986.69" waitingTime="0.00" waitingCount="0" stopTime="0.00" timeLoss="5.19" rerouteNo="1" devices="tripinfo_car_n2w_227 routing_car_n2w_227" vType="Car" speedFactor="1.10" vaporized=""/>
    <tripinfo id="car_s2e_218" depart="218.00" departLane="s2sep_1" departPos="3.60" departPosLat="0.00" departSpeed="13.90" departDelay="0.00" arrival="364.75" arrivalLane="c2e_1" arrivalPos="990.00" arrivalPosLat="0.00" arrivalSpeed="14.03" duration="146.75" routeLength="1986.69" waitingTime="0.00" waitingCount="0" stopTime="0.00" timeLoss="4.51" rerouteNo="1" devices="tripinfo_car_s2e_218 routing_car_s2e_218" vType="Car" speedFactor="1.01" vaporized=""/>
    <tripinfo id="car_s2w_167" depart="167.00" departLane="s2sep_1" departPos="3.60" departPosLat="0.00" departSpeed="13.90" departDelay="0.00" arrival="365.45" arrivalLane="c2w_1" arrivalPos="990.00" arrivalPosLat="0.00" arrivalSpeed="16.08" duration="198.45" routeLength="1996.47" waitingTime="59.85" waitingCount="3" stopTime="0.00" timeLoss="76.09" rerouteNo="1" devices="tripinfo_car_s2w_167 routing_car_s2w_167" vType="Car" speedFactor="1.18" vaporized=""/>
    <tripinfo id="car_s2e_219" depart="219.45" departLane="s2sep_1" departPos="3.60" departPosLat="0.00" departSpeed="13.90" departDelay="0.45" arrival="367.10" arrivalLane="c2e_1" arrivalPos="990.00" arrivalPosLat="0.00" arrivalSpeed="14.86" duration="147.65" routeLength="1986.69" waitingTime="0.00" waitingCount="0" stopTime="0.00" timeLoss="15.60" rerouteNo="1" devices="tripinfo_car_s2e_219 routing_car_s2e_219" vType="Car" speedFactor="1.09" vaporized=""/>
    <tripinfo id="car_n2e_220" depart="220.00" departLane="n2sep_1" departPos="3.60" departPosLat="0.00" departSpeed="13.90" departDelay="0.00" arrival="369.20" arrivalLane="c2e_1" arrivalPos="990.00" arrivalPosLat="0.00" arrivalSpeed="15.18" duration="149.20" routeLength="1996.47" waitingTime="6.25" waitingCount="1" stopTime="0.00" timeLoss="20.53" rerouteNo="1" devices="tripinfo_car_n2e_220 routing_car_n2e_220" vType="Car" speedFactor="1.12" vaporized=""/>
    <tripinfo id="car_s2w_173" depart="173.00" departLane="s2sep_1" departPos="3.60" departPosLat="0.00" departSpeed="13.90" departDelay="0.00" arrival="370.05" arrivalLane="c2w_1" arrivalPos="990.00" arrivalPosLat="0.00" arrivalSpeed="15.10" duration="197.05" routeLength="1996.47" waitingTime="45.75" waitingCount="2" stopTime="0.00" timeLoss="64.27" rerouteNo="1" devices="tripinfo_car_s2w_173 routing_car_s2w_173" vType="Car" speedFactor="1.09" vaporized=""/>
    <tripinfo id="car_w2s_218" depart="218.00" departLane="w2sep_1" departPos="3.60" departPosLat="0.00" departSpeed="13.90" departDelay="0.00" arrival="386.90" arrivalLane="c2s_1" arrivalPos="990.00" arrivalPosLat="0.00" arrivalSpeed="14.69" duration="168.90" routeLength="1986.69" waitingTime="24.25" waitingCount="1" stopTime="0.00" timeLoss="32.95" rerouteNo="1" devices="tripinfo_car_w2s_218 routing_car_w2s_218" vType="Car" speedFactor="1.06" vaporized=""/>
    <tripinfo id="car_e2n_192" depart="192.00" departLane="e2sep_1" departPos="3.60" departPosLat="0.00" departSpeed="13.90" departDelay="0.00" arrival="387.75" arrivalLane="c2n_1" arrivalPos="990.00" arrivalPosLat="0.00" arrivalSpeed="14.49" duration="195.75" routeLength="1986.69" waitingTime="51.00" waitingCount="1" stopTime="0.00" timeLoss="57.99" rerouteNo="1" devices="tripinfo_car_e2n_192 routing_car_e2n_192" vType="Car" speedFactor="1.04" vaporized=""/>
    <tripinfo id="bus_s2w_240" depart="240.00" departLane="s2sep_1" departPos="12.10" departPosLat="0.00" departSpeed="13.90" departDelay="0.00" arrival="388.95" arrivalLane="c2w_1" arrivalPos="990.00" arrivalPosLat="0.00" arrivalSpeed="13.90" duration="148.95" routeLength="1987.97" waitingTime="0.00" waitingCount="0" stopTime="0.00" timeLoss="5.25" rerouteNo="1" devices="tripinfo_bus_s2w_240 routing_bus_s2w_240" vType="Bus" speedFactor="1.00" vaporized=""/>
    <tripinfo id="car_e2n_209" depart="209.00" departLane="e2sep_1" departPos="3.60" departPosLat="0.00" departSpeed="13.90" departDelay="0.00" arrival="392.20" arrivalLane="c2n_1" arrivalPos="990.00" arrivalPosLat="0.00" arrivalSpeed="14.49" duration="183.20" routeLength="1986.69" waitingTime="34.05" waitingCount="1" stopTime="0.00" timeLoss="45.49" rerouteNo="1" devices="tripinfo_car_e2n_209 routing_car_e2n_209" vType="Car" speedFactor="1.04" vaporized=""/>
    <tripinfo id="car_w2s_237" depart="237.00" departLane="w2sep_1" departPos="3.60" departPosLat="0.00" departSpeed="13.90" departDelay="0.00" arrival="394.15" arrivalLane="c2s_1" arrivalPos="990.00" arrivalPosLat="0.00" arrivalSpeed="13.90" duration="157.15" routeLength="1986.69" waitingTime="3.75" waitingCount="1" stopTime="0.00" timeLoss="13.48" rerouteNo="1" devices="tripinfo_car_w2s_237 routing_car_w2s_237" vType="Car" speedFactor="1.00" vaporized=""/>
    <tripinfo id="car_e2w_230" depart="230.00" departLane="e2sep_1" departPos="3.60" departPosLat="0.00" departSpeed="13.90" departDelay="0.00" arrival="395.80" arrivalLane="c2w_1" arrivalPos="990.00" arrivalPosLat="0.00" arrivalSpeed="13.90" duration="165.80" routeLength="1997.01" waitingTime="12.00" waitingCount="1" stopTime="0.00" timeLoss="22.10" rerouteNo="1" devices="tripinfo_car_e2w_230 routing_car_e2w_230" vType="Car" speedFactor="1.00" vaporized=""/>
    <tripinfo id="car_e2s_203" depart="203.00" departLane="e2sep_1" departPos="3.60" departPosLat="0.00" departSpeed="13.90" departDelay="0.00" arrival="397.70" arrivalLane="c2s_1" arrivalPos="990.00" arrivalPosLat="0.00" arrivalSpeed="14.10" duration="194.70" routeLength="1996.47" waitingTime="38.45" waitingCount="2" stopTime="0.00" timeLoss="52.72" rerouteNo="1" devices="tripinfo_car_e2s_203 routing_car_e2s_203" vType="Car" speedFactor="1.02" vaporized=""/>
    <tripinfo id="car_e2n_237" depart="237.00" departLane="e2sep_1" departPos="3.60" departPosLat="0.00" departSpeed="13.90" departDelay="0.00" arrival="398.50" arrivalLane="c2n_1" arrivalPos="990.00" arrivalPosLat="0.00" arrivalSpeed="13.90" duration="161.50" routeLength="1986.69" waitingTime="6.05" waitingCount="1" stopTime="0.00" timeLoss="17.85" rerouteNo="1" devices="tripinfo_car_e2n_237 routing_car_e2n_237" vType="Car" speedFactor="1.00" vaporized=""/>
    <tripinfo id="car_w2n_216" depart="216.00" departLane="w2sep_1" departPos="3.60" departPosLat="0.00" departSpeed="13.90" departDelay="0.00" arrival="400.80" arrivalLane="c2n_1" arrivalPos="990.00" arrivalPosLat="0.00" arrivalSpeed="14.86" duration="184.80" routeLength="1996.47" waitingTime="34.90" waitingCount="2" stopTime="0.00" timeLoss="52.49" rerouteNo="1" devices="tripinfo_car_w2n_216 routing_car_w2n_216" vType="Car" speedFactor="1.09" vaporized=""/>
    <tripinfo id="amb_w2e_300" depart="300.00" departLane="w2sep_1" departPos="6.60" departPosLat="0.00" departSpeed="13.90" departDelay="0.00" arrival="401.30" arrivalLane="c2e_1" arrivalPos="990.00" arrivalPosLat="0.00" arrivalSpeed="20.85" duration="101.30" routeLength="1994.01" waitingTime="0.00" waitingCount="0" stopTime="0.00" timeLoss="5.64" rerouteNo="1" devices="tripinfo_amb_w2e_300 routing_amb_w2e_300 bluelight_amb_w2e_300 fcd_amb_w2e_300" vType="Ambulance" speedFactor="1.50" vaporized="">
        <example_device customValue1="0.00" customValue2="-1.00"/>
    </tripinfo>
    <tripinfo id="car_e2s_237" depart="238.45" departLane="e2sep_1" departPos="3.60" departPosLat="0.00" departSpeed="13.90" departDelay="1.45" arrival="401.35" arrivalLane="c2s_1" arrivalPos="990.00" arrivalPosLat="0.00" arrivalSpeed="13.88" duration="162.90" routeLength="1996.47" waitingTime="0.00" waitingCount="0" stopTime="0.00" timeLoss="18.56" rerouteNo="1" devices="tripinfo_car_e2s_237 routing_car_e2s_237" vType="Car" speedFactor="1.00" vaporized=""/>
    <tripinfo id="car_w2n_230" depart="230.00" departLane="w2sep_1" departPos="3.60" departPosLat="0.00" departSpeed="13.90" departDelay="0.00" arrival="403.45" arrivalLane="c2n_1" arrivalPos="990.00" arrivalPosLat="0.00" arrivalSpeed="14.67" duration="173.45" routeLength="1996.47" waitingTime="19.20" waitingCount="2" stopTime="0.00" timeLoss="37.92" rerouteNo="1" devices="tripinfo_car_w2n_230 routing_car_w2n_230" vType="Car" speedFactor="1.07" vaporized=""/>
    <tripinfo id="car_e2n_263" depart="263.00" departLane="e2sep_1" departPos="3.60" departPosLat="0.00" departSpeed="13.90" departDelay="0.00" arrival="408.85" arrivalLane="c2n_1" arrivalPos="990.00" arrivalPosLat="0.00" arrivalSpeed="14.13" duration="145.85" routeLength="1986.69" waitingTime="0.00" waitingCount="0" stopTime="0.00" timeLoss="4.57" rerouteNo="1" devices="tripinfo_car_e2n_263 routing_car_e2n_263" vType="Car" speedFactor="1.02" vaporized=""/>
    <tripinfo id="car_w2n_270" depart="270.00" departLane="w2sep_1" departPos="3.60" departPosLat="0.00" departSpeed="13.90" departDelay="0.00" arrival="411.20" arrivalLane="c2n_1" arrivalPos="990.00" arrivalPosLat="0.00" arrivalSpeed="14.97" duration="141.20" routeLength="1996.47" waitingTime="0.00" waitingCount="0" stopTime="0.00" timeLoss="9.56" rerouteNo="1" devices="tripinfo_car_w2n_270 routing_car_w2n_270" vType="Car" speedFactor="1.10" vaporized=""/>
    <tripinfo id="car_e2s_268" depart="268.00" departLane="e2sep_1" departPos="3.60" departPosLat="0.00" departSpeed="13.90" departDelay="0.00" arrival="415.05" arrivalLane="c2s_1" arrivalPos="990.00" arrivalPosLat="0.00" arrivalSpeed="14.03" duration="147.05" routeLength="1996.47" waitingTime="0.00" waitingCount="0" stopTime="0.00" timeLoss="4.00" rerouteNo="1" devices="tripinfo_car_e2s_268 routing_car_e2s_268" vType="Car" speedFactor="1.01" vaporized=""/>
    <tripinfo id="car_e2w_286" depart="286.00" departLane="e2sep_1" departPos="3.60" departPosLat="0.00" departSpeed="13.90" departDelay="0.00" arrival="422.20" arrivalLane="c2w_1" arrivalPos="990.00" arrivalPosLat="0.00" arrivalSpeed="16.02" duration="136.20" routeLength="1997.01" waitingTime="0.00" waitingCount="0" stopTime="0.00" timeLoss="11.53" rerouteNo="1" devices="tripinfo_car_e2w_286 routing_car_e2w_286" vType="Car" speedFactor="1.15" vaporized=""/>
    <tripinfo id="car_w2s_276" depart="276.00" departLane="w2sep_1" departPos="3.60" departPosLat="0.00" departSpeed="13.90" departDelay="0.00" arrival="423.20" arrivalLane="c2s_1" arrivalPos="990.00" arrivalPosLat="0.00" arrivalSpeed="13.94" duration="147.20" routeLength="1986.69" waitingTime="0.00" waitingCount="0" stopTime="0.00" timeLoss="3.98" rerouteNo="1" devices="tripinfo_car_w2s_276 routing_car_w2s_276" vType="Car" speedFactor="1.00" vaporized=""/>
    <tripinfo id="car_e2s_281" depart="281.00" departLane="e2sep_1" departPos="3.60" departPosLat="0.00" departSpeed="13.90" departDelay="0.00" arrival="429.05" arrivalLane="c2s_1" arrivalPos="990.00" arrivalPosLat="0.00" arrivalSpeed="14.33" duration="148.05" routeLength="1996.47" waitingTime="0.00" waitingCount="0" stopTime="0.00" timeLoss="8.13" rerouteNo="1" devices="tripinfo_car_e2s_281 routing_car_e2s_281" vType="Car" speedFactor="1.03" vaporized=""/>
    <tripinfo id="car_e2n_279" depart="279.00" departLane="e2sep_1" departPos="3.60" departPosLat="0.00" departSpeed="13.90" departDelay="0.00" arrival="430.00" arrivalLane="c2n_1" arrivalPos="990.00" arrivalPosLat="0.00" arrivalSpeed="13.90" duration="151.00" routeLength="1986.69" waitingTime="0.45" waitingCount="1" stopTime="0.00" timeLoss="7.35" rerouteNo="1" devices="tripinfo_car_e2n_279 routing_car_e2n_279" vType="Car" speedFactor="1.00" vaporized=""/>
    <tripinfo id="car_e2s_283" depart="283.00" departLane="e2sep_1" departPos="3.60" departPosLat="0.00" departSpeed="13.90" departDelay="0.00" arrival="433.55" arrivalLane="c2s_1" arrivalPos="990.00" arrivalPosLat="0.00" arrivalSpeed="14.22" duration="150.55" routeLength="1996.47" waitingTime="0.00" waitingCount="0" stopTime="0.00" timeLoss="9.52" rerouteNo="1" devices="tripinfo_car_e2s_283 routing_car_e2s_283" vType="Car" speedFactor="1.02" vaporized=""/>
    <tripinfo id="car_e2s_296" depart="296.00" departLane="e2sep_1" departPos="3.60" departPosLat="0.00" departSpeed="13.90" departDelay="0.00" arrival="435.80" arrivalLane="c2s_1" arrivalPos="990.00" arrivalPosLat="0.00" arrivalSpeed="15.21" duration="139.80" routeLength="1996.47" waitingTime="0.00" waitingCount="0" stopTime="0.00" timeLoss="10.74" rerouteNo="1" devices="tripinfo_car_e2s_296 routing_car_e2s_296" vType="Car" speedFactor="1.12" vaporized=""/>
    <tripinfo id="car_s2e_259" depart="259.00" departLane="s2sep_1" departPos="3.60" departPosLat="0.00" departSpeed="13.90" departDelay="0.00" arrival="436.95" arrivalLane="c2e_1" arrivalPos="990.00" arrivalPosLat="0.00" arrivalSpeed="16.25" duration="177.95" routeLength="1986.69" waitingTime="46.90" waitingCount="1" stopTime="0.00" timeLoss="55.06" rerouteNo="1" devices="tripinfo_car_s2e_259 routing_car_s2e_259" vType="Car" speedFactor="1.17" vaporized=""/>
    <tripinfo id="car_s2n_272" depart="272.30" departLane="s2sep_1" departPos="3.60" departPosLat="0.00" departSpeed="13.90" departDelay="0.30" arrival="441.10" arrivalLane="c2n_1" arrivalPos="990.00" arrivalPosLat="0.00" arrivalSpeed="16.36" duration="168.80" routeLength="1997.01" waitingTime="31.05" waitingCount="1" stopTime="0.00" timeLoss="46.72" rerouteNo="1" devices="tripinfo_car_s2n_272 routing_car_s2n_272" vType="Car" speedFactor="1.18" vaporized=""/>
    <tripinfo id="car_n2w_239" depart="239.00" departLane="n2sep_1" departPos="3.60" departPosLat="0.00" departSpeed="13.90" departDelay="0.00" arrival="442.30" arrivalLane="c2w_1" arrivalPos="990.00" arrivalPosLat="0.00" arrivalSpeed="14.91" duration="203.30" routeLength="1986.69" waitingTime="62.10" waitingCount="1" stopTime="0.00" timeLoss="69.36" rerouteNo="1" devices="tripinfo_car_n2w_239 routing_car_n2w_239" vType="Car" speedFactor="1.07" vaporized=""/>
    <tripinfo id="car_s2e_271" depart="271.00" departLane="s2sep_1" departPos="3.60" departPosLat="0.00" departSpeed="13.90" departDelay="0.00" arrival="444.25" arrivalLane="c2e_1" arrivalPos="990.00" arrivalPosLat="0.00" arrivalSpeed="15.23" duration="173.25" routeLength="1986.69" waitingTime="32.05" waitingCount="1" stopTime="0.00" timeLoss="42.13" rerouteNo="1" devices="tripinfo_car_s2e_271 routing_car_s2e_271" vType="Car" speedFactor="1.10" vaporized=""/>
    <tripinfo id="car_n2w_259" depart="259.40" departLane="n2sep_1" departPos="3.60" departPosLat="0.00" departSpeed="13.90" departDelay="0.40" arrival="448.20" arrivalLane="c2w_1" arrivalPos="990.00" arrivalPosLat="0.00" arrivalSpeed="14.80" duration="188.80" routeLength="1986.69" waitingTime="39.20" waitingCount="1" stopTime="0.00" timeLoss="53.87" rerouteNo="1" devices="tripinfo_car_n2w_259 routing_car_n2w_259" vType="Car" speedFactor="1.06" vaporized=""/>
    <tripinfo id="car_n2s_252" depart="252.00" departLane="n2sep_1" departPos="3.60" departPosLat="0.00" departSpeed="13.90" departDelay="0.00" arrival="448.30" arrivalLane="c2s_1" arrivalPos="990.00" arrivalPosLat="0.00" arrivalSpeed="14.09" duration="196.30" routeLength="1997.01" waitingTime="46.15" waitingCount="1" stopTime="0.00" timeLoss="54.59" rerouteNo="1" devices="tripinfo_car_n2s_252 routing_car_n2s_252" vType="Car" speedFactor="1.01" vaporized=""/>
    <tripinfo id="car_s2n_276" depart="276.00" departLane="s2sep_1" departPos="3.60" departPosLat="0.00" departSpeed="13.90" departDelay="0.00" arrival="449.45" arrivalLane="c2n_1" arrivalPos="990.00" arrivalPosLat="0.00" arrivalSpeed="14.89" duration="173.45" routeLength="1997.01" waitingTime="27.05" waitingCount="1" stopTime="0.00" timeLoss="39.30" rerouteNo="1" devices="tripinfo_car_s2n_276 routing_car_s2n_276" vType="Car" speedFactor="1.07" vaporized=""/>
    <tripinfo id="car_s2n_285" depart="285.00" departLane="s2sep_1" departPos="3.60" departPosLat="0.00" departSpeed="13.90" departDelay="0.00" arrival="453.80" arrivalLane="c2n_1" arrivalPos="990.00" arrivalPosLat="0.00" arrivalSpeed="14.73" duration="168.80" routeLength="1997.01" waitingTime="19.20" waitingCount="1" stopTime="0.00" timeLoss="33.34" rerouteNo="1" devices="tripinfo_car_s2n_285 routing_car_s2n_285" vType="Car" speedFactor="1.06" vaporized=""/>
    <tripinfo id="car_n2s_259" depart="261.15" departLane="n2sep_1" departPos="3.60" departPosLat="0.00" departSpeed="13.90" departDelay="2.15" arrival="454.35" arrivalLane="c2s_1" arrivalPos="990.00" arrivalPosLat="0.00" arrivalSpeed="13.90" duration="193.20" routeLength="1997.01" waitingTime="35.85" waitingCount="1" stopTime="0.00" timeLoss="49.50" rerouteNo="1" devices="tripinfo_car_n2s_259 routing_car_n2s_259" vType="Car" speedFactor="1.00" vaporized=""/>
    <tripinfo id="car_n2w_288" depart="288.00" departLane="n2sep_1" departPos="3.60" departPosLat="0.00" departSpeed="13.90" departDelay="0.00" arrival="456.60" arrivalLane="c2w_1" arrivalPos="990.00" arrivalPosLat="0.00" arrivalSpeed="13.90" duration="168.60" routeLength="1986.69" waitingTime="12.85" waitingCount="1" stopTime="0.00" timeLoss="24.93" rerouteNo="1" devices="tripinfo_car_n2w_288 routing_car_n2w_288" vType="Car" speedFactor="1.00" vaporized=""/>
    <tripinfo id="car_s2n_313" depart="313.00" departLane="s2sep_1" departPos="3.60" departPosLat="0.00" departSpeed="13.90" departDelay="0.00" arrival="458.70" arrivalLane="c2n_1" arrivalPos="990.00" arrivalPosLat="0.00" arrivalSpeed="14.11" duration="145.70" routeLength="1997.01" waitingTime="0.00" waitingCount="0" stopTime="0.00" timeLoss="4.18" rerouteNo="1" devices="tripinfo_car_s2n_313 routing_car_s2n_313" vType="Car" speedFactor="1.02" vaporized=""/>
    <tripinfo id="car_n2w_300" depart="300.00" departLane="n2sep_1" departPos="3.60" departPosLat="0.00" departSpeed="13.90" departDelay="0.00" arrival="460.55" arrivalLane="c2w_1" arrivalPos="990.00" arrivalPosLat="0.00" arrivalSpeed="14.00" duration="160.55" routeLength="1986.69" waitingTime="2.70" waitingCount="1" stopTime="0.00" timeLoss="18.05" rerouteNo="1" devices="tripinfo_car_n2w_300 routing_car_n2w_300" vType="Car" speedFactor="1.01" vaporized=""/>
    <tripinfo id="car_n2w_319" depart="319.00" departLane="n2sep_1" departPos="3.60" departPosLat="0.00" departSpeed="13.90" departDelay="0.00" arrival="462.60" arrivalLane="c2w_1" arrivalPos="990.00" arrivalPosLat="0.00" arrivalSpeed="15.00" duration="143.60" routeLength="1986.69" waitingTime="0.00" waitingCount="0" stopTime="0.00" timeLoss="14.59" rerouteNo="1" devices="tripinfo_car_n2w_319 routing_car_n2w_319" vType="Car" speedFactor="1.11" vaporized=""/>
    <tripinfo id="car_s2e_314" depart="314.45" departLane="s2sep_1" departPos="3.60" departPosLat="0.00" departSpeed="13.90" departDelay="0.45" arrival="463.70" arrivalLane="c2e_1" arrivalPos="990.00" arrivalPosLat="0.00" arrivalSpeed="13.95" duration="149.25" routeLength="1986.69" waitingTime="0.00" waitingCount="0" stopTime="0.00" timeLoss="6.11" rerouteNo="1" devices="tripinfo_car_s2e_314 routing_car_s2e_314" vType="Car" speedFactor="1.00" vaporized=""/>
    <tripinfo id="car_s2w_280" depart="280.00" departLane="s2sep_1" departPos="3.60" departPosLat="0.00" departSpeed="13.90" departDelay="0.00" arrival="464.75" arrivalLane="c2w_1" arrivalPos="990.00" arrivalPosLat="0.00" arrivalSpeed="14.98" duration="184.75" routeLength="1996.47" waitingTime="33.05" waitingCount="2" stopTime="0.00" timeLoss="53.93" rerouteNo="1" devices="tripinfo_car_s2w_280 routing_car_s2w_280" vType="Car" speedFactor="1.10" vaporized=""/>
</tripinfos>
