<?xml version="1.0" encoding="UTF-8"?>

<!-- generated on Sat Apr 24 18:16:27 2021 by Eclipse SUMO Version 1.4.0
<configuration xmlns:xsi="http://www.w3.org/2001/XMLSchema-instance" xsi:noNamespaceSchemaLocation="http://sumo.dlr.de/xsd/sumoConfiguration.xsd">

    <input>
        <net-file value="sumofiles/junction.net.xml"/>
        <route-files value="sumofiles/junction_preemption_101.rou.xml"/>
        <additional-files value="sumofiles/junction.det.xml"/>
    </input>

    <output>
        <tripinfo-output value="sumofiles/output/tripinfo_preemption_101.xml"/>
    </output>

    <time>
        <begin value="0"/>
        <end value="10000"/>
        <step-length value="0.05"/>
    </time>

    <processing>
        <lateral-resolution value="0.1"/>
    </processing>

    <report>
        <no-warnings value="true"/>
        <error-log value="sumofiles/output/errorlog_preemption_101.log"/>
        <no-step-log value="true"/>
    </report>

    <traci_server>
        <remote-port value="33679"/>
    </traci_server>

    <gui_only>
        <gui-settings-file value="sumofiles/junction-gui.settings.xml"/>
        <tracker-interval value="0.05"/>
    </gui_only>

</configuration>
-->

<tripinfos xmlns:xsi="http://www.w3.org/2001/XMLSchema-instance" xsi:noNamespaceSchemaLocation="http://sumo.dlr.de/xsd/tripinfo_file.xsd">
    <tripinfo id="car_e2n_1" depart="1.00" departLane="e2sep_1" departPos="3.60" departPosLat="0.00" departSpeed="13.90" departDelay="0.00" arrival="140.30" arrivalLane="c2n_1" arrivalPos="990.00" arrivalPosLat="0.00" arrivalSpeed="14.73" duration="139.30" routeLength="1986.69" waitingTime="0.00" waitingCount="0" stopTime="0.00" timeLoss="3.74" rerouteNo="1" devices="tripinfo_car_e2n_1 routing_car_e2n_1" vType="Car" speedFactor="1.06" vaporized=""/>
    <tripinfo id="car_e2w_2" depart="4.15" departLane="e2sep_1" departPos="3.60" departPosLat="0.00" departSpeed="13.90" departDelay="2.15" arrival="148.10" arrivalLane="c2w_1" arrivalPos="990.00" arrivalPosLat="0.00" arrivalSpeed="14.32" duration="143.95" routeLength="1997.01" waitingTime="0.00" waitingCount="0" stopTime="0.00" timeLoss="4.49" rerouteNo="1" devices="tripinfo_car_e2w_2 routing_car_e2w_2" vType="Car" speedFactor="1.03" vaporized=""/>
    <tripinfo id="car_e2s_1" depart="2.35" departLane="e2sep_1" departPos="3.60" departPosLat="0.00" departSpeed="13.90" departDelay="1.35" arrival="150.15" arrivalLane="c2s_1" arrivalPos="990.00" arrivalPosLat="0.00" arrivalSpeed="14.04" duration="147.80" routeLength="1996.47" waitingTime="0.00" waitingCount="0" stopTime="0.00" timeLoss="4.95" rerouteNo="1" devices="tripinfo_car_e2s_1 routing_car_e2s_1" vType="Car" speedFactor="1.01" vaporized=""/>
    <tripinfo id="car_w2n_10" depart="10.00" departLane="w2sep_1" departPos="3.60" departPosLat="0.00" departSpeed="13.90" departDelay="0.00" arrival="151.60" arrivalLane="c2n_1" arrivalPos="990.00" arrivalPosLat="0.00" arrivalSpeed="14.54" duration="141.60" routeLength="1996.47" waitingTime="0.00" waitingCount="0" stopTime="0.00" timeLoss="3.60" rerouteNo="1" devices="tripinfo_car_w2n_10 routing_car_w2n_10" vType="Car" speedFactor="1.05" vaporized=""/>
    <tripinfo id="car_s2e_26" depart="26.00" departLane="s2sep_1" departPos="3.60" departPosLat="0.00" departSpeed="13.90" departDelay="0.00" arrival="158.40" arrivalLane="c2e_1" arrivalPos="990.00" arrivalPosLat="0.00" arrivalSpeed="15.61" duration="132.40" routeLength="1986.69" waitingTime="0.00" waitingCount="0" stopTime="0.00" timeLoss="4.45" rerouteNo="1" devices="tripinfo_car_s2e_26 routing_car_s2e_26" vType="Car" speedFactor="1.12" vaporized=""/>
    <tripinfo id="car_n2s_1" depart="1.00" departLane="n2sep_1" departPos="3.60" departPosLat="0.00" departSpeed="13.90" departDelay="0.00" arrival="161.90" arrivalLane="c2s_1" arrivalPos="990.00" arrivalPosLat="0.00" arrivalSpeed="14.73" duration="160.90" routeLength="1997.01" waitingTime="17.75" waitingCount="1" stopTime="0.00" timeLoss="25.34" rerouteNo="1" devices="tripinfo_car_n2s_1 routing_car_n2s_1" vType="Car" speedFactor="1.06" vaporized=""/>
    <tripinfo id="car_n2s_2" depart="2.35" departLane="n2sep_1" departPos="3.60" departPosLat="0.00" departSpeed="13.90" departDelay="0.35" arrival="165.40" arrivalLane="c2s_1" arrivalPos="990.00" arrivalPosLat="0.00" arrivalSpeed="15.01" duration="163.05" routeLength="1997.01" waitingTime="15.60" waitingCount="1" stopTime="0.00" timeLoss="30.32" rerouteNo="1" devices="tripinfo_car_n2s_2 routing_car_n2s_2" vType="Car" speedFactor="1.08" vaporized=""/>
    <tripinfo id="car_n2e_9" depart="9.00" departLane="n2sep_1" departPos="3.60" departPosLat="0.00" departSpeed="13.90" departDelay="0.00" arrival="168.50" arrivalLane="c2e_1" arrivalPos="990.00" arrivalPosLat="0.00" arrivalSpeed="13.90" duration="159.50" routeLength="1996.47" waitingTime="5.65" waitingCount="1" stopTime="0.00" timeLoss="15.18" rerouteNo="1" devices="tripinfo_car_n2e_9 routing_car_n2e_9" vType="Car" speedFactor="1.00" vaporized=""/>
    <tripinfo id="car_n2e_13" depart="13.00" departLane="n2sep_1" departPos="3.60" departPosLat="0.00" departSpeed="13.90" departDelay="0.00" arrival="172.30" arrivalLane="c2e_1" arrivalPos="990.00" arrivalPosLat="0.00" arrivalSpeed="14.02" duration="159.30" routeLength="1996.47" waitingTime="2.50" waitingCount="1" stopTime="0.00" timeLoss="16.47" rerouteNo="1" devices="tripinfo_car_n2e_13 routing_car_n2e_13" vType="Car" speedFactor="1.01" vaporized=""/>
    <tripinfo id="car_n2e_20" depart="20.00" departLane="n2sep_1" departPos="3.60" departPosLat="0.00" departSpeed="13.90" departDelay="0.00" arrival="174.55" arrivalLane="c2e_1" arrivalPos="990.00" arrivalPosLat="0.00" arrivalSpeed="14.83" duration="154.55" routeLength="1996.47" waitingTime="1.15" waitingCount="1" stopTime="0.00" timeLoss="22.20" rerouteNo="1" devices="tripinfo_car_n2e_20 routing_car_n2e_20" vType="Car" speedFactor="1.09" vaporized=""/>
    <tripinfo id="car_n2w_35" depart="35.00" departLane="n2sep_1" departPos="3.60" departPosLat="0.00" departSpeed="13.90" departDelay="0.00" arrival="176.30" arrivalLane="c2w_1" arrivalPos="990.00" arrivalPosLat="0.00" arrivalSpeed="14.54" duration="141.30" routeLength="1986.69" waitingTime="0.00" waitingCount="0" stopTime="0.00" timeLoss="3.91" rerouteNo="1" devices="tripinfo_car_n2w_35 routing_car_n2w_35" vType="Car" speedFactor="1.05" vaporized=""/>
    <tripinfo id="car_s2e_33" depart="33.00" departLane="s2sep_1" departPos="3.60" departPosLat="0.00" departSpeed="13.90" departDelay="0.00" arrival="180.90" arrivalLane="c2e_1" arrivalPos="990.00" arrivalPosLat="0.00" arrivalSpeed="13.90" duration="147.90" routeLength="1986.69" waitingTime="0.00" waitingCount="0" stopTime="0.00" timeLoss="4.21" rerouteNo="1" devices="tripinfo_car_s2e_33 routing_car_s2e_33" vType="Car" speedFactor="1.00" vaporized=""/>
    <tripinfo id="car_n2s_35" depart="36.40" departLane="n2sep_1" departPos="3.60" departPosLat="0.00" departSpeed="13.90" departDelay="1.40" arrival="182.35" arrivalLane="c2s_1" arrivalPos="990.00" arrivalPosLat="0.00" arrivalSpeed="13.90" duration="145.95" routeLength="1997.01" waitingTime="0.00" waitingCount="0" stopTime="0.00" timeLoss="2.27" rerouteNo="1" devices="tripinfo_car_n2s_35 routing_car_n2s_35" vType="Car" speedFactor="1.00" vaporized=""/>
    <tripinfo id="car_n2s_38" depart="38.20" departLane="n2sep_1" departPos="3.60" departPosLat="0.00" departSpeed="13.90" departDelay="0.20" arrival="187.30" arrivalLane="c2s_1" arrivalPos="990.00" arrivalPosLat="0.00" arrivalSpeed="13.90" duration="149.10" routeLength="1997.01" waitingTime="0.00" waitingCount="0" stopTime="0.00" timeLoss="5.42" rerouteNo="1" devices="tripinfo_car_n2s_38 routing_car_n2s_38" vType="Car" speedFactor="1.00" vaporized=""/>
    <tripinfo id="car_s2w_40" depart="40.00" departLane="s2sep_1" departPos="3.60" departPosLat="0.00" departSpeed="13.90" departDelay="0.00" arrival="188.60" arrivalLane="c2w_1" arrivalPos="990.00" arrivalPosLat="0.00" arrivalSpeed="13.90" duration="148.60" routeLength="1996.47" waitingTime="0.00" waitingCount="0" stopTime="0.00" timeLoss="4.28" rerouteNo="1" devices="tripinfo_car_s2w_40 routing_car_s2w_40" vType="Car" speedFactor="1.00" vaporized=""/>
    <tripinfo id="car_s2w_43" depart="43.00" departLane="s2sep_1" departPos="3.60" departPosLat="0.00" departSpeed="13.90" departDelay="0.00" arrival="192.50" arrivalLane="c2w_1" arrivalPos="990.00" arrivalPosLat="0.00" arrivalSpeed="14.13" duration="149.50" routeLength="1996.47" waitingTime="0.00" waitingCount="0" stopTime="0.00" timeLoss="7.73" rerouteNo="1" devices="tripinfo_car_s2w_43 routing_car_s2w_43" vType="Car" speedFactor="1.02" vaporized=""/>
    <tripinfo id="car_n2w_50" depart="50.00" departLane="n2sep_1" departPos="3.60" departPosLat="0.00" departSpeed="13.90" departDelay="0.00" arrival="197.20" arrivalLane="c2w_1" arrivalPos="990.00" arrivalPosLat="0.00" arrivalSpeed="14.03" duration="147.20" routeLength="1986.69" waitingTime="0.00" waitingCount="0" stopTime="0.00" timeLoss="4.98" rerouteNo="1" devices="tripinfo_car_n2w_50 routing_car_n2w_50" vType="Car" speedFactor="1.01" vaporized=""/>
    <tripinfo id="car_s2w_57" depart="57.00" departLane="s2sep_1" departPos="3.60" departPosLat="0.00" departSpeed="13.90" departDelay="0.00" arrival="202.05" arrivalLane="c2w_1" arrivalPos="990.00" arrivalPosLat="0.00" arrivalSpeed="14.26" duration="145.05" routeLength="1996.47" waitingTime="0.00" waitingCount="0" stopTime="0.00" timeLoss="4.40" rerouteNo="1" devices="tripinfo_car_s2w_57 routing_car_s2w_57" vType="Car" speedFactor="1.03" vaporized=""/>
    <tripinfo id="car_w2e_60" depart="60.00" departLane="w2sep_1" departPos="3.60" departPosLat="0.00" departSpeed="13.90" departDelay="0.00" arrival="203.15" arrivalLane="c2e_1" arrivalPos="990.00" arrivalPosLat="0.00" arrivalSpeed="15.61" duration="143.15" routeLength="1997.01" waitingTime="7.25" waitingCount="1" stopTime="0.00" timeLoss="15.18" rerouteNo="1" devices="tripinfo_car_w2e_60 routing_car_w2e_60" vType="Car" speedFactor="1.12" vaporized=""/>
    <tripinfo id="car_s2w_59" depart="59.00" departLane="s2sep_1" departPos="3.60" departPosLat="0.00" departSpeed="13.90" departDelay="0.00" arrival="205.50" arrivalLane="c2w_1" arrivalPos="990.00" arrivalPosLat="0.00" arrivalSpeed="14.51" duration="146.50" routeLength="1996.47" waitingTime="0.00" waitingCount="0" stopTime="0.00" timeLoss="8.66" rerouteNo="1" devices="tripinfo_car_s2w_59 routing_car_s2w_59" vType="Car" speedFactor="1.05" vaporized=""/>
    <tripinfo id="car_w2e_66" depart="66.00" departLane="w2sep_1" departPos="3.60" departPosLat="0.00" departSpeed="13.90" departDelay="0.00" arrival="207.00" arrivalLane="c2e_1" arrivalPos="990.00" arrivalPosLat="0.00" arrivalSpeed="15.70" duration="141.00" routeLength="1997.01" waitingTime="2.30" waitingCount="1" stopTime="0.00" timeLoss="14.05" rerouteNo="1" devices="tripinfo_car_w2e_66 routing_car_w2e_66" vType="Car" speedFactor="1.13" vaporized=""/>
    <tripinfo id="car_e2w_14" depart="14.00" departLane="e2sep_1" departPos="3.60" departPosLat="0.00" departSpeed="13.90" departDelay="0.00" arrival="208.25" arrivalLane="c2w_1" arrivalPos="990.00" arrivalPosLat="0.00" arrivalSpeed="14.92" duration="194.25" routeLength="1997.01" waitingTime="50.50" waitingCount="1" stopTime="0.00" timeLoss="61.55" rerouteNo="1" devices="tripinfo_car_e2w_14 routing_car_e2w_14" vType="Car" speedFactor="1.08" vaporized=""/>
    <tripinfo id="car_e2n_76" depart="76.00" departLane="e2sep_1" departPos="3.60" departPosLat="0.00" departSpeed="13.90" departDelay="0.00" arrival="209.05" arrivalLane="c2n_1" arrivalPos="990.00" arrivalPosLat="0.00" arrivalSpeed="16.29" duration="133.05" routeLength="1986.69" waitingTime="0.00" waitingCount="0" stopTime="0.00" timeLoss="10.44" rerouteNo="1" devices="tripinfo_car_e2n_76 routing_car_e2n_76" vType="Car" speedFactor="1.17" vaporized=""/>
    <tripinfo id="car_e2w_19" depart="19.00" departLane="e2sep_1" departPos="3.60" departPosLat="0.00" departSpeed="13.90" departDelay="0.00" arrival="212.70" arrivalLane="c2w_1" arrivalPos="990.00" arrivalPosLat="0.00" arrivalSpeed="14.31" duration="193.70" routeLength="1997.01" waitingTime="43.55" waitingCount="1" stopTime="0.00" timeLoss="54.26" rerouteNo="1" devices="tripinfo_car_e2w_19 routing_car_e2w_19" vType="Car" speedFactor="1.03" vaporized=""/>
    <tripinfo id="car_w2s_66" depart="67.30" departLane="w2sep_1" departPos="3.60" departPosLat="0.00" departSpeed="13.90" departDelay="1.30" arrival="215.90" arrivalLane="c2s_1" arrivalPos="990.00" arrivalPosLat="0.00" arrivalSpeed="13.90" duration="148.60" routeLength="1986.69" waitingTime="0.00" waitingCount="0" stopTime="0.00" timeLoss="4.96" rerouteNo="1" devices="tripinfo_car_w2s_66 routing_car_w2s_66" vType="Car" speedFactor="1.00" vaporized=""/>
    <tripinfo id="car_e2w_21" depart="21.00" departLane="e2sep_1" departPos="3.60" departPosLat="0.00" departSpeed="13.90" departDelay="0.00" arrival="216.40" arrivalLane="c2w_1" arrivalPos="990.00" arrivalPosLat="0.00" arrivalSpeed="14.24" duration="195.40" routeLength="1997.01" waitingTime="40.75" waitingCount="1" stopTime="0.00" timeLoss="55.39" rerouteNo="1" devices="tripinfo_car_e2w_21 routing_car_e2w_21" vType="Car" speedFactor="1.03" vaporized=""/>
    <tripinfo id="car_e2w_42" depart="42.00" departLane="e2sep_1" departPos="3.60" departPosLat="0.00" departSpeed="13.90" departDelay="0.00" arrival="218.30" arrivalLane="c2w_1" arrivalPos="990.00" arrivalPosLat="0.00" arrivalSpeed="15.40" duration="176.30" routeLength="1997.01" waitingTime="30.15" waitingCount="1" stopTime="0.00" timeLoss="52.26" rerouteNo="1" devices="tripinfo_car_e2w_42 routing_car_e2w_42" vType="Car" speedFactor="1.16" vaporized=""/>
    <tripinfo id="car_w2e_74" depart="74.00" departLane="w2sep_1" departPos="3.60" departPosLat="0.00" departSpeed="13.90" departDelay="0.00" arrival="218.40" arrivalLane="c2e_1" arrivalPos="990.00" arrivalPosLat="0.00" arrivalSpeed="13.97" duration="144.40" routeLength="1997.01" waitingTime="0.00" waitingCount="0" stopTime="0.00" timeLoss="1.47" rerouteNo="1" devices="tripinfo_car_w2e_74 routing_car_w2e_74" vType="Car" speedFactor="1.01" vaporized=""/>
    <tripinfo id="car_w2n_23" depart="23.00" departLane="w2sep_1" departPos="3.60" departPosLat="0.00" departSpeed="13.90" departDelay="0.00" arrival="219.60" arrivalLane="c2n_1" arrivalPos="990.00" arrivalPosLat="0.00" arrivalSpeed="14.55" duration="196.60" routeLength="1996.47" waitingTime="47.40" waitingCount="2" stopTime="0.00" timeLoss="58.76" rerouteNo="1" devices="tripinfo_car_w2n_23 routing_car_w2n_23" vType="Car" speedFactor="1.05" vaporized=""/>
    <tripinfo id="car_w2s_84" depart="84.00" departLane="w2sep_1" departPos="3.60" departPosLat="0.00" departSpeed="13.90" departDelay="0.00" arrival="231.40" arrivalLane="c2s_1" arrivalPos="990.00" arrivalPosLat="0.00" arrivalSpeed="13.90" duration="147.40" routeLength="1986.69" waitingTime="0.00" waitingCount="0" stopTime="0.00" timeLoss="3.71" rerouteNo="1" devices="tripinfo_car_w2s_84 routing_car_w2s_84" vType="Car" speedFactor="1.00" vaporized=""/>
    <tripinfo id="car_e2w_97" depart="97.00" departLane="e2sep_1" departPos="3.60" departPosLat="0.00" departSpeed="13.90" departDelay="0.00" arrival="238.30" arrivalLane="c2w_1" arrivalPos="990.00" arrivalPosLat="0.00" arrivalSpeed="14.15" duration="141.30" routeLength="1997.01" waitingTime="0.00" waitingCount="0" stopTime="0.00" timeLoss="0.15" rerouteNo="1" devices="tripinfo_car_e2w_97 routing_car_e2w_97" vType="Car" speedFactor="1.02" vaporized=""/>
    <tripinfo id="bus_w2s_89" depart="89.00" departLane="w2sep_1" departPos="12.10" departPosLat="0.00" departSpeed="13.90" departDelay="0.00" arrival="238.95" arrivalLane="c2s_1" arrivalPos="990.00" arrivalPosLat="0.00" arrivalSpeed="13.89" duration="149.95" routeLength="1978.19" waitingTime="0.00" waitingCount="0" stopTime="0.00" timeLoss="6.92" rerouteNo="1" devices="tripinfo_bus_w2s_89 routing_bus_w2s_89" vType="Bus" speedFactor="1.00" vaporized=""/>
    <tripinfo id="car_w2n_102" depart="102.40" departLane="w2sep_1" departPos="3.60" departPosLat="0.00" departSpeed="13.90" departDelay="0.40" arrival="242.90" arrivalLane="c2n_1" arrivalPos="990.00" arrivalPosLat="0.00" arrivalSpeed="15.12" duration="140.50" routeLength="1996.47" waitingTime="0.00" waitingCount="0" stopTime="0.00" timeLoss="7.87" rerouteNo="1" devices="tripinfo_car_w2n_102 routing_car_w2n_102" vType="Car" speedFactor="1.09" vaporized=""/>
    <tripinfo id="car_s2e_73" depart="73.00" departLane="s2sep_1" departPos="3.60" departPosLat="0.00" departSpeed="13.90" departDelay="0.00" arrival="246.40" arrivalLane="c2e_1" arrivalPos="990.00" arrivalPosLat="0.00" arrivalSpeed="16.05" duration="173.40" routeLength="1986.69" waitingTime="40.70" waitingCount="1" stopTime="0.00" timeLoss="48.92" rerouteNo="1" devices="tripinfo_car_s2e_73 routing_car_s2e_73" vType="Car" speedFactor="1.15" vaporized=""/>
    <tripinfo id="bus_e2s_60" depart="60.00" departLane="e2sep_1" departPos="12.10" departPosLat="0.00" departSpeed="13.90" departDelay="0.00" arrival="246.90" arrivalLane="c2s_1" arrivalPos="990.00" arrivalPosLat="0.00" arrivalSpeed="13.89" duration="186.90" routeLength="1987.97" waitingTime="27.65" waitingCount="2" stopTime="0.00" timeLoss="43.17" rerouteNo="1" devices="tripinfo_bus_e2s_60 routing_bus_e2s_60" vType="Bus" speedFactor="1.00" vaporized=""/>
    <tripinfo id="car_e2s_69" depart="69.00" departLane="e2sep_1" departPos="3.60" departPosLat="0.00" departSpeed="13.90" departDelay="0.00" arrival="249.25" arrivalLane="c2s_1" arrivalPos="990.00" arrivalPosLat="0.00" arrivalSpeed="15.71" duration="180.25" routeLength="1996.47" waitingTime="26.20" waitingCount="1" stopTime="0.00" timeLoss="57.79" rerouteNo="1" devices="tripinfo_car_e2s_69 routing_car_e2s_69" vType="Car" speedFactor="1.18" vaporized=""/>
    <tripinfo id="car_n2w_52" depart="52.00" departLane="n2sep_1" departPos="3.60" departPosLat="0.00" departSpeed="13.90" departDelay="0.00" arrival="249.95" arrivalLane="c2w_1" arrivalPos="990.00" arrivalPosLat="0.00" arrivalSpeed="15.16" duration="197.95" routeLength="1986.69" waitingTime="53.15" waitingCount="1" stopTime="0.00" timeLoss="66.25" rerouteNo="1" devices="tripinfo_car_n2w_52 routing_car_n2w_52" vType="Car" speedFactor="1.09" vaporized=""/>
    <tripinfo id="car_s2e_96" depart="96.00" departLane="s2sep_1" departPos="3.60" departPosLat="0.00" departSpeed="13.90" departDelay="0.00" arrival="250.50" arrivalLane="c2e_1" arrivalPos="990.00" arrivalPosLat="0.00" arrivalSpeed="16.08" duration="154.50" routeLength="1986.69" waitingTime="18.85" waitingCount="1" stopTime="0.00" timeLoss="30.45" rerouteNo="1" devices="tripinfo_car_s2e_96 routing_car_s2e_96" vType="Car" speedFactor="1.16" vaporized=""/>
    <tripinfo id="car_s2n_98" depart="98.00" departLane="s2sep_1" departPos="3.60" departPosLat="0.00" departSpeed="13.90" departDelay="0.00" arrival="254.35" arrivalLane="c2n_1" arrivalPos="990.00" arrivalPosLat="0.00" arrivalSpeed="15.18" duration="156.35" routeLength="1997.01" waitingTime="13.75" waitingCount="1" stopTime="0.00" timeLoss="24.73" rerouteNo="1" devices="tripinfo_car_s2n_98 routing_car_s2n_98" vType="Car" speedFactor="1.09" vaporized=""/>
    <tripinfo id="car_n2w_62" depart="62.00" departLane="n2sep_1" departPos="3.60" departPosLat="0.00" departSpeed="13.90" departDelay="0.00" arrival="258.85" arrivalLane="c2w_1" arrivalPos="990.00" arrivalPosLat="0.00" arrivalSpeed="13.90" duration="196.85" routeLength="1986.69" waitingTime="43.85" waitingCount="1" stopTime="0.00" timeLoss="53.20" rerouteNo="1" devices="tripinfo_car_n2w_62 routing_car_n2w_62" vType="Car" speedFactor="1.00" vaporized=""/>
    <tripinfo id="car_n2s_81" depart="81.00" departLane="n2sep_1" departPos="3.60" departPosLat="0.00" departSpeed="13.90" departDelay="0.00" arrival="259.00" arrivalLane="c2s_1" arrivalPos="990.00" arrivalPosLat="0.00" arrivalSpeed="14.17" duration="178.00" routeLength="1997.01" waitingTime="27.25" waitingCount="1" stopTime="0.00" timeLoss="37.08" rerouteNo="1" devices="tripinfo_car_n2s_81 routing_car_n2s_81" vType="Car" speedFactor="1.02" vaporized=""/>
    <tripinfo id="car_s2e_122" depart="122.00" departLane="s2sep_1" departPos="3.60" departPosLat="0.00" departSpeed="13.90" departDelay="0.00" arrival="260.45" arrivalLane="c2e_1" arrivalPos="990.00" arrivalPosLat="0.00" arrivalSpeed="15.23" duration="138.45" routeLength="1986.69" waitingTime="0.00" waitingCount="0" stopTime="0.00" timeLoss="7.34" rerouteNo="1" devices="tripinfo_car_s2e_122 routing_car_s2e_122" vType="Car" speedFactor="1.10" vaporized=""/>
    <tripinfo id="car_n2s_91" depart="91.00" departLane="n2sep_1" departPos="3.60" departPosLat="0.00" departSpeed="13.90" departDelay="0.00" arrival="261.40" arrivalLane="c2s_1" arrivalPos="990.00" arrivalPosLat="0.00" arrivalSpeed="15.07" duration="170.40" routeLength="1997.01" waitingTime="22.85" waitingCount="1" stopTime="0.00" timeLoss="40.03" rerouteNo="1" devices="tripinfo_car_n2s_91 routing_car_n2s_91" vType="Car" speedFactor="1.10" vaporized=""/>
    <tripinfo id="car_s2n_104" depart="104.00" departLane="s2sep_1" departPos="3.60" departPosLat="0.00" departSpeed="13.90" departDelay="0.00" arrival="262.25" arrivalLane="c2n_1" arrivalPos="990.00" arrivalPosLat="0.00" arrivalSpeed="14.04" duration="158.25" routeLength="1997.01" waitingTime="4.75" waitingCount="1" stopTime="0.00" timeLoss="16.02" rerouteNo="1" devices="tripinfo_car_s2n_104 routing_car_s2n_104" vType="Car" speedFactor="1.01" vaporized=""/>
    <tripinfo id="car_n2s_97" depart="97.00" departLane="n2sep_1" departPos="3.60" departPosLat="0.00" departSpeed="13.90" departDelay="0.00" arrival="265.15" arrivalLane="c2s_1" arrivalPos="990.00" arrivalPosLat="0.00" arrivalSpeed="14.30" duration="168.15" routeLength="1997.01" waitingTime="14.35" waitingCount="1" stopTime="0.00" timeLoss="28.72" rerouteNo="1" devices="tripinfo_car_n2s_97 routing_car_n2s_97" vType="Car" speedFactor="1.03" vaporized=""/>
    <tripinfo id="car_s2n_113" depart="113.00" departLane="s2sep_1" departPos="3.60" departPosLat="0.00" departSpeed="13.90" departDelay="0.00" arrival="266.70" arrivalLane="c2n_1" arrivalPos="990.00" arrivalPosLat="0.00" arrivalSpeed="13.89" duration="153.70" routeLength="1997.01" waitingTime="0.00" waitingCount="0" stopTime="0.00" timeLoss="9.99" rerouteNo="1" devices="tripinfo_car_s2n_113 routing_car_s2n_113" vType="Car" speedFactor="1.00" vaporized=""/>
    <tripinfo id="car_s2w_79" depart="79.00" departLane="s2sep_1" departPos="3.60" departPosLat="0.00" departSpeed="13.90" departDelay="0.00" arrival="267.10" arrivalLane="c2w_1" arrivalPos="990.00" arrivalPosLat="0.00" arrivalSpeed="13.90" duration="188.10" routeLength="1996.47" waitingTime="32.50" waitingCount="2" stopTime="0.00" timeLoss="43.75" rerouteNo="1" devices="tripinfo_car_s2w_79 routing_car_s2w_79" vType="Car" speedFactor="1.00" vaporized=""/>
    <tripinfo id="car_s2n_134" depart="134.00" departLane="s2sep_1" departPos="3.60" departPosLat="0.00" departSpeed="13.90" departDelay="0.00" arrival="268.65" arrivalLane="c2n_1" arrivalPos="990.00" arrivalPosLat="0.00" arrivalSpeed="15.11" duration="134.65" routeLength="1997.01" waitingTime="0.00" waitingCount="0" stopTime="0.00" timeLoss="7.69" rerouteNo="1" devices="tripinfo_car_s2n_134 routing_car_s2n_134" vType="Car" speedFactor="1.13" vaporized=""/>
    <tripinfo id="car_n2e_64" depart="64.00" departLane="n2sep_1" departPos="3.60" departPosLat="0.00" departSpeed="13.90" departDelay="0.00" arrival="273.65" arrivalLane="c2e_1" arrivalPos="990.00" arrivalPosLat="0.00" arrivalSpeed="13.90" duration="209.65" routeLength="1996.47" waitingTime="52.30" waitingCount="2" stopTime="0.00" timeLoss="65.34" rerouteNo="1" devices="tripinfo_car_n2e_64 routing_car_n2e_64" vType="Car" speedFactor="1.00" vaporized=""/>
    <tripinfo id="car_n2e_86" depart="86.00" departLane="n2sep_1" departPos="3.60" departPosLat="0.00" departSpeed="13.90" departDelay="0.00" arrival="275.50" arrivalLane="c2e_1" arrivalPos="990.00" arrivalPosLat="0.00" arrivalSpeed="15.50" duration="189.50" routeLength="1996.47" waitingTime="37.10" waitingCount="2" stopTime="0.00" timeLoss="67.15" rerouteNo="1" devices="tripinfo_car_n2e_86 routing_car_n2e_86" vType="Car" speedFactor="1.18" vaporized=""/>
    <tripinfo id="car_n2w_130" depart="130.00" departLane="n2sep_1" departPos="3.60" departPosLat="0.00" departSpeed="13.90" departDelay="0.00" arrival="279.45" arrivalLane="c2w_1" arrivalPos="990.00" arrivalPosLat="0.00" arrivalSpeed="13.90" duration="149.45" routeLength="1986.69" waitingTime="0.00" waitingCount="0" stopTime="0.00" timeLoss="5.77" rerouteNo="1" devices="tripinfo_car_n2w_130 routing_car_n2w_130" vType="Car" speedFactor="1.00" vaporized=""/>
    <tripinfo id="car_n2e_128" depart="128.00" departLane="n2sep_1" departPos="3.60" departPosLat="0.00" departSpeed="13.90" departDelay="0.00" arrival="279.85" arrivalLane="c2e_1" arrivalPos="990.00" arrivalPosLat="0.00" arrivalSpeed="13.94" duration="151.85" routeLength="1996.47" waitingTime="0.00" waitingCount="0" stopTime="0.00" timeLoss="8.00" rerouteNo="1" devices="tripinfo_car_n2e_128 routing_car_n2e_128" vType="Car" speedFactor="1.00" vaporized=""/>
    <tripinfo id="bus_s2w_141" depart="141.00" departLane="s2sep_1" departPos="12.10" departPosLat="0.00" departSpeed="13.90" departDelay="0.00" arrival="290.15" arrivalLane="c2w_1" arrivalPos="990.00" arrivalPosLat="0.00" arrivalSpeed="13.90" duration="149.15" routeLength="1987.97" waitingTime="0.00" waitingCount="0" stopTime="0.00" timeLoss="5.44" rerouteNo="1" devices="tripinfo_bus_s2w_141 routing_bus_s2w_141" vType="Bus" speedFactor="1.00" vaporized=""/>
    <tripinfo id="car_n2e_146" depart="146.00" departLane="n2sep_1" departPos="3.60" departPosLat="0.00" departSpeed="13.90" departDelay="0.00" arrival="291.60" arrivalLane="c2e_1" arrivalPos="990.00" arrivalPosLat="0.00" arrivalSpeed="14.12" duration="145.60" routeLength="1996.47" waitingTime="0.00" waitingCount="0" stopTime="0.00" timeLoss="3.53" rerouteNo="1" devices="tripinfo_car_n2e_146 routing_car_n2e_146" vType="Car" speedFactor="1.02" vaporized=""/>
    <tripinfo id="car_s2w_156" depart="156.00" departLane="s2sep_1" departPos="3.60" departPosLat="0.00" departSpeed="13.90" departDelay="0.00" arrival="292.65" arrivalLane="c2w_1" arrivalPos="990.00" arrivalPosLat="0.00" arrivalSpeed="15.55" duration="136.65" routeLength="1996.47" waitingTime="0.00" waitingCount="0" stopTime="0.00" timeLoss="11.60" rerouteNo="1" devices="tripinfo_car_s2w_156 routing_car_s2w_156" vType="Car" speedFactor="1.15" vaporized=""/>
    <tripinfo id="car_w2e_101" depart="101.00" departLane="w2sep_1" departPos="3.60" departPosLat="0.00" departSpeed="13.90" departDelay="0.00" arrival="298.25" arrivalLane="c2e_1" arrivalPos="990.00" arrivalPosLat="0.00" arrivalSpeed="14.50" duration="197.25" routeLength="1997.01" waitingTime="52.30" waitingCount="1" stopTime="0.00" timeLoss="59.55" rerouteNo="1" devices="tripinfo_car_w2e_101 routing_car_w2e_101" vType="Car" speedFactor="1.04" vaporized=""/>
    <tripinfo id="car_e2w_100" depart="100.00" departLane="e2sep_1" departPos="3.60" departPosLat="0.00" departSpeed="13.90" departDelay="0.00" arrival="298.70" arrivalLane="c2w_1" arrivalPos="990.00" arrivalPosLat="0.00" arrivalSpeed="14.42" duration="198.70" routeLength="1997.01" waitingTime="51.00" waitingCount="1" stopTime="0.00" timeLoss="60.26" rerouteNo="1" devices="tripinfo_car_e2w_100 routing_car_e2w_100" vType="Car" speedFactor="1.04" vaporized=""/>
    <tripinfo id="car_w2e_140" depart="140.00" departLane="w2sep_1" departPos="3.60" departPosLat="0.00" departSpeed="13.90" departDelay="0.00" arrival="301.60" arrivalLane="c2e_1" arrivalPos="990.00" arrivalPosLat="0.00" arrivalSpeed="14.99" duration="161.60" routeLength="1997.01" waitingTime="16.95" waitingCount="1" stopTime="0.00" timeLoss="28.85" rerouteNo="1" devices="tripinfo_car_w2e_140 routing_car_w2e_140" vType="Car" speedFactor="1.08" vaporized=""/>
    <tripinfo id="car_w2s_129" depart="129.00" departLane="w2sep_1" departPos="3.60" departPosLat="0.00" departSpeed="13.90" departDelay="0.00" arrival="302.95" arrivalLane="c2s_1" arrivalPos="990.00" arrivalPosLat="0.00" arrivalSpeed="13.90" duration="173.95" routeLength="1986.69" waitingTime="21.80" waitingCount="1" stopTime="0.00" timeLoss="30.31" rerouteNo="1" devices="tripinfo_car_w2s_129 routing_car_w2s_129" vType="Car" speedFactor="1.00" vaporized=""/>
    <tripinfo id="car_e2w_112" depart="112.00" departLane="e2sep_1" departPos="3.60" departPosLat="0.00" departSpeed="13.90" departDelay="0.00" arrival="304.40" arrivalLane="c2w_1" arrivalPos="990.00" arrivalPosLat="0.00" arrivalSpeed="13.90" duration="192.40" routeLength="1997.01" waitingTime="38.80" waitingCount="1" stopTime="0.00" timeLoss="48.70" rerouteNo="1" devices="tripinfo_car_e2w_112 routing_car_e2w_112" vType="Car" speedFactor="1.00" vaporized=""/>
    <tripinfo id="car_e2w_119" depart="119.00" departLane="e2sep_1" departPos="3.60" departPosLat="0.00" departSpeed="13.90" departDelay="0.00" arrival="306.25" arrivalLane="c2w_1" arrivalPos="990.00" arrivalPosLat="0.00" arrivalSpeed="15.40" duration="187.25" routeLength="1997.01" waitingTime="34.30" waitingCount="1" stopTime="0.00" timeLoss="64.30" rerouteNo="1" devices="tripinfo_car_e2w_119 routing_car_e2w_119" vType="Car" speedFactor="1.17" vaporized=""/>
    <tripinfo id="car_e2n_132" depart="133.25" departLane="e2sep_1" departPos="3.60" departPosLat="0.00" departSpeed="13.90" departDelay="1.25" arrival="307.65" arrivalLane="c2n_1" arrivalPos="990.00" arrivalPosLat="0.00" arrivalSpeed="14.23" duration="174.40" routeLength="1986.69" waitingTime="21.80" waitingCount="1" stopTime="0.00" timeLoss="34.04" rerouteNo="1" devices="tripinfo_car_e2n_132 routing_car_e2n_132" vType="Car" speedFactor="1.02" vaporized=""/>
    <tripinfo id="car_e2w_132" depart="132.00" departLane="e2sep_1" departPos="3.60" departPosLat="0.00" departSpeed="13.90" departDelay="0.00" arrival="308.25" arrivalLane="c2w_1" arrivalPos="990.00" arrivalPosLat="0.00" arrivalSpeed="15.35" duration="176.25" routeLength="1997.01" waitingTime="28.75" waitingCount="1" stopTime="0.00" timeLoss="50.46" rerouteNo="1" devices="tripinfo_car_e2w_132 routing_car_e2w_132" vType="Car" speedFactor="1.14" vaporized=""/>
    <tripinfo id="car_e2s_115" depart="115.00" departLane="e2sep_1" departPos="3.60" departPosLat="0.00" departSpeed="13.90" departDelay="0.00" arrival="308.65" arrivalLane="c2s_1" arrivalPos="990.00" arrivalPosLat="0.00" arrivalSpeed="13.90" duration="193.65" routeLength="1996.47" waitingTime="36.15" waitingCount="2" stopTime="0.00" timeLoss="49.33" rerouteNo="1" devices="tripinfo_car_e2s_115 routing_car_e2s_115" vType="Car" speedFactor="1.00" vaporized=""/>
    <tripinfo id="car_e2w_161" depart="161.00" departLane="e2sep_1" departPos="3.60" departPosLat="0.00" departSpeed="13.90" departDelay="0.00" arrival="310.15" arrivalLane="c2w_1" arrivalPos="990.00" arrivalPosLat="0.00" arrivalSpeed="15.59" duration="149.15" routeLength="1997.01" waitingTime="0.00" waitingCount="0" stopTime="0.00" timeLoss="26.51" rerouteNo="1" devices="tripinfo_car_e2w_161 routing_car_e2w_161" vType="Car" speedFactor="1.17" vaporized=""/>
    <tripinfo id="car_w2s_178" depart="178.00" departLane="w2sep_1" departPos="3.60" departPosLat="0.00" departSpeed="13.90" departDelay="0.00" arrival="310.45" arrivalLane="c2s_1" arrivalPos="990.00" arrivalPosLat="0.00" arrivalSpeed="15.46" duration="132.45" routeLength="1986.69" waitingTime="0.00" waitingCount="0" stopTime="0.00" timeLoss="10.67" rerouteNo="1" devices="tripinfo_car_w2s_178 routing_car_w2s_178" vType="Car" speedFactor="1.18" vaporized=""/>
    <tripinfo id="car_e2w_168" depart="168.00" departLane="e2sep_1" departPos="3.60" departPosLat="0.00" departSpeed="13.90" departDelay="0.00" arrival="313.80" arrivalLane="c2w_1" arrivalPos="990.00" arrivalPosLat="0.00" arrivalSpeed="14.15" duration="145.80" routeLength="1997.01" waitingTime="0.00" waitingCount="0" stopTime="0.00" timeLoss="4.87" rerouteNo="1" devices="tripinfo_car_e2w_168 routing_car_e2w_168" vType="Car" speedFactor="1.02" vaporized=""/>
    <tripinfo id="car_e2n_174" depart="174.00" departLane="e2sep_1" departPos="3.60" departPosLat="0.00" departSpeed="13.90" departDelay="0.00" arrival="315.20" arrivalLane="c2n_1" arrivalPos="990.00" arrivalPosLat="0.00" arrivalSpeed="14.67" duration="141.20" routeLength="1986.69" waitingTime="0.00" waitingCount="0" stopTime="0.00" timeLoss="5.10" rerouteNo="1" devices="tripinfo_car_e2n_174 routing_car_e2n_174" vType="Car" speedFactor="1.06" vaporized=""/>
    <tripinfo id="car_e2s_120" depart="120.30" departLane="e2sep_1" departPos="3.60" departPosLat="0.00" departSpeed="13.90" departDelay="0.30" arrival="317.60" arrivalLane="c2s_1" arrivalPos="990.00" arrivalPosLat="0.00" arrivalSpeed="14.13" duration="197.30" routeLength="1996.47" waitingTime="36.10" waitingCount="3" stopTime="0.00" timeLoss="55.33" rerouteNo="1" devices="tripinfo_car_e2s_120 routing_car_e2s_120" vType="Car" speedFactor="1.02" vaporized=""/>
    <tripinfo id="car_w2e_179" depart="179.25" departLane="w2sep_1" departPos="3.60" departPosLat="0.00" departSpeed="13.90" departDelay="0.25" arrival="319.70" arrivalLane="c2e_1" arrivalPos="990.00" arrivalPosLat="0.00" arrivalSpeed="14.35" duration="140.45" routeLength="1997.01" waitingTime="0.00" waitingCount="0" stopTime="0.00" timeLoss="1.26" rerouteNo="1" devices="tripinfo_car_w2e_179 routing_car_w2e_179" vType="Car" speedFactor="1.03" vaporized=""/>
    <tripinfo id="car_w2s_179" depart="180.90" departLane="w2sep_1" departPos="3.60" departPosLat="0.00" departSpeed="13.90" departDelay="1.90" arrival="321.80" arrivalLane="c2s_1" arrivalPos="990.00" arrivalPosLat="0.00" arrivalSpeed="15.30" duration="140.90" routeLength="1986.69" waitingTime="0.00" waitingCount="0" stopTime="0.00" timeLoss="10.60" rerouteNo="1" devices="tripinfo_car_w2s_179 routing_car_w2s_179" vType="Car" speedFactor="1.10" vaporized=""/>
    <tripinfo id="car_w2e_189" depart="189.00" departLane="w2sep_1" departPos="3.60" departPosLat="0.00" departSpeed="13.90" departDelay="0.00" arrival="322.15" arrivalLane="c2e_1" arrivalPos="990.00" arrivalPosLat="0.00" arrivalSpeed="15.69" duration="133.15" routeLength="1997.01" waitingTime="0.00" waitingCount="0" stopTime="0.00" timeLoss="7.96" rerouteNo="1" devices="tripinfo_car_w2e_189 routing_car_w2e_189" vType="Car" speedFactor="1.15" vaporized=""/>
    <tripinfo id="bus_w2n_104" depart="104.85" departLane="w2sep_1" departPos="12.10" departPosLat="0.00" departSpeed="13.90" departDelay="0.85" arrival="325.45" arrivalLane="c2n_1" arrivalPos="990.00" arrivalPosLat="0.00" arrivalSpeed="13.90" duration="220.60" routeLength="1987.97" waitingTime="59.70" waitingCount="2" stopTime="0.00" timeLoss="76.89" rerouteNo="1" devices="tripinfo_bus_w2n_104 routing_bus_w2n_104" vType="Bus" speedFactor="1.00" vaporized=""/>
    <tripinfo id="car_e2s_143" depart="143.00" departLane="e2sep_1" departPos="3.60" departPosLat="0.00" departSpeed="13.90" departDelay="0.00" arrival="325.85" arrivalLane="c2s_1" arrivalPos="990.00" arrivalPosLat="0.00" arrivalSpeed="15.53" duration="182.85" routeLength="1996.47" waitingTime="28.25" waitingCount="3" stopTime="0.00" timeLoss="53.92" rerouteNo="1" devices="tripinfo_car_e2s_143 routing_car_e2s_143" vType="Car" speedFactor="1.12" vaporized=""/>
    <tripinfo id="car_w2n_108" depart="108.00" departLane="w2sep_1" departPos="3.60" departPosLat="0.00" departSpeed="13.90" departDelay="0.00" arrival="330.25" arrivalLane="c2n_1" arrivalPos="990.00" arrivalPosLat="0.00" arrivalSpeed="13.89" duration="222.25" routeLength="1996.47" waitingTime="56.20" waitingCount="2" stopTime="0.00" timeLoss="77.89" rerouteNo="1" devices="tripinfo_car_w2n_108 routing_car_w2n_108" vType="Car" speedFactor="1.00" vaporized=""/>
    <tripinfo id="car_w2n_162" depart="162.00" departLane="w2sep_1" departPos="3.60" departPosLat="0.00" departSpeed="13.90" departDelay="0.00" arrival="332.90" arrivalLane="c2n_1" arrivalPos="990.00" arrivalPosLat="0.00" arrivalSpeed="14.32" duration="170.90" routeLength="1996.47" waitingTime="14.10" waitingCount="1" stopTime="0.00" timeLoss="32.11" rerouteNo="1" devices="tripinfo_car_w2n_162 routing_car_w2n_162" vType="Car" speedFactor="1.04" vaporized=""/>
    <tripinfo id="car_e2s_157" depart="157.00" departLane="e2sep_1" departPos="3.60" departPosLat="0.00" departSpeed="13.90" departDelay="0.00" arrival="334.50" arrivalLane="c2s_1" arrivalPos="990.00" arrivalPosLat="0.00" arrivalSpeed="13.97" duration="177.50" routeLength="1996.47" waitingTime="9.30" waitingCount="2" stopTime="0.00" timeLoss="33.93" rerouteNo="1" devices="tripinfo_car_e2s_157 routing_car_e2s_157" vType="Car" speedFactor="1.01" vaporized=""/>
    <tripinfo id="car_n2w_153" depart="153.00" departLane="n2sep_1" departPos="3.60" departPosLat="0.00" departSpeed="13.90" departDelay="0.00" arrival="337.50" arrivalLane="c2w_1" arrivalPos="990.00" arrivalPosLat="0.00" arrivalSpeed="16.38" duration="184.50" routeLength="1986.69" waitingTime="43.35" waitingCount="1" stopTime="0.00" timeLoss="62.58" rerouteNo="1" devices="tripinfo_car_n2w_153 routing_car_n2w_153" vType="Car" speedFactor="1.18" vaporized=""/>
    <tripinfo id="car_e2s_186" depart="186.00" departLane="e2sep_1" departPos="3.60" departPosLat="0.00" departSpeed="13.90" departDelay="0.00" arrival="337.75" arrivalLane="c2s_1" arrivalPos="990.00" arrivalPosLat="0.00" arrivalSpeed="14.33" duration="151.75" routeLength="1996.47" waitingTime="0.00" waitingCount="0" stopTime="0.00" timeLoss="12.24" rerouteNo="1" devices="tripinfo_car_e2s_186 routing_car_e2s_186" vType="Car" speedFactor="1.03" vaporized=""/>
    <tripinfo id="car_n2s_150" depart="150.00" departLane="n2sep_1" departPos="3.60" departPosLat="0.00" departSpeed="13.90" departDelay="0.00" arrival="346.05" arrivalLane="c2s_1" arrivalPos="990.00" arrivalPosLat="0.00" arrivalSpeed="13.90" duration="196.05" routeLength="1997.01" waitingTime="44.30" waitingCount="1" stopTime="0.00" timeLoss="52.35" rerouteNo="1" devices="tripinfo_car_n2s_150 routing_car_n2s_150" vType="Car" speedFactor="1.00" vaporized=""/>
    <tripinfo id="bus_s2n_168" depart="168.00" departLane="s2sep_1" departPos="12.10" departPosLat="0.00" departSpeed="13.90" departDelay="0.00" arrival="349.25" arrivalLane="c2n_1" arrivalPos="990.00" arrivalPosLat="0.00" arrivalSpeed="13.90" duration="181.25" routeLength="1988.51" waitingTime="27.30" waitingCount="1" stopTime="0.00" timeLoss="38.19" rerouteNo="1" devices="tripinfo_bus_s2n_168 routing_bus_s2n_168" vType="Bus" speedFactor="1.00" vaporized=""/>
    <tripinfo id="car_n2w_164" depart="164.00" departLane="n2sep_1" departPos="3.60" departPosLat="0.00" departSpeed="13.90" departDelay="0.00" arrival="349.30" arrivalLane="c2w_1" arrivalPos="990.00" arrivalPosLat="0.00" arrivalSpeed="14.21" duration="185.30" routeLength="1986.69" waitingTime="34.35" waitingCount="1" stopTime="0.00" timeLoss="44.72" rerouteNo="1" devices="tripinfo_car_n2w_164 routing_car_n2w_164" vType="Car" speedFactor="1.02" vaporized=""/>
    <tripinfo id="car_s2e_175" depart="175.00" departLane="s2sep_1" departPos="3.60" departPosLat="0.00" departSpeed="13.90" departDelay="0.00" arrival="350.40" arrivalLane="c2e_1" arrivalPos="990.00" arrivalPosLat="0.00" arrivalSpeed="13.90" duration="175.40" routeLength="1986.69" waitingTime="21.40" waitingCount="1" stopTime="0.00" timeLoss="31.75" rerouteNo="1" devices="tripinfo_car_s2e_175 routing_car_s2e_175" vType="Car" speedFactor="1.00" vaporized=""/>
    <tripinfo id="car_n2w_184" depart="184.00" departLane="n2sep_1" departPos="3.60" departPosLat="0.00" departSpeed="13.90" departDelay="0.00" arrival="352.05" arrivalLane="c2w_1" arrivalPos="990.00" arrivalPosLat="0.00" arrivalSpeed="14.98" duration="168.05" routeLength="1986.69" waitingTime="17.65" waitingCount="1" stopTime="0.00" timeLoss="35.89" rerouteNo="1" devices="tripinfo_car_n2w_184 routing_car_n2w_184" vType="Car" speedFactor="1.09" vaporized=""/>
    <tripinfo id="car_n2s_180" depart="180.00" departLane="n2sep_1" departPos="3.60" departPosLat="0.00" departSpeed="13.90" departDelay="0.00" arrival="352.30" arrivalLane="c2s_1" arrivalPos="990.00" arrivalPosLat="0.00" arrivalSpeed="14.00" duration="172.30" routeLength="1997.01" waitingTime="18.55" waitingCount="1" stopTime="0.00" timeLoss="29.67" rerouteNo="1" devices="tripinfo_car_n2s_180 routing_car_n2s_180" vType="Car" speedFactor="1.01" vaporized=""/>
    <tripinfo id="car_s2n_186" depart="186.00" departLane="s2sep_1" departPos="3.60" departPosLat="0.00" departSpeed="13.90" departDelay="0.00" arrival="354.30" arrivalLane="c2n_1" arrivalPos="990.00" arrivalPosLat="0.00" arrivalSpeed="13.89" duration="168.30" routeLength="1997.01" waitingTime="11.75" waitingCount="1" stopTime="0.00" timeLoss="24.64" rerouteNo="1" devices="tripinfo_car_s2n_186 routing_car_s2n_186" vType="Car" speedFactor="1.00" vaporized=""/>
    <tripinfo id="car_n2s_201" depart="201.00" departLane="n2sep_1" departPos="3.60" departPosLat="0.00" departSpeed="13.90" departDelay="0.00" arrival="357.55" arrivalLane="c2s_1" arrivalPos="990.00" arrivalPosLat="0.00" arrivalSpeed="13.90" duration="156.55" routeLength="1997.01" waitingTime="0.00" waitingCount="0" stopTime="0.00" timeLoss="12.87" rerouteNo="1" devices="tripinfo_car_n2s_201 routing_car_n2s_201" vType="Car" speedFactor="1.00" vaporized=""/>
    <tripinfo id="bus_s2e_186" depart="188.10" departLane="s2sep_1" departPos="12.10" departPosLat="0.00" departSpeed="13.90" departDelay="2.10" arrival="357.85" arrivalLane="c2e_1" arrivalPos="990.00" arrivalPosLat="0.00" arrivalSpeed="13.89" duration="169.75" routeLength="1978.19" waitingTime="10.30" waitingCount="1" stopTime="0.00" timeLoss="26.68" rerouteNo="1" devices="tripinfo_bus_s2e_186 routing_bus_s2e_186" vType="Bus" speedFactor="1.00" vaporized=""/>
    <tripinfo id="car_n2w_203" depart="203.00" departLane="n2sep_1" departPos="3.60" departPosLat="0.00" departSpeed="13.90" departDelay="0.00" arrival="359.45" arrivalLane="c2w_1" arrivalPos="990.00" arrivalPosLat="0.00" arrivalSpeed="13.92" duration="156.45" routeLength="1986.69" waitingTime="0.00" waitingCount="0" stopTime="0.00" timeLoss="13.04" rerouteNo="1" devices="tripinfo_car_n2w_203 routing_car_n2w_203" vType="Car" speedFactor="1.00" vaporized=""/>
    <tripinfo id="car_s2n_222" depart="222.00" departLane="s2sep_1" departPos="3.60" departPosLat="0.00" departSpeed="13.90" departDelay="0.00" arrival="360.20" arrivalLane="c2n_1" arrivalPos="990.00" arrivalPosLat="0.00" arrivalSpeed="15.12" duration="138.20" routeLength="1997.01" waitingTime="0.00" waitingCount="0" stopTime="0.00" timeLoss="6.14" rerouteNo="1" devices="tripinfo_car_s2n_222 routing_car_s2n_222" vType="Car" speedFactor="1.09" vaporized=""/>
    <tripinfo id="car_n2s_210" depart="210.00" departLane="n2sep_1" departPos="3.60" departPosLat="0.00" departSpeed="13.90" departDelay="0.00" arrival="361.30" arrivalLane="c2s_1" arrivalPos="990.00" arrivalPosLat="0.00" arrivalSpeed="14.11" duration="151.30" routeLength="1997.01" waitingTime="0.00" waitingCount="0" stopTime="0.00" timeLoss="9.97" rerouteNo="1" devices="tripinfo_car_n2s_210 routing_car_n2s_210" vType="Car" speedFactor="1.02" vaporized=""/>
    <tripinfo id="car_s2e_187" depart="189.80" departLane="s2sep_1" departPos="3.60" departPosLat="0.00" departSpeed="13.90" departDelay="2.80" arrival="361.60" arrivalLane="c2e_1" arrivalPos="990.00" arrivalPosLat="0.00" arrivalSpeed="14.28" duration="171.80" routeLength="1986.69" waitingTime="8.35" waitingCount="1" stopTime="0.00" timeLoss="32.38" rerouteNo="1" devices="tripinfo_car_s2e_187 routing_car_s2e_187" vType="Car" speedFactor="1.03" vaporized=""/>
    <tripinfo id="car_n2w_212" depart="212.00" departLane="n2sep_1" departPos="3.60" departPosLat="0.00" departSpeed="13.90" departDelay="0.00" arrival="361.80" arrivalLane="c2w_1" arrivalPos="990.00" arrivalPosLat="0.00" arrivalSpeed="14.91" duration="149.80" routeLength="1986.69" waitingTime="0.00" waitingCount="0" stopTime="0.00" timeLoss="18.22" rerouteNo="1" devices="tripinfo_car_n2w_212 routing_car_n2w_212" vType="Car" speedFactor="1.09" vaporized=""/>
    <tripinfo id="car_n2s_212" depart="213.65" departLane="n2sep_1" departPos="3.60" departPosLat="0.00" departSpeed="13.90" departDelay="1.65" arrival="364.65" arrivalLane="c2s_1" arrivalPos="990.00" arrivalPosLat="0.00" arrivalSpeed="14.38" duration="151.00" routeLength="1997.01" waitingTime="0.00" waitingCount="0" stopTime="0.00" timeLoss="12.52" rerouteNo="1" devices="tripinfo_car_n2s_212 routing_car_n2s_212" vType="Car" speedFactor="1.04" vaporized=""/>
    <tripinfo id="car_n2e_164" depart="165.40" departLane="n2sep_1" departPos="3.60" departPosLat="0.00" departSpeed="13.90" departDelay="1.40" arrival="364.85" arrivalLane="c2e_1" arrivalPos="990.00" arrivalPosLat="0.00" arrivalSpeed="14.17" duration="199.45" routeLength="1996.47" waitingTime="41.00" waitingCount="2" stopTime="0.00" timeLoss="58.36" rerouteNo="1" devices="tripinfo_car_n2e_164 routing_car_n2e_164" vType="Car" speedFactor="1.02" vaporized=""/>
    <tripinfo id="car_n2s_223" depart="223.00" departLane="n2sep_1" departPos="3.60" departPosLat="0.00" departSpeed="13.90" departDelay="0.00" arrival="366.75" arrivalLane="c2s_1" arrivalPos="990.00" arrivalPosLat="0.00" arrivalSpeed="15.17" duration="143.75" routeLength="1997.01" waitingTime="0.00" waitingCount="0" stopTime="0.00" timeLoss="15.64" rerouteNo="1" devices="tripinfo_car_n2s_223 routing_car_n2s_223" vType="Car" speedFactor="1.12" vaporized=""/>
    <tripinfo id="car_n2e_167" depart="167.20" departLane="n2sep_1" departPos="3.60" departPosLat="0.00" departSpeed="13.90" departDelay="0.20" arrival="369.85" arrivalLane="c2e_1" arrivalPos="990.00" arrivalPosLat="0.00" arrivalSpeed="13.90" duration="202.65" routeLength="1996.47" waitingTime="38.05" waitingCount="3" stopTime="0.00" timeLoss="58.33" rerouteNo="1" devices="tripinfo_car_n2e_167 routing_car_n2e_167" vType="Car" speedFactor="1.00" vaporized=""/>
    <tripinfo id="car_n2e_187" depart="187.00" departLane="n2sep_1" departPos="3.60" departPosLat="0.00" departSpeed="13.90" departDelay="0.00" arrival="373.20" arrivalLane="c2e_1" arrivalPos="990.00" arrivalPosLat="0.00" arrivalSpeed="14.09" duration="186.20" routeLength="1996.47" waitingTime="19.35" waitingCount="2" stopTime="0.00" timeLoss="44.28" rerouteNo="1" devices="tripinfo_car_n2e_187 routing_car_n2e_187" vType="Car" speedFactor="1.02" vaporized=""/>
    <tripinfo id="bus_s2w_188" depart="192.50" departLane="s2sep_1" departPos="12.10" departPosLat="0.00" departSpeed="13.90" departDelay="4.50" arrival="373.40" arrivalLane="c2w_1" arrivalPos="990.00" arrivalPosLat="0.00" arrivalSpeed="13.90" duration="180.90" routeLength="1987.97" waitingTime="20.60" waitingCount="1" stopTime="0.00" timeLoss="37.18" rerouteNo="1" devices="tripinfo_bus_s2w_188 routing_bus_s2w_188" vType="Bus" speedFactor="1.00" vaporized=""/>
    <tripinfo id="car_n2e_206" depart="206.00" departLane="n2sep_1" departPos="3.60" departPosLat="0.00" departSpeed="13.90" departDelay="0.00" arrival="375.90" arrivalLane="c2e_1" arrivalPos="990.00" arrivalPosLat="0.00" arrivalSpeed="14.37" duration="169.90" routeLength="1996.47" waitingTime="8.60" waitingCount="1" stopTime="0.00" timeLoss="31.48" rerouteNo="1" devices="tripinfo_car_n2e_206 routing_car_n2e_206" vType="Car" speedFactor="1.04" vaporized=""/>
    <tripinfo id="car_s2w_220" depart="220.00" departLane="s2sep_1" departPos="3.60" departPosLat="0.00" departSpeed="13.90" departDelay="0.00" arrival="377.85" arrivalLane="c2w_1" arrivalPos="990.00" arrivalPosLat="0.00" arrivalSpeed="14.02" duration="157.85" routeLength="1996.47" waitingTime="1.30" waitingCount="1" stopTime="0.00" timeLoss="14.93" rerouteNo="1" devices="tripinfo_car_s2w_220 routing_car_s2w_220" vType="Car" speedFactor="1.01" vaporized=""/>
    <tripinfo id="car_n2e_208" depart="208.00" departLane="n2sep_1" departPos="3.60" departPosLat="0.00" departSpeed="13.90" departDelay="0.00" arrival="379.20" arrivalLane="c2e_1" arrivalPos="990.00" arrivalPosLat="0.00" arrivalSpeed="13.96" duration="171.20" routeLength="1996.47" waitingTime="6.85" waitingCount="1" stopTime="0.00" timeLoss="27.85" rerouteNo="1" devices="tripinfo_car_n2e_208 routing_car_n2e_208" vType="Car" speedFactor="1.01" vaporized=""/>
    <tripinfo id="bus_n2e_225" depart="225.00" departLane="n2sep_1" departPos="12.10" departPosLat="0.00" departSpeed="13.90" departDelay="0.00" arrival="382.65" arrivalLane="c2e_1" arrivalPos="990.00" arrivalPosLat="0.00" arrivalSpeed="13.76" duration="157.65" routeLength="1987.97" waitingTime="0.00" waitingCount="0" stopTime="0.00" timeLoss="13.94" rerouteNo="1" devices="tripinfo_bus_n2e_225 routing_bus_n2e_225" vType="Bus" speedFactor="1.00" vaporized=""/>
    <tripinfo id="car_n2e_240" depart="240.00" departLane="n2sep_1" departPos="3.60" departPosLat="0.00" departSpeed="13.90" departDelay="0.00" arrival="386.05" arrivalLane="c2e_1" arrivalPos="990.00" arrivalPosLat="0.00" arrivalSpeed="14.31" duration="146.05" routeLength="1996.47" waitingTime="0.00" waitingCount="0" stopTime="0.00" timeLoss="6.51" rerouteNo="1" devices="tripinfo_car_n2e_240 routing_car_n2e_240" vType="Car" speedFactor="1.03" vaporized=""/>
    <tripinfo id="car_e2w_215" depart="215.00" departLane="e2sep_1" departPos="3.60" departPosLat="0.00" departSpeed="13.90" departDelay="0.00" arrival="389.45" arrivalLane="c2w_1" arrivalPos="990.00" arrivalPosLat="0.00" arrivalSpeed="15.16" duration="174.45" routeLength="1997.01" waitingTime="32.15" waitingCount="1" stopTime="0.00" timeLoss="42.73" rerouteNo="1" devices="tripinfo_car_e2w_215 routing_car_e2w_215" vType="Car" speedFactor="1.09" vaporized=""/>
    <tripinfo id="car_w2e_246" depart="246.00" departLane="w2sep_1" departPos="3.60" departPosLat="0.00" departSpeed="13.90" departDelay="0.00" arrival="391.50" arrivalLane="c2e_1" arrivalPos="990.00" arrivalPosLat="0.00" arrivalSpeed="13.90" duration="145.50" routeLength="1997.01" waitingTime="0.00" waitingCount="0" stopTime="0.00" timeLoss="1.82" rerouteNo="1" devices="tripinfo_car_w2e_246 routing_car_w2e_246" vType="Car" speedFactor="1.00" vaporized=""/>
    <tripinfo id="car_e2s_234" depart="234.45" departLane="e2sep_1" departPos="3.60" departPosLat="0.00" departSpeed="13.90" departDelay="0.45" arrival="393.60" arrivalLane="c2s_1" arrivalPos="990.00" arrivalPosLat="0.00" arrivalSpeed="13.90" duration="159.15" routeLength="1996.47" waitingTime="0.90" waitingCount="1" stopTime="0.00" timeLoss="14.83" rerouteNo="1" devices="tripinfo_car_e2s_234 routing_car_e2s_234" vType="Car" speedFactor="1.00" vaporized=""/>
    <tripinfo id="bus_e2n_194" depart="194.00" departLane="e2sep_1" departPos="12.10" departPosLat="0.00" departSpeed="13.90" departDelay="0.00" arrival="393.95" arrivalLane="c2n_1" arrivalPos="990.00" arrivalPosLat="0.00" arrivalSpeed="13.90" duration="199.95" routeLength="1978.19" waitingTime="46.60" waitingCount="1" stopTime="0.00" timeLoss="56.87" rerouteNo="1" devices="tripinfo_bus_e2n_194 routing_bus_e2n_194" vType="Bus" speedFactor="1.00" vaporized=""/>
    <tripinfo id="car_e2s_264" depart="264.00" departLane="e2sep_1" departPos="3.60" departPosLat="0.00" departSpeed="13.90" departDelay="0.00" arrival="395.50" arrivalLane="c2s_1" arrivalPos="990.00" arrivalPosLat="0.00" arrivalSpeed="15.56" duration="131.50" routeLength="1996.47" waitingTime="0.00" waitingCount="0" stopTime="0.00" timeLoss="8.87" rerouteNo="1" devices="tripinfo_car_e2s_264 routing_car_e2s_264" vType="Car" speedFactor="1.18" vaporized=""/>
    <tripinfo id="car_e2n_216" depart="216.30" departLane="e2sep_1" departPos="3.60" departPosLat="0.00" departSpeed="13.90" departDelay="0.30" arrival="397.35" arrivalLane="c2n_1" arrivalPos="990.00" arrivalPosLat="0.00" arrivalSpeed="14.62" duration="181.05" routeLength="1986.69" waitingTime="28.45" waitingCount="1" stopTime="0.00" timeLoss="45.11" rerouteNo="1" devices="tripinfo_car_e2n_216 routing_car_e2n_216" vType="Car" speedFactor="1.06" vaporized=""/>
    <tripinfo id="car_e2n_229" depart="229.00" departLane="e2sep_1" departPos="3.60" departPosLat="0.00" departSpeed="13.90" departDelay="0.00" arrival="400.10" arrivalLane="c2n_1" arrivalPos="990.00" arrivalPosLat="0.00" arrivalSpeed="14.69" duration="171.10" routeLength="1986.69" waitingTime="19.10" waitingCount="1" stopTime="0.00" timeLoss="36.22" rerouteNo="1" devices="tripinfo_car_e2n_229 routing_car_e2n_229" vType="Car" speedFactor="1.07" vaporized=""/>
    <tripinfo id="car_e2w_231" depart="231.00" departLane="e2sep_1" departPos="3.60" departPosLat="0.00" departSpeed="13.90" departDelay="0.00" arrival="402.00" arrivalLane="c2w_1" arrivalPos="990.00" arrivalPosLat="0.00" arrivalSpeed="13.90" duration="171.00" routeLength="1997.01" waitingTime="13.55" waitingCount="1" stopTime="0.00" timeLoss="27.31" rerouteNo="1" devices="tripinfo_car_e2w_231 routing_car_e2w_231" vType="Car" speedFactor="1.00" vaporized=""/>
    <tripinfo id="amb_w2e_300" depart="301.65" departLane="w2sep_1" departPos="6.60" departPosLat="0.00" departSpeed="13.90" departDelay="1.65" arrival="403.40" arrivalLane="c2e_1" arrivalPos="990.00" arrivalPosLat="-0.95" arrivalSpeed="20.85" duration="101.75" routeLength="1994.01" waitingTime="0.00" waitingCount="0" stopTime="0.00" timeLoss="6.10" rerouteNo="1" devices="tripinfo_amb_w2e_300 routing_amb_w2e_300 bluelight_amb_w2e_300 fcd_amb_w2e_300" vType="Ambulance" speedFactor="1.50" vaporized="">
        <example_device customValue1="0.00" customValue2="-1.00"/>
    </tripinfo>
    <tripinfo id="car_e2n_232" depart="232.60" departLane="e2sep_1" departPos="3.60" departPosLat="0.00" departSpeed="13.90" departDelay="0.60" arrival="405.45" arrivalLane="c2n_1" arrivalPos="990.00" arrivalPosLat="0.00" arrivalSpeed="13.90" duration="172.85" routeLength="1986.69" waitingTime="11.25" waitingCount="1" stopTime="0.00" timeLoss="29.17" rerouteNo="1" devices="tripinfo_car_e2n_232 routing_car_e2n_232" vType="Car" speedFactor="1.00" vaporized=""/>
    <tripinfo id="bus_e2w_243" depart="243.00" departLane="e2sep_1" departPos="12.10" departPosLat="0.00" departSpeed="13.90" departDelay="0.00" arrival="408.00" arrivalLane="c2w_1" arrivalPos="990.00" arrivalPosLat="0.00" arrivalSpeed="13.88" duration="165.00" routeLength="1988.51" waitingTime="5.90" waitingCount="1" stopTime="0.00" timeLoss="21.93" rerouteNo="1" devices="tripinfo_bus_e2w_243 routing_bus_e2w_243" vType="Bus" speedFactor="1.00" vaporized=""/>
    <tripinfo id="car_e2w_256" depart="256.00" departLane="e2sep_1" departPos="3.60" departPosLat="0.00" departSpeed="13.90" departDelay="0.00" arrival="410.80" arrivalLane="c2w_1" arrivalPos="990.00" arrivalPosLat="0.00" arrivalSpeed="15.00" duration="154.80" routeLength="1997.01" waitingTime="0.00" waitingCount="0" stopTime="0.00" timeLoss="23.65" rerouteNo="1" devices="tripinfo_car_e2w_256 routing_car_e2w_256" vType="Car" speedFactor="1.10" vaporized=""/>
    <tripinfo id="car_w2n_210" depart="210.00" departLane="w2sep_1" departPos="3.60" departPosLat="0.00" departSpeed="13.90" departDelay="0.00" arrival="411.05" arrivalLane="c2n_1" arrivalPos="990.00" arrivalPosLat="0.00" arrivalSpeed="14.20" duration="201.05" routeLength="1996.47" waitingTime="48.25" waitingCount="2" stopTime="0.00" timeLoss="59.83" rerouteNo="1" devices="tripinfo_car_w2n_210 routing_car_w2n_210" vType="Car" speedFactor="1.02" vaporized=""/>
    <tripinfo id="car_w2n_214" depart="214.00" departLane="w2sep_1" departPos="3.60" departPosLat="0.00" departSpeed="13.90" departDelay="0.00" arrival="414.40" arrivalLane="c2n_1" arrivalPos="990.00" arrivalPosLat="0.00" arrivalSpeed="14.46" duration="200.40" routeLength="1996.47" waitingTime="44.35" waitingCount="2" stopTime="0.00" timeLoss="62.06" rerouteNo="1" devices="tripinfo_car_w2n_214 routing_car_w2n_214" vType="Car" speedFactor="1.04" vaporized=""/>
    <tripinfo id="car_w2n_227" depart="227.00" departLane="w2sep_1" departPos="3.60" departPosLat="0.00" departSpeed="13.90" departDelay="0.00" arrival="416.75" arrivalLane="c2n_1" arrivalPos="990.00" arrivalPosLat="0.00" arrivalSpeed="15.00" duration="189.75" routeLength="1996.47" waitingTime="34.20" waitingCount="2" stopTime="0.00" timeLoss="58.18" rerouteNo="1" devices="tripinfo_car_w2n_227 routing_car_w2n_227" vType="Car" speedFactor="1.10" vaporized=""/>
    <tripinfo id="car_w2n_233" depart="233.00" departLane="w2sep_1" departPos="3.60" departPosLat="0.00" departSpeed="13.90" departDelay="0.00" arrival="421.20" arrivalLane="c2n_1" arrivalPos="990.00" arrivalPosLat="0.00" arrivalSpeed="13.89" duration="188.20" routeLength="1996.47" waitingTime="22.85" waitingCount="2" stopTime="0.00" timeLoss="43.90" rerouteNo="1" devices="tripinfo_car_w2n_233 routing_car_w2n_233" vType="Car" speedFactor="1.00" vaporized=""/>
    <tripinfo id="car_w2n_236" depart="236.00" departLane="w2sep_1" departPos="3.60" departPosLat="0.00" departSpeed="13.90" departDelay="0.00" arrival="423.55" arrivalLane="c2n_1" arrivalPos="990.00" arrivalPosLat="0.00" arrivalSpeed="14.66" duration="187.55" routeLength="1996.47" waitingTime="21.40" waitingCount="2" stopTime="0.00" timeLoss="53.01" rerouteNo="1" devices="tripinfo_car_w2n_236 routing_car_w2n_236" vType="Car" speedFactor="1.07" vaporized=""/>
    <tripinfo id="car_w2n_286" depart="286.00" departLane="w2sep_1" departPos="3.60" departPosLat="0.00" departSpeed="13.90" departDelay="0.00" arrival="427.15" arrivalLane="c2n_1" arrivalPos="990.00" arrivalPosLat="0.00" arrivalSpeed="14.71" duration="141.15" routeLength="1996.47" waitingTime="0.00" waitingCount="0" stopTime="0.00" timeLoss="5.08" rerouteNo="1" devices="tripinfo_car_w2n_286 routing_car_w2n_286" vType="Car" speedFactor="1.06" vaporized=""/>
    <tripinfo id="car_e2s_308" depart="308.00" departLane="e2sep_1" departPos="3.60" departPosLat="0.00" departSpeed="13.90" departDelay="0.00" arrival="430.55" arrivalLane="c2s_1" arrivalPos="990.00" arrivalPosLat="0.00" arrivalSpeed="17.04" duration="122.55" routeLength="1996.47" waitingTime="0.00" waitingCount="0" stopTime="0.00" timeLoss="4.81" rerouteNo="1" devices="tripinfo_car_e2s_308 routing_car_e2s_308" vType="Car" speedFactor="1.23" vaporized=""/>
    <tripinfo id="car_e2w_293" depart="293.00" departLane="e2sep_1" departPos="3.60" departPosLat="0.00" departSpeed="13.90" departDelay="0.00" arrival="432.75" arrivalLane="c2w_1" arrivalPos="990.00" arrivalPosLat="0.00" arrivalSpeed="14.35" duration="139.75" routeLength="1997.01" waitingTime="0.00" waitingCount="0" stopTime="0.00" timeLoss="0.56" rerouteNo="1" devices="tripinfo_car_e2w_293 routing_car_e2w_293" vType="Car" speedFactor="1.03" vaporized=""/>
    <tripinfo id="car_n2s_246" depart="246.00" departLane="n2sep_1" departPos="3.60" departPosLat="0.00" departSpeed="13.90" departDelay="0.00" arrival="440.75" arrivalLane="c2s_1" arrivalPos="990.00" arrivalPosLat="0.00" arrivalSpeed="16.25" duration="194.75" routeLength="1997.01" waitingTime="60.40" waitingCount="1" stopTime="0.00" timeLoss="71.84" rerouteNo="1" devices="tripinfo_car_n2s_246 routing_car_n2s_246" vType="Car" speedFactor="1.17" vaporized=""/>
    <tripinfo id="car_w2n_300" depart="300.00" departLane="w2sep_1" departPos="3.60" departPosLat="0.00" departSpeed="13.90" departDelay="0.00" arrival="446.50" arrivalLane="c2n_1" arrivalPos="990.00" arrivalPosLat="0.00" arrivalSpeed="14.02" duration="146.50" routeLength="1996.47" waitingTime="0.00" waitingCount="0" stopTime="0.00" timeLoss="3.34" rerouteNo="1" devices="tripinfo_car_w2n_300 routing_car_w2n_300" vType="Car" speedFactor="1.01" vaporized=""/>
    <tripinfo id="car_n2w_256" depart="256.00" departLane="n2sep_1" departPos="3.60" departPosLat="0.00" departSpeed="13.90" departDelay="0.00" arrival="449.00" arrivalLane="c2w_1" arrivalPos="990.00" arrivalPosLat="0.00" arrivalSpeed="15.24" duration="193.00" routeLength="1986.69" waitingTime="48.75" waitingCount="1" stopTime="0.00" timeLoss="61.94" rerouteNo="1" devices="tripinfo_car_n2w_256 routing_car_n2w_256" vType="Car" speedFactor="1.10" vaporized=""/>
    <tripinfo id="car_s2e_236" depart="236.00" departLane="s2sep_1" departPos="3.60" departPosLat="0.00" departSpeed="13.90" departDelay="0.00" arrival="449.55" arrivalLane="c2e_1" arrivalPos="990.00" arrivalPosLat="0.00" arrivalSpeed="14.09" duration="213.55" routeLength="1986.69" waitingTime="65.00" waitingCount="1" stopTime="0.00" timeLoss="71.87" rerouteNo="1" devices="tripinfo_car_s2e_236 routing_car_s2e_236" vType="Car" speedFactor="1.01" vaporized=""/>
    <tripinfo id="car_s2n_244" depart="244.00" departLane="s2sep_1" departPos="3.60" departPosLat="0.00" departSpeed="13.90" departDelay="0.00" arrival="450.00" arrivalLane="c2n_1" arrivalPos="990.00" arrivalPosLat="0.00" arrivalSpeed="14.76" duration="206.00" routeLength="1997.01" waitingTime="60.60" waitingCount="1" stopTime="0.00" timeLoss="71.04" rerouteNo="1" devices="tripinfo_car_s2n_244 routing_car_s2n_244" vType="Car" speedFactor="1.06" vaporized=""/>
    <tripinfo id="car_n2s_249" depart="249.00" departLane="n2sep_1" departPos="3.60" departPosLat="0.00" departSpeed="13.90" departDelay="0.00" arrival="452.00" arrivalLane="c2s_1" arrivalPos="990.00" arrivalPosLat="0.00" arrivalSpeed="14.13" duration="203.00" routeLength="1997.01" waitingTime="52.55" waitingCount="1" stopTime="0.00" timeLoss="61.67" rerouteNo="1" devices="tripinfo_car_n2s_249 routing_car_n2s_249" vType="Car" speedFactor="1.02" vaporized=""/>
    <tripinfo id="car_s2e_277" depart="277.00" departLane="s2sep_1" departPos="3.60" departPosLat="0.00" departSpeed="13.90" departDelay="0.00" arrival="455.20" arrivalLane="c2e_1" arrivalPos="990.00" arrivalPosLat="0.00" arrivalSpeed="14.88" duration="178.20" routeLength="1986.69" waitingTime="31.70" waitingCount="1" stopTime="0.00" timeLoss="44.06" rerouteNo="1" devices="tripinfo_car_s2e_277 routing_car_s2e_277" vType="Car" speedFactor="1.07" vaporized=""/>
    <tripinfo id="car_s2n_255" depart="255.00" departLane="s2sep_1" departPos="3.60" departPosLat="0.00" departSpeed="13.90" departDelay="0.00" arrival="455.60" arrivalLane="c2n_1" arrivalPos="990.00" arrivalPosLat="0.00" arrivalSpeed="14.02" duration="200.60" routeLength="1997.01" waitingTime="47.50" waitingCount="1" stopTime="0.00" timeLoss="58.22" rerouteNo="1" devices="tripinfo_car_s2n_255 routing_car_s2n_255" vType="Car" speedFactor="1.01" vaporized=""/>
    <tripinfo id="car_n2s_273" depart="273.00" departLane="n2sep_1" departPos="3.60" departPosLat="0.00" departSpeed="13.90" departDelay="0.00" arrival="457.65" arrivalLane="c2s_1" arrivalPos="990.00" arrivalPosLat="0.00" arrivalSpeed="13.94" duration="184.65" routeLength="1997.01" waitingTime="30.30" waitingCount="1" stopTime="0.00" timeLoss="41.40" rerouteNo="1" devices="tripinfo_car_n2s_273 routing_car_n2s_273" vType="Car" speedFactor="1.00" vaporized=""/>
    <tripinfo id="car_n2s_293" depart="293.00" departLane="n2sep_1" departPos="3.60" departPosLat="0.00" departSpeed="13.90" departDelay="0.00" arrival="459.55" arrivalLane="c2s_1" arrivalPos="990.00" arrivalPosLat="0.00" arrivalSpeed="15.31" duration="166.55" routeLength="1997.01" waitingTime="20.90" waitingCount="1" stopTime="0.00" timeLoss="41.90" rerouteNo="1" devices="tripinfo_car_n2s_293 routing_car_n2s_293" vType="Car" speedFactor="1.15" vaporized=""/>
    <tripinfo id="car_s2n_266" depart="266.00" departLane="s2sep_1" departPos="3.60" departPosLat="0.00" departSpeed="13.90" departDelay="0.00" arrival="459.60" arrivalLane="c2n_1" arrivalPos="990.00" arrivalPosLat="0.00" arrivalSpeed="13.94" duration="193.60" routeLength="1997.01" waitingTime="37.40" waitingCount="1" stopTime="0.00" timeLoss="50.53" rerouteNo="1" devices="tripinfo_car_s2n_266 routing_car_s2n_266" vType="Car" speedFactor="1.00" vaporized=""/>
    <tripinfo id="car_n2w_279" depart="279.00" departLane="n2sep_1" departPos="3.60" departPosLat="0.00" departSpeed="13.90" departDelay="0.00" arrival="459.75" arrivalLane="c2w_1" arrivalPos="990.00" arrivalPosLat="0.00" arrivalSpeed="13.90" duration="180.75" routeLength="1986.69" waitingTime="25.10" waitingCount="1" stopTime="0.00" timeLoss="37.09" rerouteNo="1" devices="tripinfo_car_n2w_279 routing_car_n2w_279" vType="Car" speedFactor="1.00" vaporized=""/>
    <tripinfo id="car_s2n_281" depart="281.00" departLane="s2sep_1" departPos="3.60" departPosLat="0.00" departSpeed="13.90" departDelay="0.00" arrival="462.45" arrivalLane="c2n_1" arrivalPos="990.00" arrivalPosLat="0.00" arrivalSpeed="14.24" duration="181.45" routeLength="1997.01" waitingTime="26.30" waitingCount="1" stopTime="0.00" timeLoss="42.15" rerouteNo="1" devices="tripinfo_car_s2n_281 routing_car_s2n_281" vType="Car" speedFactor="1.03" vaporized=""/>
    <tripinfo id="car_s2e_283" depart="283.00" departLane="s2sep_1" departPos="3.60" departPosLat="0.00" departSpeed="13.90" departDelay="0.00" arrival="462.55" arrivalLane="c2e_1" arrivalPos="990.00" arrivalPosLat="0.00" arrivalSpeed="14.22" duration="179.55" routeLength="1986.69" waitingTime="23.65" waitingCount="1" stopTime="0.00" timeLoss="39.15" rerouteNo="1" devices="tripinfo_car_s2e_283 routing_car_s2e_283" vType="Car" speedFactor="1.02" vaporized=""/>
    <tripinfo id="car_n2w_301" depart="301.00" departLane="n2sep_1" departPos="3.60" departPosLat="0.00" departSpeed="13.90" departDelay="0.00" arrival="463.40" arrivalLane="c2w_1" arrivalPos="990.00" arrivalPosLat="0.00" arrivalSpeed="14.32" duration="162.40" routeLength="1986.69" waitingTime="7.95" waitingCount="1" stopTime="0.00" timeLoss="23.23" rerouteNo="1" devices="tripinfo_car_n2w_301 routing_car_n2w_301" vType="Car" speedFactor="1.03" vaporized=""/>
    <tripinfo id="car_n2s_304" depart="304.10" departLane="n2sep_1" departPos="3.60" departPosLat="0.00" departSpeed="13.90" departDelay="0.10" arrival="464.65" arrivalLane="c2s_1" arrivalPos="990.00" arrivalPosLat="0.00" arrivalSpeed="14.22" duration="160.55" routeLength="1997.01" waitingTime="2.50" waitingCount="1" stopTime="0.00" timeLoss="20.16" rerouteNo="1" devices="tripinfo_car_n2s_304 routing_car_n2s_304" vType="Car" speedFactor="1.02" vaporized=""/>
    <tripinfo id="car_s2e_299" depart="299.45" departLane="s2sep_1" departPos="3.60" departPosLat="0.00" departSpeed="13.90" departDelay="0.45" arrival="464.80" arrivalLane="c2e_1" arrivalPos="990.00" arrivalPosLat="0.00" arrivalSpeed="15.21" duration="165.35" routeLength="1986.69" waitingTime="8.60" waitingCount="1" stopTime="0.00" timeLoss="36.89" rerouteNo="1" devices="tripinfo_car_s2e_299 routing_car_s2e_299" vType="Car" speedFactor="1.12" vaporized=""/>
    <tripinfo id="bus_n2w_315" depart="315.00" departLane="n2sep_1" departPos="12.10" departPosLat="0.00" departSpeed="13.90" departDelay="0.00" arrival="470.35" arrivalLane="c2w_1" arrivalPos="990.00" arrivalPosLat="0.00" arrivalSpeed="13.89" duration="155.35" routeLength="1978.19" waitingTime="0.00" waitingCount="0" stopTime="0.00" timeLoss="12.29" rerouteNo="1" devices="tripinfo_bus_n2w_315 routing_bus_n2w_315" vType="Bus" speedFactor="1.00" vaporized=""/>
</tripinfos>
