<?xml version="1.0" encoding="UTF-8"?>

<!-- generated on Sat Apr 24 18:13:49 2021 by Eclipse SUMO Version 1.4.0
<configuration xmlns:xsi="http://www.w3.org/2001/XMLSchema-instance" xsi:noNamespaceSchemaLocation="http://sumo.dlr.de/xsd/sumoConfiguration.xsd">

    <input>
        <net-file value="sumofiles/junction.net.xml"/>
        <route-files value="sumofiles/junction_preemption_77.rou.xml"/>
        <additional-files value="sumofiles/junction.det.xml"/>
    </input>

    <output>
        <tripinfo-output value="sumofiles/output/tripinfo_preemption_77.xml"/>
    </output>

    <time>
        <begin value="0"/>
        <end value="10000"/>
        <step-length value="0.05"/>
    </time>

    <processing>
        <lateral-resolution value="0.1"/>
    </processing>

    <report>
        <no-warnings value="true"/>
        <error-log value="sumofiles/output/errorlog_preemption_77.log"/>
        <no-step-log value="true"/>
    </report>

    <traci_server>
        <remote-port value="46199"/>
    </traci_server>

    <gui_only>
        <gui-settings-file value="sumofiles/junction-gui.settings.xml"/>
        <tracker-interval value="0.05"/>
    </gui_only>

</configuration>
-->

<tripinfos xmlns:xsi="http://www.w3.org/2001/XMLSchema-instance" xsi:noNamespaceSchemaLocation="http://sumo.dlr.de/xsd/tripinfo_file.xsd">
    <tripinfo id="car_e2w_0" depart="0.00" departLane="e2sep_1" departPos="3.60" departPosLat="0.00" departSpeed="13.90" departDelay="0.00" arrival="135.70" arrivalLane="c2w_1" arrivalPos="990.00" arrivalPosLat="0.00" arrivalSpeed="14.73" duration="135.70" routeLength="1997.01" waitingTime="0.00" waitingCount="0" stopTime="0.00" timeLoss="0.16" rerouteNo="1" devices="tripinfo_car_e2w_0 routing_car_e2w_0" vType="Car" speedFactor="1.06" vaporized=""/>
    <tripinfo id="car_e2w_3" depart="3.00" departLane="e2sep_1" departPos="3.60" departPosLat="0.00" departSpeed="13.90" departDelay="0.00" arrival="141.20" arrivalLane="c2w_1" arrivalPos="990.00" arrivalPosLat="0.00" arrivalSpeed="14.73" duration="138.20" routeLength="1997.01" waitingTime="0.00" waitingCount="0" stopTime="0.00" timeLoss="2.67" rerouteNo="1" devices="tripinfo_car_e2w_3 routing_car_e2w_3" vType="Car" speedFactor="1.06" vaporized=""/>
    <tripinfo id="car_w2n_4" depart="4.00" departLane="w2sep_1" departPos="3.60" departPosLat="0.00" departSpeed="13.90" departDelay="0.00" arrival="150.10" arrivalLane="c2n_1" arrivalPos="990.00" arrivalPosLat="0.00" arrivalSpeed="14.04" duration="146.10" routeLength="1996.47" waitingTime="0.00" waitingCount="0" stopTime="0.00" timeLoss="3.25" rerouteNo="1" devices="tripinfo_car_w2n_4 routing_car_w2n_4" vType="Car" speedFactor="1.01" vaporized=""/>
    <tripinfo id="car_w2n_11" depart="11.00" departLane="w2sep_1" departPos="3.60" departPosLat="0.00" departSpeed="13.90" departDelay="0.00" arrival="159.25" arrivalLane="c2n_1" arrivalPos="990.00" arrivalPosLat="0.00" arrivalSpeed="13.90" duration="148.25" routeLength="1996.47" waitingTime="0.00" waitingCount="0" stopTime="0.00" timeLoss="3.92" rerouteNo="1" devices="tripinfo_car_w2n_11 routing_car_w2n_11" vType="Car" speedFactor="1.00" vaporized=""/>
    <tripinfo id="car_s2e_7" depart="7.00" departLane="s2sep_1" departPos="3.60" departPosLat="0.00" departSpeed="13.90" departDelay="0.00" arrival="160.30" arrivalLane="c2e_1" arrivalPos="990.00" arrivalPosLat="0.00" arrivalSpeed="15.05" duration="153.30" routeLength="1986.69" waitingTime="13.05" waitingCount="1" stopTime="0.00" timeLoss="20.61" rerouteNo="1" devices="tripinfo_car_s2e_7 routing_car_s2e_7" vType="Car" speedFactor="1.08" vaporized=""/>
    <tripinfo id="car_w2n_18" depart="18.00" departLane="w2sep_1" departPos="3.60" departPosLat="0.00" departSpeed="13.90" departDelay="0.00" arrival="161.55" arrivalLane="c2n_1" arrivalPos="990.00" arrivalPosLat="0.00" arrivalSpeed="14.87" duration="143.55" routeLength="1996.47" waitingTime="0.00" waitingCount="0" stopTime="0.00" timeLoss="11.22" rerouteNo="1" devices="tripinfo_car_w2n_18 routing_car_w2n_18" vType="Car" speedFactor="1.09" vaporized=""/>
    <tripinfo id="car_n2w_10" depart="10.00" departLane="n2sep_1" departPos="3.60" departPosLat="0.00" departSpeed="13.90" departDelay="0.00" arrival="163.60" arrivalLane="c2w_1" arrivalPos="990.00" arrivalPosLat="0.00" arrivalSpeed="14.32" duration="153.60" routeLength="1986.69" waitingTime="6.90" waitingCount="1" stopTime="0.00" timeLoss="14.16" rerouteNo="1" devices="tripinfo_car_n2w_10 routing_car_n2w_10" vType="Car" speedFactor="1.03" vaporized=""/>
    <tripinfo id="car_s2e_17" depart="17.00" departLane="s2sep_1" departPos="3.60" departPosLat="0.00" departSpeed="13.90" departDelay="0.00" arrival="167.15" arrivalLane="c2e_1" arrivalPos="990.00" arrivalPosLat="0.00" arrivalSpeed="14.32" duration="150.15" routeLength="1986.69" waitingTime="0.80" waitingCount="1" stopTime="0.00" timeLoss="10.68" rerouteNo="1" devices="tripinfo_car_s2e_17 routing_car_s2e_17" vType="Car" speedFactor="1.03" vaporized=""/>
    <tripinfo id="car_n2w_11" depart="11.40" departLane="n2sep_1" departPos="3.60" departPosLat="0.00" departSpeed="13.90" departDelay="0.40" arrival="167.45" arrivalLane="c2w_1" arrivalPos="990.00" arrivalPosLat="0.00" arrivalSpeed="14.51" duration="156.05" routeLength="1986.69" waitingTime="4.60" waitingCount="1" stopTime="0.00" timeLoss="18.68" rerouteNo="1" devices="tripinfo_car_n2w_11 routing_car_n2w_11" vType="Car" speedFactor="1.05" vaporized=""/>
    <tripinfo id="car_s2n_27" depart="27.00" departLane="s2sep_1" departPos="3.60" departPosLat="0.00" departSpeed="13.90" departDelay="0.00" arrival="169.65" arrivalLane="c2n_1" arrivalPos="990.00" arrivalPosLat="0.00" arrivalSpeed="14.15" duration="142.65" routeLength="1997.01" waitingTime="0.00" waitingCount="0" stopTime="0.00" timeLoss="1.51" rerouteNo="1" devices="tripinfo_car_s2n_27 routing_car_s2n_27" vType="Car" speedFactor="1.02" vaporized=""/>
    <tripinfo id="car_s2w_20" depart="20.00" departLane="s2sep_1" departPos="3.60" departPosLat="0.00" departSpeed="13.90" departDelay="0.00" arrival="170.55" arrivalLane="c2w_1" arrivalPos="990.00" arrivalPosLat="0.00" arrivalSpeed="15.52" duration="150.55" routeLength="1996.47" waitingTime="7.10" waitingCount="1" stopTime="0.00" timeLoss="22.03" rerouteNo="1" devices="tripinfo_car_s2w_20 routing_car_s2w_20" vType="Car" speedFactor="1.12" vaporized=""/>
    <tripinfo id="bus_n2s_19" depart="19.00" departLane="n2sep_1" departPos="12.10" departPosLat="0.00" departSpeed="13.90" departDelay="0.00" arrival="172.50" arrivalLane="c2s_1" arrivalPos="990.00" arrivalPosLat="0.00" arrivalSpeed="13.90" duration="153.50" routeLength="1988.51" waitingTime="0.00" waitingCount="0" stopTime="0.00" timeLoss="10.41" rerouteNo="1" devices="tripinfo_bus_n2s_19 routing_bus_n2s_19" vType="Bus" speedFactor="1.00" vaporized=""/>
    <tripinfo id="car_n2e_25" depart="25.00" departLane="n2sep_1" departPos="3.60" departPosLat="0.00" departSpeed="13.90" departDelay="0.00" arrival="174.00" arrivalLane="c2e_1" arrivalPos="990.00" arrivalPosLat="0.00" arrivalSpeed="13.90" duration="149.00" routeLength="1996.47" waitingTime="0.00" waitingCount="0" stopTime="0.00" timeLoss="4.65" rerouteNo="1" devices="tripinfo_car_n2e_25 routing_car_n2e_25" vType="Car" speedFactor="1.00" vaporized=""/>
    <tripinfo id="car_n2s_27" depart="27.00" departLane="n2sep_1" departPos="3.60" departPosLat="0.00" departSpeed="13.90" departDelay="0.00" arrival="174.95" arrivalLane="c2s_1" arrivalPos="990.00" arrivalPosLat="0.00" arrivalSpeed="15.58" duration="147.95" routeLength="1997.01" waitingTime="0.00" waitingCount="0" stopTime="0.00" timeLoss="23.88" rerouteNo="1" devices="tripinfo_car_n2s_27 routing_car_n2s_27" vType="Car" speedFactor="1.16" vaporized=""/>
    <tripinfo id="car_s2e_30" depart="30.00" departLane="s2sep_1" departPos="3.60" departPosLat="0.00" departSpeed="13.90" departDelay="0.00" arrival="178.55" arrivalLane="c2e_1" arrivalPos="990.00" arrivalPosLat="0.00" arrivalSpeed="14.03" duration="148.55" routeLength="1986.69" waitingTime="0.00" waitingCount="0" stopTime="0.00" timeLoss="6.32" rerouteNo="1" devices="tripinfo_car_s2e_30 routing_car_s2e_30" vType="Car" speedFactor="1.01" vaporized=""/>
    <tripinfo id="bus_n2s_39" depart="41.10" departLane="n2sep_1" departPos="12.10" departPosLat="0.00" departSpeed="13.90" departDelay="2.10" arrival="187.10" arrivalLane="c2s_1" arrivalPos="990.00" arrivalPosLat="0.00" arrivalSpeed="13.90" duration="146.00" routeLength="1988.51" waitingTime="0.00" waitingCount="0" stopTime="0.00" timeLoss="2.92" rerouteNo="1" devices="tripinfo_bus_n2s_39 routing_bus_n2s_39" vType="Bus" speedFactor="1.00" vaporized=""/>
    <tripinfo id="car_s2e_42" depart="42.00" departLane="s2sep_1" departPos="3.60" departPosLat="0.00" departSpeed="13.90" departDelay="0.00" arrival="189.50" arrivalLane="c2e_1" arrivalPos="990.00" arrivalPosLat="0.00" arrivalSpeed="13.90" duration="147.50" routeLength="1986.69" waitingTime="0.00" waitingCount="0" stopTime="0.00" timeLoss="3.81" rerouteNo="1" devices="tripinfo_car_s2e_42 routing_car_s2e_42" vType="Car" speedFactor="1.00" vaporized=""/>
    <tripinfo id="car_n2s_44" depart="46.45" departLane="n2sep_1" departPos="3.60" departPosLat="0.00" departSpeed="13.90" departDelay="2.45" arrival="189.50" arrivalLane="c2s_1" arrivalPos="990.00" arrivalPosLat="0.00" arrivalSpeed="15.77" duration="143.05" routeLength="1997.01" waitingTime="0.00" waitingCount="0" stopTime="0.00" timeLoss="21.13" rerouteNo="1" devices="tripinfo_car_n2s_44 routing_car_n2s_44" vType="Car" speedFactor="1.18" vaporized=""/>
    <tripinfo id="car_n2e_39" depart="39.00" departLane="n2sep_1" departPos="3.60" departPosLat="0.00" departSpeed="13.90" departDelay="0.00" arrival="194.15" arrivalLane="c2e_1" arrivalPos="990.00" arrivalPosLat="0.00" arrivalSpeed="13.89" duration="155.15" routeLength="1996.47" waitingTime="2.45" waitingCount="1" stopTime="0.00" timeLoss="10.82" rerouteNo="1" devices="tripinfo_car_n2e_39 routing_car_n2e_39" vType="Car" speedFactor="1.00" vaporized=""/>
    <tripinfo id="car_n2w_40" depart="42.80" departLane="n2sep_1" departPos="3.60" departPosLat="0.00" departSpeed="13.90" departDelay="2.80" arrival="194.40" arrivalLane="c2w_1" arrivalPos="990.00" arrivalPosLat="0.00" arrivalSpeed="13.90" duration="151.60" routeLength="1986.69" waitingTime="0.00" waitingCount="0" stopTime="0.00" timeLoss="7.91" rerouteNo="1" devices="tripinfo_car_n2w_40 routing_car_n2w_40" vType="Car" speedFactor="1.00" vaporized=""/>
    <tripinfo id="car_n2e_40" depart="44.70" departLane="n2sep_1" departPos="3.60" departPosLat="0.00" departSpeed="13.90" departDelay="4.70" arrival="196.10" arrivalLane="c2e_1" arrivalPos="990.00" arrivalPosLat="0.00" arrivalSpeed="15.12" duration="151.40" routeLength="1996.47" waitingTime="0.00" waitingCount="0" stopTime="0.00" timeLoss="23.91" rerouteNo="1" devices="tripinfo_car_n2e_40 routing_car_n2e_40" vType="Car" speedFactor="1.13" vaporized=""/>
    <tripinfo id="car_e2n_12" depart="12.00" departLane="e2sep_1" departPos="3.60" departPosLat="0.00" departSpeed="13.90" departDelay="0.00" arrival="209.90" arrivalLane="c2n_1" arrivalPos="990.00" arrivalPosLat="0.00" arrivalSpeed="14.04" duration="197.90" routeLength="1986.69" waitingTime="48.80" waitingCount="1" stopTime="0.00" timeLoss="55.72" rerouteNo="1" devices="tripinfo_car_e2n_12 routing_car_e2n_12" vType="Car" speedFactor="1.01" vaporized=""/>
    <tripinfo id="car_w2e_22" depart="22.00" departLane="w2sep_1" departPos="3.60" departPosLat="0.00" departSpeed="13.90" departDelay="0.00" arrival="210.80" arrivalLane="c2e_1" arrivalPos="990.00" arrivalPosLat="0.00" arrivalSpeed="13.90" duration="188.80" routeLength="1997.01" waitingTime="37.60" waitingCount="1" stopTime="0.00" timeLoss="45.10" rerouteNo="1" devices="tripinfo_car_w2e_22 routing_car_w2e_22" vType="Car" speedFactor="1.00" vaporized=""/>
    <tripinfo id="car_e2n_15" depart="15.00" departLane="e2sep_1" departPos="3.60" departPosLat="0.00" departSpeed="13.90" departDelay="0.00" arrival="212.45" arrivalLane="c2n_1" arrivalPos="990.00" arrivalPosLat="0.00" arrivalSpeed="14.87" duration="197.45" routeLength="1986.69" waitingTime="47.45" waitingCount="1" stopTime="0.00" timeLoss="64.76" rerouteNo="1" devices="tripinfo_car_e2n_15 routing_car_e2n_15" vType="Car" speedFactor="1.08" vaporized=""/>
    <tripinfo id="car_w2s_37" depart="37.00" departLane="w2sep_1" departPos="3.60" departPosLat="0.00" departSpeed="13.90" departDelay="0.00" arrival="214.15" arrivalLane="c2s_1" arrivalPos="990.00" arrivalPosLat="0.00" arrivalSpeed="14.55" duration="177.15" routeLength="1986.69" waitingTime="28.80" waitingCount="1" stopTime="0.00" timeLoss="39.94" rerouteNo="1" devices="tripinfo_car_w2s_37 routing_car_w2s_37" vType="Car" speedFactor="1.05" vaporized=""/>
    <tripinfo id="car_w2e_26" depart="26.00" departLane="w2sep_1" departPos="3.60" departPosLat="0.00" departSpeed="13.90" departDelay="0.00" arrival="215.15" arrivalLane="c2e_1" arrivalPos="990.00" arrivalPosLat="0.00" arrivalSpeed="13.89" duration="189.15" routeLength="1997.01" waitingTime="33.90" waitingCount="1" stopTime="0.00" timeLoss="45.46" rerouteNo="1" devices="tripinfo_car_w2e_26 routing_car_w2e_26" vType="Car" speedFactor="1.00" vaporized=""/>
    <tripinfo id="car_e2n_20" depart="20.00" departLane="e2sep_1" departPos="3.60" departPosLat="0.00" departSpeed="13.90" departDelay="0.00" arrival="215.75" arrivalLane="c2n_1" arrivalPos="990.00" arrivalPosLat="0.00" arrivalSpeed="14.51" duration="195.75" routeLength="1986.69" waitingTime="41.35" waitingCount="1" stopTime="0.00" timeLoss="58.51" rerouteNo="1" devices="tripinfo_car_e2n_20 routing_car_e2n_20" vType="Car" speedFactor="1.05" vaporized=""/>
    <tripinfo id="car_w2s_38" depart="38.40" departLane="w2sep_1" departPos="3.60" departPosLat="0.00" departSpeed="13.90" departDelay="0.40" arrival="216.65" arrivalLane="c2s_1" arrivalPos="990.00" arrivalPosLat="0.00" arrivalSpeed="15.40" duration="178.25" routeLength="1986.69" waitingTime="27.90" waitingCount="1" stopTime="0.00" timeLoss="50.29" rerouteNo="1" devices="tripinfo_car_w2s_38 routing_car_w2s_38" vType="Car" speedFactor="1.12" vaporized=""/>
    <tripinfo id="car_w2e_32" depart="32.00" departLane="w2sep_1" departPos="3.60" departPosLat="0.00" departSpeed="13.90" departDelay="0.00" arrival="217.30" arrivalLane="c2e_1" arrivalPos="990.00" arrivalPosLat="0.00" arrivalSpeed="14.80" duration="185.30" routeLength="1997.01" waitingTime="32.90" waitingCount="1" stopTime="0.00" timeLoss="53.58" rerouteNo="1" devices="tripinfo_car_w2e_32 routing_car_w2e_32" vType="Car" speedFactor="1.09" vaporized=""/>
    <tripinfo id="car_e2w_26" depart="26.00" departLane="e2sep_1" departPos="3.60" departPosLat="0.00" departSpeed="13.90" departDelay="0.00" arrival="217.50" arrivalLane="c2w_1" arrivalPos="990.00" arrivalPosLat="0.00" arrivalSpeed="13.90" duration="191.50" routeLength="1997.01" waitingTime="35.55" waitingCount="1" stopTime="0.00" timeLoss="47.79" rerouteNo="1" devices="tripinfo_car_e2w_26 routing_car_e2w_26" vType="Car" speedFactor="1.00" vaporized=""/>
    <tripinfo id="car_e2n_69" depart="69.00" departLane="e2sep_1" departPos="3.60" departPosLat="0.00" departSpeed="13.90" departDelay="0.00" arrival="217.65" arrivalLane="c2n_1" arrivalPos="990.00" arrivalPosLat="0.00" arrivalSpeed="15.65" duration="148.65" routeLength="1986.69" waitingTime="0.00" waitingCount="0" stopTime="0.00" timeLoss="26.84" rerouteNo="1" devices="tripinfo_car_e2n_69 routing_car_e2n_69" vType="Car" speedFactor="1.18" vaporized=""/>
    <tripinfo id="car_e2w_58" depart="58.00" departLane="e2sep_1" departPos="3.60" departPosLat="0.00" departSpeed="13.90" departDelay="0.00" arrival="219.40" arrivalLane="c2w_1" arrivalPos="990.00" arrivalPosLat="0.00" arrivalSpeed="15.33" duration="161.40" routeLength="1997.01" waitingTime="15.15" waitingCount="1" stopTime="0.00" timeLoss="36.94" rerouteNo="1" devices="tripinfo_car_e2w_58 routing_car_e2w_58" vType="Car" speedFactor="1.15" vaporized=""/>
    <tripinfo id="car_e2n_77" depart="77.00" departLane="e2sep_1" departPos="3.60" departPosLat="0.00" departSpeed="13.90" departDelay="0.00" arrival="222.75" arrivalLane="c2n_1" arrivalPos="990.00" arrivalPosLat="0.00" arrivalSpeed="14.42" duration="145.75" routeLength="1986.69" waitingTime="0.00" waitingCount="0" stopTime="0.00" timeLoss="7.28" rerouteNo="1" devices="tripinfo_car_e2n_77 routing_car_e2n_77" vType="Car" speedFactor="1.04" vaporized=""/>
    <tripinfo id="car_w2s_65" depart="65.00" departLane="w2sep_1" departPos="3.60" departPosLat="0.00" departSpeed="13.90" departDelay="0.00" arrival="223.25" arrivalLane="c2s_1" arrivalPos="990.00" arrivalPosLat="0.00" arrivalSpeed="13.90" duration="158.25" routeLength="1986.69" waitingTime="0.30" waitingCount="1" stopTime="0.00" timeLoss="14.56" rerouteNo="1" devices="tripinfo_car_w2s_65 routing_car_w2s_65" vType="Car" speedFactor="1.00" vaporized=""/>
    <tripinfo id="car_e2s_18" depart="18.00" departLane="e2sep_1" departPos="3.60" departPosLat="0.00" departSpeed="13.90" departDelay="0.00" arrival="226.50" arrivalLane="c2s_1" arrivalPos="990.00" arrivalPosLat="0.00" arrivalSpeed="14.22" duration="208.50" routeLength="1996.47" waitingTime="52.30" waitingCount="2" stopTime="0.00" timeLoss="67.89" rerouteNo="1" devices="tripinfo_car_e2s_18 routing_car_e2s_18" vType="Car" speedFactor="1.03" vaporized=""/>
    <tripinfo id="car_e2s_22" depart="22.00" departLane="e2sep_1" departPos="3.60" departPosLat="0.00" departSpeed="13.90" departDelay="0.00" arrival="229.25" arrivalLane="c2s_1" arrivalPos="990.00" arrivalPosLat="0.00" arrivalSpeed="14.42" duration="207.25" routeLength="1996.47" waitingTime="46.45" waitingCount="2" stopTime="0.00" timeLoss="69.26" rerouteNo="1" devices="tripinfo_car_e2s_22 routing_car_e2s_22" vType="Car" speedFactor="1.05" vaporized=""/>
    <tripinfo id="car_e2n_84" depart="84.00" departLane="e2sep_1" departPos="3.60" departPosLat="0.00" departSpeed="13.90" departDelay="0.00" arrival="230.65" arrivalLane="c2n_1" arrivalPos="990.00" arrivalPosLat="0.00" arrivalSpeed="14.04" duration="146.65" routeLength="1986.69" waitingTime="0.00" waitingCount="0" stopTime="0.00" timeLoss="4.42" rerouteNo="1" devices="tripinfo_car_e2n_84 routing_car_e2n_84" vType="Car" speedFactor="1.01" vaporized=""/>
    <tripinfo id="car_e2s_32" depart="32.00" departLane="e2sep_1" departPos="3.60" departPosLat="0.00" departSpeed="13.90" departDelay="0.00" arrival="232.30" arrivalLane="c2s_1" arrivalPos="990.00" arrivalPosLat="0.00" arrivalSpeed="14.20" duration="200.30" routeLength="1996.47" waitingTime="37.40" waitingCount="2" stopTime="0.00" timeLoss="59.67" rerouteNo="1" devices="tripinfo_car_e2s_32 routing_car_e2s_32" vType="Car" speedFactor="1.03" vaporized=""/>
    <tripinfo id="car_e2n_98" depart="98.00" departLane="e2sep_1" departPos="3.60" departPosLat="0.00" departSpeed="13.90" departDelay="0.00" arrival="232.55" arrivalLane="c2n_1" arrivalPos="990.00" arrivalPosLat="0.00" arrivalSpeed="15.49" duration="134.55" routeLength="1986.69" waitingTime="0.00" waitingCount="0" stopTime="0.00" timeLoss="11.64" rerouteNo="1" devices="tripinfo_car_e2n_98 routing_car_e2n_98" vType="Car" speedFactor="1.17" vaporized=""/>
    <tripinfo id="bus_e2s_41" depart="41.00" departLane="e2sep_1" departPos="12.10" departPosLat="0.00" departSpeed="13.90" departDelay="0.00" arrival="236.75" arrivalLane="c2s_1" arrivalPos="990.00" arrivalPosLat="0.00" arrivalSpeed="13.84" duration="195.75" routeLength="1987.97" waitingTime="30.50" waitingCount="2" stopTime="0.00" timeLoss="52.02" rerouteNo="1" devices="tripinfo_bus_e2s_41 routing_bus_e2s_41" vType="Bus" speedFactor="1.00" vaporized=""/>
    <tripinfo id="car_w2n_73" depart="73.00" departLane="w2sep_1" departPos="3.60" departPosLat="0.00" departSpeed="13.90" departDelay="0.00" arrival="237.80" arrivalLane="c2n_1" arrivalPos="990.00" arrivalPosLat="0.00" arrivalSpeed="14.32" duration="164.80" routeLength="1996.47" waitingTime="16.40" waitingCount="1" stopTime="0.00" timeLoss="24.71" rerouteNo="1" devices="tripinfo_car_w2n_73 routing_car_w2n_73" vType="Car" speedFactor="1.03" vaporized=""/>
    <tripinfo id="car_w2n_101" depart="101.00" departLane="w2sep_1" departPos="3.60" departPosLat="0.00" departSpeed="13.90" departDelay="0.00" arrival="240.30" arrivalLane="c2n_1" arrivalPos="990.00" arrivalPosLat="0.00" arrivalSpeed="15.04" duration="139.30" routeLength="1996.47" waitingTime="0.00" waitingCount="0" stopTime="0.00" timeLoss="7.61" rerouteNo="1" devices="tripinfo_car_w2n_101 routing_car_w2n_101" vType="Car" speedFactor="1.10" vaporized=""/>
    <tripinfo id="car_e2s_66" depart="66.00" departLane="e2sep_1" departPos="3.60" departPosLat="0.00" departSpeed="13.90" departDelay="0.00" arrival="240.45" arrivalLane="c2s_1" arrivalPos="990.00" arrivalPosLat="0.00" arrivalSpeed="14.13" duration="174.45" routeLength="1996.47" waitingTime="6.30" waitingCount="1" stopTime="0.00" timeLoss="32.92" rerouteNo="1" devices="tripinfo_car_e2s_66 routing_car_e2s_66" vType="Car" speedFactor="1.02" vaporized=""/>
    <tripinfo id="car_e2s_75" depart="75.00" departLane="e2sep_1" departPos="3.60" departPosLat="0.00" departSpeed="13.90" departDelay="0.00" arrival="242.60" arrivalLane="c2s_1" arrivalPos="990.00" arrivalPosLat="0.00" arrivalSpeed="14.82" duration="167.60" routeLength="1996.47" waitingTime="6.05" waitingCount="1" stopTime="0.00" timeLoss="35.44" rerouteNo="1" devices="tripinfo_car_e2s_75 routing_car_e2s_75" vType="Car" speedFactor="1.09" vaporized=""/>
    <tripinfo id="car_n2w_64" depart="64.00" departLane="n2sep_1" departPos="3.60" departPosLat="0.00" departSpeed="13.90" departDelay="0.00" arrival="247.75" arrivalLane="c2w_1" arrivalPos="990.00" arrivalPosLat="0.00" arrivalSpeed="16.29" duration="183.75" routeLength="1986.69" waitingTime="43.35" waitingCount="1" stopTime="0.00" timeLoss="61.16" rerouteNo="1" devices="tripinfo_car_n2w_64 routing_car_n2w_64" vType="Car" speedFactor="1.17" vaporized=""/>
    <tripinfo id="car_s2n_69" depart="69.00" departLane="s2sep_1" departPos="3.60" departPosLat="0.00" departSpeed="13.90" departDelay="0.00" arrival="249.45" arrivalLane="c2n_1" arrivalPos="990.00" arrivalPosLat="0.00" arrivalSpeed="15.32" duration="180.45" routeLength="1997.01" waitingTime="42.30" waitingCount="1" stopTime="0.00" timeLoss="50.11" rerouteNo="1" devices="tripinfo_car_s2n_69 routing_car_s2n_69" vType="Car" speedFactor="1.10" vaporized=""/>
    <tripinfo id="car_s2e_83" depart="83.00" departLane="s2sep_1" departPos="3.60" departPosLat="0.00" departSpeed="13.90" departDelay="0.00" arrival="255.00" arrivalLane="c2e_1" arrivalPos="990.00" arrivalPosLat="0.00" arrivalSpeed="14.50" duration="172.00" routeLength="1986.69" waitingTime="25.60" waitingCount="1" stopTime="0.00" timeLoss="34.34" rerouteNo="1" devices="tripinfo_car_s2e_83 routing_car_s2e_83" vType="Car" speedFactor="1.04" vaporized=""/>
    <tripinfo id="car_n2s_61" depart="61.00" departLane="n2sep_1" departPos="3.60" departPosLat="0.00" departSpeed="13.90" departDelay="0.00" arrival="255.45" arrivalLane="c2s_1" arrivalPos="990.00" arrivalPosLat="0.00" arrivalSpeed="13.97" duration="194.45" routeLength="1997.01" waitingTime="44.30" waitingCount="1" stopTime="0.00" timeLoss="51.51" rerouteNo="1" devices="tripinfo_car_n2s_61 routing_car_n2s_61" vType="Car" speedFactor="1.01" vaporized=""/>
    <tripinfo id="car_n2s_70" depart="70.55" departLane="n2sep_1" departPos="3.60" departPosLat="0.00" departSpeed="13.90" departDelay="0.55" arrival="257.65" arrivalLane="c2s_1" arrivalPos="990.00" arrivalPosLat="0.00" arrivalSpeed="15.67" duration="187.10" routeLength="1997.01" waitingTime="36.50" waitingCount="1" stopTime="0.00" timeLoss="63.06" rerouteNo="1" devices="tripinfo_car_n2s_70 routing_car_n2s_70" vType="Car" speedFactor="1.16" vaporized=""/>
    <tripinfo id="car_s2e_89" depart="89.00" departLane="s2sep_1" departPos="3.60" departPosLat="0.00" departSpeed="13.90" departDelay="0.00" arrival="261.55" arrivalLane="c2e_1" arrivalPos="990.00" arrivalPosLat="0.00" arrivalSpeed="13.90" duration="172.55" routeLength="1986.69" waitingTime="17.80" waitingCount="1" stopTime="0.00" timeLoss="28.90" rerouteNo="1" devices="tripinfo_car_s2e_89 routing_car_s2e_89" vType="Car" speedFactor="1.00" vaporized=""/>
    <tripinfo id="car_s2n_96" depart="96.50" departLane="s2sep_1" departPos="3.60" departPosLat="0.00" departSpeed="13.90" departDelay="0.50" arrival="262.40" arrivalLane="c2n_1" arrivalPos="990.00" arrivalPosLat="0.00" arrivalSpeed="13.90" duration="165.90" routeLength="1997.01" waitingTime="8.90" waitingCount="1" stopTime="0.00" timeLoss="22.22" rerouteNo="1" devices="tripinfo_car_s2n_96 routing_car_s2n_96" vType="Car" speedFactor="1.00" vaporized=""/>
    <tripinfo id="bus_n2w_65" depart="65.80" departLane="n2sep_1" departPos="12.10" departPosLat="0.00" departSpeed="13.90" departDelay="0.80" arrival="263.55" arrivalLane="c2w_1" arrivalPos="990.00" arrivalPosLat="0.00" arrivalSpeed="13.90" duration="197.75" routeLength="1978.19" waitingTime="41.00" waitingCount="1" stopTime="0.00" timeLoss="54.72" rerouteNo="1" devices="tripinfo_bus_n2w_65 routing_bus_n2w_65" vType="Bus" speedFactor="1.00" vaporized=""/>
    <tripinfo id="car_n2s_75" depart="75.00" departLane="n2sep_1" departPos="3.60" departPosLat="0.00" departSpeed="13.90" departDelay="0.00" arrival="266.15" arrivalLane="c2s_1" arrivalPos="990.00" arrivalPosLat="0.00" arrivalSpeed="14.15" duration="191.15" routeLength="1997.01" waitingTime="34.50" waitingCount="1" stopTime="0.00" timeLoss="49.99" rerouteNo="1" devices="tripinfo_car_n2s_75 routing_car_n2s_75" vType="Car" speedFactor="1.02" vaporized=""/>
    <tripinfo id="car_n2w_125" depart="125.00" departLane="n2sep_1" departPos="3.60" departPosLat="0.00" departSpeed="13.90" departDelay="0.00" arrival="266.25" arrivalLane="c2w_1" arrivalPos="990.00" arrivalPosLat="0.00" arrivalSpeed="15.42" duration="141.25" routeLength="1986.69" waitingTime="0.00" waitingCount="0" stopTime="0.00" timeLoss="14.32" rerouteNo="1" devices="tripinfo_car_n2w_125 routing_car_n2w_125" vType="Car" speedFactor="1.13" vaporized=""/>
    <tripinfo id="car_n2e_69" depart="69.00" departLane="n2sep_1" departPos="3.60" departPosLat="0.00" departSpeed="13.90" departDelay="0.00" arrival="266.40" arrivalLane="c2e_1" arrivalPos="990.00" arrivalPosLat="0.00" arrivalSpeed="13.89" duration="197.40" routeLength="1996.47" waitingTime="38.65" waitingCount="2" stopTime="0.00" timeLoss="53.09" rerouteNo="1" devices="tripinfo_car_n2e_69 routing_car_n2e_69" vType="Car" speedFactor="1.00" vaporized=""/>
    <tripinfo id="car_n2e_84" depart="84.00" departLane="n2sep_1" departPos="3.60" departPosLat="0.00" departSpeed="13.90" departDelay="0.00" arrival="268.65" arrivalLane="c2e_1" arrivalPos="990.00" arrivalPosLat="0.00" arrivalSpeed="14.81" duration="184.65" routeLength="1996.47" waitingTime="30.50" waitingCount="2" stopTime="0.00" timeLoss="52.00" rerouteNo="1" devices="tripinfo_car_n2e_84 routing_car_n2e_84" vType="Car" speedFactor="1.09" vaporized=""/>
    <tripinfo id="car_n2s_99" depart="100.55" departLane="n2sep_1" departPos="3.60" departPosLat="0.00" departSpeed="13.90" departDelay="1.55" arrival="270.25" arrivalLane="c2s_1" arrivalPos="990.00" arrivalPosLat="0.00" arrivalSpeed="14.12" duration="169.70" routeLength="1997.01" waitingTime="7.95" waitingCount="1" stopTime="0.00" timeLoss="28.40" rerouteNo="1" devices="tripinfo_car_n2s_99 routing_car_n2s_99" vType="Car" speedFactor="1.02" vaporized=""/>
    <tripinfo id="car_n2e_96" depart="96.00" departLane="n2sep_1" departPos="3.60" departPosLat="0.00" departSpeed="13.90" departDelay="0.00" arrival="272.55" arrivalLane="c2e_1" arrivalPos="990.00" arrivalPosLat="0.00" arrivalSpeed="13.88" duration="176.55" routeLength="1996.47" waitingTime="12.70" waitingCount="2" stopTime="0.00" timeLoss="32.21" rerouteNo="1" devices="tripinfo_car_n2e_96 routing_car_n2e_96" vType="Car" speedFactor="1.00" vaporized=""/>
    <tripinfo id="car_s2w_95" depart="95.00" departLane="s2sep_1" departPos="3.60" departPosLat="0.00" departSpeed="13.90" departDelay="0.00" arrival="274.75" arrivalLane="c2w_1" arrivalPos="990.00" arrivalPosLat="0.00" arrivalSpeed="13.90" duration="179.75" routeLength="1996.47" waitingTime="23.60" waitingCount="2" stopTime="0.00" timeLoss="35.40" rerouteNo="1" devices="tripinfo_car_s2w_95 routing_car_s2w_95" vType="Car" speedFactor="1.00" vaporized=""/>
    <tripinfo id="bus_n2e_99" depart="99.00" departLane="n2sep_1" departPos="12.10" departPosLat="0.00" departSpeed="13.90" departDelay="0.00" arrival="276.80" arrivalLane="c2e_1" arrivalPos="990.00" arrivalPosLat="0.00" arrivalSpeed="13.83" duration="177.80" routeLength="1987.97" waitingTime="11.25" waitingCount="2" stopTime="0.00" timeLoss="34.06" rerouteNo="1" devices="tripinfo_bus_n2e_99 routing_bus_n2e_99" vType="Bus" speedFactor="1.00" vaporized=""/>
    <tripinfo id="car_s2w_121" depart="121.00" departLane="s2sep_1" departPos="3.60" departPosLat="0.00" departSpeed="13.90" departDelay="0.00" arrival="278.15" arrivalLane="c2w_1" arrivalPos="990.00" arrivalPosLat="0.00" arrivalSpeed="14.19" duration="157.15" routeLength="1996.47" waitingTime="4.80" waitingCount="1" stopTime="0.00" timeLoss="16.14" rerouteNo="1" devices="tripinfo_car_s2w_121 routing_car_s2w_121" vType="Car" speedFactor="1.02" vaporized=""/>
    <tripinfo id="car_n2e_117" depart="117.00" departLane="n2sep_1" departPos="3.60" departPosLat="0.00" departSpeed="13.90" departDelay="0.00" arrival="279.25" arrivalLane="c2e_1" arrivalPos="990.00" arrivalPosLat="0.00" arrivalSpeed="15.37" duration="162.25" routeLength="1996.47" waitingTime="2.65" waitingCount="2" stopTime="0.00" timeLoss="35.90" rerouteNo="1" devices="tripinfo_car_n2e_117 routing_car_n2e_117" vType="Car" speedFactor="1.14" vaporized=""/>
    <tripinfo id="car_n2e_126" depart="126.25" departLane="n2sep_1" departPos="3.60" departPosLat="0.00" departSpeed="13.90" departDelay="0.25" arrival="281.55" arrivalLane="c2e_1" arrivalPos="990.00" arrivalPosLat="0.00" arrivalSpeed="14.81" duration="155.30" routeLength="1996.47" waitingTime="0.00" waitingCount="0" stopTime="0.00" timeLoss="21.99" rerouteNo="1" devices="tripinfo_car_n2e_126 routing_car_n2e_126" vType="Car" speedFactor="1.08" vaporized=""/>
    <tripinfo id="car_s2e_140" depart="140.00" departLane="s2sep_1" departPos="3.60" departPosLat="0.00" departSpeed="13.90" departDelay="0.00" arrival="286.10" arrivalLane="c2e_1" arrivalPos="990.00" arrivalPosLat="0.00" arrivalSpeed="14.11" duration="146.10" routeLength="1986.69" waitingTime="0.00" waitingCount="0" stopTime="0.00" timeLoss="4.67" rerouteNo="1" devices="tripinfo_car_s2e_140 routing_car_s2e_140" vType="Car" speedFactor="1.02" vaporized=""/>
    <tripinfo id="car_n2e_141" depart="141.00" departLane="n2sep_1" departPos="3.60" departPosLat="0.00" departSpeed="13.90" departDelay="0.00" arrival="290.65" arrivalLane="c2e_1" arrivalPos="990.00" arrivalPosLat="0.00" arrivalSpeed="13.89" duration="149.65" routeLength="1996.47" waitingTime="0.00" waitingCount="0" stopTime="0.00" timeLoss="5.32" rerouteNo="1" devices="tripinfo_car_n2e_141 routing_car_n2e_141" vType="Car" speedFactor="1.00" vaporized=""/>
    <tripinfo id="car_w2s_101" depart="102.30" departLane="w2sep_1" departPos="3.60" departPosLat="0.00" departSpeed="13.90" departDelay="1.30" arrival="300.40" arrivalLane="c2s_1" arrivalPos="990.00" arrivalPosLat="0.00" arrivalSpeed="13.94" duration="198.10" routeLength="1986.69" waitingTime="46.95" waitingCount="1" stopTime="0.00" timeLoss="54.89" rerouteNo="1" devices="tripinfo_car_w2s_101 routing_car_w2s_101" vType="Car" speedFactor="1.00" vaporized=""/>
    <tripinfo id="car_e2w_110" depart="110.00" departLane="e2sep_1" departPos="3.60" departPosLat="0.00" departSpeed="13.90" departDelay="0.00" arrival="300.75" arrivalLane="c2w_1" arrivalPos="990.00" arrivalPosLat="0.00" arrivalSpeed="13.90" duration="190.75" routeLength="1997.01" waitingTime="40.05" waitingCount="1" stopTime="0.00" timeLoss="47.04" rerouteNo="1" devices="tripinfo_car_e2w_110 routing_car_e2w_110" vType="Car" speedFactor="1.00" vaporized=""/>
    <tripinfo id="car_w2e_153" depart="153.00" departLane="w2sep_1" departPos="3.60" departPosLat="0.00" departSpeed="13.90" departDelay="0.00" arrival="304.80" arrivalLane="c2e_1" arrivalPos="990.00" arrivalPosLat="0.00" arrivalSpeed="14.46" duration="151.80" routeLength="1997.01" waitingTime="2.75" waitingCount="1" stopTime="0.00" timeLoss="13.64" rerouteNo="1" devices="tripinfo_car_w2e_153 routing_car_w2e_153" vType="Car" speedFactor="1.04" vaporized=""/>
    <tripinfo id="car_w2s_106" depart="106.00" departLane="w2sep_1" departPos="3.60" departPosLat="0.00" departSpeed="13.90" departDelay="0.00" arrival="305.10" arrivalLane="c2s_1" arrivalPos="990.00" arrivalPosLat="0.00" arrivalSpeed="13.89" duration="199.10" routeLength="1986.69" waitingTime="43.50" waitingCount="1" stopTime="0.00" timeLoss="55.41" rerouteNo="1" devices="tripinfo_car_w2s_106 routing_car_w2s_106" vType="Car" speedFactor="1.00" vaporized=""/>
    <tripinfo id="bus_e2n_149" depart="149.00" departLane="e2sep_1" departPos="12.10" departPosLat="0.00" departSpeed="13.90" departDelay="0.00" arrival="306.30" arrivalLane="c2n_1" arrivalPos="990.00" arrivalPosLat="0.00" arrivalSpeed="13.90" duration="157.30" routeLength="1978.19" waitingTime="3.05" waitingCount="1" stopTime="0.00" timeLoss="14.24" rerouteNo="1" devices="tripinfo_bus_e2n_149 routing_bus_e2n_149" vType="Bus" speedFactor="1.00" vaporized=""/>
    <tripinfo id="car_w2s_143" depart="143.00" departLane="w2sep_1" departPos="3.60" departPosLat="0.00" departSpeed="13.90" departDelay="0.00" arrival="306.90" arrivalLane="c2s_1" arrivalPos="990.00" arrivalPosLat="0.00" arrivalSpeed="15.42" duration="163.90" routeLength="1986.69" waitingTime="19.00" waitingCount="1" stopTime="0.00" timeLoss="41.99" rerouteNo="1" devices="tripinfo_car_w2s_143 routing_car_w2s_143" vType="Car" speedFactor="1.18" vaporized=""/>
    <tripinfo id="car_w2e_161" depart="161.00" departLane="w2sep_1" departPos="3.60" departPosLat="0.00" departSpeed="13.90" departDelay="0.00" arrival="308.50" arrivalLane="c2e_1" arrivalPos="990.00" arrivalPosLat="0.00" arrivalSpeed="14.64" duration="147.50" routeLength="1997.01" waitingTime="0.00" waitingCount="0" stopTime="0.00" timeLoss="11.40" rerouteNo="1" devices="tripinfo_car_w2e_161 routing_car_w2e_161" vType="Car" speedFactor="1.06" vaporized=""/>
    <tripinfo id="car_w2s_167" depart="167.00" departLane="w2sep_1" departPos="3.60" departPosLat="0.00" departSpeed="13.90" departDelay="0.00" arrival="308.75" arrivalLane="c2s_1" arrivalPos="990.00" arrivalPosLat="0.00" arrivalSpeed="15.59" duration="141.75" routeLength="1986.69" waitingTime="0.00" waitingCount="0" stopTime="0.00" timeLoss="19.94" rerouteNo="1" devices="tripinfo_car_w2s_167 routing_car_w2s_167" vType="Car" speedFactor="1.18" vaporized=""/>
    <tripinfo id="car_e2n_150" depart="150.45" departLane="e2sep_1" departPos="3.60" departPosLat="0.00" departSpeed="13.90" departDelay="0.45" arrival="311.00" arrivalLane="c2n_1" arrivalPos="990.00" arrivalPosLat="0.00" arrivalSpeed="13.96" duration="160.55" routeLength="1986.69" waitingTime="0.00" waitingCount="0" stopTime="0.00" timeLoss="17.61" rerouteNo="1" devices="tripinfo_car_e2n_150 routing_car_e2n_150" vType="Car" speedFactor="1.01" vaporized=""/>
    <tripinfo id="car_w2e_172" depart="172.00" departLane="w2sep_1" departPos="3.60" departPosLat="0.00" departSpeed="13.90" departDelay="0.00" arrival="313.15" arrivalLane="c2e_1" arrivalPos="990.00" arrivalPosLat="0.00" arrivalSpeed="15.10" duration="141.15" routeLength="1997.01" waitingTime="0.00" waitingCount="0" stopTime="0.00" timeLoss="8.97" rerouteNo="1" devices="tripinfo_car_w2e_172 routing_car_w2e_172" vType="Car" speedFactor="1.09" vaporized=""/>
    <tripinfo id="car_e2n_164" depart="164.00" departLane="e2sep_1" departPos="3.60" departPosLat="0.00" departSpeed="13.90" departDelay="0.00" arrival="314.70" arrivalLane="c2n_1" arrivalPos="990.00" arrivalPosLat="0.00" arrivalSpeed="13.88" duration="150.70" routeLength="1986.69" waitingTime="0.00" waitingCount="0" stopTime="0.00" timeLoss="7.04" rerouteNo="1" devices="tripinfo_car_e2n_164 routing_car_e2n_164" vType="Car" speedFactor="1.00" vaporized=""/>
    <tripinfo id="car_w2s_169" depart="169.00" departLane="w2sep_1" departPos="3.60" departPosLat="0.00" departSpeed="13.90" departDelay="0.00" arrival="316.35" arrivalLane="c2s_1" arrivalPos="990.00" arrivalPosLat="0.00" arrivalSpeed="14.00" duration="147.35" routeLength="1986.69" waitingTime="0.00" waitingCount="0" stopTime="0.00" timeLoss="4.69" rerouteNo="1" devices="tripinfo_car_w2s_169 routing_car_w2s_169" vType="Car" speedFactor="1.01" vaporized=""/>
    <tripinfo id="car_e2s_126" depart="126.00" departLane="e2sep_1" departPos="3.60" departPosLat="0.00" departSpeed="13.90" departDelay="0.00" arrival="318.50" arrivalLane="c2s_1" arrivalPos="990.00" arrivalPosLat="0.00" arrivalSpeed="15.15" duration="192.50" routeLength="1996.47" waitingTime="46.90" waitingCount="2" stopTime="0.00" timeLoss="63.53" rerouteNo="1" devices="tripinfo_car_e2s_126 routing_car_e2s_126" vType="Car" speedFactor="1.12" vaporized=""/>
    <tripinfo id="bus_e2n_166" depart="166.10" departLane="e2sep_1" departPos="12.10" departPosLat="0.00" departSpeed="13.90" departDelay="0.10" arrival="319.00" arrivalLane="c2n_1" arrivalPos="990.00" arrivalPosLat="0.00" arrivalSpeed="13.83" duration="152.90" routeLength="1978.19" waitingTime="0.00" waitingCount="0" stopTime="0.00" timeLoss="9.80" rerouteNo="1" devices="tripinfo_bus_e2n_166 routing_bus_e2n_166" vType="Bus" speedFactor="1.00" vaporized=""/>
    <tripinfo id="car_e2s_152" depart="152.25" departLane="e2sep_1" departPos="3.60" departPosLat="0.00" departSpeed="13.90" departDelay="0.25" arrival="320.40" arrivalLane="c2s_1" arrivalPos="990.00" arrivalPosLat="0.00" arrivalSpeed="15.62" duration="168.15" routeLength="1996.47" waitingTime="15.05" waitingCount="1" stopTime="0.00" timeLoss="45.00" rerouteNo="1" devices="tripinfo_car_e2s_152 routing_car_e2s_152" vType="Car" speedFactor="1.17" vaporized=""/>
    <tripinfo id="car_e2n_167" depart="167.80" departLane="e2sep_1" departPos="3.60" departPosLat="0.00" departSpeed="13.90" departDelay="0.80" arrival="322.40" arrivalLane="c2n_1" arrivalPos="990.00" arrivalPosLat="0.00" arrivalSpeed="14.29" duration="154.60" routeLength="1986.69" waitingTime="0.00" waitingCount="0" stopTime="0.00" timeLoss="15.45" rerouteNo="1" devices="tripinfo_car_e2n_167 routing_car_e2n_167" vType="Car" speedFactor="1.03" vaporized=""/>
    <tripinfo id="car_e2w_178" depart="178.00" departLane="e2sep_1" departPos="3.60" departPosLat="0.00" departSpeed="13.90" departDelay="0.00" arrival="322.95" arrivalLane="c2w_1" arrivalPos="990.00" arrivalPosLat="0.00" arrivalSpeed="13.90" duration="144.95" routeLength="1997.01" waitingTime="0.00" waitingCount="0" stopTime="0.00" timeLoss="1.25" rerouteNo="1" devices="tripinfo_car_e2w_178 routing_car_e2w_178" vType="Car" speedFactor="1.00" vaporized=""/>
    <tripinfo id="car_e2s_154" depart="154.00" departLane="e2sep_1" departPos="3.60" departPosLat="0.00" departSpeed="13.90" departDelay="0.00" arrival="325.45" arrivalLane="c2s_1" arrivalPos="990.00" arrivalPosLat="0.00" arrivalSpeed="14.22" duration="171.45" routeLength="1996.47" waitingTime="12.75" waitingCount="1" stopTime="0.00" timeLoss="30.36" rerouteNo="1" devices="tripinfo_car_e2s_154 routing_car_e2s_154" vType="Car" speedFactor="1.02" vaporized=""/>
    <tripinfo id="car_e2w_183" depart="183.00" departLane="e2sep_1" departPos="3.60" departPosLat="0.00" departSpeed="13.90" departDelay="0.00" arrival="326.55" arrivalLane="c2w_1" arrivalPos="990.00" arrivalPosLat="0.00" arrivalSpeed="14.29" duration="143.55" routeLength="1997.01" waitingTime="0.00" waitingCount="0" stopTime="0.00" timeLoss="4.09" rerouteNo="1" devices="tripinfo_car_e2w_183 routing_car_e2w_183" vType="Car" speedFactor="1.03" vaporized=""/>
    <tripinfo id="car_e2s_167" depart="169.65" departLane="e2sep_1" departPos="3.60" departPosLat="0.00" departSpeed="13.90" departDelay="2.65" arrival="327.75" arrivalLane="c2s_1" arrivalPos="990.00" arrivalPosLat="0.00" arrivalSpeed="15.04" duration="158.10" routeLength="1996.47" waitingTime="1.35" waitingCount="1" stopTime="0.00" timeLoss="27.17" rerouteNo="1" devices="tripinfo_car_e2s_167 routing_car_e2s_167" vType="Car" speedFactor="1.10" vaporized=""/>
    <tripinfo id="car_w2n_182" depart="182.00" departLane="w2sep_1" departPos="3.60" departPosLat="0.00" departSpeed="13.90" departDelay="0.00" arrival="328.30" arrivalLane="c2n_1" arrivalPos="990.00" arrivalPosLat="0.00" arrivalSpeed="14.13" duration="146.30" routeLength="1996.47" waitingTime="0.00" waitingCount="0" stopTime="0.00" timeLoss="4.36" rerouteNo="1" devices="tripinfo_car_w2n_182 routing_car_w2n_182" vType="Car" speedFactor="1.02" vaporized=""/>
    <tripinfo id="car_e2s_184" depart="184.45" departLane="e2sep_1" departPos="3.60" departPosLat="0.00" departSpeed="13.90" departDelay="0.45" arrival="329.80" arrivalLane="c2s_1" arrivalPos="990.00" arrivalPosLat="0.00" arrivalSpeed="15.46" duration="145.35" routeLength="1996.47" waitingTime="0.00" waitingCount="0" stopTime="0.00" timeLoss="19.61" rerouteNo="1" devices="tripinfo_car_e2s_184 routing_car_e2s_184" vType="Car" speedFactor="1.15" vaporized=""/>
    <tripinfo id="car_w2n_187" depart="187.00" departLane="w2sep_1" departPos="3.60" departPosLat="0.00" departSpeed="13.90" departDelay="0.00" arrival="335.50" arrivalLane="c2n_1" arrivalPos="990.00" arrivalPosLat="0.00" arrivalSpeed="13.92" duration="148.50" routeLength="1996.47" waitingTime="0.00" waitingCount="0" stopTime="0.00" timeLoss="4.41" rerouteNo="1" devices="tripinfo_car_w2n_187 routing_car_w2n_187" vType="Car" speedFactor="1.00" vaporized=""/>
    <tripinfo id="car_n2w_150" depart="150.00" departLane="n2sep_1" departPos="3.60" departPosLat="0.00" departSpeed="13.90" departDelay="0.00" arrival="336.55" arrivalLane="c2w_1" arrivalPos="990.00" arrivalPosLat="0.00" arrivalSpeed="16.05" duration="186.55" routeLength="1986.69" waitingTime="52.35" waitingCount="1" stopTime="0.00" timeLoss="62.07" rerouteNo="1" devices="tripinfo_car_n2w_150 routing_car_n2w_150" vType="Car" speedFactor="1.15" vaporized=""/>
    <tripinfo id="bus_e2s_188" depart="188.00" departLane="e2sep_1" departPos="12.10" departPosLat="0.00" departSpeed="13.90" departDelay="0.00" arrival="338.95" arrivalLane="c2s_1" arrivalPos="990.00" arrivalPosLat="0.00" arrivalSpeed="13.90" duration="150.95" routeLength="1987.97" waitingTime="0.00" waitingCount="0" stopTime="0.00" timeLoss="7.24" rerouteNo="1" devices="tripinfo_bus_e2s_188 routing_bus_e2s_188" vType="Bus" speedFactor="1.00" vaporized=""/>
    <tripinfo id="car_s2n_157" depart="157.45" departLane="s2sep_1" departPos="3.60" departPosLat="0.00" departSpeed="13.90" departDelay="0.45" arrival="344.60" arrivalLane="c2n_1" arrivalPos="990.00" arrivalPosLat="0.00" arrivalSpeed="14.17" duration="187.15" routeLength="1997.01" waitingTime="35.65" waitingCount="1" stopTime="0.00" timeLoss="46.24" rerouteNo="1" devices="tripinfo_car_s2n_157 routing_car_s2n_157" vType="Car" speedFactor="1.02" vaporized=""/>
    <tripinfo id="car_n2s_153" depart="153.00" departLane="n2sep_1" departPos="3.60" departPosLat="0.00" departSpeed="13.90" departDelay="0.00" arrival="346.65" arrivalLane="c2s_1" arrivalPos="990.00" arrivalPosLat="0.00" arrivalSpeed="14.21" duration="193.65" routeLength="1997.01" waitingTime="44.10" waitingCount="1" stopTime="0.00" timeLoss="53.09" rerouteNo="1" devices="tripinfo_car_n2s_153 routing_car_n2s_153" vType="Car" speedFactor="1.02" vaporized=""/>
    <tripinfo id="car_s2n_172" depart="172.00" departLane="s2sep_1" departPos="3.60" departPosLat="0.00" departSpeed="13.90" departDelay="0.00" arrival="348.30" arrivalLane="c2n_1" arrivalPos="990.00" arrivalPosLat="0.00" arrivalSpeed="14.35" duration="176.30" routeLength="1997.01" waitingTime="26.00" waitingCount="1" stopTime="0.00" timeLoss="37.41" rerouteNo="1" devices="tripinfo_car_s2n_172 routing_car_s2n_172" vType="Car" speedFactor="1.03" vaporized=""/>
    <tripinfo id="car_s2e_185" depart="185.00" departLane="s2sep_1" departPos="3.60" departPosLat="0.00" departSpeed="13.90" departDelay="0.00" arrival="350.15" arrivalLane="c2e_1" arrivalPos="990.00" arrivalPosLat="0.00" arrivalSpeed="13.90" duration="165.15" routeLength="1986.69" waitingTime="11.95" waitingCount="1" stopTime="0.00" timeLoss="21.49" rerouteNo="1" devices="tripinfo_car_s2e_185 routing_car_s2e_185" vType="Car" speedFactor="1.00" vaporized=""/>
    <tripinfo id="car_s2n_205" depart="205.00" departLane="s2sep_1" departPos="3.60" departPosLat="0.00" departSpeed="13.90" departDelay="0.00" arrival="352.50" arrivalLane="c2n_1" arrivalPos="990.00" arrivalPosLat="0.00" arrivalSpeed="14.12" duration="147.50" routeLength="1997.01" waitingTime="0.00" waitingCount="0" stopTime="0.00" timeLoss="6.16" rerouteNo="1" devices="tripinfo_car_s2n_205 routing_car_s2n_205" vType="Car" speedFactor="1.02" vaporized=""/>
    <tripinfo id="bus_n2s_156" depart="156.00" departLane="n2sep_1" departPos="12.10" departPosLat="0.00" departSpeed="13.90" departDelay="0.00" arrival="353.20" arrivalLane="c2s_1" arrivalPos="990.00" arrivalPosLat="0.00" arrivalSpeed="13.89" duration="197.20" routeLength="1988.51" waitingTime="41.25" waitingCount="1" stopTime="0.00" timeLoss="54.12" rerouteNo="1" devices="tripinfo_bus_n2s_156 routing_bus_n2s_156" vType="Bus" speedFactor="1.00" vaporized=""/>
    <tripinfo id="bus_n2w_193" depart="193.00" departLane="n2sep_1" departPos="12.10" departPosLat="0.00" departSpeed="13.90" departDelay="0.00" arrival="357.55" arrivalLane="c2w_1" arrivalPos="990.00" arrivalPosLat="0.00" arrivalSpeed="13.90" duration="164.55" routeLength="1978.19" waitingTime="7.55" waitingCount="1" stopTime="0.00" timeLoss="21.49" rerouteNo="1" devices="tripinfo_bus_n2w_193 routing_bus_n2w_193" vType="Bus" speedFactor="1.00" vaporized=""/>
    <tripinfo id="car_n2s_202" depart="202.00" departLane="n2sep_1" departPos="3.60" departPosLat="0.00" departSpeed="13.90" departDelay="0.00" arrival="358.45" arrivalLane="c2s_1" arrivalPos="990.00" arrivalPosLat="0.00" arrivalSpeed="14.20" duration="156.45" routeLength="1997.01" waitingTime="0.50" waitingCount="1" stopTime="0.00" timeLoss="15.84" rerouteNo="1" devices="tripinfo_car_n2s_202 routing_car_n2s_202" vType="Car" speedFactor="1.02" vaporized=""/>
    <tripinfo id="car_s2e_218" depart="218.00" departLane="s2sep_1" departPos="3.60" departPosLat="0.00" departSpeed="13.90" departDelay="0.00" arrival="359.80" arrivalLane="c2e_1" arrivalPos="990.00" arrivalPosLat="0.00" arrivalSpeed="14.50" duration="141.80" routeLength="1986.69" waitingTime="0.00" waitingCount="0" stopTime="0.00" timeLoss="4.10" rerouteNo="1" devices="tripinfo_car_s2e_218 routing_car_s2e_218" vType="Car" speedFactor="1.04" vaporized=""/>
    <tripinfo id="car_n2e_219" depart="219.00" departLane="n2sep_1" departPos="3.60" departPosLat="0.00" departSpeed="13.90" departDelay="0.00" arrival="362.80" arrivalLane="c2e_1" arrivalPos="990.00" arrivalPosLat="0.00" arrivalSpeed="15.07" duration="143.80" routeLength="1996.47" waitingTime="1.35" waitingCount="1" stopTime="0.00" timeLoss="11.50" rerouteNo="1" devices="tripinfo_car_n2e_219 routing_car_n2e_219" vType="Car" speedFactor="1.09" vaporized=""/>
    <tripinfo id="car_s2w_156" depart="156.00" departLane="s2sep_1" departPos="3.60" departPosLat="0.00" departSpeed="13.90" departDelay="0.00" arrival="363.15" arrivalLane="c2w_1" arrivalPos="990.00" arrivalPosLat="0.00" arrivalSpeed="13.90" duration="207.15" routeLength="1996.47" waitingTime="51.00" waitingCount="2" stopTime="0.00" timeLoss="62.84" rerouteNo="1" devices="tripinfo_car_s2w_156 routing_car_s2w_156" vType="Car" speedFactor="1.00" vaporized=""/>
    <tripinfo id="car_s2n_235" depart="235.00" departLane="s2sep_1" departPos="3.60" departPosLat="0.00" departSpeed="13.90" departDelay="0.00" arrival="366.75" arrivalLane="c2n_1" arrivalPos="990.00" arrivalPosLat="0.00" arrivalSpeed="15.25" duration="131.75" routeLength="1997.01" waitingTime="0.00" waitingCount="0" stopTime="0.00" timeLoss="0.78" rerouteNo="1" devices="tripinfo_car_s2n_235 routing_car_s2n_235" vType="Car" speedFactor="1.10" vaporized=""/>
    <tripinfo id="car_n2w_221" depart="221.00" departLane="n2sep_1" departPos="3.60" departPosLat="0.00" departSpeed="13.90" departDelay="0.00" arrival="368.60" arrivalLane="c2w_1" arrivalPos="990.00" arrivalPosLat="0.00" arrivalSpeed="14.03" duration="147.60" routeLength="1986.69" waitingTime="0.00" waitingCount="0" stopTime="0.00" timeLoss="5.37" rerouteNo="1" devices="tripinfo_car_n2w_221 routing_car_n2w_221" vType="Car" speedFactor="1.01" vaporized=""/>
    <tripinfo id="car_n2s_236" depart="236.00" departLane="n2sep_1" departPos="3.60" departPosLat="0.00" departSpeed="13.90" departDelay="0.00" arrival="371.55" arrivalLane="c2s_1" arrivalPos="990.00" arrivalPosLat="0.00" arrivalSpeed="14.80" duration="135.55" routeLength="1997.01" waitingTime="0.00" waitingCount="0" stopTime="0.00" timeLoss="0.62" rerouteNo="1" devices="tripinfo_car_n2s_236 routing_car_n2s_236" vType="Car" speedFactor="1.07" vaporized=""/>
    <tripinfo id="car_s2w_191" depart="191.00" departLane="s2sep_1" departPos="3.60" departPosLat="0.00" departSpeed="13.90" departDelay="0.00" arrival="371.75" arrivalLane="c2w_1" arrivalPos="990.00" arrivalPosLat="0.00" arrivalSpeed="14.43" duration="180.75" routeLength="1996.47" waitingTime="22.15" waitingCount="3" stopTime="0.00" timeLoss="42.35" rerouteNo="1" devices="tripinfo_car_s2w_191 routing_car_s2w_191" vType="Car" speedFactor="1.04" vaporized=""/>
    <tripinfo id="car_s2w_230" depart="230.00" departLane="s2sep_1" departPos="3.60" departPosLat="0.00" departSpeed="13.90" departDelay="0.00" arrival="374.15" arrivalLane="c2w_1" arrivalPos="990.00" arrivalPosLat="0.00" arrivalSpeed="15.33" duration="144.15" routeLength="1996.47" waitingTime="2.40" waitingCount="1" stopTime="0.00" timeLoss="15.47" rerouteNo="1" devices="tripinfo_car_s2w_230 routing_car_s2w_230" vType="Car" speedFactor="1.12" vaporized=""/>
    <tripinfo id="car_e2n_207" depart="207.00" departLane="e2sep_1" departPos="3.60" departPosLat="0.00" departSpeed="13.90" departDelay="0.00" arrival="384.80" arrivalLane="c2n_1" arrivalPos="990.00" arrivalPosLat="0.00" arrivalSpeed="15.18" duration="177.80" routeLength="1986.69" waitingTime="38.60" waitingCount="1" stopTime="0.00" timeLoss="46.24" rerouteNo="1" devices="tripinfo_car_e2n_207 routing_car_e2n_207" vType="Car" speedFactor="1.09" vaporized=""/>
    <tripinfo id="car_e2w_229" depart="229.00" departLane="e2sep_1" departPos="3.60" departPosLat="0.00" departSpeed="13.90" departDelay="0.00" arrival="387.25" arrivalLane="c2w_1" arrivalPos="990.00" arrivalPosLat="0.00" arrivalSpeed="15.12" duration="158.25" routeLength="1997.01" waitingTime="17.20" waitingCount="1" stopTime="0.00" timeLoss="26.18" rerouteNo="1" devices="tripinfo_car_e2w_229 routing_car_e2w_229" vType="Car" speedFactor="1.09" vaporized=""/>
    <tripinfo id="car_w2s_193" depart="193.00" departLane="w2sep_1" departPos="3.60" departPosLat="0.00" departSpeed="13.90" departDelay="0.00" arrival="390.20" arrivalLane="c2s_1" arrivalPos="990.00" arrivalPosLat="0.00" arrivalSpeed="14.00" duration="197.20" routeLength="1986.69" waitingTime="47.05" waitingCount="1" stopTime="0.00" timeLoss="54.51" rerouteNo="1" devices="tripinfo_car_w2s_193 routing_car_w2s_193" vType="Car" speedFactor="1.01" vaporized=""/>
    <tripinfo id="car_w2e_253" depart="253.00" departLane="w2sep_1" departPos="3.60" departPosLat="0.00" departSpeed="13.90" departDelay="0.00" arrival="391.25" arrivalLane="c2e_1" arrivalPos="990.00" arrivalPosLat="0.00" arrivalSpeed="15.27" duration="138.25" routeLength="1997.01" waitingTime="0.00" waitingCount="0" stopTime="0.00" timeLoss="7.43" rerouteNo="1" devices="tripinfo_car_w2e_253 routing_car_w2e_253" vType="Car" speedFactor="1.10" vaporized=""/>
    <tripinfo id="car_w2s_212" depart="212.00" departLane="w2sep_1" departPos="3.60" departPosLat="0.00" departSpeed="13.90" departDelay="0.00" arrival="393.55" arrivalLane="c2s_1" arrivalPos="990.00" arrivalPosLat="0.00" arrivalSpeed="14.38" duration="181.55" routeLength="1986.69" waitingTime="31.30" waitingCount="1" stopTime="0.00" timeLoss="43.13" rerouteNo="1" devices="tripinfo_car_w2s_212 routing_car_w2s_212" vType="Car" speedFactor="1.04" vaporized=""/>
    <tripinfo id="car_e2w_240" depart="240.00" departLane="e2sep_1" departPos="3.60" departPosLat="0.00" departSpeed="13.90" departDelay="0.00" arrival="395.65" arrivalLane="c2w_1" arrivalPos="990.00" arrivalPosLat="0.00" arrivalSpeed="13.90" duration="155.65" routeLength="1997.01" waitingTime="2.00" waitingCount="1" stopTime="0.00" timeLoss="11.98" rerouteNo="1" devices="tripinfo_car_e2w_240 routing_car_e2w_240" vType="Car" speedFactor="1.00" vaporized=""/>
    <tripinfo id="car_w2s_221" depart="221.00" departLane="w2sep_1" departPos="3.60" departPosLat="0.00" departSpeed="13.90" departDelay="0.00" arrival="396.40" arrivalLane="c2s_1" arrivalPos="990.00" arrivalPosLat="0.00" arrivalSpeed="14.59" duration="175.40" routeLength="1986.69" waitingTime="24.45" waitingCount="1" stopTime="0.00" timeLoss="39.44" rerouteNo="1" devices="tripinfo_car_w2s_221 routing_car_w2s_221" vType="Car" speedFactor="1.06" vaporized=""/>
    <tripinfo id="car_e2w_248" depart="248.00" departLane="e2sep_1" departPos="3.60" departPosLat="0.00" departSpeed="13.90" departDelay="0.00" arrival="399.30" arrivalLane="c2w_1" arrivalPos="990.00" arrivalPosLat="0.00" arrivalSpeed="14.07" duration="151.30" routeLength="1997.01" waitingTime="0.00" waitingCount="0" stopTime="0.00" timeLoss="9.59" rerouteNo="1" devices="tripinfo_car_e2w_248 routing_car_e2w_248" vType="Car" speedFactor="1.01" vaporized=""/>
    <tripinfo id="car_w2n_237" depart="237.00" departLane="w2sep_1" departPos="3.60" departPosLat="0.00" departSpeed="13.90" departDelay="0.00" arrival="399.55" arrivalLane="c2n_1" arrivalPos="990.00" arrivalPosLat="0.00" arrivalSpeed="13.90" duration="162.55" routeLength="1996.47" waitingTime="7.20" waitingCount="2" stopTime="0.00" timeLoss="18.20" rerouteNo="1" devices="tripinfo_car_w2n_237 routing_car_w2n_237" vType="Car" speedFactor="1.00" vaporized=""/>
    <tripinfo id="car_w2s_260" depart="260.00" departLane="w2sep_1" departPos="3.60" departPosLat="0.00" departSpeed="13.90" departDelay="0.00" arrival="401.00" arrivalLane="c2s_1" arrivalPos="990.00" arrivalPosLat="0.00" arrivalSpeed="15.23" duration="141.00" routeLength="1986.69" waitingTime="0.00" waitingCount="0" stopTime="0.00" timeLoss="9.97" rerouteNo="1" devices="tripinfo_car_w2s_260 routing_car_w2s_260" vType="Car" speedFactor="1.10" vaporized=""/>
    <tripinfo id="car_e2w_258" depart="258.00" departLane="e2sep_1" departPos="3.60" departPosLat="0.00" departSpeed="13.90" departDelay="0.00" arrival="403.55" arrivalLane="c2w_1" arrivalPos="990.00" arrivalPosLat="0.00" arrivalSpeed="14.01" duration="145.55" routeLength="1997.01" waitingTime="0.00" waitingCount="0" stopTime="0.00" timeLoss="3.14" rerouteNo="1" devices="tripinfo_car_e2w_258 routing_car_e2w_258" vType="Car" speedFactor="1.01" vaporized=""/>
    <tripinfo id="car_e2w_261" depart="261.55" departLane="e2sep_1" departPos="3.60" departPosLat="0.00" departSpeed="13.90" departDelay="0.55" arrival="405.35" arrivalLane="c2w_1" arrivalPos="990.00" arrivalPosLat="0.00" arrivalSpeed="15.45" duration="143.80" routeLength="1997.01" waitingTime="0.00" waitingCount="0" stopTime="0.00" timeLoss="21.75" rerouteNo="1" devices="tripinfo_car_e2w_261 routing_car_e2w_261" vType="Car" speedFactor="1.18" vaporized=""/>
    <tripinfo id="car_e2n_273" depart="273.00" departLane="e2sep_1" departPos="3.60" departPosLat="0.00" departSpeed="13.90" departDelay="0.00" arrival="408.05" arrivalLane="c2n_1" arrivalPos="990.00" arrivalPosLat="0.00" arrivalSpeed="15.33" duration="135.05" routeLength="1986.69" waitingTime="0.00" waitingCount="0" stopTime="0.00" timeLoss="4.82" rerouteNo="1" devices="tripinfo_car_e2n_273 routing_car_e2n_273" vType="Car" speedFactor="1.10" vaporized=""/>
    <tripinfo id="bus_e2s_214" depart="214.00" departLane="e2sep_1" departPos="12.10" departPosLat="0.00" departSpeed="13.90" departDelay="0.00" arrival="413.25" arrivalLane="c2s_1" arrivalPos="990.00" arrivalPosLat="0.00" arrivalSpeed="13.90" duration="199.25" routeLength="1987.97" waitingTime="40.30" waitingCount="2" stopTime="0.00" timeLoss="55.51" rerouteNo="1" devices="tripinfo_bus_e2s_214 routing_bus_e2s_214" vType="Bus" speedFactor="1.00" vaporized=""/>
    <tripinfo id="car_e2s_248" depart="249.45" departLane="e2sep_1" departPos="3.60" departPosLat="0.00" departSpeed="13.90" departDelay="1.45" arrival="417.00" arrivalLane="c2s_1" arrivalPos="990.00" arrivalPosLat="0.00" arrivalSpeed="14.34" duration="167.55" routeLength="1996.47" waitingTime="9.95" waitingCount="1" stopTime="0.00" timeLoss="28.02" rerouteNo="1" devices="tripinfo_car_e2s_248 routing_car_e2s_248" vType="Car" speedFactor="1.03" vaporized=""/>
    <tripinfo id="car_w2e_281" depart="281.00" departLane="w2sep_1" departPos="3.60" departPosLat="0.00" departSpeed="13.90" departDelay="0.00" arrival="420.60" arrivalLane="c2e_1" arrivalPos="990.00" arrivalPosLat="1.10" arrivalSpeed="14.34" duration="139.60" routeLength="1997.01" waitingTime="0.00" waitingCount="0" stopTime="0.00" timeLoss="0.30" rerouteNo="1" devices="tripinfo_car_w2e_281 routing_car_w2e_281" vType="Car@car_w2e_281" speedFactor="1.03" vaporized=""/>
    <tripinfo id="car_e2s_249" depart="251.20" departLane="e2sep_1" departPos="3.60" departPosLat="0.00" departSpeed="13.90" departDelay="2.20" arrival="420.85" arrivalLane="c2s_1" arrivalPos="990.00" arrivalPosLat="0.00" arrivalSpeed="13.88" duration="169.65" routeLength="1996.47" waitingTime="7.30" waitingCount="1" stopTime="0.00" timeLoss="25.32" rerouteNo="1" devices="tripinfo_car_e2s_249 routing_car_e2s_249" vType="Car" speedFactor="1.00" vaporized=""/>
    <tripinfo id="bus_w2n_257" depart="257.00" departLane="w2sep_1" departPos="12.10" departPosLat="0.00" departSpeed="13.90" departDelay="0.00" arrival="421.10" arrivalLane="c2n_1" arrivalPos="990.00" arrivalPosLat="0.00" arrivalSpeed="13.90" duration="164.10" routeLength="1987.97" waitingTime="10.15" waitingCount="1" stopTime="0.00" timeLoss="20.39" rerouteNo="1" devices="tripinfo_bus_w2n_257 routing_bus_w2n_257" vType="Bus" speedFactor="1.00" vaporized=""/>
    <tripinfo id="amb_w2e_300" depart="300.00" departLane="w2sep_1" departPos="6.60" departPosLat="0.00" departSpeed="13.90" departDelay="0.00" arrival="422.05" arrivalLane="c2e_1" arrivalPos="990.00" arrivalPosLat="0.95" arrivalSpeed="16.97" duration="122.05" routeLength="1994.01" waitingTime="0.00" waitingCount="0" stopTime="0.00" timeLoss="26.41" rerouteNo="1" devices="tripinfo_amb_w2e_300 routing_amb_w2e_300 bluelight_amb_w2e_300 fcd_amb_w2e_300" vType="Ambulance" speedFactor="1.50" vaporized="">
        <example_device customValue1="0.00" customValue2="-1.00"/>
    </tripinfo>
    <tripinfo id="car_e2s_260" depart="260.00" departLane="e2sep_1" departPos="3.60" departPosLat="0.00" departSpeed="13.90" departDelay="0.00" arrival="422.95" arrivalLane="c2s_1" arrivalPos="990.00" arrivalPosLat="0.00" arrivalSpeed="14.81" duration="162.95" routeLength="1996.47" waitingTime="2.65" waitingCount="1" stopTime="0.00" timeLoss="31.23" rerouteNo="1" devices="tripinfo_car_e2s_260 routing_car_e2s_260" vType="Car" speedFactor="1.10" vaporized=""/>
    <tripinfo id="car_w2n_266" depart="266.00" departLane="w2sep_1" departPos="3.60" departPosLat="0.00" departSpeed="13.90" departDelay="0.00" arrival="425.90" arrivalLane="c2n_1" arrivalPos="990.00" arrivalPosLat="0.00" arrivalSpeed="13.89" duration="159.90" routeLength="1996.47" waitingTime="2.10" waitingCount="1" stopTime="0.00" timeLoss="15.59" rerouteNo="1" devices="tripinfo_car_w2n_266 routing_car_w2n_266" vType="Car" speedFactor="1.00" vaporized=""/>
    <tripinfo id="car_w2e_282" depart="284.15" departLane="w2sep_1" departPos="3.60" departPosLat="0.00" departSpeed="13.90" departDelay="2.15" arrival="428.25" arrivalLane="c2e_1" arrivalPos="990.00" arrivalPosLat="-1.10" arrivalSpeed="14.75" duration="144.10" routeLength="1997.01" waitingTime="0.00" waitingCount="0" stopTime="0.00" timeLoss="8.66" rerouteNo="1" devices="tripinfo_car_w2e_282 routing_car_w2e_282" vType="Car@car_w2e_282" speedFactor="1.06" vaporized=""/>
    <tripinfo id="car_w2s_281" depart="282.40" departLane="w2sep_1" departPos="3.60" departPosLat="0.00" departSpeed="13.90" departDelay="1.40" arrival="429.40" arrivalLane="c2s_1" arrivalPos="990.00" arrivalPosLat="0.00" arrivalSpeed="14.22" duration="147.00" routeLength="1986.69" waitingTime="0.00" waitingCount="0" stopTime="0.00" timeLoss="6.62" rerouteNo="1" devices="tripinfo_car_w2s_281 routing_car_w2s_281" vType="Car" speedFactor="1.02" vaporized=""/>
    <tripinfo id="car_w2s_282" depart="285.95" departLane="w2sep_1" departPos="3.60" departPosLat="0.00" departSpeed="13.90" departDelay="3.95" arrival="431.45" arrivalLane="c2s_1" arrivalPos="990.00" arrivalPosLat="0.00" arrivalSpeed="15.49" duration="145.50" routeLength="1986.69" waitingTime="0.00" waitingCount="0" stopTime="0.00" timeLoss="20.87" rerouteNo="1" devices="tripinfo_car_w2s_282 routing_car_w2s_282" vType="Car" speedFactor="1.15" vaporized=""/>
    <tripinfo id="car_w2e_291" depart="291.00" departLane="w2sep_1" departPos="3.60" departPosLat="0.00" departSpeed="13.90" departDelay="0.00" arrival="431.95" arrivalLane="c2e_1" arrivalPos="990.00" arrivalPosLat="0.00" arrivalSpeed="15.51" duration="140.95" routeLength="1997.01" waitingTime="0.00" waitingCount="0" stopTime="0.00" timeLoss="12.50" rerouteNo="1" devices="tripinfo_car_w2e_291 routing_car_w2e_291" vType="Car" speedFactor="1.12" vaporized=""/>
    <tripinfo id="car_e2n_298" depart="298.00" departLane="e2sep_1" departPos="3.60" departPosLat="0.00" departSpeed="13.90" departDelay="0.00" arrival="441.15" arrivalLane="c2n_1" arrivalPos="990.00" arrivalPosLat="0.00" arrivalSpeed="14.35" duration="143.15" routeLength="1986.69" waitingTime="0.00" waitingCount="0" stopTime="0.00" timeLoss="3.96" rerouteNo="1" devices="tripinfo_car_e2n_298 routing_car_e2n_298" vType="Car" speedFactor="1.03" vaporized=""/>
    <tripinfo id="car_w2n_306" depart="306.00" departLane="w2sep_1" departPos="3.60" departPosLat="0.00" departSpeed="13.90" departDelay="0.00" arrival="445.70" arrivalLane="c2n_1" arrivalPos="990.00" arrivalPosLat="0.00" arrivalSpeed="14.84" duration="139.70" routeLength="1996.47" waitingTime="0.00" waitingCount="0" stopTime="0.00" timeLoss="4.60" rerouteNo="1" devices="tripinfo_car_w2n_306 routing_car_w2n_306" vType="Car" speedFactor="1.07" vaporized=""/>
    <tripinfo id="car_n2s_265" depart="265.00" departLane="n2sep_1" departPos="3.60" departPosLat="0.00" departSpeed="13.90" departDelay="0.00" arrival="453.75" arrivalLane="c2s_1" arrivalPos="990.00" arrivalPosLat="0.00" arrivalSpeed="14.89" duration="188.75" routeLength="1997.01" waitingTime="45.85" waitingCount="1" stopTime="0.00" timeLoss="54.58" rerouteNo="1" devices="tripinfo_car_n2s_265 routing_car_n2s_265" vType="Car" speedFactor="1.07" vaporized=""/>
    <tripinfo id="car_s2e_248" depart="248.00" departLane="s2sep_1" departPos="3.60" departPosLat="0.00" departSpeed="13.90" departDelay="0.00" arrival="454.30" arrivalLane="c2e_1" arrivalPos="990.00" arrivalPosLat="0.00" arrivalSpeed="14.80" duration="206.30" routeLength="1986.69" waitingTime="60.85" waitingCount="1" stopTime="0.00" timeLoss="71.38" rerouteNo="1" devices="tripinfo_car_s2e_248 routing_car_s2e_248" vType="Car" speedFactor="1.06" vaporized=""/>
    <tripinfo id="car_n2w_238" depart="238.00" departLane="n2sep_1" departPos="3.60" departPosLat="0.00" departSpeed="13.90" departDelay="0.00" arrival="456.15" arrivalLane="c2w_1" arrivalPos="990.00" arrivalPosLat="0.00" arrivalSpeed="13.90" duration="218.15" routeLength="1986.69" waitingTime="66.60" waitingCount="1" stopTime="0.00" timeLoss="74.50" rerouteNo="1" devices="tripinfo_car_n2w_238 routing_car_n2w_238" vType="Car" speedFactor="1.00" vaporized=""/>
    <tripinfo id="car_s2n_243" depart="243.00" departLane="s2sep_1" departPos="3.60" departPosLat="0.00" departSpeed="13.90" departDelay="0.00" arrival="456.45" arrivalLane="c2n_1" arrivalPos="990.00" arrivalPosLat="0.00" arrivalSpeed="13.90" duration="213.45" routeLength="1997.01" waitingTime="62.55" waitingCount="1" stopTime="0.00" timeLoss="69.78" rerouteNo="1" devices="tripinfo_car_s2n_243 routing_car_s2n_243" vType="Car" speedFactor="1.00" vaporized=""/>
    <tripinfo id="car_n2s_284" depart="284.00" departLane="n2sep_1" departPos="3.60" departPosLat="0.00" departSpeed="13.90" departDelay="0.00" arrival="459.65" arrivalLane="c2s_1" arrivalPos="990.00" arrivalPosLat="0.00" arrivalSpeed="14.35" duration="175.65" routeLength="1997.01" waitingTime="25.60" waitingCount="1" stopTime="0.00" timeLoss="36.44" rerouteNo="1" devices="tripinfo_car_n2s_284 routing_car_n2s_284" vType="Car" speedFactor="1.03" vaporized=""/>
    <tripinfo id="car_s2n_252" depart="252.00" departLane="s2sep_1" departPos="3.60" departPosLat="0.00" departSpeed="13.90" departDelay="0.00" arrival="460.75" arrivalLane="c2n_1" arrivalPos="990.00" arrivalPosLat="0.00" arrivalSpeed="14.12" duration="208.75" routeLength="1997.01" waitingTime="56.05" waitingCount="1" stopTime="0.00" timeLoss="67.44" rerouteNo="1" devices="tripinfo_car_s2n_252 routing_car_s2n_252" vType="Car" speedFactor="1.02" vaporized=""/>
    <tripinfo id="car_n2s_306" depart="306.00" departLane="n2sep_1" departPos="3.60" departPosLat="0.00" departSpeed="13.90" departDelay="0.00" arrival="461.85" arrivalLane="c2s_1" arrivalPos="990.00" arrivalPosLat="0.00" arrivalSpeed="15.50" duration="155.85" routeLength="1997.01" waitingTime="13.45" waitingCount="1" stopTime="0.00" timeLoss="30.08" rerouteNo="1" devices="tripinfo_car_n2s_306 routing_car_n2s_306" vType="Car" speedFactor="1.14" vaporized=""/>
    <tripinfo id="car_n2w_288" depart="288.00" departLane="n2sep_1" departPos="3.60" departPosLat="0.00" departSpeed="13.90" departDelay="0.00" arrival="463.45" arrivalLane="c2w_1" arrivalPos="990.00" arrivalPosLat="0.00" arrivalSpeed="13.90" duration="175.45" routeLength="1986.69" waitingTime="20.35" waitingCount="1" stopTime="0.00" timeLoss="31.77" rerouteNo="1" devices="tripinfo_car_n2w_288 routing_car_n2w_288" vType="Car" speedFactor="1.00" vaporized=""/>
    <tripinfo id="car_s2n_264" depart="264.00" departLane="s2sep_1" departPos="3.60" departPosLat="0.00" departSpeed="13.90" departDelay="0.00" arrival="464.80" arrivalLane="c2n_1" arrivalPos="990.00" arrivalPosLat="0.00" arrivalSpeed="13.95" duration="200.80" routeLength="1997.01" waitingTime="45.00" waitingCount="1" stopTime="0.00" timeLoss="57.74" rerouteNo="1" devices="tripinfo_car_s2n_264 routing_car_s2n_264" vType="Car" speedFactor="1.00" vaporized=""/>
    <tripinfo id="car_s2e_264" depart="265.45" departLane="s2sep_1" departPos="3.60" departPosLat="0.00" departSpeed="13.90" departDelay="1.45" arrival="465.05" arrivalLane="c2e_1" arrivalPos="990.00" arrivalPosLat="0.00" arrivalSpeed="13.94" duration="199.60" routeLength="1986.69" waitingTime="42.45" waitingCount="1" stopTime="0.00" timeLoss="56.35" rerouteNo="1" devices="tripinfo_car_s2e_264 routing_car_s2e_264" vType="Car" speedFactor="1.00" vaporized=""/>
    <tripinfo id="car_s2e_307" depart="307.00" departLane="s2sep_1" departPos="3.60" departPosLat="0.00" departSpeed="13.90" departDelay="0.00" arrival="466.75" arrivalLane="c2e_1" arrivalPos="990.00" arrivalPosLat="0.00" arrivalSpeed="15.74" duration="159.75" routeLength="1986.69" waitingTime="16.15" waitingCount="1" stopTime="0.00" timeLoss="42.56" rerouteNo="1" devices="tripinfo_car_s2e_307 routing_car_s2e_307" vType="Car" speedFactor="1.23" vaporized=""/>
    <tripinfo id="car_n2w_291" depart="291.00" departLane="n2sep_1" departPos="3.60" departPosLat="0.00" departSpeed="13.90" departDelay="0.00" arrival="467.35" arrivalLane="c2w_1" arrivalPos="990.00" arrivalPosLat="0.00" arrivalSpeed="14.00" duration="176.35" routeLength="1986.69" waitingTime="18.00" waitingCount="1" stopTime="0.00" timeLoss="33.86" rerouteNo="1" devices="tripinfo_car_n2w_291 routing_car_n2w_291" vType="Car" speedFactor="1.01" vaporized=""/>
    <tripinfo id="car_n2s_307" depart="307.25" departLane="n2sep_1" departPos="3.60" departPosLat="0.00" departSpeed="13.90" departDelay="0.25" arrival="467.60" arrivalLane="c2s_1" arrivalPos="990.00" arrivalPosLat="0.00" arrivalSpeed="14.42" duration="160.35" routeLength="1997.01" waitingTime="6.80" waitingCount="1" stopTime="0.00" timeLoss="21.82" rerouteNo="1" devices="tripinfo_car_n2s_307 routing_car_n2s_307" vType="Car" speedFactor="1.04" vaporized=""/>
    <tripinfo id="car_s2e_320" depart="320.00" departLane="s2sep_1" departPos="3.60" departPosLat="0.00" departSpeed="13.90" departDelay="0.00" arrival="468.95" arrivalLane="c2e_1" arrivalPos="990.00" arrivalPosLat="0.00" arrivalSpeed="15.23" duration="148.95" routeLength="1986.69" waitingTime="0.00" waitingCount="0" stopTime="0.00" timeLoss="20.60" rerouteNo="1" devices="tripinfo_car_s2e_320 routing_car_s2e_320" vType="Car" speedFactor="1.12" vaporized=""/>
    <tripinfo id="car_s2n_310" depart="310.00" departLane="s2sep_1" departPos="3.60" departPosLat="0.00" departSpeed="13.90" departDelay="0.00" arrival="469.30" arrivalLane="c2n_1" arrivalPos="990.00" arrivalPosLat="0.00" arrivalSpeed="14.05" duration="159.30" routeLength="1997.01" waitingTime="3.25" waitingCount="1" stopTime="0.00" timeLoss="17.28" rerouteNo="1" devices="tripinfo_car_s2n_310 routing_car_s2n_310" vType="Car" speedFactor="1.01" vaporized=""/>
    <tripinfo id="car_n2e_246" depart="246.00" departLane="n2sep_1" departPos="3.60" departPosLat="0.00" departSpeed="13.90" departDelay="0.00" arrival="472.10" arrivalLane="c2e_1" arrivalPos="990.00" arrivalPosLat="0.00" arrivalSpeed="14.85" duration="226.10" routeLength="1996.47" waitingTime="77.30" waitingCount="2" stopTime="0.00" timeLoss="91.58" rerouteNo="1" devices="tripinfo_car_n2e_246 routing_car_n2e_246" vType="Car" speedFactor="1.07" vaporized=""/>
    <tripinfo id="car_n2e_251" depart="251.00" departLane="n2sep_1" departPos="3.60" departPosLat="0.00" departSpeed="13.90" departDelay="0.00" arrival="474.15" arrivalLane="c2e_1" arrivalPos="990.00" arrivalPosLat="0.00" arrivalSpeed="15.72" duration="223.15" routeLength="1996.47" waitingTime="75.20" waitingCount="2" stopTime="0.00" timeLoss="99.68" rerouteNo="1" devices="tripinfo_car_n2e_251 routing_car_n2e_251" vType="Car" speedFactor="1.17" vaporized=""/>
</tripinfos>
