<?xml version="1.0" encoding="UTF-8"?>

<!-- generated on Sat Apr 24 18:34:38 2021 by Eclipse SUMO Version 1.4.0
<configuration xmlns:xsi="http://www.w3.org/2001/XMLSchema-instance" xsi:noNamespaceSchemaLocation="http://sumo.dlr.de/xsd/sumoConfiguration.xsd">

    <input>
        <net-file value="sumofiles/junction.net.xml"/>
        <route-files value="sumofiles/junction_preemption_184.rou.xml"/>
        <additional-files value="sumofiles/junction.det.xml"/>
    </input>

    <output>
        <tripinfo-output value="sumofiles/output/tripinfo_preemption_184.xml"/>
    </output>

    <time>
        <begin value="0"/>
        <end value="10000"/>
        <step-length value="0.05"/>
    </time>

    <processing>
        <lateral-resolution value="0.1"/>
    </processing>

    <report>
        <no-warnings value="true"/>
        <error-log value="sumofiles/output/errorlog_preemption_184.log"/>
        <no-step-log value="true"/>
    </report>

    <traci_server>
        <remote-port value="57933"/>
    </traci_server>

    <gui_only>
        <gui-settings-file value="sumofiles/junction-gui.settings.xml"/>
        <tracker-interval value="0.05"/>
    </gui_only>

</configuration>
-->

<tripinfos xmlns:xsi="http://www.w3.org/2001/XMLSchema-instance" xsi:noNamespaceSchemaLocation="http://sumo.dlr.de/xsd/tripinfo_file.xsd">
    <tripinfo id="car_e2w_0" depart="0.00" departLane="e2sep_1" departPos="3.60" departPosLat="0.00" departSpeed="13.90" departDelay="0.00" arrival="135.70" arrivalLane="c2w_1" arrivalPos="990.00" arrivalPosLat="0.00" arrivalSpeed="14.73" duration="135.70" routeLength="1997.01" waitingTime="0.00" waitingCount="0" stopTime="0.00" timeLoss="0.16" rerouteNo="1" devices="tripinfo_car_e2w_0 routing_car_e2w_0" vType="Car" speedFactor="1.06" vaporized=""/>
    <tripinfo id="car_w2s_4" depart="4.45" departLane="w2sep_1" departPos="3.60" departPosLat="0.00" departSpeed="13.90" departDelay="0.45" arrival="146.25" arrivalLane="c2s_1" arrivalPos="990.00" arrivalPosLat="0.00" arrivalSpeed="15.05" duration="141.80" routeLength="1986.69" waitingTime="0.00" waitingCount="0" stopTime="0.00" timeLoss="9.10" rerouteNo="1" devices="tripinfo_car_w2s_4 routing_car_w2s_4" vType="Car" speedFactor="1.08" vaporized=""/>
    <tripinfo id="car_w2n_3" depart="3.00" departLane="w2sep_1" departPos="3.60" departPosLat="0.00" departSpeed="13.90" departDelay="0.00" arrival="149.10" arrivalLane="c2n_1" arrivalPos="990.00" arrivalPosLat="0.00" arrivalSpeed="14.04" duration="146.10" routeLength="1996.47" waitingTime="0.00" waitingCount="0" stopTime="0.00" timeLoss="3.25" rerouteNo="1" devices="tripinfo_car_w2n_3 routing_car_w2n_3" vType="Car" speedFactor="1.01" vaporized=""/>
    <tripinfo id="car_e2s_4" depart="4.00" departLane="e2sep_1" departPos="3.60" departPosLat="0.00" departSpeed="13.90" departDelay="0.00" arrival="153.05" arrivalLane="c2s_1" arrivalPos="990.00" arrivalPosLat="0.00" arrivalSpeed="14.32" duration="149.05" routeLength="1996.47" waitingTime="0.15" waitingCount="1" stopTime="0.00" timeLoss="8.94" rerouteNo="1" devices="tripinfo_car_e2s_4 routing_car_e2s_4" vType="Car" speedFactor="1.03" vaporized=""/>
    <tripinfo id="car_n2w_1" depart="1.00" departLane="n2sep_1" departPos="3.60" departPosLat="0.00" departSpeed="13.90" departDelay="0.00" arrival="161.70" arrivalLane="c2w_1" arrivalPos="990.00" arrivalPosLat="0.00" arrivalSpeed="14.73" duration="160.70" routeLength="1986.69" waitingTime="17.75" waitingCount="1" stopTime="0.00" timeLoss="25.16" rerouteNo="1" devices="tripinfo_car_n2w_1 routing_car_n2w_1" vType="Car" speedFactor="1.06" vaporized=""/>
    <tripinfo id="car_s2n_4" depart="4.00" departLane="s2sep_1" departPos="3.60" departPosLat="0.00" departSpeed="13.90" departDelay="0.00" arrival="165.75" arrivalLane="c2n_1" arrivalPos="990.00" arrivalPosLat="0.00" arrivalSpeed="13.90" duration="161.75" routeLength="1997.01" waitingTime="10.95" waitingCount="1" stopTime="0.00" timeLoss="18.08" rerouteNo="1" devices="tripinfo_car_s2n_4 routing_car_s2n_4" vType="Car" speedFactor="1.00" vaporized=""/>
    <tripinfo id="car_s2w_23" depart="23.00" departLane="s2sep_1" departPos="3.60" departPosLat="0.00" departSpeed="13.90" departDelay="0.00" arrival="169.90" arrivalLane="c2w_1" arrivalPos="990.00" arrivalPosLat="0.00" arrivalSpeed="14.04" duration="146.90" routeLength="1996.47" waitingTime="0.00" waitingCount="0" stopTime="0.00" timeLoss="4.08" rerouteNo="1" devices="tripinfo_car_s2w_23 routing_car_s2w_23" vType="Car" speedFactor="1.01" vaporized=""/>
    <tripinfo id="car_s2e_34" depart="34.00" departLane="s2sep_1" departPos="3.60" departPosLat="0.00" departSpeed="13.90" departDelay="0.00" arrival="170.05" arrivalLane="c2e_1" arrivalPos="990.00" arrivalPosLat="0.00" arrivalSpeed="15.16" duration="136.05" routeLength="1986.69" waitingTime="0.00" waitingCount="0" stopTime="0.00" timeLoss="4.30" rerouteNo="1" devices="tripinfo_car_s2e_34 routing_car_s2e_34" vType="Car" speedFactor="1.09" vaporized=""/>
    <tripinfo id="car_s2e_50" depart="50.00" departLane="s2sep_1" departPos="3.60" departPosLat="0.00" departSpeed="13.90" departDelay="0.00" arrival="178.80" arrivalLane="c2e_1" arrivalPos="990.00" arrivalPosLat="0.00" arrivalSpeed="16.10" duration="128.80" routeLength="1986.69" waitingTime="0.00" waitingCount="0" stopTime="0.00" timeLoss="4.74" rerouteNo="1" devices="tripinfo_car_s2e_50 routing_car_s2e_50" vType="Car" speedFactor="1.16" vaporized=""/>
    <tripinfo id="car_s2w_37" depart="37.00" departLane="s2sep_1" departPos="3.60" departPosLat="0.00" departSpeed="13.90" departDelay="0.00" arrival="179.45" arrivalLane="c2w_1" arrivalPos="990.00" arrivalPosLat="0.00" arrivalSpeed="14.55" duration="142.45" routeLength="1996.47" waitingTime="0.00" waitingCount="0" stopTime="0.00" timeLoss="4.59" rerouteNo="1" devices="tripinfo_car_s2w_37 routing_car_s2w_37" vType="Car" speedFactor="1.05" vaporized=""/>
    <tripinfo id="car_n2e_50" depart="50.00" departLane="n2sep_1" departPos="3.60" departPosLat="0.00" departSpeed="13.90" departDelay="0.00" arrival="197.60" arrivalLane="c2e_1" arrivalPos="990.00" arrivalPosLat="0.00" arrivalSpeed="13.90" duration="147.60" routeLength="1996.47" waitingTime="0.00" waitingCount="0" stopTime="0.00" timeLoss="3.29" rerouteNo="1" devices="tripinfo_car_n2e_50 routing_car_n2e_50" vType="Car" speedFactor="1.00" vaporized=""/>
    <tripinfo id="car_s2w_55" depart="55.00" departLane="s2sep_1" departPos="3.60" departPosLat="0.00" departSpeed="13.90" departDelay="0.00" arrival="201.30" arrivalLane="c2w_1" arrivalPos="990.00" arrivalPosLat="0.00" arrivalSpeed="14.04" duration="146.30" routeLength="1996.47" waitingTime="0.00" waitingCount="0" stopTime="0.00" timeLoss="3.42" rerouteNo="1" devices="tripinfo_car_s2w_55 routing_car_s2w_55" vType="Car" speedFactor="1.01" vaporized=""/>
    <tripinfo id="car_e2n_19" depart="19.00" departLane="e2sep_1" departPos="3.60" departPosLat="0.00" departSpeed="13.90" departDelay="0.00" arrival="207.55" arrivalLane="c2n_1" arrivalPos="990.00" arrivalPosLat="0.00" arrivalSpeed="14.54" duration="188.55" routeLength="1986.69" waitingTime="44.05" waitingCount="1" stopTime="0.00" timeLoss="51.20" rerouteNo="1" devices="tripinfo_car_e2n_19 routing_car_e2n_19" vType="Car" speedFactor="1.05" vaporized=""/>
    <tripinfo id="car_w2e_39" depart="39.00" departLane="w2sep_1" departPos="3.60" departPosLat="0.00" departSpeed="13.90" departDelay="0.00" arrival="207.65" arrivalLane="c2e_1" arrivalPos="990.00" arrivalPosLat="0.00" arrivalSpeed="15.61" duration="168.65" routeLength="1997.01" waitingTime="29.85" waitingCount="1" stopTime="0.00" timeLoss="40.70" rerouteNo="1" devices="tripinfo_car_w2e_39 routing_car_w2e_39" vType="Car" speedFactor="1.12" vaporized=""/>
    <tripinfo id="car_e2n_28" depart="28.00" departLane="e2sep_1" departPos="3.60" departPosLat="0.00" departSpeed="13.90" departDelay="0.00" arrival="210.80" arrivalLane="c2n_1" arrivalPos="990.00" arrivalPosLat="0.00" arrivalSpeed="14.99" duration="182.80" routeLength="1986.69" waitingTime="37.85" waitingCount="1" stopTime="0.00" timeLoss="50.11" rerouteNo="1" devices="tripinfo_car_e2n_28 routing_car_e2n_28" vType="Car" speedFactor="1.08" vaporized=""/>
    <tripinfo id="car_w2e_61" depart="61.00" departLane="w2sep_1" departPos="3.60" departPosLat="0.00" departSpeed="13.90" departDelay="0.00" arrival="212.75" arrivalLane="c2e_1" arrivalPos="990.00" arrivalPosLat="0.00" arrivalSpeed="15.60" duration="151.75" routeLength="1997.01" waitingTime="9.75" waitingCount="1" stopTime="0.00" timeLoss="23.78" rerouteNo="1" devices="tripinfo_car_w2e_61 routing_car_w2e_61" vType="Car" speedFactor="1.12" vaporized=""/>
    <tripinfo id="bus_w2s_21" depart="21.00" departLane="w2sep_1" departPos="12.10" departPosLat="0.00" departSpeed="13.90" departDelay="0.00" arrival="213.90" arrivalLane="c2s_1" arrivalPos="990.00" arrivalPosLat="0.00" arrivalSpeed="13.90" duration="192.90" routeLength="1978.19" waitingTime="39.40" waitingCount="1" stopTime="0.00" timeLoss="49.86" rerouteNo="1" devices="tripinfo_bus_w2s_21 routing_bus_w2s_21" vType="Bus" speedFactor="1.00" vaporized=""/>
    <tripinfo id="car_e2w_48" depart="48.00" departLane="e2sep_1" departPos="3.60" departPosLat="0.00" departSpeed="13.90" departDelay="0.00" arrival="214.50" arrivalLane="c2w_1" arrivalPos="990.00" arrivalPosLat="0.00" arrivalSpeed="14.54" duration="166.50" routeLength="1997.01" waitingTime="18.05" waitingCount="1" stopTime="0.00" timeLoss="29.10" rerouteNo="1" devices="tripinfo_car_e2w_48 routing_car_e2w_48" vType="Car" speedFactor="1.05" vaporized=""/>
    <tripinfo id="car_e2n_36" depart="36.00" departLane="e2sep_1" departPos="3.60" departPosLat="0.00" departSpeed="13.90" departDelay="0.00" arrival="215.70" arrivalLane="c2n_1" arrivalPos="990.00" arrivalPosLat="0.00" arrivalSpeed="14.26" duration="179.70" routeLength="1986.69" waitingTime="25.65" waitingCount="1" stopTime="0.00" timeLoss="39.72" rerouteNo="1" devices="tripinfo_car_e2n_36 routing_car_e2n_36" vType="Car" speedFactor="1.03" vaporized=""/>
    <tripinfo id="car_w2e_64" depart="64.00" departLane="w2sep_1" departPos="3.60" departPosLat="0.00" departSpeed="13.90" departDelay="0.00" arrival="216.20" arrivalLane="c2e_1" arrivalPos="990.00" arrivalPosLat="0.00" arrivalSpeed="15.68" duration="152.20" routeLength="1997.01" waitingTime="7.60" waitingCount="1" stopTime="0.00" timeLoss="25.24" rerouteNo="1" devices="tripinfo_car_w2e_64 routing_car_w2e_64" vType="Car" speedFactor="1.13" vaporized=""/>
    <tripinfo id="car_w2s_56" depart="56.00" departLane="w2sep_1" departPos="3.60" departPosLat="0.00" departSpeed="13.90" departDelay="0.00" arrival="216.85" arrivalLane="c2s_1" arrivalPos="990.00" arrivalPosLat="0.00" arrivalSpeed="14.98" duration="160.85" routeLength="1986.69" waitingTime="12.20" waitingCount="1" stopTime="0.00" timeLoss="29.10" rerouteNo="1" devices="tripinfo_car_w2s_56 routing_car_w2s_56" vType="Car" speedFactor="1.09" vaporized=""/>
    <tripinfo id="car_w2e_91" depart="91.00" departLane="w2sep_1" departPos="3.60" departPosLat="0.00" departSpeed="13.90" departDelay="0.00" arrival="219.90" arrivalLane="c2e_1" arrivalPos="990.00" arrivalPosLat="0.00" arrivalSpeed="16.06" duration="128.90" routeLength="1997.01" waitingTime="0.00" waitingCount="0" stopTime="0.00" timeLoss="4.85" rerouteNo="1" devices="tripinfo_car_w2e_91 routing_car_w2e_91" vType="Car" speedFactor="1.16" vaporized=""/>
    <tripinfo id="car_e2n_50" depart="51.20" departLane="e2sep_1" departPos="3.60" departPosLat="0.00" departSpeed="13.90" departDelay="1.20" arrival="221.15" arrivalLane="c2n_1" arrivalPos="990.00" arrivalPosLat="0.00" arrivalSpeed="13.90" duration="169.95" routeLength="1986.69" waitingTime="9.85" waitingCount="1" stopTime="0.00" timeLoss="26.27" rerouteNo="1" devices="tripinfo_car_e2n_50 routing_car_e2n_50" vType="Car" speedFactor="1.00" vaporized=""/>
    <tripinfo id="car_e2w_88" depart="88.00" departLane="e2sep_1" departPos="3.60" departPosLat="0.00" departSpeed="13.90" departDelay="0.00" arrival="222.50" arrivalLane="c2w_1" arrivalPos="990.00" arrivalPosLat="0.00" arrivalSpeed="15.32" duration="134.50" routeLength="1997.01" waitingTime="0.00" waitingCount="0" stopTime="0.00" timeLoss="4.16" rerouteNo="1" devices="tripinfo_car_e2w_88 routing_car_e2w_88" vType="Car" speedFactor="1.10" vaporized=""/>
    <tripinfo id="car_e2n_67" depart="67.00" departLane="e2sep_1" departPos="3.60" departPosLat="0.00" departSpeed="13.90" departDelay="0.00" arrival="222.95" arrivalLane="c2n_1" arrivalPos="990.00" arrivalPosLat="0.00" arrivalSpeed="15.44" duration="155.95" routeLength="1986.69" waitingTime="0.00" waitingCount="0" stopTime="0.00" timeLoss="34.04" rerouteNo="1" devices="tripinfo_car_e2n_67 routing_car_e2n_67" vType="Car" speedFactor="1.18" vaporized=""/>
    <tripinfo id="car_w2s_78" depart="78.00" departLane="w2sep_1" departPos="3.60" departPosLat="0.00" departSpeed="13.90" departDelay="0.00" arrival="223.80" arrivalLane="c2s_1" arrivalPos="990.00" arrivalPosLat="0.00" arrivalSpeed="14.17" duration="145.80" routeLength="1986.69" waitingTime="0.00" waitingCount="0" stopTime="0.00" timeLoss="4.92" rerouteNo="1" devices="tripinfo_car_w2s_78 routing_car_w2s_78" vType="Car" speedFactor="1.02" vaporized=""/>
    <tripinfo id="car_w2s_84" depart="84.00" departLane="w2sep_1" departPos="3.60" departPosLat="0.00" departSpeed="13.90" departDelay="0.00" arrival="225.70" arrivalLane="c2s_1" arrivalPos="990.00" arrivalPosLat="0.00" arrivalSpeed="15.62" duration="141.70" routeLength="1986.69" waitingTime="0.00" waitingCount="0" stopTime="0.00" timeLoss="19.89" rerouteNo="1" devices="tripinfo_car_w2s_84 routing_car_w2s_84" vType="Car" speedFactor="1.18" vaporized=""/>
    <tripinfo id="car_e2n_75" depart="75.00" departLane="e2sep_1" departPos="3.60" departPosLat="0.00" departSpeed="13.90" departDelay="0.00" arrival="227.05" arrivalLane="c2n_1" arrivalPos="990.00" arrivalPosLat="0.00" arrivalSpeed="13.89" duration="152.05" routeLength="1986.69" waitingTime="0.00" waitingCount="0" stopTime="0.00" timeLoss="8.37" rerouteNo="1" devices="tripinfo_car_e2n_75 routing_car_e2n_75" vType="Car" speedFactor="1.00" vaporized=""/>
    <tripinfo id="car_e2n_78" depart="78.00" departLane="e2sep_1" departPos="3.60" departPosLat="0.00" departSpeed="13.90" departDelay="0.00" arrival="230.55" arrivalLane="c2n_1" arrivalPos="990.00" arrivalPosLat="0.00" arrivalSpeed="13.87" duration="152.55" routeLength="1986.69" waitingTime="0.00" waitingCount="0" stopTime="0.00" timeLoss="8.88" rerouteNo="1" devices="tripinfo_car_e2n_78 routing_car_e2n_78" vType="Car" speedFactor="1.00" vaporized=""/>
    <tripinfo id="car_w2s_94" depart="94.00" departLane="w2sep_1" departPos="3.60" departPosLat="0.00" departSpeed="13.90" departDelay="0.00" arrival="230.90" arrivalLane="c2s_1" arrivalPos="990.00" arrivalPosLat="0.00" arrivalSpeed="15.17" duration="136.90" routeLength="1986.69" waitingTime="0.00" waitingCount="0" stopTime="0.00" timeLoss="5.35" rerouteNo="1" devices="tripinfo_car_w2s_94 routing_car_w2s_94" vType="Car" speedFactor="1.09" vaporized=""/>
    <tripinfo id="car_e2w_92" depart="92.00" departLane="e2sep_1" departPos="3.60" departPosLat="0.00" departSpeed="13.90" departDelay="0.00" arrival="232.75" arrivalLane="c2w_1" arrivalPos="990.00" arrivalPosLat="0.00" arrivalSpeed="14.32" duration="140.75" routeLength="1997.01" waitingTime="0.00" waitingCount="0" stopTime="0.00" timeLoss="1.30" rerouteNo="1" devices="tripinfo_car_e2w_92 routing_car_e2w_92" vType="Car" speedFactor="1.03" vaporized=""/>
    <tripinfo id="car_w2n_42" depart="42.00" departLane="w2sep_1" departPos="3.60" departPosLat="0.00" departSpeed="13.90" departDelay="0.00" arrival="234.05" arrivalLane="c2n_1" arrivalPos="990.00" arrivalPosLat="0.00" arrivalSpeed="13.87" duration="192.05" routeLength="1996.47" waitingTime="34.35" waitingCount="2" stopTime="0.00" timeLoss="47.75" rerouteNo="1" devices="tripinfo_car_w2n_42 routing_car_w2n_42" vType="Car" speedFactor="1.00" vaporized=""/>
    <tripinfo id="car_e2s_34" depart="34.00" departLane="e2sep_1" departPos="3.60" departPosLat="0.00" departSpeed="13.90" departDelay="0.00" arrival="237.60" arrivalLane="c2s_1" arrivalPos="990.00" arrivalPosLat="0.00" arrivalSpeed="14.32" duration="203.60" routeLength="1996.47" waitingTime="50.30" waitingCount="4" stopTime="0.00" timeLoss="63.51" rerouteNo="1" devices="tripinfo_car_e2s_34 routing_car_e2s_34" vType="Car" speedFactor="1.03" vaporized=""/>
    <tripinfo id="car_e2s_48" depart="49.40" departLane="e2sep_1" departPos="3.60" departPosLat="0.00" departSpeed="13.90" departDelay="1.40" arrival="242.75" arrivalLane="c2s_1" arrivalPos="990.00" arrivalPosLat="0.00" arrivalSpeed="13.90" duration="193.35" routeLength="1996.47" waitingTime="31.35" waitingCount="2" stopTime="0.00" timeLoss="49.03" rerouteNo="1" devices="tripinfo_car_e2s_48 routing_car_e2s_48" vType="Car" speedFactor="1.00" vaporized=""/>
    <tripinfo id="car_w2n_98" depart="98.00" departLane="w2sep_1" departPos="3.60" departPosLat="0.00" departSpeed="13.90" departDelay="0.00" arrival="244.75" arrivalLane="c2n_1" arrivalPos="990.00" arrivalPosLat="0.00" arrivalSpeed="14.04" duration="146.75" routeLength="1996.47" waitingTime="0.00" waitingCount="0" stopTime="0.00" timeLoss="3.85" rerouteNo="1" devices="tripinfo_car_w2n_98 routing_car_w2n_98" vType="Car" speedFactor="1.01" vaporized=""/>
    <tripinfo id="car_s2e_72" depart="72.45" departLane="s2sep_1" departPos="3.60" departPosLat="0.00" departSpeed="13.90" departDelay="0.45" arrival="245.50" arrivalLane="c2e_1" arrivalPos="990.00" arrivalPosLat="0.00" arrivalSpeed="16.29" duration="173.05" routeLength="1986.69" waitingTime="32.80" waitingCount="1" stopTime="0.00" timeLoss="50.43" rerouteNo="1" devices="tripinfo_car_s2e_72 routing_car_s2e_72" vType="Car" speedFactor="1.17" vaporized=""/>
    <tripinfo id="car_e2s_62" depart="62.00" departLane="e2sep_1" departPos="3.60" departPosLat="0.00" departSpeed="13.90" departDelay="0.00" arrival="246.50" arrivalLane="c2s_1" arrivalPos="990.00" arrivalPosLat="0.00" arrivalSpeed="13.88" duration="184.50" routeLength="1996.47" waitingTime="19.90" waitingCount="1" stopTime="0.00" timeLoss="40.16" rerouteNo="1" devices="tripinfo_car_e2s_62 routing_car_e2s_62" vType="Car" speedFactor="1.00" vaporized=""/>
    <tripinfo id="car_e2s_64" depart="64.00" departLane="e2sep_1" departPos="3.60" departPosLat="0.00" departSpeed="13.90" departDelay="0.00" arrival="249.75" arrivalLane="c2s_1" arrivalPos="990.00" arrivalPosLat="0.00" arrivalSpeed="13.86" duration="185.75" routeLength="1996.47" waitingTime="19.20" waitingCount="1" stopTime="0.00" timeLoss="41.42" rerouteNo="1" devices="tripinfo_car_e2s_64 routing_car_e2s_64" vType="Car" speedFactor="1.00" vaporized=""/>
    <tripinfo id="car_e2s_68" depart="68.35" departLane="e2sep_1" departPos="3.60" departPosLat="0.00" departSpeed="13.90" departDelay="0.35" arrival="251.55" arrivalLane="c2s_1" arrivalPos="990.00" arrivalPosLat="0.00" arrivalSpeed="15.15" duration="183.20" routeLength="1996.47" waitingTime="18.75" waitingCount="1" stopTime="0.00" timeLoss="58.20" rerouteNo="1" devices="tripinfo_car_e2s_68 routing_car_e2s_68" vType="Car" speedFactor="1.15" vaporized=""/>
    <tripinfo id="car_e2s_93" depart="93.45" departLane="e2sep_1" departPos="3.60" departPosLat="0.00" departSpeed="13.90" departDelay="0.45" arrival="254.35" arrivalLane="c2s_1" arrivalPos="990.00" arrivalPosLat="0.00" arrivalSpeed="14.06" duration="160.90" routeLength="1996.47" waitingTime="0.00" waitingCount="0" stopTime="0.00" timeLoss="19.12" rerouteNo="1" devices="tripinfo_car_e2s_93 routing_car_e2s_93" vType="Car" speedFactor="1.02" vaporized=""/>
    <tripinfo id="car_n2w_54" depart="54.00" departLane="n2sep_1" departPos="3.60" departPosLat="0.00" departSpeed="13.90" departDelay="0.00" arrival="254.40" arrivalLane="c2w_1" arrivalPos="990.00" arrivalPosLat="0.00" arrivalSpeed="14.15" duration="200.40" routeLength="1986.69" waitingTime="51.10" waitingCount="1" stopTime="0.00" timeLoss="59.30" rerouteNo="1" devices="tripinfo_car_n2w_54 routing_car_n2w_54" vType="Car" speedFactor="1.02" vaporized=""/>
    <tripinfo id="car_s2n_94" depart="94.00" departLane="s2sep_1" departPos="3.60" departPosLat="0.00" departSpeed="13.90" departDelay="0.00" arrival="255.40" arrivalLane="c2n_1" arrivalPos="990.00" arrivalPosLat="0.00" arrivalSpeed="14.42" duration="161.40" routeLength="1997.01" waitingTime="14.30" waitingCount="1" stopTime="0.00" timeLoss="22.94" rerouteNo="1" devices="tripinfo_car_s2n_94 routing_car_s2n_94" vType="Car" speedFactor="1.04" vaporized=""/>
    <tripinfo id="car_n2s_58" depart="58.00" departLane="n2sep_1" departPos="3.60" departPosLat="0.00" departSpeed="13.90" departDelay="0.00" arrival="257.60" arrivalLane="c2s_1" arrivalPos="990.00" arrivalPosLat="0.00" arrivalSpeed="14.22" duration="199.60" routeLength="1997.01" waitingTime="48.30" waitingCount="1" stopTime="0.00" timeLoss="59.61" rerouteNo="1" devices="tripinfo_car_n2s_58 routing_car_n2s_58" vType="Car" speedFactor="1.03" vaporized=""/>
    <tripinfo id="car_n2w_97" depart="97.00" departLane="n2sep_1" departPos="3.60" departPosLat="0.00" departSpeed="13.90" departDelay="0.00" arrival="260.15" arrivalLane="c2w_1" arrivalPos="990.00" arrivalPosLat="0.00" arrivalSpeed="14.50" duration="163.15" routeLength="1986.69" waitingTime="14.00" waitingCount="1" stopTime="0.00" timeLoss="25.45" rerouteNo="1" devices="tripinfo_car_n2w_97 routing_car_n2w_97" vType="Car" speedFactor="1.04" vaporized=""/>
    <tripinfo id="car_n2e_110" depart="110.00" departLane="n2sep_1" departPos="3.60" departPosLat="0.00" departSpeed="13.90" departDelay="0.00" arrival="260.45" arrivalLane="c2e_1" arrivalPos="990.00" arrivalPosLat="0.00" arrivalSpeed="13.90" duration="150.45" routeLength="1996.47" waitingTime="0.00" waitingCount="0" stopTime="0.00" timeLoss="6.11" rerouteNo="1" devices="tripinfo_car_n2e_110 routing_car_n2e_110" vType="Car" speedFactor="1.00" vaporized=""/>
    <tripinfo id="car_n2s_60" depart="60.00" departLane="n2sep_1" departPos="3.60" departPosLat="0.00" departSpeed="13.90" departDelay="0.00" arrival="260.50" arrivalLane="c2s_1" arrivalPos="990.00" arrivalPosLat="0.00" arrivalSpeed="14.46" duration="200.50" routeLength="1997.01" waitingTime="46.60" waitingCount="1" stopTime="0.00" timeLoss="63.28" rerouteNo="1" devices="tripinfo_car_n2s_60 routing_car_n2s_60" vType="Car" speedFactor="1.05" vaporized=""/>
    <tripinfo id="car_n2e_116" depart="116.00" departLane="n2sep_1" departPos="3.60" departPosLat="0.00" departSpeed="13.90" departDelay="0.00" arrival="262.30" arrivalLane="c2e_1" arrivalPos="990.00" arrivalPosLat="0.00" arrivalSpeed="15.42" duration="146.30" routeLength="1996.47" waitingTime="0.00" waitingCount="0" stopTime="0.00" timeLoss="22.83" rerouteNo="1" devices="tripinfo_car_n2e_116 routing_car_n2e_116" vType="Car" speedFactor="1.17" vaporized=""/>
    <tripinfo id="car_n2e_117" depart="117.25" departLane="n2sep_1" departPos="3.60" departPosLat="0.00" departSpeed="13.90" departDelay="0.25" arrival="266.30" arrivalLane="c2e_1" arrivalPos="990.00" arrivalPosLat="0.00" arrivalSpeed="14.12" duration="149.05" routeLength="1996.47" waitingTime="0.00" waitingCount="0" stopTime="0.00" timeLoss="7.08" rerouteNo="1" devices="tripinfo_car_n2e_117 routing_car_n2e_117" vType="Car" speedFactor="1.02" vaporized=""/>
    <tripinfo id="car_s2w_63" depart="63.00" departLane="s2sep_1" departPos="3.60" departPosLat="0.00" departSpeed="13.90" departDelay="0.00" arrival="266.60" arrivalLane="c2w_1" arrivalPos="990.00" arrivalPosLat="0.00" arrivalSpeed="13.90" duration="203.60" routeLength="1996.47" waitingTime="47.40" waitingCount="2" stopTime="0.00" timeLoss="59.25" rerouteNo="1" devices="tripinfo_car_s2w_63 routing_car_s2w_63" vType="Car" speedFactor="1.00" vaporized=""/>
    <tripinfo id="car_n2e_121" depart="121.00" departLane="n2sep_1" departPos="3.60" departPosLat="0.00" departSpeed="13.90" departDelay="0.00" arrival="268.50" arrivalLane="c2e_1" arrivalPos="990.00" arrivalPosLat="0.00" arrivalSpeed="14.90" duration="147.50" routeLength="1996.47" waitingTime="0.00" waitingCount="0" stopTime="0.00" timeLoss="15.80" rerouteNo="1" devices="tripinfo_car_n2e_121 routing_car_n2e_121" vType="Car" speedFactor="1.10" vaporized=""/>
    <tripinfo id="car_s2w_71" depart="71.00" departLane="s2sep_1" departPos="3.60" departPosLat="0.00" departSpeed="13.90" departDelay="0.00" arrival="270.40" arrivalLane="c2w_1" arrivalPos="990.00" arrivalPosLat="0.00" arrivalSpeed="13.95" duration="199.40" routeLength="1996.47" waitingTime="39.55" waitingCount="2" stopTime="0.00" timeLoss="55.82" rerouteNo="1" devices="tripinfo_car_s2w_71 routing_car_s2w_71" vType="Car" speedFactor="1.01" vaporized=""/>
    <tripinfo id="car_s2w_98" depart="98.00" departLane="s2sep_1" departPos="3.60" departPosLat="0.00" departSpeed="13.90" departDelay="0.00" arrival="273.90" arrivalLane="c2w_1" arrivalPos="990.00" arrivalPosLat="0.00" arrivalSpeed="13.87" duration="175.90" routeLength="1996.47" waitingTime="10.65" waitingCount="2" stopTime="0.00" timeLoss="31.56" rerouteNo="1" devices="tripinfo_car_s2w_98 routing_car_s2w_98" vType="Car" speedFactor="1.00" vaporized=""/>
    <tripinfo id="car_s2w_129" depart="129.00" departLane="s2sep_1" departPos="3.60" departPosLat="0.00" departSpeed="13.90" departDelay="0.00" arrival="277.85" arrivalLane="c2w_1" arrivalPos="990.00" arrivalPosLat="0.00" arrivalSpeed="13.93" duration="148.85" routeLength="1996.47" waitingTime="0.00" waitingCount="0" stopTime="0.00" timeLoss="5.00" rerouteNo="1" devices="tripinfo_car_s2w_129 routing_car_s2w_129" vType="Car" speedFactor="1.00" vaporized=""/>
    <tripinfo id="car_s2e_129" depart="130.45" departLane="s2sep_1" departPos="3.60" departPosLat="0.00" departSpeed="13.90" departDelay="1.45" arrival="280.40" arrivalLane="c2e_1" arrivalPos="990.00" arrivalPosLat="0.00" arrivalSpeed="13.90" duration="149.95" routeLength="1986.69" waitingTime="0.00" waitingCount="0" stopTime="0.00" timeLoss="6.29" rerouteNo="1" devices="tripinfo_car_s2e_129 routing_car_s2e_129" vType="Car" speedFactor="1.00" vaporized=""/>
    <tripinfo id="car_n2e_150" depart="150.00" departLane="n2sep_1" departPos="3.60" departPosLat="0.00" departSpeed="13.90" departDelay="0.00" arrival="282.25" arrivalLane="c2e_1" arrivalPos="990.00" arrivalPosLat="0.00" arrivalSpeed="15.50" duration="132.25" routeLength="1996.47" waitingTime="0.00" waitingCount="0" stopTime="0.00" timeLoss="9.78" rerouteNo="1" devices="tripinfo_car_n2e_150 routing_car_n2e_150" vType="Car" speedFactor="1.18" vaporized=""/>
    <tripinfo id="car_e2n_97" depart="97.00" departLane="e2sep_1" departPos="3.60" departPosLat="0.00" departSpeed="13.90" departDelay="0.00" arrival="295.00" arrivalLane="c2n_1" arrivalPos="990.00" arrivalPosLat="0.00" arrivalSpeed="15.12" duration="198.00" routeLength="1986.69" waitingTime="53.25" waitingCount="1" stopTime="0.00" timeLoss="65.96" rerouteNo="1" devices="tripinfo_car_e2n_97 routing_car_e2n_97" vType="Car" speedFactor="1.09" vaporized=""/>
    <tripinfo id="car_w2e_130" depart="130.00" departLane="w2sep_1" departPos="3.60" departPosLat="0.00" departSpeed="13.90" departDelay="0.00" arrival="300.75" arrivalLane="c2e_1" arrivalPos="990.00" arrivalPosLat="0.00" arrivalSpeed="13.90" duration="170.75" routeLength="1997.01" waitingTime="19.95" waitingCount="1" stopTime="0.00" timeLoss="27.06" rerouteNo="1" devices="tripinfo_car_w2e_130 routing_car_w2e_130" vType="Car" speedFactor="1.00" vaporized=""/>
    <tripinfo id="car_e2s_137" depart="137.00" departLane="e2sep_1" departPos="3.60" departPosLat="0.00" departSpeed="13.90" departDelay="0.00" arrival="301.25" arrivalLane="c2s_1" arrivalPos="990.00" arrivalPosLat="0.00" arrivalSpeed="15.73" duration="164.25" routeLength="1996.47" waitingTime="24.55" waitingCount="2" stopTime="0.00" timeLoss="36.70" rerouteNo="1" devices="tripinfo_car_e2s_137 routing_car_e2s_137" vType="Car" speedFactor="1.13" vaporized=""/>
    <tripinfo id="car_e2n_144" depart="144.00" departLane="e2sep_1" departPos="3.60" departPosLat="0.00" departSpeed="13.90" departDelay="0.00" arrival="302.50" arrivalLane="c2n_1" arrivalPos="990.00" arrivalPosLat="0.00" arrivalSpeed="15.05" duration="158.50" routeLength="1986.69" waitingTime="14.15" waitingCount="1" stopTime="0.00" timeLoss="25.76" rerouteNo="1" devices="tripinfo_car_e2n_144 routing_car_e2n_144" vType="Car" speedFactor="1.08" vaporized=""/>
    <tripinfo id="car_e2w_115" depart="115.00" departLane="e2sep_1" departPos="3.60" departPosLat="0.00" departSpeed="13.90" departDelay="0.00" arrival="302.80" arrivalLane="c2w_1" arrivalPos="990.00" arrivalPosLat="0.00" arrivalSpeed="13.90" duration="187.80" routeLength="1997.01" waitingTime="35.90" waitingCount="1" stopTime="0.00" timeLoss="44.12" rerouteNo="1" devices="tripinfo_car_e2w_115 routing_car_e2w_115" vType="Car" speedFactor="1.00" vaporized=""/>
    <tripinfo id="car_w2e_137" depart="137.00" departLane="w2sep_1" departPos="3.60" departPosLat="0.00" departSpeed="13.90" departDelay="0.00" arrival="304.30" arrivalLane="c2e_1" arrivalPos="990.00" arrivalPosLat="0.00" arrivalSpeed="14.19" duration="167.30" routeLength="1997.01" waitingTime="15.05" waitingCount="1" stopTime="0.00" timeLoss="26.90" rerouteNo="1" devices="tripinfo_car_w2e_137 routing_car_w2e_137" vType="Car" speedFactor="1.02" vaporized=""/>
    <tripinfo id="car_e2w_131" depart="131.00" departLane="e2sep_1" departPos="3.60" departPosLat="0.00" departSpeed="13.90" departDelay="0.00" arrival="304.80" arrivalLane="c2w_1" arrivalPos="990.00" arrivalPosLat="0.00" arrivalSpeed="15.28" duration="173.80" routeLength="1997.01" waitingTime="29.20" waitingCount="1" stopTime="0.00" timeLoss="48.02" rerouteNo="1" devices="tripinfo_car_e2w_131 routing_car_e2w_131" vType="Car" speedFactor="1.14" vaporized=""/>
    <tripinfo id="car_w2e_146" depart="146.00" departLane="w2sep_1" departPos="3.60" departPosLat="0.00" departSpeed="13.90" departDelay="0.00" arrival="306.35" arrivalLane="c2e_1" arrivalPos="990.00" arrivalPosLat="0.00" arrivalSpeed="15.09" duration="160.35" routeLength="1997.01" waitingTime="12.70" waitingCount="1" stopTime="0.00" timeLoss="31.99" rerouteNo="1" devices="tripinfo_car_w2e_146 routing_car_w2e_146" vType="Car" speedFactor="1.12" vaporized=""/>
    <tripinfo id="car_w2e_160" depart="160.00" departLane="w2sep_1" departPos="3.60" departPosLat="0.00" departSpeed="13.90" departDelay="0.00" arrival="309.25" arrivalLane="c2e_1" arrivalPos="990.00" arrivalPosLat="0.00" arrivalSpeed="14.38" duration="149.25" routeLength="1997.01" waitingTime="0.00" waitingCount="0" stopTime="0.00" timeLoss="11.10" rerouteNo="1" devices="tripinfo_car_w2e_160 routing_car_w2e_160" vType="Car" speedFactor="1.04" vaporized=""/>
    <tripinfo id="car_e2n_162" depart="162.00" departLane="e2sep_1" departPos="3.60" departPosLat="0.00" departSpeed="13.90" departDelay="0.00" arrival="309.45" arrivalLane="c2n_1" arrivalPos="990.00" arrivalPosLat="0.00" arrivalSpeed="14.17" duration="147.45" routeLength="1986.69" waitingTime="0.00" waitingCount="0" stopTime="0.00" timeLoss="6.56" rerouteNo="1" devices="tripinfo_car_e2n_162 routing_car_e2n_162" vType="Car" speedFactor="1.02" vaporized=""/>
    <tripinfo id="car_e2w_165" depart="165.00" departLane="e2sep_1" departPos="3.60" departPosLat="0.00" departSpeed="13.90" departDelay="0.00" arrival="309.85" arrivalLane="c2w_1" arrivalPos="990.00" arrivalPosLat="0.00" arrivalSpeed="14.35" duration="144.85" routeLength="1997.01" waitingTime="0.00" waitingCount="0" stopTime="0.00" timeLoss="5.69" rerouteNo="1" devices="tripinfo_car_e2w_165 routing_car_e2w_165" vType="Car" speedFactor="1.03" vaporized=""/>
    <tripinfo id="car_e2s_147" depart="147.00" departLane="e2sep_1" departPos="3.60" departPosLat="0.00" departSpeed="13.90" departDelay="0.00" arrival="310.95" arrivalLane="c2s_1" arrivalPos="990.00" arrivalPosLat="0.00" arrivalSpeed="14.12" duration="163.95" routeLength="1996.47" waitingTime="7.40" waitingCount="2" stopTime="0.00" timeLoss="21.83" rerouteNo="1" devices="tripinfo_car_e2s_147 routing_car_e2s_147" vType="Car" speedFactor="1.02" vaporized=""/>
    <tripinfo id="car_e2n_168" depart="168.00" departLane="e2sep_1" departPos="3.60" departPosLat="0.00" departSpeed="13.90" departDelay="0.00" arrival="311.85" arrivalLane="c2n_1" arrivalPos="990.00" arrivalPosLat="0.00" arrivalSpeed="15.08" duration="143.85" routeLength="1986.69" waitingTime="0.00" waitingCount="0" stopTime="0.00" timeLoss="13.52" rerouteNo="1" devices="tripinfo_car_e2n_168 routing_car_e2n_168" vType="Car" speedFactor="1.10" vaporized=""/>
    <tripinfo id="car_e2s_154" depart="154.00" departLane="e2sep_1" departPos="3.60" departPosLat="0.00" departSpeed="13.90" departDelay="0.00" arrival="315.60" arrivalLane="c2s_1" arrivalPos="990.00" arrivalPosLat="0.00" arrivalSpeed="13.96" duration="161.60" routeLength="1996.47" waitingTime="0.80" waitingCount="1" stopTime="0.00" timeLoss="18.02" rerouteNo="1" devices="tripinfo_car_e2s_154 routing_car_e2s_154" vType="Car" speedFactor="1.01" vaporized=""/>
    <tripinfo id="car_e2s_155" depart="155.45" departLane="e2sep_1" departPos="3.60" departPosLat="0.00" departSpeed="13.90" departDelay="0.45" arrival="317.45" arrivalLane="c2s_1" arrivalPos="990.00" arrivalPosLat="0.00" arrivalSpeed="15.43" duration="162.00" routeLength="1996.47" waitingTime="0.00" waitingCount="0" stopTime="0.00" timeLoss="38.82" rerouteNo="1" devices="tripinfo_car_e2s_155 routing_car_e2s_155" vType="Car" speedFactor="1.17" vaporized=""/>
    <tripinfo id="car_e2n_176" depart="176.00" departLane="e2sep_1" departPos="3.60" departPosLat="0.00" departSpeed="13.90" departDelay="0.00" arrival="319.35" arrivalLane="c2n_1" arrivalPos="990.00" arrivalPosLat="0.00" arrivalSpeed="14.38" duration="143.35" routeLength="1986.69" waitingTime="0.00" waitingCount="0" stopTime="0.00" timeLoss="4.47" rerouteNo="1" devices="tripinfo_car_e2n_176 routing_car_e2n_176" vType="Car" speedFactor="1.03" vaporized=""/>
    <tripinfo id="car_e2w_179" depart="179.00" departLane="e2sep_1" departPos="3.60" departPosLat="0.00" departSpeed="13.90" departDelay="0.00" arrival="324.30" arrivalLane="c2w_1" arrivalPos="990.00" arrivalPosLat="0.00" arrivalSpeed="13.90" duration="145.30" routeLength="1997.01" waitingTime="0.00" waitingCount="0" stopTime="0.00" timeLoss="1.62" rerouteNo="1" devices="tripinfo_car_e2w_179 routing_car_e2w_179" vType="Car" speedFactor="1.00" vaporized=""/>
    <tripinfo id="car_e2w_184" depart="184.00" departLane="e2sep_1" departPos="3.60" departPosLat="0.00" departSpeed="13.90" departDelay="0.00" arrival="326.25" arrivalLane="c2w_1" arrivalPos="990.00" arrivalPosLat="0.00" arrivalSpeed="15.30" duration="142.25" routeLength="1997.01" waitingTime="0.00" waitingCount="0" stopTime="0.00" timeLoss="17.06" rerouteNo="1" devices="tripinfo_car_e2w_184 routing_car_e2w_184" vType="Car" speedFactor="1.15" vaporized=""/>
    <tripinfo id="car_w2n_107" depart="107.00" departLane="w2sep_1" departPos="3.60" departPosLat="0.00" departSpeed="13.90" departDelay="0.00" arrival="329.70" arrivalLane="c2n_1" arrivalPos="990.00" arrivalPosLat="0.00" arrivalSpeed="13.90" duration="222.70" routeLength="1996.47" waitingTime="67.35" waitingCount="2" stopTime="0.00" timeLoss="78.37" rerouteNo="1" devices="tripinfo_car_w2n_107 routing_car_w2n_107" vType="Car" speedFactor="1.00" vaporized=""/>
    <tripinfo id="car_w2n_149" depart="149.00" departLane="w2sep_1" departPos="3.60" departPosLat="0.00" departSpeed="13.90" departDelay="0.00" arrival="334.00" arrivalLane="c2n_1" arrivalPos="990.00" arrivalPosLat="0.00" arrivalSpeed="13.89" duration="185.00" routeLength="1996.47" waitingTime="24.85" waitingCount="2" stopTime="0.00" timeLoss="40.68" rerouteNo="1" devices="tripinfo_car_w2n_149 routing_car_w2n_149" vType="Car" speedFactor="1.00" vaporized=""/>
    <tripinfo id="car_e2s_186" depart="186.00" departLane="e2sep_1" departPos="3.60" departPosLat="0.00" departSpeed="13.90" departDelay="0.00" arrival="334.55" arrivalLane="c2s_1" arrivalPos="990.00" arrivalPosLat="0.00" arrivalSpeed="13.92" duration="148.55" routeLength="1996.47" waitingTime="0.00" waitingCount="0" stopTime="0.00" timeLoss="4.47" rerouteNo="1" devices="tripinfo_car_e2s_186 routing_car_e2s_186" vType="Car" speedFactor="1.00" vaporized=""/>
    <tripinfo id="car_w2n_162" depart="162.00" departLane="w2sep_1" departPos="3.60" departPosLat="0.00" departSpeed="13.90" departDelay="0.00" arrival="337.00" arrivalLane="c2n_1" arrivalPos="990.00" arrivalPosLat="0.00" arrivalSpeed="14.15" duration="175.00" routeLength="1996.47" waitingTime="16.75" waitingCount="1" stopTime="0.00" timeLoss="33.92" rerouteNo="1" devices="tripinfo_car_w2n_162 routing_car_w2n_162" vType="Car" speedFactor="1.02" vaporized=""/>
    <tripinfo id="car_n2s_154" depart="154.00" departLane="n2sep_1" departPos="3.60" departPosLat="0.00" departSpeed="13.90" departDelay="0.00" arrival="337.60" arrivalLane="c2s_1" arrivalPos="990.00" arrivalPosLat="0.00" arrivalSpeed="15.92" duration="183.60" routeLength="1997.01" waitingTime="49.90" waitingCount="1" stopTime="0.00" timeLoss="59.15" rerouteNo="1" devices="tripinfo_car_n2s_154 routing_car_n2s_154" vType="Car" speedFactor="1.15" vaporized=""/>
    <tripinfo id="car_w2n_169" depart="169.00" departLane="w2sep_1" departPos="3.60" departPosLat="0.00" departSpeed="13.90" departDelay="0.00" arrival="340.20" arrivalLane="c2n_1" arrivalPos="990.00" arrivalPosLat="0.00" arrivalSpeed="13.95" duration="171.20" routeLength="1996.47" waitingTime="14.30" waitingCount="1" stopTime="0.00" timeLoss="27.91" rerouteNo="1" devices="tripinfo_car_w2n_169 routing_car_w2n_169" vType="Car" speedFactor="1.01" vaporized=""/>
    <tripinfo id="car_w2n_184" depart="184.00" departLane="w2sep_1" departPos="3.60" departPosLat="0.00" departSpeed="13.90" departDelay="0.00" arrival="342.80" arrivalLane="c2n_1" arrivalPos="990.00" arrivalPosLat="0.00" arrivalSpeed="14.19" duration="158.80" routeLength="1996.47" waitingTime="2.25" waitingCount="1" stopTime="0.00" timeLoss="18.72" rerouteNo="1" devices="tripinfo_car_w2n_184 routing_car_w2n_184" vType="Car" speedFactor="1.03" vaporized=""/>
    <tripinfo id="car_s2n_161" depart="161.00" departLane="s2sep_1" departPos="3.60" departPosLat="0.00" departSpeed="13.90" departDelay="0.00" arrival="346.05" arrivalLane="c2n_1" arrivalPos="990.00" arrivalPosLat="0.00" arrivalSpeed="14.16" duration="185.05" routeLength="1997.01" waitingTime="35.45" waitingCount="1" stopTime="0.00" timeLoss="44.47" rerouteNo="1" devices="tripinfo_car_s2n_161 routing_car_s2n_161" vType="Car" speedFactor="1.02" vaporized=""/>
    <tripinfo id="car_n2w_162" depart="162.00" departLane="n2sep_1" departPos="3.60" departPosLat="0.00" departSpeed="13.90" departDelay="0.00" arrival="348.00" arrivalLane="c2w_1" arrivalPos="990.00" arrivalPosLat="0.00" arrivalSpeed="13.90" duration="186.00" routeLength="1986.69" waitingTime="33.85" waitingCount="1" stopTime="0.00" timeLoss="42.34" rerouteNo="1" devices="tripinfo_car_n2w_162 routing_car_n2w_162" vType="Car" speedFactor="1.00" vaporized=""/>
    <tripinfo id="car_n2e_206" depart="206.00" departLane="n2sep_1" departPos="3.60" departPosLat="0.00" departSpeed="13.90" departDelay="0.00" arrival="348.60" arrivalLane="c2e_1" arrivalPos="990.00" arrivalPosLat="0.00" arrivalSpeed="15.18" duration="142.60" routeLength="1996.47" waitingTime="2.60" waitingCount="1" stopTime="0.00" timeLoss="10.40" rerouteNo="1" devices="tripinfo_car_n2e_206 routing_car_n2e_206" vType="Car" speedFactor="1.09" vaporized=""/>
    <tripinfo id="car_s2n_163" depart="163.00" departLane="s2sep_1" departPos="3.60" departPosLat="0.00" departSpeed="13.90" departDelay="0.00" arrival="348.65" arrivalLane="c2n_1" arrivalPos="990.00" arrivalPosLat="0.00" arrivalSpeed="14.53" duration="185.65" routeLength="1997.01" waitingTime="33.55" waitingCount="1" stopTime="0.00" timeLoss="49.56" rerouteNo="1" devices="tripinfo_car_s2n_163 routing_car_s2n_163" vType="Car" speedFactor="1.06" vaporized=""/>
    <tripinfo id="car_n2w_165" depart="165.00" departLane="n2sep_1" departPos="3.60" departPosLat="0.00" departSpeed="13.90" departDelay="0.00" arrival="349.85" arrivalLane="c2w_1" arrivalPos="990.00" arrivalPosLat="0.00" arrivalSpeed="15.50" duration="184.85" routeLength="1986.69" waitingTime="33.15" waitingCount="1" stopTime="0.00" timeLoss="63.03" rerouteNo="1" devices="tripinfo_car_n2w_165 routing_car_n2w_165" vType="Car" speedFactor="1.18" vaporized=""/>
    <tripinfo id="car_s2n_173" depart="173.00" departLane="s2sep_1" departPos="3.60" departPosLat="0.00" departSpeed="13.90" departDelay="0.00" arrival="350.95" arrivalLane="c2n_1" arrivalPos="990.00" arrivalPosLat="0.00" arrivalSpeed="14.84" duration="177.95" routeLength="1997.01" waitingTime="27.55" waitingCount="1" stopTime="0.00" timeLoss="45.78" rerouteNo="1" devices="tripinfo_car_s2n_173 routing_car_s2n_173" vType="Car" speedFactor="1.09" vaporized=""/>
    <tripinfo id="car_n2s_180" depart="180.00" departLane="n2sep_1" departPos="3.60" departPosLat="0.00" departSpeed="13.90" departDelay="0.00" arrival="351.15" arrivalLane="c2s_1" arrivalPos="990.00" arrivalPosLat="0.00" arrivalSpeed="14.13" duration="171.15" routeLength="1997.01" waitingTime="19.30" waitingCount="1" stopTime="0.00" timeLoss="29.86" rerouteNo="1" devices="tripinfo_car_n2s_180 routing_car_n2s_180" vType="Car" speedFactor="1.02" vaporized=""/>
    <tripinfo id="car_s2n_185" depart="185.00" departLane="s2sep_1" departPos="3.60" departPosLat="0.00" departSpeed="13.90" departDelay="0.00" arrival="354.95" arrivalLane="c2n_1" arrivalPos="990.00" arrivalPosLat="0.00" arrivalSpeed="13.89" duration="169.95" routeLength="1997.01" waitingTime="13.15" waitingCount="1" stopTime="0.00" timeLoss="26.25" rerouteNo="1" devices="tripinfo_car_s2n_185 routing_car_s2n_185" vType="Car" speedFactor="1.00" vaporized=""/>
    <tripinfo id="car_n2s_195" depart="195.00" departLane="n2sep_1" departPos="3.60" departPosLat="0.00" departSpeed="13.90" departDelay="0.00" arrival="355.85" arrivalLane="c2s_1" arrivalPos="990.00" arrivalPosLat="0.00" arrivalSpeed="13.99" duration="160.85" routeLength="1997.01" waitingTime="4.90" waitingCount="1" stopTime="0.00" timeLoss="18.16" rerouteNo="1" devices="tripinfo_car_n2s_195 routing_car_n2s_195" vType="Car" speedFactor="1.01" vaporized=""/>
    <tripinfo id="car_s2n_218" depart="219.35" departLane="s2sep_1" departPos="3.60" departPosLat="0.00" departSpeed="13.90" departDelay="1.35" arrival="358.55" arrivalLane="c2n_1" arrivalPos="990.00" arrivalPosLat="0.00" arrivalSpeed="14.76" duration="139.20" routeLength="1997.01" waitingTime="0.00" waitingCount="0" stopTime="0.00" timeLoss="4.30" rerouteNo="1" devices="tripinfo_car_s2n_218 routing_car_s2n_218" vType="Car" speedFactor="1.07" vaporized=""/>
    <tripinfo id="car_n2s_211" depart="211.00" departLane="n2sep_1" departPos="3.60" departPosLat="0.00" departSpeed="13.90" departDelay="0.00" arrival="358.65" arrivalLane="c2s_1" arrivalPos="990.00" arrivalPosLat="0.00" arrivalSpeed="14.40" duration="147.65" routeLength="1997.01" waitingTime="0.00" waitingCount="0" stopTime="0.00" timeLoss="9.92" rerouteNo="1" devices="tripinfo_car_n2s_211 routing_car_n2s_211" vType="Car" speedFactor="1.04" vaporized=""/>
    <tripinfo id="car_n2s_215" depart="215.00" departLane="n2sep_1" departPos="3.60" departPosLat="0.00" departSpeed="13.90" departDelay="0.00" arrival="362.05" arrivalLane="c2s_1" arrivalPos="990.00" arrivalPosLat="0.00" arrivalSpeed="14.00" duration="147.05" routeLength="1997.01" waitingTime="0.00" waitingCount="0" stopTime="0.00" timeLoss="4.76" rerouteNo="1" devices="tripinfo_car_n2s_215 routing_car_n2s_215" vType="Car" speedFactor="1.01" vaporized=""/>
    <tripinfo id="car_s2w_164" depart="164.55" departLane="s2sep_1" departPos="3.60" departPosLat="0.00" departSpeed="13.90" departDelay="0.55" arrival="362.75" arrivalLane="c2w_1" arrivalPos="990.00" arrivalPosLat="0.00" arrivalSpeed="13.90" duration="198.20" routeLength="1996.47" waitingTime="40.25" waitingCount="2" stopTime="0.00" timeLoss="53.87" rerouteNo="1" devices="tripinfo_car_s2w_164 routing_car_s2w_164" vType="Car" speedFactor="1.00" vaporized=""/>
    <tripinfo id="car_s2w_210" depart="210.00" departLane="s2sep_1" departPos="3.60" departPosLat="0.00" departSpeed="13.90" departDelay="0.00" arrival="365.90" arrivalLane="c2w_1" arrivalPos="990.00" arrivalPosLat="0.00" arrivalSpeed="14.36" duration="155.90" routeLength="1996.47" waitingTime="5.00" waitingCount="1" stopTime="0.00" timeLoss="16.81" rerouteNo="1" devices="tripinfo_car_s2w_210 routing_car_s2w_210" vType="Car" speedFactor="1.04" vaporized=""/>
    <tripinfo id="car_s2w_214" depart="214.00" departLane="s2sep_1" departPos="3.60" departPosLat="0.00" departSpeed="13.90" departDelay="0.00" arrival="368.60" arrivalLane="c2w_1" arrivalPos="990.00" arrivalPosLat="0.00" arrivalSpeed="14.56" duration="154.60" routeLength="1996.47" waitingTime="0.70" waitingCount="1" stopTime="0.00" timeLoss="18.02" rerouteNo="1" devices="tripinfo_car_s2w_214 routing_car_s2w_214" vType="Car" speedFactor="1.06" vaporized=""/>
    <tripinfo id="car_s2w_218" depart="218.00" departLane="s2sep_1" departPos="3.60" departPosLat="0.00" departSpeed="13.90" departDelay="0.00" arrival="370.80" arrivalLane="c2w_1" arrivalPos="990.00" arrivalPosLat="0.00" arrivalSpeed="14.94" duration="152.80" routeLength="1996.47" waitingTime="0.00" waitingCount="0" stopTime="0.00" timeLoss="21.27" rerouteNo="1" devices="tripinfo_car_s2w_218 routing_car_s2w_218" vType="Car" speedFactor="1.10" vaporized=""/>
    <tripinfo id="car_n2e_223" depart="223.00" departLane="n2sep_1" departPos="3.60" departPosLat="0.00" departSpeed="13.90" departDelay="0.00" arrival="370.85" arrivalLane="c2e_1" arrivalPos="990.00" arrivalPosLat="0.00" arrivalSpeed="13.90" duration="147.85" routeLength="1996.47" waitingTime="0.00" waitingCount="0" stopTime="0.00" timeLoss="3.52" rerouteNo="1" devices="tripinfo_car_n2e_223 routing_car_n2e_223" vType="Car" speedFactor="1.00" vaporized=""/>
    <tripinfo id="car_s2e_230" depart="230.00" departLane="s2sep_1" departPos="3.60" departPosLat="0.00" departSpeed="13.90" departDelay="0.00" arrival="377.80" arrivalLane="c2e_1" arrivalPos="990.00" arrivalPosLat="0.00" arrivalSpeed="13.90" duration="147.80" routeLength="1986.69" waitingTime="0.00" waitingCount="0" stopTime="0.00" timeLoss="4.10" rerouteNo="1" devices="tripinfo_car_s2e_230 routing_car_s2e_230" vType="Car" speedFactor="1.00" vaporized=""/>
    <tripinfo id="car_e2n_218" depart="218.00" departLane="e2sep_1" departPos="3.60" departPosLat="0.00" departSpeed="13.90" departDelay="0.00" arrival="383.10" arrivalLane="c2n_1" arrivalPos="990.00" arrivalPosLat="0.00" arrivalSpeed="15.59" duration="165.10" routeLength="1986.69" waitingTime="29.25" waitingCount="1" stopTime="0.00" timeLoss="37.03" rerouteNo="1" devices="tripinfo_car_e2n_218 routing_car_e2n_218" vType="Car" speedFactor="1.12" vaporized=""/>
    <tripinfo id="bus_n2e_227" depart="227.00" departLane="n2sep_1" departPos="12.10" departPosLat="0.00" departSpeed="13.90" departDelay="0.00" arrival="383.85" arrivalLane="c2e_1" arrivalPos="990.00" arrivalPosLat="0.00" arrivalSpeed="13.88" duration="156.85" routeLength="1987.97" waitingTime="0.65" waitingCount="2" stopTime="0.00" timeLoss="13.11" rerouteNo="1" devices="tripinfo_bus_n2e_227 routing_bus_n2e_227" vType="Bus" speedFactor="1.00" vaporized=""/>
    <tripinfo id="car_w2s_194" depart="194.00" departLane="w2sep_1" departPos="3.60" departPosLat="0.00" departSpeed="13.90" departDelay="0.00" arrival="387.80" arrivalLane="c2s_1" arrivalPos="990.00" arrivalPosLat="0.00" arrivalSpeed="14.49" duration="193.80" routeLength="1986.69" waitingTime="48.85" waitingCount="1" stopTime="0.00" timeLoss="56.01" rerouteNo="1" devices="tripinfo_car_w2s_194 routing_car_w2s_194" vType="Car" speedFactor="1.04" vaporized=""/>
    <tripinfo id="car_e2n_231" depart="231.00" departLane="e2sep_1" departPos="3.60" departPosLat="0.00" departSpeed="13.90" departDelay="0.00" arrival="389.50" arrivalLane="c2n_1" arrivalPos="990.00" arrivalPosLat="0.00" arrivalSpeed="14.91" duration="158.50" routeLength="1986.69" waitingTime="14.40" waitingCount="1" stopTime="0.00" timeLoss="24.57" rerouteNo="1" devices="tripinfo_car_e2n_231 routing_car_e2n_231" vType="Car" speedFactor="1.07" vaporized=""/>
    <tripinfo id="car_w2e_197" depart="197.00" departLane="w2sep_1" departPos="3.60" departPosLat="0.00" departSpeed="13.90" departDelay="0.00" arrival="391.70" arrivalLane="c2e_1" arrivalPos="990.00" arrivalPosLat="0.00" arrivalSpeed="14.21" duration="194.70" routeLength="1997.01" waitingTime="44.40" waitingCount="1" stopTime="0.00" timeLoss="54.08" rerouteNo="1" devices="tripinfo_car_w2e_197 routing_car_w2e_197" vType="Car" speedFactor="1.02" vaporized=""/>
    <tripinfo id="car_w2n_217" depart="217.00" departLane="w2sep_1" departPos="3.60" departPosLat="0.00" departSpeed="13.90" departDelay="0.00" arrival="392.95" arrivalLane="c2n_1" arrivalPos="990.00" arrivalPosLat="0.00" arrivalSpeed="15.08" duration="175.95" routeLength="1996.47" waitingTime="28.05" waitingCount="2" stopTime="0.00" timeLoss="43.32" rerouteNo="1" devices="tripinfo_car_w2n_217 routing_car_w2n_217" vType="Car" speedFactor="1.09" vaporized=""/>
    <tripinfo id="car_w2e_212" depart="212.00" departLane="w2sep_1" departPos="3.60" departPosLat="0.00" departSpeed="13.90" departDelay="0.00" arrival="394.35" arrivalLane="c2e_1" arrivalPos="990.00" arrivalPosLat="0.00" arrivalSpeed="15.01" duration="182.35" routeLength="1997.01" waitingTime="36.65" waitingCount="1" stopTime="0.00" timeLoss="50.62" rerouteNo="1" devices="tripinfo_car_w2e_212 routing_car_w2e_212" vType="Car" speedFactor="1.09" vaporized=""/>
    <tripinfo id="car_w2s_200" depart="200.00" departLane="w2sep_1" departPos="3.60" departPosLat="0.00" departSpeed="13.90" departDelay="0.00" arrival="394.80" arrivalLane="c2s_1" arrivalPos="990.00" arrivalPosLat="0.00" arrivalSpeed="14.13" duration="194.80" routeLength="1986.69" waitingTime="41.55" waitingCount="1" stopTime="0.00" timeLoss="53.50" rerouteNo="1" devices="tripinfo_car_w2s_200 routing_car_w2s_200" vType="Car" speedFactor="1.02" vaporized=""/>
    <tripinfo id="car_w2e_256" depart="256.00" departLane="w2sep_1" departPos="3.60" departPosLat="0.00" departSpeed="13.90" departDelay="0.00" arrival="397.00" arrivalLane="c2e_1" arrivalPos="990.00" arrivalPosLat="0.00" arrivalSpeed="15.12" duration="141.00" routeLength="1997.01" waitingTime="0.00" waitingCount="0" stopTime="0.00" timeLoss="10.19" rerouteNo="1" devices="tripinfo_car_w2e_256 routing_car_w2e_256" vType="Car" speedFactor="1.10" vaporized=""/>
    <tripinfo id="car_w2n_226" depart="226.00" departLane="w2sep_1" departPos="3.60" departPosLat="0.00" departSpeed="13.90" departDelay="0.00" arrival="399.30" arrivalLane="c2n_1" arrivalPos="990.00" arrivalPosLat="0.00" arrivalSpeed="13.90" duration="173.30" routeLength="1996.47" waitingTime="14.80" waitingCount="1" stopTime="0.00" timeLoss="28.96" rerouteNo="1" devices="tripinfo_car_w2n_226 routing_car_w2n_226" vType="Car" speedFactor="1.00" vaporized=""/>
    <tripinfo id="car_w2n_228" depart="228.00" departLane="w2sep_1" departPos="3.60" departPosLat="0.00" departSpeed="13.90" departDelay="0.00" arrival="403.15" arrivalLane="c2n_1" arrivalPos="990.00" arrivalPosLat="0.00" arrivalSpeed="13.88" duration="175.15" routeLength="1996.47" waitingTime="12.05" waitingCount="1" stopTime="0.00" timeLoss="30.84" rerouteNo="1" devices="tripinfo_car_w2n_228 routing_car_w2n_228" vType="Car" speedFactor="1.00" vaporized=""/>
    <tripinfo id="car_e2w_270" depart="270.00" departLane="e2sep_1" departPos="3.60" departPosLat="0.00" departSpeed="13.90" departDelay="0.00" arrival="404.40" arrivalLane="c2w_1" arrivalPos="990.00" arrivalPosLat="0.00" arrivalSpeed="14.89" duration="134.40" routeLength="1997.01" waitingTime="0.00" waitingCount="0" stopTime="0.00" timeLoss="0.23" rerouteNo="1" devices="tripinfo_car_e2w_270 routing_car_e2w_270" vType="Car" speedFactor="1.07" vaporized=""/>
    <tripinfo id="car_w2n_259" depart="259.00" departLane="w2sep_1" departPos="3.60" departPosLat="0.00" departSpeed="13.90" departDelay="0.00" arrival="405.25" arrivalLane="c2n_1" arrivalPos="990.00" arrivalPosLat="0.00" arrivalSpeed="14.81" duration="146.25" routeLength="1996.47" waitingTime="0.00" waitingCount="0" stopTime="0.00" timeLoss="14.57" rerouteNo="1" devices="tripinfo_car_w2n_259 routing_car_w2n_259" vType="Car" speedFactor="1.10" vaporized=""/>
    <tripinfo id="amb_w2e_300" depart="300.00" departLane="w2sep_1" departPos="6.60" departPosLat="0.00" departSpeed="13.90" departDelay="0.00" arrival="406.85" arrivalLane="c2e_1" arrivalPos="990.00" arrivalPosLat="0.95" arrivalSpeed="20.85" duration="106.85" routeLength="1994.01" waitingTime="0.00" waitingCount="0" stopTime="0.00" timeLoss="11.19" rerouteNo="1" devices="tripinfo_amb_w2e_300 routing_amb_w2e_300 bluelight_amb_w2e_300 fcd_amb_w2e_300" vType="Ambulance" speedFactor="1.50" vaporized="">
        <example_device customValue1="0.00" customValue2="-1.00"/>
    </tripinfo>
    <tripinfo id="car_w2s_262" depart="262.00" departLane="w2sep_1" departPos="3.60" departPosLat="0.00" departSpeed="13.90" departDelay="0.00" arrival="409.40" arrivalLane="c2s_1" arrivalPos="990.00" arrivalPosLat="0.00" arrivalSpeed="13.96" duration="147.40" routeLength="1986.69" waitingTime="0.00" waitingCount="0" stopTime="0.00" timeLoss="4.34" rerouteNo="1" devices="tripinfo_car_w2s_262 routing_car_w2s_262" vType="Car" speedFactor="1.00" vaporized=""/>
    <tripinfo id="car_w2s_272" depart="272.00" departLane="w2sep_1" departPos="3.60" departPosLat="0.00" departSpeed="13.90" departDelay="0.00" arrival="411.65" arrivalLane="c2s_1" arrivalPos="990.00" arrivalPosLat="0.00" arrivalSpeed="15.01" duration="139.65" routeLength="1986.69" waitingTime="0.00" waitingCount="0" stopTime="0.00" timeLoss="9.43" rerouteNo="1" devices="tripinfo_car_w2s_272 routing_car_w2s_272" vType="Car" speedFactor="1.10" vaporized=""/>
    <tripinfo id="car_w2s_291" depart="291.00" departLane="w2sep_1" departPos="3.60" departPosLat="0.00" departSpeed="13.90" departDelay="0.00" arrival="423.60" arrivalLane="c2s_1" arrivalPos="990.00" arrivalPosLat="0.00" arrivalSpeed="15.55" duration="132.60" routeLength="1986.69" waitingTime="0.00" waitingCount="0" stopTime="0.00" timeLoss="4.16" rerouteNo="1" devices="tripinfo_car_w2s_291 routing_car_w2s_291" vType="Car" speedFactor="1.12" vaporized=""/>
    <tripinfo id="car_e2n_280" depart="280.00" departLane="e2sep_1" departPos="3.60" departPosLat="0.00" departSpeed="13.90" departDelay="0.00" arrival="433.45" arrivalLane="c2n_1" arrivalPos="990.00" arrivalPosLat="0.00" arrivalSpeed="14.35" duration="153.45" routeLength="1986.69" waitingTime="6.15" waitingCount="1" stopTime="0.00" timeLoss="14.28" rerouteNo="1" devices="tripinfo_car_e2n_280 routing_car_e2n_280" vType="Car" speedFactor="1.03" vaporized=""/>
    <tripinfo id="car_e2s_276" depart="276.00" departLane="e2sep_1" departPos="3.60" departPosLat="0.00" departSpeed="13.90" departDelay="0.00" arrival="435.35" arrivalLane="c2s_1" arrivalPos="990.00" arrivalPosLat="0.00" arrivalSpeed="14.23" duration="159.35" routeLength="1996.47" waitingTime="10.80" waitingCount="1" stopTime="0.00" timeLoss="18.33" rerouteNo="1" devices="tripinfo_car_e2s_276 routing_car_e2s_276" vType="Car" speedFactor="1.02" vaporized=""/>
    <tripinfo id="car_s2n_249" depart="249.00" departLane="s2sep_1" departPos="3.60" departPosLat="0.00" departSpeed="13.90" departDelay="0.00" arrival="450.45" arrivalLane="c2n_1" arrivalPos="990.00" arrivalPosLat="0.00" arrivalSpeed="14.38" duration="201.45" routeLength="1997.01" waitingTime="55.25" waitingCount="1" stopTime="0.00" timeLoss="62.54" rerouteNo="1" devices="tripinfo_car_s2n_249 routing_car_s2n_249" vType="Car" speedFactor="1.03" vaporized=""/>
    <tripinfo id="car_n2s_238" depart="238.00" departLane="n2sep_1" departPos="3.60" departPosLat="0.00" departSpeed="13.90" departDelay="0.00" arrival="451.80" arrivalLane="c2s_1" arrivalPos="990.00" arrivalPosLat="0.00" arrivalSpeed="14.09" duration="213.80" routeLength="1997.01" waitingTime="65.05" waitingCount="1" stopTime="0.00" timeLoss="72.10" rerouteNo="1" devices="tripinfo_car_n2s_238 routing_car_n2s_238" vType="Car" speedFactor="1.01" vaporized=""/>
    <tripinfo id="car_s2n_251" depart="251.00" departLane="s2sep_1" departPos="3.60" departPosLat="0.00" departSpeed="13.90" departDelay="0.00" arrival="453.75" arrivalLane="c2n_1" arrivalPos="990.00" arrivalPosLat="0.00" arrivalSpeed="14.75" duration="202.75" routeLength="1997.01" waitingTime="53.20" waitingCount="1" stopTime="0.00" timeLoss="67.82" rerouteNo="1" devices="tripinfo_car_s2n_251 routing_car_s2n_251" vType="Car" speedFactor="1.06" vaporized=""/>
    <tripinfo id="car_n2s_312" depart="312.00" departLane="n2sep_1" departPos="3.60" departPosLat="0.00" departSpeed="13.90" departDelay="0.00" arrival="455.50" arrivalLane="c2s_1" arrivalPos="990.00" arrivalPosLat="0.00" arrivalSpeed="14.32" duration="143.50" routeLength="1997.01" waitingTime="0.00" waitingCount="0" stopTime="0.00" timeLoss="4.31" rerouteNo="1" devices="tripinfo_car_n2s_312 routing_car_n2s_312" vType="Car" speedFactor="1.03" vaporized=""/>
    <tripinfo id="car_n2w_313" depart="313.40" departLane="n2sep_1" departPos="3.60" departPosLat="0.00" departSpeed="13.90" departDelay="0.40" arrival="455.75" arrivalLane="c2w_1" arrivalPos="990.00" arrivalPosLat="0.00" arrivalSpeed="14.85" duration="142.35" routeLength="1986.69" waitingTime="0.00" waitingCount="0" stopTime="0.00" timeLoss="7.84" rerouteNo="1" devices="tripinfo_car_n2w_313 routing_car_n2w_313" vType="Car" speedFactor="1.07" vaporized=""/>
    <tripinfo id="car_s2e_251" depart="252.55" departLane="s2sep_1" departPos="3.60" departPosLat="0.00" departSpeed="13.90" departDelay="1.55" arrival="457.15" arrivalLane="c2e_1" arrivalPos="990.00" arrivalPosLat="0.00" arrivalSpeed="13.90" duration="204.60" routeLength="1986.69" waitingTime="49.20" waitingCount="1" stopTime="0.00" timeLoss="60.94" rerouteNo="1" devices="tripinfo_car_s2e_251 routing_car_s2e_251" vType="Car" speedFactor="1.00" vaporized=""/>
    <tripinfo id="car_s2e_255" depart="255.00" departLane="s2sep_1" departPos="3.60" departPosLat="0.00" departSpeed="13.90" departDelay="0.00" arrival="461.00" arrivalLane="c2e_1" arrivalPos="990.00" arrivalPosLat="0.00" arrivalSpeed="14.11" duration="206.00" routeLength="1986.69" waitingTime="47.45" waitingCount="1" stopTime="0.00" timeLoss="64.69" rerouteNo="1" devices="tripinfo_car_s2e_255 routing_car_s2e_255" vType="Car" speedFactor="1.02" vaporized=""/>
    <tripinfo id="car_s2n_257" depart="257.00" departLane="s2sep_1" departPos="3.60" departPosLat="0.00" departSpeed="13.90" departDelay="0.00" arrival="461.20" arrivalLane="c2n_1" arrivalPos="990.00" arrivalPosLat="0.00" arrivalSpeed="14.02" duration="204.20" routeLength="1997.01" waitingTime="45.70" waitingCount="1" stopTime="0.00" timeLoss="61.80" rerouteNo="1" devices="tripinfo_car_s2n_257 routing_car_s2n_257" vType="Car" speedFactor="1.01" vaporized=""/>
    <tripinfo id="car_n2w_314" depart="315.10" departLane="n2sep_1" departPos="3.60" departPosLat="0.00" departSpeed="13.90" departDelay="1.10" arrival="462.10" arrivalLane="c2w_1" arrivalPos="990.00" arrivalPosLat="0.00" arrivalSpeed="14.42" duration="147.00" routeLength="1986.69" waitingTime="0.00" waitingCount="0" stopTime="0.00" timeLoss="8.51" rerouteNo="1" devices="tripinfo_car_n2w_314 routing_car_n2w_314" vType="Car" speedFactor="1.04" vaporized=""/>
    <tripinfo id="car_s2e_257" depart="258.75" departLane="s2sep_1" departPos="3.60" departPosLat="0.00" departSpeed="13.90" departDelay="1.75" arrival="463.20" arrivalLane="c2e_1" arrivalPos="990.00" arrivalPosLat="0.00" arrivalSpeed="14.91" duration="204.45" routeLength="1986.69" waitingTime="44.95" waitingCount="1" stopTime="0.00" timeLoss="73.41" rerouteNo="1" devices="tripinfo_car_s2e_257 routing_car_s2e_257" vType="Car" speedFactor="1.10" vaporized=""/>
    <tripinfo id="car_s2e_260" depart="260.55" departLane="s2sep_1" departPos="3.60" departPosLat="0.00" departSpeed="13.90" departDelay="0.55" arrival="465.10" arrivalLane="c2e_1" arrivalPos="990.00" arrivalPosLat="0.00" arrivalSpeed="15.59" duration="204.55" routeLength="1986.69" waitingTime="44.35" waitingCount="1" stopTime="0.00" timeLoss="82.49" rerouteNo="1" devices="tripinfo_car_s2e_260 routing_car_s2e_260" vType="Car" speedFactor="1.18" vaporized=""/>
    <tripinfo id="car_s2w_271" depart="271.00" departLane="s2sep_1" departPos="3.60" departPosLat="0.00" departSpeed="13.90" departDelay="0.00" arrival="468.15" arrivalLane="c2w_1" arrivalPos="990.00" arrivalPosLat="0.00" arrivalSpeed="13.90" duration="197.15" routeLength="1996.47" waitingTime="36.30" waitingCount="2" stopTime="0.00" timeLoss="52.80" rerouteNo="1" devices="tripinfo_car_s2w_271 routing_car_s2w_271" vType="Car" speedFactor="1.00" vaporized=""/>
    <tripinfo id="car_s2e_267" depart="267.00" departLane="s2sep_1" departPos="3.60" departPosLat="0.00" departSpeed="13.90" departDelay="0.00" arrival="469.80" arrivalLane="c2e_1" arrivalPos="990.00" arrivalPosLat="0.00" arrivalSpeed="13.94" duration="202.80" routeLength="1986.69" waitingTime="42.30" waitingCount="1" stopTime="0.00" timeLoss="59.59" rerouteNo="1" devices="tripinfo_car_s2e_267 routing_car_s2e_267" vType="Car" speedFactor="1.00" vaporized=""/>
</tripinfos>
