<?xml version="1.0" encoding="UTF-8"?>

<!-- generated on 2021-05-18 05:16:47 by Eclipse SUMO sumo Version 1.9.1
<configuration xmlns:xsi="http://www.w3.org/2001/XMLSchema-instance" xsi:noNamespaceSchemaLocation="http://sumo.dlr.de/xsd/sumoConfiguration.xsd">

    <input>
        <net-file value="sumofiles/junction.net.xml"/>
        <route-files value="sumofiles/junction_radius_7.rou.xml"/>
        <additional-files value="sumofiles/junction.det.xml"/>
    </input>

    <output>
        <tripinfo-output value="sumofiles/output/tripinfo_radius_7.xml"/>
    </output>

    <time>
        <begin value="0"/>
        <end value="10000"/>
        <step-length value="1.0"/>
    </time>

    <processing>
        <lateral-resolution value="0.5"/>
    </processing>

    <report>
        <no-warnings value="true"/>
        <error-log value="sumofiles/output/errorlog_radius_7.log"/>
        <no-step-log value="true"/>
    </report>

    <traci_server>
        <remote-port value="45589"/>
    </traci_server>

    <gui_only>
        <gui-settings-file value="sumofiles/junction-gui.settings.xml"/>
        <tracker-interval value="1"/>
    </gui_only>

</configuration>
-->

<tripinfos xmlns:xsi="http://www.w3.org/2001/XMLSchema-instance" xsi:noNamespaceSchemaLocation="http://sumo.dlr.de/xsd/tripinfo_file.xsd">
    <tripinfo id="car_e2n_5" depart="5.00" departLane="e2sep_1" departPos="3.60" departPosLat="0.00" departSpeed="13.90" departDelay="0.00" arrival="144.00" arrivalLane="c2n_1" arrivalPos="990.00" arrivalPosLat="0.00" arrivalSpeed="15.05" duration="139.00" routeLength="1986.69" waitingTime="0.00" waitingCount="0" stopTime="0.00" timeLoss="5.69" rerouteNo="1" devices="tripinfo_car_e2n_5 routing_car_e2n_5" vType="Car" speedFactor="1.08" vaporized=""/>
    <tripinfo id="car_e2s_10" depart="10.00" departLane="e2sep_1" departPos="3.60" departPosLat="0.00" departSpeed="13.90" departDelay="0.00" arrival="152.00" arrivalLane="c2s_1" arrivalPos="990.00" arrivalPosLat="0.00" arrivalSpeed="14.54" duration="142.00" routeLength="1996.47" waitingTime="0.00" waitingCount="0" stopTime="0.00" timeLoss="3.10" rerouteNo="1" devices="tripinfo_car_e2s_10 routing_car_e2s_10" vType="Car" speedFactor="1.05" vaporized=""/>
    <tripinfo id="car_n2w_3" depart="3.00" departLane="n2sep_1" departPos="3.60" departPosLat="0.00" departSpeed="13.90" departDelay="0.00" arrival="160.00" arrivalLane="c2w_1" arrivalPos="990.00" arrivalPosLat="0.00" arrivalSpeed="14.73" duration="157.00" routeLength="1986.69" waitingTime="11.00" waitingCount="1" stopTime="0.00" timeLoss="21.68" rerouteNo="1" devices="tripinfo_car_n2w_3 routing_car_n2w_3" vType="Car" speedFactor="1.06" vaporized=""/>
    <tripinfo id="car_s2n_17" depart="17.00" departLane="s2sep_1" departPos="3.60" departPosLat="0.00" departSpeed="13.90" departDelay="0.00" arrival="162.00" arrivalLane="c2n_1" arrivalPos="990.00" arrivalPosLat="0.00" arrivalSpeed="14.32" duration="145.00" routeLength="1997.01" waitingTime="0.00" waitingCount="0" stopTime="0.00" timeLoss="5.17" rerouteNo="1" devices="tripinfo_car_s2n_17 routing_car_s2n_17" vType="Car" speedFactor="1.03" vaporized=""/>
    <tripinfo id="car_n2s_4" depart="5.00" departLane="n2sep_1" departPos="3.60" departPosLat="0.00" departSpeed="13.90" departDelay="1.00" arrival="163.00" arrivalLane="c2s_1" arrivalPos="990.00" arrivalPosLat="0.00" arrivalSpeed="14.73" duration="158.00" routeLength="1997.01" waitingTime="9.00" waitingCount="1" stopTime="0.00" timeLoss="21.96" rerouteNo="1" devices="tripinfo_car_n2s_4 routing_car_n2s_4" vType="Car" speedFactor="1.06" vaporized=""/>
    <tripinfo id="car_s2n_22" depart="22.00" departLane="s2sep_1" departPos="3.60" departPosLat="0.00" departSpeed="13.90" departDelay="0.00" arrival="166.00" arrivalLane="c2n_1" arrivalPos="990.00" arrivalPosLat="0.00" arrivalSpeed="14.54" duration="144.00" routeLength="1997.01" waitingTime="0.00" waitingCount="0" stopTime="0.00" timeLoss="6.12" rerouteNo="1" devices="tripinfo_car_s2n_22 routing_car_s2n_22" vType="Car" speedFactor="1.05" vaporized=""/>
    <tripinfo id="car_n2e_6" depart="9.00" departLane="n2sep_1" departPos="3.60" departPosLat="0.00" departSpeed="13.90" departDelay="3.00" arrival="167.00" arrivalLane="c2e_1" arrivalPos="990.00" arrivalPosLat="0.00" arrivalSpeed="14.32" duration="158.00" routeLength="1996.47" waitingTime="3.00" waitingCount="1" stopTime="0.00" timeLoss="17.32" rerouteNo="1" devices="tripinfo_car_n2e_6 routing_car_n2e_6" vType="Car" speedFactor="1.03" vaporized=""/>
    <tripinfo id="car_n2s_5" depart="7.00" departLane="n2sep_1" departPos="3.60" departPosLat="0.00" departSpeed="13.90" departDelay="2.00" arrival="169.00" arrivalLane="c2s_1" arrivalPos="990.00" arrivalPosLat="0.00" arrivalSpeed="14.04" duration="162.00" routeLength="1997.01" waitingTime="5.00" waitingCount="1" stopTime="0.00" timeLoss="19.80" rerouteNo="1" devices="tripinfo_car_n2s_5 routing_car_n2s_5" vType="Car" speedFactor="1.01" vaporized=""/>
    <tripinfo id="bus_s2n_26" depart="26.00" departLane="s2sep_1" departPos="12.10" departPosLat="0.00" departSpeed="13.90" departDelay="0.00" arrival="172.00" arrivalLane="c2n_1" arrivalPos="990.00" arrivalPosLat="0.00" arrivalSpeed="13.89" duration="146.00" routeLength="1988.51" waitingTime="0.00" waitingCount="0" stopTime="0.00" timeLoss="2.86" rerouteNo="1" devices="tripinfo_bus_s2n_26 routing_bus_s2n_26" vType="Bus" speedFactor="1.00" vaporized=""/>
    <tripinfo id="car_n2s_13" depart="13.00" departLane="n2sep_1" departPos="3.60" departPosLat="0.00" departSpeed="13.90" departDelay="0.00" arrival="173.00" arrivalLane="c2s_1" arrivalPos="990.00" arrivalPosLat="0.00" arrivalSpeed="14.03" duration="160.00" routeLength="1997.01" waitingTime="2.00" waitingCount="1" stopTime="0.00" timeLoss="17.72" rerouteNo="1" devices="tripinfo_car_n2s_13 routing_car_n2s_13" vType="Car" speedFactor="1.01" vaporized=""/>
    <tripinfo id="car_s2n_33" depart="33.00" departLane="s2sep_1" departPos="3.60" departPosLat="0.00" departSpeed="13.90" departDelay="0.00" arrival="176.00" arrivalLane="c2n_1" arrivalPos="990.00" arrivalPosLat="0.00" arrivalSpeed="14.50" duration="143.00" routeLength="1997.01" waitingTime="0.00" waitingCount="0" stopTime="0.00" timeLoss="5.00" rerouteNo="1" devices="tripinfo_car_s2n_33 routing_car_s2n_33" vType="Car" speedFactor="1.05" vaporized=""/>
    <tripinfo id="car_s2e_37" depart="37.00" departLane="s2sep_1" departPos="3.60" departPosLat="0.00" departSpeed="13.90" departDelay="0.00" arrival="186.00" arrivalLane="c2e_1" arrivalPos="990.00" arrivalPosLat="0.00" arrivalSpeed="13.90" duration="149.00" routeLength="1986.69" waitingTime="0.00" waitingCount="0" stopTime="0.00" timeLoss="5.17" rerouteNo="1" devices="tripinfo_car_s2e_37 routing_car_s2e_37" vType="Car" speedFactor="1.00" vaporized=""/>
    <tripinfo id="car_n2w_38" depart="38.00" departLane="n2sep_1" departPos="3.60" departPosLat="0.00" departSpeed="13.90" departDelay="0.00" arrival="187.00" arrivalLane="c2w_1" arrivalPos="990.00" arrivalPosLat="0.00" arrivalSpeed="13.90" duration="149.00" routeLength="1986.69" waitingTime="0.00" waitingCount="0" stopTime="0.00" timeLoss="5.00" rerouteNo="1" devices="tripinfo_car_n2w_38 routing_car_n2w_38" vType="Car" speedFactor="1.00" vaporized=""/>
    <tripinfo id="car_n2s_44" depart="44.00" departLane="n2sep_1" departPos="3.60" departPosLat="0.00" departSpeed="13.90" departDelay="0.00" arrival="188.00" arrivalLane="c2s_1" arrivalPos="990.00" arrivalPosLat="0.00" arrivalSpeed="14.15" duration="144.00" routeLength="1997.01" waitingTime="0.00" waitingCount="0" stopTime="0.00" timeLoss="2.36" rerouteNo="1" devices="tripinfo_car_n2s_44 routing_car_n2s_44" vType="Car" speedFactor="1.02" vaporized=""/>
    <tripinfo id="car_s2n_44" depart="44.00" departLane="s2sep_1" departPos="3.60" departPosLat="0.00" departSpeed="13.90" departDelay="0.00" arrival="188.00" arrivalLane="c2n_1" arrivalPos="990.00" arrivalPosLat="0.00" arrivalSpeed="14.04" duration="144.00" routeLength="1997.01" waitingTime="0.00" waitingCount="0" stopTime="0.00" timeLoss="1.45" rerouteNo="1" devices="tripinfo_car_s2n_44 routing_car_s2n_44" vType="Car" speedFactor="1.01" vaporized=""/>
    <tripinfo id="car_n2s_49" depart="49.00" departLane="n2sep_1" departPos="3.60" departPosLat="0.00" departSpeed="13.90" departDelay="0.00" arrival="190.00" arrivalLane="c2s_1" arrivalPos="990.00" arrivalPosLat="0.00" arrivalSpeed="15.22" duration="141.00" routeLength="1997.01" waitingTime="0.00" waitingCount="0" stopTime="0.00" timeLoss="12.74" rerouteNo="1" devices="tripinfo_car_n2s_49 routing_car_n2s_49" vType="Car" speedFactor="1.12" vaporized=""/>
    <tripinfo id="car_n2e_46" depart="46.00" departLane="n2sep_1" departPos="3.60" departPosLat="0.00" departSpeed="13.90" departDelay="0.00" arrival="193.00" arrivalLane="c2e_1" arrivalPos="990.00" arrivalPosLat="0.00" arrivalSpeed="14.27" duration="147.00" routeLength="1996.47" waitingTime="0.00" waitingCount="0" stopTime="0.00" timeLoss="6.16" rerouteNo="1" devices="tripinfo_car_n2e_46 routing_car_n2e_46" vType="Car" speedFactor="1.03" vaporized=""/>
    <tripinfo id="car_s2w_50" depart="50.00" departLane="s2sep_1" departPos="3.60" departPosLat="0.00" departSpeed="13.90" departDelay="0.00" arrival="200.00" arrivalLane="c2w_1" arrivalPos="990.00" arrivalPosLat="0.00" arrivalSpeed="13.90" duration="150.00" routeLength="1996.47" waitingTime="0.00" waitingCount="0" stopTime="0.00" timeLoss="4.90" rerouteNo="1" devices="tripinfo_car_s2w_50 routing_car_s2w_50" vType="Car" speedFactor="1.00" vaporized=""/>
    <tripinfo id="car_s2w_59" depart="59.00" departLane="s2sep_1" departPos="3.60" departPosLat="0.00" departSpeed="13.90" departDelay="0.00" arrival="202.00" arrivalLane="c2w_1" arrivalPos="990.00" arrivalPosLat="0.00" arrivalSpeed="15.42" duration="143.00" routeLength="1996.47" waitingTime="0.00" waitingCount="0" stopTime="0.00" timeLoss="17.23" rerouteNo="1" devices="tripinfo_car_s2w_59 routing_car_s2w_59" vType="Car" speedFactor="1.15" vaporized=""/>
    <tripinfo id="car_s2w_66" depart="66.00" departLane="s2sep_1" departPos="3.60" departPosLat="0.00" departSpeed="13.90" departDelay="0.00" arrival="204.00" arrivalLane="c2w_1" arrivalPos="990.00" arrivalPosLat="0.00" arrivalSpeed="15.72" duration="138.00" routeLength="1996.47" waitingTime="0.00" waitingCount="0" stopTime="0.00" timeLoss="14.83" rerouteNo="1" devices="tripinfo_car_s2w_66 routing_car_s2w_66" vType="Car" speedFactor="1.18" vaporized=""/>
    <tripinfo id="car_e2n_17" depart="17.00" departLane="e2sep_1" departPos="3.60" departPosLat="0.00" departSpeed="13.90" departDelay="0.00" arrival="207.00" arrivalLane="c2n_1" arrivalPos="990.00" arrivalPosLat="0.00" arrivalSpeed="15.05" duration="190.00" routeLength="1986.69" waitingTime="45.00" waitingCount="1" stopTime="0.00" timeLoss="56.82" rerouteNo="1" devices="tripinfo_car_e2n_17 routing_car_e2n_17" vType="Car" speedFactor="1.08" vaporized=""/>
    <tripinfo id="car_w2s_51" depart="51.00" departLane="w2sep_1" departPos="3.60" departPosLat="0.00" departSpeed="13.90" departDelay="0.00" arrival="209.00" arrivalLane="c2s_1" arrivalPos="990.00" arrivalPosLat="0.00" arrivalSpeed="13.90" duration="158.00" routeLength="1986.69" waitingTime="5.00" waitingCount="1" stopTime="0.00" timeLoss="14.55" rerouteNo="1" devices="tripinfo_car_w2s_51 routing_car_w2s_51" vType="Car" speedFactor="1.00" vaporized=""/>
    <tripinfo id="car_e2w_7" depart="7.00" departLane="e2sep_1" departPos="3.60" departPosLat="0.00" departSpeed="13.90" departDelay="0.00" arrival="210.00" arrivalLane="c2w_1" arrivalPos="990.00" arrivalPosLat="0.00" arrivalSpeed="13.90" duration="203.00" routeLength="1997.01" waitingTime="48.00" waitingCount="1" stopTime="0.00" timeLoss="59.15" rerouteNo="1" devices="tripinfo_car_e2w_7 routing_car_e2w_7" vType="Car" speedFactor="1.00" vaporized=""/>
    <tripinfo id="car_e2n_21" depart="21.00" departLane="e2sep_1" departPos="3.60" departPosLat="0.00" departSpeed="13.90" departDelay="0.00" arrival="211.00" arrivalLane="c2n_1" arrivalPos="990.00" arrivalPosLat="0.00" arrivalSpeed="15.14" duration="190.00" routeLength="1986.69" waitingTime="42.00" waitingCount="1" stopTime="0.00" timeLoss="58.07" rerouteNo="1" devices="tripinfo_car_e2n_21 routing_car_e2n_21" vType="Car" speedFactor="1.09" vaporized=""/>
    <tripinfo id="car_w2s_58" depart="58.00" departLane="w2sep_1" departPos="3.60" departPosLat="0.00" departSpeed="13.90" departDelay="0.00" arrival="211.00" arrivalLane="c2s_1" arrivalPos="990.00" arrivalPosLat="0.00" arrivalSpeed="15.62" duration="153.00" routeLength="1986.69" waitingTime="4.00" waitingCount="1" stopTime="0.00" timeLoss="30.91" rerouteNo="1" devices="tripinfo_car_w2s_58 routing_car_w2s_58" vType="Car" speedFactor="1.18" vaporized=""/>
    <tripinfo id="car_w2s_62" depart="62.00" departLane="w2sep_1" departPos="3.60" departPosLat="0.00" departSpeed="13.90" departDelay="0.00" arrival="213.00" arrivalLane="c2s_1" arrivalPos="990.00" arrivalPosLat="0.00" arrivalSpeed="15.67" duration="151.00" routeLength="1986.69" waitingTime="4.00" waitingCount="1" stopTime="0.00" timeLoss="28.21" rerouteNo="1" devices="tripinfo_car_w2s_62 routing_car_w2s_62" vType="Car" speedFactor="1.17" vaporized=""/>
    <tripinfo id="car_e2s_26" depart="26.00" departLane="e2sep_1" departPos="3.60" departPosLat="0.00" departSpeed="13.90" departDelay="0.00" arrival="215.00" arrivalLane="c2s_1" arrivalPos="990.00" arrivalPosLat="0.00" arrivalSpeed="15.24" duration="189.00" routeLength="1996.47" waitingTime="37.00" waitingCount="1" stopTime="0.00" timeLoss="60.51" rerouteNo="1" devices="tripinfo_car_e2s_26 routing_car_e2s_26" vType="Car" speedFactor="1.12" vaporized=""/>
    <tripinfo id="car_e2w_22" depart="23.00" departLane="e2sep_1" departPos="3.60" departPosLat="0.00" departSpeed="13.90" departDelay="1.00" arrival="216.00" arrivalLane="c2w_1" arrivalPos="990.00" arrivalPosLat="0.00" arrivalSpeed="14.26" duration="193.00" routeLength="1997.01" waitingTime="38.00" waitingCount="1" stopTime="0.00" timeLoss="52.65" rerouteNo="1" devices="tripinfo_car_e2w_22 routing_car_e2w_22" vType="Car" speedFactor="1.03" vaporized=""/>
    <tripinfo id="car_e2n_32" depart="32.00" departLane="e2sep_1" departPos="3.60" departPosLat="0.00" departSpeed="13.90" departDelay="0.00" arrival="221.00" arrivalLane="c2n_1" arrivalPos="990.00" arrivalPosLat="0.00" arrivalSpeed="13.90" duration="189.00" routeLength="1986.69" waitingTime="29.00" waitingCount="1" stopTime="0.00" timeLoss="44.55" rerouteNo="1" devices="tripinfo_car_e2n_32 routing_car_e2n_32" vType="Car" speedFactor="1.00" vaporized=""/>
    <tripinfo id="car_e2s_36" depart="36.00" departLane="e2sep_1" departPos="3.60" departPosLat="0.00" departSpeed="13.90" departDelay="0.00" arrival="221.00" arrivalLane="c2s_1" arrivalPos="990.00" arrivalPosLat="0.00" arrivalSpeed="13.90" duration="185.00" routeLength="1996.47" waitingTime="21.00" waitingCount="1" stopTime="0.00" timeLoss="40.33" rerouteNo="1" devices="tripinfo_car_e2s_36 routing_car_e2s_36" vType="Car" speedFactor="1.00" vaporized=""/>
    <tripinfo id="car_e2s_40" depart="40.00" departLane="e2sep_1" departPos="3.60" departPosLat="0.00" departSpeed="13.90" departDelay="0.00" arrival="223.00" arrivalLane="c2s_1" arrivalPos="990.00" arrivalPosLat="0.00" arrivalSpeed="15.43" duration="183.00" routeLength="1996.47" waitingTime="21.00" waitingCount="1" stopTime="0.00" timeLoss="57.84" rerouteNo="1" devices="tripinfo_car_e2s_40 routing_car_e2s_40" vType="Car" speedFactor="1.16" vaporized=""/>
    <tripinfo id="car_e2w_64" depart="64.00" departLane="e2sep_1" departPos="3.60" departPosLat="0.00" departSpeed="13.90" departDelay="0.00" arrival="224.00" arrivalLane="c2w_1" arrivalPos="990.00" arrivalPosLat="0.00" arrivalSpeed="14.17" duration="160.00" routeLength="1997.01" waitingTime="0.00" waitingCount="0" stopTime="0.00" timeLoss="19.00" rerouteNo="1" devices="tripinfo_car_e2w_64 routing_car_e2w_64" vType="Car" speedFactor="1.02" vaporized=""/>
    <tripinfo id="car_e2s_45" depart="45.00" departLane="e2sep_1" departPos="3.60" departPosLat="0.00" departSpeed="13.90" departDelay="0.00" arrival="225.00" arrivalLane="c2s_1" arrivalPos="990.00" arrivalPosLat="0.00" arrivalSpeed="14.86" duration="180.00" routeLength="1996.47" waitingTime="19.00" waitingCount="1" stopTime="0.00" timeLoss="47.37" rerouteNo="1" devices="tripinfo_car_e2s_45 routing_car_e2s_45" vType="Car" speedFactor="1.09" vaporized=""/>
    <tripinfo id="car_e2n_60" depart="60.00" departLane="e2sep_1" departPos="3.60" departPosLat="0.00" departSpeed="13.90" departDelay="0.00" arrival="225.00" arrivalLane="c2n_1" arrivalPos="990.00" arrivalPosLat="0.00" arrivalSpeed="13.96" duration="165.00" routeLength="1986.69" waitingTime="3.00" waitingCount="1" stopTime="0.00" timeLoss="21.62" rerouteNo="1" devices="tripinfo_car_e2n_60 routing_car_e2n_60" vType="Car" speedFactor="1.01" vaporized=""/>
    <tripinfo id="car_e2s_51" depart="51.00" departLane="e2sep_1" departPos="3.60" departPosLat="0.00" departSpeed="13.90" departDelay="0.00" arrival="227.00" arrivalLane="c2s_1" arrivalPos="990.00" arrivalPosLat="0.00" arrivalSpeed="15.24" duration="176.00" routeLength="1996.47" waitingTime="18.00" waitingCount="1" stopTime="0.00" timeLoss="48.25" rerouteNo="1" devices="tripinfo_car_e2s_51 routing_car_e2s_51" vType="Car" speedFactor="1.13" vaporized=""/>
    <tripinfo id="car_e2n_80" depart="81.00" departLane="e2sep_1" departPos="3.60" departPosLat="0.00" departSpeed="13.90" departDelay="1.00" arrival="227.00" arrivalLane="c2n_1" arrivalPos="990.00" arrivalPosLat="0.00" arrivalSpeed="14.88" duration="146.00" routeLength="1986.69" waitingTime="0.00" waitingCount="0" stopTime="0.00" timeLoss="14.27" rerouteNo="1" devices="tripinfo_car_e2n_80 routing_car_e2n_80" vType="Car" speedFactor="1.09" vaporized=""/>
    <tripinfo id="car_e2w_79" depart="79.00" departLane="e2sep_1" departPos="3.60" departPosLat="0.00" departSpeed="13.90" departDelay="0.00" arrival="229.00" arrivalLane="c2w_1" arrivalPos="990.00" arrivalPosLat="0.00" arrivalSpeed="14.15" duration="150.00" routeLength="1997.01" waitingTime="0.00" waitingCount="0" stopTime="0.00" timeLoss="8.01" rerouteNo="1" devices="tripinfo_car_e2w_79 routing_car_e2w_79" vType="Car" speedFactor="1.02" vaporized=""/>
    <tripinfo id="car_w2n_47" depart="47.00" departLane="w2sep_1" departPos="3.60" departPosLat="0.00" departSpeed="13.90" departDelay="0.00" arrival="231.00" arrivalLane="c2n_1" arrivalPos="990.00" arrivalPosLat="0.00" arrivalSpeed="14.54" duration="184.00" routeLength="1996.47" waitingTime="28.00" waitingCount="2" stopTime="0.00" timeLoss="46.09" rerouteNo="1" devices="tripinfo_car_w2n_47 routing_car_w2n_47" vType="Car" speedFactor="1.05" vaporized=""/>
    <tripinfo id="car_e2s_62" depart="62.00" departLane="e2sep_1" departPos="3.60" departPosLat="0.00" departSpeed="13.90" departDelay="0.00" arrival="232.00" arrivalLane="c2s_1" arrivalPos="990.00" arrivalPosLat="0.00" arrivalSpeed="13.90" duration="170.00" routeLength="1996.47" waitingTime="0.00" waitingCount="0" stopTime="0.00" timeLoss="25.14" rerouteNo="1" devices="tripinfo_car_e2s_62 routing_car_e2s_62" vType="Car" speedFactor="1.00" vaporized=""/>
    <tripinfo id="car_e2s_69" depart="69.00" departLane="e2sep_1" departPos="3.60" departPosLat="0.00" departSpeed="13.90" departDelay="0.00" arrival="234.00" arrivalLane="c2s_1" arrivalPos="990.00" arrivalPosLat="0.00" arrivalSpeed="15.42" duration="165.00" routeLength="1996.47" waitingTime="0.00" waitingCount="0" stopTime="0.00" timeLoss="39.76" rerouteNo="1" devices="tripinfo_car_e2s_69 routing_car_e2s_69" vType="Car" speedFactor="1.16" vaporized=""/>
    <tripinfo id="car_e2s_108" depart="108.00" departLane="e2sep_1" departPos="3.60" departPosLat="0.00" departSpeed="13.90" departDelay="0.00" arrival="237.00" arrivalLane="c2s_1" arrivalPos="990.00" arrivalPosLat="0.00" arrivalSpeed="16.12" duration="129.00" routeLength="1996.47" waitingTime="0.00" waitingCount="0" stopTime="0.00" timeLoss="4.83" rerouteNo="1" devices="tripinfo_car_e2s_108 routing_car_e2s_108" vType="Car" speedFactor="1.17" vaporized=""/>
    <tripinfo id="car_w2n_103" depart="103.00" departLane="w2sep_1" departPos="3.60" departPosLat="0.00" departSpeed="13.90" departDelay="0.00" arrival="250.00" arrivalLane="c2n_1" arrivalPos="990.00" arrivalPosLat="0.00" arrivalSpeed="13.90" duration="147.00" routeLength="1996.47" waitingTime="0.00" waitingCount="0" stopTime="0.00" timeLoss="2.33" rerouteNo="1" devices="tripinfo_car_w2n_103 routing_car_w2n_103" vType="Car" speedFactor="1.00" vaporized=""/>
    <tripinfo id="car_n2w_66" depart="66.00" departLane="n2sep_1" departPos="3.60" departPosLat="0.00" departSpeed="13.90" departDelay="0.00" arrival="254.00" arrivalLane="c2w_1" arrivalPos="990.00" arrivalPosLat="0.00" arrivalSpeed="13.90" duration="188.00" routeLength="1986.69" waitingTime="35.00" waitingCount="1" stopTime="0.00" timeLoss="44.52" rerouteNo="1" devices="tripinfo_car_n2w_66 routing_car_n2w_66" vType="Car" speedFactor="1.00" vaporized=""/>
    <tripinfo id="car_s2n_51" depart="52.00" departLane="s2sep_1" departPos="3.60" departPosLat="0.00" departSpeed="13.90" departDelay="1.00" arrival="256.00" arrivalLane="c2n_1" arrivalPos="990.00" arrivalPosLat="0.00" arrivalSpeed="13.90" duration="204.00" routeLength="1997.01" waitingTime="49.00" waitingCount="1" stopTime="0.00" timeLoss="59.50" rerouteNo="1" devices="tripinfo_car_s2n_51 routing_car_s2n_51" vType="Car" speedFactor="1.00" vaporized=""/>
    <tripinfo id="car_s2e_82" depart="82.00" departLane="s2sep_1" departPos="3.60" departPosLat="0.00" departSpeed="13.90" departDelay="0.00" arrival="257.00" arrivalLane="c2e_1" arrivalPos="990.00" arrivalPosLat="0.00" arrivalSpeed="14.50" duration="175.00" routeLength="1986.69" waitingTime="24.00" waitingCount="1" stopTime="0.00" timeLoss="37.05" rerouteNo="1" devices="tripinfo_car_s2e_82 routing_car_s2e_82" vType="Car" speedFactor="1.04" vaporized=""/>
    <tripinfo id="car_s2n_67" depart="68.00" departLane="s2sep_1" departPos="3.60" departPosLat="0.00" departSpeed="13.90" departDelay="1.00" arrival="258.00" arrivalLane="c2n_1" arrivalPos="990.00" arrivalPosLat="0.00" arrivalSpeed="14.93" duration="190.00" routeLength="1997.01" waitingTime="40.00" waitingCount="1" stopTime="0.00" timeLoss="59.03" rerouteNo="1" devices="tripinfo_car_s2n_67 routing_car_s2n_67" vType="Car" speedFactor="1.10" vaporized=""/>
    <tripinfo id="car_n2w_72" depart="72.00" departLane="n2sep_1" departPos="3.60" departPosLat="0.00" departSpeed="13.90" departDelay="0.00" arrival="258.00" arrivalLane="c2w_1" arrivalPos="990.00" arrivalPosLat="0.00" arrivalSpeed="14.30" duration="186.00" routeLength="1986.69" waitingTime="32.00" waitingCount="1" stopTime="0.00" timeLoss="46.01" rerouteNo="1" devices="tripinfo_car_n2w_72 routing_car_n2w_72" vType="Car" speedFactor="1.03" vaporized=""/>
    <tripinfo id="car_n2w_85" depart="85.00" departLane="n2sep_1" departPos="3.60" departPosLat="0.00" departSpeed="13.90" departDelay="0.00" arrival="260.00" arrivalLane="c2w_1" arrivalPos="990.00" arrivalPosLat="0.00" arrivalSpeed="14.84" duration="175.00" routeLength="1986.69" waitingTime="24.00" waitingCount="1" stopTime="0.00" timeLoss="42.82" rerouteNo="1" devices="tripinfo_car_n2w_85 routing_car_n2w_85" vType="Car" speedFactor="1.09" vaporized=""/>
    <tripinfo id="car_n2s_88" depart="88.00" departLane="n2sep_1" departPos="3.60" departPosLat="0.00" departSpeed="13.90" departDelay="0.00" arrival="262.00" arrivalLane="c2s_1" arrivalPos="990.00" arrivalPosLat="0.00" arrivalSpeed="14.04" duration="174.00" routeLength="1997.01" waitingTime="17.00" waitingCount="1" stopTime="0.00" timeLoss="30.89" rerouteNo="1" devices="tripinfo_car_n2s_88 routing_car_n2s_88" vType="Car" speedFactor="1.01" vaporized=""/>
    <tripinfo id="car_s2e_90" depart="90.00" departLane="s2sep_1" departPos="3.60" departPosLat="0.00" departSpeed="13.90" departDelay="0.00" arrival="264.00" arrivalLane="c2e_1" arrivalPos="990.00" arrivalPosLat="0.00" arrivalSpeed="13.90" duration="174.00" routeLength="1986.69" waitingTime="15.00" waitingCount="1" stopTime="0.00" timeLoss="29.92" rerouteNo="1" devices="tripinfo_car_s2e_90 routing_car_s2e_90" vType="Car" speedFactor="1.00" vaporized=""/>
    <tripinfo id="car_s2w_80" depart="80.00" departLane="s2sep_1" departPos="3.60" departPosLat="0.00" departSpeed="13.90" departDelay="0.00" arrival="266.00" arrivalLane="c2w_1" arrivalPos="990.00" arrivalPosLat="0.00" arrivalSpeed="14.42" duration="186.00" routeLength="1996.47" waitingTime="30.00" waitingCount="2" stopTime="0.00" timeLoss="46.58" rerouteNo="1" devices="tripinfo_car_s2w_80 routing_car_s2w_80" vType="Car" speedFactor="1.04" vaporized=""/>
    <tripinfo id="car_s2n_121" depart="121.00" departLane="s2sep_1" departPos="3.60" departPosLat="0.00" departSpeed="13.90" departDelay="0.00" arrival="266.00" arrivalLane="c2n_1" arrivalPos="990.00" arrivalPosLat="0.00" arrivalSpeed="13.90" duration="145.00" routeLength="1997.01" waitingTime="0.00" waitingCount="0" stopTime="0.00" timeLoss="1.30" rerouteNo="1" devices="tripinfo_car_s2n_121 routing_car_s2n_121" vType="Car" speedFactor="1.00" vaporized=""/>
    <tripinfo id="bus_n2s_98" depart="98.00" departLane="n2sep_1" departPos="12.10" departPosLat="0.00" departSpeed="13.90" departDelay="0.00" arrival="267.00" arrivalLane="c2s_1" arrivalPos="990.00" arrivalPosLat="0.00" arrivalSpeed="13.87" duration="169.00" routeLength="1988.51" waitingTime="10.00" waitingCount="1" stopTime="0.00" timeLoss="25.43" rerouteNo="1" devices="tripinfo_bus_n2s_98 routing_bus_n2s_98" vType="Bus" speedFactor="1.00" vaporized=""/>
    <tripinfo id="car_n2w_130" depart="130.00" departLane="n2sep_1" departPos="3.60" departPosLat="0.00" departSpeed="13.90" departDelay="0.00" arrival="276.00" arrivalLane="c2w_1" arrivalPos="990.00" arrivalPosLat="0.00" arrivalSpeed="14.23" duration="146.00" routeLength="1986.69" waitingTime="0.00" waitingCount="0" stopTime="0.00" timeLoss="5.06" rerouteNo="1" devices="tripinfo_car_n2w_130 routing_car_n2w_130" vType="Car" speedFactor="1.02" vaporized=""/>
    <tripinfo id="car_n2w_144" depart="144.00" departLane="n2sep_1" departPos="3.60" departPosLat="0.00" departSpeed="13.90" departDelay="0.00" arrival="278.00" arrivalLane="c2w_1" arrivalPos="990.00" arrivalPosLat="0.00" arrivalSpeed="15.75" duration="134.00" routeLength="1986.69" waitingTime="0.00" waitingCount="0" stopTime="0.00" timeLoss="11.31" rerouteNo="1" devices="tripinfo_car_n2w_144 routing_car_n2w_144" vType="Car" speedFactor="1.18" vaporized=""/>
    <tripinfo id="car_s2w_122" depart="123.00" departLane="s2sep_1" departPos="3.60" departPosLat="0.00" departSpeed="13.90" departDelay="1.00" arrival="286.00" arrivalLane="c2w_1" arrivalPos="990.00" arrivalPosLat="0.00" arrivalSpeed="13.90" duration="163.00" routeLength="1996.47" waitingTime="6.00" waitingCount="1" stopTime="0.00" timeLoss="18.24" rerouteNo="1" devices="tripinfo_car_s2w_122 routing_car_s2w_122" vType="Car" speedFactor="1.00" vaporized=""/>
    <tripinfo id="car_e2n_125" depart="125.00" departLane="e2sep_1" departPos="3.60" departPosLat="0.00" departSpeed="13.90" departDelay="0.00" arrival="294.00" arrivalLane="c2n_1" arrivalPos="990.00" arrivalPosLat="0.00" arrivalSpeed="15.88" duration="169.00" routeLength="1986.69" waitingTime="30.00" waitingCount="1" stopTime="0.00" timeLoss="42.38" rerouteNo="1" devices="tripinfo_car_e2n_125 routing_car_e2n_125" vType="Car" speedFactor="1.14" vaporized=""/>
    <tripinfo id="car_e2n_139" depart="139.00" departLane="e2sep_1" departPos="3.60" departPosLat="0.00" departSpeed="13.90" departDelay="0.00" arrival="299.00" arrivalLane="c2n_1" arrivalPos="990.00" arrivalPosLat="0.00" arrivalSpeed="15.55" duration="160.00" routeLength="1986.69" waitingTime="17.00" waitingCount="1" stopTime="0.00" timeLoss="31.22" rerouteNo="1" devices="tripinfo_car_e2n_139 routing_car_e2n_139" vType="Car" speedFactor="1.12" vaporized=""/>
    <tripinfo id="car_w2e_97" depart="97.00" departLane="w2sep_1" departPos="3.60" departPosLat="0.00" departSpeed="13.90" departDelay="0.00" arrival="300.00" arrivalLane="c2e_1" arrivalPos="990.00" arrivalPosLat="0.00" arrivalSpeed="13.90" duration="203.00" routeLength="1997.01" waitingTime="50.00" waitingCount="1" stopTime="0.00" timeLoss="58.57" rerouteNo="1" devices="tripinfo_car_w2e_97 routing_car_w2e_97" vType="Car" speedFactor="1.00" vaporized=""/>
    <tripinfo id="car_e2w_106" depart="106.00" departLane="e2sep_1" departPos="3.60" departPosLat="0.00" departSpeed="13.90" departDelay="0.00" arrival="300.00" arrivalLane="c2w_1" arrivalPos="990.00" arrivalPosLat="0.00" arrivalSpeed="13.90" duration="194.00" routeLength="1997.01" waitingTime="40.00" waitingCount="1" stopTime="0.00" timeLoss="49.67" rerouteNo="1" devices="tripinfo_car_e2w_106 routing_car_e2w_106" vType="Car" speedFactor="1.00" vaporized=""/>
    <tripinfo id="car_w2e_138" depart="138.00" departLane="w2sep_1" departPos="3.60" departPosLat="0.00" departSpeed="13.90" departDelay="0.00" arrival="302.00" arrivalLane="c2e_1" arrivalPos="990.00" arrivalPosLat="0.00" arrivalSpeed="14.77" duration="164.00" routeLength="1997.01" waitingTime="14.00" waitingCount="1" stopTime="0.00" timeLoss="30.95" rerouteNo="1" devices="tripinfo_car_w2e_138 routing_car_w2e_138" vType="Car" speedFactor="1.08" vaporized=""/>
    <tripinfo id="car_w2s_144" depart="144.00" departLane="w2sep_1" departPos="3.60" departPosLat="0.00" departSpeed="13.90" departDelay="0.00" arrival="305.00" arrivalLane="c2s_1" arrivalPos="990.00" arrivalPosLat="0.00" arrivalSpeed="13.90" duration="161.00" routeLength="1986.69" waitingTime="4.00" waitingCount="1" stopTime="0.00" timeLoss="16.98" rerouteNo="1" devices="tripinfo_car_w2s_144 routing_car_w2s_144" vType="Car" speedFactor="1.00" vaporized=""/>
    <tripinfo id="car_w2e_158" depart="158.00" departLane="w2sep_1" departPos="3.60" departPosLat="0.00" departSpeed="13.90" departDelay="0.00" arrival="307.00" arrivalLane="c2e_1" arrivalPos="990.00" arrivalPosLat="0.00" arrivalSpeed="14.20" duration="149.00" routeLength="1997.01" waitingTime="0.00" waitingCount="0" stopTime="0.00" timeLoss="7.88" rerouteNo="1" devices="tripinfo_car_w2e_158 routing_car_w2e_158" vType="Car" speedFactor="1.02" vaporized=""/>
    <tripinfo id="car_e2w_166" depart="166.00" departLane="e2sep_1" departPos="3.60" departPosLat="0.00" departSpeed="13.90" departDelay="0.00" arrival="308.00" arrivalLane="c2w_1" arrivalPos="990.00" arrivalPosLat="0.00" arrivalSpeed="14.17" duration="142.00" routeLength="1997.01" waitingTime="0.00" waitingCount="0" stopTime="0.00" timeLoss="0.97" rerouteNo="1" devices="tripinfo_car_e2w_166 routing_car_e2w_166" vType="Car" speedFactor="1.02" vaporized=""/>
    <tripinfo id="car_e2s_118" depart="118.00" departLane="e2sep_1" departPos="3.60" departPosLat="0.00" departSpeed="13.90" departDelay="0.00" arrival="311.00" arrivalLane="c2s_1" arrivalPos="990.00" arrivalPosLat="0.00" arrivalSpeed="13.94" duration="193.00" routeLength="1996.47" waitingTime="32.00" waitingCount="2" stopTime="0.00" timeLoss="48.43" rerouteNo="1" devices="tripinfo_car_e2s_118 routing_car_e2s_118" vType="Car" speedFactor="1.00" vaporized=""/>
    <tripinfo id="car_w2n_112" depart="112.00" departLane="w2sep_1" departPos="3.60" departPosLat="0.00" departSpeed="13.90" departDelay="0.00" arrival="312.00" arrivalLane="c2n_1" arrivalPos="990.00" arrivalPosLat="0.00" arrivalSpeed="14.13" duration="200.00" routeLength="1996.47" waitingTime="42.00" waitingCount="2" stopTime="0.00" timeLoss="57.64" rerouteNo="1" devices="tripinfo_car_w2n_112 routing_car_w2n_112" vType="Car" speedFactor="1.02" vaporized=""/>
    <tripinfo id="car_e2s_168" depart="168.00" departLane="e2sep_1" departPos="3.60" departPosLat="0.00" departSpeed="13.90" departDelay="0.00" arrival="318.00" arrivalLane="c2s_1" arrivalPos="990.00" arrivalPosLat="0.00" arrivalSpeed="13.90" duration="150.00" routeLength="1996.47" waitingTime="0.00" waitingCount="0" stopTime="0.00" timeLoss="5.04" rerouteNo="1" devices="tripinfo_car_e2s_168 routing_car_e2s_168" vType="Car" speedFactor="1.00" vaporized=""/>
    <tripinfo id="car_e2n_172" depart="172.00" departLane="e2sep_1" departPos="3.60" departPosLat="0.00" departSpeed="13.90" departDelay="0.00" arrival="318.00" arrivalLane="c2n_1" arrivalPos="990.00" arrivalPosLat="0.00" arrivalSpeed="14.35" duration="146.00" routeLength="1986.69" waitingTime="0.00" waitingCount="0" stopTime="0.00" timeLoss="6.16" rerouteNo="1" devices="tripinfo_car_e2n_172 routing_car_e2n_172" vType="Car" speedFactor="1.03" vaporized=""/>
    <tripinfo id="car_e2s_174" depart="174.00" departLane="e2sep_1" departPos="3.60" departPosLat="0.00" departSpeed="13.90" departDelay="0.00" arrival="324.00" arrivalLane="c2s_1" arrivalPos="990.00" arrivalPosLat="0.00" arrivalSpeed="14.00" duration="150.00" routeLength="1996.47" waitingTime="0.00" waitingCount="0" stopTime="0.00" timeLoss="5.87" rerouteNo="1" devices="tripinfo_car_e2s_174 routing_car_e2s_174" vType="Car" speedFactor="1.01" vaporized=""/>
    <tripinfo id="car_e2n_177" depart="177.00" departLane="e2sep_1" departPos="3.60" departPosLat="0.00" departSpeed="13.90" departDelay="0.00" arrival="324.00" arrivalLane="c2n_1" arrivalPos="990.00" arrivalPosLat="0.00" arrivalSpeed="14.38" duration="147.00" routeLength="1986.69" waitingTime="0.00" waitingCount="0" stopTime="0.00" timeLoss="7.22" rerouteNo="1" devices="tripinfo_car_e2n_177 routing_car_e2n_177" vType="Car" speedFactor="1.03" vaporized=""/>
    <tripinfo id="car_w2n_114" depart="114.00" departLane="w2sep_1" departPos="3.60" departPosLat="0.00" departSpeed="13.90" departDelay="0.00" arrival="326.00" arrivalLane="c2n_1" arrivalPos="990.00" arrivalPosLat="0.00" arrivalSpeed="15.00" duration="212.00" routeLength="1996.47" waitingTime="46.00" waitingCount="3" stopTime="0.00" timeLoss="80.11" rerouteNo="1" devices="tripinfo_car_w2n_114 routing_car_w2n_114" vType="Car" speedFactor="1.10" vaporized=""/>
    <tripinfo id="car_w2n_132" depart="132.00" departLane="w2sep_1" departPos="3.60" departPosLat="0.00" departSpeed="13.90" departDelay="0.00" arrival="328.00" arrivalLane="c2n_1" arrivalPos="990.00" arrivalPosLat="0.00" arrivalSpeed="15.36" duration="196.00" routeLength="1996.47" waitingTime="36.00" waitingCount="3" stopTime="0.00" timeLoss="68.62" rerouteNo="1" devices="tripinfo_car_w2n_132 routing_car_w2n_132" vType="Car" speedFactor="1.13" vaporized=""/>
    <tripinfo id="car_w2n_140" depart="140.00" departLane="w2sep_1" departPos="3.60" departPosLat="0.00" departSpeed="13.90" departDelay="0.00" arrival="333.00" arrivalLane="c2n_1" arrivalPos="990.00" arrivalPosLat="0.00" arrivalSpeed="14.12" duration="193.00" routeLength="1996.47" waitingTime="22.00" waitingCount="3" stopTime="0.00" timeLoss="50.57" rerouteNo="1" devices="tripinfo_car_w2n_140 routing_car_w2n_140" vType="Car" speedFactor="1.02" vaporized=""/>
    <tripinfo id="car_w2n_167" depart="167.00" departLane="w2sep_1" departPos="3.60" departPosLat="0.00" departSpeed="13.90" departDelay="0.00" arrival="336.00" arrivalLane="c2n_1" arrivalPos="990.00" arrivalPosLat="0.00" arrivalSpeed="14.59" duration="169.00" routeLength="1996.47" waitingTime="6.00" waitingCount="2" stopTime="0.00" timeLoss="31.61" rerouteNo="1" devices="tripinfo_car_w2n_167 routing_car_w2n_167" vType="Car" speedFactor="1.06" vaporized=""/>
    <tripinfo id="car_w2n_180" depart="180.00" departLane="w2sep_1" departPos="3.60" departPosLat="0.00" departSpeed="13.90" departDelay="0.00" arrival="340.00" arrivalLane="c2n_1" arrivalPos="990.00" arrivalPosLat="0.00" arrivalSpeed="13.89" duration="160.00" routeLength="1996.47" waitingTime="0.00" waitingCount="0" stopTime="0.00" timeLoss="15.02" rerouteNo="1" devices="tripinfo_car_w2n_180 routing_car_w2n_180" vType="Car" speedFactor="1.00" vaporized=""/>
    <tripinfo id="car_n2w_165" depart="165.00" departLane="n2sep_1" departPos="3.60" departPosLat="0.00" departSpeed="13.90" departDelay="0.00" arrival="344.00" arrivalLane="c2w_1" arrivalPos="990.00" arrivalPosLat="0.00" arrivalSpeed="13.90" duration="179.00" routeLength="1986.69" waitingTime="26.00" waitingCount="1" stopTime="0.00" timeLoss="35.51" rerouteNo="1" devices="tripinfo_car_n2w_165 routing_car_n2w_165" vType="Car" speedFactor="1.00" vaporized=""/>
    <tripinfo id="bus_s2n_145" depart="145.00" departLane="s2sep_1" departPos="12.10" departPosLat="0.00" departSpeed="13.90" departDelay="0.00" arrival="349.00" arrivalLane="c2n_1" arrivalPos="990.00" arrivalPosLat="0.00" arrivalSpeed="13.90" duration="204.00" routeLength="1988.51" waitingTime="48.00" waitingCount="1" stopTime="0.00" timeLoss="59.98" rerouteNo="1" devices="tripinfo_bus_s2n_145 routing_bus_s2n_145" vType="Bus" speedFactor="1.00" vaporized=""/>
    <tripinfo id="car_n2w_194" depart="194.00" departLane="n2sep_1" departPos="3.60" departPosLat="0.00" departSpeed="13.90" departDelay="0.00" arrival="349.00" arrivalLane="c2w_1" arrivalPos="990.00" arrivalPosLat="0.00" arrivalSpeed="13.90" duration="155.00" routeLength="1986.69" waitingTime="0.00" waitingCount="0" stopTime="0.00" timeLoss="10.94" rerouteNo="1" devices="tripinfo_car_n2w_194 routing_car_n2w_194" vType="Car" speedFactor="1.00" vaporized=""/>
    <tripinfo id="car_s2n_153" depart="153.00" departLane="s2sep_1" departPos="3.60" departPosLat="0.00" departSpeed="13.90" departDelay="0.00" arrival="351.00" arrivalLane="c2n_1" arrivalPos="990.00" arrivalPosLat="0.00" arrivalSpeed="15.41" duration="198.00" routeLength="1997.01" waitingTime="47.00" waitingCount="1" stopTime="0.00" timeLoss="73.12" rerouteNo="1" devices="tripinfo_car_s2n_153 routing_car_s2n_153" vType="Car" speedFactor="1.15" vaporized=""/>
    <tripinfo id="car_n2w_199" depart="199.00" departLane="n2sep_1" departPos="3.60" departPosLat="0.00" departSpeed="13.90" departDelay="0.00" arrival="352.00" arrivalLane="c2w_1" arrivalPos="990.00" arrivalPosLat="0.00" arrivalSpeed="14.41" duration="153.00" routeLength="1986.69" waitingTime="0.00" waitingCount="0" stopTime="0.00" timeLoss="14.64" rerouteNo="1" devices="tripinfo_car_n2w_199 routing_car_n2w_199" vType="Car" speedFactor="1.04" vaporized=""/>
    <tripinfo id="car_s2n_154" depart="157.00" departLane="s2sep_1" departPos="3.60" departPosLat="0.00" departSpeed="13.90" departDelay="3.00" arrival="353.00" arrivalLane="c2n_1" arrivalPos="990.00" arrivalPosLat="0.00" arrivalSpeed="15.65" duration="196.00" routeLength="1997.01" waitingTime="45.00" waitingCount="1" stopTime="0.00" timeLoss="72.89" rerouteNo="1" devices="tripinfo_car_s2n_154 routing_car_s2n_154" vType="Car" speedFactor="1.17" vaporized=""/>
    <tripinfo id="car_s2e_161" depart="161.00" departLane="s2sep_1" departPos="3.60" departPosLat="0.00" departSpeed="13.90" departDelay="0.00" arrival="353.00" arrivalLane="c2e_1" arrivalPos="990.00" arrivalPosLat="0.00" arrivalSpeed="14.22" duration="192.00" routeLength="1986.69" waitingTime="35.00" waitingCount="1" stopTime="0.00" timeLoss="50.83" rerouteNo="1" devices="tripinfo_car_s2e_161 routing_car_s2e_161" vType="Car" speedFactor="1.02" vaporized=""/>
    <tripinfo id="car_n2s_202" depart="204.00" departLane="n2sep_1" departPos="3.60" departPosLat="0.00" departSpeed="13.90" departDelay="2.00" arrival="354.00" arrivalLane="c2s_1" arrivalPos="990.00" arrivalPosLat="0.00" arrivalSpeed="14.21" duration="150.00" routeLength="1997.01" waitingTime="0.00" waitingCount="0" stopTime="0.00" timeLoss="8.74" rerouteNo="1" devices="tripinfo_car_n2s_202 routing_car_n2s_202" vType="Car" speedFactor="1.02" vaporized=""/>
    <tripinfo id="car_s2n_173" depart="173.00" departLane="s2sep_1" departPos="3.60" departPosLat="0.00" departSpeed="13.90" departDelay="0.00" arrival="355.00" arrivalLane="c2n_1" arrivalPos="990.00" arrivalPosLat="0.00" arrivalSpeed="15.01" duration="182.00" routeLength="1997.01" waitingTime="30.00" waitingCount="1" stopTime="0.00" timeLoss="51.47" rerouteNo="1" devices="tripinfo_car_s2n_173 routing_car_s2n_173" vType="Car" speedFactor="1.10" vaporized=""/>
    <tripinfo id="car_s2e_187" depart="187.00" departLane="s2sep_1" departPos="3.60" departPosLat="0.00" departSpeed="13.90" departDelay="0.00" arrival="355.00" arrivalLane="c2e_1" arrivalPos="990.00" arrivalPosLat="0.00" arrivalSpeed="15.57" duration="168.00" routeLength="1986.69" waitingTime="21.00" waitingCount="1" stopTime="0.00" timeLoss="42.42" rerouteNo="1" devices="tripinfo_car_s2e_187 routing_car_s2e_187" vType="Car" speedFactor="1.15" vaporized=""/>
    <tripinfo id="car_n2w_202" depart="202.00" departLane="n2sep_1" departPos="3.60" departPosLat="0.00" departSpeed="13.90" departDelay="0.00" arrival="355.00" arrivalLane="c2w_1" arrivalPos="990.00" arrivalPosLat="0.00" arrivalSpeed="13.96" duration="153.00" routeLength="1986.69" waitingTime="0.00" waitingCount="0" stopTime="0.00" timeLoss="10.38" rerouteNo="1" devices="tripinfo_car_n2w_202 routing_car_n2w_202" vType="Car" speedFactor="1.01" vaporized=""/>
    <tripinfo id="car_n2e_169" depart="169.00" departLane="n2sep_1" departPos="3.60" departPosLat="0.00" departSpeed="13.90" departDelay="0.00" arrival="358.00" arrivalLane="c2e_1" arrivalPos="990.00" arrivalPosLat="0.00" arrivalSpeed="16.24" duration="189.00" routeLength="1996.47" waitingTime="47.00" waitingCount="2" stopTime="0.00" timeLoss="65.83" rerouteNo="1" devices="tripinfo_car_n2e_169 routing_car_n2e_169" vType="Car" speedFactor="1.18" vaporized=""/>
    <tripinfo id="car_s2n_174" depart="175.00" departLane="s2sep_1" departPos="3.60" departPosLat="0.00" departSpeed="13.90" departDelay="1.00" arrival="358.00" arrivalLane="c2n_1" arrivalPos="990.00" arrivalPosLat="0.00" arrivalSpeed="14.98" duration="183.00" routeLength="1997.01" waitingTime="27.00" waitingCount="1" stopTime="0.00" timeLoss="50.08" rerouteNo="1" devices="tripinfo_car_s2n_174 routing_car_s2n_174" vType="Car" speedFactor="1.09" vaporized=""/>
    <tripinfo id="car_s2w_154" depart="155.00" departLane="s2sep_1" departPos="3.60" departPosLat="0.00" departSpeed="13.90" departDelay="1.00" arrival="359.00" arrivalLane="c2w_1" arrivalPos="990.00" arrivalPosLat="0.00" arrivalSpeed="13.96" duration="204.00" routeLength="1996.47" waitingTime="43.00" waitingCount="2" stopTime="0.00" timeLoss="60.28" rerouteNo="1" devices="tripinfo_car_s2w_154 routing_car_s2w_154" vType="Car" speedFactor="1.01" vaporized=""/>
    <tripinfo id="car_s2w_156" depart="159.00" departLane="s2sep_1" departPos="3.60" departPosLat="0.00" departSpeed="13.90" departDelay="3.00" arrival="362.00" arrivalLane="c2w_1" arrivalPos="990.00" arrivalPosLat="0.00" arrivalSpeed="14.38" duration="203.00" routeLength="1996.47" waitingTime="40.00" waitingCount="2" stopTime="0.00" timeLoss="63.89" rerouteNo="1" devices="tripinfo_car_s2w_156 routing_car_s2w_156" vType="Car" speedFactor="1.04" vaporized=""/>
    <tripinfo id="car_s2n_205" depart="205.00" departLane="s2sep_1" departPos="3.60" departPosLat="0.00" departSpeed="13.90" departDelay="0.00" arrival="363.00" arrivalLane="c2n_1" arrivalPos="990.00" arrivalPosLat="0.00" arrivalSpeed="14.13" duration="158.00" routeLength="1997.01" waitingTime="0.00" waitingCount="0" stopTime="0.00" timeLoss="16.27" rerouteNo="1" devices="tripinfo_car_s2n_205 routing_car_s2n_205" vType="Car" speedFactor="1.02" vaporized=""/>
    <tripinfo id="car_s2w_182" depart="182.00" departLane="s2sep_1" departPos="3.60" departPosLat="0.00" departSpeed="13.90" departDelay="0.00" arrival="365.00" arrivalLane="c2w_1" arrivalPos="990.00" arrivalPosLat="0.00" arrivalSpeed="14.26" duration="183.00" routeLength="1996.47" waitingTime="19.00" waitingCount="2" stopTime="0.00" timeLoss="42.44" rerouteNo="1" devices="tripinfo_car_s2w_182 routing_car_s2w_182" vType="Car" speedFactor="1.03" vaporized=""/>
    <tripinfo id="car_n2w_228" depart="228.00" departLane="n2sep_1" departPos="3.60" departPosLat="0.00" departSpeed="13.90" departDelay="0.00" arrival="367.00" arrivalLane="c2w_1" arrivalPos="990.00" arrivalPosLat="0.00" arrivalSpeed="15.12" duration="139.00" routeLength="1986.69" waitingTime="0.00" waitingCount="0" stopTime="0.00" timeLoss="10.42" rerouteNo="1" devices="tripinfo_car_n2w_228 routing_car_n2w_228" vType="Car" speedFactor="1.12" vaporized=""/>
    <tripinfo id="car_n2e_180" depart="180.00" departLane="n2sep_1" departPos="3.60" departPosLat="0.00" departSpeed="13.90" departDelay="0.00" arrival="368.00" arrivalLane="c2e_1" arrivalPos="990.00" arrivalPosLat="0.00" arrivalSpeed="14.13" duration="188.00" routeLength="1996.47" waitingTime="27.00" waitingCount="2" stopTime="0.00" timeLoss="45.29" rerouteNo="1" devices="tripinfo_car_n2e_180 routing_car_n2e_180" vType="Car" speedFactor="1.02" vaporized=""/>
    <tripinfo id="car_n2e_212" depart="212.00" departLane="n2sep_1" departPos="3.60" departPosLat="0.00" departSpeed="13.90" departDelay="0.00" arrival="371.00" arrivalLane="c2e_1" arrivalPos="990.00" arrivalPosLat="0.00" arrivalSpeed="14.45" duration="159.00" routeLength="1996.47" waitingTime="6.00" waitingCount="1" stopTime="0.00" timeLoss="20.19" rerouteNo="1" devices="tripinfo_car_n2e_212 routing_car_n2e_212" vType="Car" speedFactor="1.04" vaporized=""/>
    <tripinfo id="car_n2e_217" depart="217.00" departLane="n2sep_1" departPos="3.60" departPosLat="0.00" departSpeed="13.90" departDelay="0.00" arrival="373.00" arrivalLane="c2e_1" arrivalPos="990.00" arrivalPosLat="0.00" arrivalSpeed="14.89" duration="156.00" routeLength="1996.47" waitingTime="4.00" waitingCount="1" stopTime="0.00" timeLoss="23.60" rerouteNo="1" devices="tripinfo_car_n2e_217 routing_car_n2e_217" vType="Car" speedFactor="1.09" vaporized=""/>
    <tripinfo id="car_s2w_236" depart="236.00" departLane="s2sep_1" departPos="3.60" departPosLat="0.00" departSpeed="13.90" departDelay="0.00" arrival="383.00" arrivalLane="c2w_1" arrivalPos="990.00" arrivalPosLat="0.00" arrivalSpeed="13.90" duration="147.00" routeLength="1996.47" waitingTime="0.00" waitingCount="0" stopTime="0.00" timeLoss="2.33" rerouteNo="1" devices="tripinfo_car_s2w_236 routing_car_s2w_236" vType="Car" speedFactor="1.00" vaporized=""/>
    <tripinfo id="car_e2w_210" depart="210.00" departLane="e2sep_1" departPos="3.60" departPosLat="0.00" departSpeed="13.90" departDelay="0.00" arrival="388.00" arrivalLane="c2w_1" arrivalPos="990.00" arrivalPosLat="0.00" arrivalSpeed="14.42" duration="178.00" routeLength="1997.01" waitingTime="28.00" waitingCount="1" stopTime="0.00" timeLoss="39.10" rerouteNo="1" devices="tripinfo_car_e2w_210 routing_car_e2w_210" vType="Car" speedFactor="1.04" vaporized=""/>
    <tripinfo id="car_e2n_221" depart="221.00" departLane="e2sep_1" departPos="3.60" departPosLat="0.00" departSpeed="13.90" departDelay="0.00" arrival="388.00" arrivalLane="c2n_1" arrivalPos="990.00" arrivalPosLat="0.00" arrivalSpeed="14.69" duration="167.00" routeLength="1986.69" waitingTime="20.00" waitingCount="1" stopTime="0.00" timeLoss="31.12" rerouteNo="1" devices="tripinfo_car_e2n_221 routing_car_e2n_221" vType="Car" speedFactor="1.06" vaporized=""/>
    <tripinfo id="car_w2s_198" depart="198.00" departLane="w2sep_1" departPos="3.60" departPosLat="0.00" departSpeed="13.90" departDelay="0.00" arrival="389.00" arrivalLane="c2s_1" arrivalPos="990.00" arrivalPosLat="0.00" arrivalSpeed="13.92" duration="191.00" routeLength="1986.69" waitingTime="38.00" waitingCount="1" stopTime="0.00" timeLoss="47.64" rerouteNo="1" devices="tripinfo_car_w2s_198 routing_car_w2s_198" vType="Car" speedFactor="1.00" vaporized=""/>
    <tripinfo id="car_w2s_226" depart="226.00" departLane="w2sep_1" departPos="3.60" departPosLat="0.00" departSpeed="13.90" departDelay="0.00" arrival="392.00" arrivalLane="c2s_1" arrivalPos="990.00" arrivalPosLat="0.00" arrivalSpeed="14.98" duration="166.00" routeLength="1986.69" waitingTime="16.00" waitingCount="1" stopTime="0.00" timeLoss="33.19" rerouteNo="1" devices="tripinfo_car_w2s_226 routing_car_w2s_226" vType="Car" speedFactor="1.09" vaporized=""/>
    <tripinfo id="car_e2w_230" depart="230.00" departLane="e2sep_1" departPos="3.60" departPosLat="0.00" departSpeed="13.90" departDelay="0.00" arrival="392.00" arrivalLane="c2w_1" arrivalPos="990.00" arrivalPosLat="0.00" arrivalSpeed="14.78" duration="162.00" routeLength="1997.01" waitingTime="12.00" waitingCount="1" stopTime="0.00" timeLoss="26.28" rerouteNo="1" devices="tripinfo_car_e2w_230 routing_car_e2w_230" vType="Car" speedFactor="1.07" vaporized=""/>
    <tripinfo id="car_w2e_233" depart="233.00" departLane="w2sep_1" departPos="3.60" departPosLat="0.00" departSpeed="13.90" departDelay="0.00" arrival="394.00" arrivalLane="c2e_1" arrivalPos="990.00" arrivalPosLat="0.00" arrivalSpeed="13.90" duration="161.00" routeLength="1997.01" waitingTime="5.00" waitingCount="1" stopTime="0.00" timeLoss="17.14" rerouteNo="1" devices="tripinfo_car_w2e_233 routing_car_w2e_233" vType="Car" speedFactor="1.00" vaporized=""/>
    <tripinfo id="car_e2s_208" depart="208.00" departLane="e2sep_1" departPos="3.60" departPosLat="0.00" departSpeed="13.90" departDelay="0.00" arrival="395.00" arrivalLane="c2s_1" arrivalPos="990.00" arrivalPosLat="0.00" arrivalSpeed="15.11" duration="187.00" routeLength="1996.47" waitingTime="36.00" waitingCount="2" stopTime="0.00" timeLoss="54.21" rerouteNo="1" devices="tripinfo_car_e2s_208 routing_car_e2s_208" vType="Car" speedFactor="1.09" vaporized=""/>
    <tripinfo id="car_w2e_251" depart="251.00" departLane="w2sep_1" departPos="3.60" departPosLat="0.00" departSpeed="13.90" departDelay="0.00" arrival="396.00" arrivalLane="c2e_1" arrivalPos="990.00" arrivalPosLat="0.00" arrivalSpeed="15.54" duration="145.00" routeLength="1997.01" waitingTime="0.00" waitingCount="0" stopTime="0.00" timeLoss="21.75" rerouteNo="1" devices="tripinfo_car_w2e_251 routing_car_w2e_251" vType="Car" speedFactor="1.17" vaporized=""/>
    <tripinfo id="car_e2n_239" depart="239.00" departLane="e2sep_1" departPos="3.60" departPosLat="0.00" departSpeed="13.90" departDelay="0.00" arrival="397.00" arrivalLane="c2n_1" arrivalPos="990.00" arrivalPosLat="0.00" arrivalSpeed="14.09" duration="158.00" routeLength="1986.69" waitingTime="2.00" waitingCount="1" stopTime="0.00" timeLoss="15.60" rerouteNo="1" devices="tripinfo_car_e2n_239 routing_car_e2n_239" vType="Car" speedFactor="1.01" vaporized=""/>
    <tripinfo id="car_e2s_228" depart="228.00" departLane="e2sep_1" departPos="3.60" departPosLat="0.00" departSpeed="13.90" departDelay="0.00" arrival="398.00" arrivalLane="c2s_1" arrivalPos="990.00" arrivalPosLat="0.00" arrivalSpeed="15.18" duration="170.00" routeLength="1996.47" waitingTime="17.00" waitingCount="2" stopTime="0.00" timeLoss="38.06" rerouteNo="1" devices="tripinfo_car_e2s_228 routing_car_e2s_228" vType="Car" speedFactor="1.10" vaporized=""/>
    <tripinfo id="car_e2n_245" depart="245.00" departLane="e2sep_1" departPos="3.60" departPosLat="0.00" departSpeed="13.90" departDelay="0.00" arrival="400.00" arrivalLane="c2n_1" arrivalPos="990.00" arrivalPosLat="0.00" arrivalSpeed="14.72" duration="155.00" routeLength="1986.69" waitingTime="0.00" waitingCount="0" stopTime="0.00" timeLoss="19.31" rerouteNo="1" devices="tripinfo_car_e2n_245 routing_car_e2n_245" vType="Car" speedFactor="1.06" vaporized=""/>
    <tripinfo id="car_w2n_222" depart="222.00" departLane="w2sep_1" departPos="3.60" departPosLat="0.00" departSpeed="13.90" departDelay="0.00" arrival="404.00" arrivalLane="c2n_1" arrivalPos="990.00" arrivalPosLat="0.00" arrivalSpeed="14.03" duration="182.00" routeLength="1996.47" waitingTime="19.00" waitingCount="2" stopTime="0.00" timeLoss="38.75" rerouteNo="1" devices="tripinfo_car_w2n_222 routing_car_w2n_222" vType="Car" speedFactor="1.01" vaporized=""/>
    <tripinfo id="car_e2s_231" depart="232.00" departLane="e2sep_1" departPos="3.60" departPosLat="0.00" departSpeed="13.90" departDelay="1.00" arrival="405.00" arrivalLane="c2s_1" arrivalPos="990.00" arrivalPosLat="0.00" arrivalSpeed="13.90" duration="173.00" routeLength="1996.47" waitingTime="8.00" waitingCount="2" stopTime="0.00" timeLoss="28.07" rerouteNo="1" devices="tripinfo_car_e2s_231 routing_car_e2s_231" vType="Car" speedFactor="1.00" vaporized=""/>
    <tripinfo id="bus_w2e_263" depart="263.00" departLane="w2sep_1" departPos="12.10" departPosLat="0.00" departSpeed="13.90" departDelay="0.00" arrival="407.00" arrivalLane="c2e_1" arrivalPos="990.00" arrivalPosLat="0.00" arrivalSpeed="13.90" duration="144.00" routeLength="1988.51" waitingTime="0.00" waitingCount="0" stopTime="0.00" timeLoss="0.87" rerouteNo="1" devices="tripinfo_bus_w2e_263 routing_bus_w2e_263" vType="Bus" speedFactor="1.00" vaporized=""/>
    <tripinfo id="car_w2s_266" depart="266.00" departLane="w2sep_1" departPos="3.60" departPosLat="0.00" departSpeed="13.90" departDelay="0.00" arrival="416.00" arrivalLane="c2s_1" arrivalPos="990.00" arrivalPosLat="0.00" arrivalSpeed="13.94" duration="150.00" routeLength="1986.69" waitingTime="0.00" waitingCount="0" stopTime="0.00" timeLoss="6.58" rerouteNo="1" devices="tripinfo_car_w2s_266 routing_car_w2s_266" vType="Car" speedFactor="1.00" vaporized=""/>
    <tripinfo id="car_w2e_270" depart="270.00" departLane="w2sep_1" departPos="3.60" departPosLat="0.00" departSpeed="13.90" departDelay="0.00" arrival="418.00" arrivalLane="c2e_1" arrivalPos="990.00" arrivalPosLat="0.00" arrivalSpeed="13.90" duration="148.00" routeLength="1997.01" waitingTime="0.00" waitingCount="0" stopTime="0.00" timeLoss="4.06" rerouteNo="1" devices="tripinfo_car_w2e_270 routing_car_w2e_270" vType="Car" speedFactor="1.00" vaporized=""/>
    <tripinfo id="car_e2s_260" depart="260.00" departLane="e2sep_1" departPos="3.60" departPosLat="0.00" departSpeed="13.90" departDelay="0.00" arrival="419.00" arrivalLane="c2s_1" arrivalPos="990.00" arrivalPosLat="0.00" arrivalSpeed="15.13" duration="159.00" routeLength="1996.47" waitingTime="11.00" waitingCount="1" stopTime="0.00" timeLoss="26.85" rerouteNo="1" devices="tripinfo_car_e2s_260 routing_car_e2s_260" vType="Car" speedFactor="1.10" vaporized=""/>
    <tripinfo id="car_e2s_264" depart="264.00" departLane="e2sep_1" departPos="3.60" departPosLat="0.00" departSpeed="13.90" departDelay="0.00" arrival="421.00" arrivalLane="c2s_1" arrivalPos="990.00" arrivalPosLat="0.00" arrivalSpeed="15.87" duration="157.00" routeLength="1996.47" waitingTime="11.00" waitingCount="1" stopTime="0.00" timeLoss="34.00" rerouteNo="1" devices="tripinfo_car_e2s_264 routing_car_e2s_264" vType="Car" speedFactor="1.18" vaporized=""/>
    <tripinfo id="car_w2e_276" depart="276.00" departLane="w2sep_1" departPos="3.60" departPosLat="0.00" departSpeed="13.90" departDelay="0.00" arrival="422.00" arrivalLane="c2e_1" arrivalPos="990.00" arrivalPosLat="0.00" arrivalSpeed="14.21" duration="146.00" routeLength="1997.01" waitingTime="0.00" waitingCount="0" stopTime="0.00" timeLoss="4.89" rerouteNo="1" devices="tripinfo_car_w2e_276 routing_car_w2e_276" vType="Car" speedFactor="1.02" vaporized=""/>
    <tripinfo id="car_e2s_268" depart="268.00" departLane="e2sep_1" departPos="3.60" departPosLat="0.00" departSpeed="13.90" departDelay="0.00" arrival="425.00" arrivalLane="c2s_1" arrivalPos="990.00" arrivalPosLat="0.00" arrivalSpeed="14.87" duration="157.00" routeLength="1996.47" waitingTime="8.00" waitingCount="1" stopTime="0.00" timeLoss="21.93" rerouteNo="1" devices="tripinfo_car_e2s_268 routing_car_e2s_268" vType="Car" speedFactor="1.07" vaporized=""/>
    <tripinfo id="car_n2s_237" depart="237.00" departLane="n2sep_1" departPos="3.60" departPosLat="0.00" departSpeed="13.90" departDelay="0.00" arrival="435.00" arrivalLane="c2s_1" arrivalPos="990.00" arrivalPosLat="0.00" arrivalSpeed="13.90" duration="198.00" routeLength="1997.01" waitingTime="44.00" waitingCount="1" stopTime="0.00" timeLoss="53.84" rerouteNo="1" devices="tripinfo_car_n2s_237 routing_car_n2s_237" vType="Car" speedFactor="1.00" vaporized=""/>
    <tripinfo id="car_n2s_239" depart="239.00" departLane="n2sep_1" departPos="3.60" departPosLat="0.00" departSpeed="13.90" departDelay="0.00" arrival="438.00" arrivalLane="c2s_1" arrivalPos="990.00" arrivalPosLat="0.00" arrivalSpeed="14.79" duration="199.00" routeLength="1997.01" waitingTime="43.00" waitingCount="1" stopTime="0.00" timeLoss="64.09" rerouteNo="1" devices="tripinfo_car_n2s_239 routing_car_n2s_239" vType="Car" speedFactor="1.07" vaporized=""/>
    <tripinfo id="bus_s2n_244" depart="246.00" departLane="s2sep_1" departPos="12.10" departPosLat="0.00" departSpeed="13.90" departDelay="2.00" arrival="438.00" arrivalLane="c2n_1" arrivalPos="990.00" arrivalPosLat="0.00" arrivalSpeed="13.90" duration="192.00" routeLength="1988.51" waitingTime="35.00" waitingCount="1" stopTime="0.00" timeLoss="48.71" rerouteNo="1" devices="tripinfo_bus_s2n_244 routing_bus_s2n_244" vType="Bus" speedFactor="1.00" vaporized=""/>
    <tripinfo id="car_n2w_252" depart="252.00" departLane="n2sep_1" departPos="3.60" departPosLat="0.00" departSpeed="13.90" departDelay="0.00" arrival="439.00" arrivalLane="c2w_1" arrivalPos="990.00" arrivalPosLat="0.00" arrivalSpeed="14.13" duration="187.00" routeLength="1986.69" waitingTime="33.00" waitingCount="1" stopTime="0.00" timeLoss="45.20" rerouteNo="1" devices="tripinfo_car_n2w_252 routing_car_n2w_252" vType="Car" speedFactor="1.02" vaporized=""/>
    <tripinfo id="car_s2e_264" depart="264.00" departLane="s2sep_1" departPos="3.60" departPosLat="0.00" departSpeed="13.90" departDelay="0.00" arrival="442.00" arrivalLane="c2e_1" arrivalPos="990.00" arrivalPosLat="0.00" arrivalSpeed="13.96" duration="178.00" routeLength="1986.69" waitingTime="20.00" waitingCount="1" stopTime="0.00" timeLoss="34.57" rerouteNo="1" devices="tripinfo_car_s2e_264 routing_car_s2e_264" vType="Car" speedFactor="1.00" vaporized=""/>
    <tripinfo id="car_n2w_271" depart="271.00" departLane="n2sep_1" departPos="3.60" departPosLat="0.00" departSpeed="13.90" departDelay="0.00" arrival="442.00" arrivalLane="c2w_1" arrivalPos="990.00" arrivalPosLat="0.00" arrivalSpeed="15.21" duration="171.00" routeLength="1986.69" waitingTime="22.00" waitingCount="1" stopTime="0.00" timeLoss="40.02" rerouteNo="1" devices="tripinfo_car_n2w_271 routing_car_n2w_271" vType="Car" speedFactor="1.10" vaporized=""/>
    <tripinfo id="car_s2n_247" depart="248.00" departLane="s2sep_1" departPos="3.60" departPosLat="0.00" departSpeed="13.90" departDelay="1.00" arrival="443.00" arrivalLane="c2n_1" arrivalPos="990.00" arrivalPosLat="0.00" arrivalSpeed="13.90" duration="195.00" routeLength="1997.01" waitingTime="33.00" waitingCount="1" stopTime="0.00" timeLoss="50.96" rerouteNo="1" devices="tripinfo_car_s2n_247 routing_car_s2n_247" vType="Car" speedFactor="1.00" vaporized=""/>
    <tripinfo id="car_n2s_255" depart="256.00" departLane="n2sep_1" departPos="3.60" departPosLat="0.00" departSpeed="13.90" departDelay="1.00" arrival="443.00" arrivalLane="c2s_1" arrivalPos="990.00" arrivalPosLat="0.00" arrivalSpeed="14.02" duration="187.00" routeLength="1997.01" waitingTime="29.00" waitingCount="1" stopTime="0.00" timeLoss="43.85" rerouteNo="1" devices="tripinfo_car_n2s_255 routing_car_n2s_255" vType="Car" speedFactor="1.01" vaporized=""/>
    <tripinfo id="car_s2e_284" depart="284.00" departLane="s2sep_1" departPos="3.60" departPosLat="0.00" departSpeed="13.90" departDelay="0.00" arrival="444.00" arrivalLane="c2e_1" arrivalPos="990.00" arrivalPosLat="0.00" arrivalSpeed="15.43" duration="160.00" routeLength="1986.69" waitingTime="10.00" waitingCount="1" stopTime="0.00" timeLoss="34.98" rerouteNo="1" devices="tripinfo_car_s2e_284 routing_car_s2e_284" vType="Car" speedFactor="1.15" vaporized=""/>
    <tripinfo id="car_n2w_296" depart="296.00" departLane="n2sep_1" departPos="3.60" departPosLat="0.00" departSpeed="13.90" departDelay="0.00" arrival="447.00" arrivalLane="c2w_1" arrivalPos="990.00" arrivalPosLat="0.00" arrivalSpeed="14.42" duration="151.00" routeLength="1986.69" waitingTime="0.00" waitingCount="0" stopTime="0.00" timeLoss="12.07" rerouteNo="1" devices="tripinfo_car_n2w_296 routing_car_n2w_296" vType="Car" speedFactor="1.04" vaporized=""/>
    <tripinfo id="car_s2e_291" depart="291.00" departLane="s2sep_1" departPos="3.60" departPosLat="0.00" departSpeed="13.90" departDelay="0.00" arrival="449.00" arrivalLane="c2e_1" arrivalPos="990.00" arrivalPosLat="0.00" arrivalSpeed="14.01" duration="158.00" routeLength="1986.69" waitingTime="0.00" waitingCount="0" stopTime="0.00" timeLoss="14.89" rerouteNo="1" devices="tripinfo_car_s2e_291 routing_car_s2e_291" vType="Car" speedFactor="1.01" vaporized=""/>
    <tripinfo id="car_s2n_304" depart="304.00" departLane="s2sep_1" departPos="3.60" departPosLat="0.00" departSpeed="13.90" departDelay="0.00" arrival="449.00" arrivalLane="c2n_1" arrivalPos="990.00" arrivalPosLat="0.00" arrivalSpeed="14.23" duration="145.00" routeLength="1997.01" waitingTime="0.00" waitingCount="0" stopTime="0.00" timeLoss="4.17" rerouteNo="1" devices="tripinfo_car_s2n_304 routing_car_s2n_304" vType="Car" speedFactor="1.02" vaporized=""/>
    <tripinfo id="car_n2e_253" depart="254.00" departLane="n2sep_1" departPos="3.60" departPosLat="0.00" departSpeed="13.90" departDelay="1.00" arrival="451.00" arrivalLane="c2e_1" arrivalPos="990.00" arrivalPosLat="0.00" arrivalSpeed="14.93" duration="197.00" routeLength="1996.47" waitingTime="44.00" waitingCount="2" stopTime="0.00" timeLoss="65.41" rerouteNo="1" devices="tripinfo_car_n2e_253 routing_car_n2e_253" vType="Car" speedFactor="1.10" vaporized=""/>
    <tripinfo id="car_s2n_316" depart="316.00" departLane="s2sep_1" departPos="3.60" departPosLat="0.00" departSpeed="13.90" departDelay="0.00" arrival="452.00" arrivalLane="c2n_1" arrivalPos="990.00" arrivalPosLat="0.00" arrivalSpeed="14.97" duration="136.00" routeLength="1997.01" waitingTime="0.00" waitingCount="0" stopTime="0.00" timeLoss="2.94" rerouteNo="1" devices="tripinfo_car_s2n_316 routing_car_s2n_316" vType="Car" speedFactor="1.08" vaporized=""/>
    <tripinfo id="bus_n2w_301" depart="301.00" departLane="n2sep_1" departPos="12.10" departPosLat="0.00" departSpeed="13.90" departDelay="0.00" arrival="454.00" arrivalLane="c2w_1" arrivalPos="990.00" arrivalPosLat="0.00" arrivalSpeed="13.89" duration="153.00" routeLength="1978.19" waitingTime="0.00" waitingCount="0" stopTime="0.00" timeLoss="9.54" rerouteNo="1" devices="tripinfo_bus_n2w_301 routing_bus_n2w_301" vType="Bus" speedFactor="1.00" vaporized=""/>
    <tripinfo id="car_n2w_316" depart="317.00" departLane="n2sep_1" departPos="3.60" departPosLat="0.00" departSpeed="13.90" departDelay="1.00" arrival="456.00" arrivalLane="c2w_1" arrivalPos="990.00" arrivalPosLat="0.00" arrivalSpeed="15.19" duration="139.00" routeLength="1986.69" waitingTime="0.00" waitingCount="0" stopTime="0.00" timeLoss="11.88" rerouteNo="1" devices="tripinfo_car_n2w_316 routing_car_n2w_316" vType="Car" speedFactor="1.13" vaporized=""/>
    <tripinfo id="car_n2e_273" depart="273.00" departLane="n2sep_1" departPos="3.60" departPosLat="0.00" departSpeed="13.90" departDelay="0.00" arrival="457.00" arrivalLane="c2e_1" arrivalPos="990.00" arrivalPosLat="0.00" arrivalSpeed="14.33" duration="184.00" routeLength="1996.47" waitingTime="22.00" waitingCount="2" stopTime="0.00" timeLoss="43.14" rerouteNo="1" devices="tripinfo_car_n2e_273 routing_car_n2e_273" vType="Car" speedFactor="1.03" vaporized=""/>
    <tripinfo id="car_s2w_244" depart="244.00" departLane="s2sep_1" departPos="3.60" departPosLat="0.00" departSpeed="13.90" departDelay="0.00" arrival="461.00" arrivalLane="c2w_1" arrivalPos="990.00" arrivalPosLat="0.00" arrivalSpeed="14.37" duration="217.00" routeLength="1996.47" waitingTime="58.00" waitingCount="2" stopTime="0.00" timeLoss="76.88" rerouteNo="1" devices="tripinfo_car_s2w_244 routing_car_s2w_244" vType="Car" speedFactor="1.03" vaporized=""/>
    <tripinfo id="car_n2e_292" depart="292.00" departLane="n2sep_1" departPos="3.60" departPosLat="0.00" departSpeed="13.90" departDelay="0.00" arrival="461.00" arrivalLane="c2e_1" arrivalPos="990.00" arrivalPosLat="0.00" arrivalSpeed="14.33" duration="169.00" routeLength="1996.47" waitingTime="11.00" waitingCount="1" stopTime="0.00" timeLoss="28.31" rerouteNo="1" devices="tripinfo_car_n2e_292 routing_car_n2e_292" vType="Car" speedFactor="1.03" vaporized=""/>
    <tripinfo id="car_s2w_261" depart="261.00" departLane="s2sep_1" departPos="3.60" departPosLat="0.00" departSpeed="13.90" departDelay="0.00" arrival="463.00" arrivalLane="c2w_1" arrivalPos="990.00" arrivalPosLat="0.00" arrivalSpeed="14.97" duration="202.00" routeLength="1996.47" waitingTime="45.00" waitingCount="2" stopTime="0.00" timeLoss="70.18" rerouteNo="1" devices="tripinfo_car_s2w_261 routing_car_s2w_261" vType="Car" speedFactor="1.10" vaporized=""/>
    <tripinfo id="car_s2w_295" depart="295.00" departLane="s2sep_1" departPos="3.60" departPosLat="0.00" departSpeed="13.90" departDelay="0.00" arrival="465.00" arrivalLane="c2w_1" arrivalPos="990.00" arrivalPosLat="0.00" arrivalSpeed="15.42" duration="170.00" routeLength="1996.47" waitingTime="18.00" waitingCount="1" stopTime="0.00" timeLoss="43.56" rerouteNo="1" devices="tripinfo_car_s2w_295 routing_car_s2w_295" vType="Car" speedFactor="1.14" vaporized=""/>
    <tripinfo id="car_n2e_302" depart="303.00" departLane="n2sep_1" departPos="3.60" departPosLat="0.00" departSpeed="13.90" departDelay="1.00" arrival="465.00" arrivalLane="c2e_1" arrivalPos="990.00" arrivalPosLat="0.00" arrivalSpeed="14.10" duration="162.00" routeLength="1996.47" waitingTime="1.00" waitingCount="1" stopTime="0.00" timeLoss="19.12" rerouteNo="1" devices="tripinfo_car_n2e_302 routing_car_n2e_302" vType="Car" speedFactor="1.02" vaporized=""/>
    <tripinfo id="car_s2w_297" depart="297.00" departLane="s2sep_1" departPos="3.60" departPosLat="0.00" departSpeed="13.90" departDelay="0.00" arrival="467.00" arrivalLane="c2w_1" arrivalPos="990.00" arrivalPosLat="0.00" arrivalSpeed="16.18" duration="170.00" routeLength="1996.47" waitingTime="18.00" waitingCount="1" stopTime="0.00" timeLoss="51.91" rerouteNo="1" devices="tripinfo_car_s2w_297 routing_car_s2w_297" vType="Car" speedFactor="1.23" vaporized=""/>
    <tripinfo id="car_n2e_315" depart="315.00" departLane="n2sep_1" departPos="3.60" departPosLat="0.00" departSpeed="13.90" departDelay="0.00" arrival="469.00" arrivalLane="c2e_1" arrivalPos="990.00" arrivalPosLat="0.00" arrivalSpeed="13.89" duration="154.00" routeLength="1996.47" waitingTime="0.00" waitingCount="0" stopTime="0.00" timeLoss="9.12" rerouteNo="1" devices="tripinfo_car_n2e_315 routing_car_n2e_315" vType="Car" speedFactor="1.00" vaporized=""/>
    <tripinfo id="car_n2e_317" depart="319.00" departLane="n2sep_1" departPos="3.60" departPosLat="0.00" departSpeed="13.90" departDelay="2.00" arrival="471.00" arrivalLane="c2e_1" arrivalPos="990.00" arrivalPosLat="0.00" arrivalSpeed="15.24" duration="152.00" routeLength="1996.47" waitingTime="0.00" waitingCount="0" stopTime="0.00" timeLoss="24.80" rerouteNo="1" devices="tripinfo_car_n2e_317 routing_car_n2e_317" vType="Car" speedFactor="1.14" vaporized=""/>
    <tripinfo id="car_e2w_290" depart="290.00" departLane="e2sep_1" departPos="3.60" departPosLat="0.00" departSpeed="13.90" departDelay="0.00" arrival="473.00" arrivalLane="c2w_1" arrivalPos="990.00" arrivalPosLat="0.00" arrivalSpeed="15.54" duration="183.00" routeLength="1997.01" waitingTime="43.00" waitingCount="1" stopTime="0.00" timeLoss="53.91" rerouteNo="1" devices="tripinfo_car_e2w_290 routing_car_e2w_290" vType="Car" speedFactor="1.12" vaporized=""/>
    <tripinfo id="car_w2e_281" depart="281.00" departLane="w2sep_1" departPos="3.60" departPosLat="0.00" departSpeed="13.90" departDelay="0.00" arrival="476.00" arrivalLane="c2e_1" arrivalPos="990.00" arrivalPosLat="0.00" arrivalSpeed="14.74" duration="195.00" routeLength="1997.01" waitingTime="47.00" waitingCount="1" stopTime="0.00" timeLoss="59.38" rerouteNo="1" devices="tripinfo_car_w2e_281 routing_car_w2e_281" vType="Car" speedFactor="1.06" vaporized=""/>
    <tripinfo id="car_e2n_295" depart="295.00" departLane="e2sep_1" departPos="3.60" departPosLat="0.00" departSpeed="13.90" departDelay="0.00" arrival="478.00" arrivalLane="c2n_1" arrivalPos="990.00" arrivalPosLat="0.00" arrivalSpeed="14.85" duration="183.00" routeLength="1986.69" waitingTime="36.00" waitingCount="1" stopTime="0.00" timeLoss="47.87" rerouteNo="1" devices="tripinfo_car_e2n_295 routing_car_e2n_295" vType="Car" speedFactor="1.07" vaporized=""/>
    <tripinfo id="car_w2s_302" depart="302.00" departLane="w2sep_1" departPos="3.60" departPosLat="0.00" departSpeed="13.90" departDelay="0.00" arrival="480.00" arrivalLane="c2s_1" arrivalPos="990.00" arrivalPosLat="0.00" arrivalSpeed="15.56" duration="178.00" routeLength="1986.69" waitingTime="31.00" waitingCount="1" stopTime="0.00" timeLoss="49.11" rerouteNo="1" devices="tripinfo_car_w2s_302 routing_car_w2s_302" vType="Car" speedFactor="1.12" vaporized=""/>
    <tripinfo id="car_w2e_286" depart="286.00" departLane="w2sep_1" departPos="3.60" departPosLat="0.00" departSpeed="13.90" departDelay="0.00" arrival="481.00" arrivalLane="c2e_1" arrivalPos="990.00" arrivalPosLat="0.00" arrivalSpeed="14.34" duration="195.00" routeLength="1997.01" waitingTime="43.00" waitingCount="1" stopTime="0.00" timeLoss="55.74" rerouteNo="1" devices="tripinfo_car_w2e_286 routing_car_w2e_286" vType="Car" speedFactor="1.03" vaporized=""/>
    <tripinfo id="car_e2n_307" depart="307.00" departLane="e2sep_1" departPos="3.60" departPosLat="0.00" departSpeed="13.90" departDelay="0.00" arrival="481.00" arrivalLane="c2n_1" arrivalPos="990.00" arrivalPosLat="0.00" arrivalSpeed="15.40" duration="174.00" routeLength="1986.69" waitingTime="28.00" waitingCount="1" stopTime="0.00" timeLoss="44.53" rerouteNo="1" devices="tripinfo_car_e2n_307 routing_car_e2n_307" vType="Car" speedFactor="1.11" vaporized=""/>
    <tripinfo id="car_e2n_321" depart="321.00" departLane="e2sep_1" departPos="3.60" departPosLat="0.00" departSpeed="13.90" departDelay="0.00" arrival="484.00" arrivalLane="c2n_1" arrivalPos="990.00" arrivalPosLat="0.00" arrivalSpeed="15.48" duration="163.00" routeLength="1986.69" waitingTime="16.00" waitingCount="1" stopTime="0.00" timeLoss="34.19" rerouteNo="1" devices="tripinfo_car_e2n_321 routing_car_e2n_321" vType="Car" speedFactor="1.12" vaporized=""/>
    <tripinfo id="car_w2e_298" depart="298.00" departLane="w2sep_1" departPos="3.60" departPosLat="0.00" departSpeed="13.90" departDelay="0.00" arrival="486.00" arrivalLane="c2e_1" arrivalPos="990.00" arrivalPosLat="0.00" arrivalSpeed="14.06" duration="188.00" routeLength="1997.01" waitingTime="31.00" waitingCount="1" stopTime="0.00" timeLoss="45.32" rerouteNo="1" devices="tripinfo_car_w2e_298 routing_car_w2e_298" vType="Car" speedFactor="1.01" vaporized=""/>
    <tripinfo id="car_e2s_313" depart="313.00" departLane="e2sep_1" departPos="3.60" departPosLat="0.00" departSpeed="13.90" departDelay="0.00" arrival="487.00" arrivalLane="c2s_1" arrivalPos="990.00" arrivalPosLat="0.00" arrivalSpeed="16.18" duration="174.00" routeLength="1996.47" waitingTime="32.00" waitingCount="2" stopTime="0.00" timeLoss="49.29" rerouteNo="1" devices="tripinfo_car_e2s_313 routing_car_e2s_313" vType="Car" speedFactor="1.16" vaporized=""/>
    <tripinfo id="car_w2e_303" depart="304.00" departLane="w2sep_1" departPos="3.60" departPosLat="0.00" departSpeed="13.90" departDelay="1.00" arrival="490.00" arrivalLane="c2e_1" arrivalPos="990.00" arrivalPosLat="0.00" arrivalSpeed="13.95" duration="186.00" routeLength="1997.01" waitingTime="27.00" waitingCount="1" stopTime="0.00" timeLoss="42.78" rerouteNo="1" devices="tripinfo_car_w2e_303 routing_car_w2e_303" vType="Car" speedFactor="1.00" vaporized=""/>
    <tripinfo id="car_e2w_336" depart="336.00" departLane="e2sep_1" departPos="3.60" departPosLat="0.00" departSpeed="13.90" departDelay="0.00" arrival="490.00" arrivalLane="c2w_1" arrivalPos="990.00" arrivalPosLat="0.00" arrivalSpeed="13.90" duration="154.00" routeLength="1997.01" waitingTime="0.00" waitingCount="0" stopTime="0.00" timeLoss="10.30" rerouteNo="1" devices="tripinfo_car_e2w_336 routing_car_e2w_336" vType="Car" speedFactor="1.00" vaporized=""/>
    <tripinfo id="car_w2e_344" depart="344.00" departLane="w2sep_1" departPos="3.60" departPosLat="0.00" departSpeed="13.90" departDelay="0.00" arrival="493.00" arrivalLane="c2e_1" arrivalPos="990.00" arrivalPosLat="0.00" arrivalSpeed="14.68" duration="149.00" routeLength="1997.01" waitingTime="0.00" waitingCount="0" stopTime="0.00" timeLoss="13.39" rerouteNo="1" devices="tripinfo_car_w2e_344 routing_car_w2e_344" vType="Car" speedFactor="1.06" vaporized=""/>
    <tripinfo id="car_e2w_341" depart="341.00" departLane="e2sep_1" departPos="3.60" departPosLat="0.00" departSpeed="13.90" departDelay="0.00" arrival="495.00" arrivalLane="c2w_1" arrivalPos="990.00" arrivalPosLat="0.00" arrivalSpeed="13.96" duration="154.00" routeLength="1997.01" waitingTime="0.00" waitingCount="0" stopTime="0.00" timeLoss="10.13" rerouteNo="1" devices="tripinfo_car_e2w_341 routing_car_e2w_341" vType="Car" speedFactor="1.00" vaporized=""/>
    <tripinfo id="car_e2n_343" depart="343.00" departLane="e2sep_1" departPos="3.60" departPosLat="0.00" departSpeed="13.90" departDelay="0.00" arrival="495.00" arrivalLane="c2n_1" arrivalPos="990.00" arrivalPosLat="0.00" arrivalSpeed="13.90" duration="152.00" routeLength="1986.69" waitingTime="0.00" waitingCount="0" stopTime="0.00" timeLoss="8.33" rerouteNo="1" devices="tripinfo_car_e2n_343 routing_car_e2n_343" vType="Car" speedFactor="1.00" vaporized=""/>
    <tripinfo id="car_w2e_345" depart="346.00" departLane="w2sep_1" departPos="3.60" departPosLat="0.00" departSpeed="13.90" departDelay="1.00" arrival="495.00" arrivalLane="c2e_1" arrivalPos="990.00" arrivalPosLat="0.00" arrivalSpeed="15.17" duration="149.00" routeLength="1997.01" waitingTime="0.00" waitingCount="0" stopTime="0.00" timeLoss="20.56" rerouteNo="1" devices="tripinfo_car_w2e_345 routing_car_w2e_345" vType="Car" speedFactor="1.12" vaporized=""/>
    <tripinfo id="car_e2s_359" depart="359.00" departLane="e2sep_1" departPos="3.60" departPosLat="0.00" departSpeed="13.90" departDelay="0.00" arrival="499.00" arrivalLane="c2s_1" arrivalPos="990.00" arrivalPosLat="0.00" arrivalSpeed="14.98" duration="140.00" routeLength="1996.47" waitingTime="0.00" waitingCount="0" stopTime="0.00" timeLoss="5.23" rerouteNo="1" devices="tripinfo_car_e2s_359 routing_car_e2s_359" vType="Car" speedFactor="1.08" vaporized=""/>
    <tripinfo id="car_w2n_289" depart="289.00" departLane="w2sep_1" departPos="3.60" departPosLat="0.00" departSpeed="13.90" departDelay="0.00" arrival="500.00" arrivalLane="c2n_1" arrivalPos="990.00" arrivalPosLat="0.00" arrivalSpeed="13.90" duration="211.00" routeLength="1996.47" waitingTime="48.00" waitingCount="2" stopTime="0.00" timeLoss="66.15" rerouteNo="1" devices="tripinfo_car_w2n_289 routing_car_w2n_289" vType="Car" speedFactor="1.00" vaporized=""/>
    <tripinfo id="car_w2s_363" depart="363.00" departLane="w2sep_1" departPos="3.60" departPosLat="0.00" departSpeed="13.90" departDelay="0.00" arrival="512.00" arrivalLane="c2s_1" arrivalPos="990.00" arrivalPosLat="0.00" arrivalSpeed="13.90" duration="149.00" routeLength="1986.69" waitingTime="0.00" waitingCount="0" stopTime="0.00" timeLoss="5.10" rerouteNo="1" devices="tripinfo_car_w2s_363 routing_car_w2s_363" vType="Car" speedFactor="1.00" vaporized=""/>
    <tripinfo id="car_w2e_369" depart="369.00" departLane="w2sep_1" departPos="3.60" departPosLat="0.00" departSpeed="13.90" departDelay="0.00" arrival="517.00" arrivalLane="c2e_1" arrivalPos="990.00" arrivalPosLat="1.00" arrivalSpeed="14.62" duration="148.00" routeLength="1997.01" waitingTime="0.00" waitingCount="0" stopTime="0.00" timeLoss="11.22" rerouteNo="1" devices="tripinfo_car_w2e_369 routing_car_w2e_369" vType="Car" speedFactor="1.05" vaporized=""/>
    <tripinfo id="amb_w2e_390" depart="390.00" departLane="w2sep_1" departPos="6.60" departPosLat="0.00" departSpeed="13.90" departDelay="0.00" arrival="519.00" arrivalLane="c2e_1" arrivalPos="990.00" arrivalPosLat="0.00" arrivalSpeed="17.89" duration="129.00" routeLength="1994.01" waitingTime="0.00" waitingCount="0" stopTime="0.00" timeLoss="32.69" rerouteNo="1" devices="tripinfo_amb_w2e_390 routing_amb_w2e_390 bluelight_amb_w2e_390" vType="Ambulance" speedFactor="1.50" vaporized="">
        <bluelight/>
    </tripinfo>
    <tripinfo id="car_w2s_369" depart="371.00" departLane="w2sep_1" departPos="3.60" departPosLat="0.00" departSpeed="13.90" departDelay="2.00" arrival="520.00" arrivalLane="c2s_1" arrivalPos="990.00" arrivalPosLat="0.00" arrivalSpeed="14.46" duration="149.00" routeLength="1986.69" waitingTime="0.00" waitingCount="0" stopTime="0.00" timeLoss="10.53" rerouteNo="1" devices="tripinfo_car_w2s_369 routing_car_w2s_369" vType="Car" speedFactor="1.04" vaporized=""/>
    <tripinfo id="car_w2s_381" depart="381.00" departLane="w2sep_1" departPos="3.60" departPosLat="0.00" departSpeed="13.90" departDelay="0.00" arrival="526.00" arrivalLane="c2s_1" arrivalPos="990.00" arrivalPosLat="0.00" arrivalSpeed="14.22" duration="145.00" routeLength="1986.69" waitingTime="0.00" waitingCount="0" stopTime="0.00" timeLoss="4.68" rerouteNo="1" devices="tripinfo_car_w2s_381 routing_car_w2s_381" vType="Car" speedFactor="1.02" vaporized=""/>
    <tripinfo id="car_e2s_390" depart="390.00" departLane="e2sep_1" departPos="3.60" departPosLat="0.00" departSpeed="13.90" departDelay="0.00" arrival="537.00" arrivalLane="c2s_1" arrivalPos="990.00" arrivalPosLat="0.00" arrivalSpeed="13.90" duration="147.00" routeLength="1996.47" waitingTime="0.00" waitingCount="0" stopTime="0.00" timeLoss="2.48" rerouteNo="1" devices="tripinfo_car_e2s_390 routing_car_e2s_390" vType="Car" speedFactor="1.00" vaporized=""/>
    <tripinfo id="car_n2w_331" depart="331.00" departLane="n2sep_1" departPos="3.60" departPosLat="0.00" departSpeed="13.90" departDelay="0.00" arrival="543.00" arrivalLane="c2w_1" arrivalPos="990.00" arrivalPosLat="0.00" arrivalSpeed="13.93" duration="212.00" routeLength="1986.69" waitingTime="59.00" waitingCount="1" stopTime="0.00" timeLoss="68.67" rerouteNo="1" devices="tripinfo_car_n2w_331 routing_car_n2w_331" vType="Car" speedFactor="1.00" vaporized=""/>
    <tripinfo id="car_s2n_357" depart="360.00" departLane="s2sep_1" departPos="3.60" departPosLat="0.00" departSpeed="13.90" departDelay="3.00" arrival="544.00" arrivalLane="c2n_1" arrivalPos="990.00" arrivalPosLat="0.00" arrivalSpeed="13.90" duration="184.00" routeLength="1997.01" waitingTime="29.00" waitingCount="1" stopTime="0.00" timeLoss="39.57" rerouteNo="1" devices="tripinfo_car_s2n_357 routing_car_s2n_357" vType="Car" speedFactor="1.00" vaporized=""/>
    <tripinfo id="car_n2s_332" depart="333.00" departLane="n2sep_1" departPos="3.60" departPosLat="0.00" departSpeed="13.90" departDelay="1.00" arrival="545.00" arrivalLane="c2s_1" arrivalPos="990.00" arrivalPosLat="0.00" arrivalSpeed="14.12" duration="212.00" routeLength="1997.01" waitingTime="57.00" waitingCount="1" stopTime="0.00" timeLoss="70.14" rerouteNo="1" devices="tripinfo_car_n2s_332 routing_car_n2s_332" vType="Car" speedFactor="1.02" vaporized=""/>
    <tripinfo id="car_s2n_364" depart="364.00" departLane="s2sep_1" departPos="3.60" departPosLat="0.00" departSpeed="13.90" departDelay="0.00" arrival="546.00" arrivalLane="c2n_1" arrivalPos="990.00" arrivalPosLat="0.00" arrivalSpeed="15.18" duration="182.00" routeLength="1997.01" waitingTime="29.00" waitingCount="1" stopTime="0.00" timeLoss="53.85" rerouteNo="1" devices="tripinfo_car_s2n_364 routing_car_s2n_364" vType="Car" speedFactor="1.13" vaporized=""/>
    <tripinfo id="car_n2s_334" depart="335.00" departLane="n2sep_1" departPos="3.60" departPosLat="0.00" departSpeed="13.90" departDelay="1.00" arrival="548.00" arrivalLane="c2s_1" arrivalPos="990.00" arrivalPosLat="0.00" arrivalSpeed="14.41" duration="213.00" routeLength="1997.01" waitingTime="56.00" waitingCount="1" stopTime="0.00" timeLoss="74.81" rerouteNo="1" devices="tripinfo_car_n2s_334 routing_car_n2s_334" vType="Car" speedFactor="1.04" vaporized=""/>
    <tripinfo id="car_n2w_343" depart="343.00" departLane="n2sep_1" departPos="3.60" departPosLat="0.00" departSpeed="13.90" departDelay="0.00" arrival="548.00" arrivalLane="c2w_1" arrivalPos="990.00" arrivalPosLat="0.00" arrivalSpeed="14.88" duration="205.00" routeLength="1986.69" waitingTime="54.00" waitingCount="1" stopTime="0.00" timeLoss="70.01" rerouteNo="1" devices="tripinfo_car_n2w_343 routing_car_n2w_343" vType="Car" speedFactor="1.07" vaporized=""/>
    <tripinfo id="car_s2n_375" depart="375.00" departLane="s2sep_1" departPos="3.60" departPosLat="0.00" departSpeed="13.90" departDelay="0.00" arrival="549.00" arrivalLane="c2n_1" arrivalPos="990.00" arrivalPosLat="0.00" arrivalSpeed="14.27" duration="174.00" routeLength="1997.01" waitingTime="19.00" waitingCount="1" stopTime="0.00" timeLoss="34.23" rerouteNo="1" devices="tripinfo_car_s2n_375 routing_car_s2n_375" vType="Car" speedFactor="1.03" vaporized=""/>
    <tripinfo id="car_s2w_351" depart="351.00" departLane="s2sep_1" departPos="3.60" departPosLat="0.00" departSpeed="13.90" departDelay="0.00" arrival="550.00" arrivalLane="c2w_1" arrivalPos="990.00" arrivalPosLat="0.00" arrivalSpeed="16.03" duration="199.00" routeLength="1996.47" waitingTime="57.00" waitingCount="2" stopTime="0.00" timeLoss="76.11" rerouteNo="1" devices="tripinfo_car_s2w_351 routing_car_s2w_351" vType="Car" speedFactor="1.18" vaporized=""/>
    <tripinfo id="car_n2s_354" depart="354.00" departLane="n2sep_1" departPos="3.60" departPosLat="0.00" departSpeed="13.90" departDelay="0.00" arrival="551.00" arrivalLane="c2s_1" arrivalPos="990.00" arrivalPosLat="0.00" arrivalSpeed="14.90" duration="197.00" routeLength="1997.01" waitingTime="46.00" waitingCount="1" stopTime="0.00" timeLoss="63.46" rerouteNo="1" devices="tripinfo_car_n2s_354 routing_car_n2s_354" vType="Car" speedFactor="1.08" vaporized=""/>
    <tripinfo id="bus_s2e_375" depart="377.00" departLane="s2sep_1" departPos="12.10" departPosLat="0.00" departSpeed="13.90" departDelay="2.00" arrival="554.00" arrivalLane="c2e_1" arrivalPos="990.00" arrivalPosLat="0.00" arrivalSpeed="13.90" duration="177.00" routeLength="1978.19" waitingTime="17.00" waitingCount="1" stopTime="0.00" timeLoss="33.71" rerouteNo="1" devices="tripinfo_bus_s2e_375 routing_bus_s2e_375" vType="Bus" speedFactor="1.00" vaporized=""/>
    <tripinfo id="car_n2s_386" depart="386.00" departLane="n2sep_1" departPos="3.60" departPosLat="0.00" departSpeed="13.90" departDelay="0.00" arrival="554.00" arrivalLane="c2s_1" arrivalPos="990.00" arrivalPosLat="0.00" arrivalSpeed="15.01" duration="168.00" routeLength="1997.01" waitingTime="16.00" waitingCount="1" stopTime="0.00" timeLoss="35.14" rerouteNo="1" devices="tripinfo_car_n2s_386 routing_car_n2s_386" vType="Car" speedFactor="1.09" vaporized=""/>
    <tripinfo id="car_s2n_412" depart="412.00" departLane="s2sep_1" departPos="3.60" departPosLat="0.00" departSpeed="13.90" departDelay="0.00" arrival="557.00" arrivalLane="c2n_1" arrivalPos="990.00" arrivalPosLat="0.00" arrivalSpeed="13.90" duration="145.00" routeLength="1997.01" waitingTime="0.00" waitingCount="0" stopTime="0.00" timeLoss="1.17" rerouteNo="1" devices="tripinfo_car_s2n_412 routing_car_s2n_412" vType="Car" speedFactor="1.00" vaporized=""/>
    <tripinfo id="car_n2e_377" depart="377.00" departLane="n2sep_1" departPos="3.60" departPosLat="0.00" departSpeed="13.90" departDelay="0.00" arrival="559.00" arrivalLane="c2e_1" arrivalPos="990.00" arrivalPosLat="0.00" arrivalSpeed="14.20" duration="182.00" routeLength="1996.47" waitingTime="23.00" waitingCount="2" stopTime="0.00" timeLoss="40.33" rerouteNo="1" devices="tripinfo_car_n2e_377 routing_car_n2e_377" vType="Car" speedFactor="1.02" vaporized=""/>
    <tripinfo id="car_n2e_408" depart="408.00" departLane="n2sep_1" departPos="3.60" departPosLat="0.00" departSpeed="13.90" departDelay="0.00" arrival="561.00" arrivalLane="c2e_1" arrivalPos="990.00" arrivalPosLat="0.00" arrivalSpeed="15.36" duration="153.00" routeLength="1996.47" waitingTime="6.00" waitingCount="1" stopTime="0.00" timeLoss="26.22" rerouteNo="1" devices="tripinfo_car_n2e_408 routing_car_n2e_408" vType="Car" speedFactor="1.14" vaporized=""/>
    <tripinfo id="car_n2w_416" depart="416.00" departLane="n2sep_1" departPos="3.60" departPosLat="0.00" departSpeed="13.90" departDelay="0.00" arrival="561.00" arrivalLane="c2w_1" arrivalPos="990.00" arrivalPosLat="0.00" arrivalSpeed="14.33" duration="145.00" routeLength="1986.69" waitingTime="0.00" waitingCount="0" stopTime="0.00" timeLoss="5.65" rerouteNo="1" devices="tripinfo_car_n2w_416 routing_car_n2w_416" vType="Car" speedFactor="1.03" vaporized=""/>
    <tripinfo id="car_n2s_420" depart="420.00" departLane="n2sep_1" departPos="3.60" departPosLat="0.00" departSpeed="13.90" departDelay="0.00" arrival="561.00" arrivalLane="c2s_1" arrivalPos="990.00" arrivalPosLat="0.00" arrivalSpeed="14.80" duration="141.00" routeLength="1997.01" waitingTime="0.00" waitingCount="0" stopTime="0.00" timeLoss="5.75" rerouteNo="1" devices="tripinfo_car_n2s_420 routing_car_n2s_420" vType="Car" speedFactor="1.06" vaporized=""/>
    <tripinfo id="car_s2n_427" depart="429.00" departLane="s2sep_1" departPos="3.60" departPosLat="0.00" departSpeed="13.90" departDelay="2.00" arrival="564.00" arrivalLane="c2n_1" arrivalPos="990.00" arrivalPosLat="0.00" arrivalSpeed="15.04" duration="135.00" routeLength="1997.01" waitingTime="0.00" waitingCount="0" stopTime="0.00" timeLoss="1.30" rerouteNo="1" devices="tripinfo_car_s2n_427 routing_car_s2n_427" vType="Car" speedFactor="1.08" vaporized=""/>
</tripinfos>
