<?xml version="1.0" encoding="UTF-8"?>

<!-- generated on Sat Apr 24 18:23:23 2021 by Eclipse SUMO Version 1.4.0
<configuration xmlns:xsi="http://www.w3.org/2001/XMLSchema-instance" xsi:noNamespaceSchemaLocation="http://sumo.dlr.de/xsd/sumoConfiguration.xsd">

    <input>
        <net-file value="sumofiles/junction.net.xml"/>
        <route-files value="sumofiles/junction_preemption_151.rou.xml"/>
        <additional-files value="sumofiles/junction.det.xml"/>
    </input>

    <output>
        <tripinfo-output value="sumofiles/output/tripinfo_preemption_151.xml"/>
    </output>

    <time>
        <begin value="0"/>
        <end value="10000"/>
        <step-length value="0.05"/>
    </time>

    <processing>
        <lateral-resolution value="0.1"/>
    </processing>

    <report>
        <no-warnings value="true"/>
        <error-log value="sumofiles/output/errorlog_preemption_151.log"/>
        <no-step-log value="true"/>
    </report>

    <traci_server>
        <remote-port value="59685"/>
    </traci_server>

    <gui_only>
        <gui-settings-file value="sumofiles/junction-gui.settings.xml"/>
        <tracker-interval value="0.05"/>
    </gui_only>

</configuration>
-->

<tripinfos xmlns:xsi="http://www.w3.org/2001/XMLSchema-instance" xsi:noNamespaceSchemaLocation="http://sumo.dlr.de/xsd/tripinfo_file.xsd">
    <tripinfo id="car_e2w_3" depart="3.00" departLane="e2sep_1" departPos="3.60" departPosLat="0.00" departSpeed="13.90" departDelay="0.00" arrival="138.70" arrivalLane="c2w_1" arrivalPos="990.00" arrivalPosLat="0.00" arrivalSpeed="14.73" duration="135.70" routeLength="1997.01" waitingTime="0.00" waitingCount="0" stopTime="0.00" timeLoss="0.15" rerouteNo="1" devices="tripinfo_car_e2w_3 routing_car_e2w_3" vType="Car" speedFactor="1.06" vaporized=""/>
    <tripinfo id="car_e2w_9" depart="9.00" departLane="e2sep_1" departPos="3.60" departPosLat="0.00" departSpeed="13.90" departDelay="0.00" arrival="145.75" arrivalLane="c2w_1" arrivalPos="990.00" arrivalPosLat="0.00" arrivalSpeed="14.73" duration="136.75" routeLength="1997.01" waitingTime="0.00" waitingCount="0" stopTime="0.00" timeLoss="1.18" rerouteNo="1" devices="tripinfo_car_e2w_9 routing_car_e2w_9" vType="Car" speedFactor="1.06" vaporized=""/>
    <tripinfo id="car_e2s_11" depart="11.00" departLane="e2sep_1" departPos="3.60" departPosLat="0.00" departSpeed="13.90" departDelay="0.00" arrival="156.15" arrivalLane="c2s_1" arrivalPos="990.00" arrivalPosLat="0.00" arrivalSpeed="14.32" duration="145.15" routeLength="1996.47" waitingTime="0.00" waitingCount="0" stopTime="0.00" timeLoss="5.06" rerouteNo="1" devices="tripinfo_car_e2s_11 routing_car_e2s_11" vType="Car" speedFactor="1.03" vaporized=""/>
    <tripinfo id="car_s2e_21" depart="21.00" departLane="s2sep_1" departPos="3.60" departPosLat="0.00" departSpeed="13.90" departDelay="0.00" arrival="160.35" arrivalLane="c2e_1" arrivalPos="990.00" arrivalPosLat="0.00" arrivalSpeed="15.61" duration="139.35" routeLength="1986.69" waitingTime="1.20" waitingCount="1" stopTime="0.00" timeLoss="11.41" rerouteNo="1" devices="tripinfo_car_s2e_21 routing_car_s2e_21" vType="Car" speedFactor="1.12" vaporized=""/>
    <tripinfo id="car_n2w_11" depart="11.00" departLane="n2sep_1" departPos="3.60" departPosLat="0.00" departSpeed="13.90" departDelay="0.00" arrival="160.40" arrivalLane="c2w_1" arrivalPos="990.00" arrivalPosLat="0.00" arrivalSpeed="15.05" duration="149.40" routeLength="1986.69" waitingTime="9.05" waitingCount="1" stopTime="0.00" timeLoss="16.69" rerouteNo="1" devices="tripinfo_car_n2w_11 routing_car_n2w_11" vType="Car" speedFactor="1.08" vaporized=""/>
    <tripinfo id="car_n2w_16" depart="16.00" departLane="n2sep_1" departPos="3.60" departPosLat="0.00" departSpeed="13.90" departDelay="0.00" arrival="164.70" arrivalLane="c2w_1" arrivalPos="990.00" arrivalPosLat="0.00" arrivalSpeed="15.03" duration="148.70" routeLength="1986.69" waitingTime="4.55" waitingCount="1" stopTime="0.00" timeLoss="16.03" rerouteNo="1" devices="tripinfo_car_n2w_16 routing_car_n2w_16" vType="Car" speedFactor="1.08" vaporized=""/>
    <tripinfo id="car_s2n_9" depart="9.00" departLane="s2sep_1" departPos="3.60" departPosLat="0.00" departSpeed="13.90" departDelay="0.00" arrival="165.00" arrivalLane="c2n_1" arrivalPos="990.00" arrivalPosLat="0.00" arrivalSpeed="14.04" duration="156.00" routeLength="1997.01" waitingTime="6.65" waitingCount="1" stopTime="0.00" timeLoss="13.77" rerouteNo="1" devices="tripinfo_car_s2n_9 routing_car_s2n_9" vType="Car" speedFactor="1.01" vaporized=""/>
    <tripinfo id="car_s2w_13" depart="13.00" departLane="s2sep_1" departPos="3.60" departPosLat="0.00" departSpeed="13.90" departDelay="0.00" arrival="169.80" arrivalLane="c2w_1" arrivalPos="990.00" arrivalPosLat="0.00" arrivalSpeed="14.53" duration="156.80" routeLength="1996.47" waitingTime="4.50" waitingCount="2" stopTime="0.00" timeLoss="18.77" rerouteNo="1" devices="tripinfo_car_s2w_13 routing_car_s2w_13" vType="Car" speedFactor="1.05" vaporized=""/>
    <tripinfo id="car_s2e_24" depart="25.50" departLane="s2sep_1" departPos="3.60" departPosLat="0.00" departSpeed="13.90" departDelay="1.50" arrival="171.50" arrivalLane="c2e_1" arrivalPos="990.00" arrivalPosLat="0.00" arrivalSpeed="14.54" duration="146.00" routeLength="1986.69" waitingTime="0.00" waitingCount="0" stopTime="0.00" timeLoss="8.65" rerouteNo="1" devices="tripinfo_car_s2e_24 routing_car_s2e_24" vType="Car" speedFactor="1.05" vaporized=""/>
    <tripinfo id="car_s2w_24" depart="24.00" departLane="s2sep_1" departPos="3.60" departPosLat="0.00" departSpeed="13.90" departDelay="0.00" arrival="175.25" arrivalLane="c2w_1" arrivalPos="990.00" arrivalPosLat="0.00" arrivalSpeed="13.90" duration="151.25" routeLength="1996.47" waitingTime="0.00" waitingCount="0" stopTime="0.00" timeLoss="6.92" rerouteNo="1" devices="tripinfo_car_s2w_24 routing_car_s2w_24" vType="Car" speedFactor="1.00" vaporized=""/>
    <tripinfo id="car_n2s_33" depart="33.00" departLane="n2sep_1" departPos="3.60" departPosLat="0.00" departSpeed="13.90" departDelay="0.00" arrival="177.10" arrivalLane="c2s_1" arrivalPos="990.00" arrivalPosLat="0.00" arrivalSpeed="13.90" duration="144.10" routeLength="1997.01" waitingTime="0.00" waitingCount="0" stopTime="0.00" timeLoss="0.41" rerouteNo="1" devices="tripinfo_car_n2s_33 routing_car_n2s_33" vType="Car" speedFactor="1.00" vaporized=""/>
    <tripinfo id="car_n2s_36" depart="36.00" departLane="n2sep_1" departPos="3.60" departPosLat="0.00" departSpeed="13.90" departDelay="0.00" arrival="182.55" arrivalLane="c2s_1" arrivalPos="990.00" arrivalPosLat="0.00" arrivalSpeed="13.90" duration="146.55" routeLength="1997.01" waitingTime="0.00" waitingCount="0" stopTime="0.00" timeLoss="2.86" rerouteNo="1" devices="tripinfo_car_n2s_36 routing_car_n2s_36" vType="Car" speedFactor="1.00" vaporized=""/>
    <tripinfo id="car_s2w_41" depart="41.00" departLane="s2sep_1" departPos="3.60" departPosLat="0.00" departSpeed="13.90" departDelay="0.00" arrival="186.35" arrivalLane="c2w_1" arrivalPos="990.00" arrivalPosLat="0.00" arrivalSpeed="14.15" duration="145.35" routeLength="1996.47" waitingTime="0.00" waitingCount="0" stopTime="0.00" timeLoss="3.57" rerouteNo="1" devices="tripinfo_car_s2w_41 routing_car_s2w_41" vType="Car" speedFactor="1.02" vaporized=""/>
    <tripinfo id="car_n2s_54" depart="54.00" departLane="n2sep_1" departPos="3.60" departPosLat="0.00" departSpeed="13.90" departDelay="0.00" arrival="187.90" arrivalLane="c2s_1" arrivalPos="990.00" arrivalPosLat="0.00" arrivalSpeed="15.60" duration="133.90" routeLength="1997.01" waitingTime="0.00" waitingCount="0" stopTime="0.00" timeLoss="5.92" rerouteNo="1" devices="tripinfo_car_n2s_54 routing_car_n2s_54" vType="Car" speedFactor="1.12" vaporized=""/>
    <tripinfo id="car_n2w_48" depart="48.00" departLane="n2sep_1" departPos="3.60" departPosLat="0.00" departSpeed="13.90" departDelay="0.00" arrival="192.45" arrivalLane="c2w_1" arrivalPos="990.00" arrivalPosLat="0.00" arrivalSpeed="14.26" duration="144.45" routeLength="1986.69" waitingTime="0.00" waitingCount="0" stopTime="0.00" timeLoss="4.44" rerouteNo="1" devices="tripinfo_car_n2w_48 routing_car_n2w_48" vType="Car" speedFactor="1.03" vaporized=""/>
    <tripinfo id="car_e2w_17" depart="17.00" departLane="e2sep_1" departPos="3.60" departPosLat="0.00" departSpeed="13.90" departDelay="0.00" arrival="207.10" arrivalLane="c2w_1" arrivalPos="990.00" arrivalPosLat="0.00" arrivalSpeed="15.16" duration="190.10" routeLength="1997.01" waitingTime="43.70" waitingCount="1" stopTime="0.00" timeLoss="58.34" rerouteNo="1" devices="tripinfo_car_e2w_17 routing_car_e2w_17" vType="Car" speedFactor="1.09" vaporized=""/>
    <tripinfo id="car_w2s_15" depart="15.00" departLane="w2sep_1" departPos="3.60" departPosLat="0.00" departSpeed="13.90" departDelay="0.00" arrival="209.90" arrivalLane="c2s_1" arrivalPos="990.00" arrivalPosLat="0.00" arrivalSpeed="14.04" duration="194.90" routeLength="1986.69" waitingTime="45.90" waitingCount="1" stopTime="0.00" timeLoss="52.74" rerouteNo="1" devices="tripinfo_car_w2s_15 routing_car_w2s_15" vType="Car" speedFactor="1.01" vaporized=""/>
    <tripinfo id="car_e2n_12" depart="12.55" departLane="e2sep_1" departPos="3.60" departPosLat="0.00" departSpeed="13.90" departDelay="0.55" arrival="210.65" arrivalLane="c2n_1" arrivalPos="990.00" arrivalPosLat="0.00" arrivalSpeed="13.90" duration="198.10" routeLength="1986.69" waitingTime="44.80" waitingCount="1" stopTime="0.00" timeLoss="54.40" rerouteNo="1" devices="tripinfo_car_e2n_12 routing_car_e2n_12" vType="Car" speedFactor="1.00" vaporized=""/>
    <tripinfo id="car_w2e_17" depart="17.00" departLane="w2sep_1" departPos="3.60" departPosLat="0.00" departSpeed="13.90" departDelay="0.00" arrival="210.75" arrivalLane="c2e_1" arrivalPos="990.00" arrivalPosLat="0.00" arrivalSpeed="14.32" duration="193.75" routeLength="1997.01" waitingTime="43.45" waitingCount="1" stopTime="0.00" timeLoss="54.28" rerouteNo="1" devices="tripinfo_car_w2e_17 routing_car_w2e_17" vType="Car" speedFactor="1.03" vaporized=""/>
    <tripinfo id="car_w2s_20" depart="20.00" departLane="w2sep_1" departPos="3.60" departPosLat="0.00" departSpeed="13.90" departDelay="0.00" arrival="213.75" arrivalLane="c2s_1" arrivalPos="990.00" arrivalPosLat="0.00" arrivalSpeed="14.53" duration="193.75" routeLength="1986.69" waitingTime="41.80" waitingCount="1" stopTime="0.00" timeLoss="56.54" rerouteNo="1" devices="tripinfo_car_w2s_20 routing_car_w2s_20" vType="Car" speedFactor="1.05" vaporized=""/>
    <tripinfo id="car_w2e_87" depart="87.00" departLane="w2sep_1" departPos="3.60" departPosLat="0.00" departSpeed="13.90" departDelay="0.00" arrival="216.35" arrivalLane="c2e_1" arrivalPos="990.00" arrivalPosLat="0.00" arrivalSpeed="16.39" duration="129.35" routeLength="1997.01" waitingTime="0.00" waitingCount="0" stopTime="0.00" timeLoss="7.56" rerouteNo="1" devices="tripinfo_car_w2e_87 routing_car_w2e_87" vType="Car" speedFactor="1.18" vaporized=""/>
    <tripinfo id="car_e2s_17" depart="18.40" departLane="e2sep_1" departPos="3.60" departPosLat="0.00" departSpeed="13.90" departDelay="1.40" arrival="218.35" arrivalLane="c2s_1" arrivalPos="990.00" arrivalPosLat="0.00" arrivalSpeed="14.26" duration="199.95" routeLength="1996.47" waitingTime="43.15" waitingCount="2" stopTime="0.00" timeLoss="59.30" rerouteNo="1" devices="tripinfo_car_e2s_17 routing_car_e2s_17" vType="Car" speedFactor="1.03" vaporized=""/>
    <tripinfo id="bus_e2n_25" depart="25.00" departLane="e2sep_1" departPos="12.10" departPosLat="0.00" departSpeed="13.90" departDelay="0.00" arrival="218.90" arrivalLane="c2n_1" arrivalPos="990.00" arrivalPosLat="0.00" arrivalSpeed="13.90" duration="193.90" routeLength="1978.19" waitingTime="37.70" waitingCount="1" stopTime="0.00" timeLoss="50.88" rerouteNo="1" devices="tripinfo_bus_e2n_25 routing_bus_e2n_25" vType="Bus" speedFactor="1.00" vaporized=""/>
    <tripinfo id="car_e2n_40" depart="40.00" departLane="e2sep_1" departPos="3.60" departPosLat="0.00" departSpeed="13.90" departDelay="0.00" arrival="221.35" arrivalLane="c2n_1" arrivalPos="990.00" arrivalPosLat="0.00" arrivalSpeed="15.57" duration="181.35" routeLength="1986.69" waitingTime="33.10" waitingCount="1" stopTime="0.00" timeLoss="57.32" rerouteNo="1" devices="tripinfo_car_e2n_40 routing_car_e2n_40" vType="Car" speedFactor="1.16" vaporized=""/>
    <tripinfo id="car_e2s_51" depart="51.00" departLane="e2sep_1" departPos="3.60" departPosLat="0.00" departSpeed="13.90" departDelay="0.00" arrival="221.45" arrivalLane="c2s_1" arrivalPos="990.00" arrivalPosLat="0.00" arrivalSpeed="14.49" duration="170.45" routeLength="1996.47" waitingTime="15.30" waitingCount="2" stopTime="0.00" timeLoss="32.61" rerouteNo="1" devices="tripinfo_car_e2s_51 routing_car_e2s_51" vType="Car" speedFactor="1.05" vaporized=""/>
    <tripinfo id="car_e2n_63" depart="63.00" departLane="e2sep_1" departPos="3.60" departPosLat="0.00" departSpeed="13.90" departDelay="0.00" arrival="223.50" arrivalLane="c2n_1" arrivalPos="990.00" arrivalPosLat="0.00" arrivalSpeed="15.34" duration="160.50" routeLength="1986.69" waitingTime="3.75" waitingCount="1" stopTime="0.00" timeLoss="33.54" rerouteNo="1" devices="tripinfo_car_e2n_63 routing_car_e2n_63" vType="Car" speedFactor="1.13" vaporized=""/>
    <tripinfo id="car_e2s_60" depart="60.00" departLane="e2sep_1" departPos="3.60" departPosLat="0.00" departSpeed="13.90" departDelay="0.00" arrival="225.75" arrivalLane="c2s_1" arrivalPos="990.00" arrivalPosLat="0.00" arrivalSpeed="13.89" duration="165.75" routeLength="1996.47" waitingTime="1.95" waitingCount="1" stopTime="0.00" timeLoss="21.42" rerouteNo="1" devices="tripinfo_car_e2s_60 routing_car_e2s_60" vType="Car" speedFactor="1.00" vaporized=""/>
    <tripinfo id="car_w2n_26" depart="26.00" departLane="w2sep_1" departPos="3.60" departPosLat="0.00" departSpeed="13.90" departDelay="0.00" arrival="228.00" arrivalLane="c2n_1" arrivalPos="990.00" arrivalPosLat="0.00" arrivalSpeed="13.89" duration="202.00" routeLength="1996.47" waitingTime="44.35" waitingCount="2" stopTime="0.00" timeLoss="57.68" rerouteNo="1" devices="tripinfo_car_w2n_26 routing_car_w2n_26" vType="Car" speedFactor="1.00" vaporized=""/>
    <tripinfo id="car_e2s_63" depart="64.35" departLane="e2sep_1" departPos="3.60" departPosLat="0.00" departSpeed="13.90" departDelay="1.35" arrival="231.00" arrivalLane="c2s_1" arrivalPos="990.00" arrivalPosLat="0.00" arrivalSpeed="13.90" duration="166.65" routeLength="1996.47" waitingTime="1.25" waitingCount="1" stopTime="0.00" timeLoss="22.34" rerouteNo="1" devices="tripinfo_car_e2s_63 routing_car_e2s_63" vType="Car" speedFactor="1.00" vaporized=""/>
    <tripinfo id="car_w2n_44" depart="44.00" departLane="w2sep_1" departPos="3.60" departPosLat="0.00" departSpeed="13.90" departDelay="0.00" arrival="231.35" arrivalLane="c2n_1" arrivalPos="990.00" arrivalPosLat="0.00" arrivalSpeed="14.00" duration="187.35" routeLength="1996.47" waitingTime="27.50" waitingCount="2" stopTime="0.00" timeLoss="44.46" rerouteNo="1" devices="tripinfo_car_w2n_44 routing_car_w2n_44" vType="Car" speedFactor="1.01" vaporized=""/>
    <tripinfo id="car_w2n_48" depart="48.00" departLane="w2sep_1" departPos="3.60" departPosLat="0.00" departSpeed="13.90" departDelay="0.00" arrival="233.45" arrivalLane="c2n_1" arrivalPos="990.00" arrivalPosLat="0.00" arrivalSpeed="14.77" duration="185.45" routeLength="1996.47" waitingTime="24.15" waitingCount="2" stopTime="0.00" timeLoss="53.15" rerouteNo="1" devices="tripinfo_car_w2n_48 routing_car_w2n_48" vType="Car" speedFactor="1.09" vaporized=""/>
    <tripinfo id="car_w2n_65" depart="65.00" departLane="w2sep_1" departPos="3.60" departPosLat="0.00" departSpeed="13.90" departDelay="0.00" arrival="235.30" arrivalLane="c2n_1" arrivalPos="990.00" arrivalPosLat="0.00" arrivalSpeed="15.50" duration="170.30" routeLength="1996.47" waitingTime="15.05" waitingCount="2" stopTime="0.00" timeLoss="47.82" rerouteNo="1" devices="tripinfo_car_w2n_65 routing_car_w2n_65" vType="Car" speedFactor="1.18" vaporized=""/>
    <tripinfo id="car_w2n_77" depart="77.00" departLane="w2sep_1" departPos="3.60" departPosLat="0.00" departSpeed="13.90" departDelay="0.00" arrival="237.20" arrivalLane="c2n_1" arrivalPos="990.00" arrivalPosLat="0.00" arrivalSpeed="15.38" duration="160.20" routeLength="1996.47" waitingTime="6.45" waitingCount="1" stopTime="0.00" timeLoss="35.16" rerouteNo="1" devices="tripinfo_car_w2n_77 routing_car_w2n_77" vType="Car" speedFactor="1.15" vaporized=""/>
    <tripinfo id="bus_w2s_89" depart="89.00" departLane="w2sep_1" departPos="12.10" departPosLat="0.00" departSpeed="13.90" departDelay="0.00" arrival="238.95" arrivalLane="c2s_1" arrivalPos="990.00" arrivalPosLat="0.00" arrivalSpeed="13.89" duration="149.95" routeLength="1978.19" waitingTime="0.00" waitingCount="0" stopTime="0.00" timeLoss="6.91" rerouteNo="1" devices="tripinfo_bus_w2s_89 routing_bus_w2s_89" vType="Bus" speedFactor="1.00" vaporized=""/>
    <tripinfo id="car_w2n_83" depart="83.00" departLane="w2sep_1" departPos="3.60" departPosLat="0.00" departSpeed="13.90" departDelay="0.00" arrival="240.20" arrivalLane="c2n_1" arrivalPos="990.00" arrivalPosLat="0.00" arrivalSpeed="14.11" duration="157.20" routeLength="1996.47" waitingTime="0.00" waitingCount="0" stopTime="0.00" timeLoss="15.68" rerouteNo="1" devices="tripinfo_car_w2n_83 routing_car_w2n_83" vType="Car" speedFactor="1.02" vaporized=""/>
    <tripinfo id="car_w2s_96" depart="96.00" departLane="w2sep_1" departPos="3.60" departPosLat="0.00" departSpeed="13.90" departDelay="0.00" arrival="242.85" arrivalLane="c2s_1" arrivalPos="990.00" arrivalPosLat="0.00" arrivalSpeed="14.29" duration="146.85" routeLength="1986.69" waitingTime="0.00" waitingCount="0" stopTime="0.00" timeLoss="7.43" rerouteNo="1" devices="tripinfo_car_w2s_96 routing_car_w2s_96" vType="Car" speedFactor="1.03" vaporized=""/>
    <tripinfo id="car_n2s_95" depart="95.00" departLane="n2sep_1" departPos="3.60" departPosLat="0.00" departSpeed="13.90" departDelay="0.00" arrival="250.80" arrivalLane="c2s_1" arrivalPos="990.00" arrivalPosLat="0.00" arrivalSpeed="16.10" duration="155.80" routeLength="1997.01" waitingTime="21.00" waitingCount="1" stopTime="0.00" timeLoss="31.74" rerouteNo="1" devices="tripinfo_car_n2s_95 routing_car_n2s_95" vType="Car" speedFactor="1.16" vaporized=""/>
    <tripinfo id="car_n2w_55" depart="55.30" departLane="n2sep_1" departPos="3.60" departPosLat="0.00" departSpeed="13.90" departDelay="0.30" arrival="255.60" arrivalLane="c2w_1" arrivalPos="990.00" arrivalPosLat="0.00" arrivalSpeed="13.90" duration="200.30" routeLength="1986.69" waitingTime="48.70" waitingCount="1" stopTime="0.00" timeLoss="56.65" rerouteNo="1" devices="tripinfo_car_n2w_55 routing_car_n2w_55" vType="Car" speedFactor="1.00" vaporized=""/>
    <tripinfo id="car_s2e_82" depart="82.00" departLane="s2sep_1" departPos="3.60" departPosLat="0.00" departSpeed="13.90" departDelay="0.00" arrival="255.65" arrivalLane="c2e_1" arrivalPos="990.00" arrivalPosLat="0.00" arrivalSpeed="13.90" duration="173.65" routeLength="1986.69" waitingTime="22.10" waitingCount="1" stopTime="0.00" timeLoss="29.95" rerouteNo="1" devices="tripinfo_car_s2e_82 routing_car_s2e_82" vType="Car" speedFactor="1.00" vaporized=""/>
    <tripinfo id="car_n2s_105" depart="105.00" departLane="n2sep_1" departPos="3.60" departPosLat="0.00" departSpeed="13.90" departDelay="0.00" arrival="257.45" arrivalLane="c2s_1" arrivalPos="990.00" arrivalPosLat="0.00" arrivalSpeed="15.12" duration="152.45" routeLength="1997.01" waitingTime="8.05" waitingCount="1" stopTime="0.00" timeLoss="20.38" rerouteNo="1" devices="tripinfo_car_n2s_105 routing_car_n2s_105" vType="Car" speedFactor="1.09" vaporized=""/>
    <tripinfo id="car_n2w_81" depart="81.00" departLane="n2sep_1" departPos="3.60" departPosLat="0.00" departSpeed="13.90" departDelay="0.00" arrival="257.50" arrivalLane="c2w_1" arrivalPos="990.00" arrivalPosLat="0.00" arrivalSpeed="15.47" duration="176.50" routeLength="1986.69" waitingTime="34.65" waitingCount="1" stopTime="0.00" timeLoss="53.87" rerouteNo="1" devices="tripinfo_car_n2w_81 routing_car_n2w_81" vType="Car" speedFactor="1.17" vaporized=""/>
    <tripinfo id="car_s2n_85" depart="85.00" departLane="s2sep_1" departPos="3.60" departPosLat="0.00" departSpeed="13.90" departDelay="0.00" arrival="257.85" arrivalLane="c2n_1" arrivalPos="990.00" arrivalPosLat="0.00" arrivalSpeed="13.90" duration="172.85" routeLength="1997.01" waitingTime="19.20" waitingCount="1" stopTime="0.00" timeLoss="29.17" rerouteNo="1" devices="tripinfo_car_s2n_85 routing_car_s2n_85" vType="Car" speedFactor="1.00" vaporized=""/>
    <tripinfo id="car_s2e_92" depart="92.00" departLane="s2sep_1" departPos="3.60" departPosLat="0.00" departSpeed="13.90" departDelay="0.00" arrival="257.90" arrivalLane="c2e_1" arrivalPos="990.00" arrivalPosLat="0.00" arrivalSpeed="15.00" duration="165.90" routeLength="1986.69" waitingTime="18.25" waitingCount="1" stopTime="0.00" timeLoss="35.56" rerouteNo="1" devices="tripinfo_car_s2e_92 routing_car_s2e_92" vType="Car" speedFactor="1.10" vaporized=""/>
    <tripinfo id="car_s2e_96" depart="96.00" departLane="s2sep_1" departPos="3.60" departPosLat="0.00" departSpeed="13.90" departDelay="0.00" arrival="260.50" arrivalLane="c2e_1" arrivalPos="990.00" arrivalPosLat="0.00" arrivalSpeed="15.02" duration="164.50" routeLength="1986.69" waitingTime="16.65" waitingCount="1" stopTime="0.00" timeLoss="32.93" rerouteNo="1" devices="tripinfo_car_s2e_96 routing_car_s2e_96" vType="Car" speedFactor="1.09" vaporized=""/>
    <tripinfo id="car_s2n_99" depart="99.00" departLane="s2sep_1" departPos="3.60" departPosLat="0.00" departSpeed="13.90" departDelay="0.00" arrival="262.80" arrivalLane="c2n_1" arrivalPos="990.00" arrivalPosLat="0.00" arrivalSpeed="14.42" duration="163.80" routeLength="1997.01" waitingTime="12.20" waitingCount="1" stopTime="0.00" timeLoss="25.32" rerouteNo="1" devices="tripinfo_car_s2n_99 routing_car_s2n_99" vType="Car" speedFactor="1.04" vaporized=""/>
    <tripinfo id="car_s2w_78" depart="78.00" departLane="s2sep_1" departPos="3.60" departPosLat="0.00" departSpeed="13.90" departDelay="0.00" arrival="264.90" arrivalLane="c2w_1" arrivalPos="990.00" arrivalPosLat="0.00" arrivalSpeed="13.97" duration="186.90" routeLength="1996.47" waitingTime="32.05" waitingCount="2" stopTime="0.00" timeLoss="43.32" rerouteNo="1" devices="tripinfo_car_s2w_78 routing_car_s2w_78" vType="Car" speedFactor="1.01" vaporized=""/>
    <tripinfo id="car_s2w_102" depart="102.00" departLane="s2sep_1" departPos="3.60" departPosLat="0.00" departSpeed="13.90" departDelay="0.00" arrival="267.95" arrivalLane="c2w_1" arrivalPos="990.00" arrivalPosLat="0.00" arrivalSpeed="14.43" duration="165.95" routeLength="1996.47" waitingTime="8.40" waitingCount="2" stopTime="0.00" timeLoss="27.62" rerouteNo="1" devices="tripinfo_car_s2w_102 routing_car_s2w_102" vType="Car" speedFactor="1.04" vaporized=""/>
    <tripinfo id="car_s2n_116" depart="116.00" departLane="s2sep_1" departPos="3.60" departPosLat="0.00" departSpeed="13.90" departDelay="0.00" arrival="268.15" arrivalLane="c2n_1" arrivalPos="990.00" arrivalPosLat="0.00" arrivalSpeed="13.90" duration="152.15" routeLength="1997.01" waitingTime="0.00" waitingCount="0" stopTime="0.00" timeLoss="8.48" rerouteNo="1" devices="tripinfo_car_s2n_116 routing_car_s2n_116" vType="Car" speedFactor="1.00" vaporized=""/>
    <tripinfo id="car_s2e_122" depart="122.00" departLane="s2sep_1" departPos="3.60" departPosLat="0.00" departSpeed="13.90" departDelay="0.00" arrival="269.95" arrivalLane="c2e_1" arrivalPos="990.00" arrivalPosLat="0.00" arrivalSpeed="13.94" duration="147.95" routeLength="1986.69" waitingTime="0.00" waitingCount="0" stopTime="0.00" timeLoss="4.74" rerouteNo="1" devices="tripinfo_car_s2e_122 routing_car_s2e_122" vType="Car" speedFactor="1.00" vaporized=""/>
    <tripinfo id="car_s2n_125" depart="125.00" departLane="s2sep_1" departPos="3.60" departPosLat="0.00" departSpeed="13.90" departDelay="0.00" arrival="270.10" arrivalLane="c2n_1" arrivalPos="990.00" arrivalPosLat="0.00" arrivalSpeed="15.23" duration="145.10" routeLength="1997.01" waitingTime="0.00" waitingCount="0" stopTime="0.00" timeLoss="19.34" rerouteNo="1" devices="tripinfo_car_s2n_125 routing_car_s2n_125" vType="Car" speedFactor="1.14" vaporized=""/>
    <tripinfo id="car_s2e_139" depart="139.00" departLane="s2sep_1" departPos="3.60" departPosLat="0.00" departSpeed="13.90" departDelay="0.00" arrival="271.85" arrivalLane="c2e_1" arrivalPos="990.00" arrivalPosLat="0.00" arrivalSpeed="15.57" duration="132.85" routeLength="1986.69" waitingTime="0.00" waitingCount="0" stopTime="0.00" timeLoss="10.93" rerouteNo="1" devices="tripinfo_car_s2e_139 routing_car_s2e_139" vType="Car" speedFactor="1.18" vaporized=""/>
    <tripinfo id="car_n2w_128" depart="128.00" departLane="n2sep_1" departPos="3.60" departPosLat="0.00" departSpeed="13.90" departDelay="0.00" arrival="277.25" arrivalLane="c2w_1" arrivalPos="990.00" arrivalPosLat="0.00" arrivalSpeed="14.23" duration="149.25" routeLength="1986.69" waitingTime="0.00" waitingCount="0" stopTime="0.00" timeLoss="8.91" rerouteNo="1" devices="tripinfo_car_n2w_128 routing_car_n2w_128" vType="Car" speedFactor="1.02" vaporized=""/>
    <tripinfo id="car_s2w_135" depart="135.00" departLane="s2sep_1" departPos="3.60" departPosLat="0.00" departSpeed="13.90" departDelay="0.00" arrival="279.55" arrivalLane="c2w_1" arrivalPos="990.00" arrivalPosLat="0.00" arrivalSpeed="15.24" duration="144.55" routeLength="1996.47" waitingTime="2.60" waitingCount="1" stopTime="0.00" timeLoss="15.61" rerouteNo="1" devices="tripinfo_car_s2w_135 routing_car_s2w_135" vType="Car" speedFactor="1.12" vaporized=""/>
    <tripinfo id="car_n2e_96" depart="96.25" departLane="n2sep_1" departPos="3.60" departPosLat="0.00" departSpeed="13.90" departDelay="0.25" arrival="279.75" arrivalLane="c2e_1" arrivalPos="990.00" arrivalPosLat="0.00" arrivalSpeed="14.15" duration="183.50" routeLength="1996.47" waitingTime="28.40" waitingCount="3" stopTime="0.00" timeLoss="41.74" rerouteNo="1" devices="tripinfo_car_n2e_96 routing_car_n2e_96" vType="Car" speedFactor="1.02" vaporized=""/>
    <tripinfo id="car_n2e_110" depart="110.00" departLane="n2sep_1" departPos="3.60" departPosLat="0.00" departSpeed="13.90" departDelay="0.00" arrival="284.65" arrivalLane="c2e_1" arrivalPos="990.00" arrivalPosLat="0.00" arrivalSpeed="13.89" duration="174.65" routeLength="1996.47" waitingTime="18.60" waitingCount="1" stopTime="0.00" timeLoss="30.31" rerouteNo="1" devices="tripinfo_car_n2e_110 routing_car_n2e_110" vType="Car" speedFactor="1.00" vaporized=""/>
    <tripinfo id="car_n2s_141" depart="141.00" departLane="n2sep_1" departPos="3.60" departPosLat="0.00" departSpeed="13.90" departDelay="0.00" arrival="284.70" arrivalLane="c2s_1" arrivalPos="990.00" arrivalPosLat="0.00" arrivalSpeed="13.97" duration="143.70" routeLength="1997.01" waitingTime="0.00" waitingCount="0" stopTime="0.00" timeLoss="0.73" rerouteNo="1" devices="tripinfo_car_n2s_141 routing_car_n2s_141" vType="Car" speedFactor="1.01" vaporized=""/>
    <tripinfo id="car_n2e_124" depart="124.00" departLane="n2sep_1" departPos="3.60" departPosLat="0.00" departSpeed="13.90" departDelay="0.00" arrival="288.30" arrivalLane="c2e_1" arrivalPos="990.00" arrivalPosLat="0.00" arrivalSpeed="13.87" duration="164.30" routeLength="1996.47" waitingTime="5.80" waitingCount="1" stopTime="0.00" timeLoss="19.99" rerouteNo="1" devices="tripinfo_car_n2e_124 routing_car_n2e_124" vType="Car" speedFactor="1.00" vaporized=""/>
    <tripinfo id="car_s2w_147" depart="147.00" departLane="s2sep_1" departPos="3.60" departPosLat="0.00" departSpeed="13.90" departDelay="0.00" arrival="291.60" arrivalLane="c2w_1" arrivalPos="990.00" arrivalPosLat="0.00" arrivalSpeed="14.22" duration="144.60" routeLength="1996.47" waitingTime="0.00" waitingCount="0" stopTime="0.00" timeLoss="3.55" rerouteNo="1" devices="tripinfo_car_s2w_147 routing_car_s2w_147" vType="Car" speedFactor="1.02" vaporized=""/>
    <tripinfo id="bus_n2e_126" depart="126.05" departLane="n2sep_1" departPos="12.10" departPosLat="0.00" departSpeed="13.90" departDelay="0.05" arrival="292.20" arrivalLane="c2e_1" arrivalPos="990.00" arrivalPosLat="0.00" arrivalSpeed="13.81" duration="166.15" routeLength="1987.97" waitingTime="6.45" waitingCount="1" stopTime="0.00" timeLoss="22.44" rerouteNo="1" devices="tripinfo_bus_n2e_126 routing_bus_n2e_126" vType="Bus" speedFactor="1.00" vaporized=""/>
    <tripinfo id="car_n2e_131" depart="131.00" departLane="n2sep_1" departPos="3.60" departPosLat="0.00" departSpeed="13.90" departDelay="0.00" arrival="294.70" arrivalLane="c2e_1" arrivalPos="990.00" arrivalPosLat="0.00" arrivalSpeed="15.27" duration="163.70" routeLength="1996.47" waitingTime="3.10" waitingCount="1" stopTime="0.00" timeLoss="36.16" rerouteNo="1" devices="tripinfo_car_n2e_131 routing_car_n2e_131" vType="Car" speedFactor="1.13" vaporized=""/>
    <tripinfo id="car_n2e_146" depart="146.00" departLane="n2sep_1" departPos="3.60" departPosLat="0.00" departSpeed="13.90" departDelay="0.00" arrival="297.75" arrivalLane="c2e_1" arrivalPos="990.00" arrivalPosLat="0.00" arrivalSpeed="14.15" duration="151.75" routeLength="1996.47" waitingTime="0.00" waitingCount="0" stopTime="0.00" timeLoss="10.53" rerouteNo="1" devices="tripinfo_car_n2e_146 routing_car_n2e_146" vType="Car" speedFactor="1.02" vaporized=""/>
    <tripinfo id="car_e2w_105" depart="105.00" departLane="e2sep_1" departPos="3.60" departPosLat="0.00" departSpeed="13.90" departDelay="0.00" arrival="300.30" arrivalLane="c2w_1" arrivalPos="990.00" arrivalPosLat="0.00" arrivalSpeed="14.04" duration="195.30" routeLength="1997.01" waitingTime="45.85" waitingCount="1" stopTime="0.00" timeLoss="53.07" rerouteNo="1" devices="tripinfo_car_e2w_105 routing_car_e2w_105" vType="Car" speedFactor="1.01" vaporized=""/>
    <tripinfo id="bus_w2e_153" depart="153.00" departLane="w2sep_1" departPos="12.10" departPosLat="0.00" departSpeed="13.90" departDelay="0.00" arrival="302.00" arrivalLane="c2e_1" arrivalPos="990.00" arrivalPosLat="0.00" arrivalSpeed="13.83" duration="149.00" routeLength="1988.51" waitingTime="0.00" waitingCount="0" stopTime="0.00" timeLoss="5.93" rerouteNo="1" devices="tripinfo_bus_w2e_153 routing_bus_w2e_153" vType="Bus" speedFactor="1.00" vaporized=""/>
    <tripinfo id="car_e2s_106" depart="106.45" departLane="e2sep_1" departPos="3.60" departPosLat="0.00" departSpeed="13.90" departDelay="0.45" arrival="303.25" arrivalLane="c2s_1" arrivalPos="990.00" arrivalPosLat="0.00" arrivalSpeed="13.90" duration="196.80" routeLength="1996.47" waitingTime="41.40" waitingCount="1" stopTime="0.00" timeLoss="52.45" rerouteNo="1" devices="tripinfo_car_e2s_106 routing_car_e2s_106" vType="Car" speedFactor="1.00" vaporized=""/>
    <tripinfo id="car_e2w_118" depart="118.00" departLane="e2sep_1" departPos="3.60" departPosLat="0.00" departSpeed="13.90" departDelay="0.00" arrival="304.95" arrivalLane="c2w_1" arrivalPos="990.00" arrivalPosLat="0.00" arrivalSpeed="13.89" duration="186.95" routeLength="1997.01" waitingTime="32.70" waitingCount="1" stopTime="0.00" timeLoss="43.27" rerouteNo="1" devices="tripinfo_car_e2w_118 routing_car_e2w_118" vType="Car" speedFactor="1.00" vaporized=""/>
    <tripinfo id="car_e2s_120" depart="122.95" departLane="e2sep_1" departPos="3.60" departPosLat="0.00" departSpeed="13.90" departDelay="2.95" arrival="305.50" arrivalLane="c2s_1" arrivalPos="990.00" arrivalPosLat="0.00" arrivalSpeed="14.92" duration="182.55" routeLength="1996.47" waitingTime="25.50" waitingCount="1" stopTime="0.00" timeLoss="50.85" rerouteNo="1" devices="tripinfo_car_e2s_120 routing_car_e2s_120" vType="Car" speedFactor="1.10" vaporized=""/>
    <tripinfo id="car_w2e_167" depart="167.00" departLane="w2sep_1" departPos="3.60" departPosLat="0.00" departSpeed="13.90" departDelay="0.00" arrival="306.05" arrivalLane="c2e_1" arrivalPos="990.00" arrivalPosLat="0.00" arrivalSpeed="15.07" duration="139.05" routeLength="1997.01" waitingTime="0.00" waitingCount="0" stopTime="0.00" timeLoss="6.83" rerouteNo="1" devices="tripinfo_car_w2e_167 routing_car_w2e_167" vType="Car" speedFactor="1.09" vaporized=""/>
    <tripinfo id="car_e2n_119" depart="121.10" departLane="e2sep_1" departPos="3.60" departPosLat="0.00" departSpeed="13.90" departDelay="2.10" arrival="306.15" arrivalLane="c2n_1" arrivalPos="990.00" arrivalPosLat="0.00" arrivalSpeed="14.13" duration="185.05" routeLength="1986.69" waitingTime="30.00" waitingCount="1" stopTime="0.00" timeLoss="43.73" rerouteNo="1" devices="tripinfo_car_e2n_119 routing_car_e2n_119" vType="Car" speedFactor="1.02" vaporized=""/>
    <tripinfo id="car_e2w_119" depart="119.45" departLane="e2sep_1" departPos="3.60" departPosLat="0.00" departSpeed="13.90" departDelay="0.45" arrival="306.80" arrivalLane="c2w_1" arrivalPos="990.00" arrivalPosLat="0.00" arrivalSpeed="15.38" duration="187.35" routeLength="1997.01" waitingTime="32.00" waitingCount="1" stopTime="0.00" timeLoss="64.40" rerouteNo="1" devices="tripinfo_car_e2w_119 routing_car_e2w_119" vType="Car" speedFactor="1.17" vaporized=""/>
    <tripinfo id="car_e2w_124" depart="124.75" departLane="e2sep_1" departPos="3.60" departPosLat="0.00" departSpeed="13.90" departDelay="0.75" arrival="310.90" arrivalLane="c2w_1" arrivalPos="990.00" arrivalPosLat="0.00" arrivalSpeed="13.89" duration="186.15" routeLength="1997.01" waitingTime="25.50" waitingCount="1" stopTime="0.00" timeLoss="42.44" rerouteNo="1" devices="tripinfo_car_e2w_124 routing_car_e2w_124" vType="Car" speedFactor="1.00" vaporized=""/>
    <tripinfo id="bus_e2n_145" depart="145.00" departLane="e2sep_1" departPos="12.10" departPosLat="0.00" departSpeed="13.90" departDelay="0.00" arrival="314.70" arrivalLane="c2n_1" arrivalPos="990.00" arrivalPosLat="0.00" arrivalSpeed="13.90" duration="169.70" routeLength="1978.19" waitingTime="12.05" waitingCount="1" stopTime="0.00" timeLoss="26.65" rerouteNo="1" devices="tripinfo_bus_e2n_145 routing_bus_e2n_145" vType="Bus" speedFactor="1.00" vaporized=""/>
    <tripinfo id="car_e2w_151" depart="151.45" departLane="e2sep_1" departPos="3.60" departPosLat="0.00" departSpeed="13.90" departDelay="0.45" arrival="315.40" arrivalLane="c2w_1" arrivalPos="990.00" arrivalPosLat="0.00" arrivalSpeed="14.66" duration="163.95" routeLength="1997.01" waitingTime="7.35" waitingCount="1" stopTime="0.00" timeLoss="27.82" rerouteNo="1" devices="tripinfo_car_e2w_151 routing_car_e2w_151" vType="Car" speedFactor="1.06" vaporized=""/>
    <tripinfo id="bus_e2s_136" depart="136.00" departLane="e2sep_1" departPos="12.10" departPosLat="0.00" departSpeed="13.90" departDelay="0.00" arrival="317.60" arrivalLane="c2s_1" arrivalPos="990.00" arrivalPosLat="0.00" arrivalSpeed="13.90" duration="181.60" routeLength="1987.97" waitingTime="20.45" waitingCount="2" stopTime="0.00" timeLoss="37.88" rerouteNo="1" devices="tripinfo_bus_e2s_136 routing_bus_e2s_136" vType="Bus" speedFactor="1.00" vaporized=""/>
    <tripinfo id="car_e2n_150" depart="150.00" departLane="e2sep_1" departPos="3.60" departPosLat="0.00" departSpeed="13.90" departDelay="0.00" arrival="318.80" arrivalLane="c2n_1" arrivalPos="990.00" arrivalPosLat="0.00" arrivalSpeed="14.15" duration="168.80" routeLength="1986.69" waitingTime="8.70" waitingCount="1" stopTime="0.00" timeLoss="27.90" rerouteNo="1" devices="tripinfo_car_e2n_150 routing_car_e2n_150" vType="Car" speedFactor="1.02" vaporized=""/>
    <tripinfo id="car_w2n_133" depart="133.00" departLane="w2sep_1" departPos="3.60" departPosLat="0.00" departSpeed="13.90" departDelay="0.00" arrival="321.15" arrivalLane="c2n_1" arrivalPos="990.00" arrivalPosLat="0.00" arrivalSpeed="14.79" duration="188.15" routeLength="1996.47" waitingTime="38.15" waitingCount="2" stopTime="0.00" timeLoss="54.80" rerouteNo="1" devices="tripinfo_car_w2n_133 routing_car_w2n_133" vType="Car" speedFactor="1.08" vaporized=""/>
    <tripinfo id="car_e2s_171" depart="171.00" departLane="e2sep_1" departPos="3.60" departPosLat="0.00" departSpeed="13.90" departDelay="0.00" arrival="321.45" arrivalLane="c2s_1" arrivalPos="990.00" arrivalPosLat="0.00" arrivalSpeed="14.29" duration="150.45" routeLength="1996.47" waitingTime="0.00" waitingCount="0" stopTime="0.00" timeLoss="10.37" rerouteNo="1" devices="tripinfo_car_e2s_171 routing_car_e2s_171" vType="Car" speedFactor="1.03" vaporized=""/>
    <tripinfo id="car_w2n_136" depart="136.00" departLane="w2sep_1" departPos="3.60" departPosLat="0.00" departSpeed="13.90" departDelay="0.00" arrival="324.80" arrivalLane="c2n_1" arrivalPos="990.00" arrivalPosLat="0.00" arrivalSpeed="14.09" duration="188.80" routeLength="1996.47" waitingTime="30.40" waitingCount="2" stopTime="0.00" timeLoss="46.71" rerouteNo="1" devices="tripinfo_car_w2n_136 routing_car_w2n_136" vType="Car" speedFactor="1.02" vaporized=""/>
    <tripinfo id="car_w2s_178" depart="178.00" departLane="w2sep_1" departPos="3.60" departPosLat="0.00" departSpeed="13.90" departDelay="0.00" arrival="326.40" arrivalLane="c2s_1" arrivalPos="990.00" arrivalPosLat="0.00" arrivalSpeed="13.92" duration="148.40" routeLength="1986.69" waitingTime="0.00" waitingCount="0" stopTime="0.00" timeLoss="4.96" rerouteNo="1" devices="tripinfo_car_w2s_178 routing_car_w2s_178" vType="Car" speedFactor="1.00" vaporized=""/>
    <tripinfo id="car_e2n_184" depart="184.00" departLane="e2sep_1" departPos="3.60" departPosLat="0.00" departSpeed="13.90" departDelay="0.00" arrival="329.90" arrivalLane="c2n_1" arrivalPos="990.00" arrivalPosLat="0.00" arrivalSpeed="14.13" duration="145.90" routeLength="1986.69" waitingTime="0.00" waitingCount="0" stopTime="0.00" timeLoss="4.58" rerouteNo="1" devices="tripinfo_car_e2n_184 routing_car_e2n_184" vType="Car" speedFactor="1.02" vaporized=""/>
    <tripinfo id="car_w2n_138" depart="138.00" departLane="w2sep_1" departPos="3.60" departPosLat="0.00" departSpeed="13.90" departDelay="0.00" arrival="334.70" arrivalLane="c2n_1" arrivalPos="990.00" arrivalPosLat="0.00" arrivalSpeed="13.89" duration="196.70" routeLength="1996.47" waitingTime="28.70" waitingCount="3" stopTime="0.00" timeLoss="52.37" rerouteNo="1" devices="tripinfo_car_w2n_138 routing_car_w2n_138" vType="Car" speedFactor="1.00" vaporized=""/>
    <tripinfo id="car_n2s_155" depart="155.00" departLane="n2sep_1" departPos="3.60" departPosLat="0.00" departSpeed="13.90" departDelay="0.00" arrival="335.35" arrivalLane="c2s_1" arrivalPos="990.00" arrivalPosLat="0.00" arrivalSpeed="16.40" duration="180.35" routeLength="1997.01" waitingTime="43.45" waitingCount="1" stopTime="0.00" timeLoss="58.56" rerouteNo="1" devices="tripinfo_car_n2s_155 routing_car_n2s_155" vType="Car" speedFactor="1.18" vaporized=""/>
    <tripinfo id="car_w2n_140" depart="140.00" departLane="w2sep_1" departPos="3.60" departPosLat="0.00" departSpeed="13.90" departDelay="0.00" arrival="336.55" arrivalLane="c2n_1" arrivalPos="990.00" arrivalPosLat="0.00" arrivalSpeed="15.27" duration="196.55" routeLength="1996.47" waitingTime="26.40" waitingCount="3" stopTime="0.00" timeLoss="71.55" rerouteNo="1" devices="tripinfo_car_w2n_140 routing_car_w2n_140" vType="Car" speedFactor="1.15" vaporized=""/>
    <tripinfo id="car_w2n_145" depart="145.00" departLane="w2sep_1" departPos="3.60" departPosLat="0.00" departSpeed="13.90" departDelay="0.00" arrival="338.45" arrivalLane="c2n_1" arrivalPos="990.00" arrivalPosLat="0.00" arrivalSpeed="15.54" duration="193.45" routeLength="1996.47" waitingTime="23.00" waitingCount="3" stopTime="0.00" timeLoss="70.27" rerouteNo="1" devices="tripinfo_car_w2n_145 routing_car_w2n_145" vType="Car" speedFactor="1.17" vaporized=""/>
    <tripinfo id="car_w2n_146" depart="146.25" departLane="w2sep_1" departPos="3.60" departPosLat="0.00" departSpeed="13.90" departDelay="0.25" arrival="341.35" arrivalLane="c2n_1" arrivalPos="990.00" arrivalPosLat="0.00" arrivalSpeed="14.38" duration="195.10" routeLength="1996.47" waitingTime="20.65" waitingCount="2" stopTime="0.00" timeLoss="56.32" rerouteNo="1" devices="tripinfo_car_w2n_146 routing_car_w2n_146" vType="Car" speedFactor="1.04" vaporized=""/>
    <tripinfo id="car_n2s_159" depart="159.45" departLane="n2sep_1" departPos="3.60" departPosLat="0.00" departSpeed="13.90" departDelay="0.45" arrival="343.80" arrivalLane="c2s_1" arrivalPos="990.00" arrivalPosLat="0.00" arrivalSpeed="15.32" duration="184.35" routeLength="1997.01" waitingTime="38.25" waitingCount="1" stopTime="0.00" timeLoss="53.99" rerouteNo="1" devices="tripinfo_car_n2s_159 routing_car_n2s_159" vType="Car" speedFactor="1.10" vaporized=""/>
    <tripinfo id="car_s2e_182" depart="182.00" departLane="s2sep_1" departPos="3.60" departPosLat="0.00" departSpeed="13.90" departDelay="0.00" arrival="345.15" arrivalLane="c2e_1" arrivalPos="990.00" arrivalPosLat="0.00" arrivalSpeed="14.00" duration="163.15" routeLength="1986.69" waitingTime="12.90" waitingCount="1" stopTime="0.00" timeLoss="20.47" rerouteNo="1" devices="tripinfo_car_s2e_182 routing_car_s2e_182" vType="Car" speedFactor="1.01" vaporized=""/>
    <tripinfo id="car_w2n_154" depart="154.45" departLane="w2sep_1" departPos="3.60" departPosLat="0.00" departSpeed="13.90" departDelay="0.45" arrival="345.20" arrivalLane="c2n_1" arrivalPos="990.00" arrivalPosLat="0.00" arrivalSpeed="13.88" duration="190.75" routeLength="1996.47" waitingTime="10.95" waitingCount="1" stopTime="0.00" timeLoss="46.44" rerouteNo="1" devices="tripinfo_car_w2n_154 routing_car_w2n_154" vType="Car" speedFactor="1.00" vaporized=""/>
    <tripinfo id="car_n2w_158" depart="158.00" departLane="n2sep_1" departPos="3.60" departPosLat="0.00" departSpeed="13.90" departDelay="0.00" arrival="345.80" arrivalLane="c2w_1" arrivalPos="990.00" arrivalPosLat="0.00" arrivalSpeed="14.35" duration="187.80" routeLength="1986.69" waitingTime="39.30" waitingCount="1" stopTime="0.00" timeLoss="48.64" rerouteNo="1" devices="tripinfo_car_n2w_158 routing_car_n2w_158" vType="Car" speedFactor="1.03" vaporized=""/>
    <tripinfo id="car_s2n_202" depart="202.00" departLane="s2sep_1" departPos="3.60" departPosLat="0.00" departSpeed="13.90" departDelay="0.00" arrival="347.50" arrivalLane="c2n_1" arrivalPos="990.00" arrivalPosLat="0.00" arrivalSpeed="14.83" duration="145.50" routeLength="1997.01" waitingTime="0.00" waitingCount="0" stopTime="0.00" timeLoss="13.45" rerouteNo="1" devices="tripinfo_car_s2n_202 routing_car_s2n_202" vType="Car" speedFactor="1.09" vaporized=""/>
    <tripinfo id="car_s2e_189" depart="189.00" departLane="s2sep_1" departPos="3.60" departPosLat="0.00" departSpeed="13.90" departDelay="0.00" arrival="348.40" arrivalLane="c2e_1" arrivalPos="990.00" arrivalPosLat="0.00" arrivalSpeed="14.45" duration="159.40" routeLength="1986.69" waitingTime="9.20" waitingCount="1" stopTime="0.00" timeLoss="21.69" rerouteNo="1" devices="tripinfo_car_s2e_189 routing_car_s2e_189" vType="Car" speedFactor="1.04" vaporized=""/>
    <tripinfo id="car_n2w_167" depart="167.00" departLane="n2sep_1" departPos="3.60" departPosLat="0.00" departSpeed="13.90" departDelay="0.00" arrival="351.10" arrivalLane="c2w_1" arrivalPos="990.00" arrivalPosLat="0.00" arrivalSpeed="14.38" duration="184.10" routeLength="1986.69" waitingTime="33.10" waitingCount="1" stopTime="0.00" timeLoss="45.22" rerouteNo="1" devices="tripinfo_car_n2w_167 routing_car_n2w_167" vType="Car" speedFactor="1.03" vaporized=""/>
    <tripinfo id="car_n2w_174" depart="174.00" departLane="n2sep_1" departPos="3.60" departPosLat="0.00" departSpeed="13.90" departDelay="0.00" arrival="353.20" arrivalLane="c2w_1" arrivalPos="990.00" arrivalPosLat="0.00" arrivalSpeed="15.48" duration="179.20" routeLength="1986.69" waitingTime="32.20" waitingCount="1" stopTime="0.00" timeLoss="54.02" rerouteNo="1" devices="tripinfo_car_n2w_174 routing_car_n2w_174" vType="Car" speedFactor="1.15" vaporized=""/>
    <tripinfo id="car_n2e_149" depart="149.00" departLane="n2sep_1" departPos="3.60" departPosLat="0.00" departSpeed="13.90" departDelay="0.00" arrival="353.95" arrivalLane="c2e_1" arrivalPos="990.00" arrivalPosLat="0.00" arrivalSpeed="13.90" duration="204.95" routeLength="1996.47" waitingTime="47.85" waitingCount="2" stopTime="0.00" timeLoss="60.62" rerouteNo="1" devices="tripinfo_car_n2e_149 routing_car_n2e_149" vType="Car" speedFactor="1.00" vaporized=""/>
    <tripinfo id="car_n2w_182" depart="182.00" departLane="n2sep_1" departPos="3.60" departPosLat="0.00" departSpeed="13.90" departDelay="0.00" arrival="356.95" arrivalLane="c2w_1" arrivalPos="990.00" arrivalPosLat="0.00" arrivalSpeed="14.47" duration="174.95" routeLength="1986.69" waitingTime="21.40" waitingCount="1" stopTime="0.00" timeLoss="37.16" rerouteNo="1" devices="tripinfo_car_n2w_182 routing_car_n2w_182" vType="Car" speedFactor="1.04" vaporized=""/>
    <tripinfo id="car_n2s_183" depart="183.40" departLane="n2sep_1" departPos="3.60" departPosLat="0.00" departSpeed="13.90" departDelay="0.40" arrival="357.50" arrivalLane="c2s_1" arrivalPos="990.00" arrivalPosLat="0.00" arrivalSpeed="14.21" duration="174.10" routeLength="1997.01" waitingTime="18.25" waitingCount="1" stopTime="0.00" timeLoss="33.52" rerouteNo="1" devices="tripinfo_car_n2s_183 routing_car_n2s_183" vType="Car" speedFactor="1.02" vaporized=""/>
    <tripinfo id="car_n2w_187" depart="187.00" departLane="n2sep_1" departPos="3.60" departPosLat="0.00" departSpeed="13.90" departDelay="0.00" arrival="359.45" arrivalLane="c2w_1" arrivalPos="990.00" arrivalPosLat="0.00" arrivalSpeed="14.99" duration="172.45" routeLength="1986.69" waitingTime="17.30" waitingCount="1" stopTime="0.00" timeLoss="40.88" rerouteNo="1" devices="tripinfo_car_n2w_187 routing_car_n2w_187" vType="Car" speedFactor="1.09" vaporized=""/>
    <tripinfo id="car_n2w_189" depart="189.00" departLane="n2sep_1" departPos="3.60" departPosLat="0.00" departSpeed="13.90" departDelay="0.00" arrival="363.30" arrivalLane="c2w_1" arrivalPos="990.00" arrivalPosLat="0.00" arrivalSpeed="14.40" duration="174.30" routeLength="1986.69" waitingTime="15.35" waitingCount="1" stopTime="0.00" timeLoss="35.88" rerouteNo="1" devices="tripinfo_car_n2w_189 routing_car_n2w_189" vType="Car" speedFactor="1.04" vaporized=""/>
    <tripinfo id="car_n2w_213" depart="213.00" departLane="n2sep_1" departPos="3.60" departPosLat="0.00" departSpeed="13.90" departDelay="0.00" arrival="365.70" arrivalLane="c2w_1" arrivalPos="990.00" arrivalPosLat="0.00" arrivalSpeed="15.02" duration="152.70" routeLength="1986.69" waitingTime="0.00" waitingCount="0" stopTime="0.00" timeLoss="21.77" rerouteNo="1" devices="tripinfo_car_n2w_213 routing_car_n2w_213" vType="Car" speedFactor="1.10" vaporized=""/>
    <tripinfo id="car_n2w_217" depart="217.00" departLane="n2sep_1" departPos="3.60" departPosLat="0.00" departSpeed="13.90" departDelay="0.00" arrival="368.55" arrivalLane="c2w_1" arrivalPos="990.00" arrivalPosLat="0.00" arrivalSpeed="14.71" duration="151.55" routeLength="1986.69" waitingTime="0.00" waitingCount="0" stopTime="0.00" timeLoss="16.65" rerouteNo="1" devices="tripinfo_car_n2w_217 routing_car_n2w_217" vType="Car" speedFactor="1.07" vaporized=""/>
    <tripinfo id="car_s2e_222" depart="222.00" departLane="s2sep_1" departPos="3.60" departPosLat="0.00" departSpeed="13.90" departDelay="0.00" arrival="369.30" arrivalLane="c2e_1" arrivalPos="990.00" arrivalPosLat="0.00" arrivalSpeed="13.90" duration="147.30" routeLength="1986.69" waitingTime="0.00" waitingCount="0" stopTime="0.00" timeLoss="3.62" rerouteNo="1" devices="tripinfo_car_s2e_222 routing_car_s2e_222" vType="Car" speedFactor="1.00" vaporized=""/>
    <tripinfo id="car_s2n_223" depart="223.45" departLane="s2sep_1" departPos="3.60" departPosLat="0.00" departSpeed="13.90" departDelay="0.45" arrival="370.95" arrivalLane="c2n_1" arrivalPos="990.00" arrivalPosLat="0.00" arrivalSpeed="13.90" duration="147.50" routeLength="1997.01" waitingTime="0.00" waitingCount="0" stopTime="0.00" timeLoss="3.81" rerouteNo="1" devices="tripinfo_car_s2n_223 routing_car_s2n_223" vType="Car" speedFactor="1.00" vaporized=""/>
    <tripinfo id="car_s2w_170" depart="170.00" departLane="s2sep_1" departPos="3.60" departPosLat="0.00" departSpeed="13.90" departDelay="0.00" arrival="372.40" arrivalLane="c2w_1" arrivalPos="990.00" arrivalPosLat="0.00" arrivalSpeed="14.12" duration="202.40" routeLength="1996.47" waitingTime="45.85" waitingCount="2" stopTime="0.00" timeLoss="60.46" rerouteNo="1" devices="tripinfo_car_s2w_170 routing_car_s2w_170" vType="Car" speedFactor="1.02" vaporized=""/>
    <tripinfo id="car_s2e_228" depart="228.00" departLane="s2sep_1" departPos="3.60" departPosLat="0.00" departSpeed="13.90" departDelay="0.00" arrival="372.50" arrivalLane="c2e_1" arrivalPos="990.00" arrivalPosLat="0.00" arrivalSpeed="14.84" duration="144.50" routeLength="1986.69" waitingTime="0.00" waitingCount="0" stopTime="0.00" timeLoss="10.56" rerouteNo="1" devices="tripinfo_car_s2e_228 routing_car_s2e_228" vType="Car" speedFactor="1.07" vaporized=""/>
    <tripinfo id="car_s2w_176" depart="176.00" departLane="s2sep_1" departPos="3.60" departPosLat="0.00" departSpeed="13.90" departDelay="0.00" arrival="376.15" arrivalLane="c2w_1" arrivalPos="990.00" arrivalPosLat="0.00" arrivalSpeed="13.88" duration="200.15" routeLength="1996.47" waitingTime="38.50" waitingCount="2" stopTime="0.00" timeLoss="55.83" rerouteNo="1" devices="tripinfo_car_s2w_176 routing_car_s2w_176" vType="Car" speedFactor="1.00" vaporized=""/>
    <tripinfo id="car_e2w_197" depart="197.00" departLane="e2sep_1" departPos="3.60" departPosLat="0.00" departSpeed="13.90" departDelay="0.00" arrival="385.10" arrivalLane="c2w_1" arrivalPos="990.00" arrivalPosLat="0.00" arrivalSpeed="15.16" duration="188.10" routeLength="1997.01" waitingTime="48.65" waitingCount="1" stopTime="0.00" timeLoss="56.41" rerouteNo="1" devices="tripinfo_car_e2w_197 routing_car_e2w_197" vType="Car" speedFactor="1.09" vaporized=""/>
    <tripinfo id="car_w2e_198" depart="198.00" departLane="w2sep_1" departPos="3.60" departPosLat="0.00" departSpeed="13.90" departDelay="0.00" arrival="387.05" arrivalLane="c2e_1" arrivalPos="990.00" arrivalPosLat="0.00" arrivalSpeed="14.69" duration="189.05" routeLength="1997.01" waitingTime="45.75" waitingCount="1" stopTime="0.00" timeLoss="53.08" rerouteNo="1" devices="tripinfo_car_w2e_198 routing_car_w2e_198" vType="Car" speedFactor="1.06" vaporized=""/>
    <tripinfo id="car_e2w_208" depart="208.00" departLane="e2sep_1" departPos="3.60" departPosLat="0.00" departSpeed="13.90" departDelay="0.00" arrival="388.35" arrivalLane="c2w_1" arrivalPos="990.00" arrivalPosLat="0.00" arrivalSpeed="15.52" duration="180.35" routeLength="1997.01" waitingTime="40.00" waitingCount="1" stopTime="0.00" timeLoss="52.24" rerouteNo="1" devices="tripinfo_car_e2w_208 routing_car_e2w_208" vType="Car" speedFactor="1.12" vaporized=""/>
    <tripinfo id="car_w2s_199" depart="199.35" departLane="w2sep_1" departPos="3.60" departPosLat="0.00" departSpeed="13.90" departDelay="0.35" arrival="392.25" arrivalLane="c2s_1" arrivalPos="990.00" arrivalPosLat="0.00" arrivalSpeed="14.04" duration="192.90" routeLength="1986.69" waitingTime="40.60" waitingCount="1" stopTime="0.00" timeLoss="50.64" rerouteNo="1" devices="tripinfo_car_w2s_199 routing_car_w2s_199" vType="Car" speedFactor="1.01" vaporized=""/>
    <tripinfo id="car_w2e_230" depart="230.00" departLane="w2sep_1" departPos="3.60" departPosLat="0.00" departSpeed="13.90" departDelay="0.00" arrival="394.50" arrivalLane="c2e_1" arrivalPos="990.00" arrivalPosLat="0.00" arrivalSpeed="14.09" duration="164.50" routeLength="1997.01" waitingTime="12.90" waitingCount="1" stopTime="0.00" timeLoss="22.78" rerouteNo="1" devices="tripinfo_car_w2e_230 routing_car_w2e_230" vType="Car" speedFactor="1.01" vaporized=""/>
    <tripinfo id="car_e2w_218" depart="218.00" departLane="e2sep_1" departPos="3.60" departPosLat="0.00" departSpeed="13.90" departDelay="0.00" arrival="395.95" arrivalLane="c2w_1" arrivalPos="990.00" arrivalPosLat="0.00" arrivalSpeed="13.90" duration="177.95" routeLength="1997.01" waitingTime="23.95" waitingCount="1" stopTime="0.00" timeLoss="34.28" rerouteNo="1" devices="tripinfo_car_e2w_218 routing_car_e2w_218" vType="Car" speedFactor="1.00" vaporized=""/>
    <tripinfo id="car_e2n_230" depart="230.00" departLane="e2sep_1" departPos="3.60" departPosLat="0.00" departSpeed="13.90" departDelay="0.00" arrival="396.95" arrivalLane="c2n_1" arrivalPos="990.00" arrivalPosLat="0.00" arrivalSpeed="14.38" duration="166.95" routeLength="1986.69" waitingTime="16.50" waitingCount="1" stopTime="0.00" timeLoss="28.06" rerouteNo="1" devices="tripinfo_car_e2n_230 routing_car_e2n_230" vType="Car" speedFactor="1.03" vaporized=""/>
    <tripinfo id="car_w2e_232" depart="232.00" departLane="w2sep_1" departPos="3.60" departPosLat="0.00" departSpeed="13.90" departDelay="0.00" arrival="397.25" arrivalLane="c2e_1" arrivalPos="990.00" arrivalPosLat="0.00" arrivalSpeed="14.68" duration="165.25" routeLength="1997.01" waitingTime="11.70" waitingCount="1" stopTime="0.00" timeLoss="30.32" rerouteNo="1" devices="tripinfo_car_w2e_232 routing_car_w2e_232" vType="Car" speedFactor="1.06" vaporized=""/>
    <tripinfo id="car_w2s_243" depart="243.00" departLane="w2sep_1" departPos="3.60" departPosLat="0.00" departSpeed="13.90" departDelay="0.00" arrival="397.55" arrivalLane="c2s_1" arrivalPos="990.00" arrivalPosLat="0.00" arrivalSpeed="15.26" duration="154.55" routeLength="1986.69" waitingTime="6.15" waitingCount="1" stopTime="0.00" timeLoss="23.80" rerouteNo="1" devices="tripinfo_car_w2s_243 routing_car_w2s_243" vType="Car" speedFactor="1.10" vaporized=""/>
    <tripinfo id="car_w2e_237" depart="237.00" departLane="w2sep_1" departPos="3.60" departPosLat="0.00" departSpeed="13.90" departDelay="0.00" arrival="399.20" arrivalLane="c2e_1" arrivalPos="990.00" arrivalPosLat="0.00" arrivalSpeed="15.58" duration="162.20" routeLength="1997.01" waitingTime="10.95" waitingCount="1" stopTime="0.00" timeLoss="39.26" rerouteNo="1" devices="tripinfo_car_w2e_237 routing_car_w2e_237" vType="Car" speedFactor="1.17" vaporized=""/>
    <tripinfo id="car_e2w_220" depart="220.00" departLane="e2sep_1" departPos="3.60" departPosLat="0.00" departSpeed="13.90" departDelay="0.00" arrival="399.95" arrivalLane="c2w_1" arrivalPos="990.00" arrivalPosLat="0.00" arrivalSpeed="13.88" duration="179.95" routeLength="1997.01" waitingTime="21.30" waitingCount="1" stopTime="0.00" timeLoss="36.27" rerouteNo="1" devices="tripinfo_car_e2w_220 routing_car_e2w_220" vType="Car" speedFactor="1.00" vaporized=""/>
    <tripinfo id="car_e2n_236" depart="236.00" departLane="e2sep_1" departPos="3.60" departPosLat="0.00" departSpeed="13.90" departDelay="0.00" arrival="402.95" arrivalLane="c2n_1" arrivalPos="990.00" arrivalPosLat="0.00" arrivalSpeed="13.90" duration="166.95" routeLength="1986.69" waitingTime="9.60" waitingCount="1" stopTime="0.00" timeLoss="23.29" rerouteNo="1" devices="tripinfo_car_e2n_236 routing_car_e2n_236" vType="Car" speedFactor="1.00" vaporized=""/>
    <tripinfo id="car_w2e_239" depart="239.00" departLane="w2sep_1" departPos="3.60" departPosLat="0.00" departSpeed="13.90" departDelay="0.00" arrival="403.00" arrivalLane="c2e_1" arrivalPos="990.00" arrivalPosLat="0.00" arrivalSpeed="14.11" duration="164.00" routeLength="1997.01" waitingTime="7.05" waitingCount="1" stopTime="0.00" timeLoss="22.68" rerouteNo="1" devices="tripinfo_car_w2e_239 routing_car_w2e_239" vType="Car" speedFactor="1.02" vaporized=""/>
    <tripinfo id="car_e2w_243" depart="243.00" departLane="e2sep_1" departPos="3.60" departPosLat="0.00" departSpeed="13.90" departDelay="0.00" arrival="404.05" arrivalLane="c2w_1" arrivalPos="990.00" arrivalPosLat="0.00" arrivalSpeed="14.01" duration="161.05" routeLength="1997.01" waitingTime="4.45" waitingCount="1" stopTime="0.00" timeLoss="18.66" rerouteNo="1" devices="tripinfo_car_e2w_243 routing_car_e2w_243" vType="Car" speedFactor="1.01" vaporized=""/>
    <tripinfo id="car_e2n_248" depart="248.00" departLane="e2sep_1" departPos="3.60" departPosLat="0.00" departSpeed="13.90" departDelay="0.00" arrival="405.20" arrivalLane="c2n_1" arrivalPos="990.00" arrivalPosLat="0.00" arrivalSpeed="14.90" duration="157.20" routeLength="1986.69" waitingTime="3.55" waitingCount="1" stopTime="0.00" timeLoss="26.07" rerouteNo="1" devices="tripinfo_car_e2n_248 routing_car_e2n_248" vType="Car" speedFactor="1.10" vaporized=""/>
    <tripinfo id="car_w2s_254" depart="254.00" departLane="w2sep_1" departPos="3.60" departPosLat="0.00" departSpeed="13.90" departDelay="0.00" arrival="406.05" arrivalLane="c2s_1" arrivalPos="990.00" arrivalPosLat="0.00" arrivalSpeed="13.96" duration="152.05" routeLength="1986.69" waitingTime="0.00" waitingCount="0" stopTime="0.00" timeLoss="9.02" rerouteNo="1" devices="tripinfo_car_w2s_254 routing_car_w2s_254" vType="Car" speedFactor="1.00" vaporized=""/>
    <tripinfo id="car_e2w_258" depart="258.00" departLane="e2sep_1" departPos="3.60" departPosLat="0.00" departSpeed="13.90" departDelay="0.00" arrival="407.70" arrivalLane="c2w_1" arrivalPos="990.00" arrivalPosLat="0.00" arrivalSpeed="14.20" duration="149.70" routeLength="1997.01" waitingTime="0.00" waitingCount="0" stopTime="0.00" timeLoss="9.32" rerouteNo="1" devices="tripinfo_car_e2w_258 routing_car_e2w_258" vType="Car" speedFactor="1.02" vaporized=""/>
    <tripinfo id="amb_w2e_300" depart="300.00" departLane="w2sep_1" departPos="6.60" departPosLat="0.00" departSpeed="13.90" departDelay="0.00" arrival="408.20" arrivalLane="c2e_1" arrivalPos="990.00" arrivalPosLat="-0.95" arrivalSpeed="20.80" duration="108.20" routeLength="1994.01" waitingTime="0.00" waitingCount="0" stopTime="0.00" timeLoss="12.53" rerouteNo="1" devices="tripinfo_amb_w2e_300 routing_amb_w2e_300 bluelight_amb_w2e_300 fcd_amb_w2e_300" vType="Ambulance" speedFactor="1.50" vaporized="">
        <example_device customValue1="0.00" customValue2="-1.00"/>
    </tripinfo>
    <tripinfo id="car_w2n_165" depart="165.00" departLane="w2sep_1" departPos="3.60" departPosLat="0.00" departSpeed="13.90" departDelay="0.00" arrival="410.70" arrivalLane="c2n_1" arrivalPos="990.00" arrivalPosLat="0.00" arrivalSpeed="14.00" duration="245.70" routeLength="1996.47" waitingTime="69.95" waitingCount="3" stopTime="0.00" timeLoss="102.43" rerouteNo="1" devices="tripinfo_car_w2n_165 routing_car_w2n_165" vType="Car" speedFactor="1.01" vaporized=""/>
    <tripinfo id="car_w2n_169" depart="169.00" departLane="w2sep_1" departPos="3.60" departPosLat="0.00" departSpeed="13.90" departDelay="0.00" arrival="414.95" arrivalLane="c2n_1" arrivalPos="990.00" arrivalPosLat="0.00" arrivalSpeed="13.89" duration="245.95" routeLength="1996.47" waitingTime="67.10" waitingCount="3" stopTime="0.00" timeLoss="101.63" rerouteNo="1" devices="tripinfo_car_w2n_169 routing_car_w2n_169" vType="Car" speedFactor="1.00" vaporized=""/>
    <tripinfo id="car_e2n_274" depart="274.00" departLane="e2sep_1" departPos="3.60" departPosLat="0.00" departSpeed="13.90" departDelay="0.00" arrival="418.50" arrivalLane="c2n_1" arrivalPos="990.00" arrivalPosLat="0.00" arrivalSpeed="14.31" duration="144.50" routeLength="1986.69" waitingTime="0.00" waitingCount="0" stopTime="0.00" timeLoss="5.33" rerouteNo="1" devices="tripinfo_car_e2n_274 routing_car_e2n_274" vType="Car" speedFactor="1.03" vaporized=""/>
    <tripinfo id="car_w2n_247" depart="247.00" departLane="w2sep_1" departPos="3.60" departPosLat="0.00" departSpeed="13.90" departDelay="0.00" arrival="420.85" arrivalLane="c2n_1" arrivalPos="990.00" arrivalPosLat="0.00" arrivalSpeed="14.98" duration="173.85" routeLength="1996.47" waitingTime="14.75" waitingCount="3" stopTime="0.00" timeLoss="42.21" rerouteNo="1" devices="tripinfo_car_w2n_247 routing_car_w2n_247" vType="Car" speedFactor="1.10" vaporized=""/>
    <tripinfo id="car_w2s_283" depart="283.00" departLane="w2sep_1" departPos="3.60" departPosLat="0.00" departSpeed="13.90" departDelay="0.00" arrival="428.55" arrivalLane="c2s_1" arrivalPos="990.00" arrivalPosLat="0.00" arrivalSpeed="14.06" duration="145.55" routeLength="1986.69" waitingTime="0.00" waitingCount="0" stopTime="0.00" timeLoss="3.56" rerouteNo="1" devices="tripinfo_car_w2s_283 routing_car_w2s_283" vType="Car" speedFactor="1.01" vaporized=""/>
    <tripinfo id="car_e2w_278" depart="278.00" departLane="e2sep_1" departPos="3.60" departPosLat="0.00" departSpeed="13.90" departDelay="0.00" arrival="433.40" arrivalLane="c2w_1" arrivalPos="990.00" arrivalPosLat="0.00" arrivalSpeed="14.85" duration="155.40" routeLength="1997.01" waitingTime="12.10" waitingCount="1" stopTime="0.00" timeLoss="20.92" rerouteNo="1" devices="tripinfo_car_e2w_278 routing_car_e2w_278" vType="Car" speedFactor="1.07" vaporized=""/>
    <tripinfo id="car_e2n_290" depart="290.00" departLane="e2sep_1" departPos="3.60" departPosLat="0.00" departSpeed="13.90" departDelay="0.00" arrival="438.95" arrivalLane="c2n_1" arrivalPos="990.00" arrivalPosLat="0.00" arrivalSpeed="14.11" duration="148.95" routeLength="1986.69" waitingTime="0.00" waitingCount="0" stopTime="0.00" timeLoss="7.41" rerouteNo="1" devices="tripinfo_car_e2n_290 routing_car_e2n_290" vType="Car" speedFactor="1.02" vaporized=""/>
    <tripinfo id="car_w2s_292" depart="292.00" departLane="w2sep_1" departPos="3.60" departPosLat="0.00" departSpeed="13.90" departDelay="0.00" arrival="439.05" arrivalLane="c2s_1" arrivalPos="990.00" arrivalPosLat="0.00" arrivalSpeed="13.95" duration="147.05" routeLength="1986.69" waitingTime="0.00" waitingCount="0" stopTime="0.00" timeLoss="3.98" rerouteNo="1" devices="tripinfo_car_w2s_292 routing_car_w2s_292" vType="Car" speedFactor="1.00" vaporized=""/>
    <tripinfo id="car_e2s_282" depart="282.00" departLane="e2sep_1" departPos="3.60" departPosLat="0.00" departSpeed="13.90" departDelay="0.00" arrival="440.80" arrivalLane="c2s_1" arrivalPos="990.00" arrivalPosLat="0.00" arrivalSpeed="15.78" duration="158.80" routeLength="1996.47" waitingTime="10.60" waitingCount="1" stopTime="0.00" timeLoss="41.06" rerouteNo="1" devices="tripinfo_car_e2s_282 routing_car_e2s_282" vType="Car" speedFactor="1.23" vaporized=""/>
    <tripinfo id="car_w2n_293" depart="293.45" departLane="w2sep_1" departPos="3.60" departPosLat="0.00" departSpeed="13.90" departDelay="0.45" arrival="443.20" arrivalLane="c2n_1" arrivalPos="990.00" arrivalPosLat="0.00" arrivalSpeed="14.21" duration="149.75" routeLength="1996.47" waitingTime="0.00" waitingCount="0" stopTime="0.00" timeLoss="8.72" rerouteNo="1" devices="tripinfo_car_w2n_293 routing_car_w2n_293" vType="Car" speedFactor="1.02" vaporized=""/>
    <tripinfo id="car_s2e_249" depart="249.00" departLane="s2sep_1" departPos="3.60" departPosLat="0.00" departSpeed="13.90" departDelay="0.00" arrival="444.35" arrivalLane="c2e_1" arrivalPos="990.00" arrivalPosLat="0.00" arrivalSpeed="16.36" duration="195.35" routeLength="1986.69" waitingTime="65.25" waitingCount="1" stopTime="0.00" timeLoss="73.31" rerouteNo="1" devices="tripinfo_car_s2e_249 routing_car_s2e_249" vType="Car" speedFactor="1.18" vaporized=""/>
    <tripinfo id="car_s2e_259" depart="259.55" departLane="s2sep_1" departPos="3.60" departPosLat="0.00" departSpeed="13.90" departDelay="0.55" arrival="449.45" arrivalLane="c2e_1" arrivalPos="990.00" arrivalPosLat="0.00" arrivalSpeed="16.02" duration="189.90" routeLength="1986.69" waitingTime="44.65" waitingCount="1" stopTime="0.00" timeLoss="65.26" rerouteNo="1" devices="tripinfo_car_s2e_259 routing_car_s2e_259" vType="Car" speedFactor="1.15" vaporized=""/>
    <tripinfo id="car_n2w_254" depart="254.00" departLane="n2sep_1" departPos="3.60" departPosLat="0.00" departSpeed="13.90" departDelay="0.00" arrival="454.60" arrivalLane="c2w_1" arrivalPos="990.00" arrivalPosLat="0.00" arrivalSpeed="13.94" duration="200.60" routeLength="1986.69" waitingTime="50.35" waitingCount="1" stopTime="0.00" timeLoss="57.36" rerouteNo="1" devices="tripinfo_car_n2w_254 routing_car_n2w_254" vType="Car" speedFactor="1.00" vaporized=""/>
    <tripinfo id="car_n2s_256" depart="257.20" departLane="n2sep_1" departPos="3.60" departPosLat="0.00" departSpeed="13.90" departDelay="1.20" arrival="454.90" arrivalLane="c2s_1" arrivalPos="990.00" arrivalPosLat="0.00" arrivalSpeed="14.34" duration="197.70" routeLength="1997.01" waitingTime="45.75" waitingCount="1" stopTime="0.00" timeLoss="58.40" rerouteNo="1" devices="tripinfo_car_n2s_256 routing_car_n2s_256" vType="Car" speedFactor="1.03" vaporized=""/>
    <tripinfo id="car_n2e_254" depart="255.45" departLane="n2sep_1" departPos="3.60" departPosLat="0.00" departSpeed="13.90" departDelay="1.45" arrival="456.70" arrivalLane="c2e_1" arrivalPos="990.00" arrivalPosLat="0.00" arrivalSpeed="14.89" duration="201.25" routeLength="1996.47" waitingTime="49.30" waitingCount="2" stopTime="0.00" timeLoss="66.48" rerouteNo="1" devices="tripinfo_car_n2e_254 routing_car_n2e_254" vType="Car" speedFactor="1.07" vaporized=""/>
    <tripinfo id="car_n2s_261" depart="261.00" departLane="n2sep_1" departPos="3.60" departPosLat="0.00" departSpeed="13.90" departDelay="0.00" arrival="460.60" arrivalLane="c2s_1" arrivalPos="990.00" arrivalPosLat="0.00" arrivalSpeed="13.90" duration="199.60" routeLength="1997.01" waitingTime="43.10" waitingCount="1" stopTime="0.00" timeLoss="55.91" rerouteNo="1" devices="tripinfo_car_n2s_261 routing_car_n2s_261" vType="Car" speedFactor="1.00" vaporized=""/>
    <tripinfo id="car_n2w_269" depart="269.00" departLane="n2sep_1" departPos="3.60" departPosLat="0.00" departSpeed="13.90" departDelay="0.00" arrival="461.50" arrivalLane="c2w_1" arrivalPos="990.00" arrivalPosLat="0.00" arrivalSpeed="14.02" duration="192.50" routeLength="1986.69" waitingTime="38.65" waitingCount="1" stopTime="0.00" timeLoss="50.01" rerouteNo="1" devices="tripinfo_car_n2w_269 routing_car_n2w_269" vType="Car" speedFactor="1.01" vaporized=""/>
    <tripinfo id="car_n2e_281" depart="281.25" departLane="n2sep_1" departPos="3.60" departPosLat="0.00" departSpeed="13.90" departDelay="0.25" arrival="462.20" arrivalLane="c2e_1" arrivalPos="990.00" arrivalPosLat="0.00" arrivalSpeed="14.42" duration="180.95" routeLength="1996.47" waitingTime="25.05" waitingCount="1" stopTime="0.00" timeLoss="41.81" rerouteNo="1" devices="tripinfo_car_n2e_281 routing_car_n2e_281" vType="Car" speedFactor="1.04" vaporized=""/>
    <tripinfo id="car_n2s_280" depart="280.00" departLane="n2sep_1" departPos="3.60" departPosLat="0.00" departSpeed="13.90" departDelay="0.00" arrival="462.55" arrivalLane="c2s_1" arrivalPos="990.00" arrivalPosLat="0.00" arrivalSpeed="15.23" duration="182.55" routeLength="1997.01" waitingTime="36.55" waitingCount="1" stopTime="0.00" timeLoss="56.78" rerouteNo="1" devices="tripinfo_car_n2s_280 routing_car_n2s_280" vType="Car" speedFactor="1.14" vaporized=""/>
    <tripinfo id="car_s2n_324" depart="324.00" departLane="s2sep_1" departPos="3.60" departPosLat="0.00" departSpeed="13.90" departDelay="0.00" arrival="462.95" arrivalLane="c2n_1" arrivalPos="990.00" arrivalPosLat="0.00" arrivalSpeed="14.45" duration="138.95" routeLength="1997.01" waitingTime="0.00" waitingCount="0" stopTime="0.00" timeLoss="0.75" rerouteNo="1" devices="tripinfo_car_s2n_324 routing_car_s2n_324" vType="Car" speedFactor="1.04" vaporized=""/>
    <tripinfo id="car_n2w_290" depart="290.00" departLane="n2sep_1" departPos="3.60" departPosLat="0.00" departSpeed="13.90" departDelay="0.00" arrival="463.65" arrivalLane="c2w_1" arrivalPos="990.00" arrivalPosLat="0.00" arrivalSpeed="15.15" duration="173.65" routeLength="1986.69" waitingTime="26.30" waitingCount="1" stopTime="0.00" timeLoss="45.29" rerouteNo="1" devices="tripinfo_car_n2w_290 routing_car_n2w_290" vType="Car" speedFactor="1.12" vaporized=""/>
    <tripinfo id="car_n2e_294" depart="294.00" departLane="n2sep_1" departPos="3.60" departPosLat="0.00" departSpeed="13.90" departDelay="0.00" arrival="464.75" arrivalLane="c2e_1" arrivalPos="990.00" arrivalPosLat="0.00" arrivalSpeed="15.29" duration="170.75" routeLength="1996.47" waitingTime="18.45" waitingCount="2" stopTime="0.00" timeLoss="41.16" rerouteNo="1" devices="tripinfo_car_n2e_294 routing_car_n2e_294" vType="Car" speedFactor="1.11" vaporized=""/>
    <tripinfo id="car_s2w_254" depart="254.00" departLane="s2sep_1" departPos="3.60" departPosLat="0.00" departSpeed="13.90" departDelay="0.00" arrival="469.90" arrivalLane="c2w_1" arrivalPos="990.00" arrivalPosLat="0.00" arrivalSpeed="13.90" duration="215.90" routeLength="1996.47" waitingTime="59.85" waitingCount="2" stopTime="0.00" timeLoss="71.55" rerouteNo="1" devices="tripinfo_car_s2w_254 routing_car_s2w_254" vType="Car" speedFactor="1.00" vaporized=""/>
    <tripinfo id="car_s2n_335" depart="335.00" departLane="s2sep_1" departPos="3.60" departPosLat="0.00" departSpeed="13.90" departDelay="0.00" arrival="469.95" arrivalLane="c2n_1" arrivalPos="990.00" arrivalPosLat="0.00" arrivalSpeed="14.89" duration="134.95" routeLength="1997.01" waitingTime="0.00" waitingCount="0" stopTime="0.00" timeLoss="0.82" rerouteNo="1" devices="tripinfo_car_s2n_335 routing_car_s2n_335" vType="Car" speedFactor="1.07" vaporized=""/>
</tripinfos>
