<?xml version="1.0" encoding="UTF-8"?>

<!-- generated on 2021-05-18 18:08:12 by Eclipse SUMO GUI Version 1.9.1
<configuration xmlns:xsi="http://www.w3.org/2001/XMLSchema-instance" xsi:noNamespaceSchemaLocation="http://sumo.dlr.de/xsd/sumoConfiguration.xsd">

    <input>
        <net-file value="sumofiles/junction.net.xml"/>
        <route-files value="sumofiles/junction_preemption_26.rou.xml"/>
        <additional-files value="sumofiles/junction.det.xml"/>
    </input>

    <output>
        <tripinfo-output value="sumofiles/output/tripinfo_preemption_26.xml"/>
    </output>

    <time>
        <begin value="0"/>
        <end value="10000"/>
        <step-length value="1.0"/>
    </time>

    <processing>
        <lateral-resolution value="0.5"/>
    </processing>

    <report>
        <no-warnings value="true"/>
        <error-log value="sumofiles/output/errorlog_preemption_26.log"/>
        <no-step-log value="true"/>
    </report>

    <traci_server>
        <remote-port value="34821"/>
    </traci_server>

    <gui_only>
        <gui-settings-file value="sumofiles/junction-gui.settings.xml"/>
        <start value="true"/>
        <tracker-interval value="1"/>
    </gui_only>

</configuration>
-->

<tripinfos xmlns:xsi="http://www.w3.org/2001/XMLSchema-instance" xsi:noNamespaceSchemaLocation="http://sumo.dlr.de/xsd/tripinfo_file.xsd">
    <tripinfo id="car_w2e_1" depart="1.00" departLane="w2sep_1" departPos="3.60" departPosLat="0.00" departSpeed="13.90" departDelay="0.00" arrival="137.00" arrivalLane="c2e_1" arrivalPos="990.00" arrivalPosLat="0.00" arrivalSpeed="14.73" duration="136.00" routeLength="1997.01" waitingTime="0.00" waitingCount="0" stopTime="0.00" timeLoss="0.10" rerouteNo="1" devices="tripinfo_car_w2e_1 routing_car_w2e_1" vType="Car" speedFactor="1.06" vaporized=""/>
    <tripinfo id="car_w2n_4" depart="4.00" departLane="w2sep_1" departPos="3.60" departPosLat="0.00" departSpeed="13.90" departDelay="0.00" arrival="143.00" arrivalLane="c2n_1" arrivalPos="990.00" arrivalPosLat="0.00" arrivalSpeed="15.05" duration="139.00" routeLength="1996.47" waitingTime="0.00" waitingCount="0" stopTime="0.00" timeLoss="5.45" rerouteNo="1" devices="tripinfo_car_w2n_4 routing_car_w2n_4" vType="Car" speedFactor="1.08" vaporized=""/>
    <tripinfo id="car_e2s_3" depart="3.00" departLane="e2sep_1" departPos="3.60" departPosLat="0.00" departSpeed="13.90" departDelay="0.00" arrival="151.00" arrivalLane="c2s_1" arrivalPos="990.00" arrivalPosLat="0.00" arrivalSpeed="14.04" duration="148.00" routeLength="1996.47" waitingTime="0.00" waitingCount="0" stopTime="0.00" timeLoss="4.39" rerouteNo="1" devices="tripinfo_car_e2s_3 routing_car_e2s_3" vType="Car" speedFactor="1.01" vaporized=""/>
    <tripinfo id="car_w2n_12" depart="12.00" departLane="w2sep_1" departPos="3.60" departPosLat="0.00" departSpeed="13.90" departDelay="0.00" arrival="156.00" arrivalLane="c2n_1" arrivalPos="990.00" arrivalPosLat="0.00" arrivalSpeed="14.27" duration="144.00" routeLength="1996.47" waitingTime="0.00" waitingCount="0" stopTime="0.00" timeLoss="2.84" rerouteNo="1" devices="tripinfo_car_w2n_12 routing_car_w2n_12" vType="Car" speedFactor="1.03" vaporized=""/>
    <tripinfo id="car_s2n_9" depart="9.00" departLane="s2sep_1" departPos="3.60" departPosLat="0.00" departSpeed="13.90" departDelay="0.00" arrival="164.00" arrivalLane="c2n_1" arrivalPos="990.00" arrivalPosLat="0.00" arrivalSpeed="14.04" duration="155.00" routeLength="1997.01" waitingTime="2.00" waitingCount="1" stopTime="0.00" timeLoss="12.67" rerouteNo="1" devices="tripinfo_car_s2n_9 routing_car_s2n_9" vType="Car" speedFactor="1.01" vaporized=""/>
    <tripinfo id="car_s2e_12" depart="13.00" departLane="s2sep_1" departPos="3.60" departPosLat="0.00" departSpeed="13.90" departDelay="1.00" arrival="164.00" arrivalLane="c2e_1" arrivalPos="990.00" arrivalPosLat="0.00" arrivalSpeed="14.55" duration="151.00" routeLength="1986.69" waitingTime="0.00" waitingCount="0" stopTime="0.00" timeLoss="13.47" rerouteNo="1" devices="tripinfo_car_s2e_12 routing_car_s2e_12" vType="Car" speedFactor="1.05" vaporized=""/>
    <tripinfo id="car_n2s_7" depart="7.00" departLane="n2sep_1" departPos="3.60" departPosLat="0.00" departSpeed="13.90" departDelay="0.00" arrival="165.00" arrivalLane="c2s_1" arrivalPos="990.00" arrivalPosLat="0.00" arrivalSpeed="13.90" duration="158.00" routeLength="1997.01" waitingTime="4.00" waitingCount="1" stopTime="0.00" timeLoss="13.67" rerouteNo="1" devices="tripinfo_car_n2s_7 routing_car_n2s_7" vType="Car" speedFactor="1.00" vaporized=""/>
    <tripinfo id="car_n2w_11" depart="11.00" departLane="n2sep_1" departPos="3.60" departPosLat="0.00" departSpeed="13.90" departDelay="0.00" arrival="165.00" arrivalLane="c2w_1" arrivalPos="990.00" arrivalPosLat="0.00" arrivalSpeed="14.32" duration="154.00" routeLength="1986.69" waitingTime="2.00" waitingCount="1" stopTime="0.00" timeLoss="14.30" rerouteNo="1" devices="tripinfo_car_n2w_11 routing_car_n2w_11" vType="Car" speedFactor="1.03" vaporized=""/>
    <tripinfo id="car_n2s_11" depart="13.00" departLane="n2sep_1" departPos="3.60" departPosLat="0.00" departSpeed="13.90" departDelay="2.00" arrival="167.00" arrivalLane="c2s_1" arrivalPos="990.00" arrivalPosLat="0.00" arrivalSpeed="14.86" duration="154.00" routeLength="1997.01" waitingTime="1.00" waitingCount="1" stopTime="0.00" timeLoss="22.01" rerouteNo="1" devices="tripinfo_car_n2s_11 routing_car_n2s_11" vType="Car" speedFactor="1.09" vaporized=""/>
    <tripinfo id="car_n2e_1" depart="1.00" departLane="n2sep_1" departPos="3.60" departPosLat="0.00" departSpeed="13.90" departDelay="0.00" arrival="168.00" arrivalLane="c2e_1" arrivalPos="990.00" arrivalPosLat="0.00" arrivalSpeed="14.72" duration="167.00" routeLength="1996.47" waitingTime="13.00" waitingCount="1" stopTime="0.00" timeLoss="30.42" rerouteNo="1" devices="tripinfo_car_n2e_1 routing_car_n2e_1" vType="Car" speedFactor="1.06" vaporized=""/>
    <tripinfo id="car_s2w_7" depart="7.00" departLane="s2sep_1" departPos="3.60" departPosLat="0.00" departSpeed="13.90" departDelay="0.00" arrival="170.00" arrivalLane="c2w_1" arrivalPos="990.00" arrivalPosLat="0.00" arrivalSpeed="14.53" duration="163.00" routeLength="1996.47" waitingTime="8.00" waitingCount="2" stopTime="0.00" timeLoss="24.58" rerouteNo="1" devices="tripinfo_car_s2w_7 routing_car_s2w_7" vType="Car" speedFactor="1.05" vaporized=""/>
    <tripinfo id="car_n2e_31" depart="31.00" departLane="n2sep_1" departPos="3.60" departPosLat="0.00" departSpeed="13.90" departDelay="0.00" arrival="170.00" arrivalLane="c2e_1" arrivalPos="990.00" arrivalPosLat="0.00" arrivalSpeed="15.64" duration="139.00" routeLength="1996.47" waitingTime="0.00" waitingCount="0" stopTime="0.00" timeLoss="13.96" rerouteNo="1" devices="tripinfo_car_n2e_31 routing_car_n2e_31" vType="Car" speedFactor="1.16" vaporized=""/>
    <tripinfo id="car_s2w_10" depart="11.00" departLane="s2sep_1" departPos="3.60" departPosLat="0.00" departSpeed="13.90" departDelay="1.00" arrival="173.00" arrivalLane="c2w_1" arrivalPos="990.00" arrivalPosLat="0.00" arrivalSpeed="14.97" duration="162.00" routeLength="1996.47" waitingTime="5.00" waitingCount="1" stopTime="0.00" timeLoss="28.20" rerouteNo="1" devices="tripinfo_car_s2w_10 routing_car_s2w_10" vType="Car" speedFactor="1.08" vaporized=""/>
    <tripinfo id="car_s2w_18" depart="18.00" departLane="s2sep_1" departPos="3.60" departPosLat="0.00" departSpeed="13.90" departDelay="0.00" arrival="175.00" arrivalLane="c2w_1" arrivalPos="990.00" arrivalPosLat="0.00" arrivalSpeed="15.30" duration="157.00" routeLength="1996.47" waitingTime="2.00" waitingCount="1" stopTime="0.00" timeLoss="28.23" rerouteNo="1" devices="tripinfo_car_s2w_18 routing_car_s2w_18" vType="Car" speedFactor="1.12" vaporized=""/>
    <tripinfo id="car_w2s_4" depart="6.00" departLane="w2sep_1" departPos="3.60" departPosLat="0.00" departSpeed="13.90" departDelay="2.00" arrival="207.00" arrivalLane="c2s_1" arrivalPos="990.00" arrivalPosLat="0.00" arrivalSpeed="14.32" duration="201.00" routeLength="1986.69" waitingTime="51.00" waitingCount="1" stopTime="0.00" timeLoss="61.68" rerouteNo="1" devices="tripinfo_car_w2s_4 routing_car_w2s_4" vType="Car" speedFactor="1.03" vaporized=""/>
    <tripinfo id="car_e2w_30" depart="31.00" departLane="e2sep_1" departPos="3.60" departPosLat="0.00" departSpeed="13.90" departDelay="1.00" arrival="210.00" arrivalLane="c2w_1" arrivalPos="990.00" arrivalPosLat="0.00" arrivalSpeed="13.90" duration="179.00" routeLength="1997.01" waitingTime="24.00" waitingCount="1" stopTime="0.00" timeLoss="34.57" rerouteNo="1" devices="tripinfo_car_e2w_30 routing_car_e2w_30" vType="Car" speedFactor="1.00" vaporized=""/>
    <tripinfo id="car_w2s_43" depart="43.00" departLane="w2sep_1" departPos="3.60" departPosLat="0.00" departSpeed="13.90" departDelay="0.00" arrival="210.00" arrivalLane="c2s_1" arrivalPos="990.00" arrivalPosLat="0.00" arrivalSpeed="15.06" duration="167.00" routeLength="1986.69" waitingTime="19.00" waitingCount="1" stopTime="0.00" timeLoss="34.95" rerouteNo="1" devices="tripinfo_car_w2s_43 routing_car_w2s_43" vType="Car" speedFactor="1.09" vaporized=""/>
    <tripinfo id="car_e2n_35" depart="35.00" departLane="e2sep_1" departPos="3.60" departPosLat="0.00" departSpeed="13.90" departDelay="0.00" arrival="211.00" arrivalLane="c2n_1" arrivalPos="990.00" arrivalPosLat="0.00" arrivalSpeed="14.15" duration="176.00" routeLength="1986.69" waitingTime="22.00" waitingCount="1" stopTime="0.00" timeLoss="34.45" rerouteNo="1" devices="tripinfo_car_e2n_35 routing_car_e2n_35" vType="Car" speedFactor="1.02" vaporized=""/>
    <tripinfo id="car_w2e_44" depart="45.00" departLane="w2sep_1" departPos="3.60" departPosLat="0.00" departSpeed="13.90" departDelay="1.00" arrival="212.00" arrivalLane="c2e_1" arrivalPos="990.00" arrivalPosLat="0.00" arrivalSpeed="14.27" duration="167.00" routeLength="1997.01" waitingTime="14.00" waitingCount="1" stopTime="0.00" timeLoss="26.99" rerouteNo="1" devices="tripinfo_car_w2e_44 routing_car_w2e_44" vType="Car" speedFactor="1.03" vaporized=""/>
    <tripinfo id="car_e2n_65" depart="65.00" departLane="e2sep_1" departPos="3.60" departPosLat="0.00" departSpeed="13.90" departDelay="0.00" arrival="213.00" arrivalLane="c2n_1" arrivalPos="990.00" arrivalPosLat="0.00" arrivalSpeed="15.22" duration="148.00" routeLength="1986.69" waitingTime="1.00" waitingCount="1" stopTime="0.00" timeLoss="19.90" rerouteNo="1" devices="tripinfo_car_e2n_65 routing_car_e2n_65" vType="Car" speedFactor="1.12" vaporized=""/>
    <tripinfo id="car_e2n_73" depart="73.00" departLane="e2sep_1" departPos="3.60" departPosLat="0.00" departSpeed="13.90" departDelay="0.00" arrival="215.00" arrivalLane="c2n_1" arrivalPos="990.00" arrivalPosLat="0.00" arrivalSpeed="15.78" duration="142.00" routeLength="1986.69" waitingTime="0.00" waitingCount="0" stopTime="0.00" timeLoss="19.93" rerouteNo="1" devices="tripinfo_car_e2n_73 routing_car_e2n_73" vType="Car" speedFactor="1.18" vaporized=""/>
    <tripinfo id="car_w2e_46" depart="47.00" departLane="w2sep_1" departPos="3.60" departPosLat="0.00" departSpeed="13.90" departDelay="1.00" arrival="216.00" arrivalLane="c2e_1" arrivalPos="990.00" arrivalPosLat="0.00" arrivalSpeed="14.53" duration="169.00" routeLength="1997.01" waitingTime="13.00" waitingCount="1" stopTime="0.00" timeLoss="31.37" rerouteNo="1" devices="tripinfo_car_w2e_46 routing_car_w2e_46" vType="Car" speedFactor="1.05" vaporized=""/>
    <tripinfo id="car_e2s_20" depart="20.00" departLane="e2sep_1" departPos="3.60" departPosLat="0.00" departSpeed="13.90" departDelay="0.00" arrival="219.00" arrivalLane="c2s_1" arrivalPos="990.00" arrivalPosLat="0.00" arrivalSpeed="13.90" duration="199.00" routeLength="1996.47" waitingTime="39.00" waitingCount="2" stopTime="0.00" timeLoss="54.57" rerouteNo="1" devices="tripinfo_car_e2s_20 routing_car_e2s_20" vType="Car" speedFactor="1.00" vaporized=""/>
    <tripinfo id="car_w2n_39" depart="39.00" departLane="w2sep_1" departPos="3.60" departPosLat="0.00" departSpeed="13.90" departDelay="0.00" arrival="221.00" arrivalLane="c2n_1" arrivalPos="990.00" arrivalPosLat="0.00" arrivalSpeed="14.04" duration="182.00" routeLength="1996.47" waitingTime="22.00" waitingCount="2" stopTime="0.00" timeLoss="39.00" rerouteNo="1" devices="tripinfo_car_w2n_39 routing_car_w2n_39" vType="Car" speedFactor="1.01" vaporized=""/>
    <tripinfo id="car_w2s_85" depart="85.00" departLane="w2sep_1" departPos="3.60" departPosLat="0.00" departSpeed="13.90" departDelay="0.00" arrival="222.00" arrivalLane="c2s_1" arrivalPos="990.00" arrivalPosLat="0.00" arrivalSpeed="15.90" duration="137.00" routeLength="1986.69" waitingTime="0.00" waitingCount="0" stopTime="0.00" timeLoss="12.26" rerouteNo="1" devices="tripinfo_car_w2s_85 routing_car_w2s_85" vType="Car" speedFactor="1.16" vaporized=""/>
    <tripinfo id="car_w2e_79" depart="79.00" departLane="w2sep_1" departPos="3.60" departPosLat="0.00" departSpeed="13.90" departDelay="0.00" arrival="223.00" arrivalLane="c2e_1" arrivalPos="990.00" arrivalPosLat="0.00" arrivalSpeed="13.97" duration="144.00" routeLength="1997.01" waitingTime="0.00" waitingCount="0" stopTime="0.00" timeLoss="1.06" rerouteNo="1" devices="tripinfo_car_w2e_79 routing_car_w2e_79" vType="Car" speedFactor="1.01" vaporized=""/>
    <tripinfo id="car_e2n_80" depart="80.00" departLane="e2sep_1" departPos="3.60" departPosLat="0.00" departSpeed="13.90" departDelay="0.00" arrival="228.00" arrivalLane="c2n_1" arrivalPos="990.00" arrivalPosLat="0.00" arrivalSpeed="14.17" duration="148.00" routeLength="1986.69" waitingTime="0.00" waitingCount="0" stopTime="0.00" timeLoss="6.06" rerouteNo="1" devices="tripinfo_car_e2n_80 routing_car_e2n_80" vType="Car" speedFactor="1.02" vaporized=""/>
    <tripinfo id="car_e2s_27" depart="27.00" departLane="e2sep_1" departPos="3.60" departPosLat="0.00" departSpeed="13.90" departDelay="0.00" arrival="229.00" arrivalLane="c2s_1" arrivalPos="990.00" arrivalPosLat="0.00" arrivalSpeed="14.54" duration="202.00" routeLength="1996.47" waitingTime="39.00" waitingCount="3" stopTime="0.00" timeLoss="63.79" rerouteNo="1" devices="tripinfo_car_e2s_27 routing_car_e2s_27" vType="Car" speedFactor="1.05" vaporized=""/>
    <tripinfo id="car_w2n_67" depart="67.00" departLane="w2sep_1" departPos="3.60" departPosLat="0.00" departSpeed="13.90" departDelay="0.00" arrival="232.00" arrivalLane="c2n_1" arrivalPos="990.00" arrivalPosLat="0.00" arrivalSpeed="13.89" duration="165.00" routeLength="1996.47" waitingTime="2.00" waitingCount="2" stopTime="0.00" timeLoss="20.77" rerouteNo="1" devices="tripinfo_car_w2n_67 routing_car_w2n_67" vType="Car" speedFactor="1.00" vaporized=""/>
    <tripinfo id="car_e2s_28" depart="29.00" departLane="e2sep_1" departPos="3.60" departPosLat="0.00" departSpeed="13.90" departDelay="1.00" arrival="235.00" arrivalLane="c2s_1" arrivalPos="990.00" arrivalPosLat="0.00" arrivalSpeed="13.90" duration="206.00" routeLength="1996.47" waitingTime="34.00" waitingCount="3" stopTime="0.00" timeLoss="61.42" rerouteNo="1" devices="tripinfo_car_e2s_28 routing_car_e2s_28" vType="Car" speedFactor="1.00" vaporized=""/>
    <tripinfo id="car_w2n_68" depart="69.00" departLane="w2sep_1" departPos="3.60" departPosLat="0.00" departSpeed="13.90" departDelay="1.00" arrival="236.00" arrivalLane="c2n_1" arrivalPos="990.00" arrivalPosLat="0.00" arrivalSpeed="13.89" duration="167.00" routeLength="1996.47" waitingTime="1.00" waitingCount="1" stopTime="0.00" timeLoss="22.29" rerouteNo="1" devices="tripinfo_car_w2n_68 routing_car_w2n_68" vType="Car" speedFactor="1.00" vaporized=""/>
    <tripinfo id="car_e2s_30" depart="33.00" departLane="e2sep_1" departPos="3.60" departPosLat="0.00" departSpeed="13.90" departDelay="3.00" arrival="239.00" arrivalLane="c2s_1" arrivalPos="990.00" arrivalPosLat="0.00" arrivalSpeed="13.89" duration="206.00" routeLength="1996.47" waitingTime="31.00" waitingCount="3" stopTime="0.00" timeLoss="61.45" rerouteNo="1" devices="tripinfo_car_e2s_30 routing_car_e2s_30" vType="Car" speedFactor="1.00" vaporized=""/>
    <tripinfo id="bus_e2s_71" depart="71.00" departLane="e2sep_1" departPos="12.10" departPosLat="0.00" departSpeed="13.90" departDelay="0.00" arrival="243.00" arrivalLane="c2s_1" arrivalPos="990.00" arrivalPosLat="0.00" arrivalSpeed="13.82" duration="172.00" routeLength="1987.97" waitingTime="3.00" waitingCount="1" stopTime="0.00" timeLoss="28.19" rerouteNo="1" devices="tripinfo_bus_e2s_71 routing_bus_e2s_71" vType="Bus" speedFactor="1.00" vaporized=""/>
    <tripinfo id="car_n2w_75" depart="75.00" departLane="n2sep_1" departPos="3.60" departPosLat="0.00" departSpeed="13.90" departDelay="0.00" arrival="245.00" arrivalLane="c2w_1" arrivalPos="990.00" arrivalPosLat="0.00" arrivalSpeed="16.05" duration="170.00" routeLength="1986.69" waitingTime="35.00" waitingCount="1" stopTime="0.00" timeLoss="45.44" rerouteNo="1" devices="tripinfo_car_n2w_75 routing_car_n2w_75" vType="Car" speedFactor="1.15" vaporized=""/>
    <tripinfo id="car_n2e_67" depart="67.00" departLane="n2sep_1" departPos="3.60" departPosLat="0.00" departSpeed="13.90" departDelay="0.00" arrival="249.00" arrivalLane="c2e_1" arrivalPos="990.00" arrivalPosLat="0.00" arrivalSpeed="15.73" duration="182.00" routeLength="1996.47" waitingTime="42.00" waitingCount="1" stopTime="0.00" timeLoss="53.55" rerouteNo="1" devices="tripinfo_car_n2e_67 routing_car_n2e_67" vType="Car" speedFactor="1.13" vaporized=""/>
    <tripinfo id="car_e2s_104" depart="104.00" departLane="e2sep_1" departPos="3.60" departPosLat="0.00" departSpeed="13.90" departDelay="0.00" arrival="250.00" arrivalLane="c2s_1" arrivalPos="990.00" arrivalPosLat="0.00" arrivalSpeed="14.04" duration="146.00" routeLength="1996.47" waitingTime="0.00" waitingCount="0" stopTime="0.00" timeLoss="3.08" rerouteNo="1" devices="tripinfo_car_e2s_104 routing_car_e2s_104" vType="Car" speedFactor="1.01" vaporized=""/>
    <tripinfo id="car_n2s_79" depart="79.00" departLane="n2sep_1" departPos="3.60" departPosLat="0.00" departSpeed="13.90" departDelay="0.00" arrival="252.00" arrivalLane="c2s_1" arrivalPos="990.00" arrivalPosLat="0.00" arrivalSpeed="15.61" duration="173.00" routeLength="1997.01" waitingTime="32.00" waitingCount="1" stopTime="0.00" timeLoss="50.17" rerouteNo="1" devices="tripinfo_car_n2s_79 routing_car_n2s_79" vType="Car" speedFactor="1.17" vaporized=""/>
    <tripinfo id="car_s2n_109" depart="109.00" departLane="s2sep_1" departPos="3.60" departPosLat="0.00" departSpeed="13.90" departDelay="0.00" arrival="254.00" arrivalLane="c2n_1" arrivalPos="990.00" arrivalPosLat="0.00" arrivalSpeed="13.90" duration="145.00" routeLength="1997.01" waitingTime="0.00" waitingCount="0" stopTime="0.00" timeLoss="1.21" rerouteNo="1" devices="tripinfo_car_s2n_109 routing_car_s2n_109" vType="Car" speedFactor="1.00" vaporized=""/>
    <tripinfo id="car_n2s_82" depart="85.00" departLane="n2sep_1" departPos="3.60" departPosLat="0.00" departSpeed="13.90" departDelay="3.00" arrival="259.00" arrivalLane="c2s_1" arrivalPos="990.00" arrivalPosLat="0.00" arrivalSpeed="15.32" duration="174.00" routeLength="1997.01" waitingTime="21.00" waitingCount="1" stopTime="0.00" timeLoss="43.43" rerouteNo="1" devices="tripinfo_car_n2s_82 routing_car_n2s_82" vType="Car" speedFactor="1.10" vaporized=""/>
    <tripinfo id="car_n2w_80" depart="81.00" departLane="n2sep_1" departPos="3.60" departPosLat="0.00" departSpeed="13.90" departDelay="1.00" arrival="260.00" arrivalLane="c2w_1" arrivalPos="990.00" arrivalPosLat="0.00" arrivalSpeed="13.90" duration="179.00" routeLength="1986.69" waitingTime="22.00" waitingCount="1" stopTime="0.00" timeLoss="35.37" rerouteNo="1" devices="tripinfo_car_n2w_80 routing_car_n2w_80" vType="Car" speedFactor="1.00" vaporized=""/>
    <tripinfo id="car_n2w_82" depart="83.00" departLane="n2sep_1" departPos="3.60" departPosLat="0.00" departSpeed="13.90" departDelay="1.00" arrival="262.00" arrivalLane="c2w_1" arrivalPos="990.00" arrivalPosLat="0.00" arrivalSpeed="15.63" duration="179.00" routeLength="1986.69" waitingTime="22.00" waitingCount="1" stopTime="0.00" timeLoss="57.03" rerouteNo="1" devices="tripinfo_car_n2w_82 routing_car_n2w_82" vType="Car" speedFactor="1.18" vaporized=""/>
    <tripinfo id="car_s2e_117" depart="117.00" departLane="s2sep_1" departPos="3.60" departPosLat="0.00" departSpeed="13.90" departDelay="0.00" arrival="266.00" arrivalLane="c2e_1" arrivalPos="990.00" arrivalPosLat="0.00" arrivalSpeed="13.90" duration="149.00" routeLength="1986.69" waitingTime="0.00" waitingCount="0" stopTime="0.00" timeLoss="5.27" rerouteNo="1" devices="tripinfo_car_s2e_117 routing_car_s2e_117" vType="Car" speedFactor="1.00" vaporized=""/>
    <tripinfo id="car_n2w_85" depart="87.00" departLane="n2sep_1" departPos="3.60" departPosLat="0.00" departSpeed="13.90" departDelay="2.00" arrival="267.00" arrivalLane="c2w_1" arrivalPos="990.00" arrivalPosLat="0.00" arrivalSpeed="14.32" duration="180.00" routeLength="1986.69" waitingTime="20.00" waitingCount="1" stopTime="0.00" timeLoss="40.27" rerouteNo="1" devices="tripinfo_car_n2w_85 routing_car_n2w_85" vType="Car" speedFactor="1.03" vaporized=""/>
    <tripinfo id="car_n2s_93" depart="93.00" departLane="n2sep_1" departPos="3.60" departPosLat="0.00" departSpeed="13.90" departDelay="0.00" arrival="268.00" arrivalLane="c2s_1" arrivalPos="990.00" arrivalPosLat="0.00" arrivalSpeed="15.18" duration="175.00" routeLength="1997.01" waitingTime="17.00" waitingCount="1" stopTime="0.00" timeLoss="42.75" rerouteNo="1" devices="tripinfo_car_n2s_93 routing_car_n2s_93" vType="Car" speedFactor="1.09" vaporized=""/>
    <tripinfo id="car_n2w_86" depart="89.00" departLane="n2sep_1" departPos="3.60" departPosLat="0.00" departSpeed="13.90" departDelay="3.00" arrival="272.00" arrivalLane="c2w_1" arrivalPos="990.00" arrivalPosLat="0.00" arrivalSpeed="14.15" duration="183.00" routeLength="1986.69" waitingTime="18.00" waitingCount="1" stopTime="0.00" timeLoss="41.24" rerouteNo="1" devices="tripinfo_car_n2w_86 routing_car_n2w_86" vType="Car" speedFactor="1.02" vaporized=""/>
    <tripinfo id="bus_s2e_121" depart="123.00" departLane="s2sep_1" departPos="12.10" departPosLat="0.00" departSpeed="13.90" departDelay="2.00" arrival="274.00" arrivalLane="c2e_1" arrivalPos="990.00" arrivalPosLat="0.00" arrivalSpeed="13.90" duration="151.00" routeLength="1978.19" waitingTime="0.00" waitingCount="0" stopTime="0.00" timeLoss="8.05" rerouteNo="1" devices="tripinfo_bus_s2e_121 routing_bus_s2e_121" vType="Bus" speedFactor="1.00" vaporized=""/>
    <tripinfo id="car_n2w_94" depart="95.00" departLane="n2sep_1" departPos="3.60" departPosLat="0.00" departSpeed="13.90" departDelay="1.00" arrival="275.00" arrivalLane="c2w_1" arrivalPos="990.00" arrivalPosLat="0.00" arrivalSpeed="14.39" duration="180.00" routeLength="1986.69" waitingTime="16.00" waitingCount="1" stopTime="0.00" timeLoss="41.56" rerouteNo="1" devices="tripinfo_car_n2w_94 routing_car_n2w_94" vType="Car" speedFactor="1.04" vaporized=""/>
    <tripinfo id="car_s2n_129" depart="129.00" departLane="s2sep_1" departPos="3.60" departPosLat="0.00" departSpeed="13.90" departDelay="0.00" arrival="275.00" arrivalLane="c2n_1" arrivalPos="990.00" arrivalPosLat="0.00" arrivalSpeed="13.94" duration="146.00" routeLength="1997.01" waitingTime="0.00" waitingCount="0" stopTime="0.00" timeLoss="2.44" rerouteNo="1" devices="tripinfo_car_s2n_129 routing_car_s2n_129" vType="Car" speedFactor="1.00" vaporized=""/>
    <tripinfo id="car_n2s_96" depart="97.00" departLane="n2sep_1" departPos="3.60" departPosLat="0.00" departSpeed="13.90" departDelay="1.00" arrival="276.00" arrivalLane="c2s_1" arrivalPos="990.00" arrivalPosLat="0.00" arrivalSpeed="14.50" duration="179.00" routeLength="1997.01" waitingTime="15.00" waitingCount="1" stopTime="0.00" timeLoss="40.65" rerouteNo="1" devices="tripinfo_car_n2s_96 routing_car_n2s_96" vType="Car" speedFactor="1.04" vaporized=""/>
    <tripinfo id="car_n2w_122" depart="122.00" departLane="n2sep_1" departPos="3.60" departPosLat="0.00" departSpeed="13.90" departDelay="0.00" arrival="277.00" arrivalLane="c2w_1" arrivalPos="990.00" arrivalPosLat="0.00" arrivalSpeed="15.63" duration="155.00" routeLength="1986.69" waitingTime="2.00" waitingCount="1" stopTime="0.00" timeLoss="31.98" rerouteNo="1" devices="tripinfo_car_n2w_122 routing_car_n2w_122" vType="Car" speedFactor="1.17" vaporized=""/>
    <tripinfo id="car_s2e_142" depart="142.00" departLane="s2sep_1" departPos="3.60" departPosLat="0.00" departSpeed="13.90" departDelay="0.00" arrival="278.00" arrivalLane="c2e_1" arrivalPos="990.00" arrivalPosLat="0.00" arrivalSpeed="15.51" duration="136.00" routeLength="1986.69" waitingTime="0.00" waitingCount="0" stopTime="0.00" timeLoss="7.42" rerouteNo="1" devices="tripinfo_car_s2e_142 routing_car_s2e_142" vType="Car" speedFactor="1.12" vaporized=""/>
    <tripinfo id="car_n2w_136" depart="136.00" departLane="n2sep_1" departPos="3.60" departPosLat="0.00" departSpeed="13.90" departDelay="0.00" arrival="280.00" arrivalLane="c2w_1" arrivalPos="990.00" arrivalPosLat="0.00" arrivalSpeed="15.68" duration="144.00" routeLength="1986.69" waitingTime="0.00" waitingCount="0" stopTime="0.00" timeLoss="17.43" rerouteNo="1" devices="tripinfo_car_n2w_136 routing_car_n2w_136" vType="Car" speedFactor="1.14" vaporized=""/>
    <tripinfo id="car_n2e_140" depart="140.00" departLane="n2sep_1" departPos="3.60" departPosLat="0.00" departSpeed="13.90" departDelay="0.00" arrival="283.00" arrivalLane="c2e_1" arrivalPos="990.00" arrivalPosLat="0.00" arrivalSpeed="15.04" duration="143.00" routeLength="1996.47" waitingTime="0.00" waitingCount="0" stopTime="0.00" timeLoss="9.01" rerouteNo="1" devices="tripinfo_car_n2e_140 routing_car_n2e_140" vType="Car" speedFactor="1.08" vaporized=""/>
    <tripinfo id="car_n2e_153" depart="153.00" departLane="n2sep_1" departPos="3.60" departPosLat="0.00" departSpeed="13.90" departDelay="0.00" arrival="285.00" arrivalLane="c2e_1" arrivalPos="990.00" arrivalPosLat="0.00" arrivalSpeed="15.74" duration="132.00" routeLength="1996.47" waitingTime="0.00" waitingCount="0" stopTime="0.00" timeLoss="6.65" rerouteNo="1" devices="tripinfo_car_n2e_153 routing_car_n2e_153" vType="Car" speedFactor="1.15" vaporized=""/>
    <tripinfo id="car_s2w_65" depart="65.00" departLane="s2sep_1" departPos="3.60" departPosLat="0.00" departSpeed="13.90" departDelay="0.00" arrival="287.00" arrivalLane="c2w_1" arrivalPos="990.00" arrivalPosLat="0.00" arrivalSpeed="13.90" duration="222.00" routeLength="1996.47" waitingTime="60.00" waitingCount="2" stopTime="0.00" timeLoss="77.58" rerouteNo="1" devices="tripinfo_car_s2w_65 routing_car_s2w_65" vType="Car" speedFactor="1.00" vaporized=""/>
    <tripinfo id="car_s2w_81" depart="81.00" departLane="s2sep_1" departPos="3.60" departPosLat="0.00" departSpeed="13.90" departDelay="0.00" arrival="291.00" arrivalLane="c2w_1" arrivalPos="990.00" arrivalPosLat="0.00" arrivalSpeed="13.89" duration="210.00" routeLength="1996.47" waitingTime="44.00" waitingCount="2" stopTime="0.00" timeLoss="65.73" rerouteNo="1" devices="tripinfo_car_s2w_81 routing_car_s2w_81" vType="Car" speedFactor="1.00" vaporized=""/>
    <tripinfo id="bus_s2w_86" depart="86.00" departLane="s2sep_1" departPos="12.10" departPosLat="0.00" departSpeed="13.90" departDelay="0.00" arrival="295.00" arrivalLane="c2w_1" arrivalPos="990.00" arrivalPosLat="0.00" arrivalSpeed="13.82" duration="209.00" routeLength="1987.97" waitingTime="39.00" waitingCount="3" stopTime="0.00" timeLoss="65.33" rerouteNo="1" devices="tripinfo_bus_s2w_86 routing_bus_s2w_86" vType="Bus" speedFactor="1.00" vaporized=""/>
    <tripinfo id="car_s2w_101" depart="101.00" departLane="s2sep_1" departPos="3.60" departPosLat="0.00" departSpeed="13.90" departDelay="0.00" arrival="298.00" arrivalLane="c2w_1" arrivalPos="990.00" arrivalPosLat="0.00" arrivalSpeed="14.94" duration="197.00" routeLength="1996.47" waitingTime="31.00" waitingCount="3" stopTime="0.00" timeLoss="64.17" rerouteNo="1" devices="tripinfo_car_s2w_101 routing_car_s2w_101" vType="Car" speedFactor="1.09" vaporized=""/>
    <tripinfo id="car_e2n_107" depart="107.00" departLane="e2sep_1" departPos="3.60" departPosLat="0.00" departSpeed="13.90" departDelay="0.00" arrival="299.00" arrivalLane="c2n_1" arrivalPos="990.00" arrivalPosLat="0.00" arrivalSpeed="13.90" duration="192.00" routeLength="1986.69" waitingTime="38.00" waitingCount="1" stopTime="0.00" timeLoss="48.53" rerouteNo="1" devices="tripinfo_car_e2n_107 routing_car_e2n_107" vType="Car" speedFactor="1.00" vaporized=""/>
    <tripinfo id="bus_w2s_110" depart="110.00" departLane="w2sep_1" departPos="12.10" departPosLat="0.00" departSpeed="13.90" departDelay="0.00" arrival="303.00" arrivalLane="c2s_1" arrivalPos="990.00" arrivalPosLat="0.00" arrivalSpeed="13.90" duration="193.00" routeLength="1978.19" waitingTime="37.00" waitingCount="1" stopTime="0.00" timeLoss="49.59" rerouteNo="1" devices="tripinfo_bus_w2s_110 routing_bus_w2s_110" vType="Bus" speedFactor="1.00" vaporized=""/>
    <tripinfo id="car_e2n_158" depart="158.00" departLane="e2sep_1" departPos="3.60" departPosLat="0.00" departSpeed="13.90" departDelay="0.00" arrival="303.00" arrivalLane="c2n_1" arrivalPos="990.00" arrivalPosLat="0.00" arrivalSpeed="14.44" duration="145.00" routeLength="1986.69" waitingTime="0.00" waitingCount="0" stopTime="0.00" timeLoss="6.53" rerouteNo="1" devices="tripinfo_car_e2n_158 routing_car_e2n_158" vType="Car" speedFactor="1.04" vaporized=""/>
    <tripinfo id="car_w2s_113" depart="113.00" departLane="w2sep_1" departPos="3.60" departPosLat="0.00" departSpeed="13.90" departDelay="0.00" arrival="308.00" arrivalLane="c2s_1" arrivalPos="990.00" arrivalPosLat="0.00" arrivalSpeed="13.90" duration="195.00" routeLength="1986.69" waitingTime="34.00" waitingCount="1" stopTime="0.00" timeLoss="51.01" rerouteNo="1" devices="tripinfo_car_w2s_113 routing_car_w2s_113" vType="Car" speedFactor="1.00" vaporized=""/>
    <tripinfo id="car_w2e_147" depart="147.00" departLane="w2sep_1" departPos="3.60" departPosLat="0.00" departSpeed="13.90" departDelay="0.00" arrival="309.00" arrivalLane="c2e_1" arrivalPos="990.00" arrivalPosLat="0.00" arrivalSpeed="14.12" duration="162.00" routeLength="1997.01" waitingTime="5.00" waitingCount="1" stopTime="0.00" timeLoss="20.40" rerouteNo="1" devices="tripinfo_car_w2e_147 routing_car_w2e_147" vType="Car" speedFactor="1.02" vaporized=""/>
    <tripinfo id="car_w2s_127" depart="127.00" departLane="w2sep_1" departPos="3.60" departPosLat="0.00" departSpeed="13.90" departDelay="0.00" arrival="310.00" arrivalLane="c2s_1" arrivalPos="990.00" arrivalPosLat="0.00" arrivalSpeed="14.84" duration="183.00" routeLength="1986.69" waitingTime="28.00" waitingCount="1" stopTime="0.00" timeLoss="51.76" rerouteNo="1" devices="tripinfo_car_w2s_127 routing_car_w2s_127" vType="Car" speedFactor="1.10" vaporized=""/>
    <tripinfo id="car_e2n_164" depart="164.00" departLane="e2sep_1" departPos="3.60" departPosLat="0.00" departSpeed="13.90" departDelay="0.00" arrival="311.00" arrivalLane="c2n_1" arrivalPos="990.00" arrivalPosLat="0.00" arrivalSpeed="14.21" duration="147.00" routeLength="1986.69" waitingTime="0.00" waitingCount="0" stopTime="0.00" timeLoss="5.98" rerouteNo="1" devices="tripinfo_car_e2n_164 routing_car_e2n_164" vType="Car" speedFactor="1.02" vaporized=""/>
    <tripinfo id="car_w2s_165" depart="165.00" departLane="w2sep_1" departPos="3.60" departPosLat="0.00" departSpeed="13.90" departDelay="0.00" arrival="314.00" arrivalLane="c2s_1" arrivalPos="990.00" arrivalPosLat="0.00" arrivalSpeed="14.20" duration="149.00" routeLength="1986.69" waitingTime="0.00" waitingCount="0" stopTime="0.00" timeLoss="7.79" rerouteNo="1" devices="tripinfo_car_w2s_165 routing_car_w2s_165" vType="Car" speedFactor="1.02" vaporized=""/>
    <tripinfo id="car_e2n_167" depart="167.00" departLane="e2sep_1" departPos="3.60" departPosLat="0.00" departSpeed="13.90" departDelay="0.00" arrival="316.00" arrivalLane="c2n_1" arrivalPos="990.00" arrivalPosLat="0.00" arrivalSpeed="14.17" duration="149.00" routeLength="1986.69" waitingTime="0.00" waitingCount="0" stopTime="0.00" timeLoss="7.84" rerouteNo="1" devices="tripinfo_car_e2n_167 routing_car_e2n_167" vType="Car" speedFactor="1.02" vaporized=""/>
    <tripinfo id="car_w2e_171" depart="171.00" departLane="w2sep_1" departPos="3.60" departPosLat="0.00" departSpeed="13.90" departDelay="0.00" arrival="316.00" arrivalLane="c2e_1" arrivalPos="990.00" arrivalPosLat="0.00" arrivalSpeed="14.67" duration="145.00" routeLength="1997.01" waitingTime="0.00" waitingCount="0" stopTime="0.00" timeLoss="8.28" rerouteNo="1" devices="tripinfo_car_w2e_171 routing_car_w2e_171" vType="Car" speedFactor="1.06" vaporized=""/>
    <tripinfo id="car_w2s_167" depart="167.00" departLane="w2sep_1" departPos="3.60" departPosLat="0.00" departSpeed="13.90" departDelay="0.00" arrival="318.00" arrivalLane="c2s_1" arrivalPos="990.00" arrivalPosLat="0.00" arrivalSpeed="13.89" duration="151.00" routeLength="1986.69" waitingTime="0.00" waitingCount="0" stopTime="0.00" timeLoss="7.36" rerouteNo="1" devices="tripinfo_car_w2s_167 routing_car_w2s_167" vType="Car" speedFactor="1.00" vaporized=""/>
    <tripinfo id="car_e2n_180" depart="180.00" departLane="e2sep_1" departPos="3.60" departPosLat="0.00" departSpeed="13.90" departDelay="0.00" arrival="319.00" arrivalLane="c2n_1" arrivalPos="990.00" arrivalPosLat="0.00" arrivalSpeed="15.22" duration="139.00" routeLength="1986.69" waitingTime="0.00" waitingCount="0" stopTime="0.00" timeLoss="7.92" rerouteNo="1" devices="tripinfo_car_e2n_180 routing_car_e2n_180" vType="Car" speedFactor="1.10" vaporized=""/>
    <tripinfo id="car_w2n_124" depart="124.00" departLane="w2sep_1" departPos="3.60" departPosLat="0.00" departSpeed="13.90" departDelay="0.00" arrival="325.00" arrivalLane="c2n_1" arrivalPos="990.00" arrivalPosLat="0.00" arrivalSpeed="14.13" duration="201.00" routeLength="1996.47" waitingTime="41.00" waitingCount="2" stopTime="0.00" timeLoss="59.10" rerouteNo="1" devices="tripinfo_car_w2n_124 routing_car_w2n_124" vType="Car" speedFactor="1.02" vaporized=""/>
    <tripinfo id="car_w2s_179" depart="179.00" departLane="w2sep_1" departPos="3.60" departPosLat="0.00" departSpeed="13.90" departDelay="0.00" arrival="325.00" arrivalLane="c2s_1" arrivalPos="990.00" arrivalPosLat="0.00" arrivalSpeed="14.35" duration="146.00" routeLength="1986.69" waitingTime="0.00" waitingCount="0" stopTime="0.00" timeLoss="6.05" rerouteNo="1" devices="tripinfo_car_w2s_179 routing_car_w2s_179" vType="Car" speedFactor="1.03" vaporized=""/>
    <tripinfo id="car_e2s_132" depart="132.00" departLane="e2sep_1" departPos="3.60" departPosLat="0.00" departSpeed="13.90" departDelay="0.00" arrival="330.00" arrivalLane="c2s_1" arrivalPos="990.00" arrivalPosLat="0.00" arrivalSpeed="13.90" duration="198.00" routeLength="1996.47" waitingTime="35.00" waitingCount="2" stopTime="0.00" timeLoss="53.41" rerouteNo="1" devices="tripinfo_car_e2s_132 routing_car_e2s_132" vType="Car" speedFactor="1.00" vaporized=""/>
    <tripinfo id="car_w2n_183" depart="183.00" departLane="w2sep_1" departPos="3.60" departPosLat="0.00" departSpeed="13.90" departDelay="0.00" arrival="333.00" arrivalLane="c2n_1" arrivalPos="990.00" arrivalPosLat="0.00" arrivalSpeed="14.00" duration="150.00" routeLength="1996.47" waitingTime="0.00" waitingCount="0" stopTime="0.00" timeLoss="5.66" rerouteNo="1" devices="tripinfo_car_w2n_183 routing_car_w2n_183" vType="Car" speedFactor="1.01" vaporized=""/>
    <tripinfo id="car_e2s_134" depart="134.00" departLane="e2sep_1" departPos="3.60" departPosLat="0.00" departSpeed="13.90" departDelay="0.00" arrival="334.00" arrivalLane="c2s_1" arrivalPos="990.00" arrivalPosLat="0.00" arrivalSpeed="13.89" duration="200.00" routeLength="1996.47" waitingTime="31.00" waitingCount="2" stopTime="0.00" timeLoss="55.28" rerouteNo="1" devices="tripinfo_car_e2s_134 routing_car_e2s_134" vType="Car" speedFactor="1.00" vaporized=""/>
    <tripinfo id="car_n2w_158" depart="158.00" departLane="n2sep_1" departPos="3.60" departPosLat="0.00" departSpeed="13.90" departDelay="0.00" arrival="334.00" arrivalLane="c2w_1" arrivalPos="990.00" arrivalPosLat="0.00" arrivalSpeed="16.29" duration="176.00" routeLength="1986.69" waitingTime="42.00" waitingCount="1" stopTime="0.00" timeLoss="53.40" rerouteNo="1" devices="tripinfo_car_n2w_158 routing_car_n2w_158" vType="Car" speedFactor="1.17" vaporized=""/>
    <tripinfo id="car_w2n_184" depart="185.00" departLane="w2sep_1" departPos="3.60" departPosLat="0.00" departSpeed="13.90" departDelay="1.00" arrival="335.00" arrivalLane="c2n_1" arrivalPos="990.00" arrivalPosLat="0.00" arrivalSpeed="14.82" duration="150.00" routeLength="1996.47" waitingTime="0.00" waitingCount="0" stopTime="0.00" timeLoss="16.74" rerouteNo="1" devices="tripinfo_car_w2n_184 routing_car_w2n_184" vType="Car" speedFactor="1.09" vaporized=""/>
    <tripinfo id="car_e2s_139" depart="139.00" departLane="e2sep_1" departPos="3.60" departPosLat="0.00" departSpeed="13.90" departDelay="0.00" arrival="336.00" arrivalLane="c2s_1" arrivalPos="990.00" arrivalPosLat="0.00" arrivalSpeed="15.16" duration="197.00" routeLength="1996.47" waitingTime="31.00" waitingCount="2" stopTime="0.00" timeLoss="69.06" rerouteNo="1" devices="tripinfo_car_e2s_139 routing_car_e2s_139" vType="Car" speedFactor="1.13" vaporized=""/>
    <tripinfo id="car_w2n_193" depart="193.00" departLane="w2sep_1" departPos="3.60" departPosLat="0.00" departSpeed="13.90" departDelay="0.00" arrival="337.00" arrivalLane="c2n_1" arrivalPos="990.00" arrivalPosLat="0.00" arrivalSpeed="15.42" duration="144.00" routeLength="1996.47" waitingTime="0.00" waitingCount="0" stopTime="0.00" timeLoss="17.81" rerouteNo="1" devices="tripinfo_car_w2n_193 routing_car_w2n_193" vType="Car" speedFactor="1.15" vaporized=""/>
    <tripinfo id="car_s2e_176" depart="176.00" departLane="s2sep_1" departPos="3.60" departPosLat="0.00" departSpeed="13.90" departDelay="0.00" arrival="340.00" arrivalLane="c2e_1" arrivalPos="990.00" arrivalPosLat="0.00" arrivalSpeed="16.40" duration="164.00" routeLength="1986.69" waitingTime="28.00" waitingCount="1" stopTime="0.00" timeLoss="41.36" rerouteNo="1" devices="tripinfo_car_s2e_176 routing_car_s2e_176" vType="Car" speedFactor="1.18" vaporized=""/>
    <tripinfo id="car_s2n_148" depart="148.00" departLane="s2sep_1" departPos="3.60" departPosLat="0.00" departSpeed="13.90" departDelay="0.00" arrival="345.00" arrivalLane="c2n_1" arrivalPos="990.00" arrivalPosLat="0.00" arrivalSpeed="13.90" duration="197.00" routeLength="1997.01" waitingTime="43.00" waitingCount="1" stopTime="0.00" timeLoss="52.94" rerouteNo="1" devices="tripinfo_car_s2n_148 routing_car_s2n_148" vType="Car" speedFactor="1.00" vaporized=""/>
    <tripinfo id="car_n2w_175" depart="175.00" departLane="n2sep_1" departPos="3.60" departPosLat="0.00" departSpeed="13.90" departDelay="0.00" arrival="348.00" arrivalLane="c2w_1" arrivalPos="990.00" arrivalPosLat="0.00" arrivalSpeed="13.90" duration="173.00" routeLength="1986.69" waitingTime="17.00" waitingCount="1" stopTime="0.00" timeLoss="28.42" rerouteNo="1" devices="tripinfo_car_n2w_175 routing_car_n2w_175" vType="Car" speedFactor="1.00" vaporized=""/>
    <tripinfo id="car_s2n_156" depart="156.00" departLane="s2sep_1" departPos="3.60" departPosLat="0.00" departSpeed="13.90" departDelay="0.00" arrival="349.00" arrivalLane="c2n_1" arrivalPos="990.00" arrivalPosLat="0.00" arrivalSpeed="13.96" duration="193.00" routeLength="1997.01" waitingTime="36.00" waitingCount="1" stopTime="0.00" timeLoss="49.71" rerouteNo="1" devices="tripinfo_car_s2n_156 routing_car_s2n_156" vType="Car" speedFactor="1.01" vaporized=""/>
    <tripinfo id="car_s2e_191" depart="191.00" departLane="s2sep_1" departPos="3.60" departPosLat="0.00" departSpeed="13.90" departDelay="0.00" arrival="352.00" arrivalLane="c2e_1" arrivalPos="990.00" arrivalPosLat="0.00" arrivalSpeed="14.32" duration="161.00" routeLength="1986.69" waitingTime="6.00" waitingCount="1" stopTime="0.00" timeLoss="20.48" rerouteNo="1" devices="tripinfo_car_s2e_191 routing_car_s2e_191" vType="Car" speedFactor="1.03" vaporized=""/>
    <tripinfo id="car_n2w_208" depart="208.00" departLane="n2sep_1" departPos="3.60" departPosLat="0.00" departSpeed="13.90" departDelay="0.00" arrival="357.00" arrivalLane="c2w_1" arrivalPos="990.00" arrivalPosLat="0.00" arrivalSpeed="13.92" duration="149.00" routeLength="1986.69" waitingTime="0.00" waitingCount="0" stopTime="0.00" timeLoss="5.36" rerouteNo="1" devices="tripinfo_car_n2w_208 routing_car_n2w_208" vType="Car" speedFactor="1.00" vaporized=""/>
    <tripinfo id="car_s2e_213" depart="213.00" departLane="s2sep_1" departPos="3.60" departPosLat="0.00" departSpeed="13.90" departDelay="0.00" arrival="359.00" arrivalLane="c2e_1" arrivalPos="990.00" arrivalPosLat="0.00" arrivalSpeed="14.21" duration="146.00" routeLength="1986.69" waitingTime="0.00" waitingCount="0" stopTime="0.00" timeLoss="5.11" rerouteNo="1" devices="tripinfo_car_s2e_213 routing_car_s2e_213" vType="Car" speedFactor="1.02" vaporized=""/>
    <tripinfo id="car_n2w_217" depart="217.00" departLane="n2sep_1" departPos="3.60" departPosLat="0.00" departSpeed="13.90" departDelay="0.00" arrival="360.00" arrivalLane="c2w_1" arrivalPos="990.00" arrivalPosLat="0.00" arrivalSpeed="15.03" duration="143.00" routeLength="1986.69" waitingTime="0.00" waitingCount="0" stopTime="0.00" timeLoss="10.53" rerouteNo="1" devices="tripinfo_car_n2w_217 routing_car_n2w_217" vType="Car" speedFactor="1.09" vaporized=""/>
    <tripinfo id="bus_s2w_119" depart="120.00" departLane="s2sep_1" departPos="12.10" departPosLat="0.00" departSpeed="13.90" departDelay="1.00" arrival="367.00" arrivalLane="c2w_1" arrivalPos="990.00" arrivalPosLat="0.00" arrivalSpeed="13.89" duration="247.00" routeLength="1987.97" waitingTime="72.00" waitingCount="3" stopTime="0.00" timeLoss="102.83" rerouteNo="1" devices="tripinfo_bus_s2w_119 routing_bus_s2w_119" vType="Bus" speedFactor="1.00" vaporized=""/>
    <tripinfo id="bus_n2e_158" depart="160.00" departLane="n2sep_1" departPos="12.10" departPosLat="0.00" departSpeed="13.90" departDelay="2.00" arrival="367.00" arrivalLane="c2e_1" arrivalPos="990.00" arrivalPosLat="0.00" arrivalSpeed="13.90" duration="207.00" routeLength="1987.97" waitingTime="44.00" waitingCount="2" stopTime="0.00" timeLoss="62.82" rerouteNo="1" devices="tripinfo_bus_n2e_158 routing_bus_n2e_158" vType="Bus" speedFactor="1.00" vaporized=""/>
    <tripinfo id="car_s2w_138" depart="138.00" departLane="s2sep_1" departPos="3.60" departPosLat="0.00" departSpeed="13.90" departDelay="0.00" arrival="371.00" arrivalLane="c2w_1" arrivalPos="990.00" arrivalPosLat="0.00" arrivalSpeed="14.21" duration="233.00" routeLength="1996.47" waitingTime="57.00" waitingCount="3" stopTime="0.00" timeLoss="91.45" rerouteNo="1" devices="tripinfo_car_s2w_138 routing_car_s2w_138" vType="Car" speedFactor="1.02" vaporized=""/>
    <tripinfo id="car_s2e_228" depart="228.00" departLane="s2sep_1" departPos="3.60" departPosLat="0.00" departSpeed="13.90" departDelay="0.00" arrival="372.00" arrivalLane="c2e_1" arrivalPos="990.00" arrivalPosLat="0.00" arrivalSpeed="14.50" duration="144.00" routeLength="1986.69" waitingTime="0.00" waitingCount="0" stopTime="0.00" timeLoss="6.15" rerouteNo="1" devices="tripinfo_car_s2e_228 routing_car_s2e_228" vType="Car" speedFactor="1.04" vaporized=""/>
    <tripinfo id="car_s2w_150" depart="150.00" departLane="s2sep_1" departPos="3.60" departPosLat="0.00" departSpeed="13.90" departDelay="0.00" arrival="373.00" arrivalLane="c2w_1" arrivalPos="990.00" arrivalPosLat="0.00" arrivalSpeed="15.64" duration="223.00" routeLength="1996.47" waitingTime="54.00" waitingCount="3" stopTime="0.00" timeLoss="99.82" rerouteNo="1" devices="tripinfo_car_s2w_150 routing_car_s2w_150" vType="Car" speedFactor="1.18" vaporized=""/>
    <tripinfo id="car_n2e_187" depart="187.00" departLane="n2sep_1" departPos="3.60" departPosLat="0.00" departSpeed="13.90" departDelay="0.00" arrival="376.00" arrivalLane="c2e_1" arrivalPos="990.00" arrivalPosLat="0.00" arrivalSpeed="14.37" duration="189.00" routeLength="1996.47" waitingTime="21.00" waitingCount="3" stopTime="0.00" timeLoss="49.49" rerouteNo="1" devices="tripinfo_car_n2e_187 routing_car_n2e_187" vType="Car" speedFactor="1.03" vaporized=""/>
    <tripinfo id="car_n2e_188" depart="189.00" departLane="n2sep_1" departPos="3.60" departPosLat="0.00" departSpeed="13.90" departDelay="1.00" arrival="381.00" arrivalLane="c2e_1" arrivalPos="990.00" arrivalPosLat="0.00" arrivalSpeed="13.90" duration="192.00" routeLength="1996.47" waitingTime="17.00" waitingCount="3" stopTime="0.00" timeLoss="47.25" rerouteNo="1" devices="tripinfo_car_n2e_188 routing_car_n2e_188" vType="Car" speedFactor="1.00" vaporized=""/>
    <tripinfo id="car_n2e_213" depart="213.00" departLane="n2sep_1" departPos="3.60" departPosLat="0.00" departSpeed="13.90" departDelay="0.00" arrival="384.00" arrivalLane="c2e_1" arrivalPos="990.00" arrivalPosLat="0.00" arrivalSpeed="13.96" duration="171.00" routeLength="1996.47" waitingTime="2.00" waitingCount="2" stopTime="0.00" timeLoss="27.73" rerouteNo="1" devices="tripinfo_car_n2e_213 routing_car_n2e_213" vType="Car" speedFactor="1.01" vaporized=""/>
    <tripinfo id="car_n2e_217" depart="219.00" departLane="n2sep_1" departPos="3.60" departPosLat="0.00" departSpeed="13.90" departDelay="2.00" arrival="387.00" arrivalLane="c2e_1" arrivalPos="990.00" arrivalPosLat="0.00" arrivalSpeed="14.33" duration="168.00" routeLength="1996.47" waitingTime="1.00" waitingCount="1" stopTime="0.00" timeLoss="28.55" rerouteNo="1" devices="tripinfo_car_n2e_217 routing_car_n2e_217" vType="Car" speedFactor="1.04" vaporized=""/>
    <tripinfo id="car_e2n_215" depart="215.00" departLane="e2sep_1" departPos="3.60" departPosLat="0.00" departSpeed="13.90" departDelay="0.00" arrival="388.00" arrivalLane="c2n_1" arrivalPos="990.00" arrivalPosLat="0.00" arrivalSpeed="14.13" duration="173.00" routeLength="1986.69" waitingTime="22.00" waitingCount="1" stopTime="0.00" timeLoss="31.72" rerouteNo="1" devices="tripinfo_car_e2n_215 routing_car_e2n_215" vType="Car" speedFactor="1.02" vaporized=""/>
    <tripinfo id="car_n2e_229" depart="229.00" departLane="n2sep_1" departPos="3.60" departPosLat="0.00" departSpeed="13.90" departDelay="0.00" arrival="389.00" arrivalLane="c2e_1" arrivalPos="990.00" arrivalPosLat="0.00" arrivalSpeed="14.78" duration="160.00" routeLength="1996.47" waitingTime="1.00" waitingCount="1" stopTime="0.00" timeLoss="27.41" rerouteNo="1" devices="tripinfo_car_n2e_229 routing_car_n2e_229" vType="Car" speedFactor="1.09" vaporized=""/>
    <tripinfo id="car_w2e_189" depart="189.00" departLane="w2sep_1" departPos="3.60" departPosLat="0.00" departSpeed="13.90" departDelay="0.00" arrival="392.00" arrivalLane="c2e_1" arrivalPos="990.00" arrivalPosLat="0.00" arrivalSpeed="14.07" duration="203.00" routeLength="1997.01" waitingTime="48.00" waitingCount="1" stopTime="0.00" timeLoss="61.34" rerouteNo="1" devices="tripinfo_car_w2e_189 routing_car_w2e_189" vType="Car" speedFactor="1.02" vaporized=""/>
    <tripinfo id="car_w2n_199" depart="199.00" departLane="w2sep_1" departPos="3.60" departPosLat="0.00" departSpeed="13.90" departDelay="0.00" arrival="393.00" arrivalLane="c2n_1" arrivalPos="990.00" arrivalPosLat="0.00" arrivalSpeed="13.90" duration="194.00" routeLength="1996.47" waitingTime="37.00" waitingCount="1" stopTime="0.00" timeLoss="49.69" rerouteNo="1" devices="tripinfo_car_w2n_199 routing_car_w2n_199" vType="Car" speedFactor="1.00" vaporized=""/>
    <tripinfo id="car_w2e_245" depart="245.00" departLane="w2sep_1" departPos="3.60" departPosLat="0.00" departSpeed="13.90" departDelay="0.00" arrival="394.00" arrivalLane="c2e_1" arrivalPos="990.00" arrivalPosLat="0.00" arrivalSpeed="14.41" duration="149.00" routeLength="1997.01" waitingTime="0.00" waitingCount="0" stopTime="0.00" timeLoss="13.01" rerouteNo="1" devices="tripinfo_car_w2e_245 routing_car_w2e_245" vType="Car" speedFactor="1.06" vaporized=""/>
    <tripinfo id="car_w2n_211" depart="211.00" departLane="w2sep_1" departPos="3.60" departPosLat="0.00" departSpeed="13.90" departDelay="0.00" arrival="396.00" arrivalLane="c2n_1" arrivalPos="990.00" arrivalPosLat="0.00" arrivalSpeed="14.41" duration="185.00" routeLength="1996.47" waitingTime="29.00" waitingCount="1" stopTime="0.00" timeLoss="46.30" rerouteNo="1" devices="tripinfo_car_w2n_211 routing_car_w2n_211" vType="Car" speedFactor="1.04" vaporized=""/>
    <tripinfo id="bus_w2s_248" depart="248.00" departLane="w2sep_1" departPos="12.10" departPosLat="0.00" departSpeed="13.90" departDelay="0.00" arrival="399.00" arrivalLane="c2s_1" arrivalPos="990.00" arrivalPosLat="0.00" arrivalSpeed="13.90" duration="151.00" routeLength="1978.19" waitingTime="0.00" waitingCount="0" stopTime="0.00" timeLoss="7.72" rerouteNo="1" devices="tripinfo_bus_w2s_248 routing_bus_w2s_248" vType="Bus" speedFactor="1.00" vaporized=""/>
    <tripinfo id="car_w2e_252" depart="252.00" departLane="w2sep_1" departPos="3.60" departPosLat="0.00" departSpeed="13.90" departDelay="0.00" arrival="400.00" arrivalLane="c2e_1" arrivalPos="990.00" arrivalPosLat="0.00" arrivalSpeed="14.04" duration="148.00" routeLength="1997.01" waitingTime="0.00" waitingCount="0" stopTime="0.00" timeLoss="5.43" rerouteNo="1" devices="tripinfo_car_w2e_252 routing_car_w2e_252" vType="Car" speedFactor="1.01" vaporized=""/>
    <tripinfo id="car_w2e_254" depart="254.00" departLane="w2sep_1" departPos="3.60" departPosLat="0.00" departSpeed="13.90" departDelay="0.00" arrival="403.00" arrivalLane="c2e_1" arrivalPos="990.00" arrivalPosLat="0.00" arrivalSpeed="14.98" duration="149.00" routeLength="1997.01" waitingTime="0.00" waitingCount="0" stopTime="0.00" timeLoss="16.02" rerouteNo="1" devices="tripinfo_car_w2e_254 routing_car_w2e_254" vType="Car" speedFactor="1.09" vaporized=""/>
    <tripinfo id="car_e2w_263" depart="263.00" departLane="e2sep_1" departPos="3.60" departPosLat="0.00" departSpeed="13.90" departDelay="0.00" arrival="407.00" arrivalLane="c2w_1" arrivalPos="990.00" arrivalPosLat="0.00" arrivalSpeed="13.90" duration="144.00" routeLength="1997.01" waitingTime="0.00" waitingCount="0" stopTime="0.00" timeLoss="0.15" rerouteNo="1" devices="tripinfo_car_e2w_263 routing_car_e2w_263" vType="Car" speedFactor="1.00" vaporized=""/>
    <tripinfo id="car_w2e_271" depart="271.00" departLane="w2sep_1" departPos="3.60" departPosLat="0.00" departSpeed="13.90" departDelay="0.00" arrival="408.00" arrivalLane="c2e_1" arrivalPos="990.00" arrivalPosLat="0.00" arrivalSpeed="14.80" duration="137.00" routeLength="1997.01" waitingTime="0.00" waitingCount="0" stopTime="0.00" timeLoss="1.51" rerouteNo="1" devices="tripinfo_car_w2e_271 routing_car_w2e_271" vType="Car" speedFactor="1.06" vaporized=""/>
    <tripinfo id="car_w2n_269" depart="269.00" departLane="w2sep_1" departPos="3.60" departPosLat="0.00" departSpeed="13.90" departDelay="0.00" arrival="417.00" arrivalLane="c2n_1" arrivalPos="990.00" arrivalPosLat="0.00" arrivalSpeed="14.09" duration="148.00" routeLength="1996.47" waitingTime="0.00" waitingCount="0" stopTime="0.00" timeLoss="4.81" rerouteNo="1" devices="tripinfo_car_w2n_269 routing_car_w2n_269" vType="Car" speedFactor="1.01" vaporized=""/>
    <tripinfo id="car_s2n_256" depart="256.00" departLane="s2sep_1" departPos="3.60" departPosLat="0.00" departSpeed="13.90" departDelay="0.00" arrival="427.00" arrivalLane="c2n_1" arrivalPos="990.00" arrivalPosLat="0.00" arrivalSpeed="15.59" duration="171.00" routeLength="1997.01" waitingTime="32.00" waitingCount="1" stopTime="0.00" timeLoss="42.77" rerouteNo="1" devices="tripinfo_car_s2n_256 routing_car_s2n_256" vType="Car" speedFactor="1.12" vaporized=""/>
    <tripinfo id="car_n2s_257" depart="257.00" departLane="n2sep_1" departPos="3.60" departPosLat="0.00" departSpeed="13.90" departDelay="0.00" arrival="429.00" arrivalLane="c2s_1" arrivalPos="990.00" arrivalPosLat="0.00" arrivalSpeed="15.25" duration="172.00" routeLength="1997.01" waitingTime="30.00" waitingCount="1" stopTime="0.00" timeLoss="40.15" rerouteNo="1" devices="tripinfo_car_n2s_257 routing_car_n2s_257" vType="Car" speedFactor="1.10" vaporized=""/>
    <tripinfo id="car_s2n_257" depart="258.00" departLane="s2sep_1" departPos="3.60" departPosLat="0.00" departSpeed="13.90" departDelay="1.00" arrival="434.00" arrivalLane="c2n_1" arrivalPos="990.00" arrivalPosLat="0.00" arrivalSpeed="14.80" duration="176.00" routeLength="1997.01" waitingTime="27.00" waitingCount="1" stopTime="0.00" timeLoss="40.41" rerouteNo="1" devices="tripinfo_car_s2n_257 routing_car_s2n_257" vType="Car" speedFactor="1.07" vaporized=""/>
    <tripinfo id="car_n2w_268" depart="269.00" departLane="n2sep_1" departPos="3.60" departPosLat="0.00" departSpeed="13.90" departDelay="1.00" arrival="436.00" arrivalLane="c2w_1" arrivalPos="990.00" arrivalPosLat="0.00" arrivalSpeed="14.91" duration="167.00" routeLength="1986.69" waitingTime="16.00" waitingCount="1" stopTime="0.00" timeLoss="32.02" rerouteNo="1" devices="tripinfo_car_n2w_268 routing_car_n2w_268" vType="Car" speedFactor="1.07" vaporized=""/>
    <tripinfo id="car_n2s_265" depart="265.00" departLane="n2sep_1" departPos="3.60" departPosLat="0.00" departSpeed="13.90" departDelay="0.00" arrival="438.00" arrivalLane="c2s_1" arrivalPos="990.00" arrivalPosLat="0.00" arrivalSpeed="13.90" duration="173.00" routeLength="1997.01" waitingTime="17.00" waitingCount="1" stopTime="0.00" timeLoss="28.50" rerouteNo="1" devices="tripinfo_car_n2s_265 routing_car_n2s_265" vType="Car" speedFactor="1.00" vaporized=""/>
    <tripinfo id="car_n2e_259" depart="259.00" departLane="n2sep_1" departPos="3.60" departPosLat="0.00" departSpeed="13.90" departDelay="0.00" arrival="440.00" arrivalLane="c2e_1" arrivalPos="990.00" arrivalPosLat="0.00" arrivalSpeed="13.90" duration="181.00" routeLength="1996.47" waitingTime="21.00" waitingCount="1" stopTime="0.00" timeLoss="36.19" rerouteNo="1" devices="tripinfo_car_n2e_259 routing_car_n2e_259" vType="Car" speedFactor="1.00" vaporized=""/>
    <tripinfo id="car_n2w_269" depart="271.00" departLane="n2sep_1" departPos="3.60" departPosLat="0.00" departSpeed="13.90" departDelay="2.00" arrival="442.00" arrivalLane="c2w_1" arrivalPos="990.00" arrivalPosLat="0.00" arrivalSpeed="14.38" duration="171.00" routeLength="1986.69" waitingTime="14.00" waitingCount="1" stopTime="0.00" timeLoss="31.44" rerouteNo="1" devices="tripinfo_car_n2w_269 routing_car_n2w_269" vType="Car" speedFactor="1.03" vaporized=""/>
    <tripinfo id="car_n2e_267" depart="267.00" departLane="n2sep_1" departPos="3.60" departPosLat="0.00" departSpeed="13.90" departDelay="0.00" arrival="444.00" arrivalLane="c2e_1" arrivalPos="990.00" arrivalPosLat="0.00" arrivalSpeed="13.89" duration="177.00" routeLength="1996.47" waitingTime="15.00" waitingCount="1" stopTime="0.00" timeLoss="32.66" rerouteNo="1" devices="tripinfo_car_n2e_267 routing_car_n2e_267" vType="Car" speedFactor="1.00" vaporized=""/>
    <tripinfo id="car_n2w_292" depart="292.00" departLane="n2sep_1" departPos="3.60" departPosLat="0.00" departSpeed="13.90" departDelay="0.00" arrival="444.00" arrivalLane="c2w_1" arrivalPos="990.00" arrivalPosLat="0.00" arrivalSpeed="15.03" duration="152.00" routeLength="1986.69" waitingTime="0.00" waitingCount="0" stopTime="0.00" timeLoss="21.13" rerouteNo="1" devices="tripinfo_car_n2w_292 routing_car_n2w_292" vType="Car" speedFactor="1.10" vaporized=""/>
    <tripinfo id="car_n2w_304" depart="304.00" departLane="n2sep_1" departPos="3.60" departPosLat="0.00" departSpeed="13.90" departDelay="0.00" arrival="447.00" arrivalLane="c2w_1" arrivalPos="990.00" arrivalPosLat="0.00" arrivalSpeed="15.21" duration="143.00" routeLength="1986.69" waitingTime="0.00" waitingCount="0" stopTime="0.00" timeLoss="12.47" rerouteNo="1" devices="tripinfo_car_n2w_304 routing_car_n2w_304" vType="Car" speedFactor="1.10" vaporized=""/>
    <tripinfo id="car_n2e_300" depart="300.00" departLane="n2sep_1" departPos="3.60" departPosLat="0.00" departSpeed="13.90" departDelay="0.00" arrival="450.00" arrivalLane="c2e_1" arrivalPos="990.00" arrivalPosLat="0.00" arrivalSpeed="13.94" duration="150.00" routeLength="1996.47" waitingTime="0.00" waitingCount="0" stopTime="0.00" timeLoss="5.75" rerouteNo="1" devices="tripinfo_car_n2e_300 routing_car_n2e_300" vType="Car" speedFactor="1.00" vaporized=""/>
    <tripinfo id="car_s2w_299" depart="299.00" departLane="s2sep_1" departPos="3.60" departPosLat="0.00" departSpeed="13.90" departDelay="0.00" arrival="453.00" arrivalLane="c2w_1" arrivalPos="990.00" arrivalPosLat="0.00" arrivalSpeed="13.96" duration="154.00" routeLength="1996.47" waitingTime="0.00" waitingCount="0" stopTime="0.00" timeLoss="9.37" rerouteNo="1" devices="tripinfo_car_s2w_299 routing_car_s2w_299" vType="Car" speedFactor="1.00" vaporized=""/>
    <tripinfo id="car_n2s_317" depart="317.00" departLane="n2sep_1" departPos="3.60" departPosLat="0.00" departSpeed="13.90" departDelay="0.00" arrival="453.00" arrivalLane="c2s_1" arrivalPos="990.00" arrivalPosLat="0.00" arrivalSpeed="14.75" duration="136.00" routeLength="1997.01" waitingTime="0.00" waitingCount="0" stopTime="0.00" timeLoss="0.50" rerouteNo="1" devices="tripinfo_car_n2s_317 routing_car_n2s_317" vType="Car" speedFactor="1.06" vaporized=""/>
    <tripinfo id="car_w2n_298" depart="298.00" departLane="w2sep_1" departPos="3.60" departPosLat="0.00" departSpeed="13.90" departDelay="0.00" arrival="454.00" arrivalLane="c2n_1" arrivalPos="990.00" arrivalPosLat="0.00" arrivalSpeed="16.36" duration="156.00" routeLength="1996.47" waitingTime="22.00" waitingCount="1" stopTime="0.00" timeLoss="32.55" rerouteNo="1" devices="tripinfo_car_w2n_298 routing_car_w2n_298" vType="Car" speedFactor="1.18" vaporized=""/>
    <tripinfo id="car_s2w_310" depart="310.00" departLane="s2sep_1" departPos="3.60" departPosLat="0.00" departSpeed="13.90" departDelay="0.00" arrival="458.00" arrivalLane="c2w_1" arrivalPos="990.00" arrivalPosLat="0.00" arrivalSpeed="14.33" duration="148.00" routeLength="1996.47" waitingTime="0.00" waitingCount="0" stopTime="0.00" timeLoss="7.96" rerouteNo="1" devices="tripinfo_car_s2w_310 routing_car_s2w_310" vType="Car" speedFactor="1.03" vaporized=""/>
    <tripinfo id="car_w2e_324" depart="324.00" departLane="w2sep_1" departPos="3.60" departPosLat="0.00" departSpeed="13.90" departDelay="0.00" arrival="460.00" arrivalLane="c2e_1" arrivalPos="990.00" arrivalPosLat="1.00" arrivalSpeed="15.55" duration="136.00" routeLength="1997.01" waitingTime="0.00" waitingCount="0" stopTime="0.00" timeLoss="6.76" rerouteNo="1" devices="tripinfo_car_w2e_324 routing_car_w2e_324" vType="Car" speedFactor="1.12" vaporized=""/>
    <tripinfo id="amb_w2e_345" depart="345.00" departLane="w2sep_1" departPos="6.60" departPosLat="0.00" departSpeed="13.90" departDelay="0.00" arrival="461.00" arrivalLane="c2e_1" arrivalPos="990.00" arrivalPosLat="0.00" arrivalSpeed="17.19" duration="116.00" routeLength="1994.01" waitingTime="0.00" waitingCount="0" stopTime="0.00" timeLoss="20.16" rerouteNo="1" devices="tripinfo_amb_w2e_345 routing_amb_w2e_345 bluelight_amb_w2e_345" vType="Ambulance" speedFactor="1.50" vaporized="">
        <bluelight/>
    </tripinfo>
    <tripinfo id="car_w2s_320" depart="320.00" departLane="w2sep_1" departPos="3.60" departPosLat="0.00" departSpeed="13.90" departDelay="0.00" arrival="463.00" arrivalLane="c2s_1" arrivalPos="990.00" arrivalPosLat="0.00" arrivalSpeed="14.35" duration="143.00" routeLength="1986.69" waitingTime="0.00" waitingCount="0" stopTime="0.00" timeLoss="3.95" rerouteNo="1" devices="tripinfo_car_w2s_320 routing_car_w2s_320" vType="Car" speedFactor="1.03" vaporized=""/>
    <tripinfo id="car_n2s_329" depart="329.00" departLane="n2sep_1" departPos="3.60" departPosLat="0.00" departSpeed="13.90" departDelay="0.00" arrival="468.00" arrivalLane="c2s_1" arrivalPos="990.00" arrivalPosLat="0.00" arrivalSpeed="15.87" duration="139.00" routeLength="1997.01" waitingTime="1.00" waitingCount="1" stopTime="0.00" timeLoss="12.54" rerouteNo="1" devices="tripinfo_car_n2s_329 routing_car_n2s_329" vType="Car" speedFactor="1.14" vaporized=""/>
    <tripinfo id="car_s2n_328" depart="328.00" departLane="s2sep_1" departPos="3.60" departPosLat="0.00" departSpeed="13.90" departDelay="0.00" arrival="473.00" arrivalLane="c2n_1" arrivalPos="990.00" arrivalPosLat="0.00" arrivalSpeed="14.35" duration="145.00" routeLength="1997.01" waitingTime="0.00" waitingCount="0" stopTime="0.00" timeLoss="5.36" rerouteNo="1" devices="tripinfo_car_s2n_328 routing_car_s2n_328" vType="Car" speedFactor="1.03" vaporized=""/>
    <tripinfo id="car_s2e_328" depart="330.00" departLane="s2sep_1" departPos="3.60" departPosLat="0.00" departSpeed="13.90" departDelay="2.00" arrival="474.00" arrivalLane="c2e_1" arrivalPos="990.00" arrivalPosLat="0.00" arrivalSpeed="14.85" duration="144.00" routeLength="1986.69" waitingTime="0.00" waitingCount="0" stopTime="0.00" timeLoss="9.01" rerouteNo="1" devices="tripinfo_car_s2e_328 routing_car_s2e_328" vType="Car" speedFactor="1.07" vaporized=""/>
    <tripinfo id="car_n2e_325" depart="325.00" departLane="n2sep_1" departPos="3.60" departPosLat="0.00" departSpeed="13.90" departDelay="0.00" arrival="481.00" arrivalLane="c2e_1" arrivalPos="990.00" arrivalPosLat="0.00" arrivalSpeed="14.02" duration="156.00" routeLength="1996.47" waitingTime="0.00" waitingCount="0" stopTime="0.00" timeLoss="12.42" rerouteNo="1" devices="tripinfo_car_n2e_325 routing_car_n2e_325" vType="Car" speedFactor="1.01" vaporized=""/>
    <tripinfo id="car_e2w_291" depart="291.00" departLane="e2sep_1" departPos="3.60" departPosLat="0.00" departSpeed="13.90" departDelay="0.00" arrival="485.00" arrivalLane="c2w_1" arrivalPos="990.00" arrivalPosLat="0.00" arrivalSpeed="16.25" duration="194.00" routeLength="1997.01" waitingTime="51.00" waitingCount="1" stopTime="0.00" timeLoss="70.36" rerouteNo="1" devices="tripinfo_car_e2w_291 routing_car_e2w_291" vType="Car" speedFactor="1.17" vaporized=""/>
    <tripinfo id="car_w2s_347" depart="347.00" departLane="w2sep_1" departPos="3.60" departPosLat="0.00" departSpeed="13.90" departDelay="0.00" arrival="488.00" arrivalLane="c2s_1" arrivalPos="990.00" arrivalPosLat="0.00" arrivalSpeed="15.05" duration="141.00" routeLength="1986.69" waitingTime="0.00" waitingCount="0" stopTime="0.00" timeLoss="7.78" rerouteNo="1" devices="tripinfo_car_w2s_347 routing_car_w2s_347" vType="Car" speedFactor="1.08" vaporized=""/>
    <tripinfo id="car_w2e_361" depart="361.00" departLane="w2sep_1" departPos="3.60" departPosLat="0.00" departSpeed="13.90" departDelay="0.00" arrival="488.00" arrivalLane="c2e_1" arrivalPos="990.00" arrivalPosLat="0.00" arrivalSpeed="15.96" duration="127.00" routeLength="1997.01" waitingTime="0.00" waitingCount="0" stopTime="0.00" timeLoss="1.33" rerouteNo="1" devices="tripinfo_car_w2e_361 routing_car_w2e_361" vType="Car" speedFactor="1.15" vaporized=""/>
    <tripinfo id="car_e2n_287" depart="287.00" departLane="e2sep_1" departPos="3.60" departPosLat="0.00" departSpeed="13.90" departDelay="0.00" arrival="492.00" arrivalLane="c2n_1" arrivalPos="990.00" arrivalPosLat="0.00" arrivalSpeed="13.90" duration="205.00" routeLength="1986.69" waitingTime="52.00" waitingCount="1" stopTime="0.00" timeLoss="61.55" rerouteNo="1" devices="tripinfo_car_e2n_287 routing_car_e2n_287" vType="Car" speedFactor="1.00" vaporized=""/>
    <tripinfo id="car_e2n_296" depart="297.00" departLane="e2sep_1" departPos="3.60" departPosLat="0.00" departSpeed="13.90" departDelay="1.00" arrival="496.00" arrivalLane="c2n_1" arrivalPos="990.00" arrivalPosLat="0.00" arrivalSpeed="15.20" duration="199.00" routeLength="1986.69" waitingTime="46.00" waitingCount="1" stopTime="0.00" timeLoss="67.13" rerouteNo="1" devices="tripinfo_car_e2n_296 routing_car_e2n_296" vType="Car" speedFactor="1.10" vaporized=""/>
    <tripinfo id="car_e2w_293" depart="295.00" departLane="e2sep_1" departPos="3.60" departPosLat="0.00" departSpeed="13.90" departDelay="2.00" arrival="497.00" arrivalLane="c2w_1" arrivalPos="990.00" arrivalPosLat="0.00" arrivalSpeed="14.03" duration="202.00" routeLength="1997.01" waitingTime="46.00" waitingCount="1" stopTime="0.00" timeLoss="58.84" rerouteNo="1" devices="tripinfo_car_e2w_293 routing_car_e2w_293" vType="Car" speedFactor="1.01" vaporized=""/>
    <tripinfo id="car_e2s_291" depart="293.00" departLane="e2sep_1" departPos="3.60" departPosLat="0.00" departSpeed="13.90" departDelay="2.00" arrival="498.00" arrivalLane="c2s_1" arrivalPos="990.00" arrivalPosLat="0.00" arrivalSpeed="14.13" duration="205.00" routeLength="1996.47" waitingTime="47.00" waitingCount="1" stopTime="0.00" timeLoss="62.74" rerouteNo="1" devices="tripinfo_car_e2s_291 routing_car_e2s_291" vType="Car" speedFactor="1.02" vaporized=""/>
    <tripinfo id="car_w2e_375" depart="375.00" departLane="w2sep_1" departPos="3.60" departPosLat="0.00" departSpeed="13.90" departDelay="0.00" arrival="498.00" arrivalLane="c2e_1" arrivalPos="990.00" arrivalPosLat="0.00" arrivalSpeed="16.39" duration="123.00" routeLength="1997.01" waitingTime="0.00" waitingCount="0" stopTime="0.00" timeLoss="0.95" rerouteNo="1" devices="tripinfo_car_w2e_375 routing_car_w2e_375" vType="Car" speedFactor="1.18" vaporized=""/>
    <tripinfo id="car_e2w_301" depart="301.00" departLane="e2sep_1" departPos="3.60" departPosLat="0.00" departSpeed="13.90" departDelay="0.00" arrival="500.00" arrivalLane="c2w_1" arrivalPos="990.00" arrivalPosLat="0.00" arrivalSpeed="14.81" duration="199.00" routeLength="1997.01" waitingTime="45.00" waitingCount="1" stopTime="0.00" timeLoss="64.13" rerouteNo="1" devices="tripinfo_car_e2w_301 routing_car_e2w_301" vType="Car" speedFactor="1.07" vaporized=""/>
    <tripinfo id="car_e2s_296" depart="299.00" departLane="e2sep_1" departPos="3.60" departPosLat="0.00" departSpeed="13.90" departDelay="3.00" arrival="501.00" arrivalLane="c2s_1" arrivalPos="990.00" arrivalPosLat="0.00" arrivalSpeed="15.10" duration="202.00" routeLength="1996.47" waitingTime="45.00" waitingCount="1" stopTime="0.00" timeLoss="69.44" rerouteNo="1" devices="tripinfo_car_e2s_296 routing_car_e2s_296" vType="Car" speedFactor="1.10" vaporized=""/>
    <tripinfo id="car_e2w_302" depart="303.00" departLane="e2sep_1" departPos="3.60" departPosLat="0.00" departSpeed="13.90" departDelay="1.00" arrival="506.00" arrivalLane="c2w_1" arrivalPos="990.00" arrivalPosLat="0.00" arrivalSpeed="13.90" duration="203.00" routeLength="1997.01" waitingTime="41.00" waitingCount="1" stopTime="0.00" timeLoss="58.51" rerouteNo="1" devices="tripinfo_car_e2w_302 routing_car_e2w_302" vType="Car" speedFactor="1.00" vaporized=""/>
    <tripinfo id="car_e2n_316" depart="316.00" departLane="e2sep_1" departPos="3.60" departPosLat="0.00" departSpeed="13.90" departDelay="0.00" arrival="506.00" arrivalLane="c2n_1" arrivalPos="990.00" arrivalPosLat="0.00" arrivalSpeed="14.23" duration="190.00" routeLength="1986.69" waitingTime="33.00" waitingCount="1" stopTime="0.00" timeLoss="49.08" rerouteNo="1" devices="tripinfo_car_e2n_316 routing_car_e2n_316" vType="Car" speedFactor="1.02" vaporized=""/>
    <tripinfo id="car_e2s_320" depart="321.00" departLane="e2sep_1" departPos="3.60" departPosLat="0.00" departSpeed="13.90" departDelay="1.00" arrival="506.00" arrivalLane="c2s_1" arrivalPos="990.00" arrivalPosLat="0.00" arrivalSpeed="13.90" duration="185.00" routeLength="1996.47" waitingTime="20.00" waitingCount="1" stopTime="0.00" timeLoss="39.75" rerouteNo="1" devices="tripinfo_car_e2s_320 routing_car_e2s_320" vType="Car" speedFactor="1.00" vaporized=""/>
</tripinfos>
