<?xml version="1.0" encoding="UTF-8"?>

<!-- generated on Sat Apr 24 18:35:16 2021 by Eclipse SUMO Version 1.4.0
<configuration xmlns:xsi="http://www.w3.org/2001/XMLSchema-instance" xsi:noNamespaceSchemaLocation="http://sumo.dlr.de/xsd/sumoConfiguration.xsd">

    <input>
        <net-file value="sumofiles/junction.net.xml"/>
        <route-files value="sumofiles/junction_preemption_164.rou.xml"/>
        <additional-files value="sumofiles/junction.det.xml"/>
    </input>

    <output>
        <tripinfo-output value="sumofiles/output/tripinfo_preemption_164.xml"/>
    </output>

    <time>
        <begin value="0"/>
        <end value="10000"/>
        <step-length value="0.05"/>
    </time>

    <processing>
        <lateral-resolution value="0.1"/>
    </processing>

    <report>
        <no-warnings value="true"/>
        <error-log value="sumofiles/output/errorlog_preemption_164.log"/>
        <no-step-log value="true"/>
    </report>

    <traci_server>
        <remote-port value="44841"/>
    </traci_server>

    <gui_only>
        <gui-settings-file value="sumofiles/junction-gui.settings.xml"/>
        <tracker-interval value="0.05"/>
    </gui_only>

</configuration>
-->

<tripinfos xmlns:xsi="http://www.w3.org/2001/XMLSchema-instance" xsi:noNamespaceSchemaLocation="http://sumo.dlr.de/xsd/tripinfo_file.xsd">
    <tripinfo id="car_w2s_4" depart="4.00" departLane="w2sep_1" departPos="3.60" departPosLat="0.00" departSpeed="13.90" departDelay="0.00" arrival="143.30" arrivalLane="c2s_1" arrivalPos="990.00" arrivalPosLat="0.00" arrivalSpeed="14.73" duration="139.30" routeLength="1986.69" waitingTime="0.00" waitingCount="0" stopTime="0.00" timeLoss="3.75" rerouteNo="1" devices="tripinfo_car_w2s_4 routing_car_w2s_4" vType="Car" speedFactor="1.06" vaporized=""/>
    <tripinfo id="car_e2s_18" depart="18.00" departLane="e2sep_1" departPos="3.60" departPosLat="0.00" departSpeed="13.90" departDelay="0.00" arrival="154.50" arrivalLane="c2s_1" arrivalPos="990.00" arrivalPosLat="0.00" arrivalSpeed="15.16" duration="136.50" routeLength="1996.47" waitingTime="0.00" waitingCount="0" stopTime="0.00" timeLoss="4.15" rerouteNo="1" devices="tripinfo_car_e2s_18 routing_car_e2s_18" vType="Car" speedFactor="1.09" vaporized=""/>
    <tripinfo id="car_s2e_0" depart="0.00" departLane="s2sep_1" departPos="3.60" departPosLat="0.00" departSpeed="13.90" departDelay="0.00" arrival="161.70" arrivalLane="c2e_1" arrivalPos="990.00" arrivalPosLat="0.00" arrivalSpeed="14.73" duration="161.70" routeLength="1986.69" waitingTime="18.75" waitingCount="1" stopTime="0.00" timeLoss="26.14" rerouteNo="1" devices="tripinfo_car_s2e_0 routing_car_s2e_0" vType="Car" speedFactor="1.06" vaporized=""/>
    <tripinfo id="car_s2n_5" depart="5.00" departLane="s2sep_1" departPos="3.60" departPosLat="0.00" departSpeed="13.90" departDelay="0.00" arrival="162.45" arrivalLane="c2n_1" arrivalPos="990.00" arrivalPosLat="0.00" arrivalSpeed="15.05" duration="157.45" routeLength="1997.01" waitingTime="15.35" waitingCount="1" stopTime="0.00" timeLoss="24.74" rerouteNo="1" devices="tripinfo_car_s2n_5 routing_car_s2n_5" vType="Car" speedFactor="1.08" vaporized=""/>
    <tripinfo id="car_n2s_7" depart="7.00" departLane="n2sep_1" departPos="3.60" departPosLat="0.00" departSpeed="13.90" departDelay="0.00" arrival="163.95" arrivalLane="c2s_1" arrivalPos="990.00" arrivalPosLat="0.00" arrivalSpeed="14.32" duration="156.95" routeLength="1997.01" waitingTime="9.90" waitingCount="1" stopTime="0.00" timeLoss="17.50" rerouteNo="1" devices="tripinfo_car_n2s_7 routing_car_n2s_7" vType="Car" speedFactor="1.03" vaporized=""/>
    <tripinfo id="car_s2e_7" depart="7.00" departLane="s2sep_1" departPos="3.60" departPosLat="0.00" departSpeed="13.90" departDelay="0.00" arrival="168.00" arrivalLane="c2e_1" arrivalPos="990.00" arrivalPosLat="0.00" arrivalSpeed="14.54" duration="161.00" routeLength="1986.69" waitingTime="11.50" waitingCount="1" stopTime="0.00" timeLoss="23.61" rerouteNo="1" devices="tripinfo_car_s2e_7 routing_car_s2e_7" vType="Car" speedFactor="1.05" vaporized=""/>
    <tripinfo id="car_n2w_15" depart="15.00" departLane="n2sep_1" departPos="3.60" departPosLat="0.00" departSpeed="13.90" departDelay="0.00" arrival="168.10" arrivalLane="c2w_1" arrivalPos="990.00" arrivalPosLat="0.00" arrivalSpeed="14.32" duration="153.10" routeLength="1986.69" waitingTime="3.00" waitingCount="1" stopTime="0.00" timeLoss="13.65" rerouteNo="1" devices="tripinfo_car_n2w_15 routing_car_n2w_15" vType="Car" speedFactor="1.03" vaporized=""/>
    <tripinfo id="car_n2s_10" depart="10.00" departLane="n2sep_1" departPos="3.60" departPosLat="0.00" departSpeed="13.90" departDelay="0.00" arrival="169.00" arrivalLane="c2s_1" arrivalPos="990.00" arrivalPosLat="0.00" arrivalSpeed="14.04" duration="159.00" routeLength="1997.01" waitingTime="5.55" waitingCount="1" stopTime="0.00" timeLoss="16.78" rerouteNo="1" devices="tripinfo_car_n2s_10 routing_car_n2s_10" vType="Car" speedFactor="1.01" vaporized=""/>
    <tripinfo id="car_s2n_21" depart="21.00" departLane="s2sep_1" departPos="3.60" departPosLat="0.00" departSpeed="13.90" departDelay="0.00" arrival="170.80" arrivalLane="c2n_1" arrivalPos="990.00" arrivalPosLat="0.00" arrivalSpeed="14.27" duration="149.80" routeLength="1997.01" waitingTime="0.00" waitingCount="0" stopTime="0.00" timeLoss="9.80" rerouteNo="1" devices="tripinfo_car_s2n_21 routing_car_s2n_21" vType="Car" speedFactor="1.03" vaporized=""/>
    <tripinfo id="car_s2w_47" depart="47.00" departLane="s2sep_1" departPos="3.60" departPosLat="0.00" departSpeed="13.90" departDelay="0.00" arrival="175.95" arrivalLane="c2w_1" arrivalPos="990.00" arrivalPosLat="0.00" arrivalSpeed="16.10" duration="128.95" routeLength="1996.47" waitingTime="0.00" waitingCount="0" stopTime="0.00" timeLoss="4.31" rerouteNo="1" devices="tripinfo_car_s2w_47 routing_car_s2w_47" vType="Car" speedFactor="1.16" vaporized=""/>
    <tripinfo id="car_n2s_45" depart="45.00" departLane="n2sep_1" departPos="3.60" departPosLat="0.00" departSpeed="13.90" departDelay="0.00" arrival="188.90" arrivalLane="c2s_1" arrivalPos="990.00" arrivalPosLat="0.00" arrivalSpeed="13.90" duration="143.90" routeLength="1997.01" waitingTime="0.00" waitingCount="0" stopTime="0.00" timeLoss="0.23" rerouteNo="1" devices="tripinfo_car_n2s_45 routing_car_n2s_45" vType="Car" speedFactor="1.00" vaporized=""/>
    <tripinfo id="car_s2n_54" depart="54.00" departLane="s2sep_1" departPos="3.60" departPosLat="0.00" departSpeed="13.90" departDelay="0.00" arrival="190.25" arrivalLane="c2n_1" arrivalPos="990.00" arrivalPosLat="0.00" arrivalSpeed="15.16" duration="136.25" routeLength="1997.01" waitingTime="0.00" waitingCount="0" stopTime="0.00" timeLoss="4.49" rerouteNo="1" devices="tripinfo_car_s2n_54 routing_car_s2n_54" vType="Car" speedFactor="1.09" vaporized=""/>
    <tripinfo id="car_s2w_51" depart="51.00" departLane="s2sep_1" departPos="3.60" departPosLat="0.00" departSpeed="13.90" departDelay="0.00" arrival="197.40" arrivalLane="c2w_1" arrivalPos="990.00" arrivalPosLat="0.00" arrivalSpeed="14.04" duration="146.40" routeLength="1996.47" waitingTime="0.00" waitingCount="0" stopTime="0.00" timeLoss="3.51" rerouteNo="1" devices="tripinfo_car_s2w_51 routing_car_s2w_51" vType="Car" speedFactor="1.01" vaporized=""/>
    <tripinfo id="car_w2e_12" depart="12.00" departLane="w2sep_1" departPos="3.60" departPosLat="0.00" departSpeed="13.90" departDelay="0.00" arrival="207.45" arrivalLane="c2e_1" arrivalPos="990.00" arrivalPosLat="0.00" arrivalSpeed="15.05" duration="195.45" routeLength="1997.01" waitingTime="52.35" waitingCount="1" stopTime="0.00" timeLoss="62.75" rerouteNo="1" devices="tripinfo_car_w2e_12 routing_car_w2e_12" vType="Car" speedFactor="1.08" vaporized=""/>
    <tripinfo id="car_w2s_5" depart="5.35" departLane="w2sep_1" departPos="3.60" departPosLat="0.00" departSpeed="13.90" departDelay="0.35" arrival="209.95" arrivalLane="c2s_1" arrivalPos="990.00" arrivalPosLat="0.00" arrivalSpeed="14.04" duration="204.60" routeLength="1986.69" waitingTime="53.90" waitingCount="1" stopTime="0.00" timeLoss="62.40" rerouteNo="1" devices="tripinfo_car_w2s_5 routing_car_w2s_5" vType="Car" speedFactor="1.01" vaporized=""/>
    <tripinfo id="car_e2n_7" depart="7.00" departLane="e2sep_1" departPos="3.60" departPosLat="0.00" departSpeed="13.90" departDelay="0.00" arrival="210.65" arrivalLane="c2n_1" arrivalPos="990.00" arrivalPosLat="0.00" arrivalSpeed="13.90" duration="203.65" routeLength="1986.69" waitingTime="53.30" waitingCount="1" stopTime="0.00" timeLoss="59.98" rerouteNo="1" devices="tripinfo_car_e2n_7 routing_car_e2n_7" vType="Car" speedFactor="1.00" vaporized=""/>
    <tripinfo id="car_w2e_33" depart="33.00" departLane="w2sep_1" departPos="3.60" departPosLat="0.00" departSpeed="13.90" departDelay="0.00" arrival="212.85" arrivalLane="c2e_1" arrivalPos="990.00" arrivalPosLat="0.00" arrivalSpeed="15.60" duration="179.85" routeLength="1997.01" waitingTime="38.20" waitingCount="1" stopTime="0.00" timeLoss="51.91" rerouteNo="1" devices="tripinfo_car_w2e_33 routing_car_w2e_33" vType="Car" speedFactor="1.12" vaporized=""/>
    <tripinfo id="car_e2n_34" depart="34.00" departLane="e2sep_1" departPos="3.60" departPosLat="0.00" departSpeed="13.90" departDelay="0.00" arrival="215.15" arrivalLane="c2n_1" arrivalPos="990.00" arrivalPosLat="0.00" arrivalSpeed="13.89" duration="181.15" routeLength="1986.69" waitingTime="26.80" waitingCount="1" stopTime="0.00" timeLoss="37.51" rerouteNo="1" devices="tripinfo_car_e2n_34 routing_car_e2n_34" vType="Car" speedFactor="1.00" vaporized=""/>
    <tripinfo id="car_e2w_40" depart="40.00" departLane="e2sep_1" departPos="3.60" departPosLat="0.00" departSpeed="13.90" departDelay="0.00" arrival="217.50" arrivalLane="c2w_1" arrivalPos="990.00" arrivalPosLat="0.00" arrivalSpeed="13.90" duration="177.50" routeLength="1997.01" waitingTime="22.15" waitingCount="1" stopTime="0.00" timeLoss="33.81" rerouteNo="1" devices="tripinfo_car_e2w_40 routing_car_e2w_40" vType="Car" speedFactor="1.00" vaporized=""/>
    <tripinfo id="car_e2n_35" depart="35.45" departLane="e2sep_1" departPos="3.60" departPosLat="0.00" departSpeed="13.90" departDelay="0.45" arrival="217.80" arrivalLane="c2n_1" arrivalPos="990.00" arrivalPosLat="0.00" arrivalSpeed="14.40" duration="182.35" routeLength="1986.69" waitingTime="25.45" waitingCount="1" stopTime="0.00" timeLoss="45.00" rerouteNo="1" devices="tripinfo_car_e2n_35 routing_car_e2n_35" vType="Car" speedFactor="1.05" vaporized=""/>
    <tripinfo id="bus_w2s_22" depart="22.00" departLane="w2sep_1" departPos="12.10" departPosLat="0.00" departSpeed="13.90" departDelay="0.00" arrival="218.85" arrivalLane="c2s_1" arrivalPos="990.00" arrivalPosLat="0.00" arrivalSpeed="13.90" duration="196.85" routeLength="1978.19" waitingTime="41.45" waitingCount="1" stopTime="0.00" timeLoss="53.76" rerouteNo="1" devices="tripinfo_bus_w2s_22 routing_bus_w2s_22" vType="Bus" speedFactor="1.00" vaporized=""/>
    <tripinfo id="car_w2s_67" depart="67.00" departLane="w2sep_1" departPos="3.60" departPosLat="0.00" departSpeed="13.90" departDelay="0.00" arrival="221.85" arrivalLane="c2s_1" arrivalPos="990.00" arrivalPosLat="0.00" arrivalSpeed="15.54" duration="154.85" routeLength="1986.69" waitingTime="0.90" waitingCount="1" stopTime="0.00" timeLoss="27.89" rerouteNo="1" devices="tripinfo_car_w2s_67 routing_car_w2s_67" vType="Car" speedFactor="1.13" vaporized=""/>
    <tripinfo id="car_w2e_39" depart="39.00" departLane="w2sep_1" departPos="3.60" departPosLat="0.00" departSpeed="13.90" departDelay="0.00" arrival="222.45" arrivalLane="c2e_1" arrivalPos="990.00" arrivalPosLat="0.00" arrivalSpeed="13.90" duration="183.45" routeLength="1997.01" waitingTime="26.40" waitingCount="1" stopTime="0.00" timeLoss="39.77" rerouteNo="1" devices="tripinfo_car_w2e_39 routing_car_w2e_39" vType="Car" speedFactor="1.00" vaporized=""/>
    <tripinfo id="bus_e2n_47" depart="47.00" departLane="e2sep_1" departPos="12.10" departPosLat="0.00" departSpeed="13.90" departDelay="0.00" arrival="223.50" arrivalLane="c2n_1" arrivalPos="990.00" arrivalPosLat="0.00" arrivalSpeed="13.88" duration="176.50" routeLength="1978.19" waitingTime="18.75" waitingCount="1" stopTime="0.00" timeLoss="33.43" rerouteNo="1" devices="tripinfo_bus_e2n_47 routing_bus_e2n_47" vType="Bus" speedFactor="1.00" vaporized=""/>
    <tripinfo id="car_w2e_61" depart="62.40" departLane="w2sep_1" departPos="3.60" departPosLat="0.00" departSpeed="13.90" departDelay="1.40" arrival="224.55" arrivalLane="c2e_1" arrivalPos="990.00" arrivalPosLat="0.00" arrivalSpeed="15.13" duration="162.15" routeLength="1997.01" waitingTime="5.45" waitingCount="1" stopTime="0.00" timeLoss="34.17" rerouteNo="1" devices="tripinfo_car_w2e_61 routing_car_w2e_61" vType="Car" speedFactor="1.12" vaporized=""/>
    <tripinfo id="car_w2s_89" depart="89.00" departLane="w2sep_1" departPos="3.60" departPosLat="0.00" departSpeed="13.90" departDelay="0.00" arrival="224.60" arrivalLane="c2s_1" arrivalPos="990.00" arrivalPosLat="0.00" arrivalSpeed="15.95" duration="135.60" routeLength="1986.69" waitingTime="0.00" waitingCount="0" stopTime="0.00" timeLoss="11.58" rerouteNo="1" devices="tripinfo_car_w2s_89 routing_car_w2s_89" vType="Car" speedFactor="1.16" vaporized=""/>
    <tripinfo id="car_e2w_77" depart="77.00" departLane="e2sep_1" departPos="3.60" departPosLat="0.00" departSpeed="13.90" departDelay="0.00" arrival="226.55" arrivalLane="c2w_1" arrivalPos="990.00" arrivalPosLat="0.00" arrivalSpeed="13.97" duration="149.55" routeLength="1997.01" waitingTime="0.00" waitingCount="0" stopTime="0.00" timeLoss="6.60" rerouteNo="1" devices="tripinfo_car_e2w_77 routing_car_e2w_77" vType="Car" speedFactor="1.01" vaporized=""/>
    <tripinfo id="car_e2n_51" depart="51.00" departLane="e2sep_1" departPos="3.60" departPosLat="0.00" departSpeed="13.90" departDelay="0.00" arrival="227.45" arrivalLane="c2n_1" arrivalPos="990.00" arrivalPosLat="0.00" arrivalSpeed="14.12" duration="176.45" routeLength="1986.69" waitingTime="15.80" waitingCount="1" stopTime="0.00" timeLoss="35.32" rerouteNo="1" devices="tripinfo_car_e2n_51 routing_car_e2n_51" vType="Car" speedFactor="1.02" vaporized=""/>
    <tripinfo id="car_w2e_65" depart="65.00" departLane="w2sep_1" departPos="3.60" departPosLat="0.00" departSpeed="13.90" departDelay="0.00" arrival="228.70" arrivalLane="c2e_1" arrivalPos="990.00" arrivalPosLat="0.00" arrivalSpeed="13.89" duration="163.70" routeLength="1997.01" waitingTime="1.60" waitingCount="1" stopTime="0.00" timeLoss="19.99" rerouteNo="1" devices="tripinfo_car_w2e_65 routing_car_w2e_65" vType="Car" speedFactor="1.00" vaporized=""/>
    <tripinfo id="car_e2n_80" depart="80.00" departLane="e2sep_1" departPos="3.60" departPosLat="0.00" departSpeed="13.90" departDelay="0.00" arrival="229.30" arrivalLane="c2n_1" arrivalPos="990.00" arrivalPosLat="0.00" arrivalSpeed="15.43" duration="149.30" routeLength="1986.69" waitingTime="0.00" waitingCount="0" stopTime="0.00" timeLoss="26.67" rerouteNo="1" devices="tripinfo_car_e2n_80 routing_car_e2n_80" vType="Car" speedFactor="1.17" vaporized=""/>
    <tripinfo id="car_w2e_83" depart="83.00" departLane="w2sep_1" departPos="3.60" departPosLat="0.00" departSpeed="13.90" departDelay="0.00" arrival="230.75" arrivalLane="c2e_1" arrivalPos="990.00" arrivalPosLat="0.00" arrivalSpeed="14.87" duration="147.75" routeLength="1997.01" waitingTime="0.00" waitingCount="0" stopTime="0.00" timeLoss="17.41" rerouteNo="1" devices="tripinfo_car_w2e_83 routing_car_w2e_83" vType="Car" speedFactor="1.10" vaporized=""/>
    <tripinfo id="car_e2n_82" depart="82.00" departLane="e2sep_1" departPos="3.60" departPosLat="0.00" departSpeed="13.90" departDelay="0.00" arrival="231.15" arrivalLane="c2n_1" arrivalPos="990.00" arrivalPosLat="0.00" arrivalSpeed="15.60" duration="149.15" routeLength="1986.69" waitingTime="0.00" waitingCount="0" stopTime="0.00" timeLoss="27.33" rerouteNo="1" devices="tripinfo_car_e2n_82 routing_car_e2n_82" vType="Car" speedFactor="1.18" vaporized=""/>
    <tripinfo id="car_e2s_25" depart="25.00" departLane="e2sep_1" departPos="3.60" departPosLat="0.00" departSpeed="13.90" departDelay="0.00" arrival="232.65" arrivalLane="c2s_1" arrivalPos="990.00" arrivalPosLat="0.00" arrivalSpeed="14.55" duration="207.65" routeLength="1996.47" waitingTime="58.05" waitingCount="2" stopTime="0.00" timeLoss="69.82" rerouteNo="1" devices="tripinfo_car_e2s_25 routing_car_e2s_25" vType="Car" speedFactor="1.05" vaporized=""/>
    <tripinfo id="car_w2n_57" depart="57.00" departLane="w2sep_1" departPos="3.60" departPosLat="0.00" departSpeed="13.90" departDelay="0.00" arrival="234.65" arrivalLane="c2n_1" arrivalPos="990.00" arrivalPosLat="0.00" arrivalSpeed="14.24" duration="177.65" routeLength="1996.47" waitingTime="23.90" waitingCount="2" stopTime="0.00" timeLoss="37.02" rerouteNo="1" devices="tripinfo_car_w2n_57 routing_car_w2n_57" vType="Car" speedFactor="1.03" vaporized=""/>
    <tripinfo id="car_w2e_96" depart="96.00" departLane="w2sep_1" departPos="3.60" departPosLat="0.00" departSpeed="13.90" departDelay="0.00" arrival="235.95" arrivalLane="c2e_1" arrivalPos="990.00" arrivalPosLat="0.00" arrivalSpeed="14.42" duration="139.95" routeLength="1997.01" waitingTime="0.00" waitingCount="0" stopTime="0.00" timeLoss="1.47" rerouteNo="1" devices="tripinfo_car_w2e_96 routing_car_w2e_96" vType="Car" speedFactor="1.04" vaporized=""/>
    <tripinfo id="car_w2n_61" depart="61.00" departLane="w2sep_1" departPos="3.60" departPosLat="0.00" departSpeed="13.90" departDelay="0.00" arrival="237.50" arrivalLane="c2n_1" arrivalPos="990.00" arrivalPosLat="0.00" arrivalSpeed="14.46" duration="176.50" routeLength="1996.47" waitingTime="20.10" waitingCount="2" stopTime="0.00" timeLoss="38.68" rerouteNo="1" devices="tripinfo_car_w2n_61 routing_car_w2n_61" vType="Car" speedFactor="1.05" vaporized=""/>
    <tripinfo id="car_w2n_110" depart="110.00" departLane="w2sep_1" departPos="3.60" departPosLat="0.00" departSpeed="13.90" departDelay="0.00" arrival="239.90" arrivalLane="c2n_1" arrivalPos="990.00" arrivalPosLat="0.00" arrivalSpeed="15.93" duration="129.90" routeLength="1996.47" waitingTime="0.00" waitingCount="0" stopTime="0.00" timeLoss="6.42" rerouteNo="1" devices="tripinfo_car_w2n_110 routing_car_w2n_110" vType="Car" speedFactor="1.17" vaporized=""/>
    <tripinfo id="car_n2s_81" depart="81.00" departLane="n2sep_1" departPos="3.60" departPosLat="0.00" departSpeed="13.90" departDelay="0.00" arrival="255.70" arrivalLane="c2s_1" arrivalPos="990.00" arrivalPosLat="0.00" arrivalSpeed="13.90" duration="174.70" routeLength="1997.01" waitingTime="23.95" waitingCount="1" stopTime="0.00" timeLoss="31.04" rerouteNo="1" devices="tripinfo_car_n2s_81 routing_car_n2s_81" vType="Car" speedFactor="1.00" vaporized=""/>
    <tripinfo id="car_s2n_64" depart="64.00" departLane="s2sep_1" departPos="3.60" departPosLat="0.00" departSpeed="13.90" departDelay="0.00" arrival="255.75" arrivalLane="c2n_1" arrivalPos="990.00" arrivalPosLat="0.00" arrivalSpeed="13.90" duration="191.75" routeLength="1997.01" waitingTime="40.95" waitingCount="1" stopTime="0.00" timeLoss="48.09" rerouteNo="1" devices="tripinfo_car_s2n_64 routing_car_s2n_64" vType="Car" speedFactor="1.00" vaporized=""/>
    <tripinfo id="car_n2w_97" depart="97.00" departLane="n2sep_1" departPos="3.60" departPosLat="0.00" departSpeed="13.90" departDelay="0.00" arrival="259.35" arrivalLane="c2w_1" arrivalPos="990.00" arrivalPosLat="0.00" arrivalSpeed="14.50" duration="162.35" routeLength="1986.69" waitingTime="12.35" waitingCount="1" stopTime="0.00" timeLoss="24.69" rerouteNo="1" devices="tripinfo_car_n2w_97 routing_car_n2w_97" vType="Car" speedFactor="1.04" vaporized=""/>
    <tripinfo id="car_n2s_82" depart="82.45" departLane="n2sep_1" departPos="3.60" departPosLat="0.00" departSpeed="13.90" departDelay="0.45" arrival="260.10" arrivalLane="c2s_1" arrivalPos="990.00" arrivalPosLat="0.00" arrivalSpeed="13.89" duration="177.65" routeLength="1997.01" waitingTime="20.95" waitingCount="1" stopTime="0.00" timeLoss="33.98" rerouteNo="1" devices="tripinfo_car_n2s_82 routing_car_n2s_82" vType="Car" speedFactor="1.00" vaporized=""/>
    <tripinfo id="car_s2n_69" depart="70.50" departLane="s2sep_1" departPos="3.60" departPosLat="0.00" departSpeed="13.90" departDelay="1.50" arrival="260.15" arrivalLane="c2n_1" arrivalPos="990.00" arrivalPosLat="0.00" arrivalSpeed="13.89" duration="189.65" routeLength="1997.01" waitingTime="32.35" waitingCount="1" stopTime="0.00" timeLoss="45.96" rerouteNo="1" devices="tripinfo_car_s2n_69 routing_car_s2n_69" vType="Car" speedFactor="1.00" vaporized=""/>
    <tripinfo id="car_s2e_81" depart="81.00" departLane="s2sep_1" departPos="3.60" departPosLat="0.00" departSpeed="13.90" departDelay="0.00" arrival="260.95" arrivalLane="c2e_1" arrivalPos="990.00" arrivalPosLat="0.00" arrivalSpeed="14.17" duration="179.95" routeLength="1986.69" waitingTime="27.45" waitingCount="1" stopTime="0.00" timeLoss="39.05" rerouteNo="1" devices="tripinfo_car_s2e_81 routing_car_s2e_81" vType="Car" speedFactor="1.02" vaporized=""/>
    <tripinfo id="car_s2n_73" depart="73.00" departLane="s2sep_1" departPos="3.60" departPosLat="0.00" departSpeed="13.90" departDelay="0.00" arrival="261.95" arrivalLane="c2n_1" arrivalPos="990.00" arrivalPosLat="0.00" arrivalSpeed="15.41" duration="188.95" routeLength="1997.01" waitingTime="31.65" waitingCount="1" stopTime="0.00" timeLoss="67.02" rerouteNo="1" devices="tripinfo_car_s2n_73 routing_car_s2n_73" vType="Car" speedFactor="1.18" vaporized=""/>
    <tripinfo id="car_n2s_94" depart="94.00" departLane="n2sep_1" departPos="3.60" departPosLat="0.00" departSpeed="13.90" departDelay="0.00" arrival="262.30" arrivalLane="c2s_1" arrivalPos="990.00" arrivalPosLat="0.00" arrivalSpeed="14.82" duration="168.30" routeLength="1997.01" waitingTime="14.55" waitingCount="1" stopTime="0.00" timeLoss="36.69" rerouteNo="1" devices="tripinfo_car_n2s_94 routing_car_n2s_94" vType="Car" speedFactor="1.09" vaporized=""/>
    <tripinfo id="car_s2e_89" depart="89.00" departLane="s2sep_1" departPos="3.60" departPosLat="0.00" departSpeed="13.90" departDelay="0.00" arrival="264.95" arrivalLane="c2e_1" arrivalPos="990.00" arrivalPosLat="0.00" arrivalSpeed="14.30" duration="175.95" routeLength="1986.69" waitingTime="22.25" waitingCount="1" stopTime="0.00" timeLoss="36.54" rerouteNo="1" devices="tripinfo_car_s2e_89 routing_car_s2e_89" vType="Car" speedFactor="1.03" vaporized=""/>
    <tripinfo id="car_n2s_102" depart="102.00" departLane="n2sep_1" departPos="3.60" departPosLat="0.00" departSpeed="13.90" departDelay="0.00" arrival="266.15" arrivalLane="c2s_1" arrivalPos="990.00" arrivalPosLat="0.00" arrivalSpeed="13.88" duration="164.15" routeLength="1997.01" waitingTime="7.05" waitingCount="1" stopTime="0.00" timeLoss="20.46" rerouteNo="1" devices="tripinfo_car_n2s_102 routing_car_n2s_102" vType="Car" speedFactor="1.00" vaporized=""/>
    <tripinfo id="car_n2w_109" depart="109.00" departLane="n2sep_1" departPos="3.60" departPosLat="0.00" departSpeed="13.90" departDelay="0.00" arrival="267.15" arrivalLane="c2w_1" arrivalPos="990.00" arrivalPosLat="0.00" arrivalSpeed="13.90" duration="158.15" routeLength="1986.69" waitingTime="1.55" waitingCount="1" stopTime="0.00" timeLoss="14.48" rerouteNo="1" devices="tripinfo_car_n2w_109 routing_car_n2w_109" vType="Car" speedFactor="1.00" vaporized=""/>
    <tripinfo id="car_s2e_98" depart="99.45" departLane="s2sep_1" departPos="3.60" departPosLat="0.00" departSpeed="13.90" departDelay="1.45" arrival="269.45" arrivalLane="c2e_1" arrivalPos="990.00" arrivalPosLat="0.00" arrivalSpeed="13.89" duration="170.00" routeLength="1986.69" waitingTime="8.95" waitingCount="1" stopTime="0.00" timeLoss="26.32" rerouteNo="1" devices="tripinfo_car_s2e_98 routing_car_s2e_98" vType="Car" speedFactor="1.00" vaporized=""/>
    <tripinfo id="car_n2s_130" depart="130.00" departLane="n2sep_1" departPos="3.60" departPosLat="0.00" departSpeed="13.90" departDelay="0.00" arrival="271.60" arrivalLane="c2s_1" arrivalPos="990.00" arrivalPosLat="0.00" arrivalSpeed="14.22" duration="141.60" routeLength="1997.01" waitingTime="0.00" waitingCount="0" stopTime="0.00" timeLoss="1.21" rerouteNo="1" devices="tripinfo_car_n2s_130 routing_car_n2s_130" vType="Car" speedFactor="1.02" vaporized=""/>
    <tripinfo id="car_n2e_91" depart="91.00" departLane="n2sep_1" departPos="3.60" departPosLat="0.00" departSpeed="13.90" departDelay="0.00" arrival="272.55" arrivalLane="c2e_1" arrivalPos="990.00" arrivalPosLat="0.00" arrivalSpeed="14.09" duration="181.55" routeLength="1996.47" waitingTime="24.70" waitingCount="2" stopTime="0.00" timeLoss="39.81" rerouteNo="1" devices="tripinfo_car_n2e_91 routing_car_n2e_91" vType="Car" speedFactor="1.02" vaporized=""/>
    <tripinfo id="car_n2w_135" depart="135.00" departLane="n2sep_1" departPos="3.60" departPosLat="0.00" departSpeed="13.90" departDelay="0.00" arrival="273.90" arrivalLane="c2w_1" arrivalPos="990.00" arrivalPosLat="0.00" arrivalSpeed="15.04" duration="138.90" routeLength="1986.69" waitingTime="0.00" waitingCount="0" stopTime="0.00" timeLoss="6.16" rerouteNo="1" devices="tripinfo_car_n2w_135 routing_car_n2w_135" vType="Car" speedFactor="1.08" vaporized=""/>
    <tripinfo id="car_n2e_115" depart="115.00" departLane="n2sep_1" departPos="3.60" departPosLat="0.00" departSpeed="13.90" departDelay="0.00" arrival="274.70" arrivalLane="c2e_1" arrivalPos="990.00" arrivalPosLat="0.00" arrivalSpeed="14.84" duration="159.70" routeLength="1996.47" waitingTime="8.60" waitingCount="1" stopTime="0.00" timeLoss="27.98" rerouteNo="1" devices="tripinfo_car_n2e_115 routing_car_n2e_115" vType="Car" speedFactor="1.10" vaporized=""/>
    <tripinfo id="car_s2e_134" depart="134.00" departLane="s2sep_1" departPos="3.60" departPosLat="0.00" departSpeed="13.90" departDelay="0.00" arrival="276.65" arrivalLane="c2e_1" arrivalPos="990.00" arrivalPosLat="0.00" arrivalSpeed="15.17" duration="142.65" routeLength="1986.69" waitingTime="0.00" waitingCount="0" stopTime="0.00" timeLoss="15.75" rerouteNo="1" devices="tripinfo_car_s2e_134 routing_car_s2e_134" vType="Car" speedFactor="1.13" vaporized=""/>
    <tripinfo id="car_n2e_120" depart="120.00" departLane="n2sep_1" departPos="3.60" departPosLat="0.00" departSpeed="13.90" departDelay="0.00" arrival="282.85" arrivalLane="c2e_1" arrivalPos="990.00" arrivalPosLat="0.00" arrivalSpeed="13.90" duration="162.85" routeLength="1996.47" waitingTime="4.10" waitingCount="1" stopTime="0.00" timeLoss="18.52" rerouteNo="1" devices="tripinfo_car_n2e_120 routing_car_n2e_120" vType="Car" speedFactor="1.00" vaporized=""/>
    <tripinfo id="car_n2s_142" depart="142.00" departLane="n2sep_1" departPos="3.60" departPosLat="0.00" departSpeed="13.90" departDelay="0.00" arrival="286.10" arrivalLane="c2s_1" arrivalPos="990.00" arrivalPosLat="0.00" arrivalSpeed="13.90" duration="144.10" routeLength="1997.01" waitingTime="0.00" waitingCount="0" stopTime="0.00" timeLoss="0.41" rerouteNo="1" devices="tripinfo_car_n2s_142 routing_car_n2s_142" vType="Car" speedFactor="1.00" vaporized=""/>
    <tripinfo id="bus_s2w_69" depart="69.00" departLane="s2sep_1" departPos="12.10" departPosLat="0.00" departSpeed="13.90" departDelay="0.00" arrival="292.90" arrivalLane="c2w_1" arrivalPos="990.00" arrivalPosLat="0.00" arrivalSpeed="13.90" duration="223.90" routeLength="1987.97" waitingTime="64.55" waitingCount="2" stopTime="0.00" timeLoss="80.18" rerouteNo="1" devices="tripinfo_bus_s2w_69 routing_bus_s2w_69" vType="Bus" speedFactor="1.00" vaporized=""/>
    <tripinfo id="car_w2s_98" depart="98.00" departLane="w2sep_1" departPos="3.60" departPosLat="0.00" departSpeed="13.90" departDelay="0.00" arrival="295.20" arrivalLane="c2s_1" arrivalPos="990.00" arrivalPosLat="0.00" arrivalSpeed="15.12" duration="197.20" routeLength="1986.69" waitingTime="53.85" waitingCount="1" stopTime="0.00" timeLoss="65.16" rerouteNo="1" devices="tripinfo_car_w2s_98 routing_car_w2s_98" vType="Car" speedFactor="1.09" vaporized=""/>
    <tripinfo id="car_s2w_74" depart="74.50" departLane="s2sep_1" departPos="3.60" departPosLat="0.00" departSpeed="13.90" departDelay="0.50" arrival="295.35" arrivalLane="c2w_1" arrivalPos="990.00" arrivalPosLat="0.00" arrivalSpeed="15.54" duration="220.85" routeLength="1996.47" waitingTime="57.50" waitingCount="2" stopTime="0.00" timeLoss="95.84" rerouteNo="1" devices="tripinfo_car_s2w_74 routing_car_s2w_74" vType="Car" speedFactor="1.15" vaporized=""/>
    <tripinfo id="car_s2w_98" depart="98.00" departLane="s2sep_1" departPos="3.60" departPosLat="0.00" departSpeed="13.90" departDelay="0.00" arrival="299.35" arrivalLane="c2w_1" arrivalPos="990.00" arrivalPosLat="0.00" arrivalSpeed="14.03" duration="201.35" routeLength="1996.47" waitingTime="37.45" waitingCount="2" stopTime="0.00" timeLoss="58.49" rerouteNo="1" devices="tripinfo_car_s2w_98 routing_car_s2w_98" vType="Car" speedFactor="1.01" vaporized=""/>
    <tripinfo id="car_e2n_102" depart="102.00" departLane="e2sep_1" departPos="3.60" departPosLat="0.00" departSpeed="13.90" departDelay="0.00" arrival="300.65" arrivalLane="c2n_1" arrivalPos="990.00" arrivalPosLat="0.00" arrivalSpeed="13.90" duration="198.65" routeLength="1986.69" waitingTime="48.20" waitingCount="1" stopTime="0.00" timeLoss="54.95" rerouteNo="1" devices="tripinfo_car_e2n_102 routing_car_e2n_102" vType="Car" speedFactor="1.00" vaporized=""/>
    <tripinfo id="car_e2w_143" depart="143.00" departLane="e2sep_1" departPos="3.60" departPosLat="0.00" departSpeed="13.90" departDelay="0.00" arrival="301.20" arrivalLane="c2w_1" arrivalPos="990.00" arrivalPosLat="0.00" arrivalSpeed="15.53" duration="158.20" routeLength="1997.01" waitingTime="9.30" waitingCount="1" stopTime="0.00" timeLoss="36.30" rerouteNo="1" devices="tripinfo_car_e2w_143 routing_car_e2w_143" vType="Car" speedFactor="1.18" vaporized=""/>
    <tripinfo id="car_w2e_141" depart="141.00" departLane="w2sep_1" departPos="3.60" departPosLat="0.00" departSpeed="13.90" departDelay="0.00" arrival="301.75" arrivalLane="c2e_1" arrivalPos="990.00" arrivalPosLat="0.00" arrivalSpeed="14.12" duration="160.75" routeLength="1997.01" waitingTime="10.90" waitingCount="1" stopTime="0.00" timeLoss="19.29" rerouteNo="1" devices="tripinfo_car_w2e_141 routing_car_w2e_141" vType="Car" speedFactor="1.02" vaporized=""/>
    <tripinfo id="car_w2e_163" depart="163.00" departLane="w2sep_1" departPos="3.60" departPosLat="0.00" departSpeed="13.90" departDelay="0.00" arrival="306.20" arrivalLane="c2e_1" arrivalPos="990.00" arrivalPosLat="0.00" arrivalSpeed="14.20" duration="143.20" routeLength="1997.01" waitingTime="0.00" waitingCount="0" stopTime="0.00" timeLoss="2.62" rerouteNo="1" devices="tripinfo_car_w2e_163 routing_car_w2e_163" vType="Car" speedFactor="1.02" vaporized=""/>
    <tripinfo id="bus_e2n_141" depart="141.00" departLane="e2sep_1" departPos="12.10" departPosLat="0.00" departSpeed="13.90" departDelay="0.00" arrival="307.05" arrivalLane="c2n_1" arrivalPos="990.00" arrivalPosLat="0.00" arrivalSpeed="13.89" duration="166.05" routeLength="1978.19" waitingTime="10.45" waitingCount="1" stopTime="0.00" timeLoss="22.99" rerouteNo="1" devices="tripinfo_bus_e2n_141 routing_bus_e2n_141" vType="Bus" speedFactor="1.00" vaporized=""/>
    <tripinfo id="car_e2s_113" depart="113.00" departLane="e2sep_1" departPos="3.60" departPosLat="0.00" departSpeed="13.90" departDelay="0.00" arrival="308.35" arrivalLane="c2s_1" arrivalPos="990.00" arrivalPosLat="0.00" arrivalSpeed="14.13" duration="195.35" routeLength="1996.47" waitingTime="42.50" waitingCount="2" stopTime="0.00" timeLoss="53.42" rerouteNo="1" devices="tripinfo_car_e2s_113 routing_car_e2s_113" vType="Car" speedFactor="1.02" vaporized=""/>
    <tripinfo id="car_w2n_116" depart="116.00" departLane="w2sep_1" departPos="3.60" departPosLat="0.00" departSpeed="13.90" departDelay="0.00" arrival="312.05" arrivalLane="c2n_1" arrivalPos="990.00" arrivalPosLat="0.00" arrivalSpeed="13.94" duration="196.05" routeLength="1996.47" waitingTime="39.80" waitingCount="2" stopTime="0.00" timeLoss="52.19" rerouteNo="1" devices="tripinfo_car_w2n_116 routing_car_w2n_116" vType="Car" speedFactor="1.00" vaporized=""/>
    <tripinfo id="car_w2e_176" depart="176.00" departLane="w2sep_1" departPos="3.60" departPosLat="0.00" departSpeed="13.90" departDelay="0.00" arrival="313.15" arrivalLane="c2e_1" arrivalPos="990.00" arrivalPosLat="0.00" arrivalSpeed="14.67" duration="137.15" routeLength="1997.01" waitingTime="0.00" waitingCount="0" stopTime="0.00" timeLoss="1.04" rerouteNo="1" devices="tripinfo_car_w2e_176 routing_car_w2e_176" vType="Car" speedFactor="1.06" vaporized=""/>
    <tripinfo id="car_e2s_124" depart="124.00" departLane="e2sep_1" departPos="3.60" departPosLat="0.00" departSpeed="13.90" departDelay="0.00" arrival="313.40" arrivalLane="c2s_1" arrivalPos="990.00" arrivalPosLat="0.00" arrivalSpeed="13.90" duration="189.40" routeLength="1996.47" waitingTime="30.05" waitingCount="2" stopTime="0.00" timeLoss="45.08" rerouteNo="1" devices="tripinfo_car_e2s_124 routing_car_e2s_124" vType="Car" speedFactor="1.00" vaporized=""/>
    <tripinfo id="car_w2n_128" depart="128.00" departLane="w2sep_1" departPos="3.60" departPosLat="0.00" departSpeed="13.90" departDelay="0.00" arrival="314.00" arrivalLane="c2n_1" arrivalPos="990.00" arrivalPosLat="0.00" arrivalSpeed="15.24" duration="186.00" routeLength="1996.47" waitingTime="37.20" waitingCount="3" stopTime="0.00" timeLoss="59.67" rerouteNo="1" devices="tripinfo_car_w2n_128 routing_car_w2n_128" vType="Car" speedFactor="1.14" vaporized=""/>
    <tripinfo id="car_e2w_170" depart="170.00" departLane="e2sep_1" departPos="3.60" departPosLat="0.00" departSpeed="13.90" departDelay="0.00" arrival="314.35" arrivalLane="c2w_1" arrivalPos="990.00" arrivalPosLat="0.00" arrivalSpeed="13.90" duration="144.35" routeLength="1997.01" waitingTime="0.00" waitingCount="0" stopTime="0.00" timeLoss="0.68" rerouteNo="1" devices="tripinfo_car_e2w_170 routing_car_e2w_170" vType="Car" speedFactor="1.00" vaporized=""/>
    <tripinfo id="car_e2s_139" depart="139.00" departLane="e2sep_1" departPos="3.60" departPosLat="0.00" departSpeed="13.90" departDelay="0.00" arrival="315.45" arrivalLane="c2s_1" arrivalPos="990.00" arrivalPosLat="0.00" arrivalSpeed="15.05" duration="176.45" routeLength="1996.47" waitingTime="20.95" waitingCount="2" stopTime="0.00" timeLoss="47.51" rerouteNo="1" devices="tripinfo_car_e2s_139 routing_car_e2s_139" vType="Car" speedFactor="1.12" vaporized=""/>
    <tripinfo id="car_e2s_174" depart="174.00" departLane="e2sep_1" departPos="3.60" departPosLat="0.00" departSpeed="13.90" departDelay="0.00" arrival="321.10" arrivalLane="c2s_1" arrivalPos="990.00" arrivalPosLat="0.00" arrivalSpeed="14.17" duration="147.10" routeLength="1996.47" waitingTime="0.00" waitingCount="0" stopTime="0.00" timeLoss="5.57" rerouteNo="1" devices="tripinfo_car_e2s_174 routing_car_e2s_174" vType="Car" speedFactor="1.02" vaporized=""/>
    <tripinfo id="car_e2n_185" depart="185.00" departLane="e2sep_1" departPos="3.60" departPosLat="0.00" departSpeed="13.90" departDelay="0.00" arrival="322.85" arrivalLane="c2n_1" arrivalPos="990.00" arrivalPosLat="0.00" arrivalSpeed="15.32" duration="137.85" routeLength="1986.69" waitingTime="0.00" waitingCount="0" stopTime="0.00" timeLoss="7.53" rerouteNo="1" devices="tripinfo_car_e2n_185 routing_car_e2n_185" vType="Car" speedFactor="1.10" vaporized=""/>
    <tripinfo id="car_e2s_176" depart="176.00" departLane="e2sep_1" departPos="3.60" departPosLat="0.00" departSpeed="13.90" departDelay="0.00" arrival="326.95" arrivalLane="c2s_1" arrivalPos="990.00" arrivalPosLat="0.00" arrivalSpeed="13.90" duration="150.95" routeLength="1996.47" waitingTime="0.00" waitingCount="0" stopTime="0.00" timeLoss="6.61" rerouteNo="1" devices="tripinfo_car_e2s_176 routing_car_e2s_176" vType="Car" speedFactor="1.00" vaporized=""/>
    <tripinfo id="car_e2s_181" depart="181.00" departLane="e2sep_1" departPos="3.60" departPosLat="0.00" departSpeed="13.90" departDelay="0.00" arrival="328.75" arrivalLane="c2s_1" arrivalPos="990.00" arrivalPosLat="0.00" arrivalSpeed="15.46" duration="147.75" routeLength="1996.47" waitingTime="1.15" waitingCount="1" stopTime="0.00" timeLoss="25.39" rerouteNo="1" devices="tripinfo_car_e2s_181 routing_car_e2s_181" vType="Car" speedFactor="1.18" vaporized=""/>
    <tripinfo id="car_w2e_186" depart="186.00" departLane="w2sep_1" departPos="3.60" departPosLat="0.00" departSpeed="13.90" departDelay="0.00" arrival="329.00" arrivalLane="c2e_1" arrivalPos="990.00" arrivalPosLat="0.00" arrivalSpeed="14.00" duration="143.00" routeLength="1997.01" waitingTime="0.00" waitingCount="0" stopTime="0.00" timeLoss="0.34" rerouteNo="1" devices="tripinfo_car_w2e_186 routing_car_w2e_186" vType="Car" speedFactor="1.01" vaporized=""/>
    <tripinfo id="car_w2n_196" depart="196.00" departLane="w2sep_1" departPos="3.60" departPosLat="0.00" departSpeed="13.90" departDelay="0.00" arrival="333.05" arrivalLane="c2n_1" arrivalPos="990.00" arrivalPosLat="0.00" arrivalSpeed="15.11" duration="137.05" routeLength="1996.47" waitingTime="0.00" waitingCount="0" stopTime="0.00" timeLoss="4.27" rerouteNo="1" devices="tripinfo_car_w2n_196 routing_car_w2n_196" vType="Car" speedFactor="1.09" vaporized=""/>
    <tripinfo id="car_n2w_144" depart="144.00" departLane="n2sep_1" departPos="3.60" departPosLat="0.00" departSpeed="13.90" departDelay="0.00" arrival="336.40" arrivalLane="c2w_1" arrivalPos="990.00" arrivalPosLat="0.00" arrivalSpeed="16.05" duration="192.40" routeLength="1986.69" waitingTime="51.40" waitingCount="1" stopTime="0.00" timeLoss="67.94" rerouteNo="1" devices="tripinfo_car_n2w_144 routing_car_n2w_144" vType="Car" speedFactor="1.15" vaporized=""/>
    <tripinfo id="car_s2n_164" depart="164.00" departLane="s2sep_1" departPos="3.60" departPosLat="0.00" departSpeed="13.90" departDelay="0.00" arrival="344.30" arrivalLane="c2n_1" arrivalPos="990.00" arrivalPosLat="0.00" arrivalSpeed="14.22" duration="180.30" routeLength="1997.01" waitingTime="32.50" waitingCount="1" stopTime="0.00" timeLoss="39.87" rerouteNo="1" devices="tripinfo_car_s2n_164 routing_car_s2n_164" vType="Car" speedFactor="1.02" vaporized=""/>
    <tripinfo id="car_n2s_151" depart="151.00" departLane="n2sep_1" departPos="3.60" departPosLat="0.00" departSpeed="13.90" departDelay="0.00" arrival="347.45" arrivalLane="c2s_1" arrivalPos="990.00" arrivalPosLat="0.00" arrivalSpeed="13.97" duration="196.45" routeLength="1997.01" waitingTime="45.00" waitingCount="1" stopTime="0.00" timeLoss="53.51" rerouteNo="1" devices="tripinfo_car_n2s_151 routing_car_n2s_151" vType="Car" speedFactor="1.01" vaporized=""/>
    <tripinfo id="car_s2n_183" depart="183.00" departLane="s2sep_1" departPos="3.60" departPosLat="0.00" departSpeed="13.90" departDelay="0.00" arrival="348.25" arrivalLane="c2n_1" arrivalPos="990.00" arrivalPosLat="0.00" arrivalSpeed="14.33" duration="165.25" routeLength="1997.01" waitingTime="14.90" waitingCount="1" stopTime="0.00" timeLoss="26.07" rerouteNo="1" devices="tripinfo_car_s2n_183 routing_car_s2n_183" vType="Car" speedFactor="1.03" vaporized=""/>
    <tripinfo id="car_n2s_152" depart="152.45" departLane="n2sep_1" departPos="3.60" departPosLat="0.00" departSpeed="13.90" departDelay="0.45" arrival="349.35" arrivalLane="c2s_1" arrivalPos="990.00" arrivalPosLat="0.00" arrivalSpeed="15.50" duration="196.90" routeLength="1997.01" waitingTime="44.30" waitingCount="1" stopTime="0.00" timeLoss="74.26" rerouteNo="1" devices="tripinfo_car_n2s_152 routing_car_n2s_152" vType="Car" speedFactor="1.17" vaporized=""/>
    <tripinfo id="car_n2e_162" depart="162.00" departLane="n2sep_1" departPos="3.60" departPosLat="0.00" departSpeed="13.90" departDelay="0.00" arrival="351.60" arrivalLane="c2e_1" arrivalPos="990.00" arrivalPosLat="0.00" arrivalSpeed="14.46" duration="189.60" routeLength="1996.47" waitingTime="39.50" waitingCount="2" stopTime="0.00" timeLoss="50.82" rerouteNo="1" devices="tripinfo_car_n2e_162 routing_car_n2e_162" vType="Car" speedFactor="1.04" vaporized=""/>
    <tripinfo id="car_s2n_200" depart="202.60" departLane="s2sep_1" departPos="3.60" departPosLat="0.00" departSpeed="13.90" departDelay="2.60" arrival="352.90" arrivalLane="c2n_1" arrivalPos="990.00" arrivalPosLat="0.00" arrivalSpeed="13.89" duration="150.30" routeLength="1997.01" waitingTime="0.00" waitingCount="0" stopTime="0.00" timeLoss="6.60" rerouteNo="1" devices="tripinfo_car_s2n_200 routing_car_s2n_200" vType="Car" speedFactor="1.00" vaporized=""/>
    <tripinfo id="car_n2w_210" depart="210.00" departLane="n2sep_1" departPos="3.60" departPosLat="0.00" departSpeed="13.90" departDelay="0.00" arrival="355.40" arrivalLane="c2w_1" arrivalPos="990.00" arrivalPosLat="0.00" arrivalSpeed="14.21" duration="145.40" routeLength="1986.69" waitingTime="0.00" waitingCount="0" stopTime="0.00" timeLoss="4.81" rerouteNo="1" devices="tripinfo_car_n2w_210 routing_car_n2w_210" vType="Car" speedFactor="1.02" vaporized=""/>
    <tripinfo id="car_s2n_213" depart="213.00" departLane="s2sep_1" departPos="3.60" departPosLat="0.00" departSpeed="13.90" departDelay="0.00" arrival="356.40" arrivalLane="c2n_1" arrivalPos="990.00" arrivalPosLat="0.00" arrivalSpeed="14.39" duration="143.40" routeLength="1997.01" waitingTime="0.00" waitingCount="0" stopTime="0.00" timeLoss="4.94" rerouteNo="1" devices="tripinfo_car_s2n_213 routing_car_s2n_213" vType="Car" speedFactor="1.04" vaporized=""/>
    <tripinfo id="car_n2w_216" depart="216.00" departLane="n2sep_1" departPos="3.60" departPosLat="0.00" departSpeed="13.90" departDelay="0.00" arrival="358.00" arrivalLane="c2w_1" arrivalPos="990.00" arrivalPosLat="0.00" arrivalSpeed="14.99" duration="142.00" routeLength="1986.69" waitingTime="0.00" waitingCount="0" stopTime="0.00" timeLoss="10.29" rerouteNo="1" devices="tripinfo_car_n2w_216 routing_car_n2w_216" vType="Car" speedFactor="1.09" vaporized=""/>
    <tripinfo id="car_n2e_205" depart="205.00" departLane="n2sep_1" departPos="3.60" departPosLat="0.00" departSpeed="13.90" departDelay="0.00" arrival="361.10" arrivalLane="c2e_1" arrivalPos="990.00" arrivalPosLat="0.00" arrivalSpeed="13.90" duration="156.10" routeLength="1996.47" waitingTime="1.55" waitingCount="1" stopTime="0.00" timeLoss="11.75" rerouteNo="1" devices="tripinfo_car_n2e_205 routing_car_n2e_205" vType="Car" speedFactor="1.00" vaporized=""/>
    <tripinfo id="bus_s2w_130" depart="130.00" departLane="s2sep_1" departPos="12.10" departPosLat="0.00" departSpeed="13.90" departDelay="0.00" arrival="366.55" arrivalLane="c2w_1" arrivalPos="990.00" arrivalPosLat="0.00" arrivalSpeed="13.90" duration="236.55" routeLength="1987.97" waitingTime="70.70" waitingCount="3" stopTime="0.00" timeLoss="92.85" rerouteNo="1" devices="tripinfo_bus_s2w_130 routing_bus_s2w_130" vType="Bus" speedFactor="1.00" vaporized=""/>
    <tripinfo id="car_s2e_221" depart="221.00" departLane="s2sep_1" departPos="3.60" departPosLat="0.00" departSpeed="13.90" departDelay="0.00" arrival="367.70" arrivalLane="c2e_1" arrivalPos="990.00" arrivalPosLat="0.00" arrivalSpeed="14.04" duration="146.70" routeLength="1986.69" waitingTime="0.00" waitingCount="0" stopTime="0.00" timeLoss="4.44" rerouteNo="1" devices="tripinfo_car_s2e_221 routing_car_s2e_221" vType="Car" speedFactor="1.01" vaporized=""/>
    <tripinfo id="car_s2w_199" depart="199.00" departLane="s2sep_1" departPos="3.60" departPosLat="0.00" departSpeed="13.90" departDelay="0.00" arrival="370.25" arrivalLane="c2w_1" arrivalPos="990.00" arrivalPosLat="0.00" arrivalSpeed="14.34" duration="171.25" routeLength="1996.47" waitingTime="10.95" waitingCount="1" stopTime="0.00" timeLoss="31.75" rerouteNo="1" devices="tripinfo_car_s2w_199 routing_car_s2w_199" vType="Car" speedFactor="1.03" vaporized=""/>
    <tripinfo id="car_s2e_228" depart="228.00" departLane="s2sep_1" departPos="3.60" departPosLat="0.00" departSpeed="13.90" departDelay="0.00" arrival="375.95" arrivalLane="c2e_1" arrivalPos="990.00" arrivalPosLat="0.00" arrivalSpeed="13.90" duration="147.95" routeLength="1986.69" waitingTime="0.00" waitingCount="0" stopTime="0.00" timeLoss="4.27" rerouteNo="1" devices="tripinfo_car_s2e_228 routing_car_s2e_228" vType="Car" speedFactor="1.00" vaporized=""/>
    <tripinfo id="car_n2w_229" depart="229.00" departLane="n2sep_1" departPos="3.60" departPosLat="0.00" departSpeed="13.90" departDelay="0.00" arrival="376.85" arrivalLane="c2w_1" arrivalPos="990.00" arrivalPosLat="0.00" arrivalSpeed="13.90" duration="147.85" routeLength="1986.69" waitingTime="0.00" waitingCount="0" stopTime="0.00" timeLoss="4.14" rerouteNo="1" devices="tripinfo_car_n2w_229 routing_car_n2w_229" vType="Car" speedFactor="1.00" vaporized=""/>
    <tripinfo id="car_n2e_222" depart="222.00" departLane="n2sep_1" departPos="3.60" departPosLat="0.00" departSpeed="13.90" departDelay="0.00" arrival="378.30" arrivalLane="c2e_1" arrivalPos="990.00" arrivalPosLat="0.00" arrivalSpeed="14.85" duration="156.30" routeLength="1996.47" waitingTime="9.95" waitingCount="1" stopTime="0.00" timeLoss="23.63" rerouteNo="1" devices="tripinfo_car_n2e_222 routing_car_n2e_222" vType="Car" speedFactor="1.09" vaporized=""/>
    <tripinfo id="bus_s2w_199" depart="200.95" departLane="s2sep_1" departPos="12.10" departPosLat="0.00" departSpeed="13.90" departDelay="1.95" arrival="382.85" arrivalLane="c2w_1" arrivalPos="990.00" arrivalPosLat="0.00" arrivalSpeed="13.88" duration="181.90" routeLength="1987.97" waitingTime="16.85" waitingCount="3" stopTime="0.00" timeLoss="38.17" rerouteNo="1" devices="tripinfo_bus_s2w_199 routing_bus_s2w_199" vType="Bus" speedFactor="1.00" vaporized=""/>
    <tripinfo id="car_s2w_203" depart="204.50" departLane="s2sep_1" departPos="3.60" departPosLat="0.00" departSpeed="13.90" departDelay="1.50" arrival="385.30" arrivalLane="c2w_1" arrivalPos="990.00" arrivalPosLat="0.00" arrivalSpeed="15.46" duration="180.80" routeLength="1996.47" waitingTime="13.35" waitingCount="2" stopTime="0.00" timeLoss="55.06" rerouteNo="1" devices="tripinfo_car_s2w_203 routing_car_s2w_203" vType="Car" speedFactor="1.15" vaporized=""/>
    <tripinfo id="car_s2w_208" depart="208.00" departLane="s2sep_1" departPos="3.60" departPosLat="0.00" departSpeed="13.90" departDelay="0.00" arrival="388.25" arrivalLane="c2w_1" arrivalPos="990.00" arrivalPosLat="0.00" arrivalSpeed="14.42" duration="180.25" routeLength="1996.47" waitingTime="11.45" waitingCount="2" stopTime="0.00" timeLoss="41.85" rerouteNo="1" devices="tripinfo_car_s2w_208 routing_car_s2w_208" vType="Car" speedFactor="1.04" vaporized=""/>
    <tripinfo id="car_w2n_247" depart="247.00" departLane="w2sep_1" departPos="3.60" departPosLat="0.00" departSpeed="13.90" departDelay="0.00" arrival="388.25" arrivalLane="c2n_1" arrivalPos="990.00" arrivalPosLat="0.00" arrivalSpeed="14.91" duration="141.25" routeLength="1996.47" waitingTime="0.00" waitingCount="0" stopTime="0.00" timeLoss="6.72" rerouteNo="1" devices="tripinfo_car_w2n_247 routing_car_w2n_247" vType="Car" speedFactor="1.07" vaporized=""/>
    <tripinfo id="car_w2s_216" depart="216.00" departLane="w2sep_1" departPos="3.60" departPosLat="0.00" departSpeed="13.90" departDelay="0.00" arrival="390.05" arrivalLane="c2s_1" arrivalPos="990.00" arrivalPosLat="0.00" arrivalSpeed="14.50" duration="174.05" routeLength="1986.69" waitingTime="27.25" waitingCount="1" stopTime="0.00" timeLoss="36.38" rerouteNo="1" devices="tripinfo_car_w2s_216 routing_car_w2s_216" vType="Car" speedFactor="1.04" vaporized=""/>
    <tripinfo id="car_w2e_209" depart="209.00" departLane="w2sep_1" departPos="3.60" departPosLat="0.00" departSpeed="13.90" departDelay="0.00" arrival="390.35" arrivalLane="c2e_1" arrivalPos="990.00" arrivalPosLat="0.00" arrivalSpeed="14.00" duration="181.35" routeLength="1997.01" waitingTime="31.45" waitingCount="1" stopTime="0.00" timeLoss="38.67" rerouteNo="1" devices="tripinfo_car_w2e_209 routing_car_w2e_209" vType="Car" speedFactor="1.01" vaporized=""/>
    <tripinfo id="car_e2w_227" depart="227.00" departLane="e2sep_1" departPos="3.60" departPosLat="0.00" departSpeed="13.90" departDelay="0.00" arrival="390.80" arrivalLane="c2w_1" arrivalPos="990.00" arrivalPosLat="0.00" arrivalSpeed="14.64" duration="163.80" routeLength="1997.01" waitingTime="16.80" waitingCount="1" stopTime="0.00" timeLoss="28.88" rerouteNo="1" devices="tripinfo_car_e2w_227 routing_car_e2w_227" vType="Car" speedFactor="1.07" vaporized=""/>
    <tripinfo id="car_w2e_224" depart="224.00" departLane="w2sep_1" departPos="3.60" departPosLat="0.00" departSpeed="13.90" departDelay="0.00" arrival="392.50" arrivalLane="c2e_1" arrivalPos="990.00" arrivalPosLat="0.00" arrivalSpeed="15.17" duration="168.50" routeLength="1997.01" waitingTime="24.75" waitingCount="1" stopTime="0.00" timeLoss="40.38" rerouteNo="1" devices="tripinfo_car_w2e_224 routing_car_w2e_224" vType="Car" speedFactor="1.12" vaporized=""/>
    <tripinfo id="car_w2s_227" depart="227.00" departLane="w2sep_1" departPos="3.60" departPosLat="0.00" departSpeed="13.90" departDelay="0.00" arrival="393.30" arrivalLane="c2s_1" arrivalPos="990.00" arrivalPosLat="0.00" arrivalSpeed="15.18" duration="166.30" routeLength="1986.69" waitingTime="21.20" waitingCount="1" stopTime="0.00" timeLoss="35.34" rerouteNo="1" devices="tripinfo_car_w2s_227 routing_car_w2s_227" vType="Car" speedFactor="1.10" vaporized=""/>
    <tripinfo id="car_w2s_248" depart="248.35" departLane="w2sep_1" departPos="3.60" departPosLat="0.00" departSpeed="13.90" departDelay="0.35" arrival="398.85" arrivalLane="c2s_1" arrivalPos="990.00" arrivalPosLat="0.00" arrivalSpeed="14.38" duration="150.50" routeLength="1986.69" waitingTime="0.00" waitingCount="0" stopTime="0.00" timeLoss="11.62" rerouteNo="1" devices="tripinfo_car_w2s_248 routing_car_w2s_248" vType="Car" speedFactor="1.03" vaporized=""/>
    <tripinfo id="car_w2n_266" depart="266.00" departLane="w2sep_1" departPos="3.60" departPosLat="0.00" departSpeed="13.90" departDelay="0.00" arrival="401.55" arrivalLane="c2n_1" arrivalPos="990.00" arrivalPosLat="0.00" arrivalSpeed="15.24" duration="135.55" routeLength="1996.47" waitingTime="0.00" waitingCount="0" stopTime="0.00" timeLoss="3.92" rerouteNo="1" devices="tripinfo_car_w2n_266 routing_car_w2n_266" vType="Car" speedFactor="1.10" vaporized=""/>
    <tripinfo id="car_e2s_201" depart="201.00" departLane="e2sep_1" departPos="3.60" departPosLat="0.00" departSpeed="13.90" departDelay="0.00" arrival="403.60" arrivalLane="c2s_1" arrivalPos="990.00" arrivalPosLat="0.00" arrivalSpeed="14.13" duration="202.60" routeLength="1996.47" waitingTime="48.25" waitingCount="2" stopTime="0.00" timeLoss="60.66" rerouteNo="1" devices="tripinfo_car_e2s_201 routing_car_e2s_201" vType="Car" speedFactor="1.02" vaporized=""/>
    <tripinfo id="car_w2n_271" depart="271.00" departLane="w2sep_1" departPos="3.60" departPosLat="0.00" departSpeed="13.90" departDelay="0.00" arrival="404.05" arrivalLane="c2n_1" arrivalPos="990.00" arrivalPosLat="0.00" arrivalSpeed="16.12" duration="133.05" routeLength="1996.47" waitingTime="0.00" waitingCount="0" stopTime="0.00" timeLoss="10.42" rerouteNo="1" devices="tripinfo_car_w2n_271 routing_car_w2n_271" vType="Car" speedFactor="1.18" vaporized=""/>
    <tripinfo id="car_e2s_202" depart="202.45" departLane="e2sep_1" departPos="3.60" departPosLat="0.00" departSpeed="13.90" departDelay="0.45" arrival="406.90" arrivalLane="c2s_1" arrivalPos="990.00" arrivalPosLat="0.00" arrivalSpeed="14.28" duration="204.45" routeLength="1996.47" waitingTime="44.60" waitingCount="2" stopTime="0.00" timeLoss="64.37" rerouteNo="1" devices="tripinfo_car_e2s_202 routing_car_e2s_202" vType="Car" speedFactor="1.03" vaporized=""/>
    <tripinfo id="car_e2s_208" depart="208.00" departLane="e2sep_1" departPos="3.60" departPosLat="0.00" departSpeed="13.90" departDelay="0.00" arrival="410.70" arrivalLane="c2s_1" arrivalPos="990.00" arrivalPosLat="0.00" arrivalSpeed="13.90" duration="202.70" routeLength="1996.47" waitingTime="38.05" waitingCount="2" stopTime="0.00" timeLoss="58.63" rerouteNo="1" devices="tripinfo_car_e2s_208 routing_car_e2s_208" vType="Car" speedFactor="1.00" vaporized=""/>
    <tripinfo id="car_e2s_211" depart="211.00" departLane="e2sep_1" departPos="3.60" departPosLat="0.00" departSpeed="13.90" departDelay="0.00" arrival="413.70" arrivalLane="c2s_1" arrivalPos="990.00" arrivalPosLat="0.00" arrivalSpeed="14.06" duration="202.70" routeLength="1996.47" waitingTime="35.25" waitingCount="2" stopTime="0.00" timeLoss="60.72" rerouteNo="1" devices="tripinfo_car_e2s_211 routing_car_e2s_211" vType="Car" speedFactor="1.02" vaporized=""/>
    <tripinfo id="amb_w2e_300" depart="301.65" departLane="w2sep_1" departPos="6.60" departPosLat="0.00" departSpeed="13.90" departDelay="1.65" arrival="414.30" arrivalLane="c2e_1" arrivalPos="990.00" arrivalPosLat="-0.95" arrivalSpeed="20.73" duration="112.65" routeLength="1994.01" waitingTime="0.00" waitingCount="0" stopTime="0.00" timeLoss="17.01" rerouteNo="1" devices="tripinfo_amb_w2e_300 routing_amb_w2e_300 bluelight_amb_w2e_300 fcd_amb_w2e_300" vType="Ambulance" speedFactor="1.50" vaporized="">
        <example_device customValue1="0.00" customValue2="-1.00"/>
    </tripinfo>
    <tripinfo id="car_w2e_278" depart="278.00" departLane="w2sep_1" departPos="3.60" departPosLat="0.00" departSpeed="13.90" departDelay="0.00" arrival="414.90" arrivalLane="c2e_1" arrivalPos="990.00" arrivalPosLat="1.10" arrivalSpeed="15.33" duration="136.90" routeLength="1997.01" waitingTime="0.00" waitingCount="0" stopTime="0.00" timeLoss="6.64" rerouteNo="1" devices="tripinfo_car_w2e_278 routing_car_w2e_278" vType="Car@car_w2e_278" speedFactor="1.10" vaporized=""/>
    <tripinfo id="car_e2s_213" depart="213.00" departLane="e2sep_1" departPos="3.60" departPosLat="0.00" departSpeed="13.90" departDelay="0.00" arrival="415.80" arrivalLane="c2s_1" arrivalPos="990.00" arrivalPosLat="0.00" arrivalSpeed="14.77" duration="202.80" routeLength="1996.47" waitingTime="33.85" waitingCount="2" stopTime="0.00" timeLoss="70.61" rerouteNo="1" devices="tripinfo_car_e2s_213 routing_car_e2s_213" vType="Car" speedFactor="1.09" vaporized=""/>
    <tripinfo id="car_e2s_216" depart="216.00" departLane="e2sep_1" departPos="3.60" departPosLat="0.00" departSpeed="13.90" departDelay="0.00" arrival="418.15" arrivalLane="c2s_1" arrivalPos="990.00" arrivalPosLat="0.00" arrivalSpeed="14.48" duration="202.15" routeLength="1996.47" waitingTime="32.35" waitingCount="2" stopTime="0.00" timeLoss="65.59" rerouteNo="1" devices="tripinfo_car_e2s_216 routing_car_e2s_216" vType="Car" speedFactor="1.06" vaporized=""/>
    <tripinfo id="car_w2s_271" depart="272.25" departLane="w2sep_1" departPos="3.60" departPosLat="0.00" departSpeed="13.90" departDelay="1.25" arrival="421.65" arrivalLane="c2s_1" arrivalPos="990.00" arrivalPosLat="0.00" arrivalSpeed="13.93" duration="149.40" routeLength="1986.69" waitingTime="0.00" waitingCount="0" stopTime="0.00" timeLoss="6.33" rerouteNo="1" devices="tripinfo_car_w2s_271 routing_car_w2s_271" vType="Car" speedFactor="1.00" vaporized=""/>
    <tripinfo id="car_w2s_279" depart="279.35" departLane="w2sep_1" departPos="3.60" departPosLat="0.00" departSpeed="13.90" departDelay="0.35" arrival="425.60" arrivalLane="c2s_1" arrivalPos="990.00" arrivalPosLat="0.00" arrivalSpeed="14.32" duration="146.25" routeLength="1986.69" waitingTime="0.00" waitingCount="0" stopTime="0.00" timeLoss="6.97" rerouteNo="1" devices="tripinfo_car_w2s_279 routing_car_w2s_279" vType="Car" speedFactor="1.03" vaporized=""/>
    <tripinfo id="car_w2s_283" depart="283.00" departLane="w2sep_1" departPos="3.60" departPosLat="0.00" departSpeed="13.90" departDelay="0.00" arrival="429.70" arrivalLane="c2s_1" arrivalPos="990.00" arrivalPosLat="0.00" arrivalSpeed="14.33" duration="146.70" routeLength="1986.69" waitingTime="0.00" waitingCount="0" stopTime="0.00" timeLoss="7.54" rerouteNo="1" devices="tripinfo_car_w2s_283 routing_car_w2s_283" vType="Car" speedFactor="1.03" vaporized=""/>
    <tripinfo id="car_e2s_263" depart="263.00" departLane="e2sep_1" departPos="3.60" departPosLat="0.00" departSpeed="13.90" departDelay="0.00" arrival="435.25" arrivalLane="c2s_1" arrivalPos="990.00" arrivalPosLat="0.00" arrivalSpeed="14.02" duration="172.25" routeLength="1996.47" waitingTime="14.25" waitingCount="1" stopTime="0.00" timeLoss="29.21" rerouteNo="1" devices="tripinfo_car_e2s_263 routing_car_e2s_263" vType="Car" speedFactor="1.01" vaporized=""/>
    <tripinfo id="car_e2n_273" depart="273.00" departLane="e2sep_1" departPos="3.60" departPosLat="0.00" departSpeed="13.90" departDelay="0.00" arrival="437.40" arrivalLane="c2n_1" arrivalPos="990.00" arrivalPosLat="0.00" arrivalSpeed="13.90" duration="164.40" routeLength="1986.69" waitingTime="14.15" waitingCount="1" stopTime="0.00" timeLoss="20.70" rerouteNo="1" devices="tripinfo_car_e2n_273 routing_car_e2n_273" vType="Car" speedFactor="1.00" vaporized=""/>
    <tripinfo id="car_e2w_279" depart="279.00" departLane="e2sep_1" departPos="3.60" departPosLat="0.00" departSpeed="13.90" departDelay="0.00" arrival="437.95" arrivalLane="c2w_1" arrivalPos="990.00" arrivalPosLat="0.00" arrivalSpeed="14.23" duration="158.95" routeLength="1997.01" waitingTime="9.80" waitingCount="1" stopTime="0.00" timeLoss="18.55" rerouteNo="1" devices="tripinfo_car_e2w_279 routing_car_e2w_279" vType="Car" speedFactor="1.02" vaporized=""/>
    <tripinfo id="car_n2s_281" depart="281.00" departLane="n2sep_1" departPos="3.60" departPosLat="0.00" departSpeed="13.90" departDelay="0.00" arrival="449.70" arrivalLane="c2s_1" arrivalPos="990.00" arrivalPosLat="0.00" arrivalSpeed="16.02" duration="168.70" routeLength="1997.01" waitingTime="33.45" waitingCount="1" stopTime="0.00" timeLoss="44.04" rerouteNo="1" devices="tripinfo_car_n2s_281 routing_car_n2s_281" vType="Car" speedFactor="1.15" vaporized=""/>
    <tripinfo id="car_s2e_229" depart="229.45" departLane="s2sep_1" departPos="3.60" departPosLat="0.00" departSpeed="13.90" departDelay="0.45" arrival="454.40" arrivalLane="c2e_1" arrivalPos="990.00" arrivalPosLat="0.00" arrivalSpeed="13.90" duration="224.95" routeLength="1986.69" waitingTime="71.55" waitingCount="1" stopTime="0.00" timeLoss="81.25" rerouteNo="1" devices="tripinfo_car_s2e_229 routing_car_s2e_229" vType="Car" speedFactor="1.00" vaporized=""/>
    <tripinfo id="car_n2w_257" depart="257.00" departLane="n2sep_1" departPos="3.60" departPosLat="0.00" departSpeed="13.90" departDelay="0.00" arrival="454.45" arrivalLane="c2w_1" arrivalPos="990.00" arrivalPosLat="0.00" arrivalSpeed="13.90" duration="197.45" routeLength="1986.69" waitingTime="46.70" waitingCount="1" stopTime="0.00" timeLoss="53.76" rerouteNo="1" devices="tripinfo_car_n2w_257 routing_car_n2w_257" vType="Car" speedFactor="1.00" vaporized=""/>
    <tripinfo id="car_s2n_232" depart="232.00" departLane="s2sep_1" departPos="3.60" departPosLat="0.00" departSpeed="13.90" departDelay="0.00" arrival="456.60" arrivalLane="c2n_1" arrivalPos="990.00" arrivalPosLat="0.00" arrivalSpeed="13.90" duration="224.60" routeLength="1997.01" waitingTime="69.30" waitingCount="1" stopTime="0.00" timeLoss="80.91" rerouteNo="1" devices="tripinfo_car_s2n_232 routing_car_s2n_232" vType="Car" speedFactor="1.00" vaporized=""/>
    <tripinfo id="car_n2w_263" depart="263.00" departLane="n2sep_1" departPos="3.60" departPosLat="0.00" departSpeed="13.90" departDelay="0.00" arrival="456.70" arrivalLane="c2w_1" arrivalPos="990.00" arrivalPosLat="0.00" arrivalSpeed="14.95" duration="193.70" routeLength="1986.69" waitingTime="45.50" waitingCount="1" stopTime="0.00" timeLoss="62.92" rerouteNo="1" devices="tripinfo_car_n2w_263 routing_car_n2w_263" vType="Car" speedFactor="1.10" vaporized=""/>
    <tripinfo id="car_n2w_317" depart="317.00" departLane="n2sep_1" departPos="3.60" departPosLat="0.00" departSpeed="13.90" departDelay="0.00" arrival="459.15" arrivalLane="c2w_1" arrivalPos="990.00" arrivalPosLat="0.00" arrivalSpeed="15.26" duration="142.15" routeLength="1986.69" waitingTime="0.00" waitingCount="0" stopTime="0.00" timeLoss="13.19" rerouteNo="1" devices="tripinfo_car_n2w_317 routing_car_n2w_317" vType="Car" speedFactor="1.11" vaporized=""/>
    <tripinfo id="car_s2n_247" depart="247.00" departLane="s2sep_1" departPos="3.60" departPosLat="0.00" departSpeed="13.90" departDelay="0.00" arrival="460.45" arrivalLane="c2n_1" arrivalPos="990.00" arrivalPosLat="0.00" arrivalSpeed="14.07" duration="213.45" routeLength="1997.01" waitingTime="59.65" waitingCount="1" stopTime="0.00" timeLoss="71.73" rerouteNo="1" devices="tripinfo_car_s2n_247 routing_car_s2n_247" vType="Car" speedFactor="1.01" vaporized=""/>
    <tripinfo id="car_s2n_248" depart="248.45" departLane="s2sep_1" departPos="3.60" departPosLat="0.00" departSpeed="13.90" departDelay="0.45" arrival="462.90" arrivalLane="c2n_1" arrivalPos="990.00" arrivalPosLat="0.00" arrivalSpeed="14.61" duration="214.45" routeLength="1997.01" waitingTime="58.45" waitingCount="1" stopTime="0.00" timeLoss="79.52" rerouteNo="1" devices="tripinfo_car_s2n_248 routing_car_s2n_248" vType="Car" speedFactor="1.06" vaporized=""/>
    <tripinfo id="car_s2e_261" depart="262.25" departLane="s2sep_1" departPos="3.60" departPosLat="0.00" departSpeed="13.90" departDelay="1.25" arrival="464.20" arrivalLane="c2e_1" arrivalPos="990.00" arrivalPosLat="0.00" arrivalSpeed="14.13" duration="201.95" routeLength="1986.69" waitingTime="47.65" waitingCount="1" stopTime="0.00" timeLoss="60.66" rerouteNo="1" devices="tripinfo_car_s2e_261 routing_car_s2e_261" vType="Car" speedFactor="1.02" vaporized=""/>
    <tripinfo id="car_s2n_261" depart="261.00" departLane="s2sep_1" departPos="3.60" departPosLat="0.00" departSpeed="13.90" departDelay="0.00" arrival="464.75" arrivalLane="c2n_1" arrivalPos="990.00" arrivalPosLat="0.00" arrivalSpeed="15.46" duration="203.75" routeLength="1997.01" waitingTime="56.45" waitingCount="1" stopTime="0.00" timeLoss="80.84" rerouteNo="1" devices="tripinfo_car_s2n_261 routing_car_s2n_261" vType="Car" speedFactor="1.17" vaporized=""/>
    <tripinfo id="car_s2e_271" depart="271.00" departLane="s2sep_1" departPos="3.60" departPosLat="0.00" departSpeed="13.90" departDelay="0.00" arrival="469.10" arrivalLane="c2e_1" arrivalPos="990.00" arrivalPosLat="0.00" arrivalSpeed="13.94" duration="198.10" routeLength="1986.69" waitingTime="40.00" waitingCount="1" stopTime="0.00" timeLoss="54.90" rerouteNo="1" devices="tripinfo_car_s2e_271 routing_car_s2e_271" vType="Car" speedFactor="1.00" vaporized=""/>
    <tripinfo id="car_s2e_272" depart="272.45" departLane="s2sep_1" departPos="3.60" departPosLat="0.00" departSpeed="13.90" departDelay="0.45" arrival="471.55" arrivalLane="c2e_1" arrivalPos="990.00" arrivalPosLat="0.00" arrivalSpeed="14.67" duration="199.10" routeLength="1986.69" waitingTime="39.10" waitingCount="1" stopTime="0.00" timeLoss="64.92" rerouteNo="1" devices="tripinfo_car_s2e_272 routing_car_s2e_272" vType="Car" speedFactor="1.07" vaporized=""/>
    <tripinfo id="car_s2n_283" depart="283.45" departLane="s2sep_1" departPos="3.60" departPosLat="0.00" departSpeed="13.90" departDelay="0.45" arrival="471.95" arrivalLane="c2n_1" arrivalPos="990.00" arrivalPosLat="0.00" arrivalSpeed="13.90" duration="188.50" routeLength="1997.01" waitingTime="27.45" waitingCount="1" stopTime="0.00" timeLoss="44.82" rerouteNo="1" devices="tripinfo_car_s2n_283 routing_car_s2n_283" vType="Car" speedFactor="1.00" vaporized=""/>
    <tripinfo id="bus_n2w_324" depart="324.00" departLane="n2sep_1" departPos="12.10" departPosLat="0.00" departSpeed="13.90" departDelay="0.00" arrival="473.25" arrivalLane="c2w_1" arrivalPos="990.00" arrivalPosLat="0.00" arrivalSpeed="13.90" duration="149.25" routeLength="1978.19" waitingTime="0.00" waitingCount="0" stopTime="0.00" timeLoss="6.19" rerouteNo="1" devices="tripinfo_bus_n2w_324 routing_bus_n2w_324" vType="Bus" speedFactor="1.00" vaporized=""/>
    <tripinfo id="car_s2e_294" depart="294.00" departLane="s2sep_1" departPos="3.60" departPosLat="0.00" departSpeed="13.90" departDelay="0.00" arrival="473.50" arrivalLane="c2e_1" arrivalPos="990.00" arrivalPosLat="0.00" arrivalSpeed="15.29" duration="179.50" routeLength="1986.69" waitingTime="26.80" waitingCount="1" stopTime="0.00" timeLoss="53.73" rerouteNo="1" devices="tripinfo_car_s2e_294 routing_car_s2e_294" vType="Car" speedFactor="1.14" vaporized=""/>
    <tripinfo id="car_s2e_295" depart="295.25" departLane="s2sep_1" departPos="3.60" departPosLat="0.00" departSpeed="13.90" departDelay="0.25" arrival="476.60" arrivalLane="c2e_1" arrivalPos="990.00" arrivalPosLat="0.00" arrivalSpeed="14.36" duration="181.35" routeLength="1986.69" waitingTime="22.30" waitingCount="1" stopTime="0.00" timeLoss="42.85" rerouteNo="1" devices="tripinfo_car_s2e_295 routing_car_s2e_295" vType="Car" speedFactor="1.04" vaporized=""/>
</tripinfos>
