<?xml version="1.0" encoding="UTF-8"?>

<!-- generated on Sat Apr 24 18:15:19 2021 by Eclipse SUMO Version 1.4.0
<configuration xmlns:xsi="http://www.w3.org/2001/XMLSchema-instance" xsi:noNamespaceSchemaLocation="http://sumo.dlr.de/xsd/sumoConfiguration.xsd">

    <input>
        <net-file value="sumofiles/junction.net.xml"/>
        <route-files value="sumofiles/junction_preemption_79.rou.xml"/>
        <additional-files value="sumofiles/junction.det.xml"/>
    </input>

    <output>
        <tripinfo-output value="sumofiles/output/tripinfo_preemption_79.xml"/>
    </output>

    <time>
        <begin value="0"/>
        <end value="10000"/>
        <step-length value="0.05"/>
    </time>

    <processing>
        <lateral-resolution value="0.1"/>
    </processing>

    <report>
        <no-warnings value="true"/>
        <error-log value="sumofiles/output/errorlog_preemption_79.log"/>
        <no-step-log value="true"/>
    </report>

    <traci_server>
        <remote-port value="35891"/>
    </traci_server>

    <gui_only>
        <gui-settings-file value="sumofiles/junction-gui.settings.xml"/>
        <tracker-interval value="0.05"/>
    </gui_only>

</configuration>
-->

<tripinfos xmlns:xsi="http://www.w3.org/2001/XMLSchema-instance" xsi:noNamespaceSchemaLocation="http://sumo.dlr.de/xsd/tripinfo_file.xsd">
    <tripinfo id="car_s2e_3" depart="3.00" departLane="s2sep_1" departPos="3.60" departPosLat="0.00" departSpeed="13.90" departDelay="0.00" arrival="161.70" arrivalLane="c2e_1" arrivalPos="990.00" arrivalPosLat="0.00" arrivalSpeed="14.73" duration="158.70" routeLength="1986.69" waitingTime="15.75" waitingCount="1" stopTime="0.00" timeLoss="23.14" rerouteNo="1" devices="tripinfo_car_s2e_3 routing_car_s2e_3" vType="Car" speedFactor="1.06" vaporized=""/>
    <tripinfo id="car_n2s_2" depart="2.00" departLane="n2sep_1" departPos="3.60" departPosLat="0.00" departSpeed="13.90" departDelay="0.00" arrival="161.75" arrivalLane="c2s_1" arrivalPos="990.00" arrivalPosLat="0.00" arrivalSpeed="14.73" duration="159.75" routeLength="1997.01" waitingTime="16.75" waitingCount="1" stopTime="0.00" timeLoss="24.20" rerouteNo="1" devices="tripinfo_car_n2s_2 routing_car_n2s_2" vType="Car" speedFactor="1.06" vaporized=""/>
    <tripinfo id="car_s2e_21" depart="21.00" departLane="s2sep_1" departPos="3.60" departPosLat="0.00" departSpeed="13.90" departDelay="0.00" arrival="165.30" arrivalLane="c2e_1" arrivalPos="990.00" arrivalPosLat="0.00" arrivalSpeed="15.01" duration="144.30" routeLength="1986.69" waitingTime="0.00" waitingCount="0" stopTime="0.00" timeLoss="11.58" rerouteNo="1" devices="tripinfo_car_s2e_21 routing_car_s2e_21" vType="Car" speedFactor="1.08" vaporized=""/>
    <tripinfo id="car_s2n_33" depart="33.00" departLane="s2sep_1" departPos="3.60" departPosLat="0.00" departSpeed="13.90" departDelay="0.00" arrival="174.30" arrivalLane="c2n_1" arrivalPos="990.00" arrivalPosLat="0.00" arrivalSpeed="14.54" duration="141.30" routeLength="1997.01" waitingTime="0.00" waitingCount="0" stopTime="0.00" timeLoss="3.93" rerouteNo="1" devices="tripinfo_car_s2n_33 routing_car_s2n_33" vType="Car" speedFactor="1.05" vaporized=""/>
    <tripinfo id="car_s2e_37" depart="37.00" departLane="s2sep_1" departPos="3.60" departPosLat="0.00" departSpeed="13.90" departDelay="0.00" arrival="178.05" arrivalLane="c2e_1" arrivalPos="990.00" arrivalPosLat="0.00" arrivalSpeed="15.05" duration="141.05" routeLength="1986.69" waitingTime="0.00" waitingCount="0" stopTime="0.00" timeLoss="8.36" rerouteNo="1" devices="tripinfo_car_s2e_37 routing_car_s2e_37" vType="Car" speedFactor="1.08" vaporized=""/>
    <tripinfo id="car_s2w_31" depart="31.00" departLane="s2sep_1" departPos="3.60" departPosLat="0.00" departSpeed="13.90" departDelay="0.00" arrival="178.70" arrivalLane="c2w_1" arrivalPos="990.00" arrivalPosLat="0.00" arrivalSpeed="13.90" duration="147.70" routeLength="1996.47" waitingTime="0.00" waitingCount="0" stopTime="0.00" timeLoss="3.38" rerouteNo="1" devices="tripinfo_car_s2w_31 routing_car_s2w_31" vType="Car" speedFactor="1.00" vaporized=""/>
    <tripinfo id="car_e2w_18" depart="18.00" departLane="e2sep_1" departPos="3.60" departPosLat="0.00" departSpeed="13.90" departDelay="0.00" arrival="210.00" arrivalLane="c2w_1" arrivalPos="990.00" arrivalPosLat="0.00" arrivalSpeed="14.04" duration="192.00" routeLength="1997.01" waitingTime="42.80" waitingCount="1" stopTime="0.00" timeLoss="49.78" rerouteNo="1" devices="tripinfo_car_e2w_18 routing_car_e2w_18" vType="Car" speedFactor="1.01" vaporized=""/>
    <tripinfo id="car_e2n_28" depart="28.00" departLane="e2sep_1" departPos="3.60" departPosLat="0.00" departSpeed="13.90" departDelay="0.00" arrival="210.85" arrivalLane="c2n_1" arrivalPos="990.00" arrivalPosLat="0.00" arrivalSpeed="14.32" duration="182.85" routeLength="1986.69" waitingTime="34.70" waitingCount="1" stopTime="0.00" timeLoss="43.44" rerouteNo="1" devices="tripinfo_car_e2n_28 routing_car_e2n_28" vType="Car" speedFactor="1.03" vaporized=""/>
    <tripinfo id="car_w2e_68" depart="68.00" departLane="w2sep_1" departPos="3.60" departPosLat="0.00" departSpeed="13.90" departDelay="0.00" arrival="212.20" arrivalLane="c2e_1" arrivalPos="990.00" arrivalPosLat="0.00" arrivalSpeed="13.90" duration="144.20" routeLength="1997.01" waitingTime="0.00" waitingCount="0" stopTime="0.00" timeLoss="0.52" rerouteNo="1" devices="tripinfo_car_w2e_68 routing_car_w2e_68" vType="Car" speedFactor="1.00" vaporized=""/>
    <tripinfo id="car_w2e_80" depart="80.00" departLane="w2sep_1" departPos="3.60" departPosLat="0.00" departSpeed="13.90" departDelay="0.00" arrival="216.00" arrivalLane="c2e_1" arrivalPos="990.00" arrivalPosLat="0.00" arrivalSpeed="15.13" duration="136.00" routeLength="1997.01" waitingTime="0.00" waitingCount="0" stopTime="0.00" timeLoss="4.26" rerouteNo="1" devices="tripinfo_car_w2e_80 routing_car_w2e_80" vType="Car" speedFactor="1.09" vaporized=""/>
    <tripinfo id="car_e2n_35" depart="35.00" departLane="e2sep_1" departPos="3.60" departPosLat="0.00" departSpeed="13.90" departDelay="0.00" arrival="216.25" arrivalLane="c2n_1" arrivalPos="990.00" arrivalPosLat="0.00" arrivalSpeed="14.04" duration="181.25" routeLength="1986.69" waitingTime="27.50" waitingCount="1" stopTime="0.00" timeLoss="39.04" rerouteNo="1" devices="tripinfo_car_e2n_35 routing_car_e2n_35" vType="Car" speedFactor="1.01" vaporized=""/>
    <tripinfo id="car_w2s_69" depart="69.45" departLane="w2sep_1" departPos="3.60" departPosLat="0.00" departSpeed="13.90" departDelay="0.45" arrival="219.45" arrivalLane="c2s_1" arrivalPos="990.00" arrivalPosLat="0.00" arrivalSpeed="13.90" duration="150.00" routeLength="1986.69" waitingTime="0.00" waitingCount="0" stopTime="0.00" timeLoss="6.34" rerouteNo="1" devices="tripinfo_car_w2s_69 routing_car_w2s_69" vType="Car" speedFactor="1.00" vaporized=""/>
    <tripinfo id="car_w2n_45" depart="45.00" departLane="w2sep_1" departPos="3.60" departPosLat="0.00" departSpeed="13.90" departDelay="0.00" arrival="219.70" arrivalLane="c2n_1" arrivalPos="990.00" arrivalPosLat="0.00" arrivalSpeed="14.23" duration="174.70" routeLength="1996.47" waitingTime="20.20" waitingCount="2" stopTime="0.00" timeLoss="34.05" rerouteNo="1" devices="tripinfo_car_w2n_45 routing_car_w2n_45" vType="Car" speedFactor="1.03" vaporized=""/>
    <tripinfo id="car_w2n_93" depart="93.00" departLane="w2sep_1" departPos="3.60" departPosLat="0.00" departSpeed="13.90" departDelay="0.00" arrival="221.90" arrivalLane="c2n_1" arrivalPos="990.00" arrivalPosLat="0.00" arrivalSpeed="15.93" duration="128.90" routeLength="1996.47" waitingTime="0.00" waitingCount="0" stopTime="0.00" timeLoss="6.42" rerouteNo="1" devices="tripinfo_car_w2n_93 routing_car_w2n_93" vType="Car" speedFactor="1.18" vaporized=""/>
    <tripinfo id="car_e2s_42" depart="42.00" departLane="e2sep_1" departPos="3.60" departPosLat="0.00" departSpeed="13.90" departDelay="0.00" arrival="223.50" arrivalLane="c2s_1" arrivalPos="990.00" arrivalPosLat="0.00" arrivalSpeed="14.30" duration="181.50" routeLength="1996.47" waitingTime="28.40" waitingCount="2" stopTime="0.00" timeLoss="41.40" rerouteNo="1" devices="tripinfo_car_e2s_42 routing_car_e2s_42" vType="Car" speedFactor="1.03" vaporized=""/>
    <tripinfo id="car_e2s_44" depart="44.00" departLane="e2sep_1" departPos="3.60" departPosLat="0.00" departSpeed="13.90" departDelay="0.00" arrival="225.90" arrivalLane="c2s_1" arrivalPos="990.00" arrivalPosLat="0.00" arrivalSpeed="14.93" duration="181.90" routeLength="1996.47" waitingTime="26.05" waitingCount="2" stopTime="0.00" timeLoss="49.59" rerouteNo="1" devices="tripinfo_car_e2s_44 routing_car_e2s_44" vType="Car" speedFactor="1.09" vaporized=""/>
    <tripinfo id="car_e2s_56" depart="56.00" departLane="e2sep_1" departPos="3.60" departPosLat="0.00" departSpeed="13.90" departDelay="0.00" arrival="228.10" arrivalLane="c2s_1" arrivalPos="990.00" arrivalPosLat="0.00" arrivalSpeed="15.26" duration="172.10" routeLength="1996.47" waitingTime="18.70" waitingCount="2" stopTime="0.00" timeLoss="43.57" rerouteNo="1" devices="tripinfo_car_e2s_56 routing_car_e2s_56" vType="Car" speedFactor="1.12" vaporized=""/>
    <tripinfo id="car_e2s_62" depart="62.00" departLane="e2sep_1" departPos="3.60" departPosLat="0.00" departSpeed="13.90" departDelay="0.00" arrival="231.35" arrivalLane="c2s_1" arrivalPos="990.00" arrivalPosLat="0.00" arrivalSpeed="14.49" duration="169.35" routeLength="1996.47" waitingTime="8.85" waitingCount="2" stopTime="0.00" timeLoss="31.35" rerouteNo="1" devices="tripinfo_car_e2s_62 routing_car_e2s_62" vType="Car" speedFactor="1.05" vaporized=""/>
    <tripinfo id="car_e2s_86" depart="86.00" departLane="e2sep_1" departPos="3.60" departPosLat="0.00" departSpeed="13.90" departDelay="0.00" arrival="236.00" arrivalLane="c2s_1" arrivalPos="990.00" arrivalPosLat="0.00" arrivalSpeed="13.89" duration="150.00" routeLength="1996.47" waitingTime="0.00" waitingCount="0" stopTime="0.00" timeLoss="5.65" rerouteNo="1" devices="tripinfo_car_e2s_86 routing_car_e2s_86" vType="Car" speedFactor="1.00" vaporized=""/>
    <tripinfo id="bus_e2w_92" depart="92.00" departLane="e2sep_1" departPos="12.10" departPosLat="0.00" departSpeed="13.90" departDelay="0.00" arrival="236.60" arrivalLane="c2w_1" arrivalPos="990.00" arrivalPosLat="0.00" arrivalSpeed="13.90" duration="144.60" routeLength="1988.51" waitingTime="0.00" waitingCount="0" stopTime="0.00" timeLoss="1.50" rerouteNo="1" devices="tripinfo_bus_e2w_92 routing_bus_e2w_92" vType="Bus" speedFactor="1.00" vaporized=""/>
    <tripinfo id="car_e2s_87" depart="87.45" departLane="e2sep_1" departPos="3.60" departPosLat="0.00" departSpeed="13.90" departDelay="0.45" arrival="237.95" arrivalLane="c2s_1" arrivalPos="990.00" arrivalPosLat="0.00" arrivalSpeed="15.12" duration="150.50" routeLength="1996.47" waitingTime="0.00" waitingCount="0" stopTime="0.00" timeLoss="22.98" rerouteNo="1" devices="tripinfo_car_e2s_87 routing_car_e2s_87" vType="Car" speedFactor="1.13" vaporized=""/>
    <tripinfo id="car_e2w_95" depart="95.00" departLane="e2sep_1" departPos="3.60" departPosLat="0.00" departSpeed="13.90" departDelay="0.00" arrival="239.05" arrivalLane="c2w_1" arrivalPos="990.00" arrivalPosLat="0.00" arrivalSpeed="15.54" duration="144.05" routeLength="1997.01" waitingTime="0.00" waitingCount="0" stopTime="0.00" timeLoss="19.58" rerouteNo="1" devices="tripinfo_car_e2w_95 routing_car_e2w_95" vType="Car" speedFactor="1.15" vaporized=""/>
    <tripinfo id="car_e2s_102" depart="102.00" departLane="e2sep_1" departPos="3.60" departPosLat="0.00" departSpeed="13.90" departDelay="0.00" arrival="239.80" arrivalLane="c2s_1" arrivalPos="990.00" arrivalPosLat="0.00" arrivalSpeed="15.51" duration="137.80" routeLength="1996.47" waitingTime="0.00" waitingCount="0" stopTime="0.00" timeLoss="14.63" rerouteNo="1" devices="tripinfo_car_e2s_102 routing_car_e2s_102" vType="Car" speedFactor="1.17" vaporized=""/>
    <tripinfo id="car_n2s_118" depart="118.00" departLane="n2sep_1" departPos="3.60" departPosLat="0.00" departSpeed="13.90" departDelay="0.00" arrival="248.15" arrivalLane="c2s_1" arrivalPos="990.00" arrivalPosLat="0.00" arrivalSpeed="16.10" duration="130.15" routeLength="1997.01" waitingTime="0.00" waitingCount="0" stopTime="0.00" timeLoss="6.08" rerouteNo="1" devices="tripinfo_car_n2s_118 routing_car_n2s_118" vType="Car" speedFactor="1.16" vaporized=""/>
    <tripinfo id="car_w2n_103" depart="103.00" departLane="w2sep_1" departPos="3.60" departPosLat="0.00" departSpeed="13.90" departDelay="0.00" arrival="250.60" arrivalLane="c2n_1" arrivalPos="990.00" arrivalPosLat="0.00" arrivalSpeed="13.90" duration="147.60" routeLength="1996.47" waitingTime="0.00" waitingCount="0" stopTime="0.00" timeLoss="3.24" rerouteNo="1" devices="tripinfo_car_w2n_103 routing_car_w2n_103" vType="Car" speedFactor="1.00" vaporized=""/>
    <tripinfo id="car_s2e_55" depart="55.00" departLane="s2sep_1" departPos="3.60" departPosLat="0.00" departSpeed="13.90" departDelay="0.00" arrival="252.50" arrivalLane="c2e_1" arrivalPos="990.00" arrivalPosLat="0.00" arrivalSpeed="14.55" duration="197.50" routeLength="1986.69" waitingTime="53.30" waitingCount="1" stopTime="0.00" timeLoss="60.28" rerouteNo="1" devices="tripinfo_car_s2e_55 routing_car_s2e_55" vType="Car" speedFactor="1.05" vaporized=""/>
    <tripinfo id="car_n2w_92" depart="92.00" departLane="n2sep_1" departPos="3.60" departPosLat="0.00" departSpeed="13.90" departDelay="0.00" arrival="255.70" arrivalLane="c2w_1" arrivalPos="990.00" arrivalPosLat="0.00" arrivalSpeed="13.90" duration="163.70" routeLength="1986.69" waitingTime="12.85" waitingCount="1" stopTime="0.00" timeLoss="20.01" rerouteNo="1" devices="tripinfo_car_n2w_92 routing_car_n2w_92" vType="Car" speedFactor="1.00" vaporized=""/>
    <tripinfo id="car_s2e_110" depart="110.00" departLane="s2sep_1" departPos="3.60" departPosLat="0.00" departSpeed="13.90" departDelay="0.00" arrival="258.10" arrivalLane="c2e_1" arrivalPos="990.00" arrivalPosLat="0.00" arrivalSpeed="16.39" duration="148.10" routeLength="1986.69" waitingTime="2.75" waitingCount="1" stopTime="0.00" timeLoss="26.29" rerouteNo="1" devices="tripinfo_car_s2e_110 routing_car_s2e_110" vType="Car" speedFactor="1.18" vaporized=""/>
    <tripinfo id="car_s2n_58" depart="58.00" departLane="s2sep_1" departPos="3.60" departPosLat="0.00" departSpeed="13.90" departDelay="0.00" arrival="258.20" arrivalLane="c2n_1" arrivalPos="990.00" arrivalPosLat="0.00" arrivalSpeed="13.90" duration="200.20" routeLength="1997.01" waitingTime="47.30" waitingCount="1" stopTime="0.00" timeLoss="56.52" rerouteNo="1" devices="tripinfo_car_s2n_58 routing_car_s2n_58" vType="Car" speedFactor="1.00" vaporized=""/>
    <tripinfo id="car_s2w_77" depart="77.00" departLane="s2sep_1" departPos="3.60" departPosLat="0.00" departSpeed="13.90" departDelay="0.00" arrival="260.25" arrivalLane="c2w_1" arrivalPos="990.00" arrivalPosLat="0.00" arrivalSpeed="14.14" duration="183.25" routeLength="1996.47" waitingTime="29.35" waitingCount="2" stopTime="0.00" timeLoss="41.51" rerouteNo="1" devices="tripinfo_car_s2w_77 routing_car_s2w_77" vType="Car" speedFactor="1.02" vaporized=""/>
    <tripinfo id="car_s2n_78" depart="78.45" departLane="s2sep_1" departPos="3.60" departPosLat="0.00" departSpeed="13.90" departDelay="0.45" arrival="262.00" arrivalLane="c2n_1" arrivalPos="990.00" arrivalPosLat="0.00" arrivalSpeed="14.02" duration="183.55" routeLength="1997.01" waitingTime="26.90" waitingCount="1" stopTime="0.00" timeLoss="41.33" rerouteNo="1" devices="tripinfo_car_s2n_78 routing_car_s2n_78" vType="Car" speedFactor="1.01" vaporized=""/>
    <tripinfo id="car_s2w_81" depart="81.00" departLane="s2sep_1" departPos="3.60" departPosLat="0.00" departSpeed="13.90" departDelay="0.00" arrival="263.25" arrivalLane="c2w_1" arrivalPos="990.00" arrivalPosLat="0.00" arrivalSpeed="14.48" duration="182.25" routeLength="1996.47" waitingTime="23.20" waitingCount="1" stopTime="0.00" timeLoss="44.42" rerouteNo="1" devices="tripinfo_car_s2w_81 routing_car_s2w_81" vType="Car" speedFactor="1.05" vaporized=""/>
    <tripinfo id="car_s2n_83" depart="83.00" departLane="s2sep_1" departPos="3.60" departPosLat="0.00" departSpeed="13.90" departDelay="0.00" arrival="265.60" arrivalLane="c2n_1" arrivalPos="990.00" arrivalPosLat="0.00" arrivalSpeed="13.87" duration="182.60" routeLength="1997.01" waitingTime="21.95" waitingCount="1" stopTime="0.00" timeLoss="38.94" rerouteNo="1" devices="tripinfo_car_s2n_83 routing_car_s2n_83" vType="Car" speedFactor="1.00" vaporized=""/>
    <tripinfo id="car_s2w_98" depart="98.00" departLane="s2sep_1" departPos="3.60" departPosLat="0.00" departSpeed="13.90" departDelay="0.00" arrival="267.25" arrivalLane="c2w_1" arrivalPos="990.00" arrivalPosLat="0.00" arrivalSpeed="13.96" duration="169.25" routeLength="1996.47" waitingTime="9.30" waitingCount="1" stopTime="0.00" timeLoss="25.64" rerouteNo="1" devices="tripinfo_car_s2w_98 routing_car_s2w_98" vType="Car" speedFactor="1.01" vaporized=""/>
    <tripinfo id="car_s2n_104" depart="104.00" departLane="s2sep_1" departPos="3.60" departPosLat="0.00" departSpeed="13.90" departDelay="0.00" arrival="268.45" arrivalLane="c2n_1" arrivalPos="990.00" arrivalPosLat="0.00" arrivalSpeed="14.08" duration="164.45" routeLength="1997.01" waitingTime="6.30" waitingCount="1" stopTime="0.00" timeLoss="23.52" rerouteNo="1" devices="tripinfo_car_s2n_104 routing_car_s2n_104" vType="Car" speedFactor="1.02" vaporized=""/>
    <tripinfo id="car_s2n_105" depart="105.45" departLane="s2sep_1" departPos="3.60" departPosLat="0.00" departSpeed="13.90" departDelay="0.45" arrival="271.45" arrivalLane="c2n_1" arrivalPos="990.00" arrivalPosLat="0.00" arrivalSpeed="13.84" duration="166.00" routeLength="1997.01" waitingTime="3.30" waitingCount="1" stopTime="0.00" timeLoss="22.33" rerouteNo="1" devices="tripinfo_car_s2n_105 routing_car_s2n_105" vType="Car" speedFactor="1.00" vaporized=""/>
    <tripinfo id="car_s2w_125" depart="125.40" departLane="s2sep_1" departPos="3.60" departPosLat="0.00" departSpeed="13.90" departDelay="0.40" arrival="271.55" arrivalLane="c2w_1" arrivalPos="990.00" arrivalPosLat="0.00" arrivalSpeed="14.49" duration="146.15" routeLength="1996.47" waitingTime="0.00" waitingCount="0" stopTime="0.00" timeLoss="7.85" rerouteNo="1" devices="tripinfo_car_s2w_125 routing_car_s2w_125" vType="Car" speedFactor="1.04" vaporized=""/>
    <tripinfo id="car_s2n_119" depart="119.00" departLane="s2sep_1" departPos="3.60" departPosLat="0.00" departSpeed="13.90" departDelay="0.00" arrival="274.05" arrivalLane="c2n_1" arrivalPos="990.00" arrivalPosLat="0.00" arrivalSpeed="14.02" duration="155.05" routeLength="1997.01" waitingTime="0.00" waitingCount="0" stopTime="0.00" timeLoss="13.93" rerouteNo="1" devices="tripinfo_car_s2n_119 routing_car_s2n_119" vType="Car" speedFactor="1.02" vaporized=""/>
    <tripinfo id="car_s2w_128" depart="128.00" departLane="s2sep_1" departPos="3.60" departPosLat="0.00" departSpeed="13.90" departDelay="0.00" arrival="274.30" arrivalLane="c2w_1" arrivalPos="990.00" arrivalPosLat="0.00" arrivalSpeed="14.99" duration="146.30" routeLength="1996.47" waitingTime="0.00" waitingCount="0" stopTime="0.00" timeLoss="13.65" rerouteNo="1" devices="tripinfo_car_s2w_128 routing_car_s2w_128" vType="Car" speedFactor="1.09" vaporized=""/>
    <tripinfo id="car_n2e_67" depart="67.00" departLane="n2sep_1" departPos="3.60" departPosLat="0.00" departSpeed="13.90" departDelay="0.00" arrival="274.55" arrivalLane="c2e_1" arrivalPos="990.00" arrivalPosLat="0.00" arrivalSpeed="13.90" duration="207.55" routeLength="1996.47" waitingTime="52.60" waitingCount="2" stopTime="0.00" timeLoss="63.23" rerouteNo="1" devices="tripinfo_car_n2e_67 routing_car_n2e_67" vType="Car" speedFactor="1.00" vaporized=""/>
    <tripinfo id="car_s2n_124" depart="124.00" departLane="s2sep_1" departPos="3.60" departPosLat="0.00" departSpeed="13.90" departDelay="0.00" arrival="276.40" arrivalLane="c2n_1" arrivalPos="990.00" arrivalPosLat="0.00" arrivalSpeed="14.20" duration="152.40" routeLength="1997.01" waitingTime="0.00" waitingCount="0" stopTime="0.00" timeLoss="13.94" rerouteNo="1" devices="tripinfo_car_s2n_124 routing_car_s2n_124" vType="Car" speedFactor="1.04" vaporized=""/>
    <tripinfo id="car_n2e_73" depart="73.00" departLane="n2sep_1" departPos="3.60" departPosLat="0.00" departSpeed="13.90" departDelay="0.00" arrival="276.50" arrivalLane="c2e_1" arrivalPos="990.00" arrivalPosLat="0.00" arrivalSpeed="15.41" duration="203.50" routeLength="1996.47" waitingTime="52.35" waitingCount="3" stopTime="0.00" timeLoss="78.88" rerouteNo="1" devices="tripinfo_car_n2e_73 routing_car_n2e_73" vType="Car" speedFactor="1.16" vaporized=""/>
    <tripinfo id="car_s2n_133" depart="133.00" departLane="s2sep_1" departPos="3.60" departPosLat="0.00" departSpeed="13.90" departDelay="0.00" arrival="279.80" arrivalLane="c2n_1" arrivalPos="990.00" arrivalPosLat="0.00" arrivalSpeed="13.86" duration="146.80" routeLength="1997.01" waitingTime="0.00" waitingCount="0" stopTime="0.00" timeLoss="3.12" rerouteNo="1" devices="tripinfo_car_s2n_133 routing_car_s2n_133" vType="Car" speedFactor="1.00" vaporized=""/>
    <tripinfo id="car_n2e_80" depart="80.00" departLane="n2sep_1" departPos="3.60" departPosLat="0.00" departSpeed="13.90" departDelay="0.00" arrival="282.65" arrivalLane="c2e_1" arrivalPos="990.00" arrivalPosLat="0.00" arrivalSpeed="14.26" duration="202.65" routeLength="1996.47" waitingTime="40.30" waitingCount="3" stopTime="0.00" timeLoss="62.00" rerouteNo="1" devices="tripinfo_car_n2e_80 routing_car_n2e_80" vType="Car" speedFactor="1.03" vaporized=""/>
    <tripinfo id="car_n2e_83" depart="83.00" departLane="n2sep_1" departPos="3.60" departPosLat="0.00" departSpeed="13.90" departDelay="0.00" arrival="284.85" arrivalLane="c2e_1" arrivalPos="990.00" arrivalPosLat="0.00" arrivalSpeed="15.25" duration="201.85" routeLength="1996.47" waitingTime="38.20" waitingCount="2" stopTime="0.00" timeLoss="73.33" rerouteNo="1" devices="tripinfo_car_n2e_83 routing_car_n2e_83" vType="Car" speedFactor="1.12" vaporized=""/>
    <tripinfo id="car_s2w_134" depart="134.50" departLane="s2sep_1" departPos="3.60" departPosLat="0.00" departSpeed="13.90" departDelay="0.50" arrival="285.50" arrivalLane="c2w_1" arrivalPos="990.00" arrivalPosLat="0.00" arrivalSpeed="13.90" duration="151.00" routeLength="1996.47" waitingTime="0.00" waitingCount="0" stopTime="0.00" timeLoss="6.68" rerouteNo="1" devices="tripinfo_car_s2w_134 routing_car_s2w_134" vType="Car" speedFactor="1.00" vaporized=""/>
    <tripinfo id="car_n2e_132" depart="132.00" departLane="n2sep_1" departPos="3.60" departPosLat="0.00" departSpeed="13.90" departDelay="0.00" arrival="290.05" arrivalLane="c2e_1" arrivalPos="990.00" arrivalPosLat="0.00" arrivalSpeed="13.90" duration="158.05" routeLength="1996.47" waitingTime="0.00" waitingCount="0" stopTime="0.00" timeLoss="13.72" rerouteNo="1" devices="tripinfo_car_n2e_132 routing_car_n2e_132" vType="Car" speedFactor="1.00" vaporized=""/>
    <tripinfo id="car_w2n_123" depart="123.00" departLane="w2sep_1" departPos="3.60" departPosLat="0.00" departSpeed="13.90" departDelay="0.00" arrival="295.95" arrivalLane="c2n_1" arrivalPos="990.00" arrivalPosLat="0.00" arrivalSpeed="15.18" duration="172.95" routeLength="1996.47" waitingTime="30.35" waitingCount="1" stopTime="0.00" timeLoss="40.78" rerouteNo="1" devices="tripinfo_car_w2n_123 routing_car_w2n_123" vType="Car" speedFactor="1.09" vaporized=""/>
    <tripinfo id="car_w2n_150" depart="150.00" departLane="w2sep_1" departPos="3.60" departPosLat="0.00" departSpeed="13.90" departDelay="0.00" arrival="298.45" arrivalLane="c2n_1" arrivalPos="990.00" arrivalPosLat="0.00" arrivalSpeed="16.02" duration="148.45" routeLength="1996.47" waitingTime="10.25" waitingCount="1" stopTime="0.00" timeLoss="24.99" rerouteNo="1" devices="tripinfo_car_w2n_150 routing_car_w2n_150" vType="Car" speedFactor="1.17" vaporized=""/>
    <tripinfo id="car_w2e_119" depart="119.00" departLane="w2sep_1" departPos="3.60" departPosLat="0.00" departSpeed="13.90" departDelay="0.00" arrival="298.90" arrivalLane="c2e_1" arrivalPos="990.00" arrivalPosLat="0.00" arrivalSpeed="14.32" duration="179.90" routeLength="1997.01" waitingTime="32.90" waitingCount="1" stopTime="0.00" timeLoss="40.44" rerouteNo="1" devices="tripinfo_car_w2e_119 routing_car_w2e_119" vType="Car" speedFactor="1.03" vaporized=""/>
    <tripinfo id="car_w2e_131" depart="131.00" departLane="w2sep_1" departPos="3.60" departPosLat="0.00" departSpeed="13.90" departDelay="0.00" arrival="303.95" arrivalLane="c2e_1" arrivalPos="990.00" arrivalPosLat="0.00" arrivalSpeed="14.04" duration="172.95" routeLength="1997.01" waitingTime="20.40" waitingCount="1" stopTime="0.00" timeLoss="30.71" rerouteNo="1" devices="tripinfo_car_w2e_131 routing_car_w2e_131" vType="Car" speedFactor="1.01" vaporized=""/>
    <tripinfo id="car_w2s_134" depart="134.00" departLane="w2sep_1" departPos="3.60" departPosLat="0.00" departSpeed="13.90" departDelay="0.00" arrival="305.15" arrivalLane="c2s_1" arrivalPos="990.00" arrivalPosLat="0.00" arrivalSpeed="13.90" duration="171.15" routeLength="1986.69" waitingTime="16.90" waitingCount="1" stopTime="0.00" timeLoss="27.49" rerouteNo="1" devices="tripinfo_car_w2s_134 routing_car_w2s_134" vType="Car" speedFactor="1.00" vaporized=""/>
    <tripinfo id="car_w2e_156" depart="156.00" departLane="w2sep_1" departPos="3.60" departPosLat="0.00" departSpeed="13.90" departDelay="0.00" arrival="306.20" arrivalLane="c2e_1" arrivalPos="990.00" arrivalPosLat="0.00" arrivalSpeed="14.92" duration="150.20" routeLength="1997.01" waitingTime="2.80" waitingCount="1" stopTime="0.00" timeLoss="19.09" rerouteNo="1" devices="tripinfo_car_w2e_156 routing_car_w2e_156" vType="Car" speedFactor="1.10" vaporized=""/>
    <tripinfo id="car_w2s_167" depart="167.00" departLane="w2sep_1" departPos="3.60" departPosLat="0.00" departSpeed="13.90" departDelay="0.00" arrival="307.15" arrivalLane="c2s_1" arrivalPos="990.00" arrivalPosLat="0.00" arrivalSpeed="15.28" duration="140.15" routeLength="1986.69" waitingTime="0.00" waitingCount="0" stopTime="0.00" timeLoss="14.39" rerouteNo="1" devices="tripinfo_car_w2s_167 routing_car_w2s_167" vType="Car" speedFactor="1.14" vaporized=""/>
    <tripinfo id="car_e2s_115" depart="115.00" departLane="e2sep_1" departPos="3.60" departPosLat="0.00" departSpeed="13.90" departDelay="0.00" arrival="309.60" arrivalLane="c2s_1" arrivalPos="990.00" arrivalPosLat="0.00" arrivalSpeed="15.11" duration="194.60" routeLength="1996.47" waitingTime="48.90" waitingCount="2" stopTime="0.00" timeLoss="63.65" rerouteNo="1" devices="tripinfo_car_e2s_115 routing_car_e2s_115" vType="Car" speedFactor="1.10" vaporized=""/>
    <tripinfo id="bus_e2s_155" depart="155.00" departLane="e2sep_1" departPos="12.10" departPosLat="0.00" departSpeed="13.90" departDelay="0.00" arrival="318.50" arrivalLane="c2s_1" arrivalPos="990.00" arrivalPosLat="0.00" arrivalSpeed="13.90" duration="163.50" routeLength="1987.97" waitingTime="7.80" waitingCount="1" stopTime="0.00" timeLoss="19.77" rerouteNo="1" devices="tripinfo_bus_e2s_155 routing_bus_e2s_155" vType="Bus" speedFactor="1.00" vaporized=""/>
    <tripinfo id="car_w2s_187" depart="187.00" departLane="w2sep_1" departPos="3.60" departPosLat="0.00" departSpeed="13.90" departDelay="0.00" arrival="320.95" arrivalLane="c2s_1" arrivalPos="990.00" arrivalPosLat="0.00" arrivalSpeed="15.54" duration="133.95" routeLength="1986.69" waitingTime="0.00" waitingCount="0" stopTime="0.00" timeLoss="9.51" rerouteNo="1" devices="tripinfo_car_w2s_187 routing_car_w2s_187" vType="Car" speedFactor="1.15" vaporized=""/>
    <tripinfo id="car_e2s_179" depart="179.00" departLane="e2sep_1" departPos="3.60" departPosLat="0.00" departSpeed="13.90" departDelay="0.00" arrival="326.80" arrivalLane="c2s_1" arrivalPos="990.00" arrivalPosLat="0.00" arrivalSpeed="14.12" duration="147.80" routeLength="1996.47" waitingTime="0.00" waitingCount="0" stopTime="0.00" timeLoss="5.69" rerouteNo="1" devices="tripinfo_car_e2s_179 routing_car_e2s_179" vType="Car" speedFactor="1.02" vaporized=""/>
    <tripinfo id="car_e2n_183" depart="183.00" departLane="e2sep_1" departPos="3.60" departPosLat="0.00" departSpeed="13.90" departDelay="0.00" arrival="330.95" arrivalLane="c2n_1" arrivalPos="990.00" arrivalPosLat="0.00" arrivalSpeed="13.90" duration="147.95" routeLength="1986.69" waitingTime="0.00" waitingCount="0" stopTime="0.00" timeLoss="4.29" rerouteNo="1" devices="tripinfo_car_e2n_183 routing_car_e2n_183" vType="Car" speedFactor="1.00" vaporized=""/>
    <tripinfo id="car_e2s_187" depart="187.00" departLane="e2sep_1" departPos="3.60" departPosLat="0.00" departSpeed="13.90" departDelay="0.00" arrival="336.90" arrivalLane="c2s_1" arrivalPos="990.00" arrivalPosLat="0.00" arrivalSpeed="13.97" duration="149.90" routeLength="1996.47" waitingTime="0.00" waitingCount="0" stopTime="0.00" timeLoss="6.29" rerouteNo="1" devices="tripinfo_car_e2s_187 routing_car_e2s_187" vType="Car" speedFactor="1.01" vaporized=""/>
    <tripinfo id="car_s2e_151" depart="151.00" departLane="s2sep_1" departPos="3.60" departPosLat="0.00" departSpeed="13.90" departDelay="0.00" arrival="344.45" arrivalLane="c2e_1" arrivalPos="990.00" arrivalPosLat="0.00" arrivalSpeed="14.13" duration="193.45" routeLength="1986.69" waitingTime="45.20" waitingCount="1" stopTime="0.00" timeLoss="52.18" rerouteNo="1" devices="tripinfo_car_s2e_151 routing_car_s2e_151" vType="Car" speedFactor="1.02" vaporized=""/>
    <tripinfo id="car_n2s_167" depart="167.00" departLane="n2sep_1" departPos="3.60" departPosLat="0.00" departSpeed="13.90" departDelay="0.00" arrival="344.45" arrivalLane="c2s_1" arrivalPos="990.00" arrivalPosLat="0.00" arrivalSpeed="14.23" duration="177.45" routeLength="1997.01" waitingTime="27.15" waitingCount="1" stopTime="0.00" timeLoss="37.09" rerouteNo="1" devices="tripinfo_car_n2s_167 routing_car_n2s_167" vType="Car" speedFactor="1.02" vaporized=""/>
    <tripinfo id="car_n2s_173" depart="173.00" departLane="n2sep_1" departPos="3.60" departPosLat="0.00" departSpeed="13.90" departDelay="0.00" arrival="346.70" arrivalLane="c2s_1" arrivalPos="990.00" arrivalPosLat="0.00" arrivalSpeed="15.23" duration="173.70" routeLength="1997.01" waitingTime="24.05" waitingCount="1" stopTime="0.00" timeLoss="45.34" rerouteNo="1" devices="tripinfo_car_n2s_173 routing_car_n2s_173" vType="Car" speedFactor="1.12" vaporized=""/>
    <tripinfo id="car_n2s_192" depart="192.00" departLane="n2sep_1" departPos="3.60" departPosLat="0.00" departSpeed="13.90" departDelay="0.00" arrival="348.70" arrivalLane="c2s_1" arrivalPos="990.00" arrivalPosLat="0.00" arrivalSpeed="15.71" duration="156.70" routeLength="1997.01" waitingTime="14.65" waitingCount="1" stopTime="0.00" timeLoss="34.08" rerouteNo="1" devices="tripinfo_car_n2s_192 routing_car_n2s_192" vType="Car" speedFactor="1.17" vaporized=""/>
    <tripinfo id="car_s2e_165" depart="165.00" departLane="s2sep_1" departPos="3.60" departPosLat="0.00" departSpeed="13.90" departDelay="0.00" arrival="349.75" arrivalLane="c2e_1" arrivalPos="990.00" arrivalPosLat="0.00" arrivalSpeed="13.90" duration="184.75" routeLength="1986.69" waitingTime="30.85" waitingCount="1" stopTime="0.00" timeLoss="41.08" rerouteNo="1" devices="tripinfo_car_s2e_165 routing_car_s2e_165" vType="Car" speedFactor="1.00" vaporized=""/>
    <tripinfo id="car_s2n_195" depart="195.00" departLane="s2sep_1" departPos="3.60" departPosLat="0.00" departSpeed="13.90" departDelay="0.00" arrival="349.75" arrivalLane="c2n_1" arrivalPos="990.00" arrivalPosLat="0.00" arrivalSpeed="14.46" duration="154.75" routeLength="1997.01" waitingTime="5.80" waitingCount="1" stopTime="0.00" timeLoss="16.60" rerouteNo="1" devices="tripinfo_car_s2n_195 routing_car_s2n_195" vType="Car" speedFactor="1.04" vaporized=""/>
    <tripinfo id="car_s2e_168" depart="168.00" departLane="s2sep_1" departPos="3.60" departPosLat="0.00" departSpeed="13.90" departDelay="0.00" arrival="351.75" arrivalLane="c2e_1" arrivalPos="990.00" arrivalPosLat="0.00" arrivalSpeed="15.15" duration="183.75" routeLength="1986.69" waitingTime="30.10" waitingCount="1" stopTime="0.00" timeLoss="56.78" rerouteNo="1" devices="tripinfo_car_s2e_168 routing_car_s2e_168" vType="Car" speedFactor="1.13" vaporized=""/>
    <tripinfo id="car_n2s_202" depart="202.00" departLane="n2sep_1" departPos="3.60" departPosLat="0.00" departSpeed="13.90" departDelay="0.00" arrival="353.00" arrivalLane="c2s_1" arrivalPos="990.00" arrivalPosLat="0.00" arrivalSpeed="14.16" duration="151.00" routeLength="1997.01" waitingTime="0.00" waitingCount="0" stopTime="0.00" timeLoss="10.07" rerouteNo="1" devices="tripinfo_car_n2s_202 routing_car_n2s_202" vType="Car" speedFactor="1.02" vaporized=""/>
    <tripinfo id="car_s2e_215" depart="215.00" departLane="s2sep_1" departPos="3.60" departPosLat="0.00" departSpeed="13.90" departDelay="0.00" arrival="354.75" arrivalLane="c2e_1" arrivalPos="990.00" arrivalPosLat="0.00" arrivalSpeed="15.02" duration="139.75" routeLength="1986.69" waitingTime="0.00" waitingCount="0" stopTime="0.00" timeLoss="7.55" rerouteNo="1" devices="tripinfo_car_s2e_215 routing_car_s2e_215" vType="Car" speedFactor="1.09" vaporized=""/>
    <tripinfo id="car_n2w_213" depart="213.00" departLane="n2sep_1" departPos="3.60" departPosLat="0.00" departSpeed="13.90" departDelay="0.00" arrival="356.20" arrivalLane="c2w_1" arrivalPos="990.00" arrivalPosLat="0.00" arrivalSpeed="14.35" duration="143.20" routeLength="1986.69" waitingTime="0.00" waitingCount="0" stopTime="0.00" timeLoss="4.05" rerouteNo="1" devices="tripinfo_car_n2w_213 routing_car_n2w_213" vType="Car" speedFactor="1.03" vaporized=""/>
    <tripinfo id="car_s2w_213" depart="213.00" departLane="s2sep_1" departPos="3.60" departPosLat="0.00" departSpeed="13.90" departDelay="0.00" arrival="358.85" arrivalLane="c2w_1" arrivalPos="990.00" arrivalPosLat="0.00" arrivalSpeed="15.16" duration="145.85" routeLength="1996.47" waitingTime="3.75" waitingCount="1" stopTime="0.00" timeLoss="14.89" rerouteNo="1" devices="tripinfo_car_s2w_213 routing_car_s2w_213" vType="Car" speedFactor="1.10" vaporized=""/>
    <tripinfo id="car_n2e_159" depart="159.00" departLane="n2sep_1" departPos="3.60" departPosLat="0.00" departSpeed="13.90" departDelay="0.00" arrival="362.30" arrivalLane="c2e_1" arrivalPos="990.00" arrivalPosLat="0.00" arrivalSpeed="13.94" duration="203.30" routeLength="1996.47" waitingTime="48.00" waitingCount="2" stopTime="0.00" timeLoss="59.43" rerouteNo="1" devices="tripinfo_car_n2e_159 routing_car_n2e_159" vType="Car" speedFactor="1.00" vaporized=""/>
    <tripinfo id="car_n2e_164" depart="164.00" departLane="n2sep_1" departPos="3.60" departPosLat="0.00" departSpeed="13.90" departDelay="0.00" arrival="366.55" arrivalLane="c2e_1" arrivalPos="990.00" arrivalPosLat="0.00" arrivalSpeed="13.89" duration="202.55" routeLength="1996.47" waitingTime="42.10" waitingCount="2" stopTime="0.00" timeLoss="58.23" rerouteNo="1" devices="tripinfo_car_n2e_164 routing_car_n2e_164" vType="Car" speedFactor="1.00" vaporized=""/>
    <tripinfo id="car_n2e_171" depart="171.00" departLane="n2sep_1" departPos="3.60" departPosLat="0.00" departSpeed="13.90" departDelay="0.00" arrival="368.80" arrivalLane="c2e_1" arrivalPos="990.00" arrivalPosLat="0.00" arrivalSpeed="14.73" duration="197.80" routeLength="1996.47" waitingTime="35.60" waitingCount="2" stopTime="0.00" timeLoss="64.46" rerouteNo="1" devices="tripinfo_car_n2e_171 routing_car_n2e_171" vType="Car" speedFactor="1.08" vaporized=""/>
    <tripinfo id="car_n2w_227" depart="227.00" departLane="n2sep_1" departPos="3.60" departPosLat="0.00" departSpeed="13.90" departDelay="0.00" arrival="372.00" arrivalLane="c2w_1" arrivalPos="990.00" arrivalPosLat="0.00" arrivalSpeed="14.13" duration="145.00" routeLength="1986.69" waitingTime="0.00" waitingCount="0" stopTime="0.00" timeLoss="3.71" rerouteNo="1" devices="tripinfo_car_n2w_227 routing_car_n2w_227" vType="Car" speedFactor="1.02" vaporized=""/>
    <tripinfo id="car_s2n_234" depart="234.00" departLane="s2sep_1" departPos="3.60" departPosLat="0.00" departSpeed="13.90" departDelay="0.00" arrival="372.30" arrivalLane="c2n_1" arrivalPos="990.00" arrivalPosLat="0.00" arrivalSpeed="14.49" duration="138.30" routeLength="1997.01" waitingTime="0.00" waitingCount="0" stopTime="0.00" timeLoss="0.52" rerouteNo="1" devices="tripinfo_car_s2n_234 routing_car_s2n_234" vType="Car" speedFactor="1.04" vaporized=""/>
    <tripinfo id="car_n2e_227" depart="228.45" departLane="n2sep_1" departPos="3.60" departPosLat="0.00" departSpeed="13.90" departDelay="1.45" arrival="376.15" arrivalLane="c2e_1" arrivalPos="990.00" arrivalPosLat="0.00" arrivalSpeed="14.32" duration="147.70" routeLength="1996.47" waitingTime="0.00" waitingCount="0" stopTime="0.00" timeLoss="7.62" rerouteNo="1" devices="tripinfo_car_n2e_227 routing_car_n2e_227" vType="Car" speedFactor="1.03" vaporized=""/>
    <tripinfo id="bus_s2w_223" depart="223.00" departLane="s2sep_1" departPos="12.10" departPosLat="0.00" departSpeed="13.90" departDelay="0.00" arrival="381.70" arrivalLane="c2w_1" arrivalPos="990.00" arrivalPosLat="0.00" arrivalSpeed="13.90" duration="158.70" routeLength="1987.97" waitingTime="5.00" waitingCount="1" stopTime="0.00" timeLoss="14.97" rerouteNo="1" devices="tripinfo_bus_s2w_223 routing_bus_s2w_223" vType="Bus" speedFactor="1.00" vaporized=""/>
    <tripinfo id="car_s2w_228" depart="228.00" departLane="s2sep_1" departPos="3.60" departPosLat="0.00" departSpeed="13.90" departDelay="0.00" arrival="384.20" arrivalLane="c2w_1" arrivalPos="990.00" arrivalPosLat="0.00" arrivalSpeed="15.49" duration="156.20" routeLength="1996.47" waitingTime="3.70" waitingCount="1" stopTime="0.00" timeLoss="30.44" rerouteNo="1" devices="tripinfo_car_s2w_228 routing_car_s2w_228" vType="Car" speedFactor="1.15" vaporized=""/>
    <tripinfo id="car_e2w_184" depart="184.50" departLane="e2sep_1" departPos="3.60" departPosLat="0.00" departSpeed="13.90" departDelay="0.50" arrival="386.10" arrivalLane="c2w_1" arrivalPos="990.00" arrivalPosLat="0.00" arrivalSpeed="15.70" duration="201.60" routeLength="1997.01" waitingTime="54.50" waitingCount="1" stopTime="0.00" timeLoss="79.68" rerouteNo="1" devices="tripinfo_car_e2w_184 routing_car_e2w_184" vType="Car" speedFactor="1.18" vaporized=""/>
    <tripinfo id="car_w2e_198" depart="198.00" departLane="w2sep_1" departPos="3.60" departPosLat="0.00" departSpeed="13.90" departDelay="0.00" arrival="389.30" arrivalLane="c2e_1" arrivalPos="990.00" arrivalPosLat="0.00" arrivalSpeed="14.21" duration="191.30" routeLength="1997.01" waitingTime="43.55" waitingCount="1" stopTime="0.00" timeLoss="50.73" rerouteNo="1" devices="tripinfo_car_w2e_198 routing_car_w2e_198" vType="Car" speedFactor="1.02" vaporized=""/>
    <tripinfo id="car_w2s_203" depart="203.00" departLane="w2sep_1" departPos="3.60" departPosLat="0.00" departSpeed="13.90" departDelay="0.00" arrival="389.30" arrivalLane="c2s_1" arrivalPos="990.00" arrivalPosLat="0.00" arrivalSpeed="14.67" duration="186.30" routeLength="1986.69" waitingTime="40.55" waitingCount="1" stopTime="0.00" timeLoss="50.21" rerouteNo="1" devices="tripinfo_car_w2s_203 routing_car_w2s_203" vType="Car" speedFactor="1.06" vaporized=""/>
    <tripinfo id="car_w2s_215" depart="215.00" departLane="w2sep_1" departPos="3.60" departPosLat="0.00" departSpeed="13.90" departDelay="0.00" arrival="396.00" arrivalLane="c2s_1" arrivalPos="990.00" arrivalPosLat="0.00" arrivalSpeed="14.00" duration="181.00" routeLength="1986.69" waitingTime="27.35" waitingCount="1" stopTime="0.00" timeLoss="38.39" rerouteNo="1" devices="tripinfo_car_w2s_215 routing_car_w2s_215" vType="Car" speedFactor="1.01" vaporized=""/>
    <tripinfo id="bus_e2w_193" depart="193.00" departLane="e2sep_1" departPos="12.10" departPosLat="0.00" departSpeed="13.90" departDelay="0.00" arrival="396.05" arrivalLane="c2w_1" arrivalPos="990.00" arrivalPosLat="0.00" arrivalSpeed="13.90" duration="203.05" routeLength="1988.51" waitingTime="48.20" waitingCount="1" stopTime="0.00" timeLoss="59.95" rerouteNo="1" devices="tripinfo_bus_e2w_193 routing_bus_e2w_193" vType="Bus" speedFactor="1.00" vaporized=""/>
    <tripinfo id="car_e2n_199" depart="199.00" departLane="e2sep_1" departPos="3.60" departPosLat="0.00" departSpeed="13.90" departDelay="0.00" arrival="396.05" arrivalLane="c2n_1" arrivalPos="990.00" arrivalPosLat="0.00" arrivalSpeed="14.22" duration="197.05" routeLength="1986.69" waitingTime="44.75" waitingCount="1" stopTime="0.00" timeLoss="56.58" rerouteNo="1" devices="tripinfo_car_e2n_199 routing_car_e2n_199" vType="Car" speedFactor="1.02" vaporized=""/>
    <tripinfo id="car_w2s_221" depart="221.00" departLane="w2sep_1" departPos="3.60" departPosLat="0.00" departSpeed="13.90" departDelay="0.00" arrival="400.35" arrivalLane="c2s_1" arrivalPos="990.00" arrivalPosLat="0.00" arrivalSpeed="13.89" duration="179.35" routeLength="1986.69" waitingTime="21.90" waitingCount="1" stopTime="0.00" timeLoss="35.67" rerouteNo="1" devices="tripinfo_car_w2s_221 routing_car_w2s_221" vType="Car" speedFactor="1.00" vaporized=""/>
    <tripinfo id="car_e2n_201" depart="201.00" departLane="e2sep_1" departPos="3.60" departPosLat="0.00" departSpeed="13.90" departDelay="0.00" arrival="401.50" arrivalLane="c2n_1" arrivalPos="990.00" arrivalPosLat="0.00" arrivalSpeed="13.90" duration="200.50" routeLength="1986.69" waitingTime="41.45" waitingCount="1" stopTime="0.00" timeLoss="56.84" rerouteNo="1" devices="tripinfo_car_e2n_201 routing_car_e2n_201" vType="Car" speedFactor="1.00" vaporized=""/>
    <tripinfo id="car_e2s_246" depart="246.00" departLane="e2sep_1" departPos="3.60" departPosLat="0.00" departSpeed="13.90" departDelay="0.00" arrival="402.50" arrivalLane="c2s_1" arrivalPos="990.00" arrivalPosLat="0.00" arrivalSpeed="14.81" duration="156.50" routeLength="1996.47" waitingTime="6.10" waitingCount="1" stopTime="0.00" timeLoss="24.32" rerouteNo="1" devices="tripinfo_car_e2s_246 routing_car_e2s_246" vType="Car" speedFactor="1.09" vaporized=""/>
    <tripinfo id="car_e2w_252" depart="252.00" departLane="e2sep_1" departPos="3.60" departPosLat="0.00" departSpeed="13.90" departDelay="0.00" arrival="404.15" arrivalLane="c2w_1" arrivalPos="990.00" arrivalPosLat="0.00" arrivalSpeed="14.42" duration="152.15" routeLength="1997.01" waitingTime="0.00" waitingCount="0" stopTime="0.00" timeLoss="13.68" rerouteNo="1" devices="tripinfo_car_e2w_252 routing_car_e2w_252" vType="Car" speedFactor="1.04" vaporized=""/>
    <tripinfo id="car_e2n_209" depart="209.00" departLane="e2sep_1" departPos="3.60" departPosLat="0.00" departSpeed="13.90" departDelay="0.00" arrival="405.35" arrivalLane="c2n_1" arrivalPos="990.00" arrivalPosLat="0.00" arrivalSpeed="13.88" duration="196.35" routeLength="1986.69" waitingTime="36.15" waitingCount="1" stopTime="0.00" timeLoss="52.68" rerouteNo="1" devices="tripinfo_car_e2n_209 routing_car_e2n_209" vType="Car" speedFactor="1.00" vaporized=""/>
    <tripinfo id="car_e2n_220" depart="220.00" departLane="e2sep_1" departPos="3.60" departPosLat="0.00" departSpeed="13.90" departDelay="0.00" arrival="408.00" arrivalLane="c2n_1" arrivalPos="990.00" arrivalPosLat="0.00" arrivalSpeed="14.25" duration="188.00" routeLength="1986.69" waitingTime="28.85" waitingCount="1" stopTime="0.00" timeLoss="49.13" rerouteNo="1" devices="tripinfo_car_e2n_220 routing_car_e2n_220" vType="Car" speedFactor="1.03" vaporized=""/>
    <tripinfo id="car_e2n_265" depart="265.00" departLane="e2sep_1" departPos="3.60" departPosLat="0.00" departSpeed="13.90" departDelay="0.00" arrival="410.15" arrivalLane="c2n_1" arrivalPos="990.00" arrivalPosLat="0.00" arrivalSpeed="14.76" duration="145.15" routeLength="1986.69" waitingTime="0.00" waitingCount="0" stopTime="0.00" timeLoss="13.11" rerouteNo="1" devices="tripinfo_car_e2n_265 routing_car_e2n_265" vType="Car" speedFactor="1.09" vaporized=""/>
    <tripinfo id="car_w2n_211" depart="211.00" departLane="w2sep_1" departPos="3.60" departPosLat="0.00" departSpeed="13.90" departDelay="0.00" arrival="411.95" arrivalLane="c2n_1" arrivalPos="990.00" arrivalPosLat="0.00" arrivalSpeed="15.47" duration="200.95" routeLength="1996.47" waitingTime="54.25" waitingCount="2" stopTime="0.00" timeLoss="78.60" rerouteNo="1" devices="tripinfo_car_w2n_211 routing_car_w2n_211" vType="Car" speedFactor="1.18" vaporized=""/>
    <tripinfo id="amb_w2e_300" depart="300.00" departLane="w2sep_1" departPos="6.60" departPosLat="0.00" departSpeed="13.90" departDelay="0.00" arrival="413.05" arrivalLane="c2e_1" arrivalPos="990.00" arrivalPosLat="-0.95" arrivalSpeed="20.85" duration="113.05" routeLength="1994.01" waitingTime="0.00" waitingCount="0" stopTime="0.00" timeLoss="17.42" rerouteNo="1" devices="tripinfo_amb_w2e_300 routing_amb_w2e_300 bluelight_amb_w2e_300 fcd_amb_w2e_300" vType="Ambulance" speedFactor="1.50" vaporized="">
        <example_device customValue1="0.00" customValue2="-1.00"/>
    </tripinfo>
    <tripinfo id="car_w2n_257" depart="257.00" departLane="w2sep_1" departPos="3.60" departPosLat="0.00" departSpeed="13.90" departDelay="0.00" arrival="414.15" arrivalLane="c2n_1" arrivalPos="990.00" arrivalPosLat="0.00" arrivalSpeed="14.85" duration="157.15" routeLength="1996.47" waitingTime="10.35" waitingCount="1" stopTime="0.00" timeLoss="24.84" rerouteNo="1" devices="tripinfo_car_w2n_257 routing_car_w2n_257" vType="Car" speedFactor="1.09" vaporized=""/>
    <tripinfo id="bus_w2n_274" depart="274.00" departLane="w2sep_1" departPos="12.10" departPosLat="0.00" departSpeed="13.90" departDelay="0.00" arrival="423.20" arrivalLane="c2n_1" arrivalPos="990.00" arrivalPosLat="0.00" arrivalSpeed="13.90" duration="149.20" routeLength="1987.97" waitingTime="0.00" waitingCount="0" stopTime="0.00" timeLoss="5.50" rerouteNo="1" devices="tripinfo_bus_w2n_274 routing_bus_w2n_274" vType="Bus" speedFactor="1.00" vaporized=""/>
    <tripinfo id="car_w2e_279" depart="279.00" departLane="w2sep_1" departPos="3.60" departPosLat="0.00" departSpeed="13.90" departDelay="0.00" arrival="423.50" arrivalLane="c2e_1" arrivalPos="990.00" arrivalPosLat="1.10" arrivalSpeed="13.90" duration="144.50" routeLength="1997.01" waitingTime="0.00" waitingCount="0" stopTime="0.00" timeLoss="0.80" rerouteNo="1" devices="tripinfo_car_w2e_279 routing_car_w2e_279" vType="Car@car_w2e_279" speedFactor="1.00" vaporized=""/>
    <tripinfo id="car_w2s_284" depart="284.00" departLane="w2sep_1" departPos="3.60" departPosLat="0.00" departSpeed="13.90" departDelay="0.00" arrival="428.15" arrivalLane="c2s_1" arrivalPos="990.00" arrivalPosLat="0.00" arrivalSpeed="14.38" duration="144.15" routeLength="1986.69" waitingTime="0.00" waitingCount="0" stopTime="0.00" timeLoss="5.26" rerouteNo="1" devices="tripinfo_car_w2s_284 routing_car_w2s_284" vType="Car" speedFactor="1.03" vaporized=""/>
    <tripinfo id="car_e2n_294" depart="294.00" departLane="e2sep_1" departPos="3.60" departPosLat="0.00" departSpeed="13.90" departDelay="0.00" arrival="431.90" arrivalLane="c2n_1" arrivalPos="990.00" arrivalPosLat="0.00" arrivalSpeed="16.25" duration="137.90" routeLength="1986.69" waitingTime="2.80" waitingCount="1" stopTime="0.00" timeLoss="15.02" rerouteNo="1" devices="tripinfo_car_e2n_294 routing_car_e2n_294" vType="Car" speedFactor="1.17" vaporized=""/>
    <tripinfo id="car_e2w_287" depart="287.00" departLane="e2sep_1" departPos="3.60" departPosLat="0.00" departSpeed="13.90" departDelay="0.00" arrival="435.30" arrivalLane="c2w_1" arrivalPos="990.00" arrivalPosLat="0.00" arrivalSpeed="14.80" duration="148.30" routeLength="1997.01" waitingTime="3.90" waitingCount="1" stopTime="0.00" timeLoss="13.33" rerouteNo="1" devices="tripinfo_car_e2w_287 routing_car_e2w_287" vType="Car" speedFactor="1.06" vaporized=""/>
</tripinfos>
