<?xml version="1.0" encoding="UTF-8"?>

<!-- generated on Sat Apr 24 18:04:54 2021 by Eclipse SUMO Version 1.4.0
<configuration xmlns:xsi="http://www.w3.org/2001/XMLSchema-instance" xsi:noNamespaceSchemaLocation="http://sumo.dlr.de/xsd/sumoConfiguration.xsd">

    <input>
        <net-file value="sumofiles/junction.net.xml"/>
        <route-files value="sumofiles/junction_preemption_65.rou.xml"/>
        <additional-files value="sumofiles/junction.det.xml"/>
    </input>

    <output>
        <tripinfo-output value="sumofiles/output/tripinfo_preemption_65.xml"/>
    </output>

    <time>
        <begin value="0"/>
        <end value="10000"/>
        <step-length value="0.05"/>
    </time>

    <processing>
        <lateral-resolution value="0.1"/>
    </processing>

    <report>
        <no-warnings value="true"/>
        <error-log value="sumofiles/output/errorlog_preemption_65.log"/>
        <no-step-log value="true"/>
    </report>

    <traci_server>
        <remote-port value="58557"/>
    </traci_server>

    <gui_only>
        <gui-settings-file value="sumofiles/junction-gui.settings.xml"/>
        <tracker-interval value="0.05"/>
    </gui_only>

</configuration>
-->

<tripinfos xmlns:xsi="http://www.w3.org/2001/XMLSchema-instance" xsi:noNamespaceSchemaLocation="http://sumo.dlr.de/xsd/tripinfo_file.xsd">
    <tripinfo id="car_e2s_1" depart="1.00" departLane="e2sep_1" departPos="3.60" departPosLat="0.00" departSpeed="13.90" departDelay="0.00" arrival="140.70" arrivalLane="c2s_1" arrivalPos="990.00" arrivalPosLat="0.00" arrivalSpeed="14.73" duration="139.70" routeLength="1996.47" waitingTime="0.00" waitingCount="0" stopTime="0.00" timeLoss="3.53" rerouteNo="1" devices="tripinfo_car_e2s_1 routing_car_e2s_1" vType="Car" speedFactor="1.06" vaporized=""/>
    <tripinfo id="car_e2s_9" depart="9.00" departLane="e2sep_1" departPos="3.60" departPosLat="0.00" departSpeed="13.90" departDelay="0.00" arrival="155.50" arrivalLane="c2s_1" arrivalPos="990.00" arrivalPosLat="0.00" arrivalSpeed="14.32" duration="146.50" routeLength="1996.47" waitingTime="0.00" waitingCount="0" stopTime="0.00" timeLoss="6.40" rerouteNo="1" devices="tripinfo_car_e2s_9 routing_car_e2s_9" vType="Car" speedFactor="1.03" vaporized=""/>
    <tripinfo id="car_s2e_7" depart="7.00" departLane="s2sep_1" departPos="3.60" departPosLat="0.00" departSpeed="13.90" departDelay="0.00" arrival="160.30" arrivalLane="c2e_1" arrivalPos="990.00" arrivalPosLat="0.00" arrivalSpeed="15.05" duration="153.30" routeLength="1986.69" waitingTime="13.05" waitingCount="1" stopTime="0.00" timeLoss="20.61" rerouteNo="1" devices="tripinfo_car_s2e_7 routing_car_s2e_7" vType="Car" speedFactor="1.08" vaporized=""/>
    <tripinfo id="car_n2e_2" depart="2.00" departLane="n2sep_1" departPos="3.60" departPosLat="0.00" departSpeed="13.90" departDelay="0.00" arrival="165.35" arrivalLane="c2e_1" arrivalPos="990.00" arrivalPosLat="0.00" arrivalSpeed="14.73" duration="163.35" routeLength="1996.47" waitingTime="16.75" waitingCount="1" stopTime="0.00" timeLoss="27.20" rerouteNo="1" devices="tripinfo_car_n2e_2 routing_car_n2e_2" vType="Car" speedFactor="1.06" vaporized=""/>
    <tripinfo id="car_n2w_11" depart="11.00" departLane="n2sep_1" departPos="3.60" departPosLat="0.00" departSpeed="13.90" departDelay="0.00" arrival="165.60" arrivalLane="c2w_1" arrivalPos="990.00" arrivalPosLat="0.00" arrivalSpeed="13.90" duration="154.60" routeLength="1986.69" waitingTime="3.85" waitingCount="1" stopTime="0.00" timeLoss="10.94" rerouteNo="1" devices="tripinfo_car_n2w_11 routing_car_n2w_11" vType="Car" speedFactor="1.00" vaporized=""/>
    <tripinfo id="car_s2n_32" depart="32.00" departLane="s2sep_1" departPos="3.60" departPosLat="0.00" departSpeed="13.90" departDelay="0.00" arrival="172.30" arrivalLane="c2n_1" arrivalPos="990.00" arrivalPosLat="0.00" arrivalSpeed="14.27" duration="140.30" routeLength="1997.01" waitingTime="0.00" waitingCount="0" stopTime="0.00" timeLoss="0.27" rerouteNo="1" devices="tripinfo_car_s2n_32 routing_car_s2n_32" vType="Car" speedFactor="1.03" vaporized=""/>
    <tripinfo id="car_n2w_33" depart="33.00" departLane="n2sep_1" departPos="3.60" departPosLat="0.00" departSpeed="13.90" departDelay="0.00" arrival="174.35" arrivalLane="c2w_1" arrivalPos="990.00" arrivalPosLat="0.00" arrivalSpeed="14.55" duration="141.35" routeLength="1986.69" waitingTime="0.00" waitingCount="0" stopTime="0.00" timeLoss="4.14" rerouteNo="1" devices="tripinfo_car_n2w_33 routing_car_n2w_33" vType="Car" speedFactor="1.05" vaporized=""/>
    <tripinfo id="car_n2s_37" depart="38.50" departLane="n2sep_1" departPos="3.60" departPosLat="0.00" departSpeed="13.90" departDelay="1.50" arrival="180.75" arrivalLane="c2s_1" arrivalPos="990.00" arrivalPosLat="0.00" arrivalSpeed="14.54" duration="142.25" routeLength="1997.01" waitingTime="0.00" waitingCount="0" stopTime="0.00" timeLoss="4.84" rerouteNo="1" devices="tripinfo_car_n2s_37 routing_car_n2s_37" vType="Car" speedFactor="1.05" vaporized=""/>
    <tripinfo id="car_s2n_38" depart="38.00" departLane="s2sep_1" departPos="3.60" departPosLat="0.00" departSpeed="13.90" departDelay="0.00" arrival="182.40" arrivalLane="c2n_1" arrivalPos="990.00" arrivalPosLat="0.00" arrivalSpeed="13.90" duration="144.40" routeLength="1997.01" waitingTime="0.00" waitingCount="0" stopTime="0.00" timeLoss="0.72" rerouteNo="1" devices="tripinfo_car_s2n_38 routing_car_s2n_38" vType="Car" speedFactor="1.00" vaporized=""/>
    <tripinfo id="car_n2e_37" depart="37.00" departLane="n2sep_1" departPos="3.60" departPosLat="0.00" departSpeed="13.90" departDelay="0.00" arrival="185.15" arrivalLane="c2e_1" arrivalPos="990.00" arrivalPosLat="0.00" arrivalSpeed="13.90" duration="148.15" routeLength="1996.47" waitingTime="0.00" waitingCount="0" stopTime="0.00" timeLoss="3.83" rerouteNo="1" devices="tripinfo_car_n2e_37 routing_car_n2e_37" vType="Car" speedFactor="1.00" vaporized=""/>
    <tripinfo id="car_n2e_44" depart="44.00" departLane="n2sep_1" departPos="3.60" departPosLat="0.00" departSpeed="13.90" departDelay="0.00" arrival="187.05" arrivalLane="c2e_1" arrivalPos="990.00" arrivalPosLat="0.00" arrivalSpeed="15.36" duration="143.05" routeLength="1996.47" waitingTime="0.00" waitingCount="0" stopTime="0.00" timeLoss="18.44" rerouteNo="1" devices="tripinfo_car_n2e_44 routing_car_n2e_44" vType="Car" speedFactor="1.16" vaporized=""/>
    <tripinfo id="car_s2w_53" depart="53.00" departLane="s2sep_1" departPos="3.60" departPosLat="0.00" departSpeed="13.90" departDelay="0.00" arrival="197.05" arrivalLane="c2w_1" arrivalPos="990.00" arrivalPosLat="0.00" arrivalSpeed="14.27" duration="144.05" routeLength="1996.47" waitingTime="0.00" waitingCount="0" stopTime="0.00" timeLoss="3.41" rerouteNo="1" devices="tripinfo_car_s2w_53 routing_car_s2w_53" vType="Car" speedFactor="1.03" vaporized=""/>
    <tripinfo id="car_w2e_14" depart="14.00" departLane="w2sep_1" departPos="3.60" departPosLat="0.00" departSpeed="13.90" departDelay="0.00" arrival="207.70" arrivalLane="c2e_1" arrivalPos="990.00" arrivalPosLat="0.00" arrivalSpeed="14.54" duration="193.70" routeLength="1997.01" waitingTime="49.45" waitingCount="1" stopTime="0.00" timeLoss="56.29" rerouteNo="1" devices="tripinfo_car_w2e_14 routing_car_w2e_14" vType="Car" speedFactor="1.05" vaporized=""/>
    <tripinfo id="car_e2n_7" depart="7.00" departLane="e2sep_1" departPos="3.60" departPosLat="0.00" departSpeed="13.90" departDelay="0.00" arrival="209.90" arrivalLane="c2n_1" arrivalPos="990.00" arrivalPosLat="0.00" arrivalSpeed="14.04" duration="202.90" routeLength="1986.69" waitingTime="53.75" waitingCount="1" stopTime="0.00" timeLoss="60.73" rerouteNo="1" devices="tripinfo_car_e2n_7 routing_car_e2n_7" vType="Car" speedFactor="1.01" vaporized=""/>
    <tripinfo id="car_w2s_32" depart="32.40" departLane="w2sep_1" departPos="3.60" departPosLat="0.00" departSpeed="13.90" departDelay="0.40" arrival="211.50" arrivalLane="c2s_1" arrivalPos="990.00" arrivalPosLat="0.00" arrivalSpeed="15.16" duration="179.10" routeLength="1986.69" waitingTime="31.70" waitingCount="1" stopTime="0.00" timeLoss="47.35" rerouteNo="1" devices="tripinfo_car_w2s_32 routing_car_w2s_32" vType="Car" speedFactor="1.09" vaporized=""/>
    <tripinfo id="car_e2w_37" depart="37.00" departLane="e2sep_1" departPos="3.60" departPosLat="0.00" departSpeed="13.90" departDelay="0.00" arrival="212.85" arrivalLane="c2w_1" arrivalPos="990.00" arrivalPosLat="0.00" arrivalSpeed="13.90" duration="175.85" routeLength="1997.01" waitingTime="23.90" waitingCount="1" stopTime="0.00" timeLoss="32.18" rerouteNo="1" devices="tripinfo_car_e2w_37 routing_car_e2w_37" vType="Car" speedFactor="1.00" vaporized=""/>
    <tripinfo id="car_w2e_15" depart="15.40" departLane="w2sep_1" departPos="3.60" departPosLat="0.00" departSpeed="13.90" departDelay="0.40" arrival="213.55" arrivalLane="c2e_1" arrivalPos="990.00" arrivalPosLat="0.00" arrivalSpeed="14.04" duration="198.15" routeLength="1997.01" waitingTime="44.45" waitingCount="1" stopTime="0.00" timeLoss="55.95" rerouteNo="1" devices="tripinfo_car_w2e_15 routing_car_w2e_15" vType="Car" speedFactor="1.01" vaporized=""/>
    <tripinfo id="car_e2n_68" depart="68.00" departLane="e2sep_1" departPos="3.60" departPosLat="0.00" departSpeed="13.90" departDelay="0.00" arrival="214.00" arrivalLane="c2n_1" arrivalPos="990.00" arrivalPosLat="0.00" arrivalSpeed="15.70" duration="146.00" routeLength="1986.69" waitingTime="5.30" waitingCount="1" stopTime="0.00" timeLoss="19.07" rerouteNo="1" devices="tripinfo_car_e2n_68 routing_car_e2n_68" vType="Car" speedFactor="1.13" vaporized=""/>
    <tripinfo id="car_w2s_35" depart="35.00" departLane="w2sep_1" departPos="3.60" departPosLat="0.00" departSpeed="13.90" departDelay="0.00" arrival="214.80" arrivalLane="c2s_1" arrivalPos="990.00" arrivalPosLat="0.00" arrivalSpeed="15.55" duration="179.80" routeLength="1986.69" waitingTime="30.80" waitingCount="1" stopTime="0.00" timeLoss="51.84" rerouteNo="1" devices="tripinfo_car_w2s_35 routing_car_w2s_35" vType="Car" speedFactor="1.12" vaporized=""/>
    <tripinfo id="car_w2e_20" depart="20.00" departLane="w2sep_1" departPos="3.60" departPosLat="0.00" departSpeed="13.90" departDelay="0.00" arrival="216.00" arrivalLane="c2e_1" arrivalPos="990.00" arrivalPosLat="0.00" arrivalSpeed="14.83" duration="196.00" routeLength="1997.01" waitingTime="43.40" waitingCount="1" stopTime="0.00" timeLoss="63.26" rerouteNo="1" devices="tripinfo_car_w2e_20 routing_car_w2e_20" vType="Car" speedFactor="1.08" vaporized=""/>
    <tripinfo id="car_e2w_43" depart="43.00" departLane="e2sep_1" departPos="3.60" departPosLat="0.00" departSpeed="13.90" departDelay="0.00" arrival="217.25" arrivalLane="c2w_1" arrivalPos="990.00" arrivalPosLat="0.00" arrivalSpeed="13.89" duration="174.25" routeLength="1997.01" waitingTime="18.70" waitingCount="1" stopTime="0.00" timeLoss="30.54" rerouteNo="1" devices="tripinfo_car_e2w_43 routing_car_e2w_43" vType="Car" speedFactor="1.00" vaporized=""/>
    <tripinfo id="car_e2w_53" depart="53.00" departLane="e2sep_1" departPos="3.60" departPosLat="0.00" departSpeed="13.90" departDelay="0.00" arrival="219.40" arrivalLane="c2w_1" arrivalPos="990.00" arrivalPosLat="0.00" arrivalSpeed="14.80" duration="166.40" routeLength="1997.01" waitingTime="15.55" waitingCount="1" stopTime="0.00" timeLoss="34.66" rerouteNo="1" devices="tripinfo_car_e2w_53 routing_car_e2w_53" vType="Car" speedFactor="1.09" vaporized=""/>
    <tripinfo id="car_e2w_60" depart="60.00" departLane="e2sep_1" departPos="3.60" departPosLat="0.00" departSpeed="13.90" departDelay="0.00" arrival="221.45" arrivalLane="c2w_1" arrivalPos="990.00" arrivalPosLat="0.00" arrivalSpeed="15.12" duration="161.45" routeLength="1997.01" waitingTime="11.50" waitingCount="1" stopTime="0.00" timeLoss="33.47" rerouteNo="1" devices="tripinfo_car_e2w_60 routing_car_e2w_60" vType="Car" speedFactor="1.12" vaporized=""/>
    <tripinfo id="car_w2n_31" depart="31.00" departLane="w2sep_1" departPos="3.60" departPosLat="0.00" departSpeed="13.90" departDelay="0.00" arrival="222.95" arrivalLane="c2n_1" arrivalPos="990.00" arrivalPosLat="0.00" arrivalSpeed="14.32" duration="191.95" routeLength="1996.47" waitingTime="40.25" waitingCount="2" stopTime="0.00" timeLoss="51.87" rerouteNo="1" devices="tripinfo_car_w2n_31 routing_car_w2n_31" vType="Car" speedFactor="1.03" vaporized=""/>
    <tripinfo id="car_w2s_67" depart="67.00" departLane="w2sep_1" departPos="3.60" departPosLat="0.00" departSpeed="13.90" departDelay="0.00" arrival="222.95" arrivalLane="c2s_1" arrivalPos="990.00" arrivalPosLat="0.00" arrivalSpeed="13.90" duration="155.95" routeLength="1986.69" waitingTime="0.00" waitingCount="0" stopTime="0.00" timeLoss="12.25" rerouteNo="1" devices="tripinfo_car_w2s_67 routing_car_w2s_67" vType="Car" speedFactor="1.00" vaporized=""/>
    <tripinfo id="car_e2w_94" depart="94.00" departLane="e2sep_1" departPos="3.60" departPosLat="0.00" departSpeed="13.90" departDelay="0.00" arrival="223.25" arrivalLane="c2w_1" arrivalPos="990.00" arrivalPosLat="0.00" arrivalSpeed="15.56" duration="129.25" routeLength="1997.01" waitingTime="0.00" waitingCount="0" stopTime="0.00" timeLoss="7.47" rerouteNo="1" devices="tripinfo_car_e2w_94 routing_car_e2w_94" vType="Car" speedFactor="1.18" vaporized=""/>
    <tripinfo id="car_w2s_74" depart="74.00" departLane="w2sep_1" departPos="3.60" departPosLat="0.00" departSpeed="13.90" departDelay="0.00" arrival="224.85" arrivalLane="c2s_1" arrivalPos="990.00" arrivalPosLat="0.00" arrivalSpeed="15.33" duration="150.85" routeLength="1986.69" waitingTime="0.00" waitingCount="0" stopTime="0.00" timeLoss="26.40" rerouteNo="1" devices="tripinfo_car_w2s_74 routing_car_w2s_74" vType="Car" speedFactor="1.15" vaporized=""/>
    <tripinfo id="car_w2s_75" depart="76.80" departLane="w2sep_1" departPos="3.60" departPosLat="0.00" departSpeed="13.90" departDelay="1.80" arrival="229.10" arrivalLane="c2s_1" arrivalPos="990.00" arrivalPosLat="0.00" arrivalSpeed="13.89" duration="152.30" routeLength="1986.69" waitingTime="0.00" waitingCount="0" stopTime="0.00" timeLoss="8.60" rerouteNo="1" devices="tripinfo_car_w2s_75 routing_car_w2s_75" vType="Car" speedFactor="1.00" vaporized=""/>
    <tripinfo id="car_w2n_50" depart="50.00" departLane="w2sep_1" departPos="3.60" departPosLat="0.00" departSpeed="13.90" departDelay="0.00" arrival="230.25" arrivalLane="c2n_1" arrivalPos="990.00" arrivalPosLat="0.00" arrivalSpeed="14.15" duration="180.25" routeLength="1996.47" waitingTime="21.75" waitingCount="3" stopTime="0.00" timeLoss="38.51" rerouteNo="1" devices="tripinfo_car_w2n_50 routing_car_w2n_50" vType="Car" speedFactor="1.02" vaporized=""/>
    <tripinfo id="car_w2n_75" depart="75.25" departLane="w2sep_1" departPos="3.60" departPosLat="0.00" departSpeed="13.90" departDelay="0.25" arrival="232.20" arrivalLane="c2n_1" arrivalPos="990.00" arrivalPosLat="0.00" arrivalSpeed="15.58" duration="156.95" routeLength="1996.47" waitingTime="3.55" waitingCount="1" stopTime="0.00" timeLoss="33.77" rerouteNo="1" devices="tripinfo_car_w2n_75 routing_car_w2n_75" vType="Car" speedFactor="1.17" vaporized=""/>
    <tripinfo id="car_s2e_94" depart="94.00" departLane="s2sep_1" departPos="3.60" departPosLat="0.00" departSpeed="13.90" departDelay="0.00" arrival="253.70" arrivalLane="c2e_1" arrivalPos="990.00" arrivalPosLat="0.00" arrivalSpeed="15.32" duration="159.70" routeLength="1986.69" waitingTime="18.35" waitingCount="1" stopTime="0.00" timeLoss="29.35" rerouteNo="1" devices="tripinfo_car_s2e_94 routing_car_s2e_94" vType="Car" speedFactor="1.10" vaporized=""/>
    <tripinfo id="car_n2s_57" depart="57.00" departLane="n2sep_1" departPos="3.60" departPosLat="0.00" departSpeed="13.90" departDelay="0.00" arrival="254.70" arrivalLane="c2s_1" arrivalPos="990.00" arrivalPosLat="0.00" arrivalSpeed="14.55" duration="197.70" routeLength="1997.01" waitingTime="51.05" waitingCount="1" stopTime="0.00" timeLoss="60.45" rerouteNo="1" devices="tripinfo_car_n2s_57 routing_car_n2s_57" vType="Car" speedFactor="1.05" vaporized=""/>
    <tripinfo id="car_n2w_52" depart="52.00" departLane="n2sep_1" departPos="3.60" departPosLat="0.00" departSpeed="13.90" departDelay="0.00" arrival="254.90" arrivalLane="c2w_1" arrivalPos="990.00" arrivalPosLat="0.00" arrivalSpeed="14.04" duration="202.90" routeLength="1986.69" waitingTime="53.80" waitingCount="1" stopTime="0.00" timeLoss="60.71" rerouteNo="1" devices="tripinfo_car_n2w_52 routing_car_n2w_52" vType="Car" speedFactor="1.01" vaporized=""/>
    <tripinfo id="car_s2n_61" depart="61.00" departLane="s2sep_1" departPos="3.60" departPosLat="0.00" departSpeed="13.90" departDelay="0.00" arrival="255.70" arrivalLane="c2n_1" arrivalPos="990.00" arrivalPosLat="0.00" arrivalSpeed="13.90" duration="194.70" routeLength="1997.01" waitingTime="43.95" waitingCount="1" stopTime="0.00" timeLoss="51.04" rerouteNo="1" devices="tripinfo_car_s2n_61 routing_car_s2n_61" vType="Car" speedFactor="1.00" vaporized=""/>
    <tripinfo id="car_n2s_70" depart="70.45" departLane="n2sep_1" departPos="3.60" departPosLat="0.00" departSpeed="13.90" departDelay="0.45" arrival="256.70" arrivalLane="c2s_1" arrivalPos="990.00" arrivalPosLat="0.00" arrivalSpeed="15.81" duration="186.25" routeLength="1997.01" waitingTime="36.80" waitingCount="1" stopTime="0.00" timeLoss="64.35" rerouteNo="1" devices="tripinfo_car_n2s_70 routing_car_n2s_70" vType="Car" speedFactor="1.18" vaporized=""/>
    <tripinfo id="car_s2n_80" depart="80.00" departLane="s2sep_1" departPos="3.60" departPosLat="0.00" departSpeed="13.90" departDelay="0.00" arrival="259.40" arrivalLane="c2n_1" arrivalPos="990.00" arrivalPosLat="0.00" arrivalSpeed="14.15" duration="179.40" routeLength="1997.01" waitingTime="27.10" waitingCount="1" stopTime="0.00" timeLoss="38.47" rerouteNo="1" devices="tripinfo_car_s2n_80 routing_car_s2n_80" vType="Car" speedFactor="1.02" vaporized=""/>
    <tripinfo id="car_n2w_74" depart="74.00" departLane="n2sep_1" departPos="3.60" departPosLat="0.00" departSpeed="13.90" departDelay="0.00" arrival="262.50" arrivalLane="c2w_1" arrivalPos="990.00" arrivalPosLat="0.00" arrivalSpeed="13.97" duration="188.50" routeLength="1986.69" waitingTime="33.30" waitingCount="1" stopTime="0.00" timeLoss="45.56" rerouteNo="1" devices="tripinfo_car_n2w_74 routing_car_n2w_74" vType="Car" speedFactor="1.01" vaporized=""/>
    <tripinfo id="car_s2n_112" depart="112.00" departLane="s2sep_1" departPos="3.60" departPosLat="0.00" departSpeed="13.90" departDelay="0.00" arrival="263.70" arrivalLane="c2n_1" arrivalPos="990.00" arrivalPosLat="0.00" arrivalSpeed="13.89" duration="151.70" routeLength="1997.01" waitingTime="0.00" waitingCount="0" stopTime="0.00" timeLoss="8.00" rerouteNo="1" devices="tripinfo_car_s2n_112 routing_car_s2n_112" vType="Car" speedFactor="1.00" vaporized=""/>
    <tripinfo id="car_n2e_69" depart="69.00" departLane="n2sep_1" departPos="3.60" departPosLat="0.00" departSpeed="13.90" departDelay="0.00" arrival="265.10" arrivalLane="c2e_1" arrivalPos="990.00" arrivalPosLat="0.00" arrivalSpeed="13.90" duration="196.10" routeLength="1996.47" waitingTime="40.80" waitingCount="2" stopTime="0.00" timeLoss="51.76" rerouteNo="1" devices="tripinfo_car_n2e_69 routing_car_n2e_69" vType="Car" speedFactor="1.00" vaporized=""/>
    <tripinfo id="car_n2w_111" depart="111.40" departLane="n2sep_1" departPos="3.60" departPosLat="0.00" departSpeed="13.90" departDelay="0.40" arrival="266.55" arrivalLane="c2w_1" arrivalPos="990.00" arrivalPosLat="0.00" arrivalSpeed="14.03" duration="155.15" routeLength="1986.69" waitingTime="0.00" waitingCount="0" stopTime="0.00" timeLoss="12.90" rerouteNo="1" devices="tripinfo_car_n2w_111 routing_car_n2w_111" vType="Car" speedFactor="1.01" vaporized=""/>
    <tripinfo id="car_n2e_104" depart="104.00" departLane="n2sep_1" departPos="3.60" departPosLat="0.00" departSpeed="13.90" departDelay="0.00" arrival="267.00" arrivalLane="c2e_1" arrivalPos="990.00" arrivalPosLat="0.00" arrivalSpeed="15.36" duration="163.00" routeLength="1996.47" waitingTime="14.60" waitingCount="2" stopTime="0.00" timeLoss="38.37" rerouteNo="1" devices="tripinfo_car_n2e_104 routing_car_n2e_104" vType="Car" speedFactor="1.16" vaporized=""/>
    <tripinfo id="car_n2e_110" depart="110.00" departLane="n2sep_1" departPos="3.60" departPosLat="0.00" departSpeed="13.90" departDelay="0.00" arrival="270.10" arrivalLane="c2e_1" arrivalPos="990.00" arrivalPosLat="0.00" arrivalSpeed="14.44" duration="160.10" routeLength="1996.47" waitingTime="1.35" waitingCount="1" stopTime="0.00" timeLoss="21.78" rerouteNo="1" devices="tripinfo_car_n2e_110 routing_car_n2e_110" vType="Car" speedFactor="1.04" vaporized=""/>
    <tripinfo id="car_n2w_120" depart="120.00" departLane="n2sep_1" departPos="3.60" departPosLat="0.00" departSpeed="13.90" departDelay="0.00" arrival="271.70" arrivalLane="c2w_1" arrivalPos="990.00" arrivalPosLat="0.00" arrivalSpeed="13.94" duration="151.70" routeLength="1986.69" waitingTime="0.00" waitingCount="0" stopTime="0.00" timeLoss="8.45" rerouteNo="1" devices="tripinfo_car_n2w_120 routing_car_n2w_120" vType="Car" speedFactor="1.00" vaporized=""/>
    <tripinfo id="car_n2e_114" depart="114.00" departLane="n2sep_1" departPos="3.60" departPosLat="0.00" departSpeed="13.90" departDelay="0.00" arrival="274.35" arrivalLane="c2e_1" arrivalPos="990.00" arrivalPosLat="0.00" arrivalSpeed="13.89" duration="160.35" routeLength="1996.47" waitingTime="0.90" waitingCount="1" stopTime="0.00" timeLoss="16.03" rerouteNo="1" devices="tripinfo_car_n2e_114 routing_car_n2e_114" vType="Car" speedFactor="1.00" vaporized=""/>
    <tripinfo id="car_s2w_85" depart="85.00" departLane="s2sep_1" departPos="3.60" departPosLat="0.00" departSpeed="13.90" departDelay="0.00" arrival="276.00" arrivalLane="c2w_1" arrivalPos="990.00" arrivalPosLat="0.00" arrivalSpeed="13.89" duration="191.00" routeLength="1996.47" waitingTime="33.55" waitingCount="2" stopTime="0.00" timeLoss="46.67" rerouteNo="1" devices="tripinfo_car_s2w_85 routing_car_s2w_85" vType="Car" speedFactor="1.00" vaporized=""/>
    <tripinfo id="car_s2n_132" depart="132.00" departLane="s2sep_1" departPos="3.60" departPosLat="0.00" departSpeed="13.90" departDelay="0.00" arrival="276.05" arrivalLane="c2n_1" arrivalPos="990.00" arrivalPosLat="0.00" arrivalSpeed="13.90" duration="144.05" routeLength="1997.01" waitingTime="0.00" waitingCount="0" stopTime="0.00" timeLoss="0.37" rerouteNo="1" devices="tripinfo_car_s2n_132 routing_car_s2n_132" vType="Car" speedFactor="1.00" vaporized=""/>
    <tripinfo id="car_s2w_105" depart="105.00" departLane="s2sep_1" departPos="3.60" departPosLat="0.00" departSpeed="13.90" departDelay="0.00" arrival="278.15" arrivalLane="c2w_1" arrivalPos="990.00" arrivalPosLat="0.00" arrivalSpeed="14.81" duration="173.15" routeLength="1996.47" waitingTime="19.50" waitingCount="2" stopTime="0.00" timeLoss="41.00" rerouteNo="1" devices="tripinfo_car_s2w_105 routing_car_s2w_105" vType="Car" speedFactor="1.09" vaporized=""/>
    <tripinfo id="car_s2w_115" depart="115.00" departLane="s2sep_1" departPos="3.60" departPosLat="0.00" departSpeed="13.90" departDelay="0.00" arrival="280.00" arrivalLane="c2w_1" arrivalPos="990.00" arrivalPosLat="0.00" arrivalSpeed="15.45" duration="165.00" routeLength="1996.47" waitingTime="10.15" waitingCount="1" stopTime="0.00" timeLoss="41.55" rerouteNo="1" devices="tripinfo_car_s2w_115 routing_car_s2w_115" vType="Car" speedFactor="1.17" vaporized=""/>
    <tripinfo id="bus_n2e_117" depart="117.00" departLane="n2sep_1" departPos="12.10" departPosLat="0.00" departSpeed="13.90" departDelay="0.00" arrival="283.05" arrivalLane="c2e_1" arrivalPos="990.00" arrivalPosLat="0.00" arrivalSpeed="13.90" duration="166.05" routeLength="1987.97" waitingTime="2.25" waitingCount="2" stopTime="0.00" timeLoss="22.33" rerouteNo="1" devices="tripinfo_bus_n2e_117 routing_bus_n2e_117" vType="Bus" speedFactor="1.00" vaporized=""/>
    <tripinfo id="car_n2e_142" depart="142.00" departLane="n2sep_1" departPos="3.60" departPosLat="0.00" departSpeed="13.90" departDelay="0.00" arrival="285.70" arrivalLane="c2e_1" arrivalPos="990.00" arrivalPosLat="0.00" arrivalSpeed="15.24" duration="143.70" routeLength="1996.47" waitingTime="0.00" waitingCount="0" stopTime="0.00" timeLoss="14.75" rerouteNo="1" devices="tripinfo_car_n2e_142 routing_car_n2e_142" vType="Car" speedFactor="1.12" vaporized=""/>
    <tripinfo id="car_n2e_145" depart="145.00" departLane="n2sep_1" departPos="3.60" departPosLat="0.00" departSpeed="13.90" departDelay="0.00" arrival="291.65" arrivalLane="c2e_1" arrivalPos="990.00" arrivalPosLat="0.00" arrivalSpeed="14.12" duration="146.65" routeLength="1996.47" waitingTime="0.00" waitingCount="0" stopTime="0.00" timeLoss="4.56" rerouteNo="1" devices="tripinfo_car_n2e_145 routing_car_n2e_145" vType="Car" speedFactor="1.02" vaporized=""/>
    <tripinfo id="car_s2w_148" depart="148.00" departLane="s2sep_1" departPos="3.60" departPosLat="0.00" departSpeed="13.90" departDelay="0.00" arrival="295.75" arrivalLane="c2w_1" arrivalPos="990.00" arrivalPosLat="0.00" arrivalSpeed="13.90" duration="147.75" routeLength="1996.47" waitingTime="0.00" waitingCount="0" stopTime="0.00" timeLoss="3.42" rerouteNo="1" devices="tripinfo_car_s2w_148 routing_car_s2w_148" vType="Car" speedFactor="1.00" vaporized=""/>
    <tripinfo id="car_w2e_105" depart="105.00" departLane="w2sep_1" departPos="3.60" departPosLat="0.00" departSpeed="13.90" departDelay="0.00" arrival="299.05" arrivalLane="c2e_1" arrivalPos="990.00" arrivalPosLat="0.00" arrivalSpeed="14.32" duration="194.05" routeLength="1997.01" waitingTime="47.25" waitingCount="1" stopTime="0.00" timeLoss="54.58" rerouteNo="1" devices="tripinfo_car_w2e_105 routing_car_w2e_105" vType="Car" speedFactor="1.03" vaporized=""/>
    <tripinfo id="car_e2w_105" depart="105.00" departLane="e2sep_1" departPos="3.60" departPosLat="0.00" departSpeed="13.90" departDelay="0.00" arrival="300.55" arrivalLane="c2w_1" arrivalPos="990.00" arrivalPosLat="0.00" arrivalSpeed="14.15" duration="195.55" routeLength="1997.01" waitingTime="46.40" waitingCount="1" stopTime="0.00" timeLoss="54.41" rerouteNo="1" devices="tripinfo_car_e2w_105 routing_car_e2w_105" vType="Car" speedFactor="1.02" vaporized=""/>
    <tripinfo id="car_e2w_106" depart="106.45" departLane="e2sep_1" departPos="3.60" departPosLat="0.00" departSpeed="13.90" departDelay="0.45" arrival="303.80" arrivalLane="c2w_1" arrivalPos="990.00" arrivalPosLat="0.00" arrivalSpeed="14.37" duration="197.35" routeLength="1997.01" waitingTime="43.95" waitingCount="1" stopTime="0.00" timeLoss="58.88" rerouteNo="1" devices="tripinfo_car_e2w_106 routing_car_e2w_106" vType="Car" speedFactor="1.04" vaporized=""/>
    <tripinfo id="car_w2e_157" depart="158.40" departLane="w2sep_1" departPos="3.60" departPosLat="0.00" departSpeed="13.90" departDelay="1.40" arrival="305.60" arrivalLane="c2e_1" arrivalPos="990.00" arrivalPosLat="0.00" arrivalSpeed="13.90" duration="147.20" routeLength="1997.01" waitingTime="0.00" waitingCount="0" stopTime="0.00" timeLoss="3.52" rerouteNo="1" devices="tripinfo_car_w2e_157 routing_car_w2e_157" vType="Car" speedFactor="1.00" vaporized=""/>
    <tripinfo id="car_w2e_161" depart="161.00" departLane="w2sep_1" departPos="3.60" departPosLat="0.00" departSpeed="13.90" departDelay="0.00" arrival="307.40" arrivalLane="c2e_1" arrivalPos="990.00" arrivalPosLat="0.00" arrivalSpeed="15.46" duration="146.40" routeLength="1997.01" waitingTime="0.00" waitingCount="0" stopTime="0.00" timeLoss="24.61" rerouteNo="1" devices="tripinfo_car_w2e_161 routing_car_w2e_161" vType="Car" speedFactor="1.18" vaporized=""/>
    <tripinfo id="car_e2w_111" depart="111.00" departLane="e2sep_1" departPos="3.60" departPosLat="0.00" departSpeed="13.90" departDelay="0.00" arrival="307.90" arrivalLane="c2w_1" arrivalPos="990.00" arrivalPosLat="0.00" arrivalSpeed="13.89" duration="196.90" routeLength="1997.01" waitingTime="40.00" waitingCount="1" stopTime="0.00" timeLoss="53.19" rerouteNo="1" devices="tripinfo_car_e2w_111 routing_car_e2w_111" vType="Car" speedFactor="1.00" vaporized=""/>
    <tripinfo id="car_e2s_112" depart="112.50" departLane="e2sep_1" departPos="3.60" departPosLat="0.00" departSpeed="13.90" departDelay="0.50" arrival="310.00" arrivalLane="c2s_1" arrivalPos="990.00" arrivalPosLat="0.00" arrivalSpeed="13.90" duration="197.50" routeLength="1996.47" waitingTime="39.05" waitingCount="2" stopTime="0.00" timeLoss="53.15" rerouteNo="1" devices="tripinfo_car_e2s_112 routing_car_e2s_112" vType="Car" speedFactor="1.00" vaporized=""/>
    <tripinfo id="car_e2w_117" depart="117.00" departLane="e2sep_1" departPos="3.60" departPosLat="0.00" departSpeed="13.90" departDelay="0.00" arrival="310.90" arrivalLane="c2w_1" arrivalPos="990.00" arrivalPosLat="0.00" arrivalSpeed="14.06" duration="193.90" routeLength="1997.01" waitingTime="34.60" waitingCount="1" stopTime="0.00" timeLoss="52.57" rerouteNo="1" devices="tripinfo_car_e2w_117 routing_car_e2w_117" vType="Car" speedFactor="1.02" vaporized=""/>
    <tripinfo id="car_e2n_131" depart="131.00" departLane="e2sep_1" departPos="3.60" departPosLat="0.00" departSpeed="13.90" departDelay="0.00" arrival="311.25" arrivalLane="c2n_1" arrivalPos="990.00" arrivalPosLat="0.00" arrivalSpeed="13.90" duration="180.25" routeLength="1986.69" waitingTime="24.70" waitingCount="1" stopTime="0.00" timeLoss="36.59" rerouteNo="1" devices="tripinfo_car_e2n_131 routing_car_e2n_131" vType="Car" speedFactor="1.00" vaporized=""/>
    <tripinfo id="car_e2w_119" depart="119.00" departLane="e2sep_1" departPos="3.60" departPosLat="0.00" departSpeed="13.90" departDelay="0.00" arrival="312.95" arrivalLane="c2w_1" arrivalPos="990.00" arrivalPosLat="0.00" arrivalSpeed="14.79" duration="193.95" routeLength="1997.01" waitingTime="33.90" waitingCount="1" stopTime="0.00" timeLoss="62.84" rerouteNo="1" devices="tripinfo_car_e2w_119 routing_car_e2w_119" vType="Car" speedFactor="1.10" vaporized=""/>
    <tripinfo id="car_w2s_174" depart="174.00" departLane="w2sep_1" departPos="3.60" departPosLat="0.00" departSpeed="13.90" departDelay="0.00" arrival="313.15" arrivalLane="c2s_1" arrivalPos="990.00" arrivalPosLat="0.00" arrivalSpeed="15.03" duration="139.15" routeLength="1986.69" waitingTime="0.00" waitingCount="0" stopTime="0.00" timeLoss="6.94" rerouteNo="1" devices="tripinfo_car_w2s_174 routing_car_w2s_174" vType="Car" speedFactor="1.09" vaporized=""/>
    <tripinfo id="car_e2w_135" depart="135.00" departLane="e2sep_1" departPos="3.60" departPosLat="0.00" departSpeed="13.90" departDelay="0.00" arrival="314.85" arrivalLane="c2w_1" arrivalPos="990.00" arrivalPosLat="0.00" arrivalSpeed="15.21" duration="179.85" routeLength="1997.01" waitingTime="24.15" waitingCount="1" stopTime="0.00" timeLoss="54.10" rerouteNo="1" devices="tripinfo_car_e2w_135 routing_car_e2w_135" vType="Car" speedFactor="1.14" vaporized=""/>
    <tripinfo id="car_e2n_135" depart="136.30" departLane="e2sep_1" departPos="3.60" departPosLat="0.00" departSpeed="13.90" departDelay="1.30" arrival="315.40" arrivalLane="c2n_1" arrivalPos="990.00" arrivalPosLat="0.00" arrivalSpeed="14.21" duration="179.10" routeLength="1986.69" waitingTime="21.80" waitingCount="1" stopTime="0.00" timeLoss="38.71" rerouteNo="1" devices="tripinfo_car_e2n_135 routing_car_e2n_135" vType="Car" speedFactor="1.02" vaporized=""/>
    <tripinfo id="car_e2s_138" depart="138.05" departLane="e2sep_1" departPos="3.60" departPosLat="0.00" departSpeed="13.90" departDelay="0.05" arrival="315.70" arrivalLane="c2s_1" arrivalPos="990.00" arrivalPosLat="0.00" arrivalSpeed="15.54" duration="177.65" routeLength="1996.47" waitingTime="21.25" waitingCount="3" stopTime="0.00" timeLoss="50.12" rerouteNo="1" devices="tripinfo_car_e2s_138 routing_car_e2s_138" vType="Car" speedFactor="1.13" vaporized=""/>
    <tripinfo id="car_e2n_151" depart="151.00" departLane="e2sep_1" departPos="3.60" departPosLat="0.00" departSpeed="13.90" departDelay="0.00" arrival="317.25" arrivalLane="c2n_1" arrivalPos="990.00" arrivalPosLat="0.00" arrivalSpeed="15.56" duration="166.25" routeLength="1986.69" waitingTime="17.85" waitingCount="1" stopTime="0.00" timeLoss="44.34" rerouteNo="1" devices="tripinfo_car_e2n_151 routing_car_e2n_151" vType="Car" speedFactor="1.18" vaporized=""/>
    <tripinfo id="car_e2w_155" depart="155.00" departLane="e2sep_1" departPos="3.60" departPosLat="0.00" departSpeed="13.90" departDelay="0.00" arrival="319.00" arrivalLane="c2w_1" arrivalPos="990.00" arrivalPosLat="0.00" arrivalSpeed="14.19" duration="164.00" routeLength="1997.01" waitingTime="4.70" waitingCount="1" stopTime="0.00" timeLoss="23.43" rerouteNo="1" devices="tripinfo_car_e2w_155 routing_car_e2w_155" vType="Car" speedFactor="1.02" vaporized=""/>
    <tripinfo id="car_w2n_111" depart="111.00" departLane="w2sep_1" departPos="3.60" departPosLat="0.00" departSpeed="13.90" departDelay="0.00" arrival="320.30" arrivalLane="c2n_1" arrivalPos="990.00" arrivalPosLat="0.00" arrivalSpeed="15.04" duration="209.30" routeLength="1996.47" waitingTime="62.65" waitingCount="2" stopTime="0.00" timeLoss="76.63" rerouteNo="1" devices="tripinfo_car_w2n_111 routing_car_w2n_111" vType="Car" speedFactor="1.09" vaporized=""/>
    <tripinfo id="car_e2w_160" depart="160.00" departLane="e2sep_1" departPos="3.60" departPosLat="0.00" departSpeed="13.90" departDelay="0.00" arrival="322.80" arrivalLane="c2w_1" arrivalPos="990.00" arrivalPosLat="0.00" arrivalSpeed="14.15" duration="162.80" routeLength="1997.01" waitingTime="2.50" waitingCount="1" stopTime="0.00" timeLoss="21.86" rerouteNo="1" devices="tripinfo_car_e2w_160 routing_car_e2w_160" vType="Car" speedFactor="1.02" vaporized=""/>
    <tripinfo id="car_e2s_153" depart="153.00" departLane="e2sep_1" departPos="3.60" departPosLat="0.00" departSpeed="13.90" departDelay="0.00" arrival="323.10" arrivalLane="c2s_1" arrivalPos="990.00" arrivalPosLat="0.00" arrivalSpeed="13.97" duration="170.10" routeLength="1996.47" waitingTime="5.60" waitingCount="2" stopTime="0.00" timeLoss="26.52" rerouteNo="1" devices="tripinfo_car_e2s_153 routing_car_e2s_153" vType="Car" speedFactor="1.01" vaporized=""/>
    <tripinfo id="car_e2s_180" depart="180.00" departLane="e2sep_1" departPos="3.60" departPosLat="0.00" departSpeed="13.90" departDelay="0.00" arrival="327.20" arrivalLane="c2s_1" arrivalPos="990.00" arrivalPosLat="0.00" arrivalSpeed="14.12" duration="147.20" routeLength="1996.47" waitingTime="0.00" waitingCount="0" stopTime="0.00" timeLoss="5.28" rerouteNo="1" devices="tripinfo_car_e2s_180 routing_car_e2s_180" vType="Car" speedFactor="1.02" vaporized=""/>
    <tripinfo id="car_e2n_184" depart="184.00" departLane="e2sep_1" departPos="3.60" departPosLat="0.00" departSpeed="13.90" departDelay="0.00" arrival="328.70" arrivalLane="c2n_1" arrivalPos="990.00" arrivalPosLat="0.00" arrivalSpeed="14.32" duration="144.70" routeLength="1986.69" waitingTime="0.00" waitingCount="0" stopTime="0.00" timeLoss="5.28" rerouteNo="1" devices="tripinfo_car_e2n_184 routing_car_e2n_184" vType="Car" speedFactor="1.03" vaporized=""/>
    <tripinfo id="car_w2n_141" depart="141.00" departLane="w2sep_1" departPos="3.60" departPosLat="0.00" departSpeed="13.90" departDelay="0.00" arrival="331.55" arrivalLane="c2n_1" arrivalPos="990.00" arrivalPosLat="0.00" arrivalSpeed="14.93" duration="190.55" routeLength="1996.47" waitingTime="36.60" waitingCount="3" stopTime="0.00" timeLoss="57.20" rerouteNo="1" devices="tripinfo_car_w2n_141 routing_car_w2n_141" vType="Car" speedFactor="1.08" vaporized=""/>
    <tripinfo id="car_e2s_191" depart="191.00" departLane="e2sep_1" departPos="3.60" departPosLat="0.00" departSpeed="13.90" departDelay="0.00" arrival="333.90" arrivalLane="c2s_1" arrivalPos="990.00" arrivalPosLat="0.00" arrivalSpeed="14.49" duration="142.90" routeLength="1996.47" waitingTime="0.00" waitingCount="0" stopTime="0.00" timeLoss="4.50" rerouteNo="1" devices="tripinfo_car_e2s_191 routing_car_e2s_191" vType="Car" speedFactor="1.04" vaporized=""/>
    <tripinfo id="car_s2e_153" depart="153.00" departLane="s2sep_1" departPos="3.60" departPosLat="0.00" departSpeed="13.90" departDelay="0.00" arrival="335.50" arrivalLane="c2e_1" arrivalPos="990.00" arrivalPosLat="0.00" arrivalSpeed="16.29" duration="182.50" routeLength="1986.69" waitingTime="45.80" waitingCount="1" stopTime="0.00" timeLoss="59.88" rerouteNo="1" devices="tripinfo_car_s2e_153 routing_car_s2e_153" vType="Car" speedFactor="1.17" vaporized=""/>
    <tripinfo id="car_w2n_157" depart="157.00" departLane="w2sep_1" departPos="3.60" departPosLat="0.00" departSpeed="13.90" departDelay="0.00" arrival="335.95" arrivalLane="c2n_1" arrivalPos="990.00" arrivalPosLat="0.00" arrivalSpeed="14.21" duration="178.95" routeLength="1996.47" waitingTime="18.40" waitingCount="2" stopTime="0.00" timeLoss="37.89" rerouteNo="1" devices="tripinfo_car_w2n_157 routing_car_w2n_157" vType="Car" speedFactor="1.02" vaporized=""/>
    <tripinfo id="car_n2s_152" depart="152.00" departLane="n2sep_1" departPos="3.60" departPosLat="0.00" departSpeed="13.90" departDelay="0.00" arrival="337.45" arrivalLane="c2s_1" arrivalPos="990.00" arrivalPosLat="0.00" arrivalSpeed="15.99" duration="185.45" routeLength="1997.01" waitingTime="49.35" waitingCount="1" stopTime="0.00" timeLoss="60.99" rerouteNo="1" devices="tripinfo_car_n2s_152 routing_car_n2s_152" vType="Car" speedFactor="1.15" vaporized=""/>
    <tripinfo id="car_n2w_185" depart="185.00" departLane="n2sep_1" departPos="3.60" departPosLat="0.00" departSpeed="13.90" departDelay="0.00" arrival="339.05" arrivalLane="c2w_1" arrivalPos="990.00" arrivalPosLat="0.00" arrivalSpeed="15.95" duration="154.05" routeLength="1986.69" waitingTime="19.40" waitingCount="1" stopTime="0.00" timeLoss="28.87" rerouteNo="1" devices="tripinfo_car_n2w_185 routing_car_n2w_185" vType="Car" speedFactor="1.15" vaporized=""/>
    <tripinfo id="car_w2n_163" depart="163.00" departLane="w2sep_1" departPos="3.60" departPosLat="0.00" departSpeed="13.90" departDelay="0.00" arrival="339.25" arrivalLane="c2n_1" arrivalPos="990.00" arrivalPosLat="0.00" arrivalSpeed="14.30" duration="176.25" routeLength="1996.47" waitingTime="12.95" waitingCount="2" stopTime="0.00" timeLoss="36.48" rerouteNo="1" devices="tripinfo_car_w2n_163 routing_car_w2n_163" vType="Car" speedFactor="1.03" vaporized=""/>
    <tripinfo id="car_w2n_166" depart="166.00" departLane="w2sep_1" departPos="3.60" departPosLat="0.00" departSpeed="13.90" departDelay="0.00" arrival="341.45" arrivalLane="c2n_1" arrivalPos="990.00" arrivalPosLat="0.00" arrivalSpeed="14.98" duration="175.45" routeLength="1996.47" waitingTime="11.90" waitingCount="1" stopTime="0.00" timeLoss="44.52" rerouteNo="1" devices="tripinfo_car_w2n_166 routing_car_w2n_166" vType="Car" speedFactor="1.10" vaporized=""/>
    <tripinfo id="car_s2e_160" depart="161.40" departLane="s2sep_1" departPos="3.60" departPosLat="0.00" departSpeed="13.90" departDelay="1.40" arrival="348.50" arrivalLane="c2e_1" arrivalPos="990.00" arrivalPosLat="0.00" arrivalSpeed="13.90" duration="187.10" routeLength="1986.69" waitingTime="32.70" waitingCount="1" stopTime="0.00" timeLoss="43.43" rerouteNo="1" devices="tripinfo_car_s2e_160 routing_car_s2e_160" vType="Car" speedFactor="1.00" vaporized=""/>
    <tripinfo id="car_n2w_186" depart="186.25" departLane="n2sep_1" departPos="3.60" departPosLat="0.00" departSpeed="13.90" departDelay="0.25" arrival="350.80" arrivalLane="c2w_1" arrivalPos="990.00" arrivalPosLat="0.00" arrivalSpeed="13.90" duration="164.55" routeLength="1986.69" waitingTime="10.00" waitingCount="1" stopTime="0.00" timeLoss="20.90" rerouteNo="1" devices="tripinfo_car_n2w_186 routing_car_n2w_186" vType="Car" speedFactor="1.00" vaporized=""/>
    <tripinfo id="bus_s2n_162" depart="164.00" departLane="s2sep_1" departPos="12.10" departPosLat="0.00" departSpeed="13.90" departDelay="2.00" arrival="352.90" arrivalLane="c2n_1" arrivalPos="990.00" arrivalPosLat="0.00" arrivalSpeed="13.90" duration="188.90" routeLength="1988.51" waitingTime="31.45" waitingCount="1" stopTime="0.00" timeLoss="45.84" rerouteNo="1" devices="tripinfo_bus_s2n_162 routing_bus_s2n_162" vType="Bus" speedFactor="1.00" vaporized=""/>
    <tripinfo id="car_n2w_198" depart="198.00" departLane="n2sep_1" departPos="3.60" departPosLat="0.00" departSpeed="13.90" departDelay="0.00" arrival="353.15" arrivalLane="c2w_1" arrivalPos="990.00" arrivalPosLat="0.00" arrivalSpeed="14.90" duration="155.15" routeLength="1986.69" waitingTime="5.65" waitingCount="1" stopTime="0.00" timeLoss="23.55" rerouteNo="1" devices="tripinfo_car_n2w_198 routing_car_n2w_198" vType="Car" speedFactor="1.09" vaporized=""/>
    <tripinfo id="car_s2e_169" depart="169.00" departLane="s2sep_1" departPos="3.60" departPosLat="0.00" departSpeed="13.90" departDelay="0.00" arrival="354.90" arrivalLane="c2e_1" arrivalPos="990.00" arrivalPosLat="0.00" arrivalSpeed="14.00" duration="185.90" routeLength="1986.69" waitingTime="28.85" waitingCount="1" stopTime="0.00" timeLoss="43.26" rerouteNo="1" devices="tripinfo_car_s2e_169 routing_car_s2e_169" vType="Car" speedFactor="1.01" vaporized=""/>
    <tripinfo id="car_n2w_207" depart="207.00" departLane="n2sep_1" departPos="3.60" departPosLat="0.00" departSpeed="13.90" departDelay="0.00" arrival="356.20" arrivalLane="c2w_1" arrivalPos="990.00" arrivalPosLat="0.00" arrivalSpeed="14.44" duration="149.20" routeLength="1986.69" waitingTime="0.00" waitingCount="0" stopTime="0.00" timeLoss="11.49" rerouteNo="1" devices="tripinfo_car_n2w_207 routing_car_n2w_207" vType="Car" speedFactor="1.04" vaporized=""/>
    <tripinfo id="car_s2n_178" depart="178.00" departLane="s2sep_1" departPos="3.60" departPosLat="0.00" departSpeed="13.90" departDelay="0.00" arrival="356.85" arrivalLane="c2n_1" arrivalPos="990.00" arrivalPosLat="0.00" arrivalSpeed="14.35" duration="178.85" routeLength="1997.01" waitingTime="24.50" waitingCount="1" stopTime="0.00" timeLoss="39.93" rerouteNo="1" devices="tripinfo_car_s2n_178 routing_car_s2n_178" vType="Car" speedFactor="1.03" vaporized=""/>
    <tripinfo id="car_s2w_154" depart="154.25" departLane="s2sep_1" departPos="3.60" departPosLat="0.00" departSpeed="13.90" departDelay="0.25" arrival="359.15" arrivalLane="c2w_1" arrivalPos="990.00" arrivalPosLat="0.00" arrivalSpeed="14.38" duration="204.90" routeLength="1996.47" waitingTime="48.10" waitingCount="3" stopTime="0.00" timeLoss="66.13" rerouteNo="1" devices="tripinfo_car_s2w_154 routing_car_s2w_154" vType="Car" speedFactor="1.04" vaporized=""/>
    <tripinfo id="car_s2e_179" depart="179.40" departLane="s2sep_1" departPos="3.60" departPosLat="0.00" departSpeed="13.90" departDelay="0.40" arrival="360.15" arrivalLane="c2e_1" arrivalPos="990.00" arrivalPosLat="0.00" arrivalSpeed="13.90" duration="180.75" routeLength="1986.69" waitingTime="20.70" waitingCount="1" stopTime="0.00" timeLoss="37.08" rerouteNo="1" devices="tripinfo_car_s2e_179 routing_car_s2e_179" vType="Car" speedFactor="1.00" vaporized=""/>
    <tripinfo id="car_s2w_160" depart="160.00" departLane="s2sep_1" departPos="3.60" departPosLat="0.00" departSpeed="13.90" departDelay="0.00" arrival="361.80" arrivalLane="c2w_1" arrivalPos="990.00" arrivalPosLat="0.00" arrivalSpeed="14.54" duration="201.80" routeLength="1996.47" waitingTime="44.05" waitingCount="2" stopTime="0.00" timeLoss="65.07" rerouteNo="1" devices="tripinfo_car_s2w_160 routing_car_s2w_160" vType="Car" speedFactor="1.06" vaporized=""/>
    <tripinfo id="car_s2n_187" depart="187.00" departLane="s2sep_1" departPos="3.60" departPosLat="0.00" departSpeed="13.90" departDelay="0.00" arrival="361.85" arrivalLane="c2n_1" arrivalPos="990.00" arrivalPosLat="0.00" arrivalSpeed="13.92" duration="174.85" routeLength="1997.01" waitingTime="16.00" waitingCount="1" stopTime="0.00" timeLoss="31.41" rerouteNo="1" devices="tripinfo_car_s2n_187 routing_car_s2n_187" vType="Car" speedFactor="1.00" vaporized=""/>
    <tripinfo id="car_s2e_193" depart="193.00" departLane="s2sep_1" departPos="3.60" departPosLat="0.00" departSpeed="13.90" departDelay="0.00" arrival="364.35" arrivalLane="c2e_1" arrivalPos="990.00" arrivalPosLat="0.00" arrivalSpeed="13.98" duration="171.35" routeLength="1986.69" waitingTime="11.65" waitingCount="1" stopTime="0.00" timeLoss="28.66" rerouteNo="1" devices="tripinfo_car_s2e_193 routing_car_s2e_193" vType="Car" speedFactor="1.01" vaporized=""/>
    <tripinfo id="car_s2w_195" depart="195.00" departLane="s2sep_1" departPos="3.60" departPosLat="0.00" departSpeed="13.90" departDelay="0.00" arrival="364.90" arrivalLane="c2w_1" arrivalPos="990.00" arrivalPosLat="0.00" arrivalSpeed="14.15" duration="169.90" routeLength="1996.47" waitingTime="3.80" waitingCount="1" stopTime="0.00" timeLoss="28.69" rerouteNo="1" devices="tripinfo_car_s2w_195 routing_car_s2w_195" vType="Car" speedFactor="1.02" vaporized=""/>
    <tripinfo id="car_n2e_211" depart="211.00" departLane="n2sep_1" departPos="3.60" departPosLat="0.00" departSpeed="13.90" departDelay="0.00" arrival="368.05" arrivalLane="c2e_1" arrivalPos="990.00" arrivalPosLat="0.00" arrivalSpeed="14.01" duration="157.05" routeLength="1996.47" waitingTime="4.45" waitingCount="1" stopTime="0.00" timeLoss="14.14" rerouteNo="1" devices="tripinfo_car_n2e_211 routing_car_n2e_211" vType="Car" speedFactor="1.01" vaporized=""/>
    <tripinfo id="car_n2e_217" depart="217.00" departLane="n2sep_1" departPos="3.60" departPosLat="0.00" departSpeed="13.90" departDelay="0.00" arrival="370.25" arrivalLane="c2e_1" arrivalPos="990.00" arrivalPosLat="0.00" arrivalSpeed="14.79" duration="153.25" routeLength="1996.47" waitingTime="3.05" waitingCount="1" stopTime="0.00" timeLoss="20.62" rerouteNo="1" devices="tripinfo_car_n2e_217 routing_car_n2e_217" vType="Car" speedFactor="1.09" vaporized=""/>
    <tripinfo id="car_s2n_233" depart="233.00" departLane="s2sep_1" departPos="3.60" departPosLat="0.00" departSpeed="13.90" departDelay="0.00" arrival="376.90" arrivalLane="c2n_1" arrivalPos="990.00" arrivalPosLat="0.00" arrivalSpeed="13.90" duration="143.90" routeLength="1997.01" waitingTime="0.00" waitingCount="0" stopTime="0.00" timeLoss="0.23" rerouteNo="1" devices="tripinfo_car_s2n_233 routing_car_s2n_233" vType="Car" speedFactor="1.00" vaporized=""/>
    <tripinfo id="car_s2w_237" depart="237.00" departLane="s2sep_1" departPos="3.60" departPosLat="0.00" departSpeed="13.90" departDelay="0.00" arrival="381.75" arrivalLane="c2w_1" arrivalPos="990.00" arrivalPosLat="0.00" arrivalSpeed="14.38" duration="144.75" routeLength="1996.47" waitingTime="0.00" waitingCount="0" stopTime="0.00" timeLoss="5.23" rerouteNo="1" devices="tripinfo_car_s2w_237 routing_car_s2w_237" vType="Car" speedFactor="1.03" vaporized=""/>
    <tripinfo id="car_s2w_247" depart="247.00" departLane="s2sep_1" departPos="3.60" departPosLat="0.00" departSpeed="13.90" departDelay="0.00" arrival="383.75" arrivalLane="c2w_1" arrivalPos="990.00" arrivalPosLat="0.00" arrivalSpeed="15.67" duration="136.75" routeLength="1996.47" waitingTime="0.00" waitingCount="0" stopTime="0.00" timeLoss="13.29" rerouteNo="1" devices="tripinfo_car_s2w_247 routing_car_s2w_247" vType="Car" speedFactor="1.17" vaporized=""/>
    <tripinfo id="car_w2e_224" depart="224.00" departLane="w2sep_1" departPos="3.60" departPosLat="0.00" departSpeed="13.90" departDelay="0.00" arrival="386.70" arrivalLane="c2e_1" arrivalPos="990.00" arrivalPosLat="0.00" arrivalSpeed="15.25" duration="162.70" routeLength="1997.01" waitingTime="22.75" waitingCount="1" stopTime="0.00" timeLoss="31.72" rerouteNo="1" devices="tripinfo_car_w2e_224 routing_car_w2e_224" vType="Car" speedFactor="1.10" vaporized=""/>
    <tripinfo id="car_e2n_209" depart="209.00" departLane="e2sep_1" departPos="3.60" departPosLat="0.00" departSpeed="13.90" departDelay="0.00" arrival="387.05" arrivalLane="c2n_1" arrivalPos="990.00" arrivalPosLat="0.00" arrivalSpeed="14.69" duration="178.05" routeLength="1986.69" waitingTime="34.60" waitingCount="1" stopTime="0.00" timeLoss="42.11" rerouteNo="1" devices="tripinfo_car_e2n_209 routing_car_e2n_209" vType="Car" speedFactor="1.06" vaporized=""/>
    <tripinfo id="car_w2s_204" depart="204.00" departLane="w2sep_1" departPos="3.60" departPosLat="0.00" departSpeed="13.90" departDelay="0.00" arrival="388.10" arrivalLane="c2s_1" arrivalPos="990.00" arrivalPosLat="0.00" arrivalSpeed="14.42" duration="184.10" routeLength="1986.69" waitingTime="38.00" waitingCount="1" stopTime="0.00" timeLoss="45.64" rerouteNo="1" devices="tripinfo_car_w2s_204 routing_car_w2s_204" vType="Car" speedFactor="1.04" vaporized=""/>
    <tripinfo id="car_e2n_217" depart="217.00" departLane="e2sep_1" departPos="3.60" departPosLat="0.00" departSpeed="13.90" departDelay="0.00" arrival="389.70" arrivalLane="c2n_1" arrivalPos="990.00" arrivalPosLat="0.00" arrivalSpeed="15.42" duration="172.70" routeLength="1986.69" waitingTime="30.80" waitingCount="1" stopTime="0.00" timeLoss="44.60" rerouteNo="1" devices="tripinfo_car_e2n_217 routing_car_e2n_217" vType="Car" speedFactor="1.12" vaporized=""/>
    <tripinfo id="car_w2s_225" depart="225.30" departLane="w2sep_1" departPos="3.60" departPosLat="0.00" departSpeed="13.90" departDelay="0.30" arrival="392.35" arrivalLane="c2s_1" arrivalPos="990.00" arrivalPosLat="0.00" arrivalSpeed="14.79" duration="167.05" routeLength="1986.69" waitingTime="19.05" waitingCount="1" stopTime="0.00" timeLoss="32.15" rerouteNo="1" devices="tripinfo_car_w2s_225 routing_car_w2s_225" vType="Car" speedFactor="1.07" vaporized=""/>
    <tripinfo id="car_e2w_227" depart="227.00" departLane="e2sep_1" departPos="3.60" departPosLat="0.00" departSpeed="13.90" departDelay="0.00" arrival="395.25" arrivalLane="c2w_1" arrivalPos="990.00" arrivalPosLat="0.00" arrivalSpeed="13.90" duration="168.25" routeLength="1997.01" waitingTime="15.00" waitingCount="1" stopTime="0.00" timeLoss="24.57" rerouteNo="1" devices="tripinfo_car_e2w_227 routing_car_e2w_227" vType="Car" speedFactor="1.00" vaporized=""/>
    <tripinfo id="car_w2e_232" depart="232.00" departLane="w2sep_1" departPos="3.60" departPosLat="0.00" departSpeed="13.90" departDelay="0.00" arrival="397.45" arrivalLane="c2e_1" arrivalPos="990.00" arrivalPosLat="0.00" arrivalSpeed="13.90" duration="165.45" routeLength="1997.01" waitingTime="11.05" waitingCount="1" stopTime="0.00" timeLoss="21.74" rerouteNo="1" devices="tripinfo_car_w2e_232 routing_car_w2e_232" vType="Car" speedFactor="1.00" vaporized=""/>
    <tripinfo id="car_e2n_228" depart="228.45" departLane="e2sep_1" departPos="3.60" departPosLat="0.00" departSpeed="13.90" departDelay="0.45" arrival="398.15" arrivalLane="c2n_1" arrivalPos="990.00" arrivalPosLat="0.00" arrivalSpeed="13.90" duration="169.70" routeLength="1986.69" waitingTime="12.45" waitingCount="1" stopTime="0.00" timeLoss="26.04" rerouteNo="1" devices="tripinfo_car_e2n_228 routing_car_e2n_228" vType="Car" speedFactor="1.00" vaporized=""/>
    <tripinfo id="car_w2s_237" depart="237.00" departLane="w2sep_1" departPos="3.60" departPosLat="0.00" departSpeed="13.90" departDelay="0.00" arrival="399.45" arrivalLane="c2s_1" arrivalPos="990.00" arrivalPosLat="0.00" arrivalSpeed="14.09" duration="162.45" routeLength="1986.69" waitingTime="7.85" waitingCount="1" stopTime="0.00" timeLoss="20.74" rerouteNo="1" devices="tripinfo_car_w2s_237 routing_car_w2s_237" vType="Car" speedFactor="1.01" vaporized=""/>
    <tripinfo id="car_w2e_241" depart="241.00" departLane="w2sep_1" departPos="3.60" departPosLat="0.00" departSpeed="13.90" departDelay="0.00" arrival="400.20" arrivalLane="c2e_1" arrivalPos="990.00" arrivalPosLat="0.00" arrivalSpeed="14.67" duration="159.20" routeLength="1997.01" waitingTime="6.55" waitingCount="1" stopTime="0.00" timeLoss="24.24" rerouteNo="1" devices="tripinfo_car_w2e_241 routing_car_w2e_241" vType="Car" speedFactor="1.06" vaporized=""/>
    <tripinfo id="car_e2n_249" depart="249.00" departLane="e2sep_1" departPos="3.60" departPosLat="0.00" departSpeed="13.90" departDelay="0.00" arrival="400.40" arrivalLane="c2n_1" arrivalPos="990.00" arrivalPosLat="0.00" arrivalSpeed="14.94" duration="151.40" routeLength="1986.69" waitingTime="1.35" waitingCount="1" stopTime="0.00" timeLoss="20.61" rerouteNo="1" devices="tripinfo_car_e2n_249 routing_car_e2n_249" vType="Car" speedFactor="1.10" vaporized=""/>
    <tripinfo id="car_w2n_197" depart="197.00" departLane="w2sep_1" departPos="3.60" departPosLat="0.00" departSpeed="13.90" departDelay="0.00" arrival="404.30" arrivalLane="c2n_1" arrivalPos="990.00" arrivalPosLat="0.00" arrivalSpeed="14.11" duration="207.30" routeLength="1996.47" waitingTime="52.15" waitingCount="2" stopTime="0.00" timeLoss="65.32" rerouteNo="1" devices="tripinfo_car_w2n_197 routing_car_w2n_197" vType="Car" speedFactor="1.02" vaporized=""/>
    <tripinfo id="car_w2s_270" depart="270.00" departLane="w2sep_1" departPos="3.60" departPosLat="0.00" departSpeed="13.90" departDelay="0.00" arrival="405.20" arrivalLane="c2s_1" arrivalPos="990.00" arrivalPosLat="0.00" arrivalSpeed="15.33" duration="135.20" routeLength="1986.69" waitingTime="0.00" waitingCount="0" stopTime="0.00" timeLoss="5.00" rerouteNo="1" devices="tripinfo_car_w2s_270 routing_car_w2s_270" vType="Car" speedFactor="1.10" vaporized=""/>
    <tripinfo id="car_w2e_259" depart="259.00" departLane="w2sep_1" departPos="3.60" departPosLat="0.00" departSpeed="13.90" departDelay="0.00" arrival="405.25" arrivalLane="c2e_1" arrivalPos="990.00" arrivalPosLat="0.00" arrivalSpeed="13.94" duration="146.25" routeLength="1997.01" waitingTime="0.00" waitingCount="0" stopTime="0.00" timeLoss="2.99" rerouteNo="1" devices="tripinfo_car_w2e_259 routing_car_w2e_259" vType="Car" speedFactor="1.00" vaporized=""/>
    <tripinfo id="car_w2n_208" depart="208.00" departLane="w2sep_1" departPos="3.60" departPosLat="0.00" departSpeed="13.90" departDelay="0.00" arrival="406.55" arrivalLane="c2n_1" arrivalPos="990.00" arrivalPosLat="0.00" arrivalSpeed="14.86" duration="198.55" routeLength="1996.47" waitingTime="43.40" waitingCount="2" stopTime="0.00" timeLoss="66.26" rerouteNo="1" devices="tripinfo_car_w2n_208 routing_car_w2n_208" vType="Car" speedFactor="1.09" vaporized=""/>
    <tripinfo id="car_w2n_248" depart="248.00" departLane="w2sep_1" departPos="3.60" departPosLat="0.00" departSpeed="13.90" departDelay="0.00" arrival="410.00" arrivalLane="c2n_1" arrivalPos="990.00" arrivalPosLat="0.00" arrivalSpeed="14.10" duration="162.00" routeLength="1996.47" waitingTime="4.85" waitingCount="1" stopTime="0.00" timeLoss="20.06" rerouteNo="1" devices="tripinfo_car_w2n_248 routing_car_w2n_248" vType="Car" speedFactor="1.02" vaporized=""/>
    <tripinfo id="car_w2e_272" depart="272.00" departLane="w2sep_1" departPos="3.60" departPosLat="0.00" departSpeed="13.90" departDelay="0.00" arrival="413.10" arrivalLane="c2e_1" arrivalPos="990.00" arrivalPosLat="1.10" arrivalSpeed="14.34" duration="141.10" routeLength="1997.01" waitingTime="0.00" waitingCount="0" stopTime="0.00" timeLoss="1.77" rerouteNo="1" devices="tripinfo_car_w2e_272 routing_car_w2e_272" vType="Car@car_w2e_272" speedFactor="1.03" vaporized=""/>
    <tripinfo id="car_e2s_235" depart="235.00" departLane="e2sep_1" departPos="3.60" departPosLat="0.00" departSpeed="13.90" departDelay="0.00" arrival="413.90" arrivalLane="c2s_1" arrivalPos="990.00" arrivalPosLat="0.00" arrivalSpeed="14.91" duration="178.90" routeLength="1996.47" waitingTime="29.85" waitingCount="3" stopTime="0.00" timeLoss="44.35" rerouteNo="1" devices="tripinfo_car_e2s_235 routing_car_e2s_235" vType="Car" speedFactor="1.07" vaporized=""/>
    <tripinfo id="amb_w2e_300" depart="300.00" departLane="w2sep_1" departPos="6.60" departPosLat="0.00" departSpeed="13.90" departDelay="0.00" arrival="414.55" arrivalLane="c2e_1" arrivalPos="990.00" arrivalPosLat="0.00" arrivalSpeed="16.92" duration="114.55" routeLength="1994.01" waitingTime="0.00" waitingCount="0" stopTime="0.00" timeLoss="18.88" rerouteNo="1" devices="tripinfo_amb_w2e_300 routing_amb_w2e_300 bluelight_amb_w2e_300 fcd_amb_w2e_300" vType="Ambulance" speedFactor="1.50" vaporized="">
        <example_device customValue1="0.00" customValue2="-1.00"/>
    </tripinfo>
    <tripinfo id="car_e2s_255" depart="255.00" departLane="e2sep_1" departPos="3.60" departPosLat="0.00" departSpeed="13.90" departDelay="0.00" arrival="417.30" arrivalLane="c2s_1" arrivalPos="990.00" arrivalPosLat="0.00" arrivalSpeed="15.19" duration="162.30" routeLength="1996.47" waitingTime="18.70" waitingCount="1" stopTime="0.00" timeLoss="30.67" rerouteNo="1" devices="tripinfo_car_e2s_255 routing_car_e2s_255" vType="Car" speedFactor="1.10" vaporized=""/>
    <tripinfo id="car_e2w_287" depart="287.00" departLane="e2sep_1" departPos="3.60" departPosLat="0.00" departSpeed="13.90" departDelay="0.00" arrival="433.15" arrivalLane="c2w_1" arrivalPos="990.00" arrivalPosLat="0.00" arrivalSpeed="15.55" duration="146.15" routeLength="1997.01" waitingTime="8.45" waitingCount="1" stopTime="0.00" timeLoss="17.68" rerouteNo="1" devices="tripinfo_car_e2w_287 routing_car_e2w_287" vType="Car" speedFactor="1.12" vaporized=""/>
    <tripinfo id="bus_w2n_289" depart="289.00" departLane="w2sep_1" departPos="12.10" departPosLat="0.00" departSpeed="13.90" departDelay="0.00" arrival="437.95" arrivalLane="c2n_1" arrivalPos="990.00" arrivalPosLat="0.00" arrivalSpeed="13.90" duration="148.95" routeLength="1987.97" waitingTime="0.00" waitingCount="0" stopTime="0.00" timeLoss="5.21" rerouteNo="1" devices="tripinfo_bus_w2n_289 routing_bus_w2n_289" vType="Bus" speedFactor="1.00" vaporized=""/>
    <tripinfo id="car_e2s_257" depart="257.00" departLane="e2sep_1" departPos="3.60" departPosLat="0.00" departSpeed="13.90" departDelay="0.00" arrival="439.35" arrivalLane="c2s_1" arrivalPos="990.00" arrivalPosLat="0.00" arrivalSpeed="13.96" duration="182.35" routeLength="1996.47" waitingTime="27.55" waitingCount="1" stopTime="0.00" timeLoss="38.68" rerouteNo="1" devices="tripinfo_car_e2s_257 routing_car_e2s_257" vType="Car" speedFactor="1.00" vaporized=""/>
    <tripinfo id="car_e2n_291" depart="291.00" departLane="e2sep_1" departPos="3.60" departPosLat="0.00" departSpeed="13.90" departDelay="0.00" arrival="443.00" arrivalLane="c2n_1" arrivalPos="990.00" arrivalPosLat="0.00" arrivalSpeed="14.01" duration="152.00" routeLength="1986.69" waitingTime="0.00" waitingCount="0" stopTime="0.00" timeLoss="9.50" rerouteNo="1" devices="tripinfo_car_e2n_291 routing_car_e2n_291" vType="Car" speedFactor="1.01" vaporized=""/>
    <tripinfo id="car_s2e_255" depart="257.75" departLane="s2sep_1" departPos="3.60" departPosLat="0.00" departSpeed="13.90" departDelay="2.75" arrival="449.60" arrivalLane="c2e_1" arrivalPos="990.00" arrivalPosLat="0.00" arrivalSpeed="15.23" duration="191.85" routeLength="1986.69" waitingTime="44.85" waitingCount="1" stopTime="0.00" timeLoss="60.74" rerouteNo="1" devices="tripinfo_car_s2e_255 routing_car_s2e_255" vType="Car" speedFactor="1.10" vaporized=""/>
    <tripinfo id="car_n2s_268" depart="268.00" departLane="n2sep_1" departPos="3.60" departPosLat="0.00" departSpeed="13.90" departDelay="0.00" arrival="453.30" arrivalLane="c2s_1" arrivalPos="990.00" arrivalPosLat="0.00" arrivalSpeed="14.89" duration="185.30" routeLength="1997.01" waitingTime="42.35" waitingCount="1" stopTime="0.00" timeLoss="51.14" rerouteNo="1" devices="tripinfo_car_n2s_268 routing_car_n2s_268" vType="Car" speedFactor="1.07" vaporized=""/>
    <tripinfo id="car_s2e_295" depart="295.00" departLane="s2sep_1" departPos="3.60" departPosLat="0.00" departSpeed="13.90" departDelay="0.00" arrival="455.10" arrivalLane="c2e_1" arrivalPos="990.00" arrivalPosLat="0.00" arrivalSpeed="14.85" duration="160.10" routeLength="1986.69" waitingTime="15.20" waitingCount="1" stopTime="0.00" timeLoss="25.62" rerouteNo="1" devices="tripinfo_car_s2e_295 routing_car_s2e_295" vType="Car" speedFactor="1.07" vaporized=""/>
    <tripinfo id="car_s2n_327" depart="327.30" departLane="s2sep_1" departPos="3.60" departPosLat="0.00" departSpeed="13.90" departDelay="0.30" arrival="455.45" arrivalLane="c2n_1" arrivalPos="990.00" arrivalPosLat="0.00" arrivalSpeed="16.18" duration="128.15" routeLength="1997.01" waitingTime="0.00" waitingCount="0" stopTime="0.00" timeLoss="4.74" rerouteNo="1" devices="tripinfo_car_s2n_327 routing_car_s2n_327" vType="Car" speedFactor="1.16" vaporized=""/>
    <tripinfo id="car_n2w_243" depart="243.00" departLane="n2sep_1" departPos="3.60" departPosLat="0.00" departSpeed="13.90" departDelay="0.00" arrival="455.70" arrivalLane="c2w_1" arrivalPos="990.00" arrivalPosLat="0.00" arrivalSpeed="13.90" duration="212.70" routeLength="1986.69" waitingTime="62.15" waitingCount="1" stopTime="0.00" timeLoss="69.02" rerouteNo="1" devices="tripinfo_car_n2w_243 routing_car_n2w_243" vType="Car" speedFactor="1.00" vaporized=""/>
    <tripinfo id="car_s2e_304" depart="304.00" departLane="s2sep_1" departPos="3.60" departPosLat="0.00" departSpeed="13.90" departDelay="0.00" arrival="457.00" arrivalLane="c2e_1" arrivalPos="990.00" arrivalPosLat="0.00" arrivalSpeed="16.23" duration="153.00" routeLength="1986.69" waitingTime="14.15" waitingCount="1" stopTime="0.00" timeLoss="35.78" rerouteNo="1" devices="tripinfo_car_s2e_304 routing_car_s2e_304" vType="Car" speedFactor="1.23" vaporized=""/>
    <tripinfo id="car_n2s_281" depart="281.00" departLane="n2sep_1" departPos="3.60" departPosLat="0.00" departSpeed="13.90" departDelay="0.00" arrival="459.00" arrivalLane="c2s_1" arrivalPos="990.00" arrivalPosLat="0.00" arrivalSpeed="14.74" duration="178.00" routeLength="1997.01" waitingTime="29.80" waitingCount="1" stopTime="0.00" timeLoss="42.58" rerouteNo="1" devices="tripinfo_car_n2s_281 routing_car_n2s_281" vType="Car" speedFactor="1.06" vaporized=""/>
    <tripinfo id="car_n2w_269" depart="269.35" departLane="n2sep_1" departPos="3.60" departPosLat="0.00" departSpeed="13.90" departDelay="0.35" arrival="461.30" arrivalLane="c2w_1" arrivalPos="990.00" arrivalPosLat="0.00" arrivalSpeed="13.90" duration="191.95" routeLength="1986.69" waitingTime="36.45" waitingCount="1" stopTime="0.00" timeLoss="48.29" rerouteNo="1" devices="tripinfo_car_n2w_269 routing_car_n2w_269" vType="Car" speedFactor="1.00" vaporized=""/>
    <tripinfo id="car_n2s_282" depart="282.40" departLane="n2sep_1" departPos="3.60" departPosLat="0.00" departSpeed="13.90" departDelay="0.40" arrival="463.95" arrivalLane="c2s_1" arrivalPos="990.00" arrivalPosLat="0.00" arrivalSpeed="14.34" duration="181.55" routeLength="1997.01" waitingTime="27.10" waitingCount="1" stopTime="0.00" timeLoss="42.34" rerouteNo="1" devices="tripinfo_car_n2s_282 routing_car_n2s_282" vType="Car" speedFactor="1.03" vaporized=""/>
    <tripinfo id="car_s2e_332" depart="332.00" departLane="s2sep_1" departPos="3.60" departPosLat="0.00" departSpeed="13.90" departDelay="0.00" arrival="465.15" arrivalLane="c2e_1" arrivalPos="990.00" arrivalPosLat="0.00" arrivalSpeed="15.69" duration="133.15" routeLength="1986.69" waitingTime="0.00" waitingCount="0" stopTime="0.00" timeLoss="5.92" rerouteNo="1" devices="tripinfo_car_s2e_332 routing_car_s2e_332" vType="Car" speedFactor="1.13" vaporized=""/>
    <tripinfo id="car_s2w_254" depart="254.00" departLane="s2sep_1" departPos="3.60" departPosLat="0.00" departSpeed="13.90" departDelay="0.00" arrival="467.00" arrivalLane="c2w_1" arrivalPos="990.00" arrivalPosLat="0.00" arrivalSpeed="14.02" duration="213.00" routeLength="1996.47" waitingTime="58.40" waitingCount="2" stopTime="0.00" timeLoss="69.98" rerouteNo="1" devices="tripinfo_car_s2w_254 routing_car_s2w_254" vType="Car" speedFactor="1.01" vaporized=""/>
    <tripinfo id="car_n2e_257" depart="257.00" departLane="n2sep_1" departPos="3.60" departPosLat="0.00" departSpeed="13.90" departDelay="0.00" arrival="468.20" arrivalLane="c2e_1" arrivalPos="990.00" arrivalPosLat="0.00" arrivalSpeed="16.26" duration="211.20" routeLength="1996.47" waitingTime="73.75" waitingCount="3" stopTime="0.00" timeLoss="88.58" rerouteNo="1" devices="tripinfo_car_n2e_257 routing_car_n2e_257" vType="Car" speedFactor="1.18" vaporized=""/>
    <tripinfo id="car_n2w_333" depart="333.00" departLane="n2sep_1" departPos="3.60" departPosLat="0.00" departSpeed="13.90" departDelay="0.00" arrival="471.25" arrivalLane="c2w_1" arrivalPos="990.00" arrivalPosLat="0.00" arrivalSpeed="15.03" duration="138.25" routeLength="1986.69" waitingTime="0.00" waitingCount="0" stopTime="0.00" timeLoss="5.54" rerouteNo="1" devices="tripinfo_car_n2w_333 routing_car_n2w_333" vType="Car" speedFactor="1.08" vaporized=""/>
    <tripinfo id="car_n2e_276" depart="276.00" departLane="n2sep_1" departPos="3.60" departPosLat="0.00" departSpeed="13.90" departDelay="0.00" arrival="477.30" arrivalLane="c2e_1" arrivalPos="990.00" arrivalPosLat="0.00" arrivalSpeed="14.23" duration="201.30" routeLength="1996.47" waitingTime="45.50" waitingCount="2" stopTime="0.00" timeLoss="60.28" rerouteNo="1" devices="tripinfo_car_n2e_276 routing_car_n2e_276" vType="Car" speedFactor="1.02" vaporized=""/>
</tripinfos>
