<?xml version="1.0" encoding="UTF-8"?>

<!-- generated on Sat Apr 24 18:08:56 2021 by Eclipse SUMO Version 1.4.0
<configuration xmlns:xsi="http://www.w3.org/2001/XMLSchema-instance" xsi:noNamespaceSchemaLocation="http://sumo.dlr.de/xsd/sumoConfiguration.xsd">

    <input>
        <net-file value="sumofiles/junction.net.xml"/>
        <route-files value="sumofiles/junction_preemption_91.rou.xml"/>
        <additional-files value="sumofiles/junction.det.xml"/>
    </input>

    <output>
        <tripinfo-output value="sumofiles/output/tripinfo_preemption_91.xml"/>
    </output>

    <time>
        <begin value="0"/>
        <end value="10000"/>
        <step-length value="0.05"/>
    </time>

    <processing>
        <lateral-resolution value="0.1"/>
    </processing>

    <report>
        <no-warnings value="true"/>
        <error-log value="sumofiles/output/errorlog_preemption_91.log"/>
        <no-step-log value="true"/>
    </report>

    <traci_server>
        <remote-port value="36931"/>
    </traci_server>

    <gui_only>
        <gui-settings-file value="sumofiles/junction-gui.settings.xml"/>
        <tracker-interval value="0.05"/>
    </gui_only>

</configuration>
-->

<tripinfos xmlns:xsi="http://www.w3.org/2001/XMLSchema-instance" xsi:noNamespaceSchemaLocation="http://sumo.dlr.de/xsd/tripinfo_file.xsd">
    <tripinfo id="car_s2n_14" depart="14.00" departLane="s2sep_1" departPos="3.60" departPosLat="0.00" departSpeed="13.90" departDelay="0.00" arrival="161.75" arrivalLane="c2n_1" arrivalPos="990.00" arrivalPosLat="0.00" arrivalSpeed="14.73" duration="147.75" routeLength="1997.01" waitingTime="4.75" waitingCount="1" stopTime="0.00" timeLoss="12.20" rerouteNo="1" devices="tripinfo_car_s2n_14 routing_car_s2n_14" vType="Car" speedFactor="1.06" vaporized=""/>
    <tripinfo id="car_n2w_21" depart="21.00" departLane="n2sep_1" departPos="3.60" departPosLat="0.00" departSpeed="13.90" departDelay="0.00" arrival="164.60" arrivalLane="c2w_1" arrivalPos="990.00" arrivalPosLat="0.00" arrivalSpeed="14.32" duration="143.60" routeLength="1986.69" waitingTime="0.00" waitingCount="0" stopTime="0.00" timeLoss="4.14" rerouteNo="1" devices="tripinfo_car_n2w_21 routing_car_n2w_21" vType="Car" speedFactor="1.03" vaporized=""/>
    <tripinfo id="car_s2e_14" depart="15.35" departLane="s2sep_1" departPos="3.60" departPosLat="0.00" departSpeed="13.90" departDelay="1.35" arrival="167.15" arrivalLane="c2e_1" arrivalPos="990.00" arrivalPosLat="0.00" arrivalSpeed="14.04" duration="151.80" routeLength="1986.69" waitingTime="0.00" waitingCount="0" stopTime="0.00" timeLoss="9.61" rerouteNo="1" devices="tripinfo_car_s2e_14 routing_car_s2e_14" vType="Car" speedFactor="1.01" vaporized=""/>
    <tripinfo id="car_s2n_25" depart="25.00" departLane="s2sep_1" departPos="3.60" departPosLat="0.00" departSpeed="13.90" departDelay="0.00" arrival="167.30" arrivalLane="c2n_1" arrivalPos="990.00" arrivalPosLat="0.00" arrivalSpeed="14.53" duration="142.30" routeLength="1997.01" waitingTime="0.00" waitingCount="0" stopTime="0.00" timeLoss="4.92" rerouteNo="1" devices="tripinfo_car_s2n_25 routing_car_s2n_25" vType="Car" speedFactor="1.05" vaporized=""/>
    <tripinfo id="car_s2w_17" depart="17.15" departLane="s2sep_1" departPos="3.60" departPosLat="0.00" departSpeed="13.90" departDelay="0.15" arrival="167.45" arrivalLane="c2w_1" arrivalPos="990.00" arrivalPosLat="0.00" arrivalSpeed="14.94" duration="150.30" routeLength="1996.47" waitingTime="0.00" waitingCount="0" stopTime="0.00" timeLoss="16.98" rerouteNo="1" devices="tripinfo_car_s2w_17 routing_car_s2w_17" vType="Car" speedFactor="1.08" vaporized=""/>
    <tripinfo id="car_n2e_14" depart="14.00" departLane="n2sep_1" departPos="3.60" departPosLat="0.00" departSpeed="13.90" departDelay="0.00" arrival="170.50" arrivalLane="c2e_1" arrivalPos="990.00" arrivalPosLat="0.00" arrivalSpeed="14.68" duration="156.50" routeLength="1996.47" waitingTime="7.05" waitingCount="2" stopTime="0.00" timeLoss="20.32" rerouteNo="1" devices="tripinfo_car_n2e_14 routing_car_n2e_14" vType="Car" speedFactor="1.06" vaporized=""/>
    <tripinfo id="car_s2n_41" depart="41.00" departLane="s2sep_1" departPos="3.60" departPosLat="0.00" departSpeed="13.90" departDelay="0.00" arrival="173.60" arrivalLane="c2n_1" arrivalPos="990.00" arrivalPosLat="0.00" arrivalSpeed="15.16" duration="132.60" routeLength="1997.01" waitingTime="0.00" waitingCount="0" stopTime="0.00" timeLoss="0.88" rerouteNo="1" devices="tripinfo_car_s2n_41 routing_car_s2n_41" vType="Car" speedFactor="1.09" vaporized=""/>
    <tripinfo id="car_n2e_26" depart="26.00" departLane="n2sep_1" departPos="3.60" departPosLat="0.00" departSpeed="13.90" departDelay="0.00" arrival="175.55" arrivalLane="c2e_1" arrivalPos="990.00" arrivalPosLat="0.00" arrivalSpeed="14.04" duration="149.55" routeLength="1996.47" waitingTime="0.00" waitingCount="0" stopTime="0.00" timeLoss="6.70" rerouteNo="1" devices="tripinfo_car_n2e_26 routing_car_n2e_26" vType="Car" speedFactor="1.01" vaporized=""/>
    <tripinfo id="car_n2s_43" depart="43.00" departLane="n2sep_1" departPos="3.60" departPosLat="0.00" departSpeed="13.90" departDelay="0.00" arrival="183.15" arrivalLane="c2s_1" arrivalPos="990.00" arrivalPosLat="0.00" arrivalSpeed="14.27" duration="140.15" routeLength="1997.01" waitingTime="0.00" waitingCount="0" stopTime="0.00" timeLoss="0.14" rerouteNo="1" devices="tripinfo_car_n2s_43 routing_car_n2s_43" vType="Car" speedFactor="1.03" vaporized=""/>
    <tripinfo id="car_n2s_44" depart="44.40" departLane="n2sep_1" departPos="3.60" departPosLat="0.00" departSpeed="13.90" departDelay="0.40" arrival="185.45" arrivalLane="c2s_1" arrivalPos="990.00" arrivalPosLat="0.00" arrivalSpeed="15.29" duration="141.05" routeLength="1997.01" waitingTime="0.00" waitingCount="0" stopTime="0.00" timeLoss="13.07" rerouteNo="1" devices="tripinfo_car_n2s_44 routing_car_n2s_44" vType="Car" speedFactor="1.12" vaporized=""/>
    <tripinfo id="car_s2n_46" depart="46.00" departLane="s2sep_1" departPos="3.60" departPosLat="0.00" departSpeed="13.90" departDelay="0.00" arrival="190.05" arrivalLane="c2n_1" arrivalPos="990.00" arrivalPosLat="0.00" arrivalSpeed="13.90" duration="144.05" routeLength="1997.01" waitingTime="0.00" waitingCount="0" stopTime="0.00" timeLoss="0.37" rerouteNo="1" devices="tripinfo_car_s2n_46 routing_car_s2n_46" vType="Car" speedFactor="1.00" vaporized=""/>
    <tripinfo id="car_e2w_26" depart="26.00" departLane="e2sep_1" departPos="3.60" departPosLat="0.00" departSpeed="13.90" departDelay="0.00" arrival="205.40" arrivalLane="c2w_1" arrivalPos="990.00" arrivalPosLat="0.00" arrivalSpeed="15.05" duration="179.40" routeLength="1997.01" waitingTime="39.20" waitingCount="1" stopTime="0.00" timeLoss="46.68" rerouteNo="1" devices="tripinfo_car_e2w_26 routing_car_e2w_26" vType="Car" speedFactor="1.08" vaporized=""/>
    <tripinfo id="car_w2s_24" depart="24.00" departLane="w2sep_1" departPos="3.60" departPosLat="0.00" departSpeed="13.90" departDelay="0.00" arrival="210.65" arrivalLane="c2s_1" arrivalPos="990.00" arrivalPosLat="0.00" arrivalSpeed="13.90" duration="186.65" routeLength="1986.69" waitingTime="36.05" waitingCount="1" stopTime="0.00" timeLoss="42.97" rerouteNo="1" devices="tripinfo_car_w2s_24 routing_car_w2s_24" vType="Car" speedFactor="1.00" vaporized=""/>
    <tripinfo id="car_w2n_56" depart="56.00" departLane="w2sep_1" departPos="3.60" departPosLat="0.00" departSpeed="13.90" departDelay="0.00" arrival="212.80" arrivalLane="c2n_1" arrivalPos="990.00" arrivalPosLat="0.00" arrivalSpeed="13.90" duration="156.80" routeLength="1996.47" waitingTime="1.75" waitingCount="1" stopTime="0.00" timeLoss="12.48" rerouteNo="1" devices="tripinfo_car_w2n_56 routing_car_w2n_56" vType="Car" speedFactor="1.00" vaporized=""/>
    <tripinfo id="car_w2s_28" depart="28.00" departLane="w2sep_1" departPos="3.60" departPosLat="0.00" departSpeed="13.90" departDelay="0.00" arrival="214.05" arrivalLane="c2s_1" arrivalPos="990.00" arrivalPosLat="0.00" arrivalSpeed="14.28" duration="186.05" routeLength="1986.69" waitingTime="33.55" waitingCount="1" stopTime="0.00" timeLoss="46.61" rerouteNo="1" devices="tripinfo_car_w2s_28 routing_car_w2s_28" vType="Car" speedFactor="1.03" vaporized=""/>
    <tripinfo id="car_w2e_50" depart="50.00" departLane="w2sep_1" departPos="3.60" departPosLat="0.00" departSpeed="13.90" departDelay="0.00" arrival="215.10" arrivalLane="c2e_1" arrivalPos="990.00" arrivalPosLat="0.00" arrivalSpeed="13.90" duration="165.10" routeLength="1997.01" waitingTime="12.00" waitingCount="1" stopTime="0.00" timeLoss="21.42" rerouteNo="1" devices="tripinfo_car_w2e_50 routing_car_w2e_50" vType="Car" speedFactor="1.00" vaporized=""/>
    <tripinfo id="car_e2w_75" depart="75.00" departLane="e2sep_1" departPos="3.60" departPosLat="0.00" departSpeed="13.90" departDelay="0.00" arrival="219.10" arrivalLane="c2w_1" arrivalPos="990.00" arrivalPosLat="0.00" arrivalSpeed="13.90" duration="144.10" routeLength="1997.01" waitingTime="0.00" waitingCount="0" stopTime="0.00" timeLoss="0.41" rerouteNo="1" devices="tripinfo_car_e2w_75 routing_car_e2w_75" vType="Car" speedFactor="1.00" vaporized=""/>
    <tripinfo id="bus_w2e_50" depart="52.05" departLane="w2sep_1" departPos="12.10" departPosLat="0.00" departSpeed="13.90" departDelay="2.05" arrival="220.30" arrivalLane="c2e_1" arrivalPos="990.00" arrivalPosLat="0.00" arrivalSpeed="13.87" duration="168.25" routeLength="1988.51" waitingTime="10.55" waitingCount="1" stopTime="0.00" timeLoss="25.20" rerouteNo="1" devices="tripinfo_bus_w2e_50 routing_bus_w2e_50" vType="Bus" speedFactor="1.00" vaporized=""/>
    <tripinfo id="car_e2s_43" depart="43.00" departLane="e2sep_1" departPos="3.60" departPosLat="0.00" departSpeed="13.90" departDelay="0.00" arrival="222.70" arrivalLane="c2s_1" arrivalPos="990.00" arrivalPosLat="0.00" arrivalSpeed="14.55" duration="179.70" routeLength="1996.47" waitingTime="30.40" waitingCount="2" stopTime="0.00" timeLoss="41.84" rerouteNo="1" devices="tripinfo_car_e2s_43 routing_car_e2s_43" vType="Car" speedFactor="1.05" vaporized=""/>
    <tripinfo id="car_w2e_70" depart="70.00" departLane="w2sep_1" departPos="3.60" departPosLat="0.00" departSpeed="13.90" departDelay="0.00" arrival="224.00" arrivalLane="c2e_1" arrivalPos="990.00" arrivalPosLat="0.00" arrivalSpeed="14.22" duration="154.00" routeLength="1997.01" waitingTime="0.00" waitingCount="0" stopTime="0.00" timeLoss="14.00" rerouteNo="1" devices="tripinfo_car_w2e_70 routing_car_w2e_70" vType="Car" speedFactor="1.03" vaporized=""/>
    <tripinfo id="car_e2w_77" depart="77.00" departLane="e2sep_1" departPos="3.60" departPosLat="0.00" departSpeed="13.90" departDelay="0.00" arrival="224.35" arrivalLane="c2w_1" arrivalPos="990.00" arrivalPosLat="0.00" arrivalSpeed="13.90" duration="147.35" routeLength="1997.01" waitingTime="0.00" waitingCount="0" stopTime="0.00" timeLoss="3.67" rerouteNo="1" devices="tripinfo_car_e2w_77 routing_car_e2w_77" vType="Car" speedFactor="1.00" vaporized=""/>
    <tripinfo id="car_w2e_82" depart="82.00" departLane="w2sep_1" departPos="3.60" departPosLat="0.00" departSpeed="13.90" departDelay="0.00" arrival="226.00" arrivalLane="c2e_1" arrivalPos="990.00" arrivalPosLat="0.00" arrivalSpeed="15.17" duration="144.00" routeLength="1997.01" waitingTime="0.00" waitingCount="0" stopTime="0.00" timeLoss="17.04" rerouteNo="1" devices="tripinfo_car_w2e_82 routing_car_w2e_82" vType="Car" speedFactor="1.13" vaporized=""/>
    <tripinfo id="car_e2s_48" depart="48.00" departLane="e2sep_1" departPos="3.60" departPosLat="0.00" departSpeed="13.90" departDelay="0.00" arrival="226.90" arrivalLane="c2s_1" arrivalPos="990.00" arrivalPosLat="0.00" arrivalSpeed="14.52" duration="178.90" routeLength="1996.47" waitingTime="24.70" waitingCount="2" stopTime="0.00" timeLoss="40.89" rerouteNo="1" devices="tripinfo_car_e2s_48 routing_car_e2s_48" vType="Car" speedFactor="1.05" vaporized=""/>
    <tripinfo id="car_e2s_60" depart="60.00" departLane="e2sep_1" departPos="3.60" departPosLat="0.00" departSpeed="13.90" departDelay="0.00" arrival="228.95" arrivalLane="c2s_1" arrivalPos="990.00" arrivalPosLat="0.00" arrivalSpeed="15.58" duration="168.95" routeLength="1996.47" waitingTime="18.00" waitingCount="2" stopTime="0.00" timeLoss="44.33" rerouteNo="1" devices="tripinfo_car_e2s_60 routing_car_e2s_60" vType="Car" speedFactor="1.16" vaporized=""/>
    <tripinfo id="car_w2e_104" depart="104.00" departLane="w2sep_1" departPos="3.60" departPosLat="0.00" departSpeed="13.90" departDelay="0.00" arrival="229.40" arrivalLane="c2e_1" arrivalPos="990.00" arrivalPosLat="0.00" arrivalSpeed="16.03" duration="125.40" routeLength="1997.01" waitingTime="0.00" waitingCount="0" stopTime="0.00" timeLoss="1.33" rerouteNo="1" devices="tripinfo_car_w2e_104 routing_car_w2e_104" vType="Car" speedFactor="1.16" vaporized=""/>
    <tripinfo id="car_e2n_85" depart="85.00" departLane="e2sep_1" departPos="3.60" departPosLat="0.00" departSpeed="13.90" departDelay="0.00" arrival="232.10" arrivalLane="c2n_1" arrivalPos="990.00" arrivalPosLat="0.00" arrivalSpeed="13.97" duration="147.10" routeLength="1986.69" waitingTime="0.00" waitingCount="0" stopTime="0.00" timeLoss="4.15" rerouteNo="1" devices="tripinfo_car_e2n_85 routing_car_e2n_85" vType="Car" speedFactor="1.01" vaporized=""/>
    <tripinfo id="car_e2w_102" depart="102.00" departLane="e2sep_1" departPos="3.60" departPosLat="0.00" departSpeed="13.90" departDelay="0.00" arrival="233.65" arrivalLane="c2w_1" arrivalPos="990.00" arrivalPosLat="0.00" arrivalSpeed="15.32" duration="131.65" routeLength="1997.01" waitingTime="0.00" waitingCount="0" stopTime="0.00" timeLoss="1.30" rerouteNo="1" devices="tripinfo_car_e2w_102 routing_car_e2w_102" vType="Car" speedFactor="1.10" vaporized=""/>
    <tripinfo id="car_e2n_99" depart="99.00" departLane="e2sep_1" departPos="3.60" departPosLat="0.00" departSpeed="13.90" departDelay="0.00" arrival="233.95" arrivalLane="c2n_1" arrivalPos="990.00" arrivalPosLat="0.00" arrivalSpeed="15.53" duration="134.95" routeLength="1986.69" waitingTime="0.00" waitingCount="0" stopTime="0.00" timeLoss="13.14" rerouteNo="1" devices="tripinfo_car_e2n_99 routing_car_e2n_99" vType="Car" speedFactor="1.18" vaporized=""/>
    <tripinfo id="car_n2w_72" depart="72.00" departLane="n2sep_1" departPos="3.60" departPosLat="0.00" departSpeed="13.90" departDelay="0.00" arrival="252.55" arrivalLane="c2w_1" arrivalPos="990.00" arrivalPosLat="0.00" arrivalSpeed="14.55" duration="180.55" routeLength="1986.69" waitingTime="36.05" waitingCount="1" stopTime="0.00" timeLoss="43.32" rerouteNo="1" devices="tripinfo_car_n2w_72 routing_car_n2w_72" vType="Car" speedFactor="1.05" vaporized=""/>
    <tripinfo id="car_n2w_83" depart="83.45" departLane="n2sep_1" departPos="3.60" departPosLat="0.00" departSpeed="13.90" departDelay="0.45" arrival="254.55" arrivalLane="c2w_1" arrivalPos="990.00" arrivalPosLat="0.00" arrivalSpeed="15.81" duration="171.10" routeLength="1986.69" waitingTime="22.55" waitingCount="1" stopTime="0.00" timeLoss="49.22" rerouteNo="1" devices="tripinfo_car_n2w_83 routing_car_n2w_83" vType="Car" speedFactor="1.18" vaporized=""/>
    <tripinfo id="car_s2e_57" depart="57.00" departLane="s2sep_1" departPos="3.60" departPosLat="0.00" departSpeed="13.90" departDelay="0.00" arrival="255.65" arrivalLane="c2e_1" arrivalPos="990.00" arrivalPosLat="0.00" arrivalSpeed="13.90" duration="198.65" routeLength="1986.69" waitingTime="48.10" waitingCount="1" stopTime="0.00" timeLoss="54.96" rerouteNo="1" devices="tripinfo_car_s2e_57 routing_car_s2e_57" vType="Car" speedFactor="1.00" vaporized=""/>
    <tripinfo id="car_s2n_61" depart="61.00" departLane="s2sep_1" departPos="3.60" departPosLat="0.00" departSpeed="13.90" departDelay="0.00" arrival="256.60" arrivalLane="c2n_1" arrivalPos="990.00" arrivalPosLat="0.00" arrivalSpeed="14.15" duration="195.60" routeLength="1997.01" waitingTime="44.95" waitingCount="1" stopTime="0.00" timeLoss="54.45" rerouteNo="1" devices="tripinfo_car_s2n_61 routing_car_s2n_61" vType="Car" speedFactor="1.02" vaporized=""/>
    <tripinfo id="car_s2n_66" depart="66.00" departLane="s2sep_1" departPos="3.60" departPosLat="0.00" departSpeed="13.90" departDelay="0.00" arrival="259.10" arrivalLane="c2n_1" arrivalPos="990.00" arrivalPosLat="0.00" arrivalSpeed="14.97" duration="193.10" routeLength="1997.01" waitingTime="40.35" waitingCount="1" stopTime="0.00" timeLoss="61.37" rerouteNo="1" devices="tripinfo_car_s2n_66 routing_car_s2n_66" vType="Car" speedFactor="1.09" vaporized=""/>
    <tripinfo id="car_s2n_72" depart="72.00" departLane="s2sep_1" departPos="3.60" departPosLat="0.00" departSpeed="13.90" departDelay="0.00" arrival="261.35" arrivalLane="c2n_1" arrivalPos="990.00" arrivalPosLat="0.00" arrivalSpeed="15.29" duration="189.35" routeLength="1997.01" waitingTime="39.50" waitingCount="1" stopTime="0.00" timeLoss="61.41" rerouteNo="1" devices="tripinfo_car_s2n_72 routing_car_s2n_72" vType="Car" speedFactor="1.12" vaporized=""/>
    <tripinfo id="car_n2w_90" depart="90.00" departLane="n2sep_1" departPos="3.60" departPosLat="0.00" departSpeed="13.90" departDelay="0.00" arrival="261.60" arrivalLane="c2w_1" arrivalPos="990.00" arrivalPosLat="0.00" arrivalSpeed="13.90" duration="171.60" routeLength="1986.69" waitingTime="16.65" waitingCount="1" stopTime="0.00" timeLoss="27.94" rerouteNo="1" devices="tripinfo_car_n2w_90 routing_car_n2w_90" vType="Car" speedFactor="1.00" vaporized=""/>
    <tripinfo id="car_n2s_95" depart="95.00" departLane="n2sep_1" departPos="3.60" departPosLat="0.00" departSpeed="13.90" departDelay="0.00" arrival="262.45" arrivalLane="c2s_1" arrivalPos="990.00" arrivalPosLat="0.00" arrivalSpeed="13.90" duration="167.45" routeLength="1997.01" waitingTime="10.65" waitingCount="1" stopTime="0.00" timeLoss="23.78" rerouteNo="1" devices="tripinfo_car_n2s_95 routing_car_n2s_95" vType="Car" speedFactor="1.00" vaporized=""/>
    <tripinfo id="car_s2n_113" depart="113.00" departLane="s2sep_1" departPos="3.60" departPosLat="0.00" departSpeed="13.90" departDelay="0.00" arrival="264.75" arrivalLane="c2n_1" arrivalPos="990.00" arrivalPosLat="0.00" arrivalSpeed="14.47" duration="151.75" routeLength="1997.01" waitingTime="0.00" waitingCount="0" stopTime="0.00" timeLoss="14.05" rerouteNo="1" devices="tripinfo_car_s2n_113 routing_car_s2n_113" vType="Car" speedFactor="1.04" vaporized=""/>
    <tripinfo id="car_n2s_124" depart="125.45" departLane="n2sep_1" departPos="3.60" departPosLat="0.00" departSpeed="13.90" departDelay="1.45" arrival="264.85" arrivalLane="c2s_1" arrivalPos="990.00" arrivalPosLat="0.00" arrivalSpeed="15.91" duration="139.40" routeLength="1997.01" waitingTime="0.00" waitingCount="0" stopTime="0.00" timeLoss="16.45" rerouteNo="1" devices="tripinfo_car_n2s_124 routing_car_n2s_124" vType="Car" speedFactor="1.17" vaporized=""/>
    <tripinfo id="car_s2w_63" depart="63.00" departLane="s2sep_1" departPos="3.60" departPosLat="0.00" departSpeed="13.90" departDelay="0.00" arrival="266.05" arrivalLane="c2w_1" arrivalPos="990.00" arrivalPosLat="0.00" arrivalSpeed="14.03" duration="203.05" routeLength="1996.47" waitingTime="45.50" waitingCount="2" stopTime="0.00" timeLoss="60.18" rerouteNo="1" devices="tripinfo_car_s2w_63 routing_car_s2w_63" vType="Car" speedFactor="1.01" vaporized=""/>
    <tripinfo id="car_n2e_82" depart="82.00" departLane="n2sep_1" departPos="3.60" departPosLat="0.00" departSpeed="13.90" departDelay="0.00" arrival="266.60" arrivalLane="c2e_1" arrivalPos="990.00" arrivalPosLat="0.00" arrivalSpeed="13.90" duration="184.60" routeLength="1996.47" waitingTime="29.20" waitingCount="2" stopTime="0.00" timeLoss="40.28" rerouteNo="1" devices="tripinfo_car_n2e_82 routing_car_n2e_82" vType="Car" speedFactor="1.00" vaporized=""/>
    <tripinfo id="car_n2e_93" depart="93.00" departLane="n2sep_1" departPos="3.60" departPosLat="0.00" departSpeed="13.90" departDelay="0.00" arrival="270.20" arrivalLane="c2e_1" arrivalPos="990.00" arrivalPosLat="0.00" arrivalSpeed="14.14" duration="177.20" routeLength="1996.47" waitingTime="17.30" waitingCount="2" stopTime="0.00" timeLoss="35.68" rerouteNo="1" devices="tripinfo_car_n2e_93 routing_car_n2e_93" vType="Car" speedFactor="1.02" vaporized=""/>
    <tripinfo id="car_n2w_124" depart="124.00" departLane="n2sep_1" departPos="3.60" departPosLat="0.00" departSpeed="13.90" departDelay="0.00" arrival="272.15" arrivalLane="c2w_1" arrivalPos="990.00" arrivalPosLat="0.00" arrivalSpeed="13.90" duration="148.15" routeLength="1986.69" waitingTime="0.00" waitingCount="0" stopTime="0.00" timeLoss="4.46" rerouteNo="1" devices="tripinfo_car_n2w_124 routing_car_n2w_124" vType="Car" speedFactor="1.00" vaporized=""/>
    <tripinfo id="bus_s2n_130" depart="130.00" departLane="s2sep_1" departPos="12.10" departPosLat="0.00" departSpeed="13.90" departDelay="0.00" arrival="274.25" arrivalLane="c2n_1" arrivalPos="990.00" arrivalPosLat="0.00" arrivalSpeed="13.90" duration="144.25" routeLength="1988.51" waitingTime="0.00" waitingCount="0" stopTime="0.00" timeLoss="1.15" rerouteNo="1" devices="tripinfo_bus_s2n_130 routing_bus_s2n_130" vType="Bus" speedFactor="1.00" vaporized=""/>
    <tripinfo id="car_n2s_135" depart="135.00" departLane="n2sep_1" departPos="3.60" departPosLat="0.00" departSpeed="13.90" departDelay="0.00" arrival="279.65" arrivalLane="c2s_1" arrivalPos="990.00" arrivalPosLat="0.00" arrivalSpeed="14.23" duration="144.65" routeLength="1997.01" waitingTime="0.00" waitingCount="0" stopTime="0.00" timeLoss="4.28" rerouteNo="1" devices="tripinfo_car_n2s_135 routing_car_n2s_135" vType="Car" speedFactor="1.02" vaporized=""/>
    <tripinfo id="car_n2w_132" depart="132.00" departLane="n2sep_1" departPos="3.60" departPosLat="0.00" departSpeed="13.90" departDelay="0.00" arrival="280.10" arrivalLane="c2w_1" arrivalPos="990.00" arrivalPosLat="0.00" arrivalSpeed="13.90" duration="148.10" routeLength="1986.69" waitingTime="0.00" waitingCount="0" stopTime="0.00" timeLoss="4.44" rerouteNo="1" devices="tripinfo_car_n2w_132 routing_car_n2w_132" vType="Car" speedFactor="1.00" vaporized=""/>
    <tripinfo id="car_s2e_131" depart="131.45" departLane="s2sep_1" departPos="3.60" departPosLat="0.00" departSpeed="13.90" departDelay="0.45" arrival="281.90" arrivalLane="c2e_1" arrivalPos="990.00" arrivalPosLat="0.00" arrivalSpeed="13.90" duration="150.45" routeLength="1986.69" waitingTime="0.00" waitingCount="0" stopTime="0.00" timeLoss="6.80" rerouteNo="1" devices="tripinfo_car_s2e_131 routing_car_s2e_131" vType="Car" speedFactor="1.00" vaporized=""/>
    <tripinfo id="car_s2w_84" depart="84.00" departLane="s2sep_1" departPos="3.60" departPosLat="0.00" departSpeed="13.90" departDelay="0.00" arrival="282.15" arrivalLane="c2w_1" arrivalPos="990.00" arrivalPosLat="0.00" arrivalSpeed="15.46" duration="198.15" routeLength="1996.47" waitingTime="52.20" waitingCount="4" stopTime="0.00" timeLoss="73.10" rerouteNo="1" devices="tripinfo_car_s2w_84 routing_car_s2w_84" vType="Car" speedFactor="1.15" vaporized=""/>
    <tripinfo id="car_s2w_89" depart="89.00" departLane="s2sep_1" departPos="3.60" departPosLat="0.00" departSpeed="13.90" departDelay="0.00" arrival="284.25" arrivalLane="c2w_1" arrivalPos="990.00" arrivalPosLat="0.00" arrivalSpeed="15.83" duration="195.25" routeLength="1996.47" waitingTime="45.55" waitingCount="3" stopTime="0.00" timeLoss="72.10" rerouteNo="1" devices="tripinfo_car_s2w_89 routing_car_s2w_89" vType="Car" speedFactor="1.17" vaporized=""/>
    <tripinfo id="car_n2e_137" depart="137.00" departLane="n2sep_1" departPos="3.60" departPosLat="0.00" departSpeed="13.90" departDelay="0.00" arrival="285.65" arrivalLane="c2e_1" arrivalPos="990.00" arrivalPosLat="0.00" arrivalSpeed="15.01" duration="148.65" routeLength="1996.47" waitingTime="1.00" waitingCount="1" stopTime="0.00" timeLoss="15.31" rerouteNo="1" devices="tripinfo_car_n2e_137 routing_car_n2e_137" vType="Car" speedFactor="1.08" vaporized=""/>
    <tripinfo id="bus_s2n_142" depart="142.00" departLane="s2sep_1" departPos="12.10" departPosLat="0.00" departSpeed="13.90" departDelay="0.00" arrival="286.05" arrivalLane="c2n_1" arrivalPos="990.00" arrivalPosLat="0.00" arrivalSpeed="13.90" duration="144.05" routeLength="1988.51" waitingTime="0.00" waitingCount="0" stopTime="0.00" timeLoss="0.99" rerouteNo="1" devices="tripinfo_bus_s2n_142 routing_bus_s2n_142" vType="Bus" speedFactor="1.00" vaporized=""/>
    <tripinfo id="car_s2w_120" depart="120.00" departLane="s2sep_1" departPos="3.60" departPosLat="0.00" departSpeed="13.90" departDelay="0.00" arrival="292.60" arrivalLane="c2w_1" arrivalPos="990.00" arrivalPosLat="0.00" arrivalSpeed="14.04" duration="172.60" routeLength="1996.47" waitingTime="13.90" waitingCount="1" stopTime="0.00" timeLoss="29.75" rerouteNo="1" devices="tripinfo_car_s2w_120 routing_car_s2w_120" vType="Car" speedFactor="1.01" vaporized=""/>
    <tripinfo id="car_s2w_123" depart="123.00" departLane="s2sep_1" departPos="3.60" departPosLat="0.00" departSpeed="13.90" departDelay="0.00" arrival="297.25" arrivalLane="c2w_1" arrivalPos="990.00" arrivalPosLat="0.00" arrivalSpeed="13.89" duration="174.25" routeLength="1996.47" waitingTime="13.10" waitingCount="1" stopTime="0.00" timeLoss="29.91" rerouteNo="1" devices="tripinfo_car_s2w_123 routing_car_s2w_123" vType="Car" speedFactor="1.00" vaporized=""/>
    <tripinfo id="car_w2e_116" depart="116.00" departLane="w2sep_1" departPos="3.60" departPosLat="0.00" departSpeed="13.90" departDelay="0.00" arrival="297.30" arrivalLane="c2e_1" arrivalPos="990.00" arrivalPosLat="0.00" arrivalSpeed="15.12" duration="181.30" routeLength="1997.01" waitingTime="33.30" waitingCount="1" stopTime="0.00" timeLoss="49.22" rerouteNo="1" devices="tripinfo_car_w2e_116 routing_car_w2e_116" vType="Car" speedFactor="1.09" vaporized=""/>
    <tripinfo id="car_w2s_112" depart="112.00" departLane="w2sep_1" departPos="3.60" departPosLat="0.00" departSpeed="13.90" departDelay="0.00" arrival="299.40" arrivalLane="c2s_1" arrivalPos="990.00" arrivalPosLat="0.00" arrivalSpeed="14.15" duration="187.40" routeLength="1986.69" waitingTime="37.35" waitingCount="1" stopTime="0.00" timeLoss="46.31" rerouteNo="1" devices="tripinfo_car_w2s_112 routing_car_w2s_112" vType="Car" speedFactor="1.02" vaporized=""/>
    <tripinfo id="car_e2n_122" depart="122.00" departLane="e2sep_1" departPos="3.60" departPosLat="0.00" departSpeed="13.90" departDelay="0.00" arrival="300.70" arrivalLane="c2n_1" arrivalPos="990.00" arrivalPosLat="0.00" arrivalSpeed="13.90" duration="178.70" routeLength="1986.69" waitingTime="27.90" waitingCount="1" stopTime="0.00" timeLoss="35.05" rerouteNo="1" devices="tripinfo_car_e2n_122 routing_car_e2n_122" vType="Car" speedFactor="1.00" vaporized=""/>
    <tripinfo id="car_e2w_137" depart="137.00" departLane="e2sep_1" departPos="3.60" departPosLat="0.00" departSpeed="13.90" departDelay="0.00" arrival="300.95" arrivalLane="c2w_1" arrivalPos="990.00" arrivalPosLat="0.00" arrivalSpeed="15.51" duration="163.95" routeLength="1997.01" waitingTime="22.10" waitingCount="1" stopTime="0.00" timeLoss="35.56" rerouteNo="1" devices="tripinfo_car_e2w_137 routing_car_e2w_137" vType="Car" speedFactor="1.12" vaporized=""/>
    <tripinfo id="car_w2e_126" depart="126.00" departLane="w2sep_1" departPos="3.60" departPosLat="0.00" departSpeed="13.90" departDelay="0.00" arrival="301.15" arrivalLane="c2e_1" arrivalPos="990.00" arrivalPosLat="0.00" arrivalSpeed="15.21" duration="175.15" routeLength="1997.01" waitingTime="31.20" waitingCount="1" stopTime="0.00" timeLoss="44.05" rerouteNo="1" devices="tripinfo_car_w2e_126 routing_car_w2e_126" vType="Car" speedFactor="1.10" vaporized=""/>
    <tripinfo id="car_w2s_136" depart="136.00" departLane="w2sep_1" departPos="3.60" departPosLat="0.00" departSpeed="13.90" departDelay="0.00" arrival="302.55" arrivalLane="c2s_1" arrivalPos="990.00" arrivalPosLat="0.00" arrivalSpeed="15.64" duration="166.55" routeLength="1986.69" waitingTime="21.00" waitingCount="1" stopTime="0.00" timeLoss="39.62" rerouteNo="1" devices="tripinfo_car_w2s_136 routing_car_w2s_136" vType="Car" speedFactor="1.13" vaporized=""/>
    <tripinfo id="car_e2n_123" depart="123.45" departLane="e2sep_1" departPos="3.60" departPosLat="0.00" departSpeed="13.90" departDelay="0.45" arrival="305.20" arrivalLane="c2n_1" arrivalPos="990.00" arrivalPosLat="0.00" arrivalSpeed="13.89" duration="181.75" routeLength="1986.69" waitingTime="25.00" waitingCount="1" stopTime="0.00" timeLoss="38.08" rerouteNo="1" devices="tripinfo_car_e2n_123 routing_car_e2n_123" vType="Car" speedFactor="1.00" vaporized=""/>
    <tripinfo id="car_w2e_130" depart="130.00" departLane="w2sep_1" departPos="3.60" departPosLat="0.00" departSpeed="13.90" departDelay="0.00" arrival="308.00" arrivalLane="c2e_1" arrivalPos="990.00" arrivalPosLat="0.00" arrivalSpeed="13.94" duration="178.00" routeLength="1997.01" waitingTime="23.20" waitingCount="1" stopTime="0.00" timeLoss="34.78" rerouteNo="1" devices="tripinfo_car_w2e_130 routing_car_w2e_130" vType="Car" speedFactor="1.00" vaporized=""/>
    <tripinfo id="car_e2n_125" depart="125.30" departLane="e2sep_1" departPos="3.60" departPosLat="0.00" departSpeed="13.90" departDelay="0.30" arrival="308.40" arrivalLane="c2n_1" arrivalPos="990.00" arrivalPosLat="0.00" arrivalSpeed="14.08" duration="183.10" routeLength="1986.69" waitingTime="23.25" waitingCount="1" stopTime="0.00" timeLoss="41.80" rerouteNo="1" devices="tripinfo_car_e2n_125 routing_car_e2n_125" vType="Car" speedFactor="1.02" vaporized=""/>
    <tripinfo id="car_e2s_112" depart="112.00" departLane="e2sep_1" departPos="3.60" departPosLat="0.00" departSpeed="13.90" departDelay="0.00" arrival="308.80" arrivalLane="c2s_1" arrivalPos="990.00" arrivalPosLat="0.00" arrivalSpeed="15.18" duration="196.80" routeLength="1996.47" waitingTime="52.75" waitingCount="2" stopTime="0.00" timeLoss="64.62" rerouteNo="1" devices="tripinfo_car_e2s_112 routing_car_e2s_112" vType="Car" speedFactor="1.09" vaporized=""/>
    <tripinfo id="car_w2e_165" depart="165.00" departLane="w2sep_1" departPos="3.60" departPosLat="0.00" departSpeed="13.90" departDelay="0.00" arrival="309.85" arrivalLane="c2e_1" arrivalPos="990.00" arrivalPosLat="0.00" arrivalSpeed="15.51" duration="144.85" routeLength="1997.01" waitingTime="0.00" waitingCount="0" stopTime="0.00" timeLoss="23.03" rerouteNo="1" devices="tripinfo_car_w2e_165 routing_car_w2e_165" vType="Car" speedFactor="1.18" vaporized=""/>
    <tripinfo id="car_e2w_141" depart="141.00" departLane="e2sep_1" departPos="3.60" departPosLat="0.00" departSpeed="13.90" departDelay="0.00" arrival="310.05" arrivalLane="c2w_1" arrivalPos="990.00" arrivalPosLat="0.00" arrivalSpeed="13.90" duration="169.05" routeLength="1997.01" waitingTime="13.35" waitingCount="1" stopTime="0.00" timeLoss="25.37" rerouteNo="1" devices="tripinfo_car_e2w_141 routing_car_e2w_141" vType="Car" speedFactor="1.00" vaporized=""/>
    <tripinfo id="car_e2s_143" depart="143.00" departLane="e2sep_1" departPos="3.60" departPosLat="0.00" departSpeed="13.90" departDelay="0.00" arrival="311.40" arrivalLane="c2s_1" arrivalPos="990.00" arrivalPosLat="0.00" arrivalSpeed="15.85" duration="168.40" routeLength="1996.47" waitingTime="16.05" waitingCount="2" stopTime="0.00" timeLoss="43.37" rerouteNo="1" devices="tripinfo_car_e2s_143 routing_car_e2s_143" vType="Car" speedFactor="1.15" vaporized=""/>
    <tripinfo id="car_e2n_147" depart="147.00" departLane="e2sep_1" departPos="3.60" departPosLat="0.00" departSpeed="13.90" departDelay="0.00" arrival="312.75" arrivalLane="c2n_1" arrivalPos="990.00" arrivalPosLat="0.00" arrivalSpeed="13.96" duration="165.75" routeLength="1986.69" waitingTime="8.20" waitingCount="1" stopTime="0.00" timeLoss="22.81" rerouteNo="1" devices="tripinfo_car_e2n_147 routing_car_e2n_147" vType="Car" speedFactor="1.01" vaporized=""/>
    <tripinfo id="car_e2w_156" depart="156.40" departLane="e2sep_1" departPos="3.60" departPosLat="0.00" departSpeed="13.90" departDelay="0.40" arrival="313.95" arrivalLane="c2w_1" arrivalPos="990.00" arrivalPosLat="0.00" arrivalSpeed="14.19" duration="157.55" routeLength="1997.01" waitingTime="0.00" waitingCount="0" stopTime="0.00" timeLoss="16.95" rerouteNo="1" devices="tripinfo_car_e2w_156 routing_car_e2w_156" vType="Car" speedFactor="1.02" vaporized=""/>
    <tripinfo id="car_e2n_156" depart="158.15" departLane="e2sep_1" departPos="3.60" departPosLat="0.00" departSpeed="13.90" departDelay="2.15" arrival="316.40" arrivalLane="c2n_1" arrivalPos="990.00" arrivalPosLat="0.00" arrivalSpeed="14.19" duration="158.25" routeLength="1986.69" waitingTime="0.00" waitingCount="0" stopTime="0.00" timeLoss="17.80" rerouteNo="1" devices="tripinfo_car_e2n_156 routing_car_e2n_156" vType="Car" speedFactor="1.02" vaporized=""/>
    <tripinfo id="car_e2s_155" depart="155.00" departLane="e2sep_1" departPos="3.60" departPosLat="0.00" departSpeed="13.90" departDelay="0.00" arrival="317.40" arrivalLane="c2s_1" arrivalPos="990.00" arrivalPosLat="0.00" arrivalSpeed="14.45" duration="162.40" routeLength="1996.47" waitingTime="5.50" waitingCount="1" stopTime="0.00" timeLoss="23.61" rerouteNo="1" devices="tripinfo_car_e2s_155 routing_car_e2s_155" vType="Car" speedFactor="1.04" vaporized=""/>
    <tripinfo id="car_e2n_174" depart="174.00" departLane="e2sep_1" departPos="3.60" departPosLat="0.00" departSpeed="13.90" departDelay="0.00" arrival="319.80" arrivalLane="c2n_1" arrivalPos="990.00" arrivalPosLat="0.00" arrivalSpeed="14.31" duration="145.80" routeLength="1986.69" waitingTime="0.00" waitingCount="0" stopTime="0.00" timeLoss="6.64" rerouteNo="1" devices="tripinfo_car_e2n_174 routing_car_e2n_174" vType="Car" speedFactor="1.03" vaporized=""/>
    <tripinfo id="car_w2s_182" depart="182.00" departLane="w2sep_1" departPos="3.60" departPosLat="0.00" departSpeed="13.90" departDelay="0.00" arrival="320.45" arrivalLane="c2s_1" arrivalPos="990.00" arrivalPosLat="0.00" arrivalSpeed="15.03" duration="138.45" routeLength="1986.69" waitingTime="0.00" waitingCount="0" stopTime="0.00" timeLoss="6.28" rerouteNo="1" devices="tripinfo_car_w2s_182 routing_car_w2s_182" vType="Car" speedFactor="1.09" vaporized=""/>
    <tripinfo id="car_e2w_189" depart="189.00" departLane="e2sep_1" departPos="3.60" departPosLat="0.00" departSpeed="13.90" departDelay="0.00" arrival="320.70" arrivalLane="c2w_1" arrivalPos="990.00" arrivalPosLat="0.00" arrivalSpeed="15.95" duration="131.70" routeLength="1997.01" waitingTime="0.00" waitingCount="0" stopTime="0.00" timeLoss="6.52" rerouteNo="1" devices="tripinfo_car_e2w_189 routing_car_e2w_189" vType="Car" speedFactor="1.15" vaporized=""/>
    <tripinfo id="car_e2n_178" depart="178.00" departLane="e2sep_1" departPos="3.60" departPosLat="0.00" departSpeed="13.90" departDelay="0.00" arrival="325.70" arrivalLane="c2n_1" arrivalPos="990.00" arrivalPosLat="0.00" arrivalSpeed="14.00" duration="147.70" routeLength="1986.69" waitingTime="0.00" waitingCount="0" stopTime="0.00" timeLoss="5.07" rerouteNo="1" devices="tripinfo_car_e2n_178 routing_car_e2n_178" vType="Car" speedFactor="1.01" vaporized=""/>
    <tripinfo id="car_w2e_186" depart="186.00" departLane="w2sep_1" departPos="3.60" departPosLat="0.00" departSpeed="13.90" departDelay="0.00" arrival="329.75" arrivalLane="c2e_1" arrivalPos="990.00" arrivalPosLat="0.00" arrivalSpeed="14.13" duration="143.75" routeLength="1997.01" waitingTime="0.00" waitingCount="0" stopTime="0.00" timeLoss="2.45" rerouteNo="1" devices="tripinfo_car_w2e_186 routing_car_w2e_186" vType="Car" speedFactor="1.02" vaporized=""/>
    <tripinfo id="car_w2n_110" depart="110.00" departLane="w2sep_1" departPos="3.60" departPosLat="0.00" departSpeed="13.90" departDelay="0.00" arrival="331.50" arrivalLane="c2n_1" arrivalPos="990.00" arrivalPosLat="0.00" arrivalSpeed="14.32" duration="221.50" routeLength="1996.47" waitingTime="69.95" waitingCount="3" stopTime="0.00" timeLoss="81.43" rerouteNo="1" devices="tripinfo_car_w2n_110 routing_car_w2n_110" vType="Car" speedFactor="1.03" vaporized=""/>
    <tripinfo id="car_e2s_184" depart="184.00" departLane="e2sep_1" departPos="3.60" departPosLat="0.00" departSpeed="13.90" departDelay="0.00" arrival="333.95" arrivalLane="c2s_1" arrivalPos="990.00" arrivalPosLat="0.00" arrivalSpeed="13.90" duration="149.95" routeLength="1996.47" waitingTime="0.00" waitingCount="0" stopTime="0.00" timeLoss="5.61" rerouteNo="1" devices="tripinfo_car_e2s_184 routing_car_e2s_184" vType="Car" speedFactor="1.00" vaporized=""/>
    <tripinfo id="car_w2n_113" depart="113.60" departLane="w2sep_1" departPos="3.60" departPosLat="0.00" departSpeed="13.90" departDelay="0.60" arrival="335.25" arrivalLane="c2n_1" arrivalPos="990.00" arrivalPosLat="0.00" arrivalSpeed="14.40" duration="221.65" routeLength="1996.47" waitingTime="62.10" waitingCount="2" stopTime="0.00" timeLoss="82.59" rerouteNo="1" devices="tripinfo_car_w2n_113 routing_car_w2n_113" vType="Car" speedFactor="1.04" vaporized=""/>
    <tripinfo id="car_w2n_134" depart="134.00" departLane="w2sep_1" departPos="3.60" departPosLat="0.00" departSpeed="13.90" departDelay="0.00" arrival="337.30" arrivalLane="c2n_1" arrivalPos="990.00" arrivalPosLat="0.00" arrivalSpeed="15.38" duration="203.30" routeLength="1996.47" waitingTime="44.80" waitingCount="2" stopTime="0.00" timeLoss="76.99" rerouteNo="1" devices="tripinfo_car_w2n_134 routing_car_w2n_134" vType="Car" speedFactor="1.14" vaporized=""/>
    <tripinfo id="car_w2n_142" depart="142.00" departLane="w2sep_1" departPos="3.60" departPosLat="0.00" departSpeed="13.90" departDelay="0.00" arrival="339.25" arrivalLane="c2n_1" arrivalPos="990.00" arrivalPosLat="0.00" arrivalSpeed="15.73" duration="197.25" routeLength="1996.47" waitingTime="41.55" waitingCount="2" stopTime="0.00" timeLoss="74.78" rerouteNo="1" devices="tripinfo_car_w2n_142 routing_car_w2n_142" vType="Car" speedFactor="1.18" vaporized=""/>
    <tripinfo id="car_w2n_151" depart="151.00" departLane="w2sep_1" departPos="3.60" departPosLat="0.00" departSpeed="13.90" departDelay="0.00" arrival="341.20" arrivalLane="c2n_1" arrivalPos="990.00" arrivalPosLat="0.00" arrivalSpeed="15.70" duration="190.20" routeLength="1996.47" waitingTime="36.25" waitingCount="2" stopTime="0.00" timeLoss="67.04" rerouteNo="1" devices="tripinfo_car_w2n_151 routing_car_w2n_151" vType="Car" speedFactor="1.17" vaporized=""/>
    <tripinfo id="car_n2w_139" depart="139.00" departLane="n2sep_1" departPos="3.60" departPosLat="0.00" departSpeed="13.90" departDelay="0.00" arrival="344.55" arrivalLane="c2w_1" arrivalPos="990.00" arrivalPosLat="0.00" arrivalSpeed="14.12" duration="205.55" routeLength="1986.69" waitingTime="53.65" waitingCount="1" stopTime="0.00" timeLoss="64.12" rerouteNo="1" devices="tripinfo_car_n2w_139 routing_car_n2w_139" vType="Car" speedFactor="1.02" vaporized=""/>
    <tripinfo id="car_s2n_163" depart="163.00" departLane="s2sep_1" departPos="3.60" departPosLat="0.00" departSpeed="13.90" departDelay="0.00" arrival="346.80" arrivalLane="c2n_1" arrivalPos="990.00" arrivalPosLat="0.00" arrivalSpeed="13.90" duration="183.80" routeLength="1997.01" waitingTime="31.30" waitingCount="1" stopTime="0.00" timeLoss="40.12" rerouteNo="1" devices="tripinfo_car_s2n_163 routing_car_s2n_163" vType="Car" speedFactor="1.00" vaporized=""/>
    <tripinfo id="car_n2w_160" depart="160.00" departLane="n2sep_1" departPos="3.60" departPosLat="0.00" departSpeed="13.90" departDelay="0.00" arrival="348.90" arrivalLane="c2w_1" arrivalPos="990.00" arrivalPosLat="0.00" arrivalSpeed="14.16" duration="188.90" routeLength="1986.69" waitingTime="37.20" waitingCount="1" stopTime="0.00" timeLoss="47.98" rerouteNo="1" devices="tripinfo_car_n2w_160 routing_car_n2w_160" vType="Car" speedFactor="1.02" vaporized=""/>
    <tripinfo id="car_s2n_174" depart="174.00" departLane="s2sep_1" departPos="3.60" departPosLat="0.00" departSpeed="13.90" departDelay="0.00" arrival="348.95" arrivalLane="c2n_1" arrivalPos="990.00" arrivalPosLat="0.00" arrivalSpeed="14.93" duration="174.95" routeLength="1997.01" waitingTime="27.80" waitingCount="1" stopTime="0.00" timeLoss="44.60" rerouteNo="1" devices="tripinfo_car_s2n_174 routing_car_s2n_174" vType="Car" speedFactor="1.10" vaporized=""/>
    <tripinfo id="car_n2s_195" depart="195.00" departLane="n2sep_1" departPos="3.60" departPosLat="0.00" departSpeed="13.90" departDelay="0.00" arrival="349.70" arrivalLane="c2s_1" arrivalPos="990.00" arrivalPosLat="0.00" arrivalSpeed="14.00" duration="154.70" routeLength="1997.01" waitingTime="2.45" waitingCount="1" stopTime="0.00" timeLoss="12.02" rerouteNo="1" devices="tripinfo_car_n2s_195 routing_car_n2s_195" vType="Car" speedFactor="1.01" vaporized=""/>
    <tripinfo id="car_n2e_163" depart="163.00" departLane="n2sep_1" departPos="3.60" departPosLat="0.00" departSpeed="13.90" departDelay="0.00" arrival="350.65" arrivalLane="c2e_1" arrivalPos="990.00" arrivalPosLat="0.00" arrivalSpeed="14.67" duration="187.65" routeLength="1996.47" waitingTime="37.25" waitingCount="2" stopTime="0.00" timeLoss="50.91" rerouteNo="1" devices="tripinfo_car_n2e_163 routing_car_n2e_163" vType="Car" speedFactor="1.06" vaporized=""/>
    <tripinfo id="car_n2w_208" depart="208.00" departLane="n2sep_1" departPos="3.60" departPosLat="0.00" departSpeed="13.90" departDelay="0.00" arrival="352.25" arrivalLane="c2w_1" arrivalPos="990.00" arrivalPosLat="0.00" arrivalSpeed="14.46" duration="144.25" routeLength="1986.69" waitingTime="0.00" waitingCount="0" stopTime="0.00" timeLoss="6.57" rerouteNo="1" devices="tripinfo_car_n2w_208 routing_car_n2w_208" vType="Car" speedFactor="1.04" vaporized=""/>
    <tripinfo id="car_s2n_192" depart="192.00" departLane="s2sep_1" departPos="3.60" departPosLat="0.00" departSpeed="13.90" departDelay="0.00" arrival="352.80" arrivalLane="c2n_1" arrivalPos="990.00" arrivalPosLat="0.00" arrivalSpeed="13.91" duration="160.80" routeLength="1997.01" waitingTime="3.65" waitingCount="1" stopTime="0.00" timeLoss="17.38" rerouteNo="1" devices="tripinfo_car_s2n_192 routing_car_s2n_192" vType="Car" speedFactor="1.00" vaporized=""/>
    <tripinfo id="car_s2n_206" depart="206.00" departLane="s2sep_1" departPos="3.60" departPosLat="0.00" departSpeed="13.90" departDelay="0.00" arrival="355.45" arrivalLane="c2n_1" arrivalPos="990.00" arrivalPosLat="0.00" arrivalSpeed="14.29" duration="149.45" routeLength="1997.01" waitingTime="0.00" waitingCount="0" stopTime="0.00" timeLoss="11.00" rerouteNo="1" devices="tripinfo_car_s2n_206 routing_car_s2n_206" vType="Car" speedFactor="1.04" vaporized=""/>
    <tripinfo id="car_s2w_158" depart="158.00" departLane="s2sep_1" departPos="3.60" departPosLat="0.00" departSpeed="13.90" departDelay="0.00" arrival="357.60" arrivalLane="c2w_1" arrivalPos="990.00" arrivalPosLat="0.00" arrivalSpeed="13.90" duration="199.60" routeLength="1996.47" waitingTime="43.15" waitingCount="2" stopTime="0.00" timeLoss="55.27" rerouteNo="1" devices="tripinfo_car_s2w_158 routing_car_s2w_158" vType="Car" speedFactor="1.00" vaporized=""/>
    <tripinfo id="car_n2w_222" depart="222.00" departLane="n2sep_1" departPos="3.60" departPosLat="0.00" departSpeed="13.90" departDelay="0.00" arrival="359.65" arrivalLane="c2w_1" arrivalPos="990.00" arrivalPosLat="0.00" arrivalSpeed="15.09" duration="137.65" routeLength="1986.69" waitingTime="0.00" waitingCount="0" stopTime="0.00" timeLoss="9.56" rerouteNo="1" devices="tripinfo_car_n2w_222 routing_car_n2w_222" vType="Car" speedFactor="1.12" vaporized=""/>
    <tripinfo id="car_s2w_189" depart="189.00" departLane="s2sep_1" departPos="3.60" departPosLat="0.00" departSpeed="13.90" departDelay="0.00" arrival="365.40" arrivalLane="c2w_1" arrivalPos="990.00" arrivalPosLat="0.00" arrivalSpeed="13.90" duration="176.40" routeLength="1996.47" waitingTime="14.20" waitingCount="4" stopTime="0.00" timeLoss="32.07" rerouteNo="1" devices="tripinfo_car_s2w_189 routing_car_s2w_189" vType="Car" speedFactor="1.00" vaporized=""/>
    <tripinfo id="car_n2e_227" depart="227.00" departLane="n2sep_1" departPos="3.60" departPosLat="0.00" departSpeed="13.90" departDelay="0.00" arrival="366.45" arrivalLane="c2e_1" arrivalPos="990.00" arrivalPosLat="0.00" arrivalSpeed="14.80" duration="139.45" routeLength="1996.47" waitingTime="0.00" waitingCount="0" stopTime="0.00" timeLoss="3.94" rerouteNo="1" devices="tripinfo_car_n2e_227 routing_car_n2e_227" vType="Car" speedFactor="1.07" vaporized=""/>
    <tripinfo id="car_s2w_235" depart="235.00" departLane="s2sep_1" departPos="3.60" departPosLat="0.00" departSpeed="13.90" departDelay="0.00" arrival="382.65" arrivalLane="c2w_1" arrivalPos="990.00" arrivalPosLat="0.00" arrivalSpeed="13.90" duration="147.65" routeLength="1996.47" waitingTime="0.00" waitingCount="0" stopTime="0.00" timeLoss="3.30" rerouteNo="1" devices="tripinfo_car_s2w_235 routing_car_s2w_235" vType="Car" speedFactor="1.00" vaporized=""/>
    <tripinfo id="car_e2n_193" depart="193.00" departLane="e2sep_1" departPos="3.60" departPosLat="0.00" departSpeed="13.90" departDelay="0.00" arrival="387.75" arrivalLane="c2n_1" arrivalPos="990.00" arrivalPosLat="0.00" arrivalSpeed="14.49" duration="194.75" routeLength="1986.69" waitingTime="49.15" waitingCount="1" stopTime="0.00" timeLoss="57.00" rerouteNo="1" devices="tripinfo_car_e2n_193 routing_car_e2n_193" vType="Car" speedFactor="1.04" vaporized=""/>
    <tripinfo id="car_w2s_188" depart="188.00" departLane="w2sep_1" departPos="3.60" departPosLat="0.00" departSpeed="13.90" departDelay="0.00" arrival="388.55" arrivalLane="c2s_1" arrivalPos="990.00" arrivalPosLat="0.00" arrivalSpeed="14.32" duration="200.55" routeLength="1986.69" waitingTime="49.95" waitingCount="1" stopTime="0.00" timeLoss="61.14" rerouteNo="1" devices="tripinfo_car_w2s_188 routing_car_w2s_188" vType="Car" speedFactor="1.03" vaporized=""/>
    <tripinfo id="car_w2e_223" depart="223.00" departLane="w2sep_1" departPos="3.60" departPosLat="0.00" departSpeed="13.90" departDelay="0.00" arrival="388.95" arrivalLane="c2e_1" arrivalPos="990.00" arrivalPosLat="0.00" arrivalSpeed="15.25" duration="165.95" routeLength="1997.01" waitingTime="24.80" waitingCount="1" stopTime="0.00" timeLoss="34.99" rerouteNo="1" devices="tripinfo_car_w2e_223 routing_car_w2e_223" vType="Car" speedFactor="1.10" vaporized=""/>
    <tripinfo id="car_e2w_209" depart="209.35" departLane="e2sep_1" departPos="3.60" departPosLat="0.00" departSpeed="13.90" departDelay="0.35" arrival="391.55" arrivalLane="c2w_1" arrivalPos="990.00" arrivalPosLat="0.00" arrivalSpeed="14.69" duration="182.20" routeLength="1997.01" waitingTime="33.05" waitingCount="1" stopTime="0.00" timeLoss="46.26" rerouteNo="1" devices="tripinfo_car_e2w_209 routing_car_e2w_209" vType="Car" speedFactor="1.06" vaporized=""/>
    <tripinfo id="car_e2n_202" depart="202.00" departLane="e2sep_1" departPos="3.60" departPosLat="0.00" departSpeed="13.90" departDelay="0.00" arrival="393.40" arrivalLane="c2n_1" arrivalPos="990.00" arrivalPosLat="0.00" arrivalSpeed="14.13" duration="191.40" routeLength="1986.69" waitingTime="39.90" waitingCount="1" stopTime="0.00" timeLoss="50.10" rerouteNo="1" devices="tripinfo_car_e2n_202 routing_car_e2n_202" vType="Car" speedFactor="1.02" vaporized=""/>
    <tripinfo id="car_w2s_211" depart="211.00" departLane="w2sep_1" departPos="3.60" departPosLat="0.00" departSpeed="13.90" departDelay="0.00" arrival="394.00" arrivalLane="c2s_1" arrivalPos="990.00" arrivalPosLat="0.00" arrivalSpeed="14.03" duration="183.00" routeLength="1986.69" waitingTime="30.45" waitingCount="1" stopTime="0.00" timeLoss="40.72" rerouteNo="1" devices="tripinfo_car_w2s_211 routing_car_w2s_211" vType="Car" speedFactor="1.01" vaporized=""/>
    <tripinfo id="car_w2e_260" depart="260.00" departLane="w2sep_1" departPos="3.60" departPosLat="0.00" departSpeed="13.90" departDelay="0.00" arrival="394.60" arrivalLane="c2e_1" arrivalPos="990.00" arrivalPosLat="0.00" arrivalSpeed="16.24" duration="134.60" routeLength="1997.01" waitingTime="0.00" waitingCount="0" stopTime="0.00" timeLoss="11.66" rerouteNo="1" devices="tripinfo_car_w2e_260 routing_car_w2e_260" vType="Car" speedFactor="1.17" vaporized=""/>
    <tripinfo id="car_e2w_231" depart="231.00" departLane="e2sep_1" departPos="3.60" departPosLat="0.00" departSpeed="13.90" departDelay="0.00" arrival="398.30" arrivalLane="c2w_1" arrivalPos="990.00" arrivalPosLat="0.00" arrivalSpeed="13.90" duration="167.30" routeLength="1997.01" waitingTime="12.20" waitingCount="1" stopTime="0.00" timeLoss="23.63" rerouteNo="1" devices="tripinfo_car_e2w_231 routing_car_e2w_231" vType="Car" speedFactor="1.00" vaporized=""/>
    <tripinfo id="car_w2s_235" depart="235.00" departLane="w2sep_1" departPos="3.60" departPosLat="0.00" departSpeed="13.90" departDelay="0.00" arrival="398.95" arrivalLane="c2s_1" arrivalPos="990.00" arrivalPosLat="0.00" arrivalSpeed="13.90" duration="163.95" routeLength="1986.69" waitingTime="8.25" waitingCount="1" stopTime="0.00" timeLoss="20.28" rerouteNo="1" devices="tripinfo_car_w2s_235 routing_car_w2s_235" vType="Car" speedFactor="1.00" vaporized=""/>
    <tripinfo id="car_w2n_183" depart="183.30" departLane="w2sep_1" departPos="3.60" departPosLat="0.00" departSpeed="13.90" departDelay="0.30" arrival="399.90" arrivalLane="c2n_1" arrivalPos="990.00" arrivalPosLat="0.00" arrivalSpeed="14.38" duration="216.60" routeLength="1996.47" waitingTime="56.85" waitingCount="3" stopTime="0.00" timeLoss="77.10" rerouteNo="1" devices="tripinfo_car_w2n_183 routing_car_w2n_183" vType="Car" speedFactor="1.03" vaporized=""/>
    <tripinfo id="car_w2s_244" depart="244.00" departLane="w2sep_1" departPos="3.60" departPosLat="0.00" departSpeed="13.90" departDelay="0.00" arrival="401.35" arrivalLane="c2s_1" arrivalPos="990.00" arrivalPosLat="0.00" arrivalSpeed="14.68" duration="157.35" routeLength="1986.69" waitingTime="4.80" waitingCount="1" stopTime="0.00" timeLoss="23.39" rerouteNo="1" devices="tripinfo_car_w2s_244 routing_car_w2s_244" vType="Car" speedFactor="1.07" vaporized=""/>
    <tripinfo id="car_e2w_250" depart="250.00" departLane="e2sep_1" departPos="3.60" departPosLat="0.00" departSpeed="13.90" departDelay="0.00" arrival="401.35" arrivalLane="c2w_1" arrivalPos="990.00" arrivalPosLat="0.00" arrivalSpeed="14.31" duration="151.35" routeLength="1997.01" waitingTime="0.00" waitingCount="0" stopTime="0.00" timeLoss="12.44" rerouteNo="1" devices="tripinfo_car_e2w_250 routing_car_e2w_250" vType="Car" speedFactor="1.03" vaporized=""/>
    <tripinfo id="car_w2s_247" depart="247.00" departLane="w2sep_1" departPos="3.60" departPosLat="0.00" departSpeed="13.90" departDelay="0.00" arrival="404.75" arrivalLane="c2s_1" arrivalPos="990.00" arrivalPosLat="0.00" arrivalSpeed="14.06" duration="157.75" routeLength="1986.69" waitingTime="0.00" waitingCount="0" stopTime="0.00" timeLoss="16.08" rerouteNo="1" devices="tripinfo_car_w2s_247 routing_car_w2s_247" vType="Car" speedFactor="1.01" vaporized=""/>
    <tripinfo id="car_w2e_273" depart="273.00" departLane="w2sep_1" departPos="3.60" departPosLat="0.00" departSpeed="13.90" departDelay="0.00" arrival="405.45" arrivalLane="c2e_1" arrivalPos="990.00" arrivalPosLat="0.00" arrivalSpeed="15.33" duration="132.45" routeLength="1997.01" waitingTime="0.00" waitingCount="0" stopTime="0.00" timeLoss="2.19" rerouteNo="1" devices="tripinfo_car_w2e_273 routing_car_w2e_273" vType="Car" speedFactor="1.10" vaporized=""/>
    <tripinfo id="car_w2s_264" depart="264.00" departLane="w2sep_1" departPos="3.60" departPosLat="0.00" departSpeed="13.90" departDelay="0.00" arrival="407.10" arrivalLane="c2s_1" arrivalPos="990.00" arrivalPosLat="0.00" arrivalSpeed="14.95" duration="143.10" routeLength="1986.69" waitingTime="0.00" waitingCount="0" stopTime="0.00" timeLoss="11.98" rerouteNo="1" devices="tripinfo_car_w2s_264 routing_car_w2s_264" vType="Car" speedFactor="1.10" vaporized=""/>
    <tripinfo id="car_e2n_262" depart="262.00" departLane="e2sep_1" departPos="3.60" departPosLat="0.00" departSpeed="13.90" departDelay="0.00" arrival="408.50" arrivalLane="c2n_1" arrivalPos="990.00" arrivalPosLat="0.00" arrivalSpeed="14.02" duration="146.50" routeLength="1986.69" waitingTime="0.00" waitingCount="0" stopTime="0.00" timeLoss="4.07" rerouteNo="1" devices="tripinfo_car_e2n_262 routing_car_e2n_262" vType="Car" speedFactor="1.01" vaporized=""/>
    <tripinfo id="car_e2s_202" depart="203.45" departLane="e2sep_1" departPos="3.60" departPosLat="0.00" departSpeed="13.90" departDelay="1.45" arrival="410.70" arrivalLane="c2s_1" arrivalPos="990.00" arrivalPosLat="0.00" arrivalSpeed="15.14" duration="207.25" routeLength="1996.47" waitingTime="56.95" waitingCount="2" stopTime="0.00" timeLoss="75.06" rerouteNo="1" devices="tripinfo_car_e2s_202 routing_car_e2s_202" vType="Car" speedFactor="1.09" vaporized=""/>
    <tripinfo id="car_w2n_200" depart="200.00" departLane="w2sep_1" departPos="3.60" departPosLat="0.00" departSpeed="13.90" departDelay="0.00" arrival="412.50" arrivalLane="c2n_1" arrivalPos="990.00" arrivalPosLat="0.00" arrivalSpeed="14.19" duration="212.50" routeLength="1996.47" waitingTime="52.70" waitingCount="3" stopTime="0.00" timeLoss="71.26" rerouteNo="1" devices="tripinfo_car_w2n_200 routing_car_w2n_200" vType="Car" speedFactor="1.02" vaporized=""/>
    <tripinfo id="car_e2s_208" depart="208.00" departLane="e2sep_1" departPos="3.60" departPosLat="0.00" departSpeed="13.90" departDelay="0.00" arrival="414.25" arrivalLane="c2s_1" arrivalPos="990.00" arrivalPosLat="0.00" arrivalSpeed="15.13" duration="206.25" routeLength="1996.47" waitingTime="54.45" waitingCount="2" stopTime="0.00" timeLoss="73.93" rerouteNo="1" devices="tripinfo_car_e2s_208 routing_car_e2s_208" vType="Car" speedFactor="1.09" vaporized=""/>
    <tripinfo id="car_e2w_271" depart="271.00" departLane="e2sep_1" departPos="3.60" departPosLat="0.00" departSpeed="13.90" departDelay="0.00" arrival="415.50" arrivalLane="c2w_1" arrivalPos="990.00" arrivalPosLat="0.00" arrivalSpeed="13.90" duration="144.50" routeLength="1997.01" waitingTime="0.00" waitingCount="0" stopTime="0.00" timeLoss="0.79" rerouteNo="1" devices="tripinfo_car_e2w_271 routing_car_e2w_271" vType="Car" speedFactor="1.00" vaporized=""/>
    <tripinfo id="car_e2s_219" depart="219.00" departLane="e2sep_1" departPos="3.60" departPosLat="0.00" departSpeed="13.90" departDelay="0.00" arrival="417.55" arrivalLane="c2s_1" arrivalPos="990.00" arrivalPosLat="0.00" arrivalSpeed="15.07" duration="198.55" routeLength="1996.47" waitingTime="44.75" waitingCount="2" stopTime="0.00" timeLoss="65.89" rerouteNo="1" devices="tripinfo_car_e2s_219 routing_car_e2s_219" vType="Car" speedFactor="1.09" vaporized=""/>
    <tripinfo id="car_w2n_261" depart="261.25" departLane="w2sep_1" departPos="3.60" departPosLat="0.00" departSpeed="13.90" departDelay="0.25" arrival="418.25" arrivalLane="c2n_1" arrivalPos="990.00" arrivalPosLat="0.00" arrivalSpeed="14.13" duration="157.00" routeLength="1996.47" waitingTime="2.70" waitingCount="2" stopTime="0.00" timeLoss="15.07" rerouteNo="1" devices="tripinfo_car_w2n_261 routing_car_w2n_261" vType="Car" speedFactor="1.02" vaporized=""/>
    <tripinfo id="car_w2n_280" depart="280.00" departLane="w2sep_1" departPos="3.60" departPosLat="0.00" departSpeed="13.90" departDelay="0.00" arrival="420.25" arrivalLane="c2n_1" arrivalPos="990.00" arrivalPosLat="0.00" arrivalSpeed="15.42" duration="140.25" routeLength="1996.47" waitingTime="0.00" waitingCount="0" stopTime="0.00" timeLoss="15.04" rerouteNo="1" devices="tripinfo_car_w2n_280 routing_car_w2n_280" vType="Car" speedFactor="1.15" vaporized=""/>
    <tripinfo id="car_w2e_282" depart="282.00" departLane="w2sep_1" departPos="3.60" departPosLat="0.00" departSpeed="13.90" departDelay="0.00" arrival="422.10" arrivalLane="c2e_1" arrivalPos="990.00" arrivalPosLat="0.00" arrivalSpeed="14.35" duration="140.10" routeLength="1997.01" waitingTime="0.00" waitingCount="0" stopTime="0.00" timeLoss="0.92" rerouteNo="1" devices="tripinfo_car_w2e_282 routing_car_w2e_282" vType="Car" speedFactor="1.03" vaporized=""/>
    <tripinfo id="amb_w2e_300" depart="300.00" departLane="w2sep_1" departPos="6.60" departPosLat="0.00" departSpeed="13.90" departDelay="0.00" arrival="426.50" arrivalLane="c2e_1" arrivalPos="990.00" arrivalPosLat="0.00" arrivalSpeed="20.74" duration="126.50" routeLength="1994.01" waitingTime="0.00" waitingCount="0" stopTime="0.00" timeLoss="30.82" rerouteNo="1" devices="tripinfo_amb_w2e_300 routing_amb_w2e_300 bluelight_amb_w2e_300 fcd_amb_w2e_300" vType="Ambulance" speedFactor="1.50" vaporized="">
        <example_device customValue1="0.00" customValue2="-1.00"/>
    </tripinfo>
    <tripinfo id="car_w2s_287" depart="287.00" departLane="w2sep_1" departPos="3.60" departPosLat="0.00" departSpeed="13.90" departDelay="0.00" arrival="434.80" arrivalLane="c2s_1" arrivalPos="990.00" arrivalPosLat="0.00" arrivalSpeed="13.90" duration="147.80" routeLength="1986.69" waitingTime="0.00" waitingCount="0" stopTime="0.00" timeLoss="4.15" rerouteNo="1" devices="tripinfo_car_w2s_287 routing_car_w2s_287" vType="Car" speedFactor="1.00" vaporized=""/>
    <tripinfo id="car_w2s_288" depart="288.50" departLane="w2sep_1" departPos="3.60" departPosLat="0.00" departSpeed="13.90" departDelay="0.50" arrival="436.90" arrivalLane="c2s_1" arrivalPos="990.00" arrivalPosLat="0.00" arrivalSpeed="15.10" duration="148.40" routeLength="1986.69" waitingTime="0.00" waitingCount="0" stopTime="0.00" timeLoss="19.94" rerouteNo="1" devices="tripinfo_car_w2s_288 routing_car_w2s_288" vType="Car" speedFactor="1.12" vaporized=""/>
    <tripinfo id="car_w2n_290" depart="290.20" departLane="w2sep_1" departPos="3.60" departPosLat="0.00" departSpeed="13.90" departDelay="0.20" arrival="438.05" arrivalLane="c2n_1" arrivalPos="990.00" arrivalPosLat="0.00" arrivalSpeed="14.35" duration="147.85" routeLength="1996.47" waitingTime="0.00" waitingCount="0" stopTime="0.00" timeLoss="8.01" rerouteNo="1" devices="tripinfo_car_w2n_290 routing_car_w2n_290" vType="Car" speedFactor="1.03" vaporized=""/>
    <tripinfo id="car_w2n_302" depart="302.00" departLane="w2sep_1" departPos="3.60" departPosLat="0.00" departSpeed="13.90" departDelay="0.00" arrival="439.90" arrivalLane="c2n_1" arrivalPos="990.00" arrivalPosLat="0.00" arrivalSpeed="16.11" duration="137.90" routeLength="1996.47" waitingTime="0.00" waitingCount="0" stopTime="0.00" timeLoss="20.16" rerouteNo="1" devices="tripinfo_car_w2n_302 routing_car_w2n_302" vType="Car" speedFactor="1.23" vaporized=""/>
    <tripinfo id="bus_w2s_298" depart="298.00" departLane="w2sep_1" departPos="12.10" departPosLat="0.00" departSpeed="13.90" departDelay="0.00" arrival="447.60" arrivalLane="c2s_1" arrivalPos="990.00" arrivalPosLat="0.00" arrivalSpeed="13.90" duration="149.60" routeLength="1978.19" waitingTime="0.00" waitingCount="0" stopTime="0.00" timeLoss="6.54" rerouteNo="1" devices="tripinfo_bus_w2s_298 routing_bus_w2s_298" vType="Bus" speedFactor="1.00" vaporized=""/>
    <tripinfo id="car_e2s_266" depart="266.00" departLane="e2sep_1" departPos="3.60" departPosLat="0.00" departSpeed="13.90" departDelay="0.00" arrival="450.00" arrivalLane="c2s_1" arrivalPos="990.00" arrivalPosLat="0.00" arrivalSpeed="15.74" duration="184.00" routeLength="1996.47" waitingTime="36.20" waitingCount="2" stopTime="0.00" timeLoss="61.37" rerouteNo="1" devices="tripinfo_car_e2s_266 routing_car_e2s_266" vType="Car" speedFactor="1.18" vaporized=""/>
    <tripinfo id="car_e2n_301" depart="301.00" departLane="e2sep_1" departPos="3.60" departPosLat="0.00" departSpeed="13.90" departDelay="0.00" arrival="451.55" arrivalLane="c2n_1" arrivalPos="990.00" arrivalPosLat="0.00" arrivalSpeed="14.42" duration="150.55" routeLength="1986.69" waitingTime="4.60" waitingCount="1" stopTime="0.00" timeLoss="12.07" rerouteNo="1" devices="tripinfo_car_e2n_301 routing_car_e2n_301" vType="Car" speedFactor="1.04" vaporized=""/>
    <tripinfo id="car_e2n_304" depart="304.00" departLane="e2sep_1" departPos="3.60" departPosLat="0.00" departSpeed="13.90" departDelay="0.00" arrival="457.10" arrivalLane="c2n_1" arrivalPos="990.00" arrivalPosLat="0.00" arrivalSpeed="14.06" duration="153.10" routeLength="1986.69" waitingTime="0.00" waitingCount="0" stopTime="0.00" timeLoss="11.08" rerouteNo="1" devices="tripinfo_car_e2n_304 routing_car_e2n_304" vType="Car" speedFactor="1.01" vaporized=""/>
    <tripinfo id="car_e2s_289" depart="289.00" departLane="e2sep_1" departPos="3.60" departPosLat="0.00" departSpeed="13.90" departDelay="0.00" arrival="457.60" arrivalLane="c2s_1" arrivalPos="990.00" arrivalPosLat="0.00" arrivalSpeed="14.02" duration="168.60" routeLength="1996.47" waitingTime="15.70" waitingCount="1" stopTime="0.00" timeLoss="25.44" rerouteNo="1" devices="tripinfo_car_e2s_289 routing_car_e2s_289" vType="Car" speedFactor="1.01" vaporized=""/>
    <tripinfo id="car_e2s_306" depart="306.00" departLane="e2sep_1" departPos="3.60" departPosLat="0.00" departSpeed="13.90" departDelay="0.00" arrival="459.70" arrivalLane="c2s_1" arrivalPos="990.00" arrivalPosLat="0.00" arrivalSpeed="15.13" duration="153.70" routeLength="1996.47" waitingTime="0.00" waitingCount="0" stopTime="0.00" timeLoss="24.79" rerouteNo="1" devices="tripinfo_car_e2s_306 routing_car_e2s_306" vType="Car" speedFactor="1.12" vaporized=""/>
    <tripinfo id="car_n2w_262" depart="262.00" departLane="n2sep_1" departPos="3.60" departPosLat="0.00" departSpeed="13.90" departDelay="0.00" arrival="467.00" arrivalLane="c2w_1" arrivalPos="990.00" arrivalPosLat="0.00" arrivalSpeed="15.27" duration="205.00" routeLength="1986.69" waitingTime="64.85" waitingCount="1" stopTime="0.00" timeLoss="74.20" rerouteNo="1" devices="tripinfo_car_n2w_262 routing_car_n2w_262" vType="Car" speedFactor="1.10" vaporized=""/>
    <tripinfo id="car_n2s_255" depart="255.00" departLane="n2sep_1" departPos="3.60" departPosLat="0.00" departSpeed="13.90" departDelay="0.00" arrival="467.10" arrivalLane="c2s_1" arrivalPos="990.00" arrivalPosLat="0.00" arrivalSpeed="14.80" duration="212.10" routeLength="1997.01" waitingTime="69.40" waitingCount="1" stopTime="0.00" timeLoss="77.16" rerouteNo="1" devices="tripinfo_car_n2s_255 routing_car_n2s_255" vType="Car" speedFactor="1.06" vaporized=""/>
    <tripinfo id="car_s2n_241" depart="241.00" departLane="s2sep_1" departPos="3.60" departPosLat="0.00" departSpeed="13.90" departDelay="0.00" arrival="471.10" arrivalLane="c2n_1" arrivalPos="990.00" arrivalPosLat="0.00" arrivalSpeed="13.90" duration="230.10" routeLength="1997.01" waitingTime="78.90" waitingCount="1" stopTime="0.00" timeLoss="86.41" rerouteNo="1" devices="tripinfo_car_s2n_241 routing_car_s2n_241" vType="Car" speedFactor="1.00" vaporized=""/>
    <tripinfo id="car_n2s_270" depart="270.00" departLane="n2sep_1" departPos="3.60" departPosLat="0.00" departSpeed="13.90" departDelay="0.00" arrival="471.70" arrivalLane="c2s_1" arrivalPos="990.00" arrivalPosLat="0.00" arrivalSpeed="14.88" duration="201.70" routeLength="1997.01" waitingTime="56.55" waitingCount="1" stopTime="0.00" timeLoss="67.54" rerouteNo="1" devices="tripinfo_car_n2s_270 routing_car_n2s_270" vType="Car" speedFactor="1.07" vaporized=""/>
    <tripinfo id="car_s2n_257" depart="257.00" departLane="s2sep_1" departPos="3.60" departPosLat="0.00" departSpeed="13.90" departDelay="0.00" arrival="475.45" arrivalLane="c2n_1" arrivalPos="990.00" arrivalPosLat="0.00" arrivalSpeed="13.89" duration="218.45" routeLength="1997.01" waitingTime="64.10" waitingCount="1" stopTime="0.00" timeLoss="74.76" rerouteNo="1" devices="tripinfo_car_s2n_257 routing_car_s2n_257" vType="Car" speedFactor="1.00" vaporized=""/>
    <tripinfo id="car_s2e_268" depart="268.00" departLane="s2sep_1" departPos="3.60" departPosLat="0.00" departSpeed="13.90" departDelay="0.00" arrival="477.25" arrivalLane="c2e_1" arrivalPos="990.00" arrivalPosLat="0.00" arrivalSpeed="13.96" duration="209.25" routeLength="1986.69" waitingTime="55.65" waitingCount="1" stopTime="0.00" timeLoss="66.23" rerouteNo="1" devices="tripinfo_car_s2e_268 routing_car_s2e_268" vType="Car" speedFactor="1.00" vaporized=""/>
    <tripinfo id="car_s2n_262" depart="262.00" departLane="s2sep_1" departPos="3.60" departPosLat="0.00" departSpeed="13.90" departDelay="0.00" arrival="477.60" arrivalLane="c2n_1" arrivalPos="990.00" arrivalPosLat="0.00" arrivalSpeed="14.85" duration="215.60" routeLength="1997.01" waitingTime="63.20" waitingCount="1" stopTime="0.00" timeLoss="84.54" rerouteNo="1" devices="tripinfo_car_s2n_262 routing_car_s2n_262" vType="Car" speedFactor="1.10" vaporized=""/>
    <tripinfo id="car_n2s_316" depart="316.00" departLane="n2sep_1" departPos="3.60" departPosLat="0.00" departSpeed="13.90" departDelay="0.00" arrival="478.20" arrivalLane="c2s_1" arrivalPos="990.00" arrivalPosLat="0.00" arrivalSpeed="13.95" duration="162.20" routeLength="1997.01" waitingTime="7.75" waitingCount="1" stopTime="0.00" timeLoss="19.06" rerouteNo="1" devices="tripinfo_car_n2s_316 routing_car_n2s_316" vType="Car" speedFactor="1.00" vaporized=""/>
    <tripinfo id="car_s2w_279" depart="279.00" departLane="s2sep_1" departPos="3.60" departPosLat="0.00" departSpeed="13.90" departDelay="0.00" arrival="478.55" arrivalLane="c2w_1" arrivalPos="990.00" arrivalPosLat="0.00" arrivalSpeed="14.23" duration="199.55" routeLength="1996.47" waitingTime="45.90" waitingCount="2" stopTime="0.00" timeLoss="58.50" rerouteNo="1" devices="tripinfo_car_s2w_279 routing_car_s2w_279" vType="Car" speedFactor="1.02" vaporized=""/>
    <tripinfo id="car_s2n_275" depart="275.00" departLane="s2sep_1" departPos="3.60" departPosLat="0.00" departSpeed="13.90" departDelay="0.00" arrival="481.15" arrivalLane="c2n_1" arrivalPos="990.00" arrivalPosLat="0.00" arrivalSpeed="14.30" duration="206.15" routeLength="1997.01" waitingTime="51.40" waitingCount="1" stopTime="0.00" timeLoss="66.85" rerouteNo="1" devices="tripinfo_car_s2n_275 routing_car_s2n_275" vType="Car" speedFactor="1.03" vaporized=""/>
    <tripinfo id="car_s2e_269" depart="269.45" departLane="s2sep_1" departPos="3.60" departPosLat="0.00" departSpeed="13.90" departDelay="0.45" arrival="481.80" arrivalLane="c2e_1" arrivalPos="990.00" arrivalPosLat="0.00" arrivalSpeed="13.94" duration="212.35" routeLength="1986.69" waitingTime="53.15" waitingCount="1" stopTime="0.00" timeLoss="69.13" rerouteNo="1" devices="tripinfo_car_s2e_269 routing_car_s2e_269" vType="Car" speedFactor="1.00" vaporized=""/>
    <tripinfo id="car_s2n_279" depart="280.45" departLane="s2sep_1" departPos="3.60" departPosLat="0.00" departSpeed="13.90" departDelay="1.45" arrival="483.95" arrivalLane="c2n_1" arrivalPos="990.00" arrivalPosLat="0.00" arrivalSpeed="14.63" duration="203.50" routeLength="1997.01" waitingTime="46.05" waitingCount="1" stopTime="0.00" timeLoss="68.04" rerouteNo="1" devices="tripinfo_car_s2n_279 routing_car_s2n_279" vType="Car" speedFactor="1.06" vaporized=""/>
    <tripinfo id="car_n2e_301" depart="301.00" departLane="n2sep_1" departPos="3.60" departPosLat="0.00" departSpeed="13.90" departDelay="0.00" arrival="483.95" arrivalLane="c2e_1" arrivalPos="990.00" arrivalPosLat="0.00" arrivalSpeed="15.42" duration="182.95" routeLength="1996.47" waitingTime="41.95" waitingCount="2" stopTime="0.00" timeLoss="56.59" rerouteNo="1" devices="tripinfo_car_n2e_301 routing_car_n2e_301" vType="Car" speedFactor="1.14" vaporized=""/>
    <tripinfo id="bus_s2w_286" depart="286.00" departLane="s2sep_1" departPos="12.10" departPosLat="0.00" departSpeed="13.90" departDelay="0.00" arrival="485.75" arrivalLane="c2w_1" arrivalPos="990.00" arrivalPosLat="0.00" arrivalSpeed="13.89" duration="199.75" routeLength="1987.97" waitingTime="39.05" waitingCount="2" stopTime="0.00" timeLoss="56.01" rerouteNo="1" devices="tripinfo_bus_s2w_286 routing_bus_s2w_286" vType="Bus" speedFactor="1.00" vaporized=""/>
</tripinfos>
