<?xml version="1.0" encoding="UTF-8"?>

<!-- generated on Sat Apr 24 18:39:12 2021 by Eclipse SUMO Version 1.4.0
<configuration xmlns:xsi="http://www.w3.org/2001/XMLSchema-instance" xsi:noNamespaceSchemaLocation="http://sumo.dlr.de/xsd/sumoConfiguration.xsd">

    <input>
        <net-file value="sumofiles/junction.net.xml"/>
        <route-files value="sumofiles/junction_preemption_357.rou.xml"/>
        <additional-files value="sumofiles/junction.det.xml"/>
    </input>

    <output>
        <tripinfo-output value="sumofiles/output/tripinfo_preemption_357.xml"/>
    </output>

    <time>
        <begin value="0"/>
        <end value="10000"/>
        <step-length value="0.05"/>
    </time>

    <processing>
        <lateral-resolution value="0.1"/>
    </processing>

    <report>
        <no-warnings value="true"/>
        <error-log value="sumofiles/output/errorlog_preemption_357.log"/>
        <no-step-log value="true"/>
    </report>

    <traci_server>
        <remote-port value="60939"/>
    </traci_server>

    <gui_only>
        <gui-settings-file value="sumofiles/junction-gui.settings.xml"/>
        <tracker-interval value="0.05"/>
    </gui_only>

</configuration>
-->

<tripinfos xmlns:xsi="http://www.w3.org/2001/XMLSchema-instance" xsi:noNamespaceSchemaLocation="http://sumo.dlr.de/xsd/tripinfo_file.xsd">
    <tripinfo id="car_w2s_4" depart="4.00" departLane="w2sep_1" departPos="3.60" departPosLat="0.00" departSpeed="13.90" departDelay="0.00" arrival="140.55" arrivalLane="c2s_1" arrivalPos="990.00" arrivalPosLat="0.00" arrivalSpeed="15.05" duration="136.55" routeLength="1986.69" waitingTime="0.00" waitingCount="0" stopTime="0.00" timeLoss="3.86" rerouteNo="1" devices="tripinfo_car_w2s_4 routing_car_w2s_4" vType="Car" speedFactor="1.08" vaporized=""/>
    <tripinfo id="car_e2s_8" depart="8.00" departLane="e2sep_1" departPos="3.60" departPosLat="0.00" departSpeed="13.90" departDelay="0.00" arrival="151.65" arrivalLane="c2s_1" arrivalPos="990.00" arrivalPosLat="0.00" arrivalSpeed="14.32" duration="143.65" routeLength="1996.47" waitingTime="0.00" waitingCount="0" stopTime="0.00" timeLoss="3.56" rerouteNo="1" devices="tripinfo_car_e2s_8 routing_car_e2s_8" vType="Car" speedFactor="1.03" vaporized=""/>
    <tripinfo id="car_e2s_14" depart="14.00" departLane="e2sep_1" departPos="3.60" departPosLat="0.00" departSpeed="13.90" departDelay="0.00" arrival="158.95" arrivalLane="c2s_1" arrivalPos="990.00" arrivalPosLat="0.00" arrivalSpeed="14.54" duration="144.95" routeLength="1996.47" waitingTime="0.00" waitingCount="0" stopTime="0.00" timeLoss="6.93" rerouteNo="1" devices="tripinfo_car_e2s_14 routing_car_e2s_14" vType="Car" speedFactor="1.05" vaporized=""/>
    <tripinfo id="car_n2e_1" depart="1.00" departLane="n2sep_1" departPos="3.60" departPosLat="0.00" departSpeed="13.90" departDelay="0.00" arrival="162.80" arrivalLane="c2e_1" arrivalPos="990.00" arrivalPosLat="0.00" arrivalSpeed="14.73" duration="161.80" routeLength="1996.47" waitingTime="17.75" waitingCount="1" stopTime="0.00" timeLoss="25.65" rerouteNo="1" devices="tripinfo_car_n2e_1 routing_car_n2e_1" vType="Car" speedFactor="1.06" vaporized=""/>
    <tripinfo id="car_n2s_1" depart="2.35" departLane="n2sep_1" departPos="3.60" departPosLat="0.00" departSpeed="13.90" departDelay="1.35" arrival="163.20" arrivalLane="c2s_1" arrivalPos="990.00" arrivalPosLat="0.00" arrivalSpeed="14.72" duration="160.85" routeLength="1997.01" waitingTime="13.85" waitingCount="1" stopTime="0.00" timeLoss="25.29" rerouteNo="1" devices="tripinfo_car_n2s_1 routing_car_n2s_1" vType="Car" speedFactor="1.06" vaporized=""/>
    <tripinfo id="car_s2w_2" depart="2.00" departLane="s2sep_1" departPos="3.60" departPosLat="0.00" departSpeed="13.90" departDelay="0.00" arrival="167.05" arrivalLane="c2w_1" arrivalPos="990.00" arrivalPosLat="0.00" arrivalSpeed="14.04" duration="165.05" routeLength="1996.47" waitingTime="13.65" waitingCount="1" stopTime="0.00" timeLoss="22.21" rerouteNo="1" devices="tripinfo_car_s2w_2 routing_car_s2w_2" vType="Car" speedFactor="1.01" vaporized=""/>
    <tripinfo id="car_n2e_15" depart="15.00" departLane="n2sep_1" departPos="3.60" departPosLat="0.00" departSpeed="13.90" departDelay="0.00" arrival="169.60" arrivalLane="c2e_1" arrivalPos="990.00" arrivalPosLat="0.00" arrivalSpeed="14.04" duration="154.60" routeLength="1996.47" waitingTime="1.50" waitingCount="1" stopTime="0.00" timeLoss="11.78" rerouteNo="1" devices="tripinfo_car_n2e_15 routing_car_n2e_15" vType="Car" speedFactor="1.01" vaporized=""/>
    <tripinfo id="car_s2w_20" depart="20.00" departLane="s2sep_1" departPos="3.60" departPosLat="0.00" departSpeed="13.90" departDelay="0.00" arrival="170.70" arrivalLane="c2w_1" arrivalPos="990.00" arrivalPosLat="0.00" arrivalSpeed="14.29" duration="150.70" routeLength="1996.47" waitingTime="0.00" waitingCount="0" stopTime="0.00" timeLoss="10.63" rerouteNo="1" devices="tripinfo_car_s2w_20 routing_car_s2w_20" vType="Car" speedFactor="1.03" vaporized=""/>
    <tripinfo id="car_n2w_29" depart="29.00" departLane="n2sep_1" departPos="3.60" departPosLat="0.00" departSpeed="13.90" departDelay="0.00" arrival="177.00" arrivalLane="c2w_1" arrivalPos="990.00" arrivalPosLat="0.00" arrivalSpeed="13.90" duration="148.00" routeLength="1986.69" waitingTime="0.00" waitingCount="0" stopTime="0.00" timeLoss="4.34" rerouteNo="1" devices="tripinfo_car_n2w_29 routing_car_n2w_29" vType="Car" speedFactor="1.00" vaporized=""/>
    <tripinfo id="car_n2e_33" depart="33.00" departLane="n2sep_1" departPos="3.60" departPosLat="0.00" departSpeed="13.90" departDelay="0.00" arrival="181.80" arrivalLane="c2e_1" arrivalPos="990.00" arrivalPosLat="0.00" arrivalSpeed="13.90" duration="148.80" routeLength="1996.47" waitingTime="0.00" waitingCount="0" stopTime="0.00" timeLoss="4.48" rerouteNo="1" devices="tripinfo_car_n2e_33 routing_car_n2e_33" vType="Car" speedFactor="1.00" vaporized=""/>
    <tripinfo id="car_n2s_44" depart="44.00" departLane="n2sep_1" departPos="3.60" departPosLat="0.00" departSpeed="13.90" departDelay="0.00" arrival="187.95" arrivalLane="c2s_1" arrivalPos="990.00" arrivalPosLat="0.00" arrivalSpeed="13.90" duration="143.95" routeLength="1997.01" waitingTime="0.00" waitingCount="0" stopTime="0.00" timeLoss="0.25" rerouteNo="1" devices="tripinfo_car_n2s_44 routing_car_n2s_44" vType="Car" speedFactor="1.00" vaporized=""/>
    <tripinfo id="car_n2s_53" depart="53.00" departLane="n2sep_1" departPos="3.60" departPosLat="0.00" departSpeed="13.90" departDelay="0.00" arrival="190.30" arrivalLane="c2s_1" arrivalPos="990.00" arrivalPosLat="0.00" arrivalSpeed="14.90" duration="137.30" routeLength="1997.01" waitingTime="0.00" waitingCount="0" stopTime="0.00" timeLoss="5.56" rerouteNo="1" devices="tripinfo_car_n2s_53 routing_car_n2s_53" vType="Car" speedFactor="1.09" vaporized=""/>
    <tripinfo id="car_s2w_47" depart="47.00" departLane="s2sep_1" departPos="3.60" departPosLat="0.00" departSpeed="13.90" departDelay="0.00" arrival="193.50" arrivalLane="c2w_1" arrivalPos="990.00" arrivalPosLat="0.00" arrivalSpeed="14.15" duration="146.50" routeLength="1996.47" waitingTime="0.00" waitingCount="0" stopTime="0.00" timeLoss="4.72" rerouteNo="1" devices="tripinfo_car_s2w_47 routing_car_s2w_47" vType="Car" speedFactor="1.02" vaporized=""/>
    <tripinfo id="car_s2w_52" depart="52.00" departLane="s2sep_1" departPos="3.60" departPosLat="0.00" departSpeed="13.90" departDelay="0.00" arrival="199.65" arrivalLane="c2w_1" arrivalPos="990.00" arrivalPosLat="0.00" arrivalSpeed="14.04" duration="147.65" routeLength="1996.47" waitingTime="0.00" waitingCount="0" stopTime="0.00" timeLoss="4.77" rerouteNo="1" devices="tripinfo_car_s2w_52 routing_car_s2w_52" vType="Car" speedFactor="1.01" vaporized=""/>
    <tripinfo id="car_w2s_18" depart="18.00" departLane="w2sep_1" departPos="3.60" departPosLat="0.00" departSpeed="13.90" departDelay="0.00" arrival="205.40" arrivalLane="c2s_1" arrivalPos="990.00" arrivalPosLat="0.00" arrivalSpeed="15.05" duration="187.40" routeLength="1986.69" waitingTime="47.35" waitingCount="1" stopTime="0.00" timeLoss="54.69" rerouteNo="1" devices="tripinfo_car_w2s_18 routing_car_w2s_18" vType="Car" speedFactor="1.08" vaporized=""/>
    <tripinfo id="car_e2n_46" depart="46.00" departLane="e2sep_1" departPos="3.60" departPosLat="0.00" departSpeed="13.90" departDelay="0.00" arrival="205.65" arrivalLane="c2n_1" arrivalPos="990.00" arrivalPosLat="0.00" arrivalSpeed="16.10" duration="159.65" routeLength="1986.69" waitingTime="18.05" waitingCount="1" stopTime="0.00" timeLoss="35.60" rerouteNo="1" devices="tripinfo_car_e2n_46 routing_car_e2n_46" vType="Car" speedFactor="1.16" vaporized=""/>
    <tripinfo id="car_w2s_26" depart="26.00" departLane="w2sep_1" departPos="3.60" departPosLat="0.00" departSpeed="13.90" departDelay="0.00" arrival="209.45" arrivalLane="c2s_1" arrivalPos="990.00" arrivalPosLat="0.00" arrivalSpeed="15.14" duration="183.45" routeLength="1986.69" waitingTime="40.30" waitingCount="1" stopTime="0.00" timeLoss="51.71" rerouteNo="1" devices="tripinfo_car_w2s_26 routing_car_w2s_26" vType="Car" speedFactor="1.09" vaporized=""/>
    <tripinfo id="car_e2w_9" depart="9.40" departLane="e2sep_1" departPos="3.60" departPosLat="0.00" departSpeed="13.90" departDelay="0.40" arrival="210.85" arrivalLane="c2w_1" arrivalPos="990.00" arrivalPosLat="0.00" arrivalSpeed="13.90" duration="201.45" routeLength="1997.01" waitingTime="48.95" waitingCount="1" stopTime="0.00" timeLoss="57.78" rerouteNo="1" devices="tripinfo_car_e2w_9 routing_car_e2w_9" vType="Car" speedFactor="1.00" vaporized=""/>
    <tripinfo id="car_w2e_28" depart="28.00" departLane="w2sep_1" departPos="3.60" departPosLat="0.00" departSpeed="13.90" departDelay="0.00" arrival="213.30" arrivalLane="c2e_1" arrivalPos="990.00" arrivalPosLat="0.00" arrivalSpeed="14.27" duration="185.30" routeLength="1997.01" waitingTime="34.80" waitingCount="1" stopTime="0.00" timeLoss="45.29" rerouteNo="1" devices="tripinfo_car_w2e_28 routing_car_w2e_28" vType="Car" speedFactor="1.03" vaporized=""/>
    <tripinfo id="car_e2w_42" depart="42.00" departLane="e2sep_1" departPos="3.60" departPosLat="0.00" departSpeed="13.90" departDelay="0.00" arrival="215.20" arrivalLane="c2w_1" arrivalPos="990.00" arrivalPosLat="0.00" arrivalSpeed="13.89" duration="173.20" routeLength="1997.01" waitingTime="18.75" waitingCount="1" stopTime="0.00" timeLoss="29.50" rerouteNo="1" devices="tripinfo_car_e2w_42 routing_car_e2w_42" vType="Car" speedFactor="1.00" vaporized=""/>
    <tripinfo id="car_w2s_28" depart="29.55" departLane="w2sep_1" departPos="3.60" departPosLat="0.00" departSpeed="13.90" departDelay="1.55" arrival="215.40" arrivalLane="c2s_1" arrivalPos="990.00" arrivalPosLat="0.00" arrivalSpeed="14.55" duration="185.85" routeLength="1986.69" waitingTime="33.05" waitingCount="1" stopTime="0.00" timeLoss="48.62" rerouteNo="1" devices="tripinfo_car_w2s_28 routing_car_w2s_28" vType="Car" speedFactor="1.05" vaporized=""/>
    <tripinfo id="car_w2s_29" depart="31.35" departLane="w2sep_1" departPos="3.60" departPosLat="0.00" departSpeed="13.90" departDelay="2.35" arrival="217.80" arrivalLane="c2s_1" arrivalPos="990.00" arrivalPosLat="0.00" arrivalSpeed="15.36" duration="186.45" routeLength="1986.69" waitingTime="32.20" waitingCount="1" stopTime="0.00" timeLoss="58.48" rerouteNo="1" devices="tripinfo_car_w2s_29 routing_car_w2s_29" vType="Car" speedFactor="1.12" vaporized=""/>
    <tripinfo id="car_w2n_65" depart="65.00" departLane="w2sep_1" departPos="3.60" departPosLat="0.00" departSpeed="13.90" departDelay="0.00" arrival="218.55" arrivalLane="c2n_1" arrivalPos="990.00" arrivalPosLat="0.00" arrivalSpeed="13.90" duration="153.55" routeLength="1996.47" waitingTime="1.90" waitingCount="1" stopTime="0.00" timeLoss="9.23" rerouteNo="1" devices="tripinfo_car_w2n_65 routing_car_w2n_65" vType="Car" speedFactor="1.00" vaporized=""/>
    <tripinfo id="bus_w2e_34" depart="34.00" departLane="w2sep_1" departPos="12.10" departPosLat="0.00" departSpeed="13.90" departDelay="0.00" arrival="223.45" arrivalLane="c2e_1" arrivalPos="990.00" arrivalPosLat="0.00" arrivalSpeed="13.90" duration="189.45" routeLength="1988.51" waitingTime="30.50" waitingCount="1" stopTime="0.00" timeLoss="46.39" rerouteNo="1" devices="tripinfo_bus_w2e_34 routing_bus_w2e_34" vType="Bus" speedFactor="1.00" vaporized=""/>
    <tripinfo id="car_e2s_32" depart="32.00" departLane="e2sep_1" departPos="3.60" departPosLat="0.00" departSpeed="13.90" departDelay="0.00" arrival="225.30" arrivalLane="c2s_1" arrivalPos="990.00" arrivalPosLat="0.00" arrivalSpeed="14.54" duration="193.30" routeLength="1996.47" waitingTime="43.75" waitingCount="2" stopTime="0.00" timeLoss="55.29" rerouteNo="1" devices="tripinfo_car_e2s_32 routing_car_e2s_32" vType="Car" speedFactor="1.05" vaporized=""/>
    <tripinfo id="car_e2n_100" depart="100.00" departLane="e2sep_1" departPos="3.60" departPosLat="0.00" departSpeed="13.90" departDelay="0.00" arrival="226.60" arrivalLane="c2n_1" arrivalPos="990.00" arrivalPosLat="0.00" arrivalSpeed="16.40" duration="126.60" routeLength="1986.69" waitingTime="0.00" waitingCount="0" stopTime="0.00" timeLoss="4.78" rerouteNo="1" devices="tripinfo_car_e2n_100 routing_car_e2n_100" vType="Car" speedFactor="1.18" vaporized=""/>
    <tripinfo id="car_e2s_74" depart="74.00" departLane="e2sep_1" departPos="3.60" departPosLat="0.00" departSpeed="13.90" departDelay="0.00" arrival="227.30" arrivalLane="c2s_1" arrivalPos="990.00" arrivalPosLat="0.00" arrivalSpeed="15.79" duration="153.30" routeLength="1996.47" waitingTime="12.00" waitingCount="1" stopTime="0.00" timeLoss="30.85" rerouteNo="1" devices="tripinfo_car_e2s_74 routing_car_e2s_74" vType="Car" speedFactor="1.18" vaporized=""/>
    <tripinfo id="car_w2e_55" depart="55.00" departLane="w2sep_1" departPos="3.60" departPosLat="0.00" departSpeed="13.90" departDelay="0.00" arrival="227.40" arrivalLane="c2e_1" arrivalPos="990.00" arrivalPosLat="0.00" arrivalSpeed="14.24" duration="172.40" routeLength="1997.01" waitingTime="14.80" waitingCount="1" stopTime="0.00" timeLoss="32.40" rerouteNo="1" devices="tripinfo_car_w2e_55 routing_car_w2e_55" vType="Car" speedFactor="1.03" vaporized=""/>
    <tripinfo id="car_w2e_102" depart="102.00" departLane="w2sep_1" departPos="3.60" departPosLat="0.00" departSpeed="13.90" departDelay="0.00" arrival="229.45" arrivalLane="c2e_1" arrivalPos="990.00" arrivalPosLat="0.00" arrivalSpeed="15.57" duration="127.45" routeLength="1997.01" waitingTime="0.00" waitingCount="0" stopTime="0.00" timeLoss="3.41" rerouteNo="1" devices="tripinfo_car_w2e_102 routing_car_w2e_102" vType="Car" speedFactor="1.16" vaporized=""/>
    <tripinfo id="car_e2s_84" depart="84.00" departLane="e2sep_1" departPos="3.60" departPosLat="0.00" departSpeed="13.90" departDelay="0.00" arrival="233.30" arrivalLane="c2s_1" arrivalPos="990.00" arrivalPosLat="0.00" arrivalSpeed="13.97" duration="149.30" routeLength="1996.47" waitingTime="0.00" waitingCount="0" stopTime="0.00" timeLoss="5.73" rerouteNo="1" devices="tripinfo_car_e2s_84 routing_car_e2s_84" vType="Car" speedFactor="1.01" vaporized=""/>
    <tripinfo id="car_e2s_109" depart="109.00" departLane="e2sep_1" departPos="3.60" departPosLat="0.00" departSpeed="13.90" departDelay="0.00" arrival="245.35" arrivalLane="c2s_1" arrivalPos="990.00" arrivalPosLat="0.00" arrivalSpeed="15.18" duration="136.35" routeLength="1996.47" waitingTime="0.00" waitingCount="0" stopTime="0.00" timeLoss="4.17" rerouteNo="1" devices="tripinfo_car_e2s_109 routing_car_e2s_109" vType="Car" speedFactor="1.09" vaporized=""/>
    <tripinfo id="car_s2n_64" depart="64.00" departLane="s2sep_1" departPos="3.60" departPosLat="0.00" departSpeed="13.90" departDelay="0.00" arrival="248.15" arrivalLane="c2n_1" arrivalPos="990.00" arrivalPosLat="0.00" arrivalSpeed="15.61" duration="184.15" routeLength="1997.01" waitingTime="48.30" waitingCount="1" stopTime="0.00" timeLoss="56.17" rerouteNo="1" devices="tripinfo_car_s2n_64 routing_car_s2n_64" vType="Car" speedFactor="1.12" vaporized=""/>
    <tripinfo id="car_n2s_58" depart="58.00" departLane="n2sep_1" departPos="3.60" departPosLat="0.00" departSpeed="13.90" departDelay="0.00" arrival="253.05" arrivalLane="c2s_1" arrivalPos="990.00" arrivalPosLat="0.00" arrivalSpeed="14.55" duration="195.05" routeLength="1997.01" waitingTime="50.00" waitingCount="1" stopTime="0.00" timeLoss="57.85" rerouteNo="1" devices="tripinfo_car_n2s_58 routing_car_n2s_58" vType="Car" speedFactor="1.05" vaporized=""/>
    <tripinfo id="car_s2w_74" depart="74.45" departLane="s2sep_1" departPos="3.60" departPosLat="0.00" departSpeed="13.90" departDelay="0.45" arrival="255.20" arrivalLane="c2w_1" arrivalPos="990.00" arrivalPosLat="0.00" arrivalSpeed="16.05" duration="180.75" routeLength="1996.47" waitingTime="34.80" waitingCount="2" stopTime="0.00" timeLoss="55.72" rerouteNo="1" devices="tripinfo_car_s2w_74 routing_car_s2w_74" vType="Car" speedFactor="1.15" vaporized=""/>
    <tripinfo id="car_s2e_73" depart="73.00" departLane="s2sep_1" departPos="3.60" departPosLat="0.00" departSpeed="13.90" departDelay="0.00" arrival="257.95" arrivalLane="c2e_1" arrivalPos="990.00" arrivalPosLat="0.00" arrivalSpeed="13.90" duration="184.95" routeLength="1986.69" waitingTime="32.85" waitingCount="1" stopTime="0.00" timeLoss="41.28" rerouteNo="1" devices="tripinfo_car_s2e_73 routing_car_s2e_73" vType="Car" speedFactor="1.00" vaporized=""/>
    <tripinfo id="car_n2s_69" depart="69.00" departLane="n2sep_1" departPos="3.60" departPosLat="0.00" departSpeed="13.90" departDelay="0.00" arrival="259.25" arrivalLane="c2s_1" arrivalPos="990.00" arrivalPosLat="0.00" arrivalSpeed="13.90" duration="190.25" routeLength="1997.01" waitingTime="36.80" waitingCount="1" stopTime="0.00" timeLoss="46.56" rerouteNo="1" devices="tripinfo_car_n2s_69 routing_car_n2s_69" vType="Car" speedFactor="1.00" vaporized=""/>
    <tripinfo id="car_n2s_86" depart="86.00" departLane="n2sep_1" departPos="3.60" departPosLat="0.00" departSpeed="13.90" departDelay="0.00" arrival="261.10" arrivalLane="c2s_1" arrivalPos="990.00" arrivalPosLat="0.00" arrivalSpeed="15.43" duration="175.10" routeLength="1997.01" waitingTime="30.55" waitingCount="1" stopTime="0.00" timeLoss="52.47" rerouteNo="1" devices="tripinfo_car_n2s_86 routing_car_n2s_86" vType="Car" speedFactor="1.17" vaporized=""/>
    <tripinfo id="car_s2e_108" depart="108.00" departLane="s2sep_1" departPos="3.60" departPosLat="0.00" departSpeed="13.90" departDelay="0.00" arrival="261.75" arrivalLane="c2e_1" arrivalPos="990.00" arrivalPosLat="0.00" arrivalSpeed="14.13" duration="153.75" routeLength="1986.69" waitingTime="0.00" waitingCount="0" stopTime="0.00" timeLoss="12.62" rerouteNo="1" devices="tripinfo_car_s2e_108 routing_car_s2e_108" vType="Car" speedFactor="1.02" vaporized=""/>
    <tripinfo id="car_s2n_118" depart="118.00" departLane="s2sep_1" departPos="3.60" departPosLat="0.00" departSpeed="13.90" departDelay="0.00" arrival="262.85" arrivalLane="c2n_1" arrivalPos="990.00" arrivalPosLat="0.00" arrivalSpeed="13.90" duration="144.85" routeLength="1997.01" waitingTime="0.00" waitingCount="0" stopTime="0.00" timeLoss="1.19" rerouteNo="1" devices="tripinfo_car_s2n_118 routing_car_s2n_118" vType="Car" speedFactor="1.00" vaporized=""/>
    <tripinfo id="car_n2e_72" depart="72.00" departLane="n2sep_1" departPos="3.60" departPosLat="0.00" departSpeed="13.90" departDelay="0.00" arrival="263.75" arrivalLane="c2e_1" arrivalPos="990.00" arrivalPosLat="0.00" arrivalSpeed="15.19" duration="191.75" routeLength="1996.47" waitingTime="40.35" waitingCount="2" stopTime="0.00" timeLoss="64.23" rerouteNo="1" devices="tripinfo_car_n2e_72 routing_car_n2e_72" vType="Car" speedFactor="1.13" vaporized=""/>
    <tripinfo id="car_n2s_87" depart="87.25" departLane="n2sep_1" departPos="3.60" departPosLat="0.00" departSpeed="13.90" departDelay="0.25" arrival="264.45" arrivalLane="c2s_1" arrivalPos="990.00" arrivalPosLat="0.00" arrivalSpeed="14.14" duration="177.20" routeLength="1997.01" waitingTime="21.50" waitingCount="1" stopTime="0.00" timeLoss="36.30" rerouteNo="1" devices="tripinfo_car_n2s_87 routing_car_n2s_87" vType="Car" speedFactor="1.02" vaporized=""/>
    <tripinfo id="car_s2w_86" depart="86.00" departLane="s2sep_1" departPos="3.60" departPosLat="0.00" departSpeed="13.90" departDelay="0.00" arrival="266.95" arrivalLane="c2w_1" arrivalPos="990.00" arrivalPosLat="0.00" arrivalSpeed="13.90" duration="180.95" routeLength="1996.47" waitingTime="23.00" waitingCount="2" stopTime="0.00" timeLoss="36.63" rerouteNo="1" devices="tripinfo_car_s2w_86 routing_car_s2w_86" vType="Car" speedFactor="1.00" vaporized=""/>
    <tripinfo id="car_n2e_91" depart="91.00" departLane="n2sep_1" departPos="3.60" departPosLat="0.00" departSpeed="13.90" departDelay="0.00" arrival="269.35" arrivalLane="c2e_1" arrivalPos="990.00" arrivalPosLat="0.00" arrivalSpeed="13.90" duration="178.35" routeLength="1996.47" waitingTime="18.75" waitingCount="2" stopTime="0.00" timeLoss="34.01" rerouteNo="1" devices="tripinfo_car_n2e_91 routing_car_n2e_91" vType="Car" speedFactor="1.00" vaporized=""/>
    <tripinfo id="car_s2w_121" depart="121.00" departLane="s2sep_1" departPos="3.60" departPosLat="0.00" departSpeed="13.90" departDelay="0.00" arrival="271.75" arrivalLane="c2w_1" arrivalPos="990.00" arrivalPosLat="0.00" arrivalSpeed="13.89" duration="150.75" routeLength="1996.47" waitingTime="0.00" waitingCount="0" stopTime="0.00" timeLoss="6.44" rerouteNo="1" devices="tripinfo_car_s2w_121 routing_car_s2w_121" vType="Car" speedFactor="1.00" vaporized=""/>
    <tripinfo id="car_s2n_146" depart="146.00" departLane="s2sep_1" departPos="3.60" departPosLat="0.00" departSpeed="13.90" departDelay="0.00" arrival="280.75" arrivalLane="c2n_1" arrivalPos="990.00" arrivalPosLat="0.00" arrivalSpeed="15.05" duration="134.75" routeLength="1997.01" waitingTime="0.00" waitingCount="0" stopTime="0.00" timeLoss="2.02" rerouteNo="1" devices="tripinfo_car_s2n_146 routing_car_s2n_146" vType="Car" speedFactor="1.08" vaporized=""/>
    <tripinfo id="car_n2e_146" depart="146.00" departLane="n2sep_1" departPos="3.60" departPosLat="0.00" departSpeed="13.90" departDelay="0.00" arrival="281.65" arrivalLane="c2e_1" arrivalPos="990.00" arrivalPosLat="0.00" arrivalSpeed="15.73" duration="135.65" routeLength="1996.47" waitingTime="0.55" waitingCount="1" stopTime="0.00" timeLoss="8.11" rerouteNo="1" devices="tripinfo_car_n2e_146 routing_car_n2e_146" vType="Car" speedFactor="1.13" vaporized=""/>
    <tripinfo id="car_s2w_140" depart="140.00" departLane="s2sep_1" departPos="3.60" departPosLat="0.00" departSpeed="13.90" departDelay="0.00" arrival="287.70" arrivalLane="c2w_1" arrivalPos="990.00" arrivalPosLat="0.00" arrivalSpeed="13.90" duration="147.70" routeLength="1996.47" waitingTime="0.00" waitingCount="0" stopTime="0.00" timeLoss="3.36" rerouteNo="1" devices="tripinfo_car_s2w_140 routing_car_s2w_140" vType="Car" speedFactor="1.00" vaporized=""/>
    <tripinfo id="car_e2n_101" depart="101.25" departLane="e2sep_1" departPos="3.60" departPosLat="0.00" departSpeed="13.90" departDelay="0.25" arrival="294.25" arrivalLane="c2n_1" arrivalPos="990.00" arrivalPosLat="0.00" arrivalSpeed="15.32" duration="193.00" routeLength="1986.69" waitingTime="53.85" waitingCount="1" stopTime="0.00" timeLoss="62.68" rerouteNo="1" devices="tripinfo_car_e2n_101 routing_car_e2n_101" vType="Car" speedFactor="1.10" vaporized=""/>
    <tripinfo id="car_e2w_143" depart="143.00" departLane="e2sep_1" departPos="3.60" departPosLat="0.00" departSpeed="13.90" departDelay="0.00" arrival="296.60" arrivalLane="c2w_1" arrivalPos="990.00" arrivalPosLat="0.00" arrivalSpeed="15.88" duration="153.60" routeLength="1997.01" waitingTime="17.20" waitingCount="1" stopTime="0.00" timeLoss="27.82" rerouteNo="1" devices="tripinfo_car_e2w_143 routing_car_e2w_143" vType="Car" speedFactor="1.14" vaporized=""/>
    <tripinfo id="car_w2e_129" depart="129.00" departLane="w2sep_1" departPos="3.60" departPosLat="0.00" departSpeed="13.90" departDelay="0.00" arrival="297.45" arrivalLane="c2e_1" arrivalPos="990.00" arrivalPosLat="0.00" arrivalSpeed="16.25" duration="168.45" routeLength="1997.01" waitingTime="27.90" waitingCount="1" stopTime="0.00" timeLoss="45.53" rerouteNo="1" devices="tripinfo_car_w2e_129 routing_car_w2e_129" vType="Car" speedFactor="1.17" vaporized=""/>
    <tripinfo id="car_w2s_113" depart="113.00" departLane="w2sep_1" departPos="3.60" departPosLat="0.00" departSpeed="13.90" departDelay="0.00" arrival="298.10" arrivalLane="c2s_1" arrivalPos="990.00" arrivalPosLat="0.00" arrivalSpeed="14.42" duration="185.10" routeLength="1986.69" waitingTime="38.75" waitingCount="1" stopTime="0.00" timeLoss="46.65" rerouteNo="1" devices="tripinfo_car_w2s_113 routing_car_w2s_113" vType="Car" speedFactor="1.04" vaporized=""/>
    <tripinfo id="car_e2n_131" depart="131.00" departLane="e2sep_1" departPos="3.60" departPosLat="0.00" departSpeed="13.90" departDelay="0.00" arrival="298.80" arrivalLane="c2n_1" arrivalPos="990.00" arrivalPosLat="0.00" arrivalSpeed="15.22" duration="167.80" routeLength="1986.69" waitingTime="22.80" waitingCount="1" stopTime="0.00" timeLoss="36.69" rerouteNo="1" devices="tripinfo_car_e2n_131 routing_car_e2n_131" vType="Car" speedFactor="1.10" vaporized=""/>
    <tripinfo id="car_w2s_118" depart="118.00" departLane="w2sep_1" departPos="3.60" departPosLat="0.00" departSpeed="13.90" departDelay="0.00" arrival="303.85" arrivalLane="c2s_1" arrivalPos="990.00" arrivalPosLat="0.00" arrivalSpeed="14.04" duration="185.85" routeLength="1986.69" waitingTime="33.10" waitingCount="1" stopTime="0.00" timeLoss="43.61" rerouteNo="1" devices="tripinfo_car_w2s_118 routing_car_w2s_118" vType="Car" speedFactor="1.01" vaporized=""/>
    <tripinfo id="car_w2n_108" depart="108.00" departLane="w2sep_1" departPos="3.60" departPosLat="0.00" departSpeed="13.90" departDelay="0.00" arrival="306.50" arrivalLane="c2n_1" arrivalPos="990.00" arrivalPosLat="0.00" arrivalSpeed="14.32" duration="198.50" routeLength="1996.47" waitingTime="47.20" waitingCount="2" stopTime="0.00" timeLoss="58.41" rerouteNo="1" devices="tripinfo_car_w2n_108 routing_car_w2n_108" vType="Car" speedFactor="1.03" vaporized=""/>
    <tripinfo id="car_w2s_123" depart="123.00" departLane="w2sep_1" departPos="3.60" departPosLat="0.00" departSpeed="13.90" departDelay="0.00" arrival="308.10" arrivalLane="c2s_1" arrivalPos="990.00" arrivalPosLat="0.00" arrivalSpeed="13.89" duration="185.10" routeLength="1986.69" waitingTime="28.50" waitingCount="1" stopTime="0.00" timeLoss="41.45" rerouteNo="1" devices="tripinfo_car_w2s_123 routing_car_w2s_123" vType="Car" speedFactor="1.00" vaporized=""/>
    <tripinfo id="car_w2s_131" depart="131.00" departLane="w2sep_1" departPos="3.60" departPosLat="0.00" departSpeed="13.90" departDelay="0.00" arrival="311.45" arrivalLane="c2s_1" arrivalPos="990.00" arrivalPosLat="0.00" arrivalSpeed="14.09" duration="180.45" routeLength="1986.69" waitingTime="24.00" waitingCount="1" stopTime="0.00" timeLoss="39.13" rerouteNo="1" devices="tripinfo_car_w2s_131 routing_car_w2s_131" vType="Car" speedFactor="1.02" vaporized=""/>
    <tripinfo id="car_w2e_138" depart="138.00" departLane="w2sep_1" departPos="3.60" departPosLat="0.00" departSpeed="13.90" departDelay="0.00" arrival="311.65" arrivalLane="c2e_1" arrivalPos="990.00" arrivalPosLat="0.00" arrivalSpeed="13.94" duration="173.65" routeLength="1997.01" waitingTime="17.85" waitingCount="1" stopTime="0.00" timeLoss="30.42" rerouteNo="1" devices="tripinfo_car_w2e_138 routing_car_w2e_138" vType="Car" speedFactor="1.00" vaporized=""/>
    <tripinfo id="car_w2s_138" depart="139.45" departLane="w2sep_1" departPos="3.60" departPosLat="0.00" departSpeed="13.90" departDelay="1.45" arrival="315.75" arrivalLane="c2s_1" arrivalPos="990.00" arrivalPosLat="0.00" arrivalSpeed="13.89" duration="176.30" routeLength="1986.69" waitingTime="15.30" waitingCount="1" stopTime="0.00" timeLoss="32.61" rerouteNo="1" devices="tripinfo_car_w2s_138 routing_car_w2s_138" vType="Car" speedFactor="1.00" vaporized=""/>
    <tripinfo id="car_w2e_144" depart="144.00" departLane="w2sep_1" departPos="3.60" departPosLat="0.00" departSpeed="13.90" departDelay="0.00" arrival="315.85" arrivalLane="c2e_1" arrivalPos="990.00" arrivalPosLat="0.00" arrivalSpeed="14.21" duration="171.85" routeLength="1997.01" waitingTime="13.70" waitingCount="1" stopTime="0.00" timeLoss="31.49" rerouteNo="1" devices="tripinfo_car_w2e_144 routing_car_w2e_144" vType="Car" speedFactor="1.02" vaporized=""/>
    <tripinfo id="car_e2n_169" depart="169.00" departLane="e2sep_1" departPos="3.60" departPosLat="0.00" departSpeed="13.90" departDelay="0.00" arrival="316.60" arrivalLane="c2n_1" arrivalPos="990.00" arrivalPosLat="0.00" arrivalSpeed="13.90" duration="147.60" routeLength="1986.69" waitingTime="0.00" waitingCount="0" stopTime="0.00" timeLoss="3.93" rerouteNo="1" devices="tripinfo_car_e2n_169 routing_car_e2n_169" vType="Car" speedFactor="1.00" vaporized=""/>
    <tripinfo id="car_w2e_155" depart="155.00" departLane="w2sep_1" departPos="3.60" departPosLat="0.00" departSpeed="13.90" departDelay="0.00" arrival="317.75" arrivalLane="c2e_1" arrivalPos="990.00" arrivalPosLat="0.00" arrivalSpeed="15.53" duration="162.75" routeLength="1997.01" waitingTime="12.85" waitingCount="1" stopTime="0.00" timeLoss="40.13" rerouteNo="1" devices="tripinfo_car_w2e_155 routing_car_w2e_155" vType="Car" speedFactor="1.17" vaporized=""/>
    <tripinfo id="car_w2s_173" depart="173.00" departLane="w2sep_1" departPos="3.60" departPosLat="0.00" departSpeed="13.90" departDelay="0.00" arrival="319.50" arrivalLane="c2s_1" arrivalPos="990.00" arrivalPosLat="0.00" arrivalSpeed="14.64" duration="146.50" routeLength="1986.69" waitingTime="0.00" waitingCount="0" stopTime="0.00" timeLoss="10.40" rerouteNo="1" devices="tripinfo_car_w2s_173 routing_car_w2s_173" vType="Car" speedFactor="1.06" vaporized=""/>
    <tripinfo id="car_w2e_157" depart="157.00" departLane="w2sep_1" departPos="3.60" departPosLat="0.00" departSpeed="13.90" departDelay="0.00" arrival="321.00" arrivalLane="c2e_1" arrivalPos="990.00" arrivalPosLat="0.00" arrivalSpeed="14.41" duration="164.00" routeLength="1997.01" waitingTime="6.15" waitingCount="1" stopTime="0.00" timeLoss="25.81" rerouteNo="1" devices="tripinfo_car_w2e_157 routing_car_w2e_157" vType="Car" speedFactor="1.04" vaporized=""/>
    <tripinfo id="car_w2s_174" depart="174.35" departLane="w2sep_1" departPos="3.60" departPosLat="0.00" departSpeed="13.90" departDelay="0.35" arrival="321.45" arrivalLane="c2s_1" arrivalPos="990.00" arrivalPosLat="0.00" arrivalSpeed="15.75" duration="147.10" routeLength="1986.69" waitingTime="0.00" waitingCount="0" stopTime="0.00" timeLoss="25.31" rerouteNo="1" devices="tripinfo_car_w2s_174 routing_car_w2s_174" vType="Car" speedFactor="1.18" vaporized=""/>
    <tripinfo id="car_w2s_180" depart="180.00" departLane="w2sep_1" departPos="3.60" departPosLat="0.00" departSpeed="13.90" departDelay="0.00" arrival="326.20" arrivalLane="c2s_1" arrivalPos="990.00" arrivalPosLat="0.00" arrivalSpeed="14.35" duration="146.20" routeLength="1986.69" waitingTime="0.00" waitingCount="0" stopTime="0.00" timeLoss="7.04" rerouteNo="1" devices="tripinfo_car_w2s_180 routing_car_w2s_180" vType="Car" speedFactor="1.03" vaporized=""/>
    <tripinfo id="car_w2e_187" depart="187.00" departLane="w2sep_1" departPos="3.60" departPosLat="0.00" departSpeed="13.90" departDelay="0.00" arrival="330.55" arrivalLane="c2e_1" arrivalPos="990.00" arrivalPosLat="0.00" arrivalSpeed="14.00" duration="143.55" routeLength="1997.01" waitingTime="0.00" waitingCount="0" stopTime="0.00" timeLoss="0.90" rerouteNo="1" devices="tripinfo_car_w2e_187 routing_car_w2e_187" vType="Car" speedFactor="1.01" vaporized=""/>
    <tripinfo id="car_e2s_114" depart="114.00" departLane="e2sep_1" departPos="3.60" departPosLat="0.00" departSpeed="13.90" departDelay="0.00" arrival="331.95" arrivalLane="c2s_1" arrivalPos="990.00" arrivalPosLat="0.00" arrivalSpeed="14.50" duration="217.95" routeLength="1996.47" waitingTime="67.60" waitingCount="3" stopTime="0.00" timeLoss="79.61" rerouteNo="1" devices="tripinfo_car_e2s_114 routing_car_e2s_114" vType="Car" speedFactor="1.04" vaporized=""/>
    <tripinfo id="car_e2s_116" depart="116.00" departLane="e2sep_1" departPos="3.60" departPosLat="0.00" departSpeed="13.90" departDelay="0.00" arrival="334.75" arrivalLane="c2s_1" arrivalPos="990.00" arrivalPosLat="0.00" arrivalSpeed="15.01" duration="218.75" routeLength="1996.47" waitingTime="64.95" waitingCount="2" stopTime="0.00" timeLoss="86.12" rerouteNo="1" devices="tripinfo_car_e2s_116 routing_car_e2s_116" vType="Car" speedFactor="1.09" vaporized=""/>
    <tripinfo id="car_s2e_147" depart="147.35" departLane="s2sep_1" departPos="3.60" departPosLat="0.00" departSpeed="13.90" departDelay="0.35" arrival="338.50" arrivalLane="c2e_1" arrivalPos="990.00" arrivalPosLat="0.00" arrivalSpeed="15.56" duration="191.15" routeLength="1986.69" waitingTime="50.15" waitingCount="1" stopTime="0.00" timeLoss="62.78" rerouteNo="1" devices="tripinfo_car_s2e_147 routing_car_s2e_147" vType="Car" speedFactor="1.12" vaporized=""/>
    <tripinfo id="car_e2s_126" depart="126.00" departLane="e2sep_1" departPos="3.60" departPosLat="0.00" departSpeed="13.90" departDelay="0.00" arrival="340.45" arrivalLane="c2s_1" arrivalPos="990.00" arrivalPosLat="0.00" arrivalSpeed="13.90" duration="214.45" routeLength="1996.47" waitingTime="51.65" waitingCount="2" stopTime="0.00" timeLoss="70.12" rerouteNo="1" devices="tripinfo_car_e2s_126 routing_car_e2s_126" vType="Car" speedFactor="1.00" vaporized=""/>
    <tripinfo id="car_s2e_153" depart="153.00" departLane="s2sep_1" departPos="3.60" departPosLat="0.00" departSpeed="13.90" departDelay="0.00" arrival="341.65" arrivalLane="c2e_1" arrivalPos="990.00" arrivalPosLat="0.00" arrivalSpeed="15.96" duration="188.65" routeLength="1986.69" waitingTime="48.90" waitingCount="1" stopTime="0.00" timeLoss="64.20" rerouteNo="1" devices="tripinfo_car_s2e_153 routing_car_s2e_153" vType="Car" speedFactor="1.15" vaporized=""/>
    <tripinfo id="car_n2w_151" depart="151.00" departLane="n2sep_1" departPos="3.60" departPosLat="0.00" departSpeed="13.90" departDelay="0.00" arrival="344.55" arrivalLane="c2w_1" arrivalPos="990.00" arrivalPosLat="0.00" arrivalSpeed="14.12" duration="193.55" routeLength="1986.69" waitingTime="45.05" waitingCount="1" stopTime="0.00" timeLoss="52.10" rerouteNo="1" devices="tripinfo_car_n2w_151 routing_car_n2w_151" vType="Car" speedFactor="1.02" vaporized=""/>
    <tripinfo id="bus_e2s_188" depart="188.00" departLane="e2sep_1" departPos="12.10" departPosLat="0.00" departSpeed="13.90" departDelay="0.00" arrival="345.50" arrivalLane="c2s_1" arrivalPos="990.00" arrivalPosLat="0.00" arrivalSpeed="13.86" duration="157.50" routeLength="1987.97" waitingTime="0.90" waitingCount="1" stopTime="0.00" timeLoss="13.76" rerouteNo="1" devices="tripinfo_bus_e2s_188 routing_bus_e2s_188" vType="Bus" speedFactor="1.00" vaporized=""/>
    <tripinfo id="car_s2n_154" depart="154.25" departLane="s2sep_1" departPos="3.60" departPosLat="0.00" departSpeed="13.90" departDelay="0.25" arrival="349.70" arrivalLane="c2n_1" arrivalPos="990.00" arrivalPosLat="0.00" arrivalSpeed="13.97" duration="195.45" routeLength="1997.01" waitingTime="42.15" waitingCount="1" stopTime="0.00" timeLoss="52.52" rerouteNo="1" devices="tripinfo_car_s2n_154 routing_car_s2n_154" vType="Car" speedFactor="1.01" vaporized=""/>
    <tripinfo id="car_n2w_152" depart="152.45" departLane="n2sep_1" departPos="3.60" departPosLat="0.00" departSpeed="13.90" departDelay="0.45" arrival="349.75" arrivalLane="c2w_1" arrivalPos="990.00" arrivalPosLat="0.00" arrivalSpeed="13.90" duration="197.30" routeLength="1986.69" waitingTime="41.30" waitingCount="1" stopTime="0.00" timeLoss="53.65" rerouteNo="1" devices="tripinfo_car_n2w_152 routing_car_n2w_152" vType="Car" speedFactor="1.00" vaporized=""/>
    <tripinfo id="car_s2e_194" depart="194.00" departLane="s2sep_1" departPos="3.60" departPosLat="0.00" departSpeed="13.90" departDelay="0.00" arrival="350.75" arrivalLane="c2e_1" arrivalPos="990.00" arrivalPosLat="0.00" arrivalSpeed="14.38" duration="156.75" routeLength="1986.69" waitingTime="6.35" waitingCount="1" stopTime="0.00" timeLoss="17.86" rerouteNo="1" devices="tripinfo_car_s2e_194 routing_car_s2e_194" vType="Car" speedFactor="1.03" vaporized=""/>
    <tripinfo id="car_n2w_153" depart="154.25" departLane="n2sep_1" departPos="3.60" departPosLat="0.00" departSpeed="13.90" departDelay="1.25" arrival="351.55" arrivalLane="c2w_1" arrivalPos="990.00" arrivalPosLat="0.00" arrivalSpeed="15.44" duration="197.30" routeLength="1986.69" waitingTime="40.60" waitingCount="1" stopTime="0.00" timeLoss="75.43" rerouteNo="1" devices="tripinfo_car_n2w_153 routing_car_n2w_153" vType="Car" speedFactor="1.18" vaporized=""/>
    <tripinfo id="car_n2s_171" depart="171.00" departLane="n2sep_1" departPos="3.60" departPosLat="0.00" departSpeed="13.90" departDelay="0.00" arrival="351.70" arrivalLane="c2s_1" arrivalPos="990.00" arrivalPosLat="0.00" arrivalSpeed="14.17" duration="180.70" routeLength="1997.01" waitingTime="28.40" waitingCount="1" stopTime="0.00" timeLoss="39.80" rerouteNo="1" devices="tripinfo_car_n2s_171 routing_car_n2s_171" vType="Car" speedFactor="1.02" vaporized=""/>
    <tripinfo id="car_n2s_184" depart="184.00" departLane="n2sep_1" departPos="3.60" departPosLat="0.00" departSpeed="13.90" departDelay="0.00" arrival="354.05" arrivalLane="c2s_1" arrivalPos="990.00" arrivalPosLat="0.00" arrivalSpeed="15.05" duration="170.05" routeLength="1997.01" waitingTime="21.10" waitingCount="1" stopTime="0.00" timeLoss="39.69" rerouteNo="1" devices="tripinfo_car_n2s_184 routing_car_n2s_184" vType="Car" speedFactor="1.10" vaporized=""/>
    <tripinfo id="car_n2e_161" depart="161.00" departLane="n2sep_1" departPos="3.60" departPosLat="0.00" departSpeed="13.90" departDelay="0.00" arrival="355.45" arrivalLane="c2e_1" arrivalPos="990.00" arrivalPosLat="0.00" arrivalSpeed="14.21" duration="194.45" routeLength="1996.47" waitingTime="38.55" waitingCount="3" stopTime="0.00" timeLoss="53.38" rerouteNo="1" devices="tripinfo_car_n2e_161 routing_car_n2e_161" vType="Car" speedFactor="1.02" vaporized=""/>
    <tripinfo id="car_n2w_196" depart="196.00" departLane="n2sep_1" departPos="3.60" departPosLat="0.00" departSpeed="13.90" departDelay="0.00" arrival="357.60" arrivalLane="c2w_1" arrivalPos="990.00" arrivalPosLat="0.00" arrivalSpeed="13.90" duration="161.60" routeLength="1986.69" waitingTime="4.80" waitingCount="1" stopTime="0.00" timeLoss="17.92" rerouteNo="1" devices="tripinfo_car_n2w_196 routing_car_n2w_196" vType="Car" speedFactor="1.00" vaporized=""/>
    <tripinfo id="car_n2s_200" depart="200.00" departLane="n2sep_1" departPos="3.60" departPosLat="0.00" departSpeed="13.90" departDelay="0.00" arrival="358.20" arrivalLane="c2s_1" arrivalPos="990.00" arrivalPosLat="0.00" arrivalSpeed="14.31" duration="158.20" routeLength="1997.01" waitingTime="2.85" waitingCount="1" stopTime="0.00" timeLoss="18.73" rerouteNo="1" devices="tripinfo_car_n2s_200 routing_car_n2s_200" vType="Car" speedFactor="1.03" vaporized=""/>
    <tripinfo id="car_n2e_173" depart="173.00" departLane="n2sep_1" departPos="3.60" departPosLat="0.00" departSpeed="13.90" departDelay="0.00" arrival="359.90" arrivalLane="c2e_1" arrivalPos="990.00" arrivalPosLat="0.00" arrivalSpeed="13.89" duration="186.90" routeLength="1996.47" waitingTime="24.20" waitingCount="2" stopTime="0.00" timeLoss="42.55" rerouteNo="1" devices="tripinfo_car_n2e_173 routing_car_n2e_173" vType="Car" speedFactor="1.00" vaporized=""/>
    <tripinfo id="car_n2w_203" depart="203.00" departLane="n2sep_1" departPos="3.60" departPosLat="0.00" departSpeed="13.90" departDelay="0.00" arrival="362.40" arrivalLane="c2w_1" arrivalPos="990.00" arrivalPosLat="0.00" arrivalSpeed="13.89" duration="159.40" routeLength="1986.69" waitingTime="0.00" waitingCount="0" stopTime="0.00" timeLoss="15.70" rerouteNo="1" devices="tripinfo_car_n2w_203 routing_car_n2w_203" vType="Car" speedFactor="1.00" vaporized=""/>
    <tripinfo id="car_n2s_213" depart="213.00" departLane="n2sep_1" departPos="3.60" departPosLat="0.00" departSpeed="13.90" departDelay="0.00" arrival="365.20" arrivalLane="c2s_1" arrivalPos="990.00" arrivalPosLat="0.00" arrivalSpeed="14.00" duration="152.20" routeLength="1997.01" waitingTime="0.00" waitingCount="0" stopTime="0.00" timeLoss="9.53" rerouteNo="1" devices="tripinfo_car_n2s_213 routing_car_n2s_213" vType="Car" speedFactor="1.01" vaporized=""/>
    <tripinfo id="car_n2w_205" depart="205.00" departLane="n2sep_1" departPos="3.60" departPosLat="0.00" departSpeed="13.90" departDelay="0.00" arrival="366.15" arrivalLane="c2w_1" arrivalPos="990.00" arrivalPosLat="0.00" arrivalSpeed="13.90" duration="161.15" routeLength="1986.69" waitingTime="0.00" waitingCount="0" stopTime="0.00" timeLoss="17.73" rerouteNo="1" devices="tripinfo_car_n2w_205 routing_car_n2w_205" vType="Car" speedFactor="1.00" vaporized=""/>
    <tripinfo id="car_n2w_217" depart="217.00" departLane="n2sep_1" departPos="3.60" departPosLat="0.00" departSpeed="13.90" departDelay="0.00" arrival="368.30" arrivalLane="c2w_1" arrivalPos="990.00" arrivalPosLat="0.00" arrivalSpeed="14.79" duration="151.30" routeLength="1986.69" waitingTime="0.00" waitingCount="0" stopTime="0.00" timeLoss="19.71" rerouteNo="1" devices="tripinfo_car_n2w_217 routing_car_n2w_217" vType="Car" speedFactor="1.09" vaporized=""/>
    <tripinfo id="car_s2w_159" depart="159.00" departLane="s2sep_1" departPos="3.60" departPosLat="0.00" departSpeed="13.90" departDelay="0.00" arrival="371.60" arrivalLane="c2w_1" arrivalPos="990.00" arrivalPosLat="0.00" arrivalSpeed="14.16" duration="212.60" routeLength="1996.47" waitingTime="55.95" waitingCount="2" stopTime="0.00" timeLoss="71.36" rerouteNo="1" devices="tripinfo_car_s2w_159 routing_car_s2w_159" vType="Car" speedFactor="1.02" vaporized=""/>
    <tripinfo id="car_s2w_187" depart="187.00" departLane="s2sep_1" departPos="3.60" departPosLat="0.00" departSpeed="13.90" departDelay="0.00" arrival="373.85" arrivalLane="c2w_1" arrivalPos="990.00" arrivalPosLat="0.00" arrivalSpeed="14.81" duration="186.85" routeLength="1996.47" waitingTime="33.15" waitingCount="2" stopTime="0.00" timeLoss="54.05" rerouteNo="1" devices="tripinfo_car_s2w_187 routing_car_s2w_187" vType="Car" speedFactor="1.09" vaporized=""/>
    <tripinfo id="car_s2w_228" depart="228.00" departLane="s2sep_1" departPos="3.60" departPosLat="0.00" departSpeed="13.90" departDelay="0.00" arrival="376.65" arrivalLane="c2w_1" arrivalPos="990.00" arrivalPosLat="0.00" arrivalSpeed="14.41" duration="148.65" routeLength="1996.47" waitingTime="0.00" waitingCount="0" stopTime="0.00" timeLoss="10.33" rerouteNo="1" devices="tripinfo_car_s2w_228 routing_car_s2w_228" vType="Car" speedFactor="1.04" vaporized=""/>
    <tripinfo id="car_w2s_202" depart="202.00" departLane="w2sep_1" departPos="3.60" departPosLat="0.00" departSpeed="13.90" departDelay="0.00" arrival="381.75" arrivalLane="c2s_1" arrivalPos="990.00" arrivalPosLat="0.00" arrivalSpeed="15.95" duration="179.75" routeLength="1986.69" waitingTime="46.55" waitingCount="1" stopTime="0.00" timeLoss="54.59" rerouteNo="1" devices="tripinfo_car_w2s_202 routing_car_w2s_202" vType="Car" speedFactor="1.15" vaporized=""/>
    <tripinfo id="car_e2w_232" depart="232.00" departLane="e2sep_1" departPos="3.60" departPosLat="0.00" departSpeed="13.90" departDelay="0.00" arrival="389.40" arrivalLane="c2w_1" arrivalPos="990.00" arrivalPosLat="0.00" arrivalSpeed="15.16" duration="157.40" routeLength="1997.01" waitingTime="15.50" waitingCount="1" stopTime="0.00" timeLoss="25.67" rerouteNo="1" devices="tripinfo_car_e2w_232 routing_car_e2w_232" vType="Car" speedFactor="1.09" vaporized=""/>
    <tripinfo id="car_e2n_196" depart="196.00" departLane="e2sep_1" departPos="3.60" departPosLat="0.00" departSpeed="13.90" departDelay="0.00" arrival="389.45" arrivalLane="c2n_1" arrivalPos="990.00" arrivalPosLat="0.00" arrivalSpeed="14.13" duration="193.45" routeLength="1986.69" waitingTime="44.90" waitingCount="1" stopTime="0.00" timeLoss="52.18" rerouteNo="1" devices="tripinfo_car_e2n_196 routing_car_e2n_196" vType="Car" speedFactor="1.02" vaporized=""/>
    <tripinfo id="car_w2s_207" depart="207.00" departLane="w2sep_1" departPos="3.60" departPosLat="0.00" departSpeed="13.90" departDelay="0.00" arrival="390.90" arrivalLane="c2s_1" arrivalPos="990.00" arrivalPosLat="0.00" arrivalSpeed="14.49" duration="183.90" routeLength="1986.69" waitingTime="36.50" waitingCount="1" stopTime="0.00" timeLoss="46.13" rerouteNo="1" devices="tripinfo_car_w2s_207 routing_car_w2s_207" vType="Car" speedFactor="1.04" vaporized=""/>
    <tripinfo id="car_w2e_227" depart="227.00" departLane="w2sep_1" departPos="3.60" departPosLat="0.00" departSpeed="13.90" departDelay="0.00" arrival="392.55" arrivalLane="c2e_1" arrivalPos="990.00" arrivalPosLat="0.00" arrivalSpeed="14.42" duration="165.55" routeLength="1997.01" waitingTime="17.35" waitingCount="1" stopTime="0.00" timeLoss="27.09" rerouteNo="1" devices="tripinfo_car_w2e_227 routing_car_w2e_227" vType="Car" speedFactor="1.04" vaporized=""/>
    <tripinfo id="car_e2n_214" depart="214.00" departLane="e2sep_1" departPos="3.60" departPosLat="0.00" departSpeed="13.90" departDelay="0.00" arrival="393.75" arrivalLane="c2n_1" arrivalPos="990.00" arrivalPosLat="0.00" arrivalSpeed="14.19" duration="179.75" routeLength="1986.69" waitingTime="28.30" waitingCount="1" stopTime="0.00" timeLoss="39.17" rerouteNo="1" devices="tripinfo_car_e2n_214 routing_car_e2n_214" vType="Car" speedFactor="1.02" vaporized=""/>
    <tripinfo id="car_w2e_239" depart="239.00" departLane="w2sep_1" departPos="3.60" departPosLat="0.00" departSpeed="13.90" departDelay="0.00" arrival="394.95" arrivalLane="c2e_1" arrivalPos="990.00" arrivalPosLat="0.00" arrivalSpeed="15.34" duration="155.95" routeLength="1997.01" waitingTime="11.30" waitingCount="1" stopTime="0.00" timeLoss="27.85" rerouteNo="1" devices="tripinfo_car_w2e_239 routing_car_w2e_239" vType="Car" speedFactor="1.12" vaporized=""/>
    <tripinfo id="car_w2n_216" depart="216.00" departLane="w2sep_1" departPos="3.60" departPosLat="0.00" departSpeed="13.90" departDelay="0.00" arrival="398.20" arrivalLane="c2n_1" arrivalPos="990.00" arrivalPosLat="0.00" arrivalSpeed="14.12" duration="182.20" routeLength="1996.47" waitingTime="27.80" waitingCount="2" stopTime="0.00" timeLoss="40.25" rerouteNo="1" devices="tripinfo_car_w2n_216 routing_car_w2n_216" vType="Car" speedFactor="1.02" vaporized=""/>
    <tripinfo id="car_w2e_247" depart="247.00" departLane="w2sep_1" departPos="3.60" departPosLat="0.00" departSpeed="13.90" departDelay="0.00" arrival="400.75" arrivalLane="c2e_1" arrivalPos="990.00" arrivalPosLat="0.00" arrivalSpeed="13.90" duration="153.75" routeLength="1997.01" waitingTime="0.00" waitingCount="0" stopTime="0.00" timeLoss="10.08" rerouteNo="1" devices="tripinfo_car_w2e_247 routing_car_w2e_247" vType="Car" speedFactor="1.00" vaporized=""/>
    <tripinfo id="car_w2n_240" depart="240.30" departLane="w2sep_1" departPos="3.60" departPosLat="0.00" departSpeed="13.90" departDelay="0.30" arrival="402.30" arrivalLane="c2n_1" arrivalPos="990.00" arrivalPosLat="0.00" arrivalSpeed="14.78" duration="162.00" routeLength="1996.47" waitingTime="7.25" waitingCount="3" stopTime="0.00" timeLoss="26.50" rerouteNo="1" devices="tripinfo_car_w2n_240 routing_car_w2n_240" vType="Car" speedFactor="1.07" vaporized=""/>
    <tripinfo id="car_e2w_258" depart="258.00" departLane="e2sep_1" departPos="3.60" departPosLat="0.00" departSpeed="13.90" departDelay="0.00" arrival="402.30" arrivalLane="c2w_1" arrivalPos="990.00" arrivalPosLat="0.00" arrivalSpeed="13.90" duration="144.30" routeLength="1997.01" waitingTime="0.00" waitingCount="0" stopTime="0.00" timeLoss="0.64" rerouteNo="1" devices="tripinfo_car_e2w_258 routing_car_e2w_258" vType="Car" speedFactor="1.00" vaporized=""/>
    <tripinfo id="car_w2e_259" depart="259.00" departLane="w2sep_1" departPos="3.60" departPosLat="0.00" departSpeed="13.90" departDelay="0.00" arrival="403.80" arrivalLane="c2e_1" arrivalPos="990.00" arrivalPosLat="0.00" arrivalSpeed="14.31" duration="144.80" routeLength="1997.01" waitingTime="0.00" waitingCount="0" stopTime="0.00" timeLoss="5.89" rerouteNo="1" devices="tripinfo_car_w2e_259 routing_car_w2e_259" vType="Car" speedFactor="1.03" vaporized=""/>
    <tripinfo id="car_w2e_264" depart="264.00" departLane="w2sep_1" departPos="3.60" departPosLat="0.00" departSpeed="13.90" departDelay="0.00" arrival="406.30" arrivalLane="c2e_1" arrivalPos="990.00" arrivalPosLat="0.00" arrivalSpeed="14.62" duration="142.30" routeLength="1997.01" waitingTime="0.00" waitingCount="0" stopTime="0.00" timeLoss="7.36" rerouteNo="1" devices="tripinfo_car_w2e_264 routing_car_w2e_264" vType="Car" speedFactor="1.06" vaporized=""/>
    <tripinfo id="car_e2n_270" depart="270.00" departLane="e2sep_1" departPos="3.60" departPosLat="0.00" departSpeed="13.90" departDelay="0.00" arrival="406.45" arrivalLane="c2n_1" arrivalPos="990.00" arrivalPosLat="0.00" arrivalSpeed="15.25" duration="136.45" routeLength="1986.69" waitingTime="0.00" waitingCount="0" stopTime="0.00" timeLoss="5.67" rerouteNo="1" devices="tripinfo_car_e2n_270 routing_car_e2n_270" vType="Car" speedFactor="1.10" vaporized=""/>
    <tripinfo id="car_e2s_232" depart="233.30" departLane="e2sep_1" departPos="3.60" departPosLat="0.00" departSpeed="13.90" departDelay="1.30" arrival="407.50" arrivalLane="c2s_1" arrivalPos="990.00" arrivalPosLat="0.00" arrivalSpeed="14.69" duration="174.20" routeLength="1996.47" waitingTime="24.40" waitingCount="2" stopTime="0.00" timeLoss="37.61" rerouteNo="1" devices="tripinfo_car_e2s_232 routing_car_e2s_232" vType="Car" speedFactor="1.06" vaporized=""/>
    <tripinfo id="car_w2e_268" depart="268.00" departLane="w2sep_1" departPos="3.60" departPosLat="0.00" departSpeed="13.90" departDelay="0.00" arrival="408.20" arrivalLane="c2e_1" arrivalPos="990.00" arrivalPosLat="1.10" arrivalSpeed="15.50" duration="140.20" routeLength="1997.01" waitingTime="0.00" waitingCount="0" stopTime="0.00" timeLoss="17.25" rerouteNo="1" devices="tripinfo_car_w2e_268 routing_car_w2e_268" vType="Car@car_w2e_268" speedFactor="1.17" vaporized=""/>
    <tripinfo id="amb_w2e_300" depart="300.00" departLane="w2sep_1" departPos="6.60" departPosLat="0.00" departSpeed="13.90" departDelay="0.00" arrival="408.70" arrivalLane="c2e_1" arrivalPos="990.00" arrivalPosLat="-0.95" arrivalSpeed="19.53" duration="108.70" routeLength="1994.01" waitingTime="0.00" waitingCount="0" stopTime="0.00" timeLoss="13.05" rerouteNo="1" devices="tripinfo_amb_w2e_300 routing_amb_w2e_300 bluelight_amb_w2e_300 fcd_amb_w2e_300" vType="Ambulance" speedFactor="1.50" vaporized="">
        <example_device customValue1="0.00" customValue2="-1.00"/>
    </tripinfo>
    <tripinfo id="car_e2s_237" depart="237.00" departLane="e2sep_1" departPos="3.60" departPosLat="0.00" departSpeed="13.90" departDelay="0.00" arrival="410.80" arrivalLane="c2s_1" arrivalPos="990.00" arrivalPosLat="0.00" arrivalSpeed="15.07" duration="173.80" routeLength="1996.47" waitingTime="21.65" waitingCount="2" stopTime="0.00" timeLoss="41.13" rerouteNo="1" devices="tripinfo_car_e2s_237 routing_car_e2s_237" vType="Car" speedFactor="1.09" vaporized=""/>
    <tripinfo id="car_e2s_258" depart="259.45" departLane="e2sep_1" departPos="3.60" departPosLat="0.00" departSpeed="13.90" departDelay="1.45" arrival="414.25" arrivalLane="c2s_1" arrivalPos="990.00" arrivalPosLat="0.00" arrivalSpeed="14.87" duration="154.80" routeLength="1996.47" waitingTime="0.65" waitingCount="1" stopTime="0.00" timeLoss="20.24" rerouteNo="1" devices="tripinfo_car_e2s_258 routing_car_e2s_258" vType="Car" speedFactor="1.07" vaporized=""/>
    <tripinfo id="car_w2n_255" depart="255.00" departLane="w2sep_1" departPos="3.60" departPosLat="0.00" departSpeed="13.90" departDelay="0.00" arrival="415.40" arrivalLane="c2n_1" arrivalPos="990.00" arrivalPosLat="0.00" arrivalSpeed="13.90" duration="160.40" routeLength="1996.47" waitingTime="4.15" waitingCount="1" stopTime="0.00" timeLoss="16.07" rerouteNo="1" devices="tripinfo_car_w2n_255 routing_car_w2n_255" vType="Car" speedFactor="1.00" vaporized=""/>
    <tripinfo id="car_e2s_302" depart="302.00" departLane="e2sep_1" departPos="3.60" departPosLat="0.00" departSpeed="13.90" departDelay="0.00" arrival="437.65" arrivalLane="c2s_1" arrivalPos="990.00" arrivalPosLat="0.00" arrivalSpeed="15.33" duration="135.65" routeLength="1996.47" waitingTime="0.00" waitingCount="0" stopTime="0.00" timeLoss="4.81" rerouteNo="1" devices="tripinfo_car_e2s_302 routing_car_e2s_302" vType="Car" speedFactor="1.10" vaporized=""/>
    <tripinfo id="car_n2s_280" depart="280.00" departLane="n2sep_1" departPos="3.60" departPosLat="0.00" departSpeed="13.90" departDelay="0.00" arrival="450.25" arrivalLane="c2s_1" arrivalPos="990.00" arrivalPosLat="0.00" arrivalSpeed="15.24" duration="170.25" routeLength="1997.01" waitingTime="29.00" waitingCount="1" stopTime="0.00" timeLoss="39.20" rerouteNo="1" devices="tripinfo_car_n2s_280 routing_car_n2s_280" vType="Car" speedFactor="1.10" vaporized=""/>
    <tripinfo id="car_s2n_258" depart="258.00" departLane="s2sep_1" departPos="3.60" departPosLat="0.00" departSpeed="13.90" departDelay="0.00" arrival="450.95" arrivalLane="c2n_1" arrivalPos="990.00" arrivalPosLat="0.00" arrivalSpeed="14.09" duration="192.95" routeLength="1997.01" waitingTime="44.10" waitingCount="1" stopTime="0.00" timeLoss="51.24" rerouteNo="1" devices="tripinfo_car_s2n_258 routing_car_s2n_258" vType="Car" speedFactor="1.01" vaporized=""/>
    <tripinfo id="car_n2w_235" depart="235.00" departLane="n2sep_1" departPos="3.60" departPosLat="0.00" departSpeed="13.90" departDelay="0.00" arrival="451.15" arrivalLane="c2w_1" arrivalPos="990.00" arrivalPosLat="0.00" arrivalSpeed="14.04" duration="216.15" routeLength="1986.69" waitingTime="67.05" waitingCount="1" stopTime="0.00" timeLoss="73.87" rerouteNo="1" devices="tripinfo_car_n2w_235 routing_car_n2w_235" vType="Car" speedFactor="1.01" vaporized=""/>
    <tripinfo id="car_n2s_295" depart="295.00" departLane="n2sep_1" departPos="3.60" departPosLat="0.00" departSpeed="13.90" departDelay="0.00" arrival="452.70" arrivalLane="c2s_1" arrivalPos="990.00" arrivalPosLat="0.00" arrivalSpeed="16.10" duration="157.70" routeLength="1997.01" waitingTime="19.30" waitingCount="1" stopTime="0.00" timeLoss="35.63" rerouteNo="1" devices="tripinfo_car_n2s_295 routing_car_n2s_295" vType="Car" speedFactor="1.18" vaporized=""/>
    <tripinfo id="car_s2n_286" depart="286.00" departLane="s2sep_1" departPos="3.60" departPosLat="0.00" departSpeed="13.90" departDelay="0.00" arrival="453.45" arrivalLane="c2n_1" arrivalPos="990.00" arrivalPosLat="0.00" arrivalSpeed="15.03" duration="167.45" routeLength="1997.01" waitingTime="22.75" waitingCount="1" stopTime="0.00" timeLoss="36.32" rerouteNo="1" devices="tripinfo_car_s2n_286 routing_car_s2n_286" vType="Car" speedFactor="1.10" vaporized=""/>
    <tripinfo id="car_n2w_239" depart="239.00" departLane="n2sep_1" departPos="3.60" departPosLat="0.00" departSpeed="13.90" departDelay="0.00" arrival="453.50" arrivalLane="c2w_1" arrivalPos="990.00" arrivalPosLat="0.00" arrivalSpeed="14.99" duration="214.50" routeLength="1986.69" waitingTime="65.80" waitingCount="1" stopTime="0.00" timeLoss="83.56" rerouteNo="1" devices="tripinfo_car_n2w_239 routing_car_n2w_239" vType="Car" speedFactor="1.10" vaporized=""/>
    <tripinfo id="car_s2e_267" depart="267.00" departLane="s2sep_1" departPos="3.60" departPosLat="0.00" departSpeed="13.90" departDelay="0.00" arrival="454.15" arrivalLane="c2e_1" arrivalPos="990.00" arrivalPosLat="0.00" arrivalSpeed="13.90" duration="187.15" routeLength="1986.69" waitingTime="34.90" waitingCount="1" stopTime="0.00" timeLoss="43.51" rerouteNo="1" devices="tripinfo_car_s2e_267 routing_car_s2e_267" vType="Car" speedFactor="1.00" vaporized=""/>
    <tripinfo id="car_s2n_304" depart="304.00" departLane="s2sep_1" departPos="3.60" departPosLat="0.00" departSpeed="13.90" departDelay="0.00" arrival="457.90" arrivalLane="c2n_1" arrivalPos="990.00" arrivalPosLat="0.00" arrivalSpeed="14.33" duration="153.90" routeLength="1997.01" waitingTime="2.40" waitingCount="1" stopTime="0.00" timeLoss="14.56" rerouteNo="1" devices="tripinfo_car_s2n_304 routing_car_s2n_304" vType="Car" speedFactor="1.03" vaporized=""/>
    <tripinfo id="car_n2e_255" depart="255.00" departLane="n2sep_1" departPos="3.60" departPosLat="0.00" departSpeed="13.90" departDelay="0.00" arrival="461.30" arrivalLane="c2e_1" arrivalPos="990.00" arrivalPosLat="0.00" arrivalSpeed="13.90" duration="206.30" routeLength="1996.47" waitingTime="50.70" waitingCount="2" stopTime="0.00" timeLoss="61.98" rerouteNo="1" devices="tripinfo_car_n2e_255 routing_car_n2e_255" vType="Car" speedFactor="1.00" vaporized=""/>
    <tripinfo id="car_n2w_298" depart="298.00" departLane="n2sep_1" departPos="3.60" departPosLat="0.00" departSpeed="13.90" departDelay="0.00" arrival="461.30" arrivalLane="c2w_1" arrivalPos="990.00" arrivalPosLat="0.00" arrivalSpeed="13.90" duration="163.30" routeLength="1986.69" waitingTime="7.55" waitingCount="1" stopTime="0.00" timeLoss="19.62" rerouteNo="1" devices="tripinfo_car_n2w_298 routing_car_n2w_298" vType="Car" speedFactor="1.00" vaporized=""/>
    <tripinfo id="car_n2w_309" depart="309.00" departLane="n2sep_1" departPos="3.60" departPosLat="0.00" departSpeed="13.90" departDelay="0.00" arrival="463.95" arrivalLane="c2w_1" arrivalPos="990.00" arrivalPosLat="0.00" arrivalSpeed="14.60" duration="154.95" routeLength="1986.69" waitingTime="0.00" waitingCount="0" stopTime="0.00" timeLoss="19.51" rerouteNo="1" devices="tripinfo_car_n2w_309 routing_car_n2w_309" vType="Car" speedFactor="1.06" vaporized=""/>
    <tripinfo id="car_n2e_306" depart="306.00" departLane="n2sep_1" departPos="3.60" departPosLat="0.00" departSpeed="13.90" departDelay="0.00" arrival="464.70" arrivalLane="c2e_1" arrivalPos="990.00" arrivalPosLat="0.00" arrivalSpeed="14.18" duration="158.70" routeLength="1996.47" waitingTime="3.70" waitingCount="1" stopTime="0.00" timeLoss="17.67" rerouteNo="1" devices="tripinfo_car_n2e_306 routing_car_n2e_306" vType="Car" speedFactor="1.02" vaporized=""/>
    <tripinfo id="car_n2e_321" depart="321.00" departLane="n2sep_1" departPos="3.60" departPosLat="0.00" departSpeed="13.90" departDelay="0.00" arrival="466.75" arrivalLane="c2e_1" arrivalPos="990.00" arrivalPosLat="0.00" arrivalSpeed="15.07" duration="145.75" routeLength="1996.47" waitingTime="0.00" waitingCount="0" stopTime="0.00" timeLoss="16.71" rerouteNo="1" devices="tripinfo_car_n2e_321 routing_car_n2e_321" vType="Car" speedFactor="1.12" vaporized=""/>
    <tripinfo id="car_s2w_269" depart="269.00" departLane="s2sep_1" departPos="3.60" departPosLat="0.00" departSpeed="13.90" departDelay="0.00" arrival="467.65" arrivalLane="c2w_1" arrivalPos="990.00" arrivalPosLat="0.00" arrivalSpeed="14.11" duration="198.65" routeLength="1996.47" waitingTime="40.60" waitingCount="2" stopTime="0.00" timeLoss="56.72" rerouteNo="1" devices="tripinfo_car_s2w_269 routing_car_s2w_269" vType="Car" speedFactor="1.02" vaporized=""/>
    <tripinfo id="car_n2w_332" depart="332.00" departLane="n2sep_1" departPos="3.60" departPosLat="0.00" departSpeed="13.90" departDelay="0.00" arrival="469.75" arrivalLane="c2w_1" arrivalPos="990.00" arrivalPosLat="0.00" arrivalSpeed="15.10" duration="137.75" routeLength="1986.69" waitingTime="0.00" waitingCount="0" stopTime="0.00" timeLoss="9.42" rerouteNo="1" devices="tripinfo_car_n2w_332 routing_car_n2w_332" vType="Car" speedFactor="1.12" vaporized=""/>
</tripinfos>
