<?xml version="1.0" encoding="UTF-8"?>

<!-- generated on Sat Apr 24 18:05:01 2021 by Eclipse SUMO Version 1.4.0
<configuration xmlns:xsi="http://www.w3.org/2001/XMLSchema-instance" xsi:noNamespaceSchemaLocation="http://sumo.dlr.de/xsd/sumoConfiguration.xsd">

    <input>
        <net-file value="sumofiles/junction.net.xml"/>
        <route-files value="sumofiles/junction_preemption_44.rou.xml"/>
        <additional-files value="sumofiles/junction.det.xml"/>
    </input>

    <output>
        <tripinfo-output value="sumofiles/output/tripinfo_preemption_44.xml"/>
    </output>

    <time>
        <begin value="0"/>
        <end value="10000"/>
        <step-length value="0.05"/>
    </time>

    <processing>
        <lateral-resolution value="0.1"/>
    </processing>

    <report>
        <no-warnings value="true"/>
        <error-log value="sumofiles/output/errorlog_preemption_44.log"/>
        <no-step-log value="true"/>
    </report>

    <traci_server>
        <remote-port value="37019"/>
    </traci_server>

    <gui_only>
        <gui-settings-file value="sumofiles/junction-gui.settings.xml"/>
        <tracker-interval value="0.05"/>
    </gui_only>

</configuration>
-->

<tripinfos xmlns:xsi="http://www.w3.org/2001/XMLSchema-instance" xsi:noNamespaceSchemaLocation="http://sumo.dlr.de/xsd/tripinfo_file.xsd">
    <tripinfo id="car_w2n_7" depart="7.00" departLane="w2sep_1" departPos="3.60" departPosLat="0.00" departSpeed="13.90" departDelay="0.00" arrival="148.70" arrivalLane="c2n_1" arrivalPos="990.00" arrivalPosLat="0.00" arrivalSpeed="14.73" duration="141.70" routeLength="1996.47" waitingTime="0.00" waitingCount="0" stopTime="0.00" timeLoss="5.53" rerouteNo="1" devices="tripinfo_car_w2n_7 routing_car_w2n_7" vType="Car" speedFactor="1.06" vaporized=""/>
    <tripinfo id="car_n2s_17" depart="17.00" departLane="n2sep_1" departPos="3.60" departPosLat="0.00" departSpeed="13.90" departDelay="0.00" arrival="159.90" arrivalLane="c2s_1" arrivalPos="990.00" arrivalPosLat="0.00" arrivalSpeed="15.16" duration="142.90" routeLength="1997.01" waitingTime="2.60" waitingCount="1" stopTime="0.00" timeLoss="11.18" rerouteNo="1" devices="tripinfo_car_n2s_17 routing_car_n2s_17" vType="Car" speedFactor="1.09" vaporized=""/>
    <tripinfo id="car_w2n_12" depart="12.00" departLane="w2sep_1" departPos="3.60" departPosLat="0.00" departSpeed="13.90" departDelay="0.00" arrival="160.55" arrivalLane="c2n_1" arrivalPos="990.00" arrivalPosLat="0.00" arrivalSpeed="14.04" duration="148.55" routeLength="1996.47" waitingTime="0.00" waitingCount="0" stopTime="0.00" timeLoss="5.71" rerouteNo="1" devices="tripinfo_car_w2n_12 routing_car_w2n_12" vType="Car" speedFactor="1.01" vaporized=""/>
    <tripinfo id="car_s2w_8" depart="8.00" departLane="s2sep_1" departPos="3.60" departPosLat="0.00" departSpeed="13.90" departDelay="0.00" arrival="162.50" arrivalLane="c2w_1" arrivalPos="990.00" arrivalPosLat="0.00" arrivalSpeed="15.05" duration="154.50" routeLength="1996.47" waitingTime="12.10" waitingCount="1" stopTime="0.00" timeLoss="21.18" rerouteNo="1" devices="tripinfo_car_s2w_8 routing_car_s2w_8" vType="Car" speedFactor="1.08" vaporized=""/>
    <tripinfo id="bus_s2e_14" depart="14.00" departLane="s2sep_1" departPos="12.10" departPosLat="0.00" departSpeed="13.90" departDelay="0.00" arrival="168.90" arrivalLane="c2e_1" arrivalPos="990.00" arrivalPosLat="0.00" arrivalSpeed="13.90" duration="154.90" routeLength="1978.19" waitingTime="1.15" waitingCount="1" stopTime="0.00" timeLoss="11.86" rerouteNo="1" devices="tripinfo_bus_s2e_14 routing_bus_s2e_14" vType="Bus" speedFactor="1.00" vaporized=""/>
    <tripinfo id="car_s2e_26" depart="26.00" departLane="s2sep_1" departPos="3.60" departPosLat="0.00" departSpeed="13.90" departDelay="0.00" arrival="172.45" arrivalLane="c2e_1" arrivalPos="990.00" arrivalPosLat="0.00" arrivalSpeed="14.48" duration="146.45" routeLength="1986.69" waitingTime="0.00" waitingCount="0" stopTime="0.00" timeLoss="9.08" rerouteNo="1" devices="tripinfo_car_s2e_26 routing_car_s2e_26" vType="Car" speedFactor="1.05" vaporized=""/>
    <tripinfo id="car_s2n_36" depart="36.45" departLane="s2sep_1" departPos="3.60" departPosLat="0.00" departSpeed="13.90" departDelay="0.45" arrival="174.50" arrivalLane="c2n_1" arrivalPos="990.00" arrivalPosLat="0.00" arrivalSpeed="16.10" duration="138.05" routeLength="1997.01" waitingTime="0.00" waitingCount="0" stopTime="0.00" timeLoss="14.00" rerouteNo="1" devices="tripinfo_car_s2n_36 routing_car_s2n_36" vType="Car" speedFactor="1.16" vaporized=""/>
    <tripinfo id="car_n2e_2" depart="2.00" departLane="n2sep_1" departPos="3.60" departPosLat="0.00" departSpeed="13.90" departDelay="0.00" arrival="175.15" arrivalLane="c2e_1" arrivalPos="990.00" arrivalPosLat="0.00" arrivalSpeed="14.61" duration="173.15" routeLength="1996.47" waitingTime="20.80" waitingCount="2" stopTime="0.00" timeLoss="36.99" rerouteNo="1" devices="tripinfo_car_n2e_2 routing_car_n2e_2" vType="Car" speedFactor="1.06" vaporized=""/>
    <tripinfo id="car_n2e_13" depart="13.00" departLane="n2sep_1" departPos="3.60" departPosLat="0.00" departSpeed="13.90" departDelay="0.00" arrival="177.55" arrivalLane="c2e_1" arrivalPos="990.00" arrivalPosLat="0.00" arrivalSpeed="14.83" duration="164.55" routeLength="1996.47" waitingTime="11.00" waitingCount="2" stopTime="0.00" timeLoss="31.24" rerouteNo="1" devices="tripinfo_car_n2e_13 routing_car_n2e_13" vType="Car" speedFactor="1.08" vaporized=""/>
    <tripinfo id="car_n2s_37" depart="37.00" departLane="n2sep_1" departPos="3.60" departPosLat="0.00" departSpeed="13.90" departDelay="0.00" arrival="178.35" arrivalLane="c2s_1" arrivalPos="990.00" arrivalPosLat="0.00" arrivalSpeed="14.15" duration="141.35" routeLength="1997.01" waitingTime="0.00" waitingCount="0" stopTime="0.00" timeLoss="0.22" rerouteNo="1" devices="tripinfo_car_n2s_37 routing_car_n2s_37" vType="Car" speedFactor="1.02" vaporized=""/>
    <tripinfo id="car_s2e_35" depart="35.00" departLane="s2sep_1" departPos="3.60" departPosLat="0.00" departSpeed="13.90" departDelay="0.00" arrival="183.20" arrivalLane="c2e_1" arrivalPos="990.00" arrivalPosLat="0.00" arrivalSpeed="13.90" duration="148.20" routeLength="1986.69" waitingTime="0.00" waitingCount="0" stopTime="0.00" timeLoss="4.51" rerouteNo="1" devices="tripinfo_car_s2e_35 routing_car_s2e_35" vType="Car" speedFactor="1.00" vaporized=""/>
    <tripinfo id="car_n2w_38" depart="38.40" departLane="n2sep_1" departPos="3.60" departPosLat="0.00" departSpeed="13.90" departDelay="0.40" arrival="186.75" arrivalLane="c2w_1" arrivalPos="990.00" arrivalPosLat="0.00" arrivalSpeed="14.04" duration="148.35" routeLength="1986.69" waitingTime="0.00" waitingCount="0" stopTime="0.00" timeLoss="6.15" rerouteNo="1" devices="tripinfo_car_n2w_38 routing_car_n2w_38" vType="Car" speedFactor="1.01" vaporized=""/>
    <tripinfo id="car_w2e_10" depart="10.00" departLane="w2sep_1" departPos="3.60" departPosLat="0.00" departSpeed="13.90" departDelay="0.00" arrival="208.65" arrivalLane="c2e_1" arrivalPos="990.00" arrivalPosLat="0.00" arrivalSpeed="14.32" duration="198.65" routeLength="1997.01" waitingTime="51.85" waitingCount="1" stopTime="0.00" timeLoss="59.21" rerouteNo="1" devices="tripinfo_car_w2e_10 routing_car_w2e_10" vType="Car" speedFactor="1.03" vaporized=""/>
    <tripinfo id="car_e2n_8" depart="8.00" departLane="e2sep_1" departPos="3.60" departPosLat="0.00" departSpeed="13.90" departDelay="0.00" arrival="209.90" arrivalLane="c2n_1" arrivalPos="990.00" arrivalPosLat="0.00" arrivalSpeed="14.04" duration="201.90" routeLength="1986.69" waitingTime="53.00" waitingCount="1" stopTime="0.00" timeLoss="59.72" rerouteNo="1" devices="tripinfo_car_e2n_8 routing_car_e2n_8" vType="Car" speedFactor="1.01" vaporized=""/>
    <tripinfo id="car_e2w_10" depart="10.00" departLane="e2sep_1" departPos="3.60" departPosLat="0.00" departSpeed="13.90" departDelay="0.00" arrival="212.80" arrivalLane="c2w_1" arrivalPos="990.00" arrivalPosLat="0.00" arrivalSpeed="13.90" duration="202.80" routeLength="1997.01" waitingTime="49.25" waitingCount="1" stopTime="0.00" timeLoss="59.13" rerouteNo="1" devices="tripinfo_car_e2w_10 routing_car_e2w_10" vType="Car" speedFactor="1.00" vaporized=""/>
    <tripinfo id="car_w2s_25" depart="25.00" departLane="w2sep_1" departPos="3.60" departPosLat="0.00" departSpeed="13.90" departDelay="0.00" arrival="212.95" arrivalLane="c2s_1" arrivalPos="990.00" arrivalPosLat="0.00" arrivalSpeed="13.90" duration="187.95" routeLength="1986.69" waitingTime="35.75" waitingCount="1" stopTime="0.00" timeLoss="44.31" rerouteNo="1" devices="tripinfo_car_w2s_25 routing_car_w2s_25" vType="Car" speedFactor="1.00" vaporized=""/>
    <tripinfo id="car_e2n_10" depart="11.65" departLane="e2sep_1" departPos="3.60" departPosLat="0.00" departSpeed="13.90" departDelay="1.65" arrival="213.80" arrivalLane="c2n_1" arrivalPos="990.00" arrivalPosLat="0.00" arrivalSpeed="14.51" duration="202.15" routeLength="1986.69" waitingTime="47.90" waitingCount="1" stopTime="0.00" timeLoss="64.76" rerouteNo="1" devices="tripinfo_car_e2n_10 routing_car_e2n_10" vType="Car" speedFactor="1.05" vaporized=""/>
    <tripinfo id="car_w2e_61" depart="61.00" departLane="w2sep_1" departPos="3.60" departPosLat="0.00" departSpeed="13.90" departDelay="0.00" arrival="215.90" arrivalLane="c2e_1" arrivalPos="990.00" arrivalPosLat="0.00" arrivalSpeed="14.27" duration="154.90" routeLength="1997.01" waitingTime="3.90" waitingCount="1" stopTime="0.00" timeLoss="14.92" rerouteNo="1" devices="tripinfo_car_w2e_61 routing_car_w2e_61" vType="Car" speedFactor="1.03" vaporized=""/>
    <tripinfo id="car_e2n_52" depart="52.00" departLane="e2sep_1" departPos="3.60" departPosLat="0.00" departSpeed="13.90" departDelay="0.00" arrival="216.40" arrivalLane="c2n_1" arrivalPos="990.00" arrivalPosLat="0.00" arrivalSpeed="15.00" duration="164.40" routeLength="1986.69" waitingTime="16.65" waitingCount="1" stopTime="0.00" timeLoss="32.68" rerouteNo="1" devices="tripinfo_car_e2n_52 routing_car_e2n_52" vType="Car" speedFactor="1.09" vaporized=""/>
    <tripinfo id="car_w2s_30" depart="30.00" departLane="w2sep_1" departPos="3.60" departPosLat="0.00" departSpeed="13.90" departDelay="0.00" arrival="217.45" arrivalLane="c2s_1" arrivalPos="990.00" arrivalPosLat="0.00" arrivalSpeed="13.89" duration="187.45" routeLength="1986.69" waitingTime="31.50" waitingCount="1" stopTime="0.00" timeLoss="43.81" rerouteNo="1" devices="tripinfo_car_w2s_30 routing_car_w2s_30" vType="Car" speedFactor="1.00" vaporized=""/>
    <tripinfo id="car_e2s_14" depart="14.00" departLane="e2sep_1" departPos="3.60" departPosLat="0.00" departSpeed="13.90" departDelay="0.00" arrival="220.60" arrivalLane="c2s_1" arrivalPos="990.00" arrivalPosLat="0.00" arrivalSpeed="14.26" duration="206.60" routeLength="1996.47" waitingTime="48.00" waitingCount="2" stopTime="0.00" timeLoss="66.53" rerouteNo="1" devices="tripinfo_car_e2s_14 routing_car_e2s_14" vType="Car" speedFactor="1.03" vaporized=""/>
    <tripinfo id="car_e2n_65" depart="65.00" departLane="e2sep_1" departPos="3.60" departPosLat="0.00" departSpeed="13.90" departDelay="0.00" arrival="221.80" arrivalLane="c2n_1" arrivalPos="990.00" arrivalPosLat="0.00" arrivalSpeed="13.90" duration="156.80" routeLength="1986.69" waitingTime="0.00" waitingCount="0" stopTime="0.00" timeLoss="13.12" rerouteNo="1" devices="tripinfo_car_e2n_65 routing_car_e2n_65" vType="Car" speedFactor="1.00" vaporized=""/>
    <tripinfo id="car_e2n_89" depart="89.00" departLane="e2sep_1" departPos="3.60" departPosLat="0.00" departSpeed="13.90" departDelay="0.00" arrival="223.70" arrivalLane="c2n_1" arrivalPos="990.00" arrivalPosLat="0.00" arrivalSpeed="15.31" duration="134.70" routeLength="1986.69" waitingTime="0.00" waitingCount="0" stopTime="0.00" timeLoss="10.25" rerouteNo="1" devices="tripinfo_car_e2n_89 routing_car_e2n_89" vType="Car" speedFactor="1.15" vaporized=""/>
    <tripinfo id="car_e2s_19" depart="19.00" departLane="e2sep_1" departPos="3.60" departPosLat="0.00" departSpeed="13.90" departDelay="0.00" arrival="223.85" arrivalLane="c2s_1" arrivalPos="990.00" arrivalPosLat="0.00" arrivalSpeed="14.22" duration="204.85" routeLength="1996.47" waitingTime="45.10" waitingCount="2" stopTime="0.00" timeLoss="64.24" rerouteNo="1" devices="tripinfo_car_e2s_19 routing_car_e2s_19" vType="Car" speedFactor="1.03" vaporized=""/>
    <tripinfo id="car_e2s_20" depart="20.45" departLane="e2sep_1" departPos="3.60" departPosLat="0.00" departSpeed="13.90" departDelay="0.45" arrival="226.60" arrivalLane="c2s_1" arrivalPos="990.00" arrivalPosLat="0.00" arrivalSpeed="14.44" duration="206.15" routeLength="1996.47" waitingTime="41.40" waitingCount="2" stopTime="0.00" timeLoss="68.30" rerouteNo="1" devices="tripinfo_car_e2s_20 routing_car_e2s_20" vType="Car" speedFactor="1.05" vaporized=""/>
    <tripinfo id="car_w2s_93" depart="93.00" departLane="w2sep_1" departPos="3.60" departPosLat="0.00" departSpeed="13.90" departDelay="0.00" arrival="228.50" arrivalLane="c2s_1" arrivalPos="990.00" arrivalPosLat="0.00" arrivalSpeed="15.55" duration="135.50" routeLength="1986.69" waitingTime="0.00" waitingCount="0" stopTime="0.00" timeLoss="12.88" rerouteNo="1" devices="tripinfo_car_w2s_93 routing_car_w2s_93" vType="Car" speedFactor="1.17" vaporized=""/>
    <tripinfo id="bus_w2e_86" depart="86.00" departLane="w2sep_1" departPos="12.10" departPosLat="0.00" departSpeed="13.90" departDelay="0.00" arrival="229.60" arrivalLane="c2e_1" arrivalPos="990.00" arrivalPosLat="0.00" arrivalSpeed="13.90" duration="143.60" routeLength="1988.51" waitingTime="0.00" waitingCount="0" stopTime="0.00" timeLoss="0.51" rerouteNo="1" devices="tripinfo_bus_w2e_86 routing_bus_w2e_86" vType="Bus" speedFactor="1.00" vaporized=""/>
    <tripinfo id="car_e2s_21" depart="22.20" departLane="e2sep_1" departPos="3.60" departPosLat="0.00" departSpeed="13.90" departDelay="1.20" arrival="235.65" arrivalLane="c2s_1" arrivalPos="990.00" arrivalPosLat="0.00" arrivalSpeed="15.61" duration="213.45" routeLength="1996.47" waitingTime="52.15" waitingCount="3" stopTime="0.00" timeLoss="84.92" rerouteNo="1" devices="tripinfo_car_e2s_21 routing_car_e2s_21" vType="Car" speedFactor="1.12" vaporized=""/>
    <tripinfo id="car_w2e_95" depart="95.00" departLane="w2sep_1" departPos="3.60" departPosLat="0.00" departSpeed="13.90" departDelay="0.00" arrival="239.80" arrivalLane="c2e_1" arrivalPos="990.00" arrivalPosLat="0.00" arrivalSpeed="13.90" duration="144.80" routeLength="1997.01" waitingTime="0.00" waitingCount="0" stopTime="0.00" timeLoss="1.10" rerouteNo="1" devices="tripinfo_car_w2e_95 routing_car_w2e_95" vType="Car" speedFactor="1.00" vaporized=""/>
    <tripinfo id="car_w2n_97" depart="97.00" departLane="w2sep_1" departPos="3.60" departPosLat="0.00" departSpeed="13.90" departDelay="0.00" arrival="245.15" arrivalLane="c2n_1" arrivalPos="990.00" arrivalPosLat="0.00" arrivalSpeed="14.17" duration="148.15" routeLength="1996.47" waitingTime="0.00" waitingCount="0" stopTime="0.00" timeLoss="6.60" rerouteNo="1" devices="tripinfo_car_w2n_97 routing_car_w2n_97" vType="Car" speedFactor="1.02" vaporized=""/>
    <tripinfo id="car_e2s_36" depart="36.00" departLane="e2sep_1" departPos="3.60" departPosLat="0.00" departSpeed="13.90" departDelay="0.00" arrival="245.65" arrivalLane="c2s_1" arrivalPos="990.00" arrivalPosLat="0.00" arrivalSpeed="13.90" duration="209.65" routeLength="1996.47" waitingTime="39.80" waitingCount="2" stopTime="0.00" timeLoss="65.31" rerouteNo="1" devices="tripinfo_car_e2s_36 routing_car_e2s_36" vType="Car" speedFactor="1.00" vaporized=""/>
    <tripinfo id="car_n2w_65" depart="65.00" departLane="n2sep_1" departPos="3.60" departPosLat="0.00" departSpeed="13.90" departDelay="0.00" arrival="248.05" arrivalLane="c2w_1" arrivalPos="990.00" arrivalPosLat="0.00" arrivalSpeed="15.61" duration="183.05" routeLength="1986.69" waitingTime="47.60" waitingCount="1" stopTime="0.00" timeLoss="55.09" rerouteNo="1" devices="tripinfo_car_n2w_65 routing_car_n2w_65" vType="Car" speedFactor="1.12" vaporized=""/>
    <tripinfo id="car_e2s_62" depart="62.00" departLane="e2sep_1" departPos="3.60" departPosLat="0.00" departSpeed="13.90" departDelay="0.00" arrival="248.55" arrivalLane="c2s_1" arrivalPos="990.00" arrivalPosLat="0.00" arrivalSpeed="14.46" duration="186.55" routeLength="1996.47" waitingTime="15.70" waitingCount="2" stopTime="0.00" timeLoss="48.70" rerouteNo="1" devices="tripinfo_car_e2s_62 routing_car_e2s_62" vType="Car" speedFactor="1.05" vaporized=""/>
    <tripinfo id="car_w2n_104" depart="104.00" departLane="w2sep_1" departPos="3.60" departPosLat="0.00" departSpeed="13.90" departDelay="0.00" arrival="251.30" arrivalLane="c2n_1" arrivalPos="990.00" arrivalPosLat="0.00" arrivalSpeed="14.32" duration="147.30" routeLength="1996.47" waitingTime="0.00" waitingCount="0" stopTime="0.00" timeLoss="7.23" rerouteNo="1" devices="tripinfo_car_w2n_104 routing_car_w2n_104" vType="Car" speedFactor="1.03" vaporized=""/>
    <tripinfo id="car_s2e_89" depart="89.00" departLane="s2sep_1" departPos="3.60" departPosLat="0.00" departSpeed="13.90" departDelay="0.00" arrival="255.35" arrivalLane="c2e_1" arrivalPos="990.00" arrivalPosLat="0.00" arrivalSpeed="13.97" duration="166.35" routeLength="1986.69" waitingTime="16.30" waitingCount="1" stopTime="0.00" timeLoss="23.40" rerouteNo="1" devices="tripinfo_car_s2e_89 routing_car_s2e_89" vType="Car" speedFactor="1.01" vaporized=""/>
    <tripinfo id="car_n2e_77" depart="77.00" departLane="n2sep_1" departPos="3.60" departPosLat="0.00" departSpeed="13.90" departDelay="0.00" arrival="257.40" arrivalLane="c2e_1" arrivalPos="990.00" arrivalPosLat="0.00" arrivalSpeed="15.22" duration="180.40" routeLength="1996.47" waitingTime="34.80" waitingCount="1" stopTime="0.00" timeLoss="52.88" rerouteNo="1" devices="tripinfo_car_n2e_77 routing_car_n2e_77" vType="Car" speedFactor="1.13" vaporized=""/>
    <tripinfo id="car_n2w_67" depart="67.00" departLane="n2sep_1" departPos="3.60" departPosLat="0.00" departSpeed="13.90" departDelay="0.00" arrival="258.65" arrivalLane="c2w_1" arrivalPos="990.00" arrivalPosLat="0.00" arrivalSpeed="13.90" duration="191.65" routeLength="1986.69" waitingTime="38.40" waitingCount="1" stopTime="0.00" timeLoss="48.00" rerouteNo="1" devices="tripinfo_car_n2w_67 routing_car_n2w_67" vType="Car" speedFactor="1.00" vaporized=""/>
    <tripinfo id="car_n2w_100" depart="100.00" departLane="n2sep_1" departPos="3.60" departPosLat="0.00" departSpeed="13.90" departDelay="0.00" arrival="260.50" arrivalLane="c2w_1" arrivalPos="990.00" arrivalPosLat="0.00" arrivalSpeed="15.50" duration="160.50" routeLength="1986.69" waitingTime="17.00" waitingCount="1" stopTime="0.00" timeLoss="38.70" rerouteNo="1" devices="tripinfo_car_n2w_100 routing_car_n2w_100" vType="Car" speedFactor="1.18" vaporized=""/>
    <tripinfo id="car_n2e_78" depart="78.30" departLane="n2sep_1" departPos="3.60" departPosLat="0.00" departSpeed="13.90" departDelay="0.30" arrival="262.00" arrivalLane="c2e_1" arrivalPos="990.00" arrivalPosLat="0.00" arrivalSpeed="13.89" duration="183.70" routeLength="1996.47" waitingTime="26.70" waitingCount="1" stopTime="0.00" timeLoss="39.37" rerouteNo="1" devices="tripinfo_car_n2e_78 routing_car_n2e_78" vType="Car" speedFactor="1.00" vaporized=""/>
    <tripinfo id="car_s2w_78" depart="78.00" departLane="s2sep_1" departPos="3.60" departPosLat="0.00" departSpeed="13.90" departDelay="0.00" arrival="262.40" arrivalLane="c2w_1" arrivalPos="990.00" arrivalPosLat="0.00" arrivalSpeed="15.66" duration="184.40" routeLength="1996.47" waitingTime="41.05" waitingCount="2" stopTime="0.00" timeLoss="61.93" rerouteNo="1" devices="tripinfo_car_s2w_78 routing_car_s2w_78" vType="Car" speedFactor="1.18" vaporized=""/>
    <tripinfo id="car_n2e_103" depart="103.00" departLane="n2sep_1" departPos="3.60" departPosLat="0.00" departSpeed="13.90" departDelay="0.00" arrival="264.10" arrivalLane="c2e_1" arrivalPos="990.00" arrivalPosLat="0.00" arrivalSpeed="14.90" duration="161.10" routeLength="1996.47" waitingTime="9.70" waitingCount="1" stopTime="0.00" timeLoss="30.17" rerouteNo="1" devices="tripinfo_car_n2e_103 routing_car_n2e_103" vType="Car" speedFactor="1.10" vaporized=""/>
    <tripinfo id="car_s2w_103" depart="103.00" departLane="s2sep_1" departPos="3.60" departPosLat="0.00" departSpeed="13.90" departDelay="0.00" arrival="264.40" arrivalLane="c2w_1" arrivalPos="990.00" arrivalPosLat="0.00" arrivalSpeed="15.56" duration="161.40" routeLength="1996.47" waitingTime="14.45" waitingCount="2" stopTime="0.00" timeLoss="36.77" rerouteNo="1" devices="tripinfo_car_s2w_103 routing_car_s2w_103" vType="Car" speedFactor="1.16" vaporized=""/>
    <tripinfo id="car_n2s_126" depart="126.00" departLane="n2sep_1" departPos="3.60" departPosLat="0.00" departSpeed="13.90" departDelay="0.00" arrival="270.05" arrivalLane="c2s_1" arrivalPos="990.00" arrivalPosLat="0.00" arrivalSpeed="13.90" duration="144.05" routeLength="1997.01" waitingTime="0.00" waitingCount="0" stopTime="0.00" timeLoss="0.36" rerouteNo="1" devices="tripinfo_car_n2s_126 routing_car_n2s_126" vType="Car" speedFactor="1.00" vaporized=""/>
    <tripinfo id="car_s2w_114" depart="114.00" departLane="s2sep_1" departPos="3.60" departPosLat="0.00" departSpeed="13.90" departDelay="0.00" arrival="270.25" arrivalLane="c2w_1" arrivalPos="990.00" arrivalPosLat="0.00" arrivalSpeed="15.12" duration="156.25" routeLength="1996.47" waitingTime="3.95" waitingCount="2" stopTime="0.00" timeLoss="23.58" rerouteNo="1" devices="tripinfo_car_s2w_114 routing_car_s2w_114" vType="Car" speedFactor="1.09" vaporized=""/>
    <tripinfo id="car_n2s_132" depart="132.00" departLane="n2sep_1" departPos="3.60" departPosLat="0.00" departSpeed="13.90" departDelay="0.00" arrival="271.90" arrivalLane="c2s_1" arrivalPos="990.00" arrivalPosLat="0.00" arrivalSpeed="15.42" duration="139.90" routeLength="1997.01" waitingTime="0.00" waitingCount="0" stopTime="0.00" timeLoss="16.98" rerouteNo="1" devices="tripinfo_car_n2s_132 routing_car_n2s_132" vType="Car" speedFactor="1.17" vaporized=""/>
    <tripinfo id="car_n2s_145" depart="145.00" departLane="n2sep_1" departPos="3.60" departPosLat="0.00" departSpeed="13.90" departDelay="0.00" arrival="278.25" arrivalLane="c2s_1" arrivalPos="990.00" arrivalPosLat="0.00" arrivalSpeed="15.88" duration="133.25" routeLength="1997.01" waitingTime="0.00" waitingCount="0" stopTime="0.00" timeLoss="7.47" rerouteNo="1" devices="tripinfo_car_n2s_145 routing_car_n2s_145" vType="Car" speedFactor="1.14" vaporized=""/>
    <tripinfo id="car_s2w_125" depart="125.00" departLane="s2sep_1" departPos="3.60" departPosLat="0.00" departSpeed="13.90" departDelay="0.00" arrival="278.35" arrivalLane="c2w_1" arrivalPos="990.00" arrivalPosLat="0.00" arrivalSpeed="13.90" duration="153.35" routeLength="1996.47" waitingTime="0.00" waitingCount="0" stopTime="0.00" timeLoss="9.02" rerouteNo="1" devices="tripinfo_car_s2w_125 routing_car_s2w_125" vType="Car" speedFactor="1.00" vaporized=""/>
    <tripinfo id="car_s2w_128" depart="128.00" departLane="s2sep_1" departPos="3.60" departPosLat="0.00" departSpeed="13.90" departDelay="0.00" arrival="282.45" arrivalLane="c2w_1" arrivalPos="990.00" arrivalPosLat="0.00" arrivalSpeed="13.89" duration="154.45" routeLength="1996.47" waitingTime="0.00" waitingCount="0" stopTime="0.00" timeLoss="10.13" rerouteNo="1" devices="tripinfo_car_s2w_128 routing_car_s2w_128" vType="Car" speedFactor="1.00" vaporized=""/>
    <tripinfo id="car_n2e_137" depart="137.00" departLane="n2sep_1" departPos="3.60" departPosLat="0.00" departSpeed="13.90" departDelay="0.00" arrival="282.55" arrivalLane="c2e_1" arrivalPos="990.00" arrivalPosLat="0.00" arrivalSpeed="14.13" duration="145.55" routeLength="1996.47" waitingTime="0.00" waitingCount="0" stopTime="0.00" timeLoss="3.62" rerouteNo="1" devices="tripinfo_car_n2e_137 routing_car_n2e_137" vType="Car" speedFactor="1.02" vaporized=""/>
    <tripinfo id="car_n2e_141" depart="141.00" departLane="n2sep_1" departPos="3.60" departPosLat="0.00" departSpeed="13.90" departDelay="0.00" arrival="290.00" arrivalLane="c2e_1" arrivalPos="990.00" arrivalPosLat="0.00" arrivalSpeed="13.90" duration="149.00" routeLength="1996.47" waitingTime="0.00" waitingCount="0" stopTime="0.00" timeLoss="4.68" rerouteNo="1" devices="tripinfo_car_n2e_141 routing_car_n2e_141" vType="Car" speedFactor="1.00" vaporized=""/>
    <tripinfo id="car_s2w_139" depart="139.00" departLane="s2sep_1" departPos="3.60" departPosLat="0.00" departSpeed="13.90" departDelay="0.00" arrival="290.35" arrivalLane="c2w_1" arrivalPos="990.00" arrivalPosLat="0.00" arrivalSpeed="13.90" duration="151.35" routeLength="1996.47" waitingTime="0.00" waitingCount="0" stopTime="0.00" timeLoss="7.04" rerouteNo="1" devices="tripinfo_car_s2w_139 routing_car_s2w_139" vType="Car" speedFactor="1.00" vaporized=""/>
    <tripinfo id="car_n2e_150" depart="150.00" departLane="n2sep_1" departPos="3.60" departPosLat="0.00" departSpeed="13.90" departDelay="0.00" arrival="292.00" arrivalLane="c2e_1" arrivalPos="990.00" arrivalPosLat="0.00" arrivalSpeed="15.17" duration="142.00" routeLength="1996.47" waitingTime="0.00" waitingCount="0" stopTime="0.00" timeLoss="14.49" rerouteNo="1" devices="tripinfo_car_n2e_150 routing_car_n2e_150" vType="Car" speedFactor="1.13" vaporized=""/>
    <tripinfo id="bus_s2w_141" depart="141.10" departLane="s2sep_1" departPos="12.10" departPosLat="0.00" departSpeed="13.90" departDelay="0.10" arrival="295.00" arrivalLane="c2w_1" arrivalPos="990.00" arrivalPosLat="0.00" arrivalSpeed="13.85" duration="153.90" routeLength="1987.97" waitingTime="0.00" waitingCount="0" stopTime="0.00" timeLoss="10.18" rerouteNo="1" devices="tripinfo_bus_s2w_141 routing_bus_s2w_141" vType="Bus" speedFactor="1.00" vaporized=""/>
    <tripinfo id="car_e2n_116" depart="116.00" departLane="e2sep_1" departPos="3.60" departPosLat="0.00" departSpeed="13.90" departDelay="0.00" arrival="299.90" arrivalLane="c2n_1" arrivalPos="990.00" arrivalPosLat="0.00" arrivalSpeed="14.04" duration="183.90" routeLength="1986.69" waitingTime="34.70" waitingCount="1" stopTime="0.00" timeLoss="41.70" rerouteNo="1" devices="tripinfo_car_e2n_116 routing_car_e2n_116" vType="Car" speedFactor="1.01" vaporized=""/>
    <tripinfo id="car_w2e_98" depart="98.65" departLane="w2sep_1" departPos="3.60" departPosLat="0.00" departSpeed="13.90" departDelay="0.65" arrival="301.00" arrivalLane="c2e_1" arrivalPos="990.00" arrivalPosLat="0.00" arrivalSpeed="13.90" duration="202.35" routeLength="1997.01" waitingTime="47.65" waitingCount="1" stopTime="0.00" timeLoss="58.64" rerouteNo="1" devices="tripinfo_car_w2e_98 routing_car_w2e_98" vType="Car" speedFactor="1.00" vaporized=""/>
    <tripinfo id="car_w2s_107" depart="107.00" departLane="w2sep_1" departPos="3.60" departPosLat="0.00" departSpeed="13.90" departDelay="0.00" arrival="301.75" arrivalLane="c2s_1" arrivalPos="990.00" arrivalPosLat="0.00" arrivalSpeed="14.15" duration="194.75" routeLength="1986.69" waitingTime="42.70" waitingCount="1" stopTime="0.00" timeLoss="53.64" rerouteNo="1" devices="tripinfo_car_w2s_107 routing_car_w2s_107" vType="Car" speedFactor="1.02" vaporized=""/>
    <tripinfo id="car_e2n_138" depart="138.00" departLane="e2sep_1" departPos="3.60" departPosLat="0.00" departSpeed="13.90" departDelay="0.00" arrival="302.40" arrivalLane="c2n_1" arrivalPos="990.00" arrivalPosLat="0.00" arrivalSpeed="15.02" duration="164.40" routeLength="1986.69" waitingTime="19.15" waitingCount="1" stopTime="0.00" timeLoss="33.29" rerouteNo="1" devices="tripinfo_car_e2n_138 routing_car_e2n_138" vType="Car" speedFactor="1.10" vaporized=""/>
    <tripinfo id="car_e2w_130" depart="130.00" departLane="e2sep_1" departPos="3.60" departPosLat="0.00" departSpeed="13.90" departDelay="0.00" arrival="303.20" arrivalLane="c2w_1" arrivalPos="990.00" arrivalPosLat="0.00" arrivalSpeed="13.90" duration="173.20" routeLength="1997.01" waitingTime="20.85" waitingCount="1" stopTime="0.00" timeLoss="29.50" rerouteNo="1" devices="tripinfo_car_e2w_130 routing_car_e2w_130" vType="Car" speedFactor="1.00" vaporized=""/>
    <tripinfo id="car_w2e_108" depart="108.50" departLane="w2sep_1" departPos="3.60" departPosLat="0.00" departSpeed="13.90" departDelay="0.50" arrival="303.30" arrivalLane="c2e_1" arrivalPos="990.00" arrivalPosLat="0.00" arrivalSpeed="14.89" duration="194.80" routeLength="1997.01" waitingTime="41.80" waitingCount="1" stopTime="0.00" timeLoss="63.21" rerouteNo="1" devices="tripinfo_car_w2e_108 routing_car_w2e_108" vType="Car" speedFactor="1.09" vaporized=""/>
    <tripinfo id="car_e2w_152" depart="152.00" departLane="e2sep_1" departPos="3.60" departPosLat="0.00" departSpeed="13.90" departDelay="0.00" arrival="305.60" arrivalLane="c2w_1" arrivalPos="990.00" arrivalPosLat="0.00" arrivalSpeed="14.81" duration="153.60" routeLength="1997.01" waitingTime="6.25" waitingCount="1" stopTime="0.00" timeLoss="20.87" rerouteNo="1" devices="tripinfo_car_e2w_152 routing_car_e2w_152" vType="Car" speedFactor="1.08" vaporized=""/>
    <tripinfo id="car_w2s_114" depart="114.00" departLane="w2sep_1" departPos="3.60" departPosLat="0.00" departSpeed="13.90" departDelay="0.00" arrival="305.95" arrivalLane="c2s_1" arrivalPos="990.00" arrivalPosLat="0.00" arrivalSpeed="14.49" duration="191.95" routeLength="1986.69" waitingTime="37.60" waitingCount="1" stopTime="0.00" timeLoss="54.24" rerouteNo="1" devices="tripinfo_car_w2s_114 routing_car_w2s_114" vType="Car" speedFactor="1.04" vaporized=""/>
    <tripinfo id="car_e2n_161" depart="161.00" departLane="e2sep_1" departPos="3.60" departPosLat="0.00" departSpeed="13.90" departDelay="0.00" arrival="310.15" arrivalLane="c2n_1" arrivalPos="990.00" arrivalPosLat="0.00" arrivalSpeed="13.90" duration="149.15" routeLength="1986.69" waitingTime="0.00" waitingCount="0" stopTime="0.00" timeLoss="5.48" rerouteNo="1" devices="tripinfo_car_e2n_161 routing_car_e2n_161" vType="Car" speedFactor="1.00" vaporized=""/>
    <tripinfo id="car_w2e_147" depart="147.00" departLane="w2sep_1" departPos="3.60" departPosLat="0.00" departSpeed="13.90" departDelay="0.00" arrival="312.55" arrivalLane="c2e_1" arrivalPos="990.00" arrivalPosLat="0.00" arrivalSpeed="14.23" duration="165.55" routeLength="1997.01" waitingTime="10.95" waitingCount="1" stopTime="0.00" timeLoss="25.19" rerouteNo="1" devices="tripinfo_car_w2e_147 routing_car_w2e_147" vType="Car" speedFactor="1.02" vaporized=""/>
    <tripinfo id="bus_w2s_133" depart="133.00" departLane="w2sep_1" departPos="12.10" departPosLat="0.00" departSpeed="13.90" departDelay="0.00" arrival="313.10" arrivalLane="c2s_1" arrivalPos="990.00" arrivalPosLat="0.00" arrivalSpeed="13.89" duration="180.10" routeLength="1978.19" waitingTime="22.85" waitingCount="1" stopTime="0.00" timeLoss="37.02" rerouteNo="1" devices="tripinfo_bus_w2s_133 routing_bus_w2s_133" vType="Bus" speedFactor="1.00" vaporized=""/>
    <tripinfo id="car_w2e_165" depart="165.00" departLane="w2sep_1" departPos="3.60" departPosLat="0.00" departSpeed="13.90" departDelay="0.00" arrival="314.50" arrivalLane="c2e_1" arrivalPos="990.00" arrivalPosLat="0.00" arrivalSpeed="15.67" duration="149.50" routeLength="1997.01" waitingTime="3.95" waitingCount="1" stopTime="0.00" timeLoss="27.57" rerouteNo="1" devices="tripinfo_car_w2e_165 routing_car_w2e_165" vType="Car" speedFactor="1.18" vaporized=""/>
    <tripinfo id="car_w2s_155" depart="155.00" departLane="w2sep_1" departPos="3.60" departPosLat="0.00" departSpeed="13.90" departDelay="0.00" arrival="315.70" arrivalLane="c2s_1" arrivalPos="990.00" arrivalPosLat="0.00" arrivalSpeed="15.22" duration="160.70" routeLength="1986.69" waitingTime="9.30" waitingCount="1" stopTime="0.00" timeLoss="32.35" rerouteNo="1" devices="tripinfo_car_w2s_155 routing_car_w2s_155" vType="Car" speedFactor="1.12" vaporized=""/>
    <tripinfo id="car_e2n_170" depart="170.00" departLane="e2sep_1" departPos="3.60" departPosLat="0.00" departSpeed="13.90" departDelay="0.00" arrival="317.25" arrivalLane="c2n_1" arrivalPos="990.00" arrivalPosLat="0.00" arrivalSpeed="13.97" duration="147.25" routeLength="1986.69" waitingTime="0.00" waitingCount="0" stopTime="0.00" timeLoss="4.32" rerouteNo="1" devices="tripinfo_car_e2n_170 routing_car_e2n_170" vType="Car" speedFactor="1.01" vaporized=""/>
    <tripinfo id="car_w2s_175" depart="175.00" departLane="w2sep_1" departPos="3.60" departPosLat="0.00" departSpeed="13.90" departDelay="0.00" arrival="317.65" arrivalLane="c2s_1" arrivalPos="990.00" arrivalPosLat="0.00" arrivalSpeed="15.63" duration="142.65" routeLength="1986.69" waitingTime="0.00" waitingCount="0" stopTime="0.00" timeLoss="20.04" rerouteNo="1" devices="tripinfo_car_w2s_175 routing_car_w2s_175" vType="Car" speedFactor="1.17" vaporized=""/>
    <tripinfo id="car_w2n_112" depart="112.00" departLane="w2sep_1" departPos="3.60" departPosLat="0.00" departSpeed="13.90" departDelay="0.00" arrival="320.55" arrivalLane="c2n_1" arrivalPos="990.00" arrivalPosLat="0.00" arrivalSpeed="14.37" duration="208.55" routeLength="1996.47" waitingTime="52.05" waitingCount="3" stopTime="0.00" timeLoss="69.46" rerouteNo="1" devices="tripinfo_car_w2n_112 routing_car_w2n_112" vType="Car" speedFactor="1.04" vaporized=""/>
    <tripinfo id="car_w2e_181" depart="181.00" departLane="w2sep_1" departPos="3.60" departPosLat="0.00" departSpeed="13.90" departDelay="0.00" arrival="322.70" arrivalLane="c2e_1" arrivalPos="990.00" arrivalPosLat="0.00" arrivalSpeed="14.21" duration="141.70" routeLength="1997.01" waitingTime="0.00" waitingCount="0" stopTime="0.00" timeLoss="1.11" rerouteNo="1" devices="tripinfo_car_w2e_181 routing_car_w2e_181" vType="Car" speedFactor="1.02" vaporized=""/>
    <tripinfo id="car_w2n_139" depart="139.00" departLane="w2sep_1" departPos="3.60" departPosLat="0.00" departSpeed="13.90" departDelay="0.00" arrival="324.95" arrivalLane="c2n_1" arrivalPos="990.00" arrivalPosLat="0.00" arrivalSpeed="13.93" duration="185.95" routeLength="1996.47" waitingTime="25.85" waitingCount="2" stopTime="0.00" timeLoss="42.08" rerouteNo="1" devices="tripinfo_car_w2n_139 routing_car_w2n_139" vType="Car" speedFactor="1.00" vaporized=""/>
    <tripinfo id="car_e2n_183" depart="183.00" departLane="e2sep_1" departPos="3.60" departPosLat="0.00" departSpeed="13.90" departDelay="0.00" arrival="328.75" arrivalLane="c2n_1" arrivalPos="990.00" arrivalPosLat="0.00" arrivalSpeed="14.20" duration="145.75" routeLength="1986.69" waitingTime="0.00" waitingCount="0" stopTime="0.00" timeLoss="5.30" rerouteNo="1" devices="tripinfo_car_e2n_183 routing_car_e2n_183" vType="Car" speedFactor="1.02" vaporized=""/>
    <tripinfo id="car_e2s_192" depart="193.45" departLane="e2sep_1" departPos="3.60" departPosLat="0.00" departSpeed="13.90" departDelay="1.45" arrival="330.30" arrivalLane="c2s_1" arrivalPos="990.00" arrivalPosLat="0.00" arrivalSpeed="16.40" duration="136.85" routeLength="1996.47" waitingTime="0.00" waitingCount="0" stopTime="0.00" timeLoss="14.49" rerouteNo="1" devices="tripinfo_car_e2s_192 routing_car_e2s_192" vType="Car" speedFactor="1.18" vaporized=""/>
    <tripinfo id="car_w2n_185" depart="185.00" departLane="w2sep_1" departPos="3.60" departPosLat="0.00" departSpeed="13.90" departDelay="0.00" arrival="334.30" arrivalLane="c2n_1" arrivalPos="990.00" arrivalPosLat="0.00" arrivalSpeed="13.90" duration="149.30" routeLength="1996.47" waitingTime="0.00" waitingCount="0" stopTime="0.00" timeLoss="4.95" rerouteNo="1" devices="tripinfo_car_w2n_185 routing_car_w2n_185" vType="Car" speedFactor="1.00" vaporized=""/>
    <tripinfo id="car_w2n_194" depart="194.40" departLane="w2sep_1" departPos="3.60" departPosLat="0.00" departSpeed="13.90" departDelay="0.40" arrival="336.80" arrivalLane="c2n_1" arrivalPos="990.00" arrivalPosLat="0.00" arrivalSpeed="15.11" duration="142.40" routeLength="1996.47" waitingTime="0.00" waitingCount="0" stopTime="0.00" timeLoss="11.48" rerouteNo="1" devices="tripinfo_car_w2n_194 routing_car_w2n_194" vType="Car" speedFactor="1.10" vaporized=""/>
    <tripinfo id="car_s2e_167" depart="167.00" departLane="s2sep_1" departPos="3.60" departPosLat="0.00" departSpeed="13.90" departDelay="0.00" arrival="341.15" arrivalLane="c2e_1" arrivalPos="990.00" arrivalPosLat="0.00" arrivalSpeed="16.05" duration="174.15" routeLength="1986.69" waitingTime="38.40" waitingCount="1" stopTime="0.00" timeLoss="49.69" rerouteNo="1" devices="tripinfo_car_s2e_167 routing_car_s2e_167" vType="Car" speedFactor="1.15" vaporized=""/>
    <tripinfo id="car_n2s_158" depart="158.00" departLane="n2sep_1" departPos="3.60" departPosLat="0.00" departSpeed="13.90" departDelay="0.00" arrival="344.75" arrivalLane="c2s_1" arrivalPos="990.00" arrivalPosLat="0.00" arrivalSpeed="14.12" duration="186.75" routeLength="1997.01" waitingTime="37.95" waitingCount="1" stopTime="0.00" timeLoss="45.29" rerouteNo="1" devices="tripinfo_car_n2s_158 routing_car_n2s_158" vType="Car" speedFactor="1.02" vaporized=""/>
    <tripinfo id="car_n2s_200" depart="200.00" departLane="n2sep_1" departPos="3.60" departPosLat="0.00" departSpeed="13.90" departDelay="0.00" arrival="347.30" arrivalLane="c2s_1" arrivalPos="990.00" arrivalPosLat="0.00" arrivalSpeed="14.92" duration="147.30" routeLength="1997.01" waitingTime="0.85" waitingCount="1" stopTime="0.00" timeLoss="15.10" rerouteNo="1" devices="tripinfo_car_n2s_200 routing_car_n2s_200" vType="Car" speedFactor="1.09" vaporized=""/>
    <tripinfo id="car_s2w_177" depart="177.00" departLane="s2sep_1" departPos="3.60" departPosLat="0.00" departSpeed="13.90" departDelay="0.00" arrival="347.85" arrivalLane="c2w_1" arrivalPos="990.00" arrivalPosLat="0.00" arrivalSpeed="14.46" duration="170.85" routeLength="1996.47" waitingTime="20.85" waitingCount="2" stopTime="0.00" timeLoss="32.05" rerouteNo="1" devices="tripinfo_car_s2w_177 routing_car_s2w_177" vType="Car" speedFactor="1.04" vaporized=""/>
    <tripinfo id="bus_s2n_152" depart="152.00" departLane="s2sep_1" departPos="12.10" departPosLat="0.00" departSpeed="13.90" departDelay="0.00" arrival="349.30" arrivalLane="c2n_1" arrivalPos="990.00" arrivalPosLat="0.00" arrivalSpeed="13.90" duration="197.30" routeLength="1988.51" waitingTime="43.30" waitingCount="1" stopTime="0.00" timeLoss="54.24" rerouteNo="1" devices="tripinfo_bus_s2n_152 routing_bus_s2n_152" vType="Bus" speedFactor="1.00" vaporized=""/>
    <tripinfo id="car_s2n_191" depart="191.00" departLane="s2sep_1" departPos="3.60" departPosLat="0.00" departSpeed="13.90" departDelay="0.00" arrival="352.65" arrivalLane="c2n_1" arrivalPos="990.00" arrivalPosLat="0.00" arrivalSpeed="14.60" duration="161.65" routeLength="1997.01" waitingTime="10.25" waitingCount="1" stopTime="0.00" timeLoss="25.56" rerouteNo="1" devices="tripinfo_car_s2n_191 routing_car_s2n_191" vType="Car" speedFactor="1.06" vaporized=""/>
    <tripinfo id="car_n2s_211" depart="211.00" departLane="n2sep_1" departPos="3.60" departPosLat="0.00" departSpeed="13.90" departDelay="0.00" arrival="353.60" arrivalLane="c2s_1" arrivalPos="990.00" arrivalPosLat="0.00" arrivalSpeed="14.13" duration="142.60" routeLength="1997.01" waitingTime="0.00" waitingCount="0" stopTime="0.00" timeLoss="1.29" rerouteNo="1" devices="tripinfo_car_n2s_211 routing_car_n2s_211" vType="Car" speedFactor="1.02" vaporized=""/>
    <tripinfo id="car_s2e_195" depart="195.00" departLane="s2sep_1" departPos="3.60" departPosLat="0.00" departSpeed="13.90" departDelay="0.00" arrival="354.40" arrivalLane="c2e_1" arrivalPos="990.00" arrivalPosLat="0.00" arrivalSpeed="14.00" duration="159.40" routeLength="1986.69" waitingTime="4.20" waitingCount="1" stopTime="0.00" timeLoss="16.76" rerouteNo="1" devices="tripinfo_car_s2e_195 routing_car_s2e_195" vType="Car" speedFactor="1.01" vaporized=""/>
    <tripinfo id="car_s2e_205" depart="205.00" departLane="s2sep_1" departPos="3.60" departPosLat="0.00" departSpeed="13.90" departDelay="0.00" arrival="357.80" arrivalLane="c2e_1" arrivalPos="990.00" arrivalPosLat="0.00" arrivalSpeed="14.34" duration="152.80" routeLength="1986.69" waitingTime="0.00" waitingCount="0" stopTime="0.00" timeLoss="13.93" rerouteNo="1" devices="tripinfo_car_s2e_205 routing_car_s2e_205" vType="Car" speedFactor="1.03" vaporized=""/>
    <tripinfo id="car_n2e_191" depart="191.00" departLane="n2sep_1" departPos="3.60" departPosLat="0.00" departSpeed="13.90" departDelay="0.00" arrival="361.50" arrivalLane="c2e_1" arrivalPos="990.00" arrivalPosLat="0.00" arrivalSpeed="14.15" duration="170.50" routeLength="1996.47" waitingTime="15.40" waitingCount="2" stopTime="0.00" timeLoss="28.97" rerouteNo="1" devices="tripinfo_car_n2e_191 routing_car_n2e_191" vType="Car" speedFactor="1.02" vaporized=""/>
    <tripinfo id="car_s2e_221" depart="221.00" departLane="s2sep_1" departPos="3.60" departPosLat="0.00" departSpeed="13.90" departDelay="0.00" arrival="364.75" arrivalLane="c2e_1" arrivalPos="990.00" arrivalPosLat="0.00" arrivalSpeed="14.44" duration="143.75" routeLength="1986.69" waitingTime="0.00" waitingCount="0" stopTime="0.00" timeLoss="5.98" rerouteNo="1" devices="tripinfo_car_s2e_221 routing_car_s2e_221" vType="Car" speedFactor="1.04" vaporized=""/>
    <tripinfo id="car_s2w_231" depart="231.00" departLane="s2sep_1" departPos="3.60" departPosLat="0.00" departSpeed="13.90" departDelay="0.00" arrival="376.40" arrivalLane="c2w_1" arrivalPos="990.00" arrivalPosLat="0.00" arrivalSpeed="14.13" duration="145.40" routeLength="1996.47" waitingTime="0.00" waitingCount="0" stopTime="0.00" timeLoss="3.42" rerouteNo="1" devices="tripinfo_car_s2w_231 routing_car_s2w_231" vType="Car" speedFactor="1.02" vaporized=""/>
    <tripinfo id="car_n2e_241" depart="241.35" departLane="n2sep_1" departPos="3.60" departPosLat="0.00" departSpeed="13.90" departDelay="0.35" arrival="378.65" arrivalLane="c2e_1" arrivalPos="990.00" arrivalPosLat="0.00" arrivalSpeed="15.59" duration="137.30" routeLength="1996.47" waitingTime="0.00" waitingCount="0" stopTime="0.00" timeLoss="8.63" rerouteNo="1" devices="tripinfo_car_n2e_241 routing_car_n2e_241" vType="Car" speedFactor="1.12" vaporized=""/>
    <tripinfo id="car_w2e_193" depart="193.00" departLane="w2sep_1" departPos="3.60" departPosLat="0.00" departSpeed="13.90" departDelay="0.00" arrival="388.80" arrivalLane="c2e_1" arrivalPos="990.00" arrivalPosLat="0.00" arrivalSpeed="14.35" duration="195.80" routeLength="1997.01" waitingTime="49.00" waitingCount="1" stopTime="0.00" timeLoss="56.65" rerouteNo="1" devices="tripinfo_car_w2e_193 routing_car_w2e_193" vType="Car" speedFactor="1.03" vaporized=""/>
    <tripinfo id="car_e2w_192" depart="192.00" departLane="e2sep_1" departPos="3.60" departPosLat="0.00" departSpeed="13.90" departDelay="0.00" arrival="390.80" arrivalLane="c2w_1" arrivalPos="990.00" arrivalPosLat="0.00" arrivalSpeed="13.90" duration="198.80" routeLength="1997.01" waitingTime="48.05" waitingCount="1" stopTime="0.00" timeLoss="55.11" rerouteNo="1" devices="tripinfo_car_e2w_192 routing_car_e2w_192" vType="Car" speedFactor="1.00" vaporized=""/>
    <tripinfo id="car_e2w_212" depart="212.00" departLane="e2sep_1" departPos="3.60" departPosLat="0.00" departSpeed="13.90" departDelay="0.00" arrival="394.10" arrivalLane="c2w_1" arrivalPos="990.00" arrivalPosLat="0.00" arrivalSpeed="14.27" duration="182.10" routeLength="1997.01" waitingTime="30.80" waitingCount="1" stopTime="0.00" timeLoss="42.67" rerouteNo="1" devices="tripinfo_car_e2w_212 routing_car_e2w_212" vType="Car" speedFactor="1.03" vaporized=""/>
    <tripinfo id="car_w2e_207" depart="207.00" departLane="w2sep_1" departPos="3.60" departPosLat="0.00" departSpeed="13.90" departDelay="0.00" arrival="394.45" arrivalLane="c2e_1" arrivalPos="990.00" arrivalPosLat="0.00" arrivalSpeed="13.90" duration="187.45" routeLength="1997.01" waitingTime="33.80" waitingCount="1" stopTime="0.00" timeLoss="43.77" rerouteNo="1" devices="tripinfo_car_w2e_207 routing_car_w2e_207" vType="Car" speedFactor="1.00" vaporized=""/>
    <tripinfo id="car_e2n_220" depart="220.45" departLane="e2sep_1" departPos="3.60" departPosLat="0.00" departSpeed="13.90" departDelay="0.45" arrival="397.15" arrivalLane="c2n_1" arrivalPos="990.00" arrivalPosLat="0.00" arrivalSpeed="13.92" duration="176.70" routeLength="1986.69" waitingTime="20.35" waitingCount="1" stopTime="0.00" timeLoss="33.29" rerouteNo="1" devices="tripinfo_car_e2n_220 routing_car_e2n_220" vType="Car" speedFactor="1.00" vaporized=""/>
    <tripinfo id="car_w2e_233" depart="234.50" departLane="w2sep_1" departPos="3.60" departPosLat="0.00" departSpeed="13.90" departDelay="1.50" arrival="397.35" arrivalLane="c2e_1" arrivalPos="990.00" arrivalPosLat="0.00" arrivalSpeed="14.33" duration="162.85" routeLength="1997.01" waitingTime="6.50" waitingCount="1" stopTime="0.00" timeLoss="24.37" rerouteNo="1" devices="tripinfo_car_w2e_233 routing_car_w2e_233" vType="Car" speedFactor="1.04" vaporized=""/>
    <tripinfo id="car_e2w_219" depart="219.00" departLane="e2sep_1" departPos="3.60" departPosLat="0.00" departSpeed="13.90" departDelay="0.00" arrival="398.05" arrivalLane="c2w_1" arrivalPos="990.00" arrivalPosLat="0.00" arrivalSpeed="13.88" duration="179.05" routeLength="1997.01" waitingTime="22.85" waitingCount="1" stopTime="0.00" timeLoss="35.37" rerouteNo="1" devices="tripinfo_car_e2w_219 routing_car_e2w_219" vType="Car" speedFactor="1.00" vaporized=""/>
    <tripinfo id="car_e2n_242" depart="242.00" departLane="e2sep_1" departPos="3.60" departPosLat="0.00" departSpeed="13.90" departDelay="0.00" arrival="399.50" arrivalLane="c2n_1" arrivalPos="990.00" arrivalPosLat="0.00" arrivalSpeed="14.97" duration="157.50" routeLength="1986.69" waitingTime="9.35" waitingCount="1" stopTime="0.00" timeLoss="26.53" rerouteNo="1" devices="tripinfo_car_e2n_242 routing_car_e2n_242" vType="Car" speedFactor="1.10" vaporized=""/>
    <tripinfo id="car_w2e_235" depart="236.30" departLane="w2sep_1" departPos="3.60" departPosLat="0.00" departSpeed="13.90" departDelay="1.30" arrival="399.55" arrivalLane="c2e_1" arrivalPos="990.00" arrivalPosLat="0.00" arrivalSpeed="14.84" duration="163.25" routeLength="1997.01" waitingTime="5.55" waitingCount="1" stopTime="0.00" timeLoss="31.54" rerouteNo="1" devices="tripinfo_car_w2e_235 routing_car_w2e_235" vType="Car" speedFactor="1.09" vaporized=""/>
    <tripinfo id="car_e2w_234" depart="234.00" departLane="e2sep_1" departPos="3.60" departPosLat="0.00" departSpeed="13.90" departDelay="0.00" arrival="400.65" arrivalLane="c2w_1" arrivalPos="990.00" arrivalPosLat="0.00" arrivalSpeed="14.35" duration="166.65" routeLength="1997.01" waitingTime="12.90" waitingCount="1" stopTime="0.00" timeLoss="28.94" rerouteNo="1" devices="tripinfo_car_e2w_234 routing_car_e2w_234" vType="Car" speedFactor="1.04" vaporized=""/>
    <tripinfo id="car_w2n_215" depart="215.00" departLane="w2sep_1" departPos="3.60" departPosLat="0.00" departSpeed="13.90" departDelay="0.00" arrival="401.55" arrivalLane="c2n_1" arrivalPos="990.00" arrivalPosLat="0.00" arrivalSpeed="15.46" duration="186.55" routeLength="1996.47" waitingTime="39.15" waitingCount="2" stopTime="0.00" timeLoss="60.78" rerouteNo="1" devices="tripinfo_car_w2n_215 routing_car_w2n_215" vType="Car" speedFactor="1.15" vaporized=""/>
    <tripinfo id="bus_w2e_236" depart="238.90" departLane="w2sep_1" departPos="12.10" departPosLat="0.00" departSpeed="13.90" departDelay="2.90" arrival="403.25" arrivalLane="c2e_1" arrivalPos="990.00" arrivalPosLat="0.00" arrivalSpeed="13.80" duration="164.35" routeLength="1988.51" waitingTime="3.95" waitingCount="1" stopTime="0.00" timeLoss="21.27" rerouteNo="1" devices="tripinfo_bus_w2e_236 routing_bus_w2e_236" vType="Bus" speedFactor="1.00" vaporized=""/>
    <tripinfo id="car_w2e_241" depart="242.75" departLane="w2sep_1" departPos="3.60" departPosLat="0.00" departSpeed="13.90" departDelay="1.75" arrival="405.95" arrivalLane="c2e_1" arrivalPos="990.00" arrivalPosLat="0.00" arrivalSpeed="14.85" duration="163.20" routeLength="1997.01" waitingTime="0.00" waitingCount="0" stopTime="0.00" timeLoss="31.13" rerouteNo="1" devices="tripinfo_car_w2e_241 routing_car_w2e_241" vType="Car" speedFactor="1.09" vaporized=""/>
    <tripinfo id="car_w2n_231" depart="231.00" departLane="w2sep_1" departPos="3.60" departPosLat="0.00" departSpeed="13.90" departDelay="0.00" arrival="406.25" arrivalLane="c2n_1" arrivalPos="990.00" arrivalPosLat="0.00" arrivalSpeed="14.20" duration="175.25" routeLength="1996.47" waitingTime="18.25" waitingCount="2" stopTime="0.00" timeLoss="34.04" rerouteNo="1" devices="tripinfo_car_w2n_231 routing_car_w2n_231" vType="Car" speedFactor="1.02" vaporized=""/>
    <tripinfo id="car_w2n_233" depart="233.00" departLane="w2sep_1" departPos="3.60" departPosLat="0.00" departSpeed="13.90" departDelay="0.00" arrival="408.65" arrivalLane="c2n_1" arrivalPos="990.00" arrivalPosLat="0.00" arrivalSpeed="14.94" duration="175.65" routeLength="1996.47" waitingTime="15.45" waitingCount="2" stopTime="0.00" timeLoss="43.47" rerouteNo="1" devices="tripinfo_car_w2n_233 routing_car_w2n_233" vType="Car" speedFactor="1.09" vaporized=""/>
    <tripinfo id="car_w2s_265" depart="265.00" departLane="w2sep_1" departPos="3.60" departPosLat="0.00" departSpeed="13.90" departDelay="0.00" arrival="408.80" arrivalLane="c2s_1" arrivalPos="990.00" arrivalPosLat="0.00" arrivalSpeed="14.38" duration="143.80" routeLength="1986.69" waitingTime="0.00" waitingCount="0" stopTime="0.00" timeLoss="4.94" rerouteNo="1" devices="tripinfo_car_w2s_265 routing_car_w2s_265" vType="Car" speedFactor="1.03" vaporized=""/>
    <tripinfo id="car_w2e_246" depart="246.00" departLane="w2sep_1" departPos="3.60" departPosLat="0.00" departSpeed="13.90" departDelay="0.00" arrival="409.25" arrivalLane="c2e_1" arrivalPos="990.00" arrivalPosLat="0.00" arrivalSpeed="13.86" duration="163.25" routeLength="1997.01" waitingTime="0.00" waitingCount="0" stopTime="0.00" timeLoss="19.55" rerouteNo="1" devices="tripinfo_car_w2e_246 routing_car_w2e_246" vType="Car" speedFactor="1.00" vaporized=""/>
    <tripinfo id="amb_w2e_300" depart="300.70" departLane="w2sep_1" departPos="6.60" departPosLat="0.00" departSpeed="13.90" departDelay="0.70" arrival="411.00" arrivalLane="c2e_1" arrivalPos="990.00" arrivalPosLat="-0.95" arrivalSpeed="18.52" duration="110.30" routeLength="1994.01" waitingTime="0.00" waitingCount="0" stopTime="0.00" timeLoss="14.66" rerouteNo="1" devices="tripinfo_amb_w2e_300 routing_amb_w2e_300 bluelight_amb_w2e_300 fcd_amb_w2e_300" vType="Ambulance" speedFactor="1.50" vaporized="">
        <example_device customValue1="0.00" customValue2="-1.00"/>
    </tripinfo>
    <tripinfo id="car_w2e_251" depart="251.00" departLane="w2sep_1" departPos="3.60" departPosLat="0.00" departSpeed="13.90" departDelay="0.00" arrival="412.20" arrivalLane="c2e_1" arrivalPos="990.00" arrivalPosLat="1.10" arrivalSpeed="13.83" duration="161.20" routeLength="1997.01" waitingTime="0.00" waitingCount="0" stopTime="0.00" timeLoss="17.53" rerouteNo="1" devices="tripinfo_car_w2e_251 routing_car_w2e_251" vType="Car@car_w2e_251" speedFactor="1.00" vaporized=""/>
    <tripinfo id="car_w2s_271" depart="271.00" departLane="w2sep_1" departPos="3.60" departPosLat="0.00" departSpeed="13.90" departDelay="0.00" arrival="412.55" arrivalLane="c2s_1" arrivalPos="990.00" arrivalPosLat="0.00" arrivalSpeed="14.77" duration="141.55" routeLength="1986.69" waitingTime="0.00" waitingCount="0" stopTime="0.00" timeLoss="6.64" rerouteNo="1" devices="tripinfo_car_w2s_271 routing_car_w2s_271" vType="Car" speedFactor="1.06" vaporized=""/>
    <tripinfo id="car_w2n_241" depart="241.00" departLane="w2sep_1" departPos="3.60" departPosLat="0.00" departSpeed="13.90" departDelay="0.00" arrival="412.75" arrivalLane="c2n_1" arrivalPos="990.00" arrivalPosLat="0.00" arrivalSpeed="14.02" duration="171.75" routeLength="1996.47" waitingTime="4.45" waitingCount="1" stopTime="0.00" timeLoss="28.83" rerouteNo="1" devices="tripinfo_car_w2n_241 routing_car_w2n_241" vType="Car" speedFactor="1.01" vaporized=""/>
    <tripinfo id="car_w2n_252" depart="252.50" departLane="w2sep_1" departPos="3.60" departPosLat="0.00" departSpeed="13.90" departDelay="0.50" arrival="416.45" arrivalLane="c2n_1" arrivalPos="990.00" arrivalPosLat="0.00" arrivalSpeed="13.88" duration="163.95" routeLength="1996.47" waitingTime="2.00" waitingCount="1" stopTime="0.00" timeLoss="19.64" rerouteNo="1" devices="tripinfo_car_w2n_252 routing_car_w2n_252" vType="Car" speedFactor="1.00" vaporized=""/>
    <tripinfo id="car_e2s_223" depart="223.00" departLane="e2sep_1" departPos="3.60" departPosLat="0.00" departSpeed="13.90" departDelay="0.00" arrival="418.80" arrivalLane="c2s_1" arrivalPos="990.00" arrivalPosLat="0.00" arrivalSpeed="14.00" duration="195.80" routeLength="1996.47" waitingTime="36.75" waitingCount="2" stopTime="0.00" timeLoss="52.46" rerouteNo="1" devices="tripinfo_car_e2s_223 routing_car_e2s_223" vType="Car" speedFactor="1.01" vaporized=""/>
    <tripinfo id="bus_w2n_256" depart="256.00" departLane="w2sep_1" departPos="12.10" departPosLat="0.00" departSpeed="13.90" departDelay="0.00" arrival="420.15" arrivalLane="c2n_1" arrivalPos="990.00" arrivalPosLat="0.00" arrivalSpeed="13.79" duration="164.15" routeLength="1987.97" waitingTime="1.75" waitingCount="1" stopTime="0.00" timeLoss="20.45" rerouteNo="1" devices="tripinfo_bus_w2n_256 routing_bus_w2n_256" vType="Bus" speedFactor="1.00" vaporized=""/>
    <tripinfo id="bus_e2s_250" depart="250.00" departLane="e2sep_1" departPos="12.10" departPosLat="0.00" departSpeed="13.90" departDelay="0.00" arrival="424.60" arrivalLane="c2s_1" arrivalPos="990.00" arrivalPosLat="0.00" arrivalSpeed="13.88" duration="174.60" routeLength="1987.97" waitingTime="19.15" waitingCount="1" stopTime="0.00" timeLoss="30.90" rerouteNo="1" devices="tripinfo_bus_e2s_250 routing_bus_e2s_250" vType="Bus" speedFactor="1.00" vaporized=""/>
    <tripinfo id="car_w2n_289" depart="289.00" departLane="w2sep_1" departPos="3.60" departPosLat="0.00" departSpeed="13.90" departDelay="0.00" arrival="425.20" arrivalLane="c2n_1" arrivalPos="990.00" arrivalPosLat="0.00" arrivalSpeed="15.23" duration="136.20" routeLength="1996.47" waitingTime="0.00" waitingCount="0" stopTime="0.00" timeLoss="4.55" rerouteNo="1" devices="tripinfo_car_w2n_289 routing_car_w2n_289" vType="Car" speedFactor="1.10" vaporized=""/>
    <tripinfo id="car_w2s_289" depart="290.30" departLane="w2sep_1" departPos="3.60" departPosLat="0.00" departSpeed="13.90" departDelay="1.30" arrival="428.95" arrivalLane="c2s_1" arrivalPos="990.00" arrivalPosLat="0.00" arrivalSpeed="15.21" duration="138.65" routeLength="1986.69" waitingTime="0.00" waitingCount="0" stopTime="0.00" timeLoss="7.52" rerouteNo="1" devices="tripinfo_car_w2s_289 routing_car_w2s_289" vType="Car" speedFactor="1.10" vaporized=""/>
    <tripinfo id="bus_e2s_258" depart="258.00" departLane="e2sep_1" departPos="12.10" departPosLat="0.00" departSpeed="13.90" departDelay="0.00" arrival="442.95" arrivalLane="c2s_1" arrivalPos="990.00" arrivalPosLat="0.00" arrivalSpeed="13.90" duration="184.95" routeLength="1987.97" waitingTime="22.20" waitingCount="2" stopTime="0.00" timeLoss="41.24" rerouteNo="1" devices="tripinfo_bus_e2s_258 routing_bus_e2s_258" vType="Bus" speedFactor="1.00" vaporized=""/>
    <tripinfo id="car_e2s_262" depart="262.00" departLane="e2sep_1" departPos="3.60" departPosLat="0.00" departSpeed="13.90" departDelay="0.00" arrival="447.30" arrivalLane="c2s_1" arrivalPos="990.00" arrivalPosLat="0.00" arrivalSpeed="14.08" duration="185.30" routeLength="1996.47" waitingTime="18.05" waitingCount="2" stopTime="0.00" timeLoss="42.95" rerouteNo="1" devices="tripinfo_car_e2s_262 routing_car_e2s_262" vType="Car" speedFactor="1.01" vaporized=""/>
    <tripinfo id="car_s2e_242" depart="242.00" departLane="s2sep_1" departPos="3.60" departPosLat="0.00" departSpeed="13.90" departDelay="0.00" arrival="448.95" arrivalLane="c2e_1" arrivalPos="990.00" arrivalPosLat="0.00" arrivalSpeed="14.80" duration="206.95" routeLength="1986.69" waitingTime="64.70" waitingCount="1" stopTime="0.00" timeLoss="72.03" rerouteNo="1" devices="tripinfo_car_s2e_242 routing_car_s2e_242" vType="Car" speedFactor="1.07" vaporized=""/>
    <tripinfo id="car_s2n_260" depart="260.00" departLane="s2sep_1" departPos="3.60" departPosLat="0.00" departSpeed="13.90" departDelay="0.00" arrival="450.60" arrivalLane="c2n_1" arrivalPos="990.00" arrivalPosLat="0.00" arrivalSpeed="14.91" duration="190.60" routeLength="1997.01" waitingTime="47.95" waitingCount="1" stopTime="0.00" timeLoss="56.68" rerouteNo="1" devices="tripinfo_car_s2n_260 routing_car_s2n_260" vType="Car" speedFactor="1.07" vaporized=""/>
    <tripinfo id="car_e2s_272" depart="272.00" departLane="e2sep_1" departPos="3.60" departPosLat="0.00" departSpeed="13.90" departDelay="0.00" arrival="450.95" arrivalLane="c2s_1" arrivalPos="990.00" arrivalPosLat="0.00" arrivalSpeed="13.88" duration="178.95" routeLength="1996.47" waitingTime="8.95" waitingCount="2" stopTime="0.00" timeLoss="34.60" rerouteNo="1" devices="tripinfo_car_e2s_272 routing_car_e2s_272" vType="Car" speedFactor="1.00" vaporized=""/>
    <tripinfo id="car_s2n_274" depart="274.00" departLane="s2sep_1" departPos="3.60" departPosLat="0.00" departSpeed="13.90" departDelay="0.00" arrival="452.90" arrivalLane="c2n_1" arrivalPos="990.00" arrivalPosLat="0.00" arrivalSpeed="15.91" duration="178.90" routeLength="1997.01" waitingTime="40.05" waitingCount="1" stopTime="0.00" timeLoss="55.99" rerouteNo="1" devices="tripinfo_car_s2n_274 routing_car_s2n_274" vType="Car" speedFactor="1.17" vaporized=""/>
    <tripinfo id="car_n2s_240" depart="240.00" departLane="n2sep_1" departPos="3.60" departPosLat="0.00" departSpeed="13.90" departDelay="0.00" arrival="453.35" arrivalLane="c2s_1" arrivalPos="990.00" arrivalPosLat="0.00" arrivalSpeed="14.48" duration="213.35" routeLength="1997.01" waitingTime="66.60" waitingCount="1" stopTime="0.00" timeLoss="77.41" rerouteNo="1" devices="tripinfo_car_n2s_240 routing_car_n2s_240" vType="Car" speedFactor="1.06" vaporized=""/>
    <tripinfo id="car_s2n_280" depart="280.00" departLane="s2sep_1" departPos="3.60" departPosLat="0.00" departSpeed="13.90" departDelay="0.00" arrival="456.35" arrivalLane="c2n_1" arrivalPos="990.00" arrivalPosLat="0.00" arrivalSpeed="15.23" duration="176.35" routeLength="1997.01" waitingTime="28.35" waitingCount="1" stopTime="0.00" timeLoss="45.55" rerouteNo="1" devices="tripinfo_car_s2n_280 routing_car_s2n_280" vType="Car" speedFactor="1.10" vaporized=""/>
    <tripinfo id="car_n2w_285" depart="285.00" departLane="n2sep_1" departPos="3.60" departPosLat="0.00" departSpeed="13.90" departDelay="0.00" arrival="457.05" arrivalLane="c2w_1" arrivalPos="990.00" arrivalPosLat="0.00" arrivalSpeed="14.03" duration="172.05" routeLength="1986.69" waitingTime="20.15" waitingCount="1" stopTime="0.00" timeLoss="29.70" rerouteNo="1" devices="tripinfo_car_n2w_285 routing_car_n2w_285" vType="Car" speedFactor="1.01" vaporized=""/>
    <tripinfo id="car_n2s_255" depart="255.00" departLane="n2sep_1" departPos="3.60" departPosLat="0.00" departSpeed="13.90" departDelay="0.00" arrival="457.45" arrivalLane="c2s_1" arrivalPos="990.00" arrivalPosLat="0.00" arrivalSpeed="13.89" duration="202.45" routeLength="1997.01" waitingTime="48.35" waitingCount="1" stopTime="0.00" timeLoss="58.74" rerouteNo="1" devices="tripinfo_car_n2s_255 routing_car_n2s_255" vType="Car" speedFactor="1.00" vaporized=""/>
    <tripinfo id="car_n2s_290" depart="290.00" departLane="n2sep_1" departPos="3.60" departPosLat="0.00" departSpeed="13.90" departDelay="0.00" arrival="459.20" arrivalLane="c2s_1" arrivalPos="990.00" arrivalPosLat="0.00" arrivalSpeed="15.36" duration="169.20" routeLength="1997.01" waitingTime="19.50" waitingCount="1" stopTime="0.00" timeLoss="47.15" rerouteNo="1" devices="tripinfo_car_n2s_290 routing_car_n2s_290" vType="Car" speedFactor="1.18" vaporized=""/>
    <tripinfo id="car_s2e_311" depart="311.00" departLane="s2sep_1" departPos="3.60" departPosLat="0.00" departSpeed="13.90" departDelay="0.00" arrival="462.00" arrivalLane="c2e_1" arrivalPos="990.00" arrivalPosLat="0.00" arrivalSpeed="13.90" duration="151.00" routeLength="1986.69" waitingTime="0.00" waitingCount="0" stopTime="0.00" timeLoss="7.31" rerouteNo="1" devices="tripinfo_car_s2e_311 routing_car_s2e_311" vType="Car" speedFactor="1.00" vaporized=""/>
    <tripinfo id="car_s2w_276" depart="276.00" departLane="s2sep_1" departPos="3.60" departPosLat="0.00" departSpeed="13.90" departDelay="0.00" arrival="462.30" arrivalLane="c2w_1" arrivalPos="990.00" arrivalPosLat="0.00" arrivalSpeed="14.13" duration="186.30" routeLength="1996.47" waitingTime="31.90" waitingCount="2" stopTime="0.00" timeLoss="44.33" rerouteNo="1" devices="tripinfo_car_s2w_276 routing_car_s2w_276" vType="Car" speedFactor="1.02" vaporized=""/>
    <tripinfo id="car_n2s_324" depart="324.00" departLane="n2sep_1" departPos="3.60" departPosLat="0.00" departSpeed="13.90" departDelay="0.00" arrival="465.70" arrivalLane="c2s_1" arrivalPos="990.00" arrivalPosLat="0.00" arrivalSpeed="14.74" duration="141.70" routeLength="1997.01" waitingTime="0.00" waitingCount="0" stopTime="0.00" timeLoss="6.23" rerouteNo="1" devices="tripinfo_car_n2s_324 routing_car_n2s_324" vType="Car" speedFactor="1.06" vaporized=""/>
    <tripinfo id="car_n2w_322" depart="322.00" departLane="n2sep_1" departPos="3.60" departPosLat="0.00" departSpeed="13.90" departDelay="0.00" arrival="467.25" arrivalLane="c2w_1" arrivalPos="990.00" arrivalPosLat="0.00" arrivalSpeed="14.22" duration="145.25" routeLength="1986.69" waitingTime="0.00" waitingCount="0" stopTime="0.00" timeLoss="4.88" rerouteNo="1" devices="tripinfo_car_n2w_322 routing_car_n2w_322" vType="Car" speedFactor="1.02" vaporized=""/>
</tripinfos>
