<?xml version="1.0" encoding="UTF-8"?>

<!-- generated on Sat Apr 24 17:14:08 2021 by Eclipse SUMO Version 1.4.0
<configuration xmlns:xsi="http://www.w3.org/2001/XMLSchema-instance" xsi:noNamespaceSchemaLocation="http://sumo.dlr.de/xsd/sumoConfiguration.xsd">

    <input>
        <net-file value="sumofiles/junction.net.xml"/>
        <route-files value="sumofiles/junction_0_0.rou.xml"/>
        <additional-files value="sumofiles/junction.det.xml"/>
    </input>

    <output>
        <tripinfo-output value="sumofiles/output/tripinfo_0_0.xml"/>
    </output>

    <time>
        <begin value="0"/>
        <end value="10000"/>
        <step-length value="0.05"/>
    </time>

    <processing>
        <lateral-resolution value="0.1"/>
    </processing>

    <report>
        <no-warnings value="true"/>
        <error-log value="sumofiles/output/errorlog_0_0.log"/>
        <no-step-log value="true"/>
    </report>

    <traci_server>
        <remote-port value="35327"/>
    </traci_server>

    <gui_only>
        <gui-settings-file value="sumofiles/junction-gui.settings.xml"/>
        <tracker-interval value="0.05"/>
    </gui_only>

</configuration>
-->

<tripinfos xmlns:xsi="http://www.w3.org/2001/XMLSchema-instance" xsi:noNamespaceSchemaLocation="http://sumo.dlr.de/xsd/tripinfo_file.xsd">
    <tripinfo id="car_e2s_1" depart="1.00" departLane="e2sep_1" departPos="3.60" departPosLat="0.00" departSpeed="13.90" departDelay="0.00" arrival="140.70" arrivalLane="c2s_1" arrivalPos="990.00" arrivalPosLat="0.00" arrivalSpeed="14.73" duration="139.70" routeLength="1996.47" waitingTime="0.00" waitingCount="0" stopTime="0.00" timeLoss="3.53" rerouteNo="1" devices="tripinfo_car_e2s_1 routing_car_e2s_1" vType="Car" speedFactor="1.06" vaporized=""/>
    <tripinfo id="car_e2w_5" depart="5.00" departLane="e2sep_1" departPos="3.60" departPosLat="0.00" departSpeed="13.90" departDelay="0.00" arrival="141.65" arrivalLane="c2w_1" arrivalPos="990.00" arrivalPosLat="0.00" arrivalSpeed="14.73" duration="136.65" routeLength="1997.01" waitingTime="0.00" waitingCount="0" stopTime="0.00" timeLoss="1.11" rerouteNo="1" devices="tripinfo_car_e2w_5 routing_car_e2w_5" vType="Car" speedFactor="1.06" vaporized=""/>
    <tripinfo id="car_w2n_18" depart="18.00" departLane="w2sep_1" departPos="3.60" departPosLat="0.00" departSpeed="13.90" departDelay="0.00" arrival="155.70" arrivalLane="c2n_1" arrivalPos="990.00" arrivalPosLat="0.00" arrivalSpeed="15.05" duration="137.70" routeLength="1996.47" waitingTime="0.00" waitingCount="0" stopTime="0.00" timeLoss="4.35" rerouteNo="1" devices="tripinfo_car_w2n_18 routing_car_w2n_18" vType="Car" speedFactor="1.08" vaporized=""/>
    <tripinfo id="car_s2n_20" depart="20.00" departLane="s2sep_1" departPos="3.60" departPosLat="0.00" departSpeed="13.90" departDelay="0.00" arrival="162.25" arrivalLane="c2n_1" arrivalPos="990.00" arrivalPosLat="0.00" arrivalSpeed="15.16" duration="142.25" routeLength="1997.01" waitingTime="0.00" waitingCount="0" stopTime="0.00" timeLoss="10.49" rerouteNo="1" devices="tripinfo_car_s2n_20 routing_car_s2n_20" vType="Car" speedFactor="1.09" vaporized=""/>
    <tripinfo id="car_n2s_20" depart="20.00" departLane="n2sep_1" departPos="3.60" departPosLat="0.00" departSpeed="13.90" departDelay="0.00" arrival="162.30" arrivalLane="c2s_1" arrivalPos="990.00" arrivalPosLat="0.00" arrivalSpeed="14.32" duration="142.30" routeLength="1997.01" waitingTime="0.00" waitingCount="0" stopTime="0.00" timeLoss="2.84" rerouteNo="1" devices="tripinfo_car_n2s_20 routing_car_n2s_20" vType="Car" speedFactor="1.03" vaporized=""/>
    <tripinfo id="car_n2s_21" depart="23.15" departLane="n2sep_1" departPos="3.60" departPosLat="0.00" departSpeed="13.90" departDelay="2.15" arrival="164.65" arrivalLane="c2s_1" arrivalPos="990.00" arrivalPosLat="0.00" arrivalSpeed="15.32" duration="141.50" routeLength="1997.01" waitingTime="0.00" waitingCount="0" stopTime="0.00" timeLoss="13.52" rerouteNo="1" devices="tripinfo_car_n2s_21 routing_car_n2s_21" vType="Car" speedFactor="1.12" vaporized=""/>
    <tripinfo id="car_s2e_12" depart="12.00" departLane="s2sep_1" departPos="3.60" departPosLat="0.00" departSpeed="13.90" departDelay="0.00" arrival="165.60" arrivalLane="c2e_1" arrivalPos="990.00" arrivalPosLat="0.00" arrivalSpeed="13.90" duration="153.60" routeLength="1986.69" waitingTime="2.40" waitingCount="1" stopTime="0.00" timeLoss="9.94" rerouteNo="1" devices="tripinfo_car_s2e_12 routing_car_s2e_12" vType="Car" speedFactor="1.00" vaporized=""/>
    <tripinfo id="car_n2s_24" depart="24.90" departLane="n2sep_1" departPos="3.60" departPosLat="0.00" departSpeed="13.90" departDelay="0.90" arrival="169.20" arrivalLane="c2s_1" arrivalPos="990.00" arrivalPosLat="0.00" arrivalSpeed="14.53" duration="144.30" routeLength="1997.01" waitingTime="0.00" waitingCount="0" stopTime="0.00" timeLoss="6.90" rerouteNo="1" devices="tripinfo_car_n2s_24 routing_car_n2s_24" vType="Car" speedFactor="1.05" vaporized=""/>
    <tripinfo id="car_s2e_20" depart="21.35" departLane="s2sep_1" departPos="3.60" departPosLat="0.00" departSpeed="13.90" departDelay="1.35" arrival="169.75" arrivalLane="c2e_1" arrivalPos="990.00" arrivalPosLat="0.00" arrivalSpeed="14.25" duration="148.40" routeLength="1986.69" waitingTime="0.00" waitingCount="0" stopTime="0.00" timeLoss="8.40" rerouteNo="1" devices="tripinfo_car_s2e_20 routing_car_s2e_20" vType="Car" speedFactor="1.03" vaporized=""/>
    <tripinfo id="car_n2e_10" depart="10.00" departLane="n2sep_1" departPos="3.60" departPosLat="0.00" departSpeed="13.90" departDelay="0.00" arrival="172.25" arrivalLane="c2e_1" arrivalPos="990.00" arrivalPosLat="0.00" arrivalSpeed="14.86" duration="162.25" routeLength="1996.47" waitingTime="13.20" waitingCount="2" stopTime="0.00" timeLoss="28.94" rerouteNo="1" devices="tripinfo_car_n2e_10 routing_car_n2e_10" vType="Car" speedFactor="1.08" vaporized=""/>
    <tripinfo id="car_s2n_38" depart="38.45" departLane="s2sep_1" departPos="3.60" departPosLat="0.00" departSpeed="13.90" departDelay="0.45" arrival="172.40" arrivalLane="c2n_1" arrivalPos="990.00" arrivalPosLat="0.00" arrivalSpeed="16.10" duration="133.95" routeLength="1997.01" waitingTime="0.00" waitingCount="0" stopTime="0.00" timeLoss="9.88" rerouteNo="1" devices="tripinfo_car_s2n_38 routing_car_s2n_38" vType="Car" speedFactor="1.16" vaporized=""/>
    <tripinfo id="car_s2w_7" depart="7.00" departLane="s2sep_1" departPos="3.60" departPosLat="0.00" departSpeed="13.90" departDelay="0.00" arrival="173.55" arrivalLane="c2w_1" arrivalPos="990.00" arrivalPosLat="0.00" arrivalSpeed="14.04" duration="166.55" routeLength="1996.47" waitingTime="12.75" waitingCount="2" stopTime="0.00" timeLoss="23.68" rerouteNo="1" devices="tripinfo_car_s2w_7 routing_car_s2w_7" vType="Car" speedFactor="1.01" vaporized=""/>
    <tripinfo id="car_n2e_21" depart="21.40" departLane="n2sep_1" departPos="3.60" departPosLat="0.00" departSpeed="13.90" departDelay="0.40" arrival="175.50" arrivalLane="c2e_1" arrivalPos="990.00" arrivalPosLat="0.00" arrivalSpeed="14.50" duration="154.10" routeLength="1996.47" waitingTime="1.60" waitingCount="1" stopTime="0.00" timeLoss="16.26" rerouteNo="1" devices="tripinfo_car_n2e_21 routing_car_n2e_21" vType="Car" speedFactor="1.05" vaporized=""/>
    <tripinfo id="car_s2w_16" depart="16.00" departLane="s2sep_1" departPos="3.60" departPosLat="0.00" departSpeed="13.90" departDelay="0.00" arrival="177.90" arrivalLane="c2w_1" arrivalPos="990.00" arrivalPosLat="0.00" arrivalSpeed="14.03" duration="161.90" routeLength="1996.47" waitingTime="3.15" waitingCount="1" stopTime="0.00" timeLoss="19.07" rerouteNo="1" devices="tripinfo_car_s2w_16 routing_car_s2w_16" vType="Car" speedFactor="1.01" vaporized=""/>
    <tripinfo id="car_n2e_27" depart="27.00" departLane="n2sep_1" departPos="3.60" departPosLat="0.00" departSpeed="13.90" departDelay="0.00" arrival="180.30" arrivalLane="c2e_1" arrivalPos="990.00" arrivalPosLat="0.00" arrivalSpeed="13.89" duration="153.30" routeLength="1996.47" waitingTime="0.00" waitingCount="0" stopTime="0.00" timeLoss="8.98" rerouteNo="1" devices="tripinfo_car_n2e_27 routing_car_n2e_27" vType="Car" speedFactor="1.00" vaporized=""/>
    <tripinfo id="car_s2w_37" depart="37.00" departLane="s2sep_1" departPos="3.60" departPosLat="0.00" departSpeed="13.90" departDelay="0.00" arrival="185.15" arrivalLane="c2w_1" arrivalPos="990.00" arrivalPosLat="0.00" arrivalSpeed="13.90" duration="148.15" routeLength="1996.47" waitingTime="0.00" waitingCount="0" stopTime="0.00" timeLoss="3.84" rerouteNo="1" devices="tripinfo_car_s2w_37 routing_car_s2w_37" vType="Car" speedFactor="1.00" vaporized=""/>
    <tripinfo id="car_n2s_43" depart="43.00" departLane="n2sep_1" departPos="3.60" departPosLat="0.00" departSpeed="13.90" departDelay="0.00" arrival="187.25" arrivalLane="c2s_1" arrivalPos="990.00" arrivalPosLat="0.00" arrivalSpeed="14.15" duration="144.25" routeLength="1997.01" waitingTime="0.00" waitingCount="0" stopTime="0.00" timeLoss="3.13" rerouteNo="1" devices="tripinfo_car_n2s_43 routing_car_n2s_43" vType="Car" speedFactor="1.02" vaporized=""/>
    <tripinfo id="bus_n2e_41" depart="41.00" departLane="n2sep_1" departPos="12.10" departPosLat="0.00" departSpeed="13.90" departDelay="0.00" arrival="190.35" arrivalLane="c2e_1" arrivalPos="990.00" arrivalPosLat="0.00" arrivalSpeed="13.90" duration="149.35" routeLength="1987.97" waitingTime="0.00" waitingCount="0" stopTime="0.00" timeLoss="5.64" rerouteNo="1" devices="tripinfo_bus_n2e_41 routing_bus_n2e_41" vType="Bus" speedFactor="1.00" vaporized=""/>
    <tripinfo id="car_s2w_44" depart="44.00" departLane="s2sep_1" departPos="3.60" departPosLat="0.00" departSpeed="13.90" departDelay="0.00" arrival="191.65" arrivalLane="c2w_1" arrivalPos="990.00" arrivalPosLat="0.00" arrivalSpeed="14.04" duration="147.65" routeLength="1996.47" waitingTime="0.00" waitingCount="0" stopTime="0.00" timeLoss="4.77" rerouteNo="1" devices="tripinfo_car_s2w_44 routing_car_s2w_44" vType="Car" speedFactor="1.01" vaporized=""/>
    <tripinfo id="car_n2e_45" depart="45.00" departLane="n2sep_1" departPos="3.60" departPosLat="0.00" departSpeed="13.90" departDelay="0.00" arrival="193.25" arrivalLane="c2e_1" arrivalPos="990.00" arrivalPosLat="0.00" arrivalSpeed="14.97" duration="148.25" routeLength="1996.47" waitingTime="0.00" waitingCount="0" stopTime="0.00" timeLoss="15.91" rerouteNo="1" devices="tripinfo_car_n2e_45 routing_car_n2e_45" vType="Car" speedFactor="1.09" vaporized=""/>
    <tripinfo id="car_e2n_15" depart="15.00" departLane="e2sep_1" departPos="3.60" departPosLat="0.00" departSpeed="13.90" departDelay="0.00" arrival="207.55" arrivalLane="c2n_1" arrivalPos="990.00" arrivalPosLat="0.00" arrivalSpeed="14.54" duration="192.55" routeLength="1986.69" waitingTime="48.05" waitingCount="1" stopTime="0.00" timeLoss="55.20" rerouteNo="1" devices="tripinfo_car_e2n_15 routing_car_e2n_15" vType="Car" speedFactor="1.05" vaporized=""/>
    <tripinfo id="car_w2e_11" depart="11.00" departLane="w2sep_1" departPos="3.60" departPosLat="0.00" departSpeed="13.90" departDelay="0.00" arrival="208.75" arrivalLane="c2e_1" arrivalPos="990.00" arrivalPosLat="0.00" arrivalSpeed="14.32" duration="197.75" routeLength="1997.01" waitingTime="51.85" waitingCount="1" stopTime="0.00" timeLoss="58.26" rerouteNo="1" devices="tripinfo_car_w2e_11 routing_car_w2e_11" vType="Car" speedFactor="1.03" vaporized=""/>
    <tripinfo id="car_e2n_45" depart="45.00" departLane="e2sep_1" departPos="3.60" departPosLat="0.00" departSpeed="13.90" departDelay="0.00" arrival="212.90" arrivalLane="c2n_1" arrivalPos="990.00" arrivalPosLat="0.00" arrivalSpeed="14.26" duration="167.90" routeLength="1986.69" waitingTime="17.60" waitingCount="1" stopTime="0.00" timeLoss="27.89" rerouteNo="1" devices="tripinfo_car_e2n_45 routing_car_e2n_45" vType="Car" speedFactor="1.03" vaporized=""/>
    <tripinfo id="car_w2s_38" depart="38.00" departLane="w2sep_1" departPos="3.60" departPosLat="0.00" departSpeed="13.90" departDelay="0.00" arrival="212.95" arrivalLane="c2s_1" arrivalPos="990.00" arrivalPosLat="0.00" arrivalSpeed="13.90" duration="174.95" routeLength="1986.69" waitingTime="22.85" waitingCount="1" stopTime="0.00" timeLoss="31.29" rerouteNo="1" devices="tripinfo_car_w2s_38 routing_car_w2s_38" vType="Car" speedFactor="1.00" vaporized=""/>
    <tripinfo id="car_w2e_50" depart="50.00" departLane="w2sep_1" departPos="3.60" departPosLat="0.00" departSpeed="13.90" departDelay="0.00" arrival="215.55" arrivalLane="c2e_1" arrivalPos="990.00" arrivalPosLat="0.00" arrivalSpeed="13.90" duration="165.55" routeLength="1997.01" waitingTime="11.95" waitingCount="1" stopTime="0.00" timeLoss="21.89" rerouteNo="1" devices="tripinfo_car_w2e_50 routing_car_w2e_50" vType="Car" speedFactor="1.00" vaporized=""/>
    <tripinfo id="car_e2n_47" depart="47.00" departLane="e2sep_1" departPos="3.60" departPosLat="0.00" departSpeed="13.90" departDelay="0.00" arrival="216.10" arrivalLane="c2n_1" arrivalPos="990.00" arrivalPosLat="0.00" arrivalSpeed="14.50" duration="169.10" routeLength="1986.69" waitingTime="15.65" waitingCount="1" stopTime="0.00" timeLoss="31.90" rerouteNo="1" devices="tripinfo_car_e2n_47 routing_car_e2n_47" vType="Car" speedFactor="1.05" vaporized=""/>
    <tripinfo id="car_w2e_59" depart="59.00" departLane="w2sep_1" departPos="3.60" departPosLat="0.00" departSpeed="13.90" departDelay="0.00" arrival="217.60" arrivalLane="c2e_1" arrivalPos="990.00" arrivalPosLat="0.00" arrivalSpeed="15.19" duration="158.60" routeLength="1997.01" waitingTime="10.85" waitingCount="1" stopTime="0.00" timeLoss="31.62" rerouteNo="1" devices="tripinfo_car_w2e_59 routing_car_w2e_59" vType="Car" speedFactor="1.13" vaporized=""/>
    <tripinfo id="car_e2n_66" depart="66.00" departLane="e2sep_1" departPos="3.60" departPosLat="0.00" departSpeed="13.90" departDelay="0.00" arrival="218.10" arrivalLane="c2n_1" arrivalPos="990.00" arrivalPosLat="0.00" arrivalSpeed="15.47" duration="152.10" routeLength="1986.69" waitingTime="5.95" waitingCount="1" stopTime="0.00" timeLoss="27.63" rerouteNo="1" devices="tripinfo_car_e2n_66 routing_car_e2n_66" vType="Car" speedFactor="1.15" vaporized=""/>
    <tripinfo id="car_w2s_61" depart="61.00" departLane="w2sep_1" departPos="3.60" departPosLat="0.00" departSpeed="13.90" departDelay="0.00" arrival="219.95" arrivalLane="c2s_1" arrivalPos="990.00" arrivalPosLat="0.00" arrivalSpeed="13.90" duration="158.95" routeLength="1986.69" waitingTime="2.95" waitingCount="1" stopTime="0.00" timeLoss="15.30" rerouteNo="1" devices="tripinfo_car_w2s_61 routing_car_w2s_61" vType="Car" speedFactor="1.00" vaporized=""/>
    <tripinfo id="car_w2s_71" depart="71.00" departLane="w2sep_1" departPos="3.60" departPosLat="0.00" departSpeed="13.90" departDelay="0.00" arrival="223.50" arrivalLane="c2s_1" arrivalPos="990.00" arrivalPosLat="0.00" arrivalSpeed="14.14" duration="152.50" routeLength="1986.69" waitingTime="0.00" waitingCount="0" stopTime="0.00" timeLoss="11.58" rerouteNo="1" devices="tripinfo_car_w2s_71 routing_car_w2s_71" vType="Car" speedFactor="1.02" vaporized=""/>
    <tripinfo id="car_w2n_73" depart="73.00" departLane="w2sep_1" departPos="3.60" departPosLat="0.00" departSpeed="13.90" departDelay="0.00" arrival="223.50" arrivalLane="c2n_1" arrivalPos="990.00" arrivalPosLat="0.00" arrivalSpeed="13.90" duration="150.50" routeLength="1996.47" waitingTime="0.00" waitingCount="0" stopTime="0.00" timeLoss="6.17" rerouteNo="1" devices="tripinfo_car_w2n_73 routing_car_w2n_73" vType="Car" speedFactor="1.00" vaporized=""/>
    <tripinfo id="car_e2w_87" depart="87.45" departLane="e2sep_1" departPos="3.60" departPosLat="0.00" departSpeed="13.90" departDelay="0.45" arrival="227.60" arrivalLane="c2w_1" arrivalPos="990.00" arrivalPosLat="0.00" arrivalSpeed="15.18" duration="140.15" routeLength="1997.01" waitingTime="0.00" waitingCount="0" stopTime="0.00" timeLoss="8.58" rerouteNo="1" devices="tripinfo_car_e2w_87 routing_car_e2w_87" vType="Car" speedFactor="1.09" vaporized=""/>
    <tripinfo id="car_e2n_86" depart="86.00" departLane="e2sep_1" departPos="3.60" departPosLat="0.00" departSpeed="13.90" departDelay="0.00" arrival="231.15" arrivalLane="c2n_1" arrivalPos="990.00" arrivalPosLat="0.00" arrivalSpeed="14.15" duration="145.15" routeLength="1986.69" waitingTime="0.00" waitingCount="0" stopTime="0.00" timeLoss="4.05" rerouteNo="1" devices="tripinfo_car_e2n_86 routing_car_e2n_86" vType="Car" speedFactor="1.02" vaporized=""/>
    <tripinfo id="bus_w2s_82" depart="82.00" departLane="w2sep_1" departPos="12.10" departPosLat="0.00" departSpeed="13.90" departDelay="0.00" arrival="231.55" arrivalLane="c2s_1" arrivalPos="990.00" arrivalPosLat="0.00" arrivalSpeed="13.90" duration="149.55" routeLength="1978.19" waitingTime="0.00" waitingCount="0" stopTime="0.00" timeLoss="6.49" rerouteNo="1" devices="tripinfo_bus_w2s_82 routing_bus_w2s_82" vType="Bus" speedFactor="1.00" vaporized=""/>
    <tripinfo id="car_e2s_22" depart="22.00" departLane="e2sep_1" departPos="3.60" departPosLat="0.00" departSpeed="13.90" departDelay="0.00" arrival="236.40" arrivalLane="c2s_1" arrivalPos="990.00" arrivalPosLat="0.00" arrivalSpeed="13.89" duration="214.40" routeLength="1996.47" waitingTime="56.95" waitingCount="3" stopTime="0.00" timeLoss="70.08" rerouteNo="1" devices="tripinfo_car_e2s_22 routing_car_e2s_22" vType="Car" speedFactor="1.00" vaporized=""/>
    <tripinfo id="bus_e2w_90" depart="90.00" departLane="e2sep_1" departPos="12.10" departPosLat="0.00" departSpeed="13.90" departDelay="0.00" arrival="236.90" arrivalLane="c2w_1" arrivalPos="990.00" arrivalPosLat="0.00" arrivalSpeed="13.90" duration="146.90" routeLength="1988.51" waitingTime="0.00" waitingCount="0" stopTime="0.00" timeLoss="3.83" rerouteNo="1" devices="tripinfo_bus_e2w_90 routing_bus_e2w_90" vType="Bus" speedFactor="1.00" vaporized=""/>
    <tripinfo id="car_e2s_49" depart="49.00" departLane="e2sep_1" departPos="3.60" departPosLat="0.00" departSpeed="13.90" departDelay="0.00" arrival="238.40" arrivalLane="c2s_1" arrivalPos="990.00" arrivalPosLat="0.00" arrivalSpeed="15.05" duration="189.40" routeLength="1996.47" waitingTime="30.20" waitingCount="2" stopTime="0.00" timeLoss="60.87" rerouteNo="1" devices="tripinfo_car_e2s_49 routing_car_e2s_49" vType="Car" speedFactor="1.12" vaporized=""/>
    <tripinfo id="car_e2s_66" depart="67.25" departLane="e2sep_1" departPos="3.60" departPosLat="0.00" departSpeed="13.90" departDelay="1.25" arrival="241.85" arrivalLane="c2s_1" arrivalPos="990.00" arrivalPosLat="0.00" arrivalSpeed="13.94" duration="174.60" routeLength="1996.47" waitingTime="15.45" waitingCount="1" stopTime="0.00" timeLoss="31.03" rerouteNo="1" devices="tripinfo_car_e2s_66 routing_car_e2s_66" vType="Car" speedFactor="1.01" vaporized=""/>
    <tripinfo id="car_n2w_64" depart="64.00" departLane="n2sep_1" departPos="3.60" departPosLat="0.00" departSpeed="13.90" departDelay="0.00" arrival="247.55" arrivalLane="c2w_1" arrivalPos="990.00" arrivalPosLat="0.00" arrivalSpeed="16.38" duration="183.55" routeLength="1986.69" waitingTime="47.20" waitingCount="1" stopTime="0.00" timeLoss="61.67" rerouteNo="1" devices="tripinfo_car_n2w_64 routing_car_n2w_64" vType="Car" speedFactor="1.18" vaporized=""/>
    <tripinfo id="car_s2e_78" depart="78.25" departLane="s2sep_1" departPos="3.60" departPosLat="0.00" departSpeed="13.90" departDelay="0.25" arrival="251.45" arrivalLane="c2e_1" arrivalPos="990.00" arrivalPosLat="0.00" arrivalSpeed="15.32" duration="173.20" routeLength="1986.69" waitingTime="31.60" waitingCount="1" stopTime="0.00" timeLoss="42.89" rerouteNo="1" devices="tripinfo_car_s2e_78 routing_car_s2e_78" vType="Car" speedFactor="1.10" vaporized=""/>
    <tripinfo id="car_s2e_83" depart="83.00" departLane="s2sep_1" departPos="3.60" departPosLat="0.00" departSpeed="13.90" departDelay="0.00" arrival="254.30" arrivalLane="c2e_1" arrivalPos="990.00" arrivalPosLat="0.00" arrivalSpeed="15.97" duration="171.30" routeLength="1986.69" waitingTime="30.45" waitingCount="1" stopTime="0.00" timeLoss="47.26" rerouteNo="1" devices="tripinfo_car_s2e_83 routing_car_s2e_83" vType="Car" speedFactor="1.16" vaporized=""/>
    <tripinfo id="car_s2n_70" depart="70.00" departLane="s2sep_1" departPos="3.60" departPosLat="0.00" departSpeed="13.90" departDelay="0.00" arrival="255.70" arrivalLane="c2n_1" arrivalPos="990.00" arrivalPosLat="0.00" arrivalSpeed="13.90" duration="185.70" routeLength="1997.01" waitingTime="35.00" waitingCount="1" stopTime="0.00" timeLoss="42.03" rerouteNo="1" devices="tripinfo_car_s2n_70 routing_car_s2n_70" vType="Car" speedFactor="1.00" vaporized=""/>
    <tripinfo id="car_n2s_57" depart="57.00" departLane="n2sep_1" departPos="3.60" departPosLat="0.00" departSpeed="13.90" departDelay="0.00" arrival="255.80" arrivalLane="c2s_1" arrivalPos="990.00" arrivalPosLat="0.00" arrivalSpeed="13.90" duration="198.80" routeLength="1997.01" waitingTime="48.15" waitingCount="1" stopTime="0.00" timeLoss="55.11" rerouteNo="1" devices="tripinfo_car_n2s_57 routing_car_n2s_57" vType="Car" speedFactor="1.00" vaporized=""/>
    <tripinfo id="car_n2s_70" depart="70.00" departLane="n2sep_1" departPos="3.60" departPosLat="0.00" departSpeed="13.90" departDelay="0.00" arrival="257.65" arrivalLane="c2s_1" arrivalPos="990.00" arrivalPosLat="0.00" arrivalSpeed="15.44" duration="187.65" routeLength="1997.01" waitingTime="45.90" waitingCount="1" stopTime="0.00" timeLoss="65.03" rerouteNo="1" devices="tripinfo_car_n2s_70 routing_car_n2s_70" vType="Car" speedFactor="1.17" vaporized=""/>
    <tripinfo id="car_s2w_77" depart="77.00" departLane="s2sep_1" departPos="3.60" departPosLat="0.00" departSpeed="13.90" departDelay="0.00" arrival="261.30" arrivalLane="c2w_1" arrivalPos="990.00" arrivalPosLat="0.00" arrivalSpeed="16.40" duration="184.30" routeLength="1996.47" waitingTime="45.25" waitingCount="3" stopTime="0.00" timeLoss="61.96" rerouteNo="1" devices="tripinfo_car_s2w_77 routing_car_s2w_77" vType="Car" speedFactor="1.18" vaporized=""/>
    <tripinfo id="car_s2e_85" depart="85.00" departLane="s2sep_1" departPos="3.60" departPosLat="0.00" departSpeed="13.90" departDelay="0.00" arrival="261.70" arrivalLane="c2e_1" arrivalPos="990.00" arrivalPosLat="0.00" arrivalSpeed="14.32" duration="176.70" routeLength="1986.69" waitingTime="24.40" waitingCount="1" stopTime="0.00" timeLoss="37.26" rerouteNo="1" devices="tripinfo_car_s2e_85 routing_car_s2e_85" vType="Car" speedFactor="1.03" vaporized=""/>
    <tripinfo id="car_n2s_111" depart="111.00" departLane="n2sep_1" departPos="3.60" departPosLat="0.00" departSpeed="13.90" departDelay="0.00" arrival="263.00" arrivalLane="c2s_1" arrivalPos="990.00" arrivalPosLat="0.00" arrivalSpeed="13.90" duration="152.00" routeLength="1997.01" waitingTime="0.00" waitingCount="0" stopTime="0.00" timeLoss="8.29" rerouteNo="1" devices="tripinfo_car_n2s_111 routing_car_n2s_111" vType="Car" speedFactor="1.00" vaporized=""/>
    <tripinfo id="car_s2e_121" depart="121.00" departLane="s2sep_1" departPos="3.60" departPosLat="0.00" departSpeed="13.90" departDelay="0.00" arrival="263.70" arrivalLane="c2e_1" arrivalPos="990.00" arrivalPosLat="0.00" arrivalSpeed="15.64" duration="142.70" routeLength="1986.69" waitingTime="0.00" waitingCount="0" stopTime="0.00" timeLoss="19.76" rerouteNo="1" devices="tripinfo_car_s2e_121 routing_car_s2e_121" vType="Car" speedFactor="1.17" vaporized=""/>
    <tripinfo id="car_n2s_116" depart="116.00" departLane="n2sep_1" departPos="3.60" departPosLat="0.00" departSpeed="13.90" departDelay="0.00" arrival="266.80" arrivalLane="c2s_1" arrivalPos="990.00" arrivalPosLat="0.00" arrivalSpeed="13.88" duration="150.80" routeLength="1997.01" waitingTime="0.00" waitingCount="0" stopTime="0.00" timeLoss="7.12" rerouteNo="1" devices="tripinfo_car_n2s_116 routing_car_n2s_116" vType="Car" speedFactor="1.00" vaporized=""/>
    <tripinfo id="car_s2n_124" depart="124.00" departLane="s2sep_1" departPos="3.60" departPosLat="0.00" departSpeed="13.90" departDelay="0.00" arrival="268.65" arrivalLane="c2n_1" arrivalPos="990.00" arrivalPosLat="0.00" arrivalSpeed="13.90" duration="144.65" routeLength="1997.01" waitingTime="0.00" waitingCount="0" stopTime="0.00" timeLoss="0.94" rerouteNo="1" devices="tripinfo_car_s2n_124 routing_car_s2n_124" vType="Car" speedFactor="1.00" vaporized=""/>
    <tripinfo id="car_n2s_122" depart="122.00" departLane="n2sep_1" departPos="3.60" departPosLat="0.00" departSpeed="13.90" departDelay="0.00" arrival="269.95" arrivalLane="c2s_1" arrivalPos="990.00" arrivalPosLat="0.00" arrivalSpeed="14.08" duration="147.95" routeLength="1997.01" waitingTime="0.00" waitingCount="0" stopTime="0.00" timeLoss="6.65" rerouteNo="1" devices="tripinfo_car_n2s_122 routing_car_n2s_122" vType="Car" speedFactor="1.02" vaporized=""/>
    <tripinfo id="car_n2e_120" depart="120.00" departLane="n2sep_1" departPos="3.60" departPosLat="0.00" departSpeed="13.90" departDelay="0.00" arrival="272.10" arrivalLane="c2e_1" arrivalPos="990.00" arrivalPosLat="0.00" arrivalSpeed="13.90" duration="152.10" routeLength="1996.47" waitingTime="0.00" waitingCount="0" stopTime="0.00" timeLoss="7.78" rerouteNo="1" devices="tripinfo_car_n2e_120 routing_car_n2e_120" vType="Car" speedFactor="1.00" vaporized=""/>
    <tripinfo id="car_n2e_124" depart="124.00" departLane="n2sep_1" departPos="3.60" departPosLat="0.00" departSpeed="13.90" departDelay="0.00" arrival="276.65" arrivalLane="c2e_1" arrivalPos="990.00" arrivalPosLat="0.00" arrivalSpeed="13.94" duration="152.65" routeLength="1996.47" waitingTime="0.00" waitingCount="0" stopTime="0.00" timeLoss="8.81" rerouteNo="1" devices="tripinfo_car_n2e_124 routing_car_n2e_124" vType="Car" speedFactor="1.00" vaporized=""/>
    <tripinfo id="car_s2e_143" depart="143.00" departLane="s2sep_1" departPos="3.60" departPosLat="0.00" departSpeed="13.90" departDelay="0.00" arrival="278.70" arrivalLane="c2e_1" arrivalPos="990.00" arrivalPosLat="0.00" arrivalSpeed="15.19" duration="135.70" routeLength="1986.69" waitingTime="0.00" waitingCount="0" stopTime="0.00" timeLoss="8.75" rerouteNo="1" devices="tripinfo_car_s2e_143 routing_car_s2e_143" vType="Car" speedFactor="1.13" vaporized=""/>
    <tripinfo id="car_s2n_146" depart="146.00" departLane="s2sep_1" departPos="3.60" departPosLat="0.00" departSpeed="13.90" departDelay="0.00" arrival="280.20" arrivalLane="c2n_1" arrivalPos="990.00" arrivalPosLat="0.00" arrivalSpeed="15.05" duration="134.20" routeLength="1997.01" waitingTime="0.00" waitingCount="0" stopTime="0.00" timeLoss="1.45" rerouteNo="1" devices="tripinfo_car_s2n_146 routing_car_s2n_146" vType="Car" speedFactor="1.08" vaporized=""/>
    <tripinfo id="car_e2w_106" depart="106.00" departLane="e2sep_1" departPos="3.60" departPosLat="0.00" departSpeed="13.90" departDelay="0.00" arrival="297.80" arrivalLane="c2w_1" arrivalPos="990.00" arrivalPosLat="0.00" arrivalSpeed="14.50" duration="191.80" routeLength="1997.01" waitingTime="46.90" waitingCount="1" stopTime="0.00" timeLoss="54.09" rerouteNo="1" devices="tripinfo_car_e2w_106 routing_car_e2w_106" vType="Car" speedFactor="1.04" vaporized=""/>
    <tripinfo id="car_w2s_100" depart="100.00" departLane="w2sep_1" departPos="3.60" departPosLat="0.00" departSpeed="13.90" departDelay="0.00" arrival="298.10" arrivalLane="c2s_1" arrivalPos="990.00" arrivalPosLat="0.00" arrivalSpeed="14.42" duration="198.10" routeLength="1986.69" waitingTime="52.65" waitingCount="1" stopTime="0.00" timeLoss="59.66" rerouteNo="1" devices="tripinfo_car_w2s_100 routing_car_w2s_100" vType="Car" speedFactor="1.04" vaporized=""/>
    <tripinfo id="car_w2e_123" depart="123.00" departLane="w2sep_1" departPos="3.60" departPosLat="0.00" departSpeed="13.90" departDelay="0.00" arrival="299.00" arrivalLane="c2e_1" arrivalPos="990.00" arrivalPosLat="0.00" arrivalSpeed="15.23" duration="176.00" routeLength="1997.01" waitingTime="34.20" waitingCount="1" stopTime="0.00" timeLoss="44.89" rerouteNo="1" devices="tripinfo_car_w2e_123 routing_car_w2e_123" vType="Car" speedFactor="1.10" vaporized=""/>
    <tripinfo id="car_w2s_107" depart="107.00" departLane="w2sep_1" departPos="3.60" departPosLat="0.00" departSpeed="13.90" departDelay="0.00" arrival="301.00" arrivalLane="c2s_1" arrivalPos="990.00" arrivalPosLat="0.00" arrivalSpeed="15.02" duration="194.00" routeLength="1986.69" waitingTime="48.95" waitingCount="1" stopTime="0.00" timeLoss="61.99" rerouteNo="1" devices="tripinfo_car_w2s_107 routing_car_w2s_107" vType="Car" speedFactor="1.09" vaporized=""/>
    <tripinfo id="car_w2s_160" depart="160.00" departLane="w2sep_1" departPos="3.60" departPosLat="0.00" departSpeed="13.90" departDelay="0.00" arrival="303.15" arrivalLane="c2s_1" arrivalPos="990.00" arrivalPosLat="0.00" arrivalSpeed="15.84" duration="143.15" routeLength="1986.69" waitingTime="3.15" waitingCount="1" stopTime="0.00" timeLoss="20.55" rerouteNo="1" devices="tripinfo_car_w2s_160 routing_car_w2s_160" vType="Car" speedFactor="1.17" vaporized=""/>
    <tripinfo id="bus_e2n_108" depart="108.00" departLane="e2sep_1" departPos="12.10" departPosLat="0.00" departSpeed="13.90" departDelay="0.00" arrival="306.30" arrivalLane="c2n_1" arrivalPos="990.00" arrivalPosLat="0.00" arrivalSpeed="13.90" duration="198.30" routeLength="1978.19" waitingTime="42.75" waitingCount="1" stopTime="0.00" timeLoss="55.25" rerouteNo="1" devices="tripinfo_bus_e2n_108 routing_bus_e2n_108" vType="Bus" speedFactor="1.00" vaporized=""/>
    <tripinfo id="car_w2e_139" depart="139.00" departLane="w2sep_1" departPos="3.60" departPosLat="0.00" departSpeed="13.90" departDelay="0.00" arrival="306.45" arrivalLane="c2e_1" arrivalPos="990.00" arrivalPosLat="0.00" arrivalSpeed="14.23" duration="167.45" routeLength="1997.01" waitingTime="15.75" waitingCount="1" stopTime="0.00" timeLoss="27.07" rerouteNo="1" devices="tripinfo_car_w2e_139 routing_car_w2e_139" vType="Car" speedFactor="1.02" vaporized=""/>
    <tripinfo id="car_e2w_166" depart="166.00" departLane="e2sep_1" departPos="3.60" departPosLat="0.00" departSpeed="13.90" departDelay="0.00" arrival="309.70" arrivalLane="c2w_1" arrivalPos="990.00" arrivalPosLat="0.00" arrivalSpeed="14.46" duration="143.70" routeLength="1997.01" waitingTime="0.00" waitingCount="0" stopTime="0.00" timeLoss="5.53" rerouteNo="1" devices="tripinfo_car_e2w_166 routing_car_e2w_166" vType="Car" speedFactor="1.04" vaporized=""/>
    <tripinfo id="car_e2n_132" depart="132.00" departLane="e2sep_1" departPos="3.60" departPosLat="0.00" departSpeed="13.90" departDelay="0.00" arrival="311.20" arrivalLane="c2n_1" arrivalPos="990.00" arrivalPosLat="0.00" arrivalSpeed="13.89" duration="179.20" routeLength="1986.69" waitingTime="20.85" waitingCount="1" stopTime="0.00" timeLoss="35.53" rerouteNo="1" devices="tripinfo_car_e2n_132 routing_car_e2n_132" vType="Car" speedFactor="1.00" vaporized=""/>
    <tripinfo id="car_w2s_167" depart="167.00" departLane="w2sep_1" departPos="3.60" departPosLat="0.00" departSpeed="13.90" departDelay="0.00" arrival="312.00" arrivalLane="c2s_1" arrivalPos="990.00" arrivalPosLat="0.00" arrivalSpeed="14.22" duration="145.00" routeLength="1986.69" waitingTime="0.00" waitingCount="0" stopTime="0.00" timeLoss="4.56" rerouteNo="1" devices="tripinfo_car_w2s_167 routing_car_w2s_167" vType="Car" speedFactor="1.02" vaporized=""/>
    <tripinfo id="car_e2n_138" depart="138.00" departLane="e2sep_1" departPos="3.60" departPosLat="0.00" departSpeed="13.90" departDelay="0.00" arrival="313.10" arrivalLane="c2n_1" arrivalPos="990.00" arrivalPosLat="0.00" arrivalSpeed="15.18" duration="175.10" routeLength="1986.69" waitingTime="20.20" waitingCount="1" stopTime="0.00" timeLoss="49.36" rerouteNo="1" devices="tripinfo_car_e2n_138 routing_car_e2n_138" vType="Car" speedFactor="1.14" vaporized=""/>
    <tripinfo id="car_e2s_151" depart="151.00" departLane="e2sep_1" departPos="3.60" departPosLat="0.00" departSpeed="13.90" departDelay="0.00" arrival="316.60" arrivalLane="c2s_1" arrivalPos="990.00" arrivalPosLat="0.00" arrivalSpeed="15.54" duration="165.60" routeLength="1996.47" waitingTime="24.10" waitingCount="3" stopTime="0.00" timeLoss="36.64" rerouteNo="1" devices="tripinfo_car_e2s_151 routing_car_e2s_151" vType="Car" speedFactor="1.12" vaporized=""/>
    <tripinfo id="car_w2n_110" depart="110.00" departLane="w2sep_1" departPos="3.60" departPosLat="0.00" departSpeed="13.90" departDelay="0.00" arrival="316.70" arrivalLane="c2n_1" arrivalPos="990.00" arrivalPosLat="0.00" arrivalSpeed="14.02" duration="206.70" routeLength="1996.47" waitingTime="50.35" waitingCount="2" stopTime="0.00" timeLoss="63.85" rerouteNo="1" devices="tripinfo_car_w2n_110 routing_car_w2n_110" vType="Car" speedFactor="1.01" vaporized=""/>
    <tripinfo id="car_w2e_175" depart="175.00" departLane="w2sep_1" departPos="3.60" departPosLat="0.00" departSpeed="13.90" departDelay="0.00" arrival="316.70" arrivalLane="c2e_1" arrivalPos="990.00" arrivalPosLat="0.00" arrivalSpeed="14.17" duration="141.70" routeLength="1997.01" waitingTime="0.00" waitingCount="0" stopTime="0.00" timeLoss="0.81" rerouteNo="1" devices="tripinfo_car_w2e_175 routing_car_w2e_175" vType="Car" speedFactor="1.02" vaporized=""/>
    <tripinfo id="car_w2e_180" depart="180.00" departLane="w2sep_1" departPos="3.60" departPosLat="0.00" departSpeed="13.90" departDelay="0.00" arrival="318.60" arrivalLane="c2e_1" arrivalPos="990.00" arrivalPosLat="0.00" arrivalSpeed="15.63" duration="138.60" routeLength="1997.01" waitingTime="0.00" waitingCount="0" stopTime="0.00" timeLoss="16.81" rerouteNo="1" devices="tripinfo_car_w2e_180 routing_car_w2e_180" vType="Car" speedFactor="1.18" vaporized=""/>
    <tripinfo id="car_w2n_112" depart="112.00" departLane="w2sep_1" departPos="3.60" departPosLat="0.00" departSpeed="13.90" departDelay="0.00" arrival="320.35" arrivalLane="c2n_1" arrivalPos="990.00" arrivalPosLat="0.00" arrivalSpeed="13.87" duration="208.35" routeLength="1996.47" waitingTime="45.85" waitingCount="2" stopTime="0.00" timeLoss="64.04" rerouteNo="1" devices="tripinfo_car_w2n_112 routing_car_w2n_112" vType="Car" speedFactor="1.00" vaporized=""/>
    <tripinfo id="car_w2n_156" depart="156.00" departLane="w2sep_1" departPos="3.60" departPosLat="0.00" departSpeed="13.90" departDelay="0.00" arrival="322.20" arrivalLane="c2n_1" arrivalPos="990.00" arrivalPosLat="0.00" arrivalSpeed="15.21" duration="166.20" routeLength="1996.47" waitingTime="11.50" waitingCount="2" stopTime="0.00" timeLoss="41.18" rerouteNo="1" devices="tripinfo_car_w2n_156 routing_car_w2n_156" vType="Car" speedFactor="1.15" vaporized=""/>
    <tripinfo id="car_e2s_153" depart="153.00" departLane="e2sep_1" departPos="3.60" departPosLat="0.00" departSpeed="13.90" departDelay="0.00" arrival="325.05" arrivalLane="c2s_1" arrivalPos="990.00" arrivalPosLat="0.00" arrivalSpeed="14.12" duration="172.05" routeLength="1996.47" waitingTime="17.20" waitingCount="1" stopTime="0.00" timeLoss="29.98" rerouteNo="1" devices="tripinfo_car_e2s_153 routing_car_e2s_153" vType="Car" speedFactor="1.02" vaporized=""/>
    <tripinfo id="car_e2s_154" depart="154.55" departLane="e2sep_1" departPos="3.60" departPosLat="0.00" departSpeed="13.90" departDelay="0.55" arrival="326.95" arrivalLane="c2s_1" arrivalPos="990.00" arrivalPosLat="0.00" arrivalSpeed="15.60" duration="172.40" routeLength="1996.47" waitingTime="14.95" waitingCount="1" stopTime="0.00" timeLoss="49.94" rerouteNo="1" devices="tripinfo_car_e2s_154 routing_car_e2s_154" vType="Car" speedFactor="1.18" vaporized=""/>
    <tripinfo id="car_w2n_194" depart="194.00" departLane="w2sep_1" departPos="3.60" departPosLat="0.00" departSpeed="13.90" departDelay="0.00" arrival="330.80" arrivalLane="c2n_1" arrivalPos="990.00" arrivalPosLat="0.00" arrivalSpeed="15.11" duration="136.80" routeLength="1996.47" waitingTime="0.00" waitingCount="0" stopTime="0.00" timeLoss="4.02" rerouteNo="1" devices="tripinfo_car_w2n_194 routing_car_w2n_194" vType="Car" speedFactor="1.09" vaporized=""/>
    <tripinfo id="car_e2s_157" depart="157.00" departLane="e2sep_1" departPos="3.60" departPosLat="0.00" departSpeed="13.90" departDelay="0.00" arrival="331.80" arrivalLane="c2s_1" arrivalPos="990.00" arrivalPosLat="0.00" arrivalSpeed="13.97" duration="174.80" routeLength="1996.47" waitingTime="14.20" waitingCount="1" stopTime="0.00" timeLoss="31.20" rerouteNo="1" devices="tripinfo_car_e2s_157 routing_car_e2s_157" vType="Car" speedFactor="1.01" vaporized=""/>
</tripinfos>
