<?xml version="1.0" encoding="UTF-8"?>

<!-- generated on Sat Apr 24 18:14:05 2021 by Eclipse SUMO Version 1.4.0
<configuration xmlns:xsi="http://www.w3.org/2001/XMLSchema-instance" xsi:noNamespaceSchemaLocation="http://sumo.dlr.de/xsd/sumoConfiguration.xsd">

    <input>
        <net-file value="sumofiles/junction.net.xml"/>
        <route-files value="sumofiles/junction_preemption_56.rou.xml"/>
        <additional-files value="sumofiles/junction.det.xml"/>
    </input>

    <output>
        <tripinfo-output value="sumofiles/output/tripinfo_preemption_56.xml"/>
    </output>

    <time>
        <begin value="0"/>
        <end value="10000"/>
        <step-length value="0.05"/>
    </time>

    <processing>
        <lateral-resolution value="0.1"/>
    </processing>

    <report>
        <no-warnings value="true"/>
        <error-log value="sumofiles/output/errorlog_preemption_56.log"/>
        <no-step-log value="true"/>
    </report>

    <traci_server>
        <remote-port value="52965"/>
    </traci_server>

    <gui_only>
        <gui-settings-file value="sumofiles/junction-gui.settings.xml"/>
        <tracker-interval value="0.05"/>
    </gui_only>

</configuration>
-->

<tripinfos xmlns:xsi="http://www.w3.org/2001/XMLSchema-instance" xsi:noNamespaceSchemaLocation="http://sumo.dlr.de/xsd/tripinfo_file.xsd">
    <tripinfo id="car_e2n_1" depart="1.00" departLane="e2sep_1" departPos="3.60" departPosLat="0.00" departSpeed="13.90" departDelay="0.00" arrival="140.30" arrivalLane="c2n_1" arrivalPos="990.00" arrivalPosLat="0.00" arrivalSpeed="14.73" duration="139.30" routeLength="1986.69" waitingTime="0.00" waitingCount="0" stopTime="0.00" timeLoss="3.74" rerouteNo="1" devices="tripinfo_car_e2n_1 routing_car_e2n_1" vType="Car" speedFactor="1.06" vaporized=""/>
    <tripinfo id="car_w2e_6" depart="6.00" departLane="w2sep_1" departPos="3.60" departPosLat="0.00" departSpeed="13.90" departDelay="0.00" arrival="145.55" arrivalLane="c2e_1" arrivalPos="990.00" arrivalPosLat="0.00" arrivalSpeed="14.32" duration="139.55" routeLength="1997.01" waitingTime="0.00" waitingCount="0" stopTime="0.00" timeLoss="0.07" rerouteNo="1" devices="tripinfo_car_w2e_6 routing_car_w2e_6" vType="Car" speedFactor="1.03" vaporized=""/>
    <tripinfo id="car_e2s_1" depart="2.35" departLane="e2sep_1" departPos="3.60" departPosLat="0.00" departSpeed="13.90" departDelay="1.35" arrival="150.15" arrivalLane="c2s_1" arrivalPos="990.00" arrivalPosLat="0.00" arrivalSpeed="14.04" duration="147.80" routeLength="1996.47" waitingTime="0.00" waitingCount="0" stopTime="0.00" timeLoss="4.95" rerouteNo="1" devices="tripinfo_car_e2s_1 routing_car_e2s_1" vType="Car" speedFactor="1.01" vaporized=""/>
    <tripinfo id="car_e2s_16" depart="16.00" departLane="e2sep_1" departPos="3.60" departPosLat="0.00" departSpeed="13.90" departDelay="0.00" arrival="157.85" arrivalLane="c2s_1" arrivalPos="990.00" arrivalPosLat="0.00" arrivalSpeed="14.55" duration="141.85" routeLength="1996.47" waitingTime="0.00" waitingCount="0" stopTime="0.00" timeLoss="4.00" rerouteNo="1" devices="tripinfo_car_e2s_16 routing_car_e2s_16" vType="Car" speedFactor="1.05" vaporized=""/>
    <tripinfo id="car_n2w_2" depart="2.00" departLane="n2sep_1" departPos="3.60" departPosLat="0.00" departSpeed="13.90" departDelay="0.00" arrival="160.30" arrivalLane="c2w_1" arrivalPos="990.00" arrivalPosLat="0.00" arrivalSpeed="15.05" duration="158.30" routeLength="1986.69" waitingTime="18.05" waitingCount="1" stopTime="0.00" timeLoss="25.61" rerouteNo="1" devices="tripinfo_car_n2w_2 routing_car_n2w_2" vType="Car" speedFactor="1.08" vaporized=""/>
    <tripinfo id="car_s2e_7" depart="7.00" departLane="s2sep_1" departPos="3.60" departPosLat="0.00" departSpeed="13.90" departDelay="0.00" arrival="165.65" arrivalLane="c2e_1" arrivalPos="990.00" arrivalPosLat="0.00" arrivalSpeed="13.90" duration="158.65" routeLength="1986.69" waitingTime="7.80" waitingCount="1" stopTime="0.00" timeLoss="14.99" rerouteNo="1" devices="tripinfo_car_s2e_7 routing_car_s2e_7" vType="Car" speedFactor="1.00" vaporized=""/>
    <tripinfo id="car_n2s_13" depart="13.00" departLane="n2sep_1" departPos="3.60" departPosLat="0.00" departSpeed="13.90" departDelay="0.00" arrival="166.10" arrivalLane="c2s_1" arrivalPos="990.00" arrivalPosLat="0.00" arrivalSpeed="14.32" duration="153.10" routeLength="1997.01" waitingTime="4.80" waitingCount="1" stopTime="0.00" timeLoss="13.62" rerouteNo="1" devices="tripinfo_car_n2s_13 routing_car_n2s_13" vType="Car" speedFactor="1.03" vaporized=""/>
    <tripinfo id="car_s2w_0" depart="0.00" departLane="s2sep_1" departPos="3.60" departPosLat="0.00" departSpeed="13.90" departDelay="0.00" arrival="167.25" arrivalLane="c2w_1" arrivalPos="990.00" arrivalPosLat="0.00" arrivalSpeed="14.73" duration="167.25" routeLength="1996.47" waitingTime="19.25" waitingCount="2" stopTime="0.00" timeLoss="31.11" rerouteNo="1" devices="tripinfo_car_s2w_0 routing_car_s2w_0" vType="Car" speedFactor="1.06" vaporized=""/>
    <tripinfo id="car_s2e_10" depart="11.45" departLane="s2sep_1" departPos="3.60" departPosLat="0.00" departSpeed="13.90" departDelay="1.45" arrival="169.75" arrivalLane="c2e_1" arrivalPos="990.00" arrivalPosLat="0.00" arrivalSpeed="14.03" duration="158.30" routeLength="1986.69" waitingTime="2.15" waitingCount="1" stopTime="0.00" timeLoss="16.10" rerouteNo="1" devices="tripinfo_car_s2e_10 routing_car_s2e_10" vType="Car" speedFactor="1.01" vaporized=""/>
    <tripinfo id="car_s2n_13" depart="17.65" departLane="s2sep_1" departPos="3.60" departPosLat="0.00" departSpeed="13.90" departDelay="4.65" arrival="171.35" arrivalLane="c2n_1" arrivalPos="990.00" arrivalPosLat="0.00" arrivalSpeed="15.16" duration="153.70" routeLength="1997.01" waitingTime="0.00" waitingCount="0" stopTime="0.00" timeLoss="21.93" rerouteNo="1" devices="tripinfo_car_s2n_13 routing_car_s2n_13" vType="Car" speedFactor="1.09" vaporized=""/>
    <tripinfo id="car_s2e_11" depart="13.25" departLane="s2sep_1" departPos="3.60" departPosLat="0.00" departSpeed="13.90" departDelay="2.25" arrival="172.05" arrivalLane="c2e_1" arrivalPos="990.00" arrivalPosLat="0.00" arrivalSpeed="14.77" duration="158.80" routeLength="1986.69" waitingTime="1.20" waitingCount="1" stopTime="0.00" timeLoss="26.09" rerouteNo="1" devices="tripinfo_car_s2e_11 routing_car_s2e_11" vType="Car" speedFactor="1.08" vaporized=""/>
    <tripinfo id="car_n2s_31" depart="31.00" departLane="n2sep_1" departPos="3.60" departPosLat="0.00" departSpeed="13.90" departDelay="0.00" arrival="175.45" arrivalLane="c2s_1" arrivalPos="990.00" arrivalPosLat="0.00" arrivalSpeed="13.90" duration="144.45" routeLength="1997.01" waitingTime="0.00" waitingCount="0" stopTime="0.00" timeLoss="0.74" rerouteNo="1" devices="tripinfo_car_n2s_31 routing_car_n2s_31" vType="Car" speedFactor="1.00" vaporized=""/>
    <tripinfo id="car_s2w_10" depart="10.00" departLane="s2sep_1" departPos="3.60" departPosLat="0.00" departSpeed="13.90" departDelay="0.00" arrival="175.75" arrivalLane="c2w_1" arrivalPos="990.00" arrivalPosLat="0.00" arrivalSpeed="14.54" duration="165.75" routeLength="1996.47" waitingTime="8.75" waitingCount="2" stopTime="0.00" timeLoss="27.76" rerouteNo="1" devices="tripinfo_car_s2w_10 routing_car_s2w_10" vType="Car" speedFactor="1.05" vaporized=""/>
    <tripinfo id="bus_s2e_12" depart="15.90" departLane="s2sep_1" departPos="12.10" departPosLat="0.00" departSpeed="13.90" departDelay="3.90" arrival="176.90" arrivalLane="c2e_1" arrivalPos="990.00" arrivalPosLat="0.00" arrivalSpeed="13.86" duration="161.00" routeLength="1978.19" waitingTime="0.00" waitingCount="0" stopTime="0.00" timeLoss="17.94" rerouteNo="1" devices="tripinfo_bus_s2e_12 routing_bus_s2e_12" vType="Bus" speedFactor="1.00" vaporized=""/>
    <tripinfo id="car_n2w_37" depart="37.50" departLane="n2sep_1" departPos="3.60" departPosLat="0.00" departSpeed="13.90" departDelay="0.50" arrival="178.15" arrivalLane="c2w_1" arrivalPos="990.00" arrivalPosLat="0.00" arrivalSpeed="15.80" duration="140.65" routeLength="1986.69" waitingTime="0.00" waitingCount="0" stopTime="0.00" timeLoss="16.59" rerouteNo="1" devices="tripinfo_car_n2w_37 routing_car_n2w_37" vType="Car" speedFactor="1.16" vaporized=""/>
    <tripinfo id="car_s2n_15" depart="19.45" departLane="s2sep_1" departPos="3.60" departPosLat="0.00" departSpeed="13.90" departDelay="4.45" arrival="178.35" arrivalLane="c2n_1" arrivalPos="990.00" arrivalPosLat="0.00" arrivalSpeed="14.27" duration="158.90" routeLength="1997.01" waitingTime="0.00" waitingCount="0" stopTime="0.00" timeLoss="18.91" rerouteNo="1" devices="tripinfo_car_s2n_15 routing_car_s2n_15" vType="Car" speedFactor="1.03" vaporized=""/>
    <tripinfo id="car_s2n_16" depart="21.35" departLane="s2sep_1" departPos="3.60" departPosLat="0.00" departSpeed="13.90" departDelay="5.35" arrival="180.60" arrivalLane="c2n_1" arrivalPos="990.00" arrivalPosLat="0.00" arrivalSpeed="15.27" duration="159.25" routeLength="1997.01" waitingTime="0.00" waitingCount="0" stopTime="0.00" timeLoss="31.29" rerouteNo="1" devices="tripinfo_car_s2n_16 routing_car_s2n_16" vType="Car" speedFactor="1.12" vaporized=""/>
    <tripinfo id="car_s2e_48" depart="48.00" departLane="s2sep_1" departPos="3.60" departPosLat="0.00" departSpeed="13.90" departDelay="0.00" arrival="184.35" arrivalLane="c2e_1" arrivalPos="990.00" arrivalPosLat="0.00" arrivalSpeed="15.61" duration="136.35" routeLength="1986.69" waitingTime="0.00" waitingCount="0" stopTime="0.00" timeLoss="8.42" rerouteNo="1" devices="tripinfo_car_s2e_48 routing_car_s2e_48" vType="Car" speedFactor="1.12" vaporized=""/>
    <tripinfo id="car_s2n_22" depart="23.15" departLane="s2sep_1" departPos="3.60" departPosLat="0.00" departSpeed="13.90" departDelay="1.15" arrival="185.40" arrivalLane="c2n_1" arrivalPos="990.00" arrivalPosLat="0.00" arrivalSpeed="13.90" duration="162.25" routeLength="1997.01" waitingTime="0.00" waitingCount="0" stopTime="0.00" timeLoss="18.58" rerouteNo="1" devices="tripinfo_car_s2n_22 routing_car_s2n_22" vType="Car" speedFactor="1.00" vaporized=""/>
    <tripinfo id="car_n2s_44" depart="44.00" departLane="n2sep_1" departPos="3.60" departPosLat="0.00" departSpeed="13.90" departDelay="0.00" arrival="185.40" arrivalLane="c2s_1" arrivalPos="990.00" arrivalPosLat="0.00" arrivalSpeed="15.16" duration="141.40" routeLength="1997.01" waitingTime="0.00" waitingCount="0" stopTime="0.00" timeLoss="9.68" rerouteNo="1" devices="tripinfo_car_n2s_44 routing_car_n2s_44" vType="Car" speedFactor="1.09" vaporized=""/>
    <tripinfo id="car_n2w_38" depart="39.15" departLane="n2sep_1" departPos="3.60" departPosLat="0.00" departSpeed="13.90" departDelay="1.15" arrival="188.15" arrivalLane="c2w_1" arrivalPos="990.00" arrivalPosLat="0.00" arrivalSpeed="14.15" duration="149.00" routeLength="1986.69" waitingTime="0.00" waitingCount="0" stopTime="0.00" timeLoss="7.89" rerouteNo="1" devices="tripinfo_car_n2w_38 routing_car_n2w_38" vType="Car" speedFactor="1.02" vaporized=""/>
    <tripinfo id="car_s2n_44" depart="44.00" departLane="s2sep_1" departPos="3.60" departPosLat="0.00" departSpeed="13.90" departDelay="0.00" arrival="188.45" arrivalLane="c2n_1" arrivalPos="990.00" arrivalPosLat="0.00" arrivalSpeed="14.20" duration="144.45" routeLength="1997.01" waitingTime="0.00" waitingCount="0" stopTime="0.00" timeLoss="4.44" rerouteNo="1" devices="tripinfo_car_s2n_44 routing_car_s2n_44" vType="Car" speedFactor="1.03" vaporized=""/>
    <tripinfo id="car_s2w_57" depart="57.00" departLane="s2sep_1" departPos="3.60" departPosLat="0.00" departSpeed="13.90" departDelay="0.00" arrival="190.95" arrivalLane="c2w_1" arrivalPos="990.00" arrivalPosLat="0.00" arrivalSpeed="16.10" duration="133.95" routeLength="1996.47" waitingTime="0.00" waitingCount="0" stopTime="0.00" timeLoss="10.75" rerouteNo="1" devices="tripinfo_car_s2w_57 routing_car_s2w_57" vType="Car" speedFactor="1.17" vaporized=""/>
    <tripinfo id="car_s2n_50" depart="50.00" departLane="s2sep_1" departPos="3.60" departPosLat="0.00" departSpeed="13.90" departDelay="0.00" arrival="195.55" arrivalLane="c2n_1" arrivalPos="990.00" arrivalPosLat="0.00" arrivalSpeed="13.90" duration="145.55" routeLength="1997.01" waitingTime="0.00" waitingCount="0" stopTime="0.00" timeLoss="1.88" rerouteNo="1" devices="tripinfo_car_s2n_50 routing_car_s2n_50" vType="Car" speedFactor="1.00" vaporized=""/>
    <tripinfo id="car_n2e_36" depart="36.00" departLane="n2sep_1" departPos="3.60" departPosLat="0.00" departSpeed="13.90" departDelay="0.00" arrival="198.60" arrivalLane="c2e_1" arrivalPos="990.00" arrivalPosLat="0.00" arrivalSpeed="13.90" duration="162.60" routeLength="1996.47" waitingTime="10.80" waitingCount="1" stopTime="0.00" timeLoss="18.26" rerouteNo="1" devices="tripinfo_car_n2e_36 routing_car_n2e_36" vType="Car" speedFactor="1.00" vaporized=""/>
    <tripinfo id="car_n2e_42" depart="42.00" departLane="n2sep_1" departPos="3.60" departPosLat="0.00" departSpeed="13.90" departDelay="0.00" arrival="202.55" arrivalLane="c2e_1" arrivalPos="990.00" arrivalPosLat="0.00" arrivalSpeed="14.02" duration="160.55" routeLength="1996.47" waitingTime="3.45" waitingCount="1" stopTime="0.00" timeLoss="17.69" rerouteNo="1" devices="tripinfo_car_n2e_42 routing_car_n2e_42" vType="Car" speedFactor="1.01" vaporized=""/>
    <tripinfo id="car_n2e_47" depart="47.00" departLane="n2sep_1" departPos="3.60" departPosLat="0.00" departSpeed="13.90" departDelay="0.00" arrival="205.25" arrivalLane="c2e_1" arrivalPos="990.00" arrivalPosLat="0.00" arrivalSpeed="14.43" duration="158.25" routeLength="1996.47" waitingTime="0.00" waitingCount="0" stopTime="0.00" timeLoss="20.40" rerouteNo="1" devices="tripinfo_car_n2e_47 routing_car_n2e_47" vType="Car" speedFactor="1.05" vaporized=""/>
    <tripinfo id="car_w2s_26" depart="26.00" departLane="w2sep_1" departPos="3.60" departPosLat="0.00" departSpeed="13.90" departDelay="0.00" arrival="207.60" arrivalLane="c2s_1" arrivalPos="990.00" arrivalPosLat="0.00" arrivalSpeed="14.54" duration="181.60" routeLength="1986.69" waitingTime="36.95" waitingCount="1" stopTime="0.00" timeLoss="44.22" rerouteNo="1" devices="tripinfo_car_w2s_26 routing_car_w2s_26" vType="Car" speedFactor="1.05" vaporized=""/>
    <tripinfo id="car_n2e_51" depart="51.00" departLane="n2sep_1" departPos="3.60" departPosLat="0.00" departSpeed="13.90" departDelay="0.00" arrival="208.85" arrivalLane="c2e_1" arrivalPos="990.00" arrivalPosLat="0.00" arrivalSpeed="13.87" duration="157.85" routeLength="1996.47" waitingTime="0.00" waitingCount="0" stopTime="0.00" timeLoss="13.50" rerouteNo="1" devices="tripinfo_car_n2e_51 routing_car_n2e_51" vType="Car" speedFactor="1.00" vaporized=""/>
    <tripinfo id="car_e2n_56" depart="56.00" departLane="e2sep_1" departPos="3.60" departPosLat="0.00" departSpeed="13.90" departDelay="0.00" arrival="210.35" arrivalLane="c2n_1" arrivalPos="990.00" arrivalPosLat="0.00" arrivalSpeed="13.97" duration="154.35" routeLength="1986.69" waitingTime="4.30" waitingCount="1" stopTime="0.00" timeLoss="11.41" rerouteNo="1" devices="tripinfo_car_e2n_56 routing_car_e2n_56" vType="Car" speedFactor="1.01" vaporized=""/>
    <tripinfo id="car_n2e_52" depart="54.20" departLane="n2sep_1" departPos="3.60" departPosLat="0.00" departSpeed="13.90" departDelay="2.20" arrival="212.05" arrivalLane="c2e_1" arrivalPos="990.00" arrivalPosLat="0.00" arrivalSpeed="13.85" duration="157.85" routeLength="1996.47" waitingTime="0.00" waitingCount="0" stopTime="0.00" timeLoss="13.51" rerouteNo="1" devices="tripinfo_car_n2e_52 routing_car_n2e_52" vType="Car" speedFactor="1.00" vaporized=""/>
    <tripinfo id="car_w2e_71" depart="71.00" departLane="w2sep_1" departPos="3.60" departPosLat="0.00" departSpeed="13.90" departDelay="0.00" arrival="214.15" arrivalLane="c2e_1" arrivalPos="990.00" arrivalPosLat="0.00" arrivalSpeed="14.89" duration="143.15" routeLength="1997.01" waitingTime="0.00" waitingCount="0" stopTime="0.00" timeLoss="12.80" rerouteNo="1" devices="tripinfo_car_w2e_71 routing_car_w2e_71" vType="Car" speedFactor="1.10" vaporized=""/>
    <tripinfo id="car_w2s_30" depart="30.00" departLane="w2sep_1" departPos="3.60" departPosLat="0.00" departSpeed="13.90" departDelay="0.00" arrival="214.30" arrivalLane="c2s_1" arrivalPos="990.00" arrivalPosLat="0.00" arrivalSpeed="13.90" duration="184.30" routeLength="1986.69" waitingTime="30.45" waitingCount="1" stopTime="0.00" timeLoss="40.61" rerouteNo="1" devices="tripinfo_car_w2s_30 routing_car_w2s_30" vType="Car" speedFactor="1.00" vaporized=""/>
    <tripinfo id="car_w2s_63" depart="63.00" departLane="w2sep_1" departPos="3.60" departPosLat="0.00" departSpeed="13.90" departDelay="0.00" arrival="217.70" arrivalLane="c2s_1" arrivalPos="990.00" arrivalPosLat="0.00" arrivalSpeed="14.13" duration="154.70" routeLength="1986.69" waitingTime="0.00" waitingCount="0" stopTime="0.00" timeLoss="13.80" rerouteNo="1" devices="tripinfo_car_w2s_63 routing_car_w2s_63" vType="Car" speedFactor="1.02" vaporized=""/>
    <tripinfo id="car_w2e_77" depart="77.00" departLane="w2sep_1" departPos="3.60" departPosLat="0.00" departSpeed="13.90" departDelay="0.00" arrival="219.10" arrivalLane="c2e_1" arrivalPos="990.00" arrivalPosLat="0.00" arrivalSpeed="14.32" duration="142.10" routeLength="1997.01" waitingTime="0.00" waitingCount="0" stopTime="0.00" timeLoss="2.64" rerouteNo="1" devices="tripinfo_car_w2e_77 routing_car_w2e_77" vType="Car" speedFactor="1.03" vaporized=""/>
    <tripinfo id="car_e2n_86" depart="86.00" departLane="e2sep_1" departPos="3.60" departPosLat="0.00" departSpeed="13.90" departDelay="0.00" arrival="221.75" arrivalLane="c2n_1" arrivalPos="990.00" arrivalPosLat="0.00" arrivalSpeed="15.18" duration="135.75" routeLength="1986.69" waitingTime="0.00" waitingCount="0" stopTime="0.00" timeLoss="4.18" rerouteNo="1" devices="tripinfo_car_e2n_86 routing_car_e2n_86" vType="Car" speedFactor="1.09" vaporized=""/>
    <tripinfo id="car_e2s_69" depart="69.00" departLane="e2sep_1" departPos="3.60" departPosLat="0.00" departSpeed="13.90" departDelay="0.00" arrival="223.85" arrivalLane="c2s_1" arrivalPos="990.00" arrivalPosLat="0.00" arrivalSpeed="13.90" duration="154.85" routeLength="1996.47" waitingTime="2.90" waitingCount="1" stopTime="0.00" timeLoss="10.51" rerouteNo="1" devices="tripinfo_car_e2s_69 routing_car_e2s_69" vType="Car" speedFactor="1.00" vaporized=""/>
    <tripinfo id="car_e2s_90" depart="90.00" departLane="e2sep_1" departPos="3.60" departPosLat="0.00" departSpeed="13.90" departDelay="0.00" arrival="233.20" arrivalLane="c2s_1" arrivalPos="990.00" arrivalPosLat="0.00" arrivalSpeed="14.42" duration="143.20" routeLength="1996.47" waitingTime="0.00" waitingCount="0" stopTime="0.00" timeLoss="4.10" rerouteNo="1" devices="tripinfo_car_e2s_90 routing_car_e2s_90" vType="Car" speedFactor="1.04" vaporized=""/>
    <tripinfo id="car_w2n_98" depart="98.00" departLane="w2sep_1" departPos="3.60" departPosLat="0.00" departSpeed="13.90" departDelay="0.00" arrival="239.05" arrivalLane="c2n_1" arrivalPos="990.00" arrivalPosLat="0.00" arrivalSpeed="15.12" duration="141.05" routeLength="1996.47" waitingTime="1.20" waitingCount="1" stopTime="0.00" timeLoss="8.40" rerouteNo="1" devices="tripinfo_car_w2n_98 routing_car_w2n_98" vType="Car" speedFactor="1.09" vaporized=""/>
    <tripinfo id="car_e2w_98" depart="98.00" departLane="e2sep_1" departPos="3.60" departPosLat="0.00" departSpeed="13.90" departDelay="0.00" arrival="240.50" arrivalLane="c2w_1" arrivalPos="990.00" arrivalPosLat="0.00" arrivalSpeed="14.04" duration="142.50" routeLength="1997.01" waitingTime="0.00" waitingCount="0" stopTime="0.00" timeLoss="0.27" rerouteNo="1" devices="tripinfo_car_e2w_98 routing_car_e2w_98" vType="Car" speedFactor="1.01" vaporized=""/>
    <tripinfo id="car_s2n_70" depart="70.00" departLane="s2sep_1" departPos="3.60" departPosLat="0.00" departSpeed="13.90" departDelay="0.00" arrival="245.55" arrivalLane="c2n_1" arrivalPos="990.00" arrivalPosLat="0.00" arrivalSpeed="16.39" duration="175.55" routeLength="1997.01" waitingTime="45.15" waitingCount="1" stopTime="0.00" timeLoss="53.73" rerouteNo="1" devices="tripinfo_car_s2n_70 routing_car_s2n_70" vType="Car" speedFactor="1.18" vaporized=""/>
    <tripinfo id="bus_e2s_98" depart="100.05" departLane="e2sep_1" departPos="12.10" departPosLat="0.00" departSpeed="13.90" departDelay="2.05" arrival="251.40" arrivalLane="c2s_1" arrivalPos="990.00" arrivalPosLat="0.00" arrivalSpeed="13.90" duration="151.35" routeLength="1987.97" waitingTime="0.00" waitingCount="0" stopTime="0.00" timeLoss="7.62" rerouteNo="1" devices="tripinfo_bus_e2s_98 routing_bus_e2s_98" vType="Bus" speedFactor="1.00" vaporized=""/>
    <tripinfo id="car_n2s_51" depart="52.50" departLane="n2sep_1" departPos="3.60" departPosLat="0.00" departSpeed="13.90" departDelay="1.50" arrival="254.00" arrivalLane="c2s_1" arrivalPos="990.00" arrivalPosLat="0.00" arrivalSpeed="15.36" duration="201.50" routeLength="1997.01" waitingTime="51.00" waitingCount="1" stopTime="0.00" timeLoss="74.53" rerouteNo="1" devices="tripinfo_car_n2s_51 routing_car_n2s_51" vType="Car" speedFactor="1.13" vaporized=""/>
    <tripinfo id="car_n2s_56" depart="57.80" departLane="n2sep_1" departPos="3.60" departPosLat="0.00" departSpeed="13.90" departDelay="1.80" arrival="256.00" arrivalLane="c2s_1" arrivalPos="990.00" arrivalPosLat="0.00" arrivalSpeed="15.52" duration="198.20" routeLength="1997.01" waitingTime="44.50" waitingCount="1" stopTime="0.00" timeLoss="73.73" rerouteNo="1" devices="tripinfo_car_n2s_56 routing_car_n2s_56" vType="Car" speedFactor="1.15" vaporized=""/>
    <tripinfo id="car_s2n_81" depart="81.00" departLane="s2sep_1" departPos="3.60" departPosLat="0.00" departSpeed="13.90" departDelay="0.00" arrival="256.95" arrivalLane="c2n_1" arrivalPos="990.00" arrivalPosLat="0.00" arrivalSpeed="14.15" duration="175.95" routeLength="1997.01" waitingTime="26.05" waitingCount="1" stopTime="0.00" timeLoss="34.83" rerouteNo="1" devices="tripinfo_car_s2n_81 routing_car_s2n_81" vType="Car" speedFactor="1.02" vaporized=""/>
    <tripinfo id="car_s2n_116" depart="116.00" departLane="s2sep_1" departPos="3.60" departPosLat="0.00" departSpeed="13.90" departDelay="0.00" arrival="259.50" arrivalLane="c2n_1" arrivalPos="990.00" arrivalPosLat="0.00" arrivalSpeed="15.04" duration="143.50" routeLength="1997.01" waitingTime="0.00" waitingCount="0" stopTime="0.00" timeLoss="12.35" rerouteNo="1" devices="tripinfo_car_s2n_116 routing_car_s2n_116" vType="Car" speedFactor="1.10" vaporized=""/>
    <tripinfo id="car_s2e_109" depart="109.00" departLane="s2sep_1" departPos="3.60" departPosLat="0.00" departSpeed="13.90" departDelay="0.00" arrival="260.05" arrivalLane="c2e_1" arrivalPos="990.00" arrivalPosLat="0.00" arrivalSpeed="13.90" duration="151.05" routeLength="1986.69" waitingTime="0.00" waitingCount="0" stopTime="0.00" timeLoss="7.35" rerouteNo="1" devices="tripinfo_car_s2e_109 routing_car_s2e_109" vType="Car" speedFactor="1.00" vaporized=""/>
    <tripinfo id="car_n2w_58" depart="59.55" departLane="n2sep_1" departPos="3.60" departPosLat="0.00" departSpeed="13.90" departDelay="1.55" arrival="260.20" arrivalLane="c2w_1" arrivalPos="990.00" arrivalPosLat="0.00" arrivalSpeed="13.90" duration="200.65" routeLength="1986.69" waitingTime="42.45" waitingCount="1" stopTime="0.00" timeLoss="56.98" rerouteNo="1" devices="tripinfo_car_n2w_58 routing_car_n2w_58" vType="Car" speedFactor="1.00" vaporized=""/>
    <tripinfo id="car_n2e_56" depart="56.10" departLane="n2sep_1" departPos="3.60" departPosLat="0.00" departSpeed="13.90" departDelay="0.10" arrival="261.85" arrivalLane="c2e_1" arrivalPos="990.00" arrivalPosLat="0.00" arrivalSpeed="15.47" duration="205.75" routeLength="1996.47" waitingTime="48.60" waitingCount="2" stopTime="0.00" timeLoss="83.29" rerouteNo="1" devices="tripinfo_car_n2e_56 routing_car_n2e_56" vType="Car" speedFactor="1.18" vaporized=""/>
    <tripinfo id="car_n2s_92" depart="92.00" departLane="n2sep_1" departPos="3.60" departPosLat="0.00" departSpeed="13.90" departDelay="0.00" arrival="261.95" arrivalLane="c2s_1" arrivalPos="990.00" arrivalPosLat="0.00" arrivalSpeed="14.50" duration="169.95" routeLength="1997.01" waitingTime="20.20" waitingCount="1" stopTime="0.00" timeLoss="32.24" rerouteNo="1" devices="tripinfo_car_n2s_92 routing_car_n2s_92" vType="Car" speedFactor="1.04" vaporized=""/>
    <tripinfo id="car_n2w_72" depart="72.00" departLane="n2sep_1" departPos="3.60" departPosLat="0.00" departSpeed="13.90" departDelay="0.00" arrival="262.10" arrivalLane="c2w_1" arrivalPos="990.00" arrivalPosLat="0.00" arrivalSpeed="15.36" duration="190.10" routeLength="1986.69" waitingTime="41.70" waitingCount="1" stopTime="0.00" timeLoss="66.07" rerouteNo="1" devices="tripinfo_car_n2w_72 routing_car_n2w_72" vType="Car" speedFactor="1.16" vaporized=""/>
    <tripinfo id="bus_n2e_99" depart="99.00" departLane="n2sep_1" departPos="12.10" departPosLat="0.00" departSpeed="13.90" departDelay="0.00" arrival="270.25" arrivalLane="c2e_1" arrivalPos="990.00" arrivalPosLat="0.00" arrivalSpeed="13.90" duration="171.25" routeLength="1987.97" waitingTime="11.50" waitingCount="2" stopTime="0.00" timeLoss="27.55" rerouteNo="1" devices="tripinfo_bus_n2e_99 routing_bus_n2e_99" vType="Bus" speedFactor="1.00" vaporized=""/>
    <tripinfo id="car_n2w_124" depart="124.00" departLane="n2sep_1" departPos="3.60" departPosLat="0.00" departSpeed="13.90" departDelay="0.00" arrival="272.10" arrivalLane="c2w_1" arrivalPos="990.00" arrivalPosLat="0.00" arrivalSpeed="13.90" duration="148.10" routeLength="1986.69" waitingTime="0.00" waitingCount="0" stopTime="0.00" timeLoss="4.41" rerouteNo="1" devices="tripinfo_car_n2w_124 routing_car_n2w_124" vType="Car" speedFactor="1.00" vaporized=""/>
    <tripinfo id="car_s2w_111" depart="111.00" departLane="s2sep_1" departPos="3.60" departPosLat="0.00" departSpeed="13.90" departDelay="0.00" arrival="273.95" arrivalLane="c2w_1" arrivalPos="990.00" arrivalPosLat="0.00" arrivalSpeed="15.42" duration="162.95" routeLength="1996.47" waitingTime="13.60" waitingCount="2" stopTime="0.00" timeLoss="39.47" rerouteNo="1" devices="tripinfo_car_s2w_111 routing_car_s2w_111" vType="Car" speedFactor="1.17" vaporized=""/>
    <tripinfo id="car_n2e_102" depart="102.00" departLane="n2sep_1" departPos="3.60" departPosLat="0.00" departSpeed="13.90" departDelay="0.00" arrival="275.00" arrivalLane="c2e_1" arrivalPos="990.00" arrivalPosLat="0.00" arrivalSpeed="13.89" duration="173.00" routeLength="1996.47" waitingTime="7.10" waitingCount="2" stopTime="0.00" timeLoss="28.68" rerouteNo="1" devices="tripinfo_car_n2e_102 routing_car_n2e_102" vType="Car" speedFactor="1.00" vaporized=""/>
    <tripinfo id="car_n2e_118" depart="118.00" departLane="n2sep_1" departPos="3.60" departPosLat="0.00" departSpeed="13.90" departDelay="0.00" arrival="278.35" arrivalLane="c2e_1" arrivalPos="990.00" arrivalPosLat="0.00" arrivalSpeed="13.90" duration="160.35" routeLength="1996.47" waitingTime="0.00" waitingCount="0" stopTime="0.00" timeLoss="16.50" rerouteNo="1" devices="tripinfo_car_n2e_118 routing_car_n2e_118" vType="Car" speedFactor="1.00" vaporized=""/>
    <tripinfo id="car_n2e_144" depart="144.00" departLane="n2sep_1" departPos="3.60" departPosLat="0.00" departSpeed="13.90" departDelay="0.00" arrival="280.70" arrivalLane="c2e_1" arrivalPos="990.00" arrivalPosLat="0.00" arrivalSpeed="15.54" duration="136.70" routeLength="1996.47" waitingTime="0.00" waitingCount="0" stopTime="0.00" timeLoss="10.35" rerouteNo="1" devices="tripinfo_car_n2e_144 routing_car_n2e_144" vType="Car" speedFactor="1.14" vaporized=""/>
    <tripinfo id="car_n2w_137" depart="137.00" departLane="n2sep_1" departPos="3.60" departPosLat="0.00" departSpeed="13.90" departDelay="0.00" arrival="284.50" arrivalLane="c2w_1" arrivalPos="990.00" arrivalPosLat="0.00" arrivalSpeed="13.90" duration="147.50" routeLength="1986.69" waitingTime="0.00" waitingCount="0" stopTime="0.00" timeLoss="3.84" rerouteNo="1" devices="tripinfo_car_n2w_137 routing_car_n2w_137" vType="Car" speedFactor="1.00" vaporized=""/>
    <tripinfo id="car_e2n_156" depart="157.45" departLane="e2sep_1" departPos="3.60" departPosLat="0.00" departSpeed="13.90" departDelay="1.45" arrival="294.90" arrivalLane="c2n_1" arrivalPos="990.00" arrivalPosLat="0.00" arrivalSpeed="16.38" duration="137.45" routeLength="1986.69" waitingTime="0.00" waitingCount="0" stopTime="0.00" timeLoss="15.55" rerouteNo="1" devices="tripinfo_car_e2n_156 routing_car_e2n_156" vType="Car" speedFactor="1.18" vaporized=""/>
    <tripinfo id="car_s2w_150" depart="150.30" departLane="s2sep_1" departPos="3.60" departPosLat="0.00" departSpeed="13.90" departDelay="0.30" arrival="296.90" arrivalLane="c2w_1" arrivalPos="990.00" arrivalPosLat="0.00" arrivalSpeed="14.12" duration="146.60" routeLength="1996.47" waitingTime="0.00" waitingCount="0" stopTime="0.00" timeLoss="4.51" rerouteNo="1" devices="tripinfo_car_s2w_150 routing_car_s2w_150" vType="Car" speedFactor="1.02" vaporized=""/>
    <tripinfo id="car_w2s_102" depart="102.00" departLane="w2sep_1" departPos="3.60" departPosLat="0.00" departSpeed="13.90" departDelay="0.00" arrival="300.65" arrivalLane="c2s_1" arrivalPos="990.00" arrivalPosLat="0.00" arrivalSpeed="13.90" duration="198.65" routeLength="1986.69" waitingTime="47.90" waitingCount="1" stopTime="0.00" timeLoss="54.95" rerouteNo="1" devices="tripinfo_car_w2s_102 routing_car_w2s_102" vType="Car" speedFactor="1.00" vaporized=""/>
    <tripinfo id="bus_e2w_156" depart="156.00" departLane="e2sep_1" departPos="12.10" departPosLat="0.00" departSpeed="13.90" departDelay="0.00" arrival="302.30" arrivalLane="c2w_1" arrivalPos="990.00" arrivalPosLat="0.00" arrivalSpeed="13.87" duration="146.30" routeLength="1988.51" waitingTime="0.00" waitingCount="0" stopTime="0.00" timeLoss="3.21" rerouteNo="1" devices="tripinfo_bus_e2w_156 routing_bus_e2w_156" vType="Bus" speedFactor="1.00" vaporized=""/>
    <tripinfo id="car_w2n_149" depart="149.00" departLane="w2sep_1" departPos="3.60" departPosLat="0.00" departSpeed="13.90" departDelay="0.00" arrival="303.75" arrivalLane="c2n_1" arrivalPos="990.00" arrivalPosLat="0.00" arrivalSpeed="15.05" duration="154.75" routeLength="1996.47" waitingTime="9.30" waitingCount="2" stopTime="0.00" timeLoss="21.43" rerouteNo="1" devices="tripinfo_car_w2n_149 routing_car_w2n_149" vType="Car" speedFactor="1.08" vaporized=""/>
    <tripinfo id="car_w2s_113" depart="113.00" departLane="w2sep_1" departPos="3.60" departPosLat="0.00" departSpeed="13.90" departDelay="0.00" arrival="304.50" arrivalLane="c2s_1" arrivalPos="990.00" arrivalPosLat="0.00" arrivalSpeed="14.11" duration="191.50" routeLength="1986.69" waitingTime="38.90" waitingCount="1" stopTime="0.00" timeLoss="50.19" rerouteNo="1" devices="tripinfo_car_w2s_113 routing_car_w2s_113" vType="Car" speedFactor="1.02" vaporized=""/>
    <tripinfo id="bus_w2s_157" depart="157.00" departLane="w2sep_1" departPos="12.10" departPosLat="0.00" departSpeed="13.90" departDelay="0.00" arrival="308.90" arrivalLane="c2s_1" arrivalPos="990.00" arrivalPosLat="0.00" arrivalSpeed="13.84" duration="151.90" routeLength="1978.19" waitingTime="0.00" waitingCount="0" stopTime="0.00" timeLoss="8.80" rerouteNo="1" devices="tripinfo_bus_w2s_157 routing_bus_w2s_157" vType="Bus" speedFactor="1.00" vaporized=""/>
    <tripinfo id="car_w2e_173" depart="173.00" departLane="w2sep_1" departPos="3.60" departPosLat="0.00" departSpeed="13.90" departDelay="0.00" arrival="309.75" arrivalLane="c2e_1" arrivalPos="990.00" arrivalPosLat="0.00" arrivalSpeed="14.67" duration="136.75" routeLength="1997.01" waitingTime="0.00" waitingCount="0" stopTime="0.00" timeLoss="0.64" rerouteNo="1" devices="tripinfo_car_w2e_173 routing_car_w2e_173" vType="Car" speedFactor="1.06" vaporized=""/>
    <tripinfo id="car_e2s_102" depart="102.00" departLane="e2sep_1" departPos="3.60" departPosLat="0.00" departSpeed="13.90" departDelay="0.00" arrival="313.15" arrivalLane="c2s_1" arrivalPos="990.00" arrivalPosLat="0.00" arrivalSpeed="13.88" duration="211.15" routeLength="1996.47" waitingTime="49.15" waitingCount="2" stopTime="0.00" timeLoss="66.82" rerouteNo="1" devices="tripinfo_car_e2s_102 routing_car_e2s_102" vType="Car" speedFactor="1.00" vaporized=""/>
    <tripinfo id="car_w2s_174" depart="174.35" departLane="w2sep_1" departPos="3.60" departPosLat="0.00" departSpeed="13.90" departDelay="0.35" arrival="314.90" arrivalLane="c2s_1" arrivalPos="990.00" arrivalPosLat="0.00" arrivalSpeed="15.36" duration="140.55" routeLength="1986.69" waitingTime="0.00" waitingCount="0" stopTime="0.00" timeLoss="18.78" rerouteNo="1" devices="tripinfo_car_w2s_174 routing_car_w2s_174" vType="Car" speedFactor="1.18" vaporized=""/>
    <tripinfo id="car_e2n_182" depart="182.00" departLane="e2sep_1" departPos="3.60" departPosLat="0.00" departSpeed="13.90" departDelay="0.00" arrival="316.45" arrivalLane="c2n_1" arrivalPos="990.00" arrivalPosLat="0.00" arrivalSpeed="15.32" duration="134.45" routeLength="1986.69" waitingTime="0.00" waitingCount="0" stopTime="0.00" timeLoss="4.14" rerouteNo="1" devices="tripinfo_car_e2n_182 routing_car_e2n_182" vType="Car" speedFactor="1.10" vaporized=""/>
    <tripinfo id="car_e2s_157" depart="159.10" departLane="e2sep_1" departPos="3.60" departPosLat="0.00" departSpeed="13.90" departDelay="2.10" arrival="321.85" arrivalLane="c2s_1" arrivalPos="990.00" arrivalPosLat="0.00" arrivalSpeed="13.97" duration="162.75" routeLength="1996.47" waitingTime="6.70" waitingCount="1" stopTime="0.00" timeLoss="19.16" rerouteNo="1" devices="tripinfo_car_e2s_157 routing_car_e2s_157" vType="Car" speedFactor="1.01" vaporized=""/>
    <tripinfo id="car_w2n_182" depart="182.00" departLane="w2sep_1" departPos="3.60" departPosLat="0.00" departSpeed="13.90" departDelay="0.00" arrival="325.80" arrivalLane="c2n_1" arrivalPos="990.00" arrivalPosLat="0.00" arrivalSpeed="14.35" duration="143.80" routeLength="1996.47" waitingTime="0.00" waitingCount="0" stopTime="0.00" timeLoss="4.01" rerouteNo="1" devices="tripinfo_car_w2n_182 routing_car_w2n_182" vType="Car" speedFactor="1.03" vaporized=""/>
    <tripinfo id="car_w2n_196" depart="196.45" departLane="w2sep_1" departPos="3.60" departPosLat="0.00" departSpeed="13.90" departDelay="0.45" arrival="334.15" arrivalLane="c2n_1" arrivalPos="990.00" arrivalPosLat="0.00" arrivalSpeed="15.95" duration="137.70" routeLength="1996.47" waitingTime="0.00" waitingCount="0" stopTime="0.00" timeLoss="11.95" rerouteNo="1" devices="tripinfo_car_w2n_196 routing_car_w2n_196" vType="Car" speedFactor="1.15" vaporized=""/>
    <tripinfo id="car_s2e_149" depart="149.00" departLane="s2sep_1" departPos="3.60" departPosLat="0.00" departSpeed="13.90" departDelay="0.00" arrival="338.25" arrivalLane="c2e_1" arrivalPos="990.00" arrivalPosLat="0.00" arrivalSpeed="15.56" duration="189.25" routeLength="1986.69" waitingTime="53.45" waitingCount="1" stopTime="0.00" timeLoss="60.88" rerouteNo="1" devices="tripinfo_car_s2e_149 routing_car_s2e_149" vType="Car" speedFactor="1.12" vaporized=""/>
    <tripinfo id="car_n2w_147" depart="147.00" departLane="n2sep_1" departPos="3.60" departPosLat="0.00" departSpeed="13.90" departDelay="0.00" arrival="339.90" arrivalLane="c2w_1" arrivalPos="990.00" arrivalPosLat="0.00" arrivalSpeed="15.73" duration="192.90" routeLength="1986.69" waitingTime="49.20" waitingCount="1" stopTime="0.00" timeLoss="65.94" rerouteNo="1" devices="tripinfo_car_n2w_147 routing_car_n2w_147" vType="Car" speedFactor="1.13" vaporized=""/>
    <tripinfo id="car_s2e_158" depart="158.00" departLane="s2sep_1" departPos="3.60" departPosLat="0.00" departSpeed="13.90" departDelay="0.00" arrival="341.70" arrivalLane="c2e_1" arrivalPos="990.00" arrivalPosLat="0.00" arrivalSpeed="16.23" duration="183.70" routeLength="1986.69" waitingTime="39.35" waitingCount="1" stopTime="0.00" timeLoss="61.09" rerouteNo="1" devices="tripinfo_car_s2e_158 routing_car_s2e_158" vType="Car" speedFactor="1.17" vaporized=""/>
    <tripinfo id="car_n2s_144" depart="145.25" departLane="n2sep_1" departPos="3.60" departPosLat="0.00" departSpeed="13.90" departDelay="1.25" arrival="344.15" arrivalLane="c2s_1" arrivalPos="990.00" arrivalPosLat="0.00" arrivalSpeed="14.23" duration="198.90" routeLength="1997.01" waitingTime="50.35" waitingCount="1" stopTime="0.00" timeLoss="58.52" rerouteNo="1" devices="tripinfo_car_n2s_144 routing_car_n2s_144" vType="Car" speedFactor="1.02" vaporized=""/>
    <tripinfo id="car_s2n_151" depart="152.00" departLane="s2sep_1" departPos="3.60" departPosLat="0.00" departSpeed="13.90" departDelay="1.00" arrival="347.95" arrivalLane="c2n_1" arrivalPos="990.00" arrivalPosLat="0.00" arrivalSpeed="13.90" duration="195.95" routeLength="1997.01" waitingTime="41.20" waitingCount="1" stopTime="0.00" timeLoss="52.24" rerouteNo="1" devices="tripinfo_car_s2n_151 routing_car_s2n_151" vType="Car" speedFactor="1.00" vaporized=""/>
    <tripinfo id="car_n2w_165" depart="165.00" departLane="n2sep_1" departPos="3.60" departPosLat="0.00" departSpeed="13.90" departDelay="0.00" arrival="349.50" arrivalLane="c2w_1" arrivalPos="990.00" arrivalPosLat="0.00" arrivalSpeed="14.21" duration="184.50" routeLength="1986.69" waitingTime="33.45" waitingCount="1" stopTime="0.00" timeLoss="43.94" rerouteNo="1" devices="tripinfo_car_n2w_165 routing_car_n2w_165" vType="Car" speedFactor="1.02" vaporized=""/>
    <tripinfo id="car_s2e_159" depart="159.40" departLane="s2sep_1" departPos="3.60" departPosLat="0.00" departSpeed="13.90" departDelay="0.40" arrival="350.70" arrivalLane="c2e_1" arrivalPos="990.00" arrivalPosLat="0.00" arrivalSpeed="14.46" duration="191.30" routeLength="1986.69" waitingTime="37.50" waitingCount="1" stopTime="0.00" timeLoss="53.12" rerouteNo="1" devices="tripinfo_car_s2e_159 routing_car_s2e_159" vType="Car" speedFactor="1.04" vaporized=""/>
    <tripinfo id="car_n2w_194" depart="194.00" departLane="n2sep_1" departPos="3.60" departPosLat="0.00" departSpeed="13.90" departDelay="0.00" arrival="354.65" arrivalLane="c2w_1" arrivalPos="990.00" arrivalPosLat="0.00" arrivalSpeed="13.90" duration="160.65" routeLength="1986.69" waitingTime="4.05" waitingCount="1" stopTime="0.00" timeLoss="17.01" rerouteNo="1" devices="tripinfo_car_n2w_194 routing_car_n2w_194" vType="Car" speedFactor="1.00" vaporized=""/>
    <tripinfo id="car_n2s_216" depart="216.00" departLane="n2sep_1" departPos="3.60" departPosLat="0.00" departSpeed="13.90" departDelay="0.00" arrival="355.05" arrivalLane="c2s_1" arrivalPos="990.00" arrivalPosLat="0.00" arrivalSpeed="14.50" duration="139.05" routeLength="1997.01" waitingTime="0.00" waitingCount="0" stopTime="0.00" timeLoss="1.35" rerouteNo="1" devices="tripinfo_car_n2s_216 routing_car_n2s_216" vType="Car" speedFactor="1.04" vaporized=""/>
    <tripinfo id="car_s2e_166" depart="166.00" departLane="s2sep_1" departPos="3.60" departPosLat="0.00" departSpeed="13.90" departDelay="0.00" arrival="355.50" arrivalLane="c2e_1" arrivalPos="990.00" arrivalPosLat="0.00" arrivalSpeed="14.21" duration="189.50" routeLength="1986.69" waitingTime="34.40" waitingCount="1" stopTime="0.00" timeLoss="49.07" rerouteNo="1" devices="tripinfo_car_s2e_166 routing_car_s2e_166" vType="Car" speedFactor="1.02" vaporized=""/>
    <tripinfo id="car_s2n_188" depart="188.00" departLane="s2sep_1" departPos="3.60" departPosLat="0.00" departSpeed="13.90" departDelay="0.00" arrival="356.20" arrivalLane="c2n_1" arrivalPos="990.00" arrivalPosLat="0.00" arrivalSpeed="15.11" duration="168.20" routeLength="1997.01" waitingTime="20.60" waitingCount="1" stopTime="0.00" timeLoss="36.02" rerouteNo="1" devices="tripinfo_car_s2n_188 routing_car_s2n_188" vType="Car" speedFactor="1.09" vaporized=""/>
    <tripinfo id="car_n2w_200" depart="200.00" departLane="n2sep_1" departPos="3.60" departPosLat="0.00" departSpeed="13.90" departDelay="0.00" arrival="358.35" arrivalLane="c2w_1" arrivalPos="990.00" arrivalPosLat="0.00" arrivalSpeed="13.90" duration="158.35" routeLength="1986.69" waitingTime="0.00" waitingCount="0" stopTime="0.00" timeLoss="14.95" rerouteNo="1" devices="tripinfo_car_n2w_200 routing_car_n2w_200" vType="Car" speedFactor="1.00" vaporized=""/>
    <tripinfo id="car_s2e_171" depart="171.00" departLane="s2sep_1" departPos="3.60" departPosLat="0.00" departSpeed="13.90" departDelay="0.00" arrival="359.30" arrivalLane="c2e_1" arrivalPos="990.00" arrivalPosLat="0.00" arrivalSpeed="14.15" duration="188.30" routeLength="1986.69" waitingTime="30.60" waitingCount="1" stopTime="0.00" timeLoss="47.37" rerouteNo="1" devices="tripinfo_car_s2e_171 routing_car_s2e_171" vType="Car" speedFactor="1.02" vaporized=""/>
    <tripinfo id="car_s2w_156" depart="156.00" departLane="s2sep_1" departPos="3.60" departPosLat="0.00" departSpeed="13.90" departDelay="0.00" arrival="360.20" arrivalLane="c2w_1" arrivalPos="990.00" arrivalPosLat="0.00" arrivalSpeed="15.23" duration="204.20" routeLength="1996.47" waitingTime="50.05" waitingCount="2" stopTime="0.00" timeLoss="79.19" rerouteNo="1" devices="tripinfo_car_s2w_156 routing_car_s2w_156" vType="Car" speedFactor="1.15" vaporized=""/>
    <tripinfo id="car_s2e_173" depart="173.00" departLane="s2sep_1" departPos="3.60" departPosLat="0.00" departSpeed="13.90" departDelay="0.00" arrival="363.10" arrivalLane="c2e_1" arrivalPos="990.00" arrivalPosLat="0.00" arrivalSpeed="13.88" duration="190.10" routeLength="1986.69" waitingTime="27.45" waitingCount="1" stopTime="0.00" timeLoss="46.43" rerouteNo="1" devices="tripinfo_car_s2e_173 routing_car_s2e_173" vType="Car" speedFactor="1.00" vaporized=""/>
    <tripinfo id="car_s2w_210" depart="210.00" departLane="s2sep_1" departPos="3.60" departPosLat="0.00" departSpeed="13.90" departDelay="0.00" arrival="363.30" arrivalLane="c2w_1" arrivalPos="990.00" arrivalPosLat="0.00" arrivalSpeed="14.36" duration="153.30" routeLength="1996.47" waitingTime="3.50" waitingCount="1" stopTime="0.00" timeLoss="14.20" rerouteNo="1" devices="tripinfo_car_s2w_210 routing_car_s2w_210" vType="Car" speedFactor="1.04" vaporized=""/>
    <tripinfo id="car_s2n_200" depart="200.00" departLane="s2sep_1" departPos="3.60" departPosLat="0.00" departSpeed="13.90" departDelay="0.00" arrival="363.40" arrivalLane="c2n_1" arrivalPos="990.00" arrivalPosLat="0.00" arrivalSpeed="14.49" duration="163.40" routeLength="1997.01" waitingTime="8.25" waitingCount="1" stopTime="0.00" timeLoss="25.61" rerouteNo="1" devices="tripinfo_car_s2n_200 routing_car_s2n_200" vType="Car" speedFactor="1.04" vaporized=""/>
    <tripinfo id="car_s2e_195" depart="195.00" departLane="s2sep_1" departPos="3.60" departPosLat="0.00" departSpeed="13.90" departDelay="0.00" arrival="365.85" arrivalLane="c2e_1" arrivalPos="990.00" arrivalPosLat="0.00" arrivalSpeed="14.21" duration="170.85" routeLength="1986.69" waitingTime="11.65" waitingCount="1" stopTime="0.00" timeLoss="31.41" rerouteNo="1" devices="tripinfo_car_s2e_195 routing_car_s2e_195" vType="Car" speedFactor="1.03" vaporized=""/>
    <tripinfo id="car_s2w_227" depart="227.00" departLane="s2sep_1" departPos="3.60" departPosLat="0.00" departSpeed="13.90" departDelay="0.00" arrival="368.00" arrivalLane="c2w_1" arrivalPos="990.00" arrivalPosLat="0.00" arrivalSpeed="14.68" duration="141.00" routeLength="1996.47" waitingTime="0.00" waitingCount="0" stopTime="0.00" timeLoss="4.41" rerouteNo="1" devices="tripinfo_car_s2w_227 routing_car_s2w_227" vType="Car" speedFactor="1.06" vaporized=""/>
    <tripinfo id="car_n2e_171" depart="171.00" departLane="n2sep_1" departPos="3.60" departPosLat="0.00" departSpeed="13.90" departDelay="0.00" arrival="370.00" arrivalLane="c2e_1" arrivalPos="990.00" arrivalPosLat="0.00" arrivalSpeed="13.89" duration="199.00" routeLength="1996.47" waitingTime="41.95" waitingCount="2" stopTime="0.00" timeLoss="54.68" rerouteNo="1" devices="tripinfo_car_n2e_171 routing_car_n2e_171" vType="Car" speedFactor="1.00" vaporized=""/>
    <tripinfo id="car_n2e_186" depart="186.00" departLane="n2sep_1" departPos="3.60" departPosLat="0.00" departSpeed="13.90" departDelay="0.00" arrival="373.45" arrivalLane="c2e_1" arrivalPos="990.00" arrivalPosLat="0.00" arrivalSpeed="13.97" duration="187.45" routeLength="1996.47" waitingTime="27.70" waitingCount="2" stopTime="0.00" timeLoss="44.17" rerouteNo="1" devices="tripinfo_car_n2e_186 routing_car_n2e_186" vType="Car" speedFactor="1.01" vaporized=""/>
    <tripinfo id="car_n2e_202" depart="202.00" departLane="n2sep_1" departPos="3.60" departPosLat="0.00" departSpeed="13.90" departDelay="0.00" arrival="376.65" arrivalLane="c2e_1" arrivalPos="990.00" arrivalPosLat="0.00" arrivalSpeed="13.95" duration="174.65" routeLength="1996.47" waitingTime="13.90" waitingCount="1" stopTime="0.00" timeLoss="31.35" rerouteNo="1" devices="tripinfo_car_n2e_202 routing_car_n2e_202" vType="Car" speedFactor="1.01" vaporized=""/>
    <tripinfo id="car_n2e_206" depart="206.00" departLane="n2sep_1" departPos="3.60" departPosLat="0.00" departSpeed="13.90" departDelay="0.00" arrival="379.50" arrivalLane="c2e_1" arrivalPos="990.00" arrivalPosLat="0.00" arrivalSpeed="14.04" duration="173.50" routeLength="1996.47" waitingTime="13.35" waitingCount="1" stopTime="0.00" timeLoss="31.56" rerouteNo="1" devices="tripinfo_car_n2e_206 routing_car_n2e_206" vType="Car" speedFactor="1.02" vaporized=""/>
    <tripinfo id="car_n2e_243" depart="243.00" departLane="n2sep_1" departPos="3.60" departPosLat="0.00" departSpeed="13.90" departDelay="0.00" arrival="381.45" arrivalLane="c2e_1" arrivalPos="990.00" arrivalPosLat="0.00" arrivalSpeed="14.98" duration="138.45" routeLength="1996.47" waitingTime="0.00" waitingCount="0" stopTime="0.00" timeLoss="9.77" rerouteNo="1" devices="tripinfo_car_n2e_243 routing_car_n2e_243" vType="Car" speedFactor="1.12" vaporized=""/>
    <tripinfo id="car_e2n_191" depart="191.00" departLane="e2sep_1" departPos="3.60" departPosLat="0.00" departSpeed="13.90" departDelay="0.00" arrival="388.30" arrivalLane="c2n_1" arrivalPos="990.00" arrivalPosLat="0.00" arrivalSpeed="14.38" duration="197.30" routeLength="1986.69" waitingTime="51.45" waitingCount="1" stopTime="0.00" timeLoss="58.44" rerouteNo="1" devices="tripinfo_car_e2n_191 routing_car_e2n_191" vType="Car" speedFactor="1.03" vaporized=""/>
    <tripinfo id="car_w2s_195" depart="195.00" departLane="w2sep_1" departPos="3.60" departPosLat="0.00" departSpeed="13.90" departDelay="0.00" arrival="389.45" arrivalLane="c2s_1" arrivalPos="990.00" arrivalPosLat="0.00" arrivalSpeed="14.13" duration="194.45" routeLength="1986.69" waitingTime="46.25" waitingCount="1" stopTime="0.00" timeLoss="53.19" rerouteNo="1" devices="tripinfo_car_w2s_195 routing_car_w2s_195" vType="Car" speedFactor="1.02" vaporized=""/>
    <tripinfo id="car_e2s_226" depart="226.00" departLane="e2sep_1" departPos="3.60" departPosLat="0.00" departSpeed="13.90" departDelay="0.00" arrival="391.95" arrivalLane="c2s_1" arrivalPos="990.00" arrivalPosLat="0.00" arrivalSpeed="14.97" duration="165.95" routeLength="1996.47" waitingTime="19.55" waitingCount="1" stopTime="0.00" timeLoss="33.67" rerouteNo="1" devices="tripinfo_car_e2s_226 routing_car_e2s_226" vType="Car" speedFactor="1.09" vaporized=""/>
    <tripinfo id="car_e2w_203" depart="203.00" departLane="e2sep_1" departPos="3.60" departPosLat="0.00" departSpeed="13.90" departDelay="0.00" arrival="393.65" arrivalLane="c2w_1" arrivalPos="990.00" arrivalPosLat="0.00" arrivalSpeed="14.21" duration="190.65" routeLength="1997.01" waitingTime="39.30" waitingCount="1" stopTime="0.00" timeLoss="50.04" rerouteNo="1" devices="tripinfo_car_e2w_203 routing_car_e2w_203" vType="Car" speedFactor="1.02" vaporized=""/>
    <tripinfo id="car_e2n_199" depart="199.00" departLane="e2sep_1" departPos="3.60" departPosLat="0.00" departSpeed="13.90" departDelay="0.00" arrival="394.45" arrivalLane="c2n_1" arrivalPos="990.00" arrivalPosLat="0.00" arrivalSpeed="13.90" duration="195.45" routeLength="1986.69" waitingTime="41.80" waitingCount="1" stopTime="0.00" timeLoss="51.77" rerouteNo="1" devices="tripinfo_car_e2n_199 routing_car_e2n_199" vType="Car" speedFactor="1.00" vaporized=""/>
    <tripinfo id="car_e2n_208" depart="208.00" departLane="e2sep_1" departPos="3.60" departPosLat="0.00" departSpeed="13.90" departDelay="0.00" arrival="396.70" arrivalLane="c2n_1" arrivalPos="990.00" arrivalPosLat="0.00" arrivalSpeed="14.87" duration="188.70" routeLength="1986.69" waitingTime="38.25" waitingCount="1" stopTime="0.00" timeLoss="57.12" rerouteNo="1" devices="tripinfo_car_e2n_208 routing_car_e2n_208" vType="Car" speedFactor="1.09" vaporized=""/>
    <tripinfo id="car_e2n_231" depart="231.00" departLane="e2sep_1" departPos="3.60" departPosLat="0.00" departSpeed="13.90" departDelay="0.00" arrival="401.10" arrivalLane="c2n_1" arrivalPos="990.00" arrivalPosLat="0.00" arrivalSpeed="14.03" duration="170.10" routeLength="1986.69" waitingTime="13.95" waitingCount="1" stopTime="0.00" timeLoss="27.85" rerouteNo="1" devices="tripinfo_car_e2n_231 routing_car_e2n_231" vType="Car" speedFactor="1.01" vaporized=""/>
    <tripinfo id="car_e2n_243" depart="243.00" departLane="e2sep_1" departPos="3.60" departPosLat="0.00" departSpeed="13.90" departDelay="0.00" arrival="403.35" arrivalLane="c2n_1" arrivalPos="990.00" arrivalPosLat="0.00" arrivalSpeed="14.92" duration="160.35" routeLength="1986.69" waitingTime="8.55" waitingCount="1" stopTime="0.00" timeLoss="29.40" rerouteNo="1" devices="tripinfo_car_e2n_243 routing_car_e2n_243" vType="Car" speedFactor="1.10" vaporized=""/>
    <tripinfo id="car_e2w_250" depart="250.00" departLane="e2sep_1" departPos="3.60" departPosLat="0.00" departSpeed="13.90" departDelay="0.00" arrival="404.30" arrivalLane="c2w_1" arrivalPos="990.00" arrivalPosLat="0.00" arrivalSpeed="13.90" duration="154.30" routeLength="1997.01" waitingTime="0.00" waitingCount="0" stopTime="0.00" timeLoss="10.62" rerouteNo="1" devices="tripinfo_car_e2w_250 routing_car_e2w_250" vType="Car" speedFactor="1.00" vaporized=""/>
    <tripinfo id="car_w2s_266" depart="266.00" departLane="w2sep_1" departPos="3.60" departPosLat="0.00" departSpeed="13.90" departDelay="0.00" arrival="407.80" arrivalLane="c2s_1" arrivalPos="990.00" arrivalPosLat="0.00" arrivalSpeed="14.91" duration="141.80" routeLength="1986.69" waitingTime="0.00" waitingCount="0" stopTime="0.00" timeLoss="7.85" rerouteNo="1" devices="tripinfo_car_w2s_266 routing_car_w2s_266" vType="Car" speedFactor="1.07" vaporized=""/>
    <tripinfo id="car_w2n_245" depart="245.00" departLane="w2sep_1" departPos="3.60" departPosLat="0.00" departSpeed="13.90" departDelay="0.00" arrival="408.25" arrivalLane="c2n_1" arrivalPos="990.00" arrivalPosLat="0.00" arrivalSpeed="13.90" duration="163.25" routeLength="1996.47" waitingTime="10.75" waitingCount="1" stopTime="0.00" timeLoss="18.90" rerouteNo="1" devices="tripinfo_car_w2n_245 routing_car_w2n_245" vType="Car" speedFactor="1.00" vaporized=""/>
    <tripinfo id="bus_w2n_263" depart="263.00" departLane="w2sep_1" departPos="12.10" departPosLat="0.00" departSpeed="13.90" departDelay="0.00" arrival="413.10" arrivalLane="c2n_1" arrivalPos="990.00" arrivalPosLat="0.00" arrivalSpeed="13.86" duration="150.10" routeLength="1987.97" waitingTime="0.00" waitingCount="0" stopTime="0.00" timeLoss="6.37" rerouteNo="1" devices="tripinfo_bus_w2n_263 routing_bus_w2n_263" vType="Bus" speedFactor="1.00" vaporized=""/>
    <tripinfo id="amb_w2e_300" depart="302.40" departLane="w2sep_1" departPos="6.60" departPosLat="0.00" departSpeed="13.90" departDelay="2.40" arrival="413.75" arrivalLane="c2e_1" arrivalPos="990.00" arrivalPosLat="-0.95" arrivalSpeed="20.85" duration="111.35" routeLength="1994.01" waitingTime="0.00" waitingCount="0" stopTime="0.00" timeLoss="15.70" rerouteNo="1" devices="tripinfo_amb_w2e_300 routing_amb_w2e_300 bluelight_amb_w2e_300 fcd_amb_w2e_300" vType="Ambulance" speedFactor="1.50" vaporized="">
        <example_device customValue1="0.00" customValue2="-1.00"/>
    </tripinfo>
    <tripinfo id="car_w2s_273" depart="273.00" departLane="w2sep_1" departPos="3.60" departPosLat="0.00" departSpeed="13.90" departDelay="0.00" arrival="418.95" arrivalLane="c2s_1" arrivalPos="990.00" arrivalPosLat="0.00" arrivalSpeed="14.09" duration="145.95" routeLength="1986.69" waitingTime="0.00" waitingCount="0" stopTime="0.00" timeLoss="4.24" rerouteNo="1" devices="tripinfo_car_w2s_273 routing_car_w2s_273" vType="Car" speedFactor="1.01" vaporized=""/>
    <tripinfo id="car_w2e_281" depart="281.00" departLane="w2sep_1" departPos="3.60" departPosLat="0.00" departSpeed="13.90" departDelay="0.00" arrival="425.15" arrivalLane="c2e_1" arrivalPos="990.00" arrivalPosLat="1.10" arrivalSpeed="13.90" duration="144.15" routeLength="1997.01" waitingTime="0.00" waitingCount="0" stopTime="0.00" timeLoss="0.46" rerouteNo="1" devices="tripinfo_car_w2e_281 routing_car_w2e_281" vType="Car@car_w2e_281" speedFactor="1.00" vaporized=""/>
    <tripinfo id="car_e2w_284" depart="284.00" departLane="e2sep_1" departPos="3.60" departPosLat="0.00" departSpeed="13.90" departDelay="0.00" arrival="439.20" arrivalLane="c2w_1" arrivalPos="990.00" arrivalPosLat="0.00" arrivalSpeed="14.13" duration="155.20" routeLength="1997.01" waitingTime="6.90" waitingCount="1" stopTime="0.00" timeLoss="13.89" rerouteNo="1" devices="tripinfo_car_e2w_284 routing_car_e2w_284" vType="Car" speedFactor="1.02" vaporized=""/>
    <tripinfo id="car_e2w_291" depart="291.00" departLane="e2sep_1" departPos="3.60" departPosLat="0.00" departSpeed="13.90" departDelay="0.00" arrival="441.65" arrivalLane="c2w_1" arrivalPos="990.00" arrivalPosLat="0.00" arrivalSpeed="15.02" duration="150.65" routeLength="1997.01" waitingTime="4.65" waitingCount="1" stopTime="0.00" timeLoss="19.60" rerouteNo="1" devices="tripinfo_car_e2w_291 routing_car_e2w_291" vType="Car" speedFactor="1.10" vaporized=""/>
    <tripinfo id="car_w2n_294" depart="294.00" departLane="w2sep_1" departPos="3.60" departPosLat="0.00" departSpeed="13.90" departDelay="0.00" arrival="444.85" arrivalLane="c2n_1" arrivalPos="990.00" arrivalPosLat="0.00" arrivalSpeed="13.96" duration="150.85" routeLength="1996.47" waitingTime="0.40" waitingCount="1" stopTime="0.00" timeLoss="7.14" rerouteNo="1" devices="tripinfo_car_w2n_294 routing_car_w2n_294" vType="Car" speedFactor="1.00" vaporized=""/>
    <tripinfo id="car_w2n_299" depart="299.00" departLane="w2sep_1" departPos="3.60" departPosLat="0.00" departSpeed="13.90" departDelay="0.00" arrival="447.45" arrivalLane="c2n_1" arrivalPos="990.00" arrivalPosLat="0.00" arrivalSpeed="14.72" duration="148.45" routeLength="1996.47" waitingTime="0.00" waitingCount="0" stopTime="0.00" timeLoss="13.68" rerouteNo="1" devices="tripinfo_car_w2n_299 routing_car_w2n_299" vType="Car" speedFactor="1.07" vaporized=""/>
    <tripinfo id="car_s2n_242" depart="242.00" departLane="s2sep_1" departPos="3.60" departPosLat="0.00" departSpeed="13.90" departDelay="0.00" arrival="452.40" arrivalLane="c2n_1" arrivalPos="990.00" arrivalPosLat="0.00" arrivalSpeed="15.12" duration="210.40" routeLength="1997.01" waitingTime="70.35" waitingCount="1" stopTime="0.00" timeLoss="78.32" rerouteNo="1" devices="tripinfo_car_s2n_242 routing_car_s2n_242" vType="Car" speedFactor="1.09" vaporized=""/>
    <tripinfo id="car_s2e_277" depart="277.00" departLane="s2sep_1" departPos="3.60" departPosLat="0.00" departSpeed="13.90" departDelay="0.00" arrival="457.25" arrivalLane="c2e_1" arrivalPos="990.00" arrivalPosLat="0.00" arrivalSpeed="14.38" duration="180.25" routeLength="1986.69" waitingTime="32.65" waitingCount="1" stopTime="0.00" timeLoss="41.38" rerouteNo="1" devices="tripinfo_car_s2e_277 routing_car_s2e_277" vType="Car" speedFactor="1.03" vaporized=""/>
    <tripinfo id="car_n2w_257" depart="257.00" departLane="n2sep_1" departPos="3.60" departPosLat="0.00" departSpeed="13.90" departDelay="0.00" arrival="457.35" arrivalLane="c2w_1" arrivalPos="990.00" arrivalPosLat="0.00" arrivalSpeed="13.90" duration="200.35" routeLength="1986.69" waitingTime="49.60" waitingCount="1" stopTime="0.00" timeLoss="56.67" rerouteNo="1" devices="tripinfo_car_n2w_257 routing_car_n2w_257" vType="Car" speedFactor="1.00" vaporized=""/>
    <tripinfo id="car_s2e_282" depart="282.00" departLane="s2sep_1" departPos="3.60" departPosLat="0.00" departSpeed="13.90" departDelay="0.00" arrival="459.30" arrivalLane="c2e_1" arrivalPos="990.00" arrivalPosLat="0.00" arrivalSpeed="15.69" duration="177.30" routeLength="1986.69" waitingTime="31.90" waitingCount="1" stopTime="0.00" timeLoss="54.36" rerouteNo="1" devices="tripinfo_car_s2e_282 routing_car_s2e_282" vType="Car" speedFactor="1.17" vaporized=""/>
    <tripinfo id="car_n2w_287" depart="287.00" departLane="n2sep_1" departPos="3.60" departPosLat="0.00" departSpeed="13.90" departDelay="0.00" arrival="459.60" arrivalLane="c2w_1" arrivalPos="990.00" arrivalPosLat="0.00" arrivalSpeed="14.95" duration="172.60" routeLength="1986.69" waitingTime="26.30" waitingCount="1" stopTime="0.00" timeLoss="41.83" rerouteNo="1" devices="tripinfo_car_n2w_287 routing_car_n2w_287" vType="Car" speedFactor="1.10" vaporized=""/>
    <tripinfo id="car_n2e_278" depart="278.00" departLane="n2sep_1" departPos="3.60" departPosLat="0.00" departSpeed="13.90" departDelay="0.00" arrival="463.75" arrivalLane="c2e_1" arrivalPos="990.00" arrivalPosLat="0.00" arrivalSpeed="14.79" duration="185.75" routeLength="1996.47" waitingTime="37.65" waitingCount="2" stopTime="0.00" timeLoss="50.19" rerouteNo="1" devices="tripinfo_car_n2e_278 routing_car_n2e_278" vType="Car" speedFactor="1.06" vaporized=""/>
    <tripinfo id="car_s2n_296" depart="296.00" departLane="s2sep_1" departPos="3.60" departPosLat="0.00" departSpeed="13.90" departDelay="0.00" arrival="463.80" arrivalLane="c2n_1" arrivalPos="990.00" arrivalPosLat="0.00" arrivalSpeed="13.94" duration="167.80" routeLength="1997.01" waitingTime="14.05" waitingCount="1" stopTime="0.00" timeLoss="24.59" rerouteNo="1" devices="tripinfo_car_s2n_296 routing_car_s2n_296" vType="Car" speedFactor="1.00" vaporized=""/>
    <tripinfo id="car_n2w_291" depart="291.00" departLane="n2sep_1" departPos="3.60" departPosLat="0.00" departSpeed="13.90" departDelay="0.00" arrival="463.85" arrivalLane="c2w_1" arrivalPos="990.00" arrivalPosLat="0.00" arrivalSpeed="14.01" duration="172.85" routeLength="1986.69" waitingTime="18.00" waitingCount="1" stopTime="0.00" timeLoss="30.47" rerouteNo="1" devices="tripinfo_car_n2w_291 routing_car_n2w_291" vType="Car" speedFactor="1.01" vaporized=""/>
    <tripinfo id="car_n2w_309" depart="309.00" departLane="n2sep_1" departPos="3.60" departPosLat="0.00" departSpeed="13.90" departDelay="0.00" arrival="466.85" arrivalLane="c2w_1" arrivalPos="990.00" arrivalPosLat="0.00" arrivalSpeed="14.26" duration="157.85" routeLength="1986.69" waitingTime="2.90" waitingCount="1" stopTime="0.00" timeLoss="18.55" rerouteNo="1" devices="tripinfo_car_n2w_309 routing_car_n2w_309" vType="Car" speedFactor="1.03" vaporized=""/>
    <tripinfo id="car_s2w_243" depart="243.30" departLane="s2sep_1" departPos="3.60" departPosLat="0.00" departSpeed="13.90" departDelay="0.30" arrival="469.25" arrivalLane="c2w_1" arrivalPos="990.00" arrivalPosLat="0.00" arrivalSpeed="14.60" duration="225.95" routeLength="1996.47" waitingTime="71.75" waitingCount="2" stopTime="0.00" timeLoss="90.45" rerouteNo="1" devices="tripinfo_car_s2w_243 routing_car_s2w_243" vType="Car" speedFactor="1.07" vaporized=""/>
    <tripinfo id="car_n2e_318" depart="318.00" departLane="n2sep_1" departPos="3.60" departPosLat="0.00" departSpeed="13.90" departDelay="0.00" arrival="470.15" arrivalLane="c2e_1" arrivalPos="990.00" arrivalPosLat="0.00" arrivalSpeed="13.90" duration="152.15" routeLength="1996.47" waitingTime="0.00" waitingCount="0" stopTime="0.00" timeLoss="7.83" rerouteNo="1" devices="tripinfo_car_n2e_318 routing_car_n2e_318" vType="Car" speedFactor="1.00" vaporized=""/>
</tripinfos>
