%!PS-Adobe-3.0 EPSF-3.0
%%Creator: (MATLAB, The Mathworks, Inc. Version 9.9.0.1524771 \(R2020b\) Update 2. Operating System: Linux)
%%Title: ../pictures/visualize_cost/V.eps
%%CreationDate: 2021-02-09T17:51:50
%%Pages: (atend)
%%BoundingBox:    20     1   558   282
%%LanguageLevel: 3
%%EndComments
%%BeginProlog
%%BeginResource: procset (Apache XML Graphics Std ProcSet) 1.2 0
%%Version: 1.2 0
%%Copyright: (Copyright 2001-2003,2010 The Apache Software Foundation. License terms: http://www.apache.org/licenses/LICENSE-2.0)
/bd{bind def}bind def
/ld{load def}bd
/GR/grestore ld
/GS/gsave ld
/RM/rmoveto ld
/C/curveto ld
/t/show ld
/L/lineto ld
/ML/setmiterlimit ld
/CT/concat ld
/f/fill ld
/N/newpath ld
/S/stroke ld
/CC/setcmykcolor ld
/A/ashow ld
/cp/closepath ld
/RC/setrgbcolor ld
/LJ/setlinejoin ld
/GC/setgray ld
/LW/setlinewidth ld
/M/moveto ld
/re {4 2 roll M
1 index 0 rlineto
0 exch rlineto
neg 0 rlineto
cp } bd
/_ctm matrix def
/_tm matrix def
/BT { _ctm currentmatrix pop matrix _tm copy pop 0 0 moveto } bd
/ET { _ctm setmatrix } bd
/iTm { _ctm setmatrix _tm concat } bd
/Tm { _tm astore pop iTm 0 0 moveto } bd
/ux 0.0 def
/uy 0.0 def
/F {
  /Tp exch def
  /Tf exch def
  Tf findfont Tp scalefont setfont
  /cf Tf def  /cs Tp def
} bd
/ULS {currentpoint /uy exch def /ux exch def} bd
/ULE {
  /Tcx currentpoint pop def
  gsave
  newpath
  cf findfont cs scalefont dup
  /FontMatrix get 0 get /Ts exch def /FontInfo get dup
  /UnderlinePosition get Ts mul /To exch def
  /UnderlineThickness get Ts mul /Tt exch def
  ux uy To add moveto  Tcx uy To add lineto
  Tt setlinewidth stroke
  grestore
} bd
/OLE {
  /Tcx currentpoint pop def
  gsave
  newpath
  cf findfont cs scalefont dup
  /FontMatrix get 0 get /Ts exch def /FontInfo get dup
  /UnderlinePosition get Ts mul /To exch def
  /UnderlineThickness get Ts mul /Tt exch def
  ux uy To add cs add moveto Tcx uy To add cs add lineto
  Tt setlinewidth stroke
  grestore
} bd
/SOE {
  /Tcx currentpoint pop def
  gsave
  newpath
  cf findfont cs scalefont dup
  /FontMatrix get 0 get /Ts exch def /FontInfo get dup
  /UnderlinePosition get Ts mul /To exch def
  /UnderlineThickness get Ts mul /Tt exch def
  ux uy To add cs 10 mul 26 idiv add moveto Tcx uy To add cs 10 mul 26 idiv add lineto
  Tt setlinewidth stroke
  grestore
} bd
/QT {
/Y22 exch store
/X22 exch store
/Y21 exch store
/X21 exch store
currentpoint
/Y21 load 2 mul add 3 div exch
/X21 load 2 mul add 3 div exch
/X21 load 2 mul /X22 load add 3 div
/Y21 load 2 mul /Y22 load add 3 div
/X22 load /Y22 load curveto
} bd
/SSPD {
dup length /d exch dict def
{
/v exch def
/k exch def
currentpagedevice k known {
/cpdv currentpagedevice k get def
v cpdv ne {
/upd false def
/nullv v type /nulltype eq def
/nullcpdv cpdv type /nulltype eq def
nullv nullcpdv or
{
/upd true def
} {
/sametype v type cpdv type eq def
sametype {
v type /arraytype eq {
/vlen v length def
/cpdvlen cpdv length def
vlen cpdvlen eq {
0 1 vlen 1 sub {
/i exch def
/obj v i get def
/cpdobj cpdv i get def
obj cpdobj ne {
/upd true def
exit
} if
} for
} {
/upd true def
} ifelse
} {
v type /dicttype eq {
v {
/dv exch def
/dk exch def
/cpddv cpdv dk get def
dv cpddv ne {
/upd true def
exit
} if
} forall
} {
/upd true def
} ifelse
} ifelse
} if
} ifelse
upd true eq {
d k v put
} if
} if
} if
} forall
d length 0 gt {
d setpagedevice
} if
} bd
/RE { % /NewFontName [NewEncodingArray] /FontName RE -
  findfont dup length dict begin
  {
    1 index /FID ne
    {def} {pop pop} ifelse
  } forall
  /Encoding exch def
  /FontName 1 index def
  currentdict definefont pop
  end
} bind def
%%EndResource
%%BeginResource: procset (Apache XML Graphics EPS ProcSet) 1.0 0
%%Version: 1.0 0
%%Copyright: (Copyright 2002-2003 The Apache Software Foundation. License terms: http://www.apache.org/licenses/LICENSE-2.0)
/BeginEPSF { %def
/b4_Inc_state save def         % Save state for cleanup
/dict_count countdictstack def % Count objects on dict stack
/op_count count 1 sub def      % Count objects on operand stack
userdict begin                 % Push userdict on dict stack
/showpage { } def              % Redefine showpage, { } = null proc
0 setgray 0 setlinecap         % Prepare graphics state
1 setlinewidth 0 setlinejoin
10 setmiterlimit [ ] 0 setdash newpath
/languagelevel where           % If level not equal to 1 then
{pop languagelevel             % set strokeadjust and
1 ne                           % overprint to their defaults.
{false setstrokeadjust false setoverprint
} if
} if
} bd
/EndEPSF { %def
count op_count sub {pop} repeat            % Clean up stacks
countdictstack dict_count sub {end} repeat
b4_Inc_state restore
} bd
%%EndResource
%FOPBeginFontDict
%%IncludeResource: font Courier-Oblique
%%IncludeResource: font Courier-BoldOblique
%%IncludeResource: font Courier-Bold
%%IncludeResource: font ZapfDingbats
%%IncludeResource: font Symbol
%%IncludeResource: font Helvetica
%%IncludeResource: font Helvetica-Oblique
%%IncludeResource: font Helvetica-Bold
%%IncludeResource: font Helvetica-BoldOblique
%%IncludeResource: font Times-Roman
%%IncludeResource: font Times-Italic
%%IncludeResource: font Times-Bold
%%IncludeResource: font Times-BoldItalic
%%IncludeResource: font Courier
%FOPEndFontDict
%%BeginResource: encoding WinAnsiEncoding
/WinAnsiEncoding [
/.notdef /.notdef /.notdef /.notdef /.notdef
/.notdef /.notdef /.notdef /.notdef /.notdef
/.notdef /.notdef /.notdef /.notdef /.notdef
/.notdef /.notdef /.notdef /.notdef /.notdef
/.notdef /.notdef /.notdef /.notdef /.notdef
/.notdef /.notdef /.notdef /.notdef /.notdef
/.notdef /.notdef /space /exclam /quotedbl
/numbersign /dollar /percent /ampersand /quotesingle
/parenleft /parenright /asterisk /plus /comma
/hyphen /period /slash /zero /one
/two /three /four /five /six
/seven /eight /nine /colon /semicolon
/less /equal /greater /question /at
/A /B /C /D /E
/F /G /H /I /J
/K /L /M /N /O
/P /Q /R /S /T
/U /V /W /X /Y
/Z /bracketleft /backslash /bracketright /asciicircum
/underscore /quoteleft /a /b /c
/d /e /f /g /h
/i /j /k /l /m
/n /o /p /q /r
/s /t /u /v /w
/x /y /z /braceleft /bar
/braceright /asciitilde /bullet /Euro /bullet
/quotesinglbase /florin /quotedblbase /ellipsis /dagger
/daggerdbl /circumflex /perthousand /Scaron /guilsinglleft
/OE /bullet /Zcaron /bullet /bullet
/quoteleft /quoteright /quotedblleft /quotedblright /bullet
/endash /emdash /asciitilde /trademark /scaron
/guilsinglright /oe /bullet /zcaron /Ydieresis
/space /exclamdown /cent /sterling /currency
/yen /brokenbar /section /dieresis /copyright
/ordfeminine /guillemotleft /logicalnot /sfthyphen /registered
/macron /degree /plusminus /twosuperior /threesuperior
/acute /mu /paragraph /middot /cedilla
/onesuperior /ordmasculine /guillemotright /onequarter /onehalf
/threequarters /questiondown /Agrave /Aacute /Acircumflex
/Atilde /Adieresis /Aring /AE /Ccedilla
/Egrave /Eacute /Ecircumflex /Edieresis /Igrave
/Iacute /Icircumflex /Idieresis /Eth /Ntilde
/Ograve /Oacute /Ocircumflex /Otilde /Odieresis
/multiply /Oslash /Ugrave /Uacute /Ucircumflex
/Udieresis /Yacute /Thorn /germandbls /agrave
/aacute /acircumflex /atilde /adieresis /aring
/ae /ccedilla /egrave /eacute /ecircumflex
/edieresis /igrave /iacute /icircumflex /idieresis
/eth /ntilde /ograve /oacute /ocircumflex
/otilde /odieresis /divide /oslash /ugrave
/uacute /ucircumflex /udieresis /yacute /thorn
/ydieresis
] def
%%EndResource
%FOPBeginFontReencode
/Courier-Oblique findfont
dup length dict begin
  {1 index /FID ne {def} {pop pop} ifelse} forall
  /Encoding WinAnsiEncoding def
  currentdict
end
/Courier-Oblique exch definefont pop
/Courier-BoldOblique findfont
dup length dict begin
  {1 index /FID ne {def} {pop pop} ifelse} forall
  /Encoding WinAnsiEncoding def
  currentdict
end
/Courier-BoldOblique exch definefont pop
/Courier-Bold findfont
dup length dict begin
  {1 index /FID ne {def} {pop pop} ifelse} forall
  /Encoding WinAnsiEncoding def
  currentdict
end
/Courier-Bold exch definefont pop
/Helvetica findfont
dup length dict begin
  {1 index /FID ne {def} {pop pop} ifelse} forall
  /Encoding WinAnsiEncoding def
  currentdict
end
/Helvetica exch definefont pop
/Helvetica-Oblique findfont
dup length dict begin
  {1 index /FID ne {def} {pop pop} ifelse} forall
  /Encoding WinAnsiEncoding def
  currentdict
end
/Helvetica-Oblique exch definefont pop
/Helvetica-Bold findfont
dup length dict begin
  {1 index /FID ne {def} {pop pop} ifelse} forall
  /Encoding WinAnsiEncoding def
  currentdict
end
/Helvetica-Bold exch definefont pop
/Helvetica-BoldOblique findfont
dup length dict begin
  {1 index /FID ne {def} {pop pop} ifelse} forall
  /Encoding WinAnsiEncoding def
  currentdict
end
/Helvetica-BoldOblique exch definefont pop
/Times-Roman findfont
dup length dict begin
  {1 index /FID ne {def} {pop pop} ifelse} forall
  /Encoding WinAnsiEncoding def
  currentdict
end
/Times-Roman exch definefont pop
/Times-Italic findfont
dup length dict begin
  {1 index /FID ne {def} {pop pop} ifelse} forall
  /Encoding WinAnsiEncoding def
  currentdict
end
/Times-Italic exch definefont pop
/Times-Bold findfont
dup length dict begin
  {1 index /FID ne {def} {pop pop} ifelse} forall
  /Encoding WinAnsiEncoding def
  currentdict
end
/Times-Bold exch definefont pop
/Times-BoldItalic findfont
dup length dict begin
  {1 index /FID ne {def} {pop pop} ifelse} forall
  /Encoding WinAnsiEncoding def
  currentdict
end
/Times-BoldItalic exch definefont pop
/Courier findfont
dup length dict begin
  {1 index /FID ne {def} {pop pop} ifelse} forall
  /Encoding WinAnsiEncoding def
  currentdict
end
/Courier exch definefont pop
%FOPEndFontReencode
%%EndProlog
%%Page: 1 1
%%PageBoundingBox: 0 0 600 300
%%BeginPageSetup
[1 0 0 -1 0 300] CT
%%EndPageSetup
GS
[0.75 0 0 0.75 0 0] CT
1 GC
N
0 0 800 400 re
f
GR
GS
[0.75 0 0 0.75 0 0] CT
1 GC
N
0 0 800 400 re
f
GR
GS
[0.75 0 0 0.75 0 0] CT
1 GC
N
79 352 M
548 352 L
548 30 L
79 30 L
cp
f
GR
GS
[0.75 0 0 0.75 0 0] CT
0.873 GC
1 LJ
0.667 LW
N
79 352 M
79 30 L
S
GR
GS
[0.75 0 0 0.75 0 0] CT
0.873 GC
1 LJ
0.667 LW
N
130.089 352 M
130.089 30 L
S
GR
GS
[0.75 0 0 0.75 0 0] CT
0.873 GC
1 LJ
0.667 LW
N
181.179 352 M
181.179 30 L
S
GR
GS
[0.75 0 0 0.75 0 0] CT
0.873 GC
1 LJ
0.667 LW
N
232.268 352 M
232.268 30 L
S
GR
GS
[0.75 0 0 0.75 0 0] CT
0.873 GC
1 LJ
0.667 LW
N
283.357 352 M
283.357 30 L
S
GR
GS
[0.75 0 0 0.75 0 0] CT
0.873 GC
1 LJ
0.667 LW
N
334.447 352 M
334.447 30 L
S
GR
GS
[0.75 0 0 0.75 0 0] CT
0.873 GC
1 LJ
0.667 LW
N
385.536 352 M
385.536 30 L
S
GR
GS
[0.75 0 0 0.75 0 0] CT
0.873 GC
1 LJ
0.667 LW
N
436.625 352 M
436.625 30 L
S
GR
GS
[0.75 0 0 0.75 0 0] CT
0.873 GC
1 LJ
0.667 LW
N
487.715 352 M
487.715 30 L
S
GR
GS
[0.75 0 0 0.75 0 0] CT
0.873 GC
1 LJ
0.667 LW
N
538.804 352 M
538.804 30 L
S
GR
GS
[0.75 0 0 0.75 0 0] CT
0.873 GC
1 LJ
0.667 LW
N
548 352 M
79 352 L
S
GR
GS
[0.75 0 0 0.75 0 0] CT
0.873 GC
1 LJ
0.667 LW
N
548 306 M
79 306 L
S
GR
GS
[0.75 0 0 0.75 0 0] CT
0.873 GC
1 LJ
0.667 LW
N
548 260 M
79 260 L
S
GR
GS
[0.75 0 0 0.75 0 0] CT
0.873 GC
1 LJ
0.667 LW
N
548 214 M
79 214 L
S
GR
GS
[0.75 0 0 0.75 0 0] CT
0.873 GC
1 LJ
0.667 LW
N
548 168 M
79 168 L
S
GR
GS
[0.75 0 0 0.75 0 0] CT
0.873 GC
1 LJ
0.667 LW
N
548 122 M
79 122 L
S
GR
GS
[0.75 0 0 0.75 0 0] CT
0.873 GC
1 LJ
0.667 LW
N
548 76 M
79 76 L
S
GR
GS
[0.75 0 0 0.75 0 0] CT
0.873 GC
1 LJ
0.667 LW
N
548 30 M
79 30 L
S
GR
GS
[0.75 0 0 0.75 0 0] CT
0.149 GC
2 setlinecap
1 LJ
0.667 LW
N
79 352 M
548 352 L
S
GR
GS
[0.75 0 0 0.75 0 0] CT
0.149 GC
2 setlinecap
1 LJ
0.667 LW
N
79 352 M
79 347.31 L
S
GR
GS
[0.75 0 0 0.75 0 0] CT
0.149 GC
2 setlinecap
1 LJ
0.667 LW
N
130.089 352 M
130.089 347.31 L
S
GR
GS
[0.75 0 0 0.75 0 0] CT
0.149 GC
2 setlinecap
1 LJ
0.667 LW
N
181.179 352 M
181.179 347.31 L
S
GR
GS
[0.75 0 0 0.75 0 0] CT
0.149 GC
2 setlinecap
1 LJ
0.667 LW
N
232.268 352 M
232.268 347.31 L
S
GR
GS
[0.75 0 0 0.75 0 0] CT
0.149 GC
2 setlinecap
1 LJ
0.667 LW
N
283.357 352 M
283.357 347.31 L
S
GR
GS
[0.75 0 0 0.75 0 0] CT
0.149 GC
2 setlinecap
1 LJ
0.667 LW
N
334.447 352 M
334.447 347.31 L
S
GR
GS
[0.75 0 0 0.75 0 0] CT
0.149 GC
2 setlinecap
1 LJ
0.667 LW
N
385.536 352 M
385.536 347.31 L
S
GR
GS
[0.75 0 0 0.75 0 0] CT
0.149 GC
2 setlinecap
1 LJ
0.667 LW
N
436.625 352 M
436.625 347.31 L
S
GR
GS
[0.75 0 0 0.75 0 0] CT
0.149 GC
2 setlinecap
1 LJ
0.667 LW
N
487.715 352 M
487.715 347.31 L
S
GR
GS
[0.75 0 0 0.75 0 0] CT
0.149 GC
2 setlinecap
1 LJ
0.667 LW
N
538.804 352 M
538.804 347.31 L
S
GR
GS
[0.75 0 0 0.75 59.25 268.00001] CT
0.149 GC
/Helvetica 13.333 F
GS
[1 0 0 1 0 0] CT
-4.5 13 moveto 
1 -1 scale
(0) t 
GR
GR
GS
[0.75 0 0 0.75 97.56699 268.00001] CT
0.149 GC
/Helvetica 13.333 F
GS
[1 0 0 1 0 0] CT
-8.5 13 moveto 
1 -1 scale
(10) t 
GR
GR
GS
[0.75 0 0 0.75 135.88399 268.00001] CT
0.149 GC
/Helvetica 13.333 F
GS
[1 0 0 1 0 0] CT
-8.5 13 moveto 
1 -1 scale
(20) t 
GR
GR
GS
[0.75 0 0 0.75 174.20098 268.00001] CT
0.149 GC
/Helvetica 13.333 F
GS
[1 0 0 1 0 0] CT
-8.5 13 moveto 
1 -1 scale
(30) t 
GR
GR
GS
[0.75 0 0 0.75 212.51797 268.00001] CT
0.149 GC
/Helvetica 13.333 F
GS
[1 0 0 1 0 0] CT
-8.5 13 moveto 
1 -1 scale
(40) t 
GR
GR
GS
[0.75 0 0 0.75 250.83497 268.00001] CT
0.149 GC
/Helvetica 13.333 F
GS
[1 0 0 1 0 0] CT
-8.5 13 moveto 
1 -1 scale
(50) t 
GR
GR
GS
[0.75 0 0 0.75 289.15196 268.00001] CT
0.149 GC
/Helvetica 13.333 F
GS
[1 0 0 1 0 0] CT
-8.5 13 moveto 
1 -1 scale
(60) t 
GR
GR
GS
[0.75 0 0 0.75 327.46896 268.00001] CT
0.149 GC
/Helvetica 13.333 F
GS
[1 0 0 1 0 0] CT
-8.5 13 moveto 
1 -1 scale
(70) t 
GR
GR
GS
[0.75 0 0 0.75 365.78595 268.00001] CT
0.149 GC
/Helvetica 13.333 F
GS
[1 0 0 1 0 0] CT
-8.5 13 moveto 
1 -1 scale
(80) t 
GR
GR
GS
[0.75 0 0 0.75 404.10292 268.00001] CT
0.149 GC
/Helvetica 13.333 F
GS
[1 0 0 1 0 0] CT
-8.5 13 moveto 
1 -1 scale
(90) t 
GR
GR
GS
[0.75 0 0 0.75 235.12516 282] CT
0.149 GC
N
-12.62 15.175 M
-12.62 14.878 -12.557 14.628 QT
-11.104 8.878 L
-13.214 8.878 L
-13.417 8.878 -13.417 8.612 QT
-13.339 8.175 -13.151 8.175 QT
-10.932 8.175 L
-10.135 4.909 L
-10.057 4.644 -9.823 4.464 QT
-9.589 4.284 -9.292 4.284 QT
-9.042 4.284 -8.87 4.433 QT
-8.698 4.581 -8.698 4.831 QT
-8.698 4.894 -8.706 4.925 QT
-8.714 4.956 -8.714 5.003 QT
-9.51 8.175 L
-7.464 8.175 L
-7.245 8.175 -7.245 8.441 QT
-7.26 8.487 -7.292 8.605 QT
-7.323 8.722 -7.37 8.8 QT
-7.417 8.878 -7.51 8.878 QT
-9.698 8.878 L
-11.135 14.659 L
-11.276 15.222 -11.276 15.644 QT
-11.276 16.503 -10.682 16.503 QT
-9.807 16.503 -9.128 15.675 QT
-8.448 14.847 -8.089 13.862 QT
-8.01 13.737 -7.932 13.737 QT
-7.698 13.737 L
-7.62 13.737 -7.565 13.792 QT
-7.51 13.847 -7.51 13.925 QT
-7.51 13.956 -7.542 13.972 QT
-7.979 15.191 -8.815 16.105 QT
-9.651 17.019 -10.745 17.019 QT
-11.526 17.019 -12.073 16.503 QT
-12.62 15.987 -12.62 15.175 QT
cp
f
GR
GS
[0.75 0 0 0.75 235.12516 282] CT
0.149 GC
N
-4.273 21.8 M
-4.273 1.8 L
-1.538 1.8 L
-1.538 2.597 L
-3.46 2.597 L
-3.46 21.003 L
-1.538 21.003 L
-1.538 21.8 L
-4.273 21.8 L
cp
f
GR
GS
[0.75 0 0 0.75 235.12516 282] CT
0.149 GC
N
0.658 15.581 M
1.205 16.503 2.814 16.503 QT
3.517 16.503 4.158 16.261 QT
4.799 16.019 5.213 15.542 QT
5.627 15.066 5.627 14.378 QT
5.627 13.862 5.252 13.526 QT
4.877 13.191 4.345 13.081 QT
3.267 12.862 L
2.517 12.675 2.041 12.167 QT
1.564 11.659 1.564 10.941 QT
1.564 10.05 2.049 9.37 QT
2.533 8.691 3.322 8.323 QT
4.111 7.956 4.955 7.956 QT
5.861 7.956 6.58 8.394 QT
7.299 8.831 7.299 9.675 QT
7.299 10.144 7.041 10.495 QT
6.783 10.847 6.33 10.847 QT
6.064 10.847 5.877 10.675 QT
5.689 10.503 5.689 10.237 QT
5.689 10.003 5.814 9.784 QT
5.939 9.566 6.166 9.433 QT
6.392 9.3 6.627 9.3 QT
6.439 8.862 5.955 8.667 QT
5.47 8.472 4.924 8.472 QT
4.408 8.472 3.9 8.683 QT
3.392 8.894 3.088 9.284 QT
2.783 9.675 2.783 10.222 QT
2.783 10.581 3.033 10.855 QT
3.283 11.128 3.658 11.237 QT
4.83 11.472 L
5.377 11.597 5.845 11.894 QT
6.314 12.191 6.58 12.644 QT
6.845 13.097 6.845 13.691 QT
6.845 14.425 6.431 15.151 QT
6.017 15.878 5.408 16.3 QT
4.345 17.019 2.799 17.019 QT
1.736 17.019 0.845 16.534 QT
-0.045 16.05 -0.045 15.081 QT
-0.045 14.534 0.275 14.128 QT
0.595 13.722 1.142 13.722 QT
1.47 13.722 1.689 13.917 QT
1.908 14.112 1.908 14.441 QT
1.908 14.894 1.564 15.237 QT
1.22 15.581 0.767 15.581 QT
0.658 15.581 L
cp
f
GR
GS
[0.75 0 0 0.75 235.12516 282] CT
0.149 GC
N
8.736 21.8 M
8.736 21.003 L
10.689 21.003 L
10.689 2.597 L
8.736 2.597 L
8.736 1.8 L
11.486 1.8 L
11.486 21.8 L
8.736 21.8 L
cp
f
GR
GS
[0.75 0 0 0.75 0 0] CT
0.149 GC
2 setlinecap
1 LJ
0.667 LW
N
79 352 M
79 30 L
S
GR
GS
[0.75 0 0 0.75 0 0] CT
0.149 GC
2 setlinecap
1 LJ
0.667 LW
N
79 352 M
83.69 352 L
S
GR
GS
[0.75 0 0 0.75 0 0] CT
0.149 GC
2 setlinecap
1 LJ
0.667 LW
N
79 306 M
83.69 306 L
S
GR
GS
[0.75 0 0 0.75 0 0] CT
0.149 GC
2 setlinecap
1 LJ
0.667 LW
N
79 260 M
83.69 260 L
S
GR
GS
[0.75 0 0 0.75 0 0] CT
0.149 GC
2 setlinecap
1 LJ
0.667 LW
N
79 214 M
83.69 214 L
S
GR
GS
[0.75 0 0 0.75 0 0] CT
0.149 GC
2 setlinecap
1 LJ
0.667 LW
N
79 168 M
83.69 168 L
S
GR
GS
[0.75 0 0 0.75 0 0] CT
0.149 GC
2 setlinecap
1 LJ
0.667 LW
N
79 122 M
83.69 122 L
S
GR
GS
[0.75 0 0 0.75 0 0] CT
0.149 GC
2 setlinecap
1 LJ
0.667 LW
N
79 76 M
83.69 76 L
S
GR
GS
[0.75 0 0 0.75 0 0] CT
0.149 GC
2 setlinecap
1 LJ
0.667 LW
N
79 30 M
83.69 30 L
S
GR
GS
[0.75 0 0 0.75 55.25 264] CT
0.149 GC
/Helvetica 13.333 F
GS
[1 0 0 1 0 0] CT
-9 4.5 moveto 
1 -1 scale
(0) t 
GR
GR
GS
[0.75 0 0 0.75 55.25 229.5] CT
0.149 GC
/Helvetica 13.333 F
GS
[1 0 0 1 0 0] CT
-22 4.5 moveto 
1 -1 scale
(0.2) t 
GR
GR
GS
[0.75 0 0 0.75 55.25 195] CT
0.149 GC
/Helvetica 13.333 F
GS
[1 0 0 1 0 0] CT
-22 4.5 moveto 
1 -1 scale
(0.4) t 
GR
GR
GS
[0.75 0 0 0.75 55.25 160.5] CT
0.149 GC
/Helvetica 13.333 F
GS
[1 0 0 1 0 0] CT
-22 4.5 moveto 
1 -1 scale
(0.6) t 
GR
GR
GS
[0.75 0 0 0.75 55.25 126] CT
0.149 GC
/Helvetica 13.333 F
GS
[1 0 0 1 0 0] CT
-22 4.5 moveto 
1 -1 scale
(0.8) t 
GR
GR
GS
[0.75 0 0 0.75 55.25 91.5] CT
0.149 GC
/Helvetica 13.333 F
GS
[1 0 0 1 0 0] CT
-9 4.5 moveto 
1 -1 scale
(1) t 
GR
GR
GS
[0.75 0 0 0.75 55.25 56.99999] CT
0.149 GC
/Helvetica 13.333 F
GS
[1 0 0 1 0 0] CT
-22 4.5 moveto 
1 -1 scale
(1.2) t 
GR
GR
GS
[0.75 0 0 0.75 55.25 22.5] CT
0.149 GC
/Helvetica 13.333 F
GS
[1 0 0 1 0 0] CT
-22 4.5 moveto 
1 -1 scale
(1.4) t 
GR
GR
GS
[0 -0.75 0.75 0 35.75 143.24989] CT
0.149 GC
N
-4.335 -8.403 M
-4.132 -7.841 -3.608 -7.559 QT
-3.085 -7.278 -2.46 -7.278 QT
-1.835 -7.278 -1.257 -7.716 QT
-0.679 -8.153 -0.273 -8.802 QT
0.134 -9.45 0.29 -10.106 QT
2.649 -19.559 L
2.681 -19.638 2.681 -19.677 QT
2.681 -19.716 2.696 -19.763 QT
2.696 -19.981 2.54 -20.028 QT
2.009 -20.153 0.399 -20.153 QT
0.196 -20.153 0.196 -20.419 QT
0.227 -20.575 0.251 -20.669 QT
0.274 -20.763 0.345 -20.809 QT
0.415 -20.856 0.54 -20.856 QT
5.962 -20.856 L
6.149 -20.856 6.149 -20.606 QT
6.071 -20.153 5.899 -20.153 QT
5.196 -20.153 4.837 -20.052 QT
4.477 -19.95 4.337 -19.481 QT
1.977 -10.028 L
1.743 -9.091 1.056 -8.349 QT
0.368 -7.606 -0.577 -7.184 QT
-1.523 -6.763 -2.476 -6.763 QT
-3.538 -6.763 -4.335 -7.349 QT
-5.132 -7.934 -5.132 -8.934 QT
-5.132 -9.606 -4.773 -10.083 QT
-4.413 -10.559 -3.741 -10.559 QT
-3.366 -10.559 -3.108 -10.325 QT
-2.851 -10.091 -2.851 -9.716 QT
-2.851 -9.184 -3.249 -8.786 QT
-3.648 -8.388 -4.179 -8.388 QT
-4.288 -8.388 -4.335 -8.403 QT
cp
f
GR
GS
[0.75 0 0 0.75 0 0] CT
0 0.447 0.741 RC
1 LJ
2.667 LW
N
79 122 M
83.737 129.804 L
88.475 137.422 L
93.212 144.854 L
97.949 152.105 L
102.687 159.175 L
107.424 166.069 L
112.162 172.789 L
116.899 179.336 L
121.636 185.715 L
126.374 191.926 L
131.111 197.973 L
135.848 203.859 L
140.586 209.585 L
145.323 215.155 L
150.061 220.57 L
154.798 225.833 L
159.535 230.947 L
164.273 235.914 L
169.01 240.737 L
173.747 245.418 L
178.485 249.959 L
183.222 254.362 L
187.96 258.631 L
192.697 262.768 L
197.434 266.775 L
202.172 270.654 L
206.909 274.407 L
211.646 278.038 L
216.384 281.548 L
221.121 284.94 L
225.859 288.216 L
230.596 291.378 L
235.333 294.428 L
240.071 297.37 L
244.808 300.205 L
249.545 302.935 L
254.283 305.563 L
259.02 308.09 L
263.758 310.52 L
268.495 312.854 L
273.232 315.095 L
277.97 317.244 L
282.707 319.304 L
287.444 321.277 L
292.182 323.165 L
296.919 324.97 L
301.657 326.695 L
306.394 328.341 L
311.131 329.91 L
315.869 331.406 L
320.606 332.829 L
325.343 334.181 L
330.081 335.466 L
334.818 336.684 L
339.556 337.838 L
344.293 338.929 L
349.03 339.961 L
353.768 340.934 L
358.505 341.85 L
363.242 342.712 L
367.98 343.522 L
372.717 344.28 L
377.455 344.99 L
382.192 345.653 L
386.929 346.271 L
391.667 346.845 L
396.404 347.378 L
401.141 322.416 L
405.879 280.796 L
410.616 245.448 L
415.354 214.646 L
420.091 187.607 L
424.828 164.011 L
429.566 143.631 L
434.303 126.436 L
439.04 112.425 L
443.778 101.682 L
448.515 94.202 L
453.253 89.659 L
457.99 87.437 L
462.727 86.864 L
467.465 87.282 L
472.202 88.122 L
476.939 89.023 L
481.677 351.78 L
486.414 351.835 L
491.152 351.88 L
495.889 351.915 L
500.626 59.767 L
505.364 46.038 L
510.101 36.409 L
514.838 32.982 L
519.576 32.421 L
524.313 32.606 L
529.051 33.034 L
533.788 33.463 L
538.525 33.856 L
543.263 34.225 L
548 34.618 L
S
GR
GS
[0.75 0 0 0.75 0 0] CT
0.851 0.325 0.098 RC
1 LJ
2.667 LW
N
79 122 M
82.79 129.804 L
86.58 137.422 L
90.37 144.854 L
94.16 152.105 L
97.949 159.175 L
101.739 166.069 L
105.529 172.789 L
109.319 179.336 L
113.109 185.715 L
116.899 191.926 L
120.689 197.973 L
124.479 203.859 L
128.269 209.585 L
132.059 215.155 L
135.848 220.57 L
139.638 225.833 L
143.428 230.947 L
147.218 235.914 L
151.008 240.737 L
154.798 245.418 L
158.588 249.959 L
162.378 254.362 L
166.168 258.631 L
169.958 262.768 L
173.747 266.775 L
177.537 270.654 L
181.327 274.407 L
185.117 278.038 L
188.907 281.548 L
192.697 284.94 L
196.487 288.216 L
200.277 291.378 L
204.067 294.428 L
207.857 297.37 L
211.646 300.205 L
215.436 302.935 L
219.226 305.563 L
223.016 308.09 L
226.806 310.52 L
230.596 312.854 L
234.386 315.095 L
238.176 317.244 L
241.966 319.304 L
245.756 321.277 L
249.545 323.165 L
253.335 324.97 L
257.125 326.695 L
260.915 328.341 L
264.705 329.91 L
268.495 331.406 L
272.285 332.829 L
276.075 334.181 L
279.865 335.466 L
283.655 336.684 L
287.444 337.838 L
291.234 338.929 L
295.024 339.961 L
298.814 340.934 L
302.604 341.85 L
306.394 342.712 L
310.184 322.66 L
313.974 299.648 L
317.764 277.981 L
321.554 257.281 L
325.343 237.711 L
329.133 219.327 L
332.923 201.986 L
336.713 186.121 L
340.503 171.572 L
344.293 158.378 L
348.083 146.579 L
351.873 136.214 L
355.663 127.353 L
359.453 120.008 L
363.242 114.189 L
367.032 109.806 L
370.822 106.698 L
374.612 104.703 L
378.402 103.635 L
382.192 103.311 L
385.982 103.523 L
389.772 104.042 L
393.562 104.685 L
397.352 105.352 L
401.141 103.409 L
404.931 98.213 L
408.721 93.166 L
412.511 89.121 L
416.301 86.337 L
420.091 84.808 L
423.881 82.152 L
427.671 72.61 L
431.461 67.453 L
435.251 65.259 L
439.04 64.653 L
442.83 64.707 L
446.62 64.927 L
450.41 65.238 L
454.2 352 L
S
GR
GS
[0.75 0 0 0.75 0 0] CT
0.929 0.694 0.125 RC
1 LJ
2.667 LW
N
79 122 M
82.158 129.804 L
85.316 137.422 L
88.475 144.854 L
91.633 152.105 L
94.791 159.175 L
97.949 166.069 L
101.108 172.789 L
104.266 179.336 L
107.424 185.715 L
110.582 191.926 L
113.741 197.973 L
116.899 203.859 L
120.057 209.585 L
123.215 215.155 L
126.374 220.57 L
129.532 225.833 L
132.69 230.947 L
135.848 235.914 L
139.007 240.737 L
142.165 245.418 L
145.323 249.959 L
148.481 254.362 L
151.64 258.631 L
154.798 262.768 L
157.956 266.775 L
161.114 270.654 L
164.273 274.407 L
167.431 278.038 L
170.589 281.548 L
173.747 284.94 L
176.906 288.216 L
180.064 291.378 L
183.222 294.428 L
186.38 297.37 L
189.539 300.205 L
192.697 302.935 L
195.855 305.563 L
199.013 308.09 L
202.172 310.52 L
205.33 312.854 L
208.488 315.095 L
211.646 317.244 L
214.805 319.304 L
217.963 321.277 L
221.121 323.165 L
224.279 324.97 L
227.438 326.695 L
230.596 328.341 L
233.754 329.91 L
236.912 331.406 L
240.071 332.829 L
243.229 334.181 L
246.387 334.548 L
249.545 324.04 L
252.704 312.335 L
255.862 300.113 L
259.02 287.551 L
262.178 274.99 L
265.337 262.402 L
268.495 250.066 L
271.653 238.106 L
274.811 226.588 L
277.97 215.578 L
281.128 205.145 L
284.286 195.332 L
287.444 185.978 L
290.603 177.523 L
293.761 169.819 L
296.919 162.884 L
300.077 156.755 L
303.236 151.447 L
306.394 146.948 L
309.552 143.218 L
312.71 140.215 L
315.869 137.868 L
319.027 136.132 L
322.185 134.946 L
325.343 134.235 L
328.502 133.993 L
331.66 134.064 L
334.818 134.368 L
337.976 134.815 L
341.135 135.333 L
344.293 135.869 L
347.451 136.284 L
350.609 133.795 L
353.768 130.424 L
356.926 127.238 L
360.084 124.562 L
363.242 122.573 L
366.401 121.249 L
369.559 120.606 L
372.717 117.969 L
375.875 111.906 L
379.034 108.176 L
382.192 106.327 L
385.35 105.568 L
388.508 105.448 L
391.667 105.565 L
S
GR
GS
[0.75 0 0 0.75 0 0] CT
0.494 0.184 0.557 RC
1 LJ
2.667 LW
N
79 122 M
81.707 129.804 L
84.414 137.422 L
87.121 144.854 L
89.828 152.105 L
92.535 159.175 L
95.242 166.069 L
97.949 172.789 L
100.657 179.336 L
103.364 185.715 L
106.071 191.926 L
108.778 197.973 L
111.485 203.859 L
114.192 209.585 L
116.899 215.155 L
119.606 220.57 L
122.313 225.833 L
125.02 230.947 L
127.727 235.914 L
130.434 240.737 L
133.141 245.418 L
135.848 249.959 L
138.556 254.362 L
141.263 258.631 L
143.97 262.768 L
146.677 266.775 L
149.384 270.654 L
152.091 274.407 L
154.798 278.038 L
157.505 281.548 L
160.212 284.94 L
162.919 288.216 L
165.626 291.378 L
168.333 294.428 L
171.04 297.37 L
173.747 300.205 L
176.455 302.935 L
179.162 305.563 L
181.869 308.09 L
184.576 310.52 L
187.283 312.854 L
189.99 315.095 L
192.697 317.244 L
195.404 319.304 L
198.111 321.277 L
200.818 323.165 L
203.525 323.207 L
206.232 319.707 L
208.939 314.482 L
211.646 308.16 L
214.354 301.023 L
217.061 293.516 L
219.768 285.626 L
222.475 277.438 L
225.182 269.317 L
227.889 261.065 L
230.596 252.893 L
233.303 244.859 L
236.01 237.019 L
238.717 229.415 L
241.424 222.096 L
244.131 215.089 L
246.838 208.428 L
249.545 202.155 L
252.253 196.287 L
254.96 190.857 L
257.667 185.886 L
260.374 181.392 L
263.081 177.374 L
265.788 173.825 L
268.495 170.726 L
271.202 168.054 L
273.909 165.786 L
276.616 163.909 L
279.323 162.396 L
282.03 161.227 L
284.737 160.397 L
287.444 159.88 L
290.152 159.618 L
292.859 159.577 L
295.566 159.717 L
298.273 159.994 L
300.98 160.362 L
303.687 160.784 L
306.394 161.227 L
309.101 161.672 L
311.808 161.837 L
314.515 160.083 L
317.222 157.828 L
319.929 155.616 L
322.636 153.672 L
325.343 152.095 L
328.051 150.927 L
330.758 150.141 L
333.465 149.761 L
336.172 148.762 L
338.879 144.169 L
341.586 141.044 L
344.293 139.194 L
347 138.248 L
S
GR
GS
[0.75 0 0 0.75 0 0] CT
0.467 0.675 0.188 RC
1 LJ
2.667 LW
N
79 122 M
81.369 129.804 L
83.737 137.422 L
86.106 144.854 L
88.475 152.105 L
90.843 159.175 L
93.212 166.069 L
95.581 172.789 L
97.949 179.336 L
100.318 185.715 L
102.687 191.926 L
105.056 197.973 L
107.424 203.859 L
109.793 209.585 L
112.162 215.155 L
114.53 220.57 L
116.899 225.833 L
119.268 230.947 L
121.636 235.914 L
124.005 240.737 L
126.374 245.418 L
128.742 249.959 L
131.111 254.362 L
133.48 258.631 L
135.848 262.768 L
138.217 266.775 L
140.586 270.654 L
142.955 274.407 L
145.323 278.038 L
147.692 281.548 L
150.061 284.94 L
152.429 288.216 L
154.798 291.378 L
157.167 294.428 L
159.535 297.37 L
161.904 300.205 L
164.273 302.935 L
166.641 305.563 L
169.01 308.09 L
171.379 310.52 L
173.747 312.854 L
176.116 311.089 L
178.485 308.749 L
180.854 305.339 L
183.222 301.246 L
185.591 296.687 L
187.96 291.702 L
190.328 286.445 L
192.697 281.012 L
195.066 275.452 L
197.434 269.704 L
199.803 263.909 L
202.172 258.149 L
204.54 252.424 L
206.909 246.78 L
209.278 241.254 L
211.646 235.867 L
214.015 230.651 L
216.384 225.629 L
218.753 220.826 L
221.121 216.26 L
223.49 211.955 L
225.859 207.927 L
228.227 204.183 L
230.596 200.741 L
232.965 197.587 L
235.333 194.718 L
237.702 192.129 L
240.071 189.807 L
242.439 187.747 L
244.808 185.937 L
247.177 184.371 L
249.545 183.04 L
251.914 181.955 L
254.283 181.081 L
256.652 180.456 L
259.02 180.001 L
261.389 179.716 L
263.758 179.594 L
266.126 179.609 L
268.495 179.743 L
270.864 179.971 L
273.232 180.267 L
275.601 180.608 L
277.97 180.975 L
280.338 181.35 L
282.707 181.724 L
285.076 182.019 L
287.444 180.968 L
289.813 179.422 L
292.182 177.811 L
294.551 176.307 L
296.919 175.01 L
299.288 173.953 L
301.657 173.155 L
304.025 172.615 L
306.394 172.289 L
308.763 172.211 L
311.131 169.528 L
313.5 166.663 L
S
GR
GS
[0.75 0 0 0.75 0 0] CT
0.302 0.745 0.933 RC
1 LJ
2.667 LW
N
79 122 M
81.105 129.804 L
83.211 137.422 L
85.316 144.854 L
87.422 152.105 L
89.527 159.175 L
91.633 166.069 L
93.738 172.789 L
95.844 179.336 L
97.949 185.715 L
100.055 191.926 L
102.16 197.973 L
104.266 203.859 L
106.371 209.585 L
108.477 215.155 L
110.582 220.57 L
112.688 225.833 L
114.793 230.947 L
116.899 235.914 L
119.004 240.737 L
121.11 245.418 L
123.215 249.959 L
125.321 254.362 L
127.426 258.631 L
129.532 262.768 L
131.637 266.775 L
133.743 270.654 L
135.848 274.407 L
137.954 278.038 L
140.059 281.548 L
142.165 284.94 L
144.27 288.216 L
146.376 291.378 L
148.481 294.428 L
150.587 297.37 L
152.692 300.205 L
154.798 302.935 L
156.903 303.193 L
159.009 301.033 L
161.114 298.387 L
163.22 295.322 L
165.325 291.957 L
167.431 288.358 L
169.536 284.575 L
171.642 280.662 L
173.747 276.55 L
175.853 272.46 L
177.958 268.227 L
180.064 263.972 L
182.169 259.724 L
184.275 255.505 L
186.38 251.334 L
188.486 247.244 L
190.591 243.241 L
192.697 239.348 L
194.802 235.586 L
196.908 231.969 L
199.013 228.503 L
201.119 225.216 L
203.224 222.115 L
205.33 219.192 L
207.435 216.456 L
209.541 213.905 L
211.646 211.533 L
213.752 209.347 L
215.857 207.333 L
217.963 205.495 L
220.068 203.825 L
222.174 202.319 L
224.279 200.975 L
226.385 199.832 L
228.49 198.84 L
230.596 197.996 L
232.701 197.301 L
234.807 196.743 L
236.912 196.316 L
239.018 196.017 L
241.123 195.835 L
243.229 195.759 L
245.334 195.78 L
247.44 195.877 L
249.545 196.061 L
251.651 196.291 L
253.756 196.564 L
255.862 196.864 L
257.967 197.18 L
260.073 197.501 L
262.178 197.822 L
264.284 198.14 L
266.389 197.86 L
268.495 196.849 L
270.6 195.668 L
272.706 194.496 L
274.811 193.406 L
276.917 192.461 L
279.022 191.666 L
281.128 191.044 L
283.233 190.612 L
285.339 190.333 L
287.444 190.207 L
S
GR
GS
[0.75 0 0 0.75 0 0] CT
0.635 0.078 0.184 RC
1 LJ
2.667 LW
N
79 122 M
80.895 129.804 L
82.79 137.422 L
84.685 144.854 L
86.58 152.105 L
88.475 159.175 L
90.37 166.069 L
92.265 172.789 L
94.16 179.336 L
96.055 185.715 L
97.949 191.926 L
99.844 197.973 L
101.739 203.859 L
103.634 209.585 L
105.529 215.155 L
107.424 220.57 L
109.319 225.833 L
111.214 230.947 L
113.109 235.914 L
115.004 240.737 L
116.899 245.418 L
118.794 249.959 L
120.689 254.362 L
122.584 258.631 L
124.479 262.768 L
126.374 266.775 L
128.269 270.654 L
130.164 274.407 L
132.059 278.038 L
133.954 281.548 L
135.848 284.94 L
137.743 288.216 L
139.638 291.378 L
141.533 294.428 L
143.428 297.37 L
145.323 295.401 L
147.218 293.117 L
149.113 290.631 L
151.008 287.971 L
152.903 285.175 L
154.798 282.268 L
156.693 279.195 L
158.588 276.13 L
160.483 272.939 L
162.378 269.709 L
164.273 266.47 L
166.168 263.229 L
168.063 260.006 L
169.958 256.818 L
171.853 253.682 L
173.747 250.608 L
175.642 247.609 L
177.537 244.697 L
179.432 241.887 L
181.327 239.183 L
183.222 236.587 L
185.117 234.117 L
187.012 231.759 L
188.907 229.522 L
190.802 227.411 L
192.697 225.417 L
194.592 223.542 L
196.487 221.789 L
198.382 220.154 L
200.277 218.636 L
202.172 217.231 L
204.067 215.974 L
205.962 214.836 L
207.857 213.808 L
209.752 212.892 L
211.646 212.083 L
213.541 211.375 L
215.436 210.777 L
217.331 210.275 L
219.226 209.869 L
221.121 209.556 L
223.016 209.331 L
224.911 209.19 L
226.806 209.127 L
228.701 209.135 L
230.596 209.205 L
232.491 209.333 L
234.386 209.507 L
236.281 209.718 L
238.176 209.957 L
240.071 210.215 L
241.966 210.488 L
243.861 210.764 L
245.756 211.042 L
247.651 211.318 L
249.545 211.572 L
251.44 211.112 L
253.335 210.31 L
255.23 209.41 L
257.125 208.514 L
259.02 207.685 L
260.915 206.935 L
262.81 206.296 L
264.705 205.776 L
266.6 205.378 L
S
GR
GS
[0.75 0 0 0.75 0 0] CT
1 GC
N
743 279 M
743 104 L
559 104 L
559 279 L
cp
f
GR
GS
[0.75 0 0 0.75 454.44864 88.5] CT
N
4.406 5.019 M
2.797 -7.716 L
2.656 -8.153 1.297 -8.153 QT
1.109 -8.153 1.109 -8.419 QT
1.141 -8.638 1.203 -8.747 QT
1.266 -8.856 1.438 -8.856 QT
6.313 -8.856 L
6.422 -8.856 6.477 -8.778 QT
6.531 -8.7 6.531 -8.606 QT
6.453 -8.153 6.266 -8.153 QT
4.703 -8.153 4.594 -7.622 QT
5.922 2.831 L
12.078 -6.997 L
12.25 -7.325 12.25 -7.528 QT
12.25 -7.872 11.938 -8.013 QT
11.625 -8.153 11.203 -8.153 QT
11 -8.153 11 -8.419 QT
11.031 -8.575 11.063 -8.669 QT
11.094 -8.763 11.156 -8.809 QT
11.219 -8.856 11.344 -8.856 QT
15.203 -8.856 L
15.375 -8.856 15.375 -8.606 QT
15.297 -8.153 15.125 -8.153 QT
13.609 -8.153 12.766 -6.841 QT
12.719 -6.809 12.703 -6.809 QT
5.328 5.019 L
5.172 5.237 4.938 5.237 QT
4.656 5.237 L
4.438 5.237 4.406 5.019 QT
cp
f
GR
GS
[0.75 0 0 0.75 454.44864 88.5] CT
N
15.167 8.112 M
13.448 8.112 12.831 6.698 QT
12.214 5.284 12.214 3.331 QT
12.214 2.112 12.432 1.042 QT
12.651 -0.028 13.315 -0.778 QT
13.979 -1.528 15.167 -1.528 QT
16.089 -1.528 16.674 -1.075 QT
17.26 -0.622 17.573 0.089 QT
17.885 0.8 17.995 1.62 QT
18.104 2.441 18.104 3.331 QT
18.104 4.534 17.885 5.589 QT
17.667 6.644 17.018 7.378 QT
16.37 8.112 15.167 8.112 QT
cp
15.167 7.737 M
15.948 7.737 16.331 6.941 QT
16.714 6.144 16.799 5.175 QT
16.885 4.206 16.885 3.112 QT
16.885 2.05 16.799 1.167 QT
16.714 0.284 16.331 -0.442 QT
15.948 -1.169 15.167 -1.169 QT
14.37 -1.169 13.987 -0.442 QT
13.604 0.284 13.518 1.167 QT
13.432 2.05 13.432 3.112 QT
13.432 3.894 13.471 4.581 QT
13.51 5.269 13.674 6.003 QT
13.839 6.737 14.206 7.237 QT
14.573 7.737 15.167 7.737 QT
cp
f
GR
GS
[0.75 0 0 0.75 454.44864 88.5] CT
N
26.722 2.144 M
26.566 2.144 26.456 2.019 QT
26.347 1.894 26.347 1.737 QT
26.347 1.581 26.456 1.464 QT
26.566 1.347 26.722 1.347 QT
39.285 1.347 L
39.425 1.347 39.535 1.464 QT
39.644 1.581 39.644 1.737 QT
39.644 1.894 39.535 2.019 QT
39.425 2.144 39.285 2.144 QT
26.722 2.144 L
cp
26.722 -1.747 M
26.566 -1.747 26.456 -1.864 QT
26.347 -1.981 26.347 -2.138 QT
26.347 -2.294 26.456 -2.419 QT
26.566 -2.544 26.722 -2.544 QT
39.285 -2.544 L
39.425 -2.544 39.535 -2.419 QT
39.644 -2.294 39.644 -2.138 QT
39.644 -1.981 39.535 -1.864 QT
39.425 -1.747 39.285 -1.747 QT
26.722 -1.747 L
cp
f
GR
GS
[0.75 0 0 0.75 454.44864 88.5] CT
N
48.192 4.8 M
48.192 4.097 L
50.692 4.097 50.692 3.456 QT
50.692 -7.044 L
49.661 -6.544 48.067 -6.544 QT
48.067 -7.247 L
50.521 -7.247 51.771 -8.528 QT
52.052 -8.528 L
52.13 -8.528 52.192 -8.474 QT
52.255 -8.419 52.255 -8.341 QT
52.255 3.456 L
52.255 4.097 54.755 4.097 QT
54.755 4.8 L
48.192 4.8 L
cp
f
GR
GS
[0.75 0 0 0.75 454.44864 88.5] CT
N
58.193 4.8 M
58.193 4.097 L
60.693 4.097 60.693 3.456 QT
60.693 -7.044 L
59.661 -6.544 58.068 -6.544 QT
58.068 -7.247 L
60.521 -7.247 61.771 -8.528 QT
62.052 -8.528 L
62.13 -8.528 62.193 -8.474 QT
62.255 -8.419 62.255 -8.341 QT
62.255 3.456 L
62.255 4.097 64.755 4.097 QT
64.755 4.8 L
58.193 4.8 L
cp
f
GR
GS
[0.75 0 0 0.75 454.44864 88.5] CT
N
68.021 3.691 M
68.021 3.253 68.349 2.925 QT
68.677 2.597 69.114 2.597 QT
69.396 2.597 69.653 2.745 QT
69.911 2.894 70.06 3.159 QT
70.208 3.425 70.208 3.691 QT
70.208 4.128 69.888 4.464 QT
69.568 4.8 69.114 4.8 QT
68.677 4.8 68.349 4.464 QT
68.021 4.128 68.021 3.691 QT
cp
f
GR
GS
[0.75 0 0 0.75 454.44864 88.5] CT
N
73.748 4.8 M
73.748 4.097 L
76.248 4.097 76.248 3.456 QT
76.248 -7.044 L
75.217 -6.544 73.623 -6.544 QT
73.623 -7.247 L
76.076 -7.247 77.326 -8.528 QT
77.607 -8.528 L
77.686 -8.528 77.748 -8.474 QT
77.811 -8.419 77.811 -8.341 QT
77.811 3.456 L
77.811 4.097 80.311 4.097 QT
80.311 4.8 L
73.748 4.8 L
cp
f
GR
GS
[0.75 0 0 0.75 454.44864 88.5] CT
N
87.581 9.8 M
87.581 -10.2 L
90.316 -10.2 L
90.316 -9.403 L
88.394 -9.403 L
88.394 9.003 L
90.316 9.003 L
90.316 9.8 L
87.581 9.8 L
cp
f
GR
GS
[0.75 0 0 0.75 454.44864 88.5] CT
N
92.324 4.456 M
92.324 4.347 92.34 4.284 QT
93.84 -1.684 L
93.981 -2.247 93.981 -2.669 QT
93.981 -3.528 93.403 -3.528 QT
92.778 -3.528 92.473 -2.778 QT
92.168 -2.028 91.887 -0.888 QT
91.887 -0.825 91.824 -0.794 QT
91.762 -0.763 91.715 -0.763 QT
91.481 -0.763 L
91.418 -0.763 91.364 -0.833 QT
91.309 -0.903 91.309 -0.966 QT
91.528 -1.825 91.731 -2.434 QT
91.934 -3.044 92.356 -3.544 QT
92.778 -4.044 93.418 -4.044 QT
94.168 -4.044 94.746 -3.567 QT
95.324 -3.091 95.324 -2.356 QT
95.918 -3.138 96.715 -3.591 QT
97.512 -4.044 98.418 -4.044 QT
99.356 -4.044 100.051 -3.559 QT
100.746 -3.075 100.746 -2.184 QT
101.356 -3.059 102.184 -3.552 QT
103.012 -4.044 103.981 -4.044 QT
105.012 -4.044 105.645 -3.481 QT
106.278 -2.919 106.278 -1.888 QT
106.278 -1.059 105.91 0.105 QT
105.543 1.269 104.996 2.706 QT
104.715 3.394 104.715 3.894 QT
104.715 4.503 105.184 4.503 QT
105.965 4.503 106.481 3.659 QT
106.996 2.816 107.215 1.862 QT
107.278 1.737 107.387 1.737 QT
107.621 1.737 L
107.699 1.737 107.746 1.792 QT
107.793 1.847 107.793 1.925 QT
107.793 1.941 107.778 1.972 QT
107.512 3.112 106.832 4.066 QT
106.153 5.019 105.137 5.019 QT
104.434 5.019 103.934 4.534 QT
103.434 4.05 103.434 3.362 QT
103.434 3.019 103.606 2.581 QT
104.168 1.081 104.543 -0.099 QT
104.918 -1.278 104.918 -2.184 QT
104.918 -2.747 104.692 -3.138 QT
104.465 -3.528 103.949 -3.528 QT
102.856 -3.528 102.051 -2.856 QT
101.246 -2.184 100.668 -1.075 QT
100.621 -0.888 100.606 -0.778 QT
99.309 4.362 L
99.246 4.628 99.004 4.823 QT
98.762 5.019 98.481 5.019 QT
98.246 5.019 98.059 4.862 QT
97.871 4.706 97.871 4.456 QT
97.871 4.347 97.903 4.284 QT
99.184 -0.809 L
99.387 -1.638 99.387 -2.184 QT
99.387 -2.747 99.153 -3.138 QT
98.918 -3.528 98.371 -3.528 QT
97.637 -3.528 97.028 -3.2 QT
96.418 -2.872 95.957 -2.341 QT
95.496 -1.809 95.121 -1.075 QT
93.762 4.362 L
93.684 4.628 93.449 4.823 QT
93.215 5.019 92.918 5.019 QT
92.668 5.019 92.496 4.862 QT
92.324 4.706 92.324 4.456 QT
cp
f
GR
GS
[0.75 0 0 0.75 454.44864 88.5] CT
N
109.463 9.394 M
109.463 9.347 109.478 9.316 QT
116.432 -9.95 L
116.478 -10.075 116.572 -10.138 QT
116.666 -10.2 116.791 -10.2 QT
116.978 -10.2 117.088 -10.091 QT
117.197 -9.981 117.197 -9.794 QT
117.197 -9.716 L
110.244 9.55 L
110.119 9.8 109.869 9.8 QT
109.697 9.8 109.58 9.683 QT
109.463 9.566 109.463 9.394 QT
cp
f
GR
GS
[0.75 0 0 0.75 454.44864 88.5] CT
N
120.072 3.581 M
120.619 4.503 122.229 4.503 QT
122.932 4.503 123.572 4.261 QT
124.213 4.019 124.627 3.542 QT
125.041 3.066 125.041 2.378 QT
125.041 1.862 124.666 1.526 QT
124.291 1.191 123.76 1.081 QT
122.682 0.862 L
121.932 0.675 121.455 0.167 QT
120.979 -0.341 120.979 -1.059 QT
120.979 -1.95 121.463 -2.63 QT
121.947 -3.309 122.736 -3.677 QT
123.525 -4.044 124.369 -4.044 QT
125.275 -4.044 125.994 -3.606 QT
126.713 -3.169 126.713 -2.325 QT
126.713 -1.856 126.455 -1.505 QT
126.197 -1.153 125.744 -1.153 QT
125.479 -1.153 125.291 -1.325 QT
125.104 -1.497 125.104 -1.763 QT
125.104 -1.997 125.229 -2.216 QT
125.354 -2.434 125.58 -2.567 QT
125.807 -2.7 126.041 -2.7 QT
125.854 -3.138 125.369 -3.333 QT
124.885 -3.528 124.338 -3.528 QT
123.822 -3.528 123.314 -3.317 QT
122.807 -3.106 122.502 -2.716 QT
122.197 -2.325 122.197 -1.778 QT
122.197 -1.419 122.447 -1.145 QT
122.697 -0.872 123.072 -0.763 QT
124.244 -0.528 L
124.791 -0.403 125.26 -0.106 QT
125.729 0.191 125.994 0.644 QT
126.26 1.097 126.26 1.691 QT
126.26 2.425 125.846 3.151 QT
125.432 3.878 124.822 4.3 QT
123.76 5.019 122.213 5.019 QT
121.15 5.019 120.26 4.534 QT
119.369 4.05 119.369 3.081 QT
119.369 2.534 119.689 2.128 QT
120.01 1.722 120.557 1.722 QT
120.885 1.722 121.104 1.917 QT
121.322 2.112 121.322 2.441 QT
121.322 2.894 120.979 3.237 QT
120.635 3.581 120.182 3.581 QT
120.072 3.581 L
cp
f
GR
GS
[0.75 0 0 0.75 454.44864 88.5] CT
N
128.15 9.8 M
128.15 9.003 L
130.104 9.003 L
130.104 -9.403 L
128.15 -9.403 L
128.15 -10.2 L
130.9 -10.2 L
130.9 9.8 L
128.15 9.8 L
cp
f
GR
GS
[0.75 0 0 0.75 0 0] CT
0 0.447 0.741 RC
1 LJ
2.667 LW
N
562.994 118 M
602.936 118 L
S
GR
GS
[0.75 0 0 0.75 454.44864 106.875] CT
N
/f1068973273{4.406 5.019 M
2.797 -7.716 L
2.656 -8.153 1.297 -8.153 QT
1.109 -8.153 1.109 -8.419 QT
1.141 -8.638 1.203 -8.747 QT
1.266 -8.856 1.438 -8.856 QT
6.313 -8.856 L
6.422 -8.856 6.477 -8.778 QT
6.531 -8.7 6.531 -8.606 QT
6.453 -8.153 6.266 -8.153 QT
4.703 -8.153 4.594 -7.622 QT
5.922 2.831 L
12.078 -6.997 L
12.25 -7.325 12.25 -7.528 QT
12.25 -7.872 11.938 -8.013 QT
11.625 -8.153 11.203 -8.153 QT
11 -8.153 11 -8.419 QT
11.031 -8.575 11.063 -8.669 QT
11.094 -8.763 11.156 -8.809 QT
11.219 -8.856 11.344 -8.856 QT
15.203 -8.856 L
15.375 -8.856 15.375 -8.606 QT
15.297 -8.153 15.125 -8.153 QT
13.609 -8.153 12.766 -6.841 QT
12.719 -6.809 12.703 -6.809 QT
5.328 5.019 L
5.172 5.237 4.938 5.237 QT
4.656 5.237 L
4.438 5.237 4.406 5.019 QT
cp}def
f1068973273
f
GR
GS
[0.75 0 0 0.75 454.44864 106.875] CT
N
/f1138558608{15.167 8.112 M
13.448 8.112 12.831 6.698 QT
12.214 5.284 12.214 3.331 QT
12.214 2.112 12.432 1.042 QT
12.651 -0.028 13.315 -0.778 QT
13.979 -1.528 15.167 -1.528 QT
16.089 -1.528 16.674 -1.075 QT
17.26 -0.622 17.573 0.089 QT
17.885 0.8 17.995 1.62 QT
18.104 2.441 18.104 3.331 QT
18.104 4.534 17.885 5.589 QT
17.667 6.644 17.018 7.378 QT
16.37 8.112 15.167 8.112 QT
cp
15.167 7.737 M
15.948 7.737 16.331 6.941 QT
16.714 6.144 16.799 5.175 QT
16.885 4.206 16.885 3.112 QT
16.885 2.05 16.799 1.167 QT
16.714 0.284 16.331 -0.442 QT
15.948 -1.169 15.167 -1.169 QT
14.37 -1.169 13.987 -0.442 QT
13.604 0.284 13.518 1.167 QT
13.432 2.05 13.432 3.112 QT
13.432 3.894 13.471 4.581 QT
13.51 5.269 13.674 6.003 QT
13.839 6.737 14.206 7.237 QT
14.573 7.737 15.167 7.737 QT
cp}def
f1138558608
f
GR
GS
[0.75 0 0 0.75 454.44864 106.875] CT
N
/f-1967198721{26.722 2.144 M
26.566 2.144 26.456 2.019 QT
26.347 1.894 26.347 1.737 QT
26.347 1.581 26.456 1.464 QT
26.566 1.347 26.722 1.347 QT
39.285 1.347 L
39.425 1.347 39.535 1.464 QT
39.644 1.581 39.644 1.737 QT
39.644 1.894 39.535 2.019 QT
39.425 2.144 39.285 2.144 QT
26.722 2.144 L
cp
26.722 -1.747 M
26.566 -1.747 26.456 -1.864 QT
26.347 -1.981 26.347 -2.138 QT
26.347 -2.294 26.456 -2.419 QT
26.566 -2.544 26.722 -2.544 QT
39.285 -2.544 L
39.425 -2.544 39.535 -2.419 QT
39.644 -2.294 39.644 -2.138 QT
39.644 -1.981 39.535 -1.864 QT
39.425 -1.747 39.285 -1.747 QT
26.722 -1.747 L
cp}def
f-1967198721
f
GR
GS
[0.75 0 0 0.75 454.44864 106.875] CT
N
/f-1654971308{48.192 4.8 M
48.192 4.097 L
50.692 4.097 50.692 3.456 QT
50.692 -7.044 L
49.661 -6.544 48.067 -6.544 QT
48.067 -7.247 L
50.521 -7.247 51.771 -8.528 QT
52.052 -8.528 L
52.13 -8.528 52.192 -8.474 QT
52.255 -8.419 52.255 -8.341 QT
52.255 3.456 L
52.255 4.097 54.755 4.097 QT
54.755 4.8 L
48.192 4.8 L
cp}def
f-1654971308
f
GR
GS
[0.75 0 0 0.75 454.44864 106.875] CT
N
/f-1508219825{58.239 3.253 M
58.708 3.941 59.497 4.269 QT
60.286 4.597 61.193 4.597 QT
62.364 4.597 62.849 3.612 QT
63.333 2.628 63.333 1.362 QT
63.333 0.8 63.232 0.23 QT
63.13 -0.341 62.888 -0.825 QT
62.646 -1.309 62.216 -1.606 QT
61.786 -1.903 61.177 -1.903 QT
59.849 -1.903 L
59.677 -1.903 59.677 -2.091 QT
59.677 -2.263 L
59.677 -2.419 59.849 -2.419 QT
60.958 -2.513 L
61.661 -2.513 62.122 -3.036 QT
62.583 -3.559 62.802 -4.317 QT
63.021 -5.075 63.021 -5.763 QT
63.021 -6.716 62.568 -7.333 QT
62.114 -7.95 61.193 -7.95 QT
60.443 -7.95 59.747 -7.661 QT
59.052 -7.372 58.646 -6.778 QT
58.677 -6.794 58.708 -6.802 QT
58.739 -6.809 58.771 -6.809 QT
59.224 -6.809 59.528 -6.497 QT
59.833 -6.184 59.833 -5.731 QT
59.833 -5.309 59.528 -4.997 QT
59.224 -4.684 58.771 -4.684 QT
58.333 -4.684 58.021 -4.997 QT
57.708 -5.309 57.708 -5.731 QT
57.708 -6.591 58.224 -7.231 QT
58.739 -7.872 59.56 -8.2 QT
60.38 -8.528 61.193 -8.528 QT
61.802 -8.528 62.474 -8.341 QT
63.146 -8.153 63.693 -7.817 QT
64.239 -7.481 64.591 -6.958 QT
64.943 -6.434 64.943 -5.763 QT
64.943 -4.919 64.568 -4.208 QT
64.193 -3.497 63.536 -2.974 QT
62.88 -2.45 62.099 -2.2 QT
62.958 -2.044 63.739 -1.552 QT
64.521 -1.059 64.997 -0.302 QT
65.474 0.456 65.474 1.347 QT
65.474 2.441 64.872 3.339 QT
64.271 4.237 63.278 4.737 QT
62.286 5.237 61.193 5.237 QT
60.255 5.237 59.318 4.878 QT
58.38 4.519 57.778 3.808 QT
57.177 3.097 57.177 2.097 QT
57.177 1.612 57.505 1.276 QT
57.833 0.941 58.333 0.941 QT
58.661 0.941 58.927 1.089 QT
59.193 1.237 59.349 1.511 QT
59.505 1.784 59.505 2.097 QT
59.505 2.597 59.161 2.925 QT
58.818 3.253 58.333 3.253 QT
58.239 3.253 L
cp}def
f-1508219825
f
GR
GS
[0.75 0 0 0.75 454.44864 106.875] CT
N
/f820751904{68.021 3.691 M
68.021 3.253 68.349 2.925 QT
68.677 2.597 69.114 2.597 QT
69.396 2.597 69.653 2.745 QT
69.911 2.894 70.06 3.159 QT
70.208 3.425 70.208 3.691 QT
70.208 4.128 69.888 4.464 QT
69.568 4.8 69.114 4.8 QT
68.677 4.8 68.349 4.464 QT
68.021 4.128 68.021 3.691 QT
cp}def
f820751904
f
GR
GS
[0.75 0 0 0.75 454.44864 106.875] CT
N
/f2135303644{74.139 3.956 M
74.686 4.597 76.045 4.597 QT
76.811 4.597 77.467 4.081 QT
78.123 3.566 78.498 2.816 QT
78.904 1.972 79.022 1.011 QT
79.139 0.05 79.139 -1.388 QT
78.811 -0.575 78.17 -0.059 QT
77.529 0.456 76.701 0.456 QT
75.529 0.456 74.615 -0.169 QT
73.701 -0.794 73.217 -1.825 QT
72.732 -2.856 72.732 -4.013 QT
72.732 -5.216 73.279 -6.255 QT
73.826 -7.294 74.795 -7.911 QT
75.764 -8.528 76.982 -8.528 QT
78.201 -8.528 79.014 -7.864 QT
79.826 -7.2 80.256 -6.161 QT
80.686 -5.122 80.857 -3.958 QT
81.029 -2.794 81.029 -1.669 QT
81.029 -0.122 80.467 1.487 QT
79.904 3.097 78.772 4.167 QT
77.639 5.237 76.045 5.237 QT
74.873 5.237 74.053 4.683 QT
73.232 4.128 73.232 3.003 QT
73.232 2.597 73.506 2.316 QT
73.779 2.034 74.201 2.034 QT
74.592 2.034 74.873 2.316 QT
75.154 2.597 75.154 3.003 QT
75.154 3.394 74.873 3.675 QT
74.592 3.956 74.201 3.956 QT
74.139 3.956 L
cp
76.779 -0.059 M
77.592 -0.059 78.115 -0.614 QT
78.639 -1.169 78.873 -1.989 QT
79.107 -2.809 79.107 -3.622 QT
79.107 -3.997 L
79.107 -4.075 L
79.107 -5.575 78.67 -6.763 QT
78.232 -7.95 76.982 -7.95 QT
76.201 -7.95 75.709 -7.599 QT
75.217 -7.247 74.982 -6.677 QT
74.748 -6.106 74.678 -5.45 QT
74.607 -4.794 74.607 -4.013 QT
74.607 -2.888 74.717 -2.083 QT
74.826 -1.278 75.303 -0.669 QT
75.779 -0.059 76.779 -0.059 QT
cp}def
f2135303644
f
GR
GS
[0.75 0 0 0.75 454.44864 106.875] CT
N
/f-727042790{87.581 9.8 M
87.581 -10.2 L
90.316 -10.2 L
90.316 -9.403 L
88.394 -9.403 L
88.394 9.003 L
90.316 9.003 L
90.316 9.8 L
87.581 9.8 L
cp}def
f-727042790
f
GR
GS
[0.75 0 0 0.75 454.44864 106.875] CT
N
/f1612806902{92.324 4.456 M
92.324 4.347 92.34 4.284 QT
93.84 -1.684 L
93.981 -2.247 93.981 -2.669 QT
93.981 -3.528 93.403 -3.528 QT
92.778 -3.528 92.473 -2.778 QT
92.168 -2.028 91.887 -0.888 QT
91.887 -0.825 91.824 -0.794 QT
91.762 -0.763 91.715 -0.763 QT
91.481 -0.763 L
91.418 -0.763 91.364 -0.833 QT
91.309 -0.903 91.309 -0.966 QT
91.528 -1.825 91.731 -2.434 QT
91.934 -3.044 92.356 -3.544 QT
92.778 -4.044 93.418 -4.044 QT
94.168 -4.044 94.746 -3.567 QT
95.324 -3.091 95.324 -2.356 QT
95.918 -3.138 96.715 -3.591 QT
97.512 -4.044 98.418 -4.044 QT
99.356 -4.044 100.051 -3.559 QT
100.746 -3.075 100.746 -2.184 QT
101.356 -3.059 102.184 -3.552 QT
103.012 -4.044 103.981 -4.044 QT
105.012 -4.044 105.645 -3.481 QT
106.278 -2.919 106.278 -1.888 QT
106.278 -1.059 105.91 0.105 QT
105.543 1.269 104.996 2.706 QT
104.715 3.394 104.715 3.894 QT
104.715 4.503 105.184 4.503 QT
105.965 4.503 106.481 3.659 QT
106.996 2.816 107.215 1.862 QT
107.278 1.737 107.387 1.737 QT
107.621 1.737 L
107.699 1.737 107.746 1.792 QT
107.793 1.847 107.793 1.925 QT
107.793 1.941 107.778 1.972 QT
107.512 3.112 106.832 4.066 QT
106.153 5.019 105.137 5.019 QT
104.434 5.019 103.934 4.534 QT
103.434 4.05 103.434 3.362 QT
103.434 3.019 103.606 2.581 QT
104.168 1.081 104.543 -0.099 QT
104.918 -1.278 104.918 -2.184 QT
104.918 -2.747 104.692 -3.138 QT
104.465 -3.528 103.949 -3.528 QT
102.856 -3.528 102.051 -2.856 QT
101.246 -2.184 100.668 -1.075 QT
100.621 -0.888 100.606 -0.778 QT
99.309 4.362 L
99.246 4.628 99.004 4.823 QT
98.762 5.019 98.481 5.019 QT
98.246 5.019 98.059 4.862 QT
97.871 4.706 97.871 4.456 QT
97.871 4.347 97.903 4.284 QT
99.184 -0.809 L
99.387 -1.638 99.387 -2.184 QT
99.387 -2.747 99.153 -3.138 QT
98.918 -3.528 98.371 -3.528 QT
97.637 -3.528 97.028 -3.2 QT
96.418 -2.872 95.957 -2.341 QT
95.496 -1.809 95.121 -1.075 QT
93.762 4.362 L
93.684 4.628 93.449 4.823 QT
93.215 5.019 92.918 5.019 QT
92.668 5.019 92.496 4.862 QT
92.324 4.706 92.324 4.456 QT
cp}def
f1612806902
f
GR
GS
[0.75 0 0 0.75 454.44864 106.875] CT
N
/f-10076840{109.463 9.394 M
109.463 9.347 109.478 9.316 QT
116.432 -9.95 L
116.478 -10.075 116.572 -10.138 QT
116.666 -10.2 116.791 -10.2 QT
116.978 -10.2 117.088 -10.091 QT
117.197 -9.981 117.197 -9.794 QT
117.197 -9.716 L
110.244 9.55 L
110.119 9.8 109.869 9.8 QT
109.697 9.8 109.58 9.683 QT
109.463 9.566 109.463 9.394 QT
cp}def
f-10076840
f
GR
GS
[0.75 0 0 0.75 454.44864 106.875] CT
N
/f-1564004227{120.072 3.581 M
120.619 4.503 122.229 4.503 QT
122.932 4.503 123.572 4.261 QT
124.213 4.019 124.627 3.542 QT
125.041 3.066 125.041 2.378 QT
125.041 1.862 124.666 1.526 QT
124.291 1.191 123.76 1.081 QT
122.682 0.862 L
121.932 0.675 121.455 0.167 QT
120.979 -0.341 120.979 -1.059 QT
120.979 -1.95 121.463 -2.63 QT
121.947 -3.309 122.736 -3.677 QT
123.525 -4.044 124.369 -4.044 QT
125.275 -4.044 125.994 -3.606 QT
126.713 -3.169 126.713 -2.325 QT
126.713 -1.856 126.455 -1.505 QT
126.197 -1.153 125.744 -1.153 QT
125.479 -1.153 125.291 -1.325 QT
125.104 -1.497 125.104 -1.763 QT
125.104 -1.997 125.229 -2.216 QT
125.354 -2.434 125.58 -2.567 QT
125.807 -2.7 126.041 -2.7 QT
125.854 -3.138 125.369 -3.333 QT
124.885 -3.528 124.338 -3.528 QT
123.822 -3.528 123.314 -3.317 QT
122.807 -3.106 122.502 -2.716 QT
122.197 -2.325 122.197 -1.778 QT
122.197 -1.419 122.447 -1.145 QT
122.697 -0.872 123.072 -0.763 QT
124.244 -0.528 L
124.791 -0.403 125.26 -0.106 QT
125.729 0.191 125.994 0.644 QT
126.26 1.097 126.26 1.691 QT
126.26 2.425 125.846 3.151 QT
125.432 3.878 124.822 4.3 QT
123.76 5.019 122.213 5.019 QT
121.15 5.019 120.26 4.534 QT
119.369 4.05 119.369 3.081 QT
119.369 2.534 119.689 2.128 QT
120.01 1.722 120.557 1.722 QT
120.885 1.722 121.104 1.917 QT
121.322 2.112 121.322 2.441 QT
121.322 2.894 120.979 3.237 QT
120.635 3.581 120.182 3.581 QT
120.072 3.581 L
cp}def
f-1564004227
f
GR
GS
[0.75 0 0 0.75 454.44864 106.875] CT
N
/f-1535772716{128.15 9.8 M
128.15 9.003 L
130.104 9.003 L
130.104 -9.403 L
128.15 -9.403 L
128.15 -10.2 L
130.9 -10.2 L
130.9 9.8 L
128.15 9.8 L
cp}def
f-1535772716
f
GR
GS
[0.75 0 0 0.75 0 0] CT
0.851 0.325 0.098 RC
1 LJ
2.667 LW
N
562.994 142.5 M
602.936 142.5 L
S
GR
GS
[0.75 0 0 0.75 454.44864 125.25] CT
N
f1068973273
f
GR
GS
[0.75 0 0 0.75 454.44864 125.25] CT
N
f1138558608
f
GR
GS
[0.75 0 0 0.75 454.44864 125.25] CT
N
f-1967198721
f
GR
GS
[0.75 0 0 0.75 454.44864 125.25] CT
N
f-1654971308
f
GR
GS
[0.75 0 0 0.75 454.44864 125.25] CT
N
/f-578466229{61.333 5.237 M
60.099 5.237 59.263 4.581 QT
58.427 3.925 57.974 2.87 QT
57.521 1.816 57.349 0.667 QT
57.177 -0.481 57.177 -1.669 QT
57.177 -3.247 57.794 -4.841 QT
58.411 -6.434 59.607 -7.481 QT
60.802 -8.528 62.443 -8.528 QT
63.114 -8.528 63.708 -8.263 QT
64.302 -7.997 64.638 -7.497 QT
64.974 -6.997 64.974 -6.278 QT
64.974 -5.872 64.7 -5.599 QT
64.427 -5.325 64.005 -5.325 QT
63.614 -5.325 63.333 -5.606 QT
63.052 -5.888 63.052 -6.278 QT
63.052 -6.669 63.333 -6.958 QT
63.614 -7.247 64.005 -7.247 QT
64.114 -7.247 L
63.864 -7.606 63.403 -7.778 QT
62.943 -7.95 62.443 -7.95 QT
61.833 -7.95 61.318 -7.684 QT
60.802 -7.419 60.396 -6.966 QT
59.989 -6.513 59.716 -5.974 QT
59.443 -5.434 59.286 -4.739 QT
59.13 -4.044 59.091 -3.442 QT
59.052 -2.841 59.052 -1.919 QT
59.411 -2.747 60.052 -3.263 QT
60.693 -3.778 61.505 -3.778 QT
62.396 -3.778 63.13 -3.419 QT
63.864 -3.059 64.388 -2.419 QT
64.911 -1.778 65.193 -0.958 QT
65.474 -0.138 65.474 0.691 QT
65.474 1.862 64.95 2.925 QT
64.427 3.987 63.482 4.612 QT
62.536 5.237 61.333 5.237 QT
cp
61.333 4.597 M
62.099 4.597 62.568 4.245 QT
63.036 3.894 63.263 3.316 QT
63.489 2.737 63.536 2.144 QT
63.583 1.55 63.583 0.691 QT
63.583 -0.434 63.482 -1.239 QT
63.38 -2.044 62.896 -2.653 QT
62.411 -3.263 61.427 -3.263 QT
60.614 -3.263 60.099 -2.716 QT
59.583 -2.169 59.341 -1.333 QT
59.099 -0.497 59.099 0.284 QT
59.099 0.534 59.114 0.675 QT
59.114 0.706 59.114 0.73 QT
59.114 0.753 59.099 0.769 QT
59.099 1.628 59.271 2.511 QT
59.443 3.394 59.943 3.995 QT
60.443 4.597 61.333 4.597 QT
cp}def
f-578466229
f
GR
GS
[0.75 0 0 0.75 454.44864 125.25] CT
N
f820751904
f
GR
GS
[0.75 0 0 0.75 454.44864 125.25] CT
N
/f2142300685{75.373 4.284 M
75.373 3.175 75.568 2.105 QT
75.764 1.034 76.139 -0.005 QT
76.514 -1.044 77.045 -2.044 QT
77.576 -3.044 78.201 -3.919 QT
80.029 -6.466 L
77.748 -6.466 L
74.201 -6.466 74.092 -6.356 QT
73.826 -6.044 73.592 -4.513 QT
73.014 -4.513 L
73.67 -8.716 L
74.248 -8.716 L
74.248 -8.653 L
74.248 -8.294 75.475 -8.184 QT
76.701 -8.075 77.873 -8.075 QT
81.592 -8.075 L
81.592 -7.559 L
81.592 -7.544 81.584 -7.536 QT
81.576 -7.528 81.561 -7.513 QT
78.811 -3.638 L
77.795 -2.138 77.545 -0.302 QT
77.295 1.534 77.295 4.284 QT
77.295 4.675 77.006 4.956 QT
76.717 5.237 76.326 5.237 QT
75.936 5.237 75.654 4.956 QT
75.373 4.675 75.373 4.284 QT
cp}def
f2142300685
f
GR
GS
[0.75 0 0 0.75 454.44864 125.25] CT
N
f-727042790
f
GR
GS
[0.75 0 0 0.75 454.44864 125.25] CT
N
f1612806902
f
GR
GS
[0.75 0 0 0.75 454.44864 125.25] CT
N
f-10076840
f
GR
GS
[0.75 0 0 0.75 454.44864 125.25] CT
N
f-1564004227
f
GR
GS
[0.75 0 0 0.75 454.44864 125.25] CT
N
f-1535772716
f
GR
GS
[0.75 0 0 0.75 0 0] CT
0.929 0.694 0.125 RC
1 LJ
2.667 LW
N
562.994 167 M
602.936 167 L
S
GR
GS
[0.75 0 0 0.75 454.44864 143.625] CT
N
f1068973273
f
GR
GS
[0.75 0 0 0.75 454.44864 143.625] CT
N
f1138558608
f
GR
GS
[0.75 0 0 0.75 454.44864 143.625] CT
N
f-1967198721
f
GR
GS
[0.75 0 0 0.75 454.44864 143.625] CT
N
f-1654971308
f
GR
GS
[0.75 0 0 0.75 454.44864 143.625] CT
N
/f511145289{58.583 3.956 M
59.13 4.597 60.489 4.597 QT
61.255 4.597 61.911 4.081 QT
62.568 3.566 62.943 2.816 QT
63.349 1.972 63.466 1.011 QT
63.583 0.05 63.583 -1.388 QT
63.255 -0.575 62.614 -0.059 QT
61.974 0.456 61.146 0.456 QT
59.974 0.456 59.06 -0.169 QT
58.146 -0.794 57.661 -1.825 QT
57.177 -2.856 57.177 -4.013 QT
57.177 -5.216 57.724 -6.255 QT
58.271 -7.294 59.239 -7.911 QT
60.208 -8.528 61.427 -8.528 QT
62.646 -8.528 63.458 -7.864 QT
64.271 -7.2 64.7 -6.161 QT
65.13 -5.122 65.302 -3.958 QT
65.474 -2.794 65.474 -1.669 QT
65.474 -0.122 64.911 1.487 QT
64.349 3.097 63.216 4.167 QT
62.083 5.237 60.489 5.237 QT
59.318 5.237 58.497 4.683 QT
57.677 4.128 57.677 3.003 QT
57.677 2.597 57.95 2.316 QT
58.224 2.034 58.646 2.034 QT
59.036 2.034 59.318 2.316 QT
59.599 2.597 59.599 3.003 QT
59.599 3.394 59.318 3.675 QT
59.036 3.956 58.646 3.956 QT
58.583 3.956 L
cp
61.224 -0.059 M
62.036 -0.059 62.56 -0.614 QT
63.083 -1.169 63.318 -1.989 QT
63.552 -2.809 63.552 -3.622 QT
63.552 -3.997 L
63.552 -4.075 L
63.552 -5.575 63.114 -6.763 QT
62.677 -7.95 61.427 -7.95 QT
60.646 -7.95 60.153 -7.599 QT
59.661 -7.247 59.427 -6.677 QT
59.193 -6.106 59.122 -5.45 QT
59.052 -4.794 59.052 -4.013 QT
59.052 -2.888 59.161 -2.083 QT
59.271 -1.278 59.747 -0.669 QT
60.224 -0.059 61.224 -0.059 QT
cp}def
f511145289
f
GR
GS
[0.75 0 0 0.75 454.44864 143.625] CT
N
f820751904
f
GR
GS
[0.75 0 0 0.75 454.44864 143.625] CT
N
/f1676170868{72.451 1.503 M
72.451 0.8 L
78.623 -8.419 L
78.701 -8.528 78.826 -8.528 QT
79.123 -8.528 L
79.357 -8.528 79.357 -8.294 QT
79.357 0.8 L
81.311 0.8 L
81.311 1.503 L
79.357 1.503 L
79.357 3.456 L
79.357 3.878 79.943 3.987 QT
80.529 4.097 81.295 4.097 QT
81.295 4.8 L
75.779 4.8 L
75.779 4.097 L
76.561 4.097 77.147 3.987 QT
77.732 3.878 77.732 3.456 QT
77.732 1.503 L
72.451 1.503 L
cp
73.107 0.8 M
77.842 0.8 L
77.842 -6.278 L
73.107 0.8 L
cp}def
f1676170868
f
GR
GS
[0.75 0 0 0.75 454.44864 143.625] CT
N
f-727042790
f
GR
GS
[0.75 0 0 0.75 454.44864 143.625] CT
N
f1612806902
f
GR
GS
[0.75 0 0 0.75 454.44864 143.625] CT
N
f-10076840
f
GR
GS
[0.75 0 0 0.75 454.44864 143.625] CT
N
f-1564004227
f
GR
GS
[0.75 0 0 0.75 454.44864 143.625] CT
N
f-1535772716
f
GR
GS
[0.75 0 0 0.75 0 0] CT
0.494 0.184 0.557 RC
1 LJ
2.667 LW
N
562.994 191.5 M
602.936 191.5 L
S
GR
GS
[0.75 0 0 0.75 454.44864 162] CT
N
f1068973273
f
GR
GS
[0.75 0 0 0.75 454.44864 162] CT
N
f1138558608
f
GR
GS
[0.75 0 0 0.75 454.44864 162] CT
N
f-1967198721
f
GR
GS
[0.75 0 0 0.75 454.44864 162] CT
N
/f-1428036658{47.333 4.8 M
47.333 4.269 L
47.333 4.206 47.364 4.159 QT
50.474 0.722 L
51.177 -0.044 51.614 -0.559 QT
52.052 -1.075 52.482 -1.755 QT
52.911 -2.434 53.161 -3.13 QT
53.411 -3.825 53.411 -4.606 QT
53.411 -5.419 53.107 -6.169 QT
52.802 -6.919 52.208 -7.372 QT
51.614 -7.825 50.755 -7.825 QT
49.896 -7.825 49.2 -7.302 QT
48.505 -6.778 48.224 -5.95 QT
48.302 -5.966 48.427 -5.966 QT
48.88 -5.966 49.2 -5.661 QT
49.521 -5.356 49.521 -4.872 QT
49.521 -4.419 49.2 -4.099 QT
48.88 -3.778 48.427 -3.778 QT
47.958 -3.778 47.646 -4.106 QT
47.333 -4.434 47.333 -4.872 QT
47.333 -5.638 47.614 -6.294 QT
47.896 -6.95 48.427 -7.466 QT
48.958 -7.981 49.63 -8.255 QT
50.302 -8.528 51.052 -8.528 QT
52.192 -8.528 53.177 -8.044 QT
54.161 -7.559 54.739 -6.677 QT
55.317 -5.794 55.317 -4.606 QT
55.317 -3.731 54.935 -2.95 QT
54.552 -2.169 53.958 -1.528 QT
53.364 -0.888 52.435 -0.083 QT
51.505 0.722 51.224 1.003 QT
48.958 3.175 L
50.88 3.175 L
52.286 3.175 53.239 3.151 QT
54.192 3.128 54.255 3.081 QT
54.489 2.831 54.739 1.237 QT
55.317 1.237 L
54.755 4.8 L
47.333 4.8 L
cp}def
f-1428036658
f
GR
GS
[0.75 0 0 0.75 454.44864 162] CT
N
/f1680273512{57.333 4.8 M
57.333 4.269 L
57.333 4.206 57.364 4.159 QT
60.474 0.722 L
61.177 -0.044 61.614 -0.559 QT
62.052 -1.075 62.482 -1.755 QT
62.911 -2.434 63.161 -3.13 QT
63.411 -3.825 63.411 -4.606 QT
63.411 -5.419 63.107 -6.169 QT
62.802 -6.919 62.208 -7.372 QT
61.614 -7.825 60.755 -7.825 QT
59.896 -7.825 59.2 -7.302 QT
58.505 -6.778 58.224 -5.95 QT
58.302 -5.966 58.427 -5.966 QT
58.88 -5.966 59.2 -5.661 QT
59.521 -5.356 59.521 -4.872 QT
59.521 -4.419 59.2 -4.099 QT
58.88 -3.778 58.427 -3.778 QT
57.958 -3.778 57.646 -4.106 QT
57.333 -4.434 57.333 -4.872 QT
57.333 -5.638 57.614 -6.294 QT
57.896 -6.95 58.427 -7.466 QT
58.958 -7.981 59.63 -8.255 QT
60.302 -8.528 61.052 -8.528 QT
62.193 -8.528 63.177 -8.044 QT
64.161 -7.559 64.739 -6.677 QT
65.318 -5.794 65.318 -4.606 QT
65.318 -3.731 64.935 -2.95 QT
64.552 -2.169 63.958 -1.528 QT
63.364 -0.888 62.435 -0.083 QT
61.505 0.722 61.224 1.003 QT
58.958 3.175 L
60.88 3.175 L
62.286 3.175 63.239 3.151 QT
64.193 3.128 64.255 3.081 QT
64.489 2.831 64.739 1.237 QT
65.318 1.237 L
64.755 4.8 L
57.333 4.8 L
cp}def
f1680273512
f
GR
GS
[0.75 0 0 0.75 454.44864 162] CT
N
f820751904
f
GR
GS
[0.75 0 0 0.75 454.44864 162] CT
N
/f376030737{72.889 4.8 M
72.889 4.269 L
72.889 4.206 72.92 4.159 QT
76.029 0.722 L
76.732 -0.044 77.17 -0.559 QT
77.607 -1.075 78.037 -1.755 QT
78.467 -2.434 78.717 -3.13 QT
78.967 -3.825 78.967 -4.606 QT
78.967 -5.419 78.662 -6.169 QT
78.357 -6.919 77.764 -7.372 QT
77.17 -7.825 76.311 -7.825 QT
75.451 -7.825 74.756 -7.302 QT
74.061 -6.778 73.779 -5.95 QT
73.857 -5.966 73.982 -5.966 QT
74.436 -5.966 74.756 -5.661 QT
75.076 -5.356 75.076 -4.872 QT
75.076 -4.419 74.756 -4.099 QT
74.436 -3.778 73.982 -3.778 QT
73.514 -3.778 73.201 -4.106 QT
72.889 -4.434 72.889 -4.872 QT
72.889 -5.638 73.17 -6.294 QT
73.451 -6.95 73.982 -7.466 QT
74.514 -7.981 75.186 -8.255 QT
75.857 -8.528 76.607 -8.528 QT
77.748 -8.528 78.732 -8.044 QT
79.717 -7.559 80.295 -6.677 QT
80.873 -5.794 80.873 -4.606 QT
80.873 -3.731 80.49 -2.95 QT
80.107 -2.169 79.514 -1.528 QT
78.92 -0.888 77.99 -0.083 QT
77.061 0.722 76.779 1.003 QT
74.514 3.175 L
76.436 3.175 L
77.842 3.175 78.795 3.151 QT
79.748 3.128 79.811 3.081 QT
80.045 2.831 80.295 1.237 QT
80.873 1.237 L
80.311 4.8 L
72.889 4.8 L
cp}def
f376030737
f
GR
GS
[0.75 0 0 0.75 454.44864 162] CT
N
f-727042790
f
GR
GS
[0.75 0 0 0.75 454.44864 162] CT
N
f1612806902
f
GR
GS
[0.75 0 0 0.75 454.44864 162] CT
N
f-10076840
f
GR
GS
[0.75 0 0 0.75 454.44864 162] CT
N
f-1564004227
f
GR
GS
[0.75 0 0 0.75 454.44864 162] CT
N
f-1535772716
f
GR
GS
[0.75 0 0 0.75 0 0] CT
0.467 0.675 0.188 RC
1 LJ
2.667 LW
N
562.994 216 M
602.936 216 L
S
GR
GS
[0.75 0 0 0.75 454.44864 180.375] CT
N
f1068973273
f
GR
GS
[0.75 0 0 0.75 454.44864 180.375] CT
N
f1138558608
f
GR
GS
[0.75 0 0 0.75 454.44864 180.375] CT
N
f-1967198721
f
GR
GS
[0.75 0 0 0.75 454.44864 180.375] CT
N
f-1428036658
f
GR
GS
[0.75 0 0 0.75 454.44864 180.375] CT
N
/f203859795{58.068 2.519 M
58.271 3.112 58.7 3.589 QT
59.13 4.066 59.708 4.331 QT
60.286 4.597 60.911 4.597 QT
62.364 4.597 62.911 3.48 QT
63.458 2.362 63.458 0.753 QT
63.458 0.066 63.435 -0.411 QT
63.411 -0.888 63.302 -1.325 QT
63.114 -2.028 62.646 -2.552 QT
62.177 -3.075 61.505 -3.075 QT
60.833 -3.075 60.349 -2.872 QT
59.864 -2.669 59.568 -2.395 QT
59.271 -2.122 59.036 -1.817 QT
58.802 -1.513 58.739 -1.497 QT
58.505 -1.497 L
58.458 -1.497 58.388 -1.559 QT
58.318 -1.622 58.318 -1.684 QT
58.318 -8.372 L
58.318 -8.419 58.38 -8.474 QT
58.443 -8.528 58.505 -8.528 QT
58.568 -8.528 L
59.911 -7.872 61.427 -7.872 QT
62.911 -7.872 64.286 -8.528 QT
64.349 -8.528 L
64.427 -8.528 64.482 -8.474 QT
64.536 -8.419 64.536 -8.372 QT
64.536 -8.184 L
64.536 -8.075 64.505 -8.075 QT
63.818 -7.169 62.786 -6.661 QT
61.755 -6.153 60.646 -6.153 QT
59.849 -6.153 59.005 -6.388 QT
59.005 -2.606 L
59.677 -3.138 60.2 -3.372 QT
60.724 -3.606 61.536 -3.606 QT
62.63 -3.606 63.505 -2.966 QT
64.38 -2.325 64.849 -1.309 QT
65.318 -0.294 65.318 0.769 QT
65.318 1.972 64.724 3.003 QT
64.13 4.034 63.114 4.636 QT
62.099 5.237 60.911 5.237 QT
59.927 5.237 59.099 4.73 QT
58.271 4.222 57.802 3.362 QT
57.333 2.503 57.333 1.534 QT
57.333 1.081 57.622 0.8 QT
57.911 0.519 58.349 0.519 QT
58.802 0.519 59.099 0.808 QT
59.396 1.097 59.396 1.534 QT
59.396 1.972 59.099 2.269 QT
58.802 2.566 58.349 2.566 QT
58.286 2.566 58.2 2.55 QT
58.114 2.534 58.068 2.519 QT
cp}def
f203859795
f
GR
GS
[0.75 0 0 0.75 454.44864 180.375] CT
N
f820751904
f
GR
GS
[0.75 0 0 0.75 454.44864 180.375] CT
N
/f-1618959814{76.889 5.237 M
74.436 5.237 73.553 3.222 QT
72.67 1.206 72.67 -1.575 QT
72.67 -3.309 72.99 -4.849 QT
73.311 -6.388 74.248 -7.458 QT
75.186 -8.528 76.889 -8.528 QT
78.201 -8.528 79.045 -7.88 QT
79.889 -7.231 80.326 -6.208 QT
80.764 -5.184 80.928 -4.02 QT
81.092 -2.856 81.092 -1.575 QT
81.092 0.144 80.772 1.644 QT
80.451 3.144 79.522 4.191 QT
78.592 5.237 76.889 5.237 QT
cp
76.889 4.722 M
77.998 4.722 78.545 3.581 QT
79.092 2.441 79.225 1.05 QT
79.357 -0.341 79.357 -1.903 QT
79.357 -3.403 79.225 -4.677 QT
79.092 -5.95 78.553 -6.974 QT
78.014 -7.997 76.889 -7.997 QT
75.764 -7.997 75.217 -6.966 QT
74.67 -5.934 74.537 -4.669 QT
74.404 -3.403 74.404 -1.903 QT
74.404 -0.794 74.459 0.198 QT
74.514 1.191 74.748 2.237 QT
74.982 3.284 75.506 4.003 QT
76.029 4.722 76.889 4.722 QT
cp}def
f-1618959814
f
GR
GS
[0.75 0 0 0.75 454.44864 180.375] CT
N
f-727042790
f
GR
GS
[0.75 0 0 0.75 454.44864 180.375] CT
N
f1612806902
f
GR
GS
[0.75 0 0 0.75 454.44864 180.375] CT
N
f-10076840
f
GR
GS
[0.75 0 0 0.75 454.44864 180.375] CT
N
f-1564004227
f
GR
GS
[0.75 0 0 0.75 454.44864 180.375] CT
N
f-1535772716
f
GR
GS
[0.75 0 0 0.75 0 0] CT
0.302 0.745 0.933 RC
1 LJ
2.667 LW
N
562.994 240.5 M
602.936 240.5 L
S
GR
GS
[0.75 0 0 0.75 454.44864 198.75] CT
N
f1068973273
f
GR
GS
[0.75 0 0 0.75 454.44864 198.75] CT
N
f1138558608
f
GR
GS
[0.75 0 0 0.75 454.44864 198.75] CT
N
f-1967198721
f
GR
GS
[0.75 0 0 0.75 454.44864 198.75] CT
N
f-1428036658
f
GR
GS
[0.75 0 0 0.75 454.44864 198.75] CT
N
/f1360200109{59.818 4.284 M
59.818 3.175 60.013 2.105 QT
60.208 1.034 60.583 -0.005 QT
60.958 -1.044 61.489 -2.044 QT
62.021 -3.044 62.646 -3.919 QT
64.474 -6.466 L
62.193 -6.466 L
58.646 -6.466 58.536 -6.356 QT
58.271 -6.044 58.036 -4.513 QT
57.458 -4.513 L
58.114 -8.716 L
58.693 -8.716 L
58.693 -8.653 L
58.693 -8.294 59.919 -8.184 QT
61.146 -8.075 62.318 -8.075 QT
66.036 -8.075 L
66.036 -7.559 L
66.036 -7.544 66.028 -7.536 QT
66.021 -7.528 66.005 -7.513 QT
63.255 -3.638 L
62.239 -2.138 61.989 -0.302 QT
61.739 1.534 61.739 4.284 QT
61.739 4.675 61.45 4.956 QT
61.161 5.237 60.771 5.237 QT
60.38 5.237 60.099 4.956 QT
59.818 4.675 59.818 4.284 QT
cp}def
f1360200109
f
GR
GS
[0.75 0 0 0.75 454.44864 198.75] CT
N
f820751904
f
GR
GS
[0.75 0 0 0.75 454.44864 198.75] CT
N
/f-1061730900{72.732 1.769 M
72.732 0.566 73.522 -0.356 QT
74.311 -1.278 75.545 -1.903 QT
74.811 -2.372 L
74.123 -2.825 73.693 -3.575 QT
73.264 -4.325 73.264 -5.138 QT
73.264 -6.106 73.772 -6.872 QT
74.279 -7.638 75.107 -8.083 QT
75.936 -8.528 76.889 -8.528 QT
77.779 -8.528 78.607 -8.161 QT
79.436 -7.794 79.967 -7.122 QT
80.498 -6.45 80.498 -5.528 QT
80.498 -4.856 80.178 -4.278 QT
79.857 -3.7 79.303 -3.239 QT
78.748 -2.778 78.123 -2.45 QT
79.279 -1.731 L
80.061 -1.2 80.545 -0.364 QT
81.029 0.472 81.029 1.394 QT
81.029 2.487 80.451 3.378 QT
79.873 4.269 78.912 4.753 QT
77.951 5.237 76.889 5.237 QT
75.857 5.237 74.897 4.816 QT
73.936 4.394 73.334 3.597 QT
72.732 2.8 72.732 1.769 QT
cp
73.811 1.769 M
73.811 2.55 74.248 3.206 QT
74.686 3.862 75.397 4.23 QT
76.107 4.597 76.889 4.597 QT
78.045 4.597 78.998 3.925 QT
79.951 3.253 79.951 2.128 QT
79.951 1.737 79.795 1.362 QT
79.639 0.987 79.373 0.683 QT
79.107 0.378 78.779 0.175 QT
76.092 -1.559 L
75.467 -1.231 74.943 -0.724 QT
74.42 -0.216 74.115 0.425 QT
73.811 1.066 73.811 1.769 QT
cp
75.186 -4.341 M
77.607 -2.778 L
78.451 -3.263 78.99 -3.958 QT
79.529 -4.653 79.529 -5.528 QT
79.529 -6.2 79.154 -6.763 QT
78.779 -7.325 78.17 -7.638 QT
77.561 -7.95 76.873 -7.95 QT
76.264 -7.95 75.647 -7.716 QT
75.029 -7.481 74.631 -7.013 QT
74.232 -6.544 74.232 -5.919 QT
74.232 -4.981 75.186 -4.341 QT
cp}def
f-1061730900
f
GR
GS
[0.75 0 0 0.75 454.44864 198.75] CT
N
f-727042790
f
GR
GS
[0.75 0 0 0.75 454.44864 198.75] CT
N
f1612806902
f
GR
GS
[0.75 0 0 0.75 454.44864 198.75] CT
N
f-10076840
f
GR
GS
[0.75 0 0 0.75 454.44864 198.75] CT
N
f-1564004227
f
GR
GS
[0.75 0 0 0.75 454.44864 198.75] CT
N
f-1535772716
f
GR
GS
[0.75 0 0 0.75 0 0] CT
0.635 0.078 0.184 RC
1 LJ
2.667 LW
N
562.994 265 M
602.936 265 L
S
GR
GS
[0.75 0 0 0.75 0 0] CT
0.149 GC
10.0 ML
0.667 LW
N
559 279 M
559 104 L
743 104 L
743 279 L
cp
S
GR
%%Trailer
%%Pages: 1
%%EOF
