<?xml version="1.0" encoding="UTF-8"?>

<!-- generated on Sat Apr 24 18:24:26 2021 by Eclipse SUMO Version 1.4.0
<configuration xmlns:xsi="http://www.w3.org/2001/XMLSchema-instance" xsi:noNamespaceSchemaLocation="http://sumo.dlr.de/xsd/sumoConfiguration.xsd">

    <input>
        <net-file value="sumofiles/junction.net.xml"/>
        <route-files value="sumofiles/junction_preemption_152.rou.xml"/>
        <additional-files value="sumofiles/junction.det.xml"/>
    </input>

    <output>
        <tripinfo-output value="sumofiles/output/tripinfo_preemption_152.xml"/>
    </output>

    <time>
        <begin value="0"/>
        <end value="10000"/>
        <step-length value="0.05"/>
    </time>

    <processing>
        <lateral-resolution value="0.1"/>
    </processing>

    <report>
        <no-warnings value="true"/>
        <error-log value="sumofiles/output/errorlog_preemption_152.log"/>
        <no-step-log value="true"/>
    </report>

    <traci_server>
        <remote-port value="46485"/>
    </traci_server>

    <gui_only>
        <gui-settings-file value="sumofiles/junction-gui.settings.xml"/>
        <tracker-interval value="0.05"/>
    </gui_only>

</configuration>
-->

<tripinfos xmlns:xsi="http://www.w3.org/2001/XMLSchema-instance" xsi:noNamespaceSchemaLocation="http://sumo.dlr.de/xsd/tripinfo_file.xsd">
    <tripinfo id="car_w2e_8" depart="8.00" departLane="w2sep_1" departPos="3.60" departPosLat="0.00" departSpeed="13.90" departDelay="0.00" arrival="150.25" arrivalLane="c2e_1" arrivalPos="990.00" arrivalPosLat="0.00" arrivalSpeed="14.04" duration="142.25" routeLength="1997.01" waitingTime="0.00" waitingCount="0" stopTime="0.00" timeLoss="0.04" rerouteNo="1" devices="tripinfo_car_w2e_8 routing_car_w2e_8" vType="Car" speedFactor="1.01" vaporized=""/>
    <tripinfo id="car_n2s_3" depart="3.00" departLane="n2sep_1" departPos="3.60" departPosLat="0.00" departSpeed="13.90" departDelay="0.00" arrival="161.75" arrivalLane="c2s_1" arrivalPos="990.00" arrivalPosLat="0.00" arrivalSpeed="14.73" duration="158.75" routeLength="1997.01" waitingTime="14.45" waitingCount="1" stopTime="0.00" timeLoss="23.20" rerouteNo="1" devices="tripinfo_car_n2s_3 routing_car_n2s_3" vType="Car" speedFactor="1.06" vaporized=""/>
    <tripinfo id="car_n2s_10" depart="11.45" departLane="n2sep_1" departPos="3.60" departPosLat="0.00" departSpeed="13.90" departDelay="1.45" arrival="167.80" arrivalLane="c2s_1" arrivalPos="990.00" arrivalPosLat="0.00" arrivalSpeed="15.05" duration="156.35" routeLength="1997.01" waitingTime="5.45" waitingCount="1" stopTime="0.00" timeLoss="23.64" rerouteNo="1" devices="tripinfo_car_n2s_10 routing_car_n2s_10" vType="Car" speedFactor="1.08" vaporized=""/>
    <tripinfo id="bus_s2n_5" depart="5.00" departLane="s2sep_1" departPos="12.10" departPosLat="0.00" departSpeed="13.90" departDelay="0.00" arrival="169.20" arrivalLane="c2n_1" arrivalPos="990.00" arrivalPosLat="0.00" arrivalSpeed="13.90" duration="164.20" routeLength="1988.51" waitingTime="10.25" waitingCount="1" stopTime="0.00" timeLoss="21.11" rerouteNo="1" devices="tripinfo_bus_s2n_5 routing_bus_s2n_5" vType="Bus" speedFactor="1.00" vaporized=""/>
    <tripinfo id="car_s2e_27" depart="27.00" departLane="s2sep_1" departPos="3.60" departPosLat="0.00" departSpeed="13.90" departDelay="0.00" arrival="169.25" arrivalLane="c2e_1" arrivalPos="990.00" arrivalPosLat="0.00" arrivalSpeed="15.05" duration="142.25" routeLength="1986.69" waitingTime="0.00" waitingCount="0" stopTime="0.00" timeLoss="9.57" rerouteNo="1" devices="tripinfo_car_s2e_27 routing_car_s2e_27" vType="Car" speedFactor="1.08" vaporized=""/>
    <tripinfo id="bus_n2w_10" depart="10.00" departLane="n2sep_1" departPos="12.10" departPosLat="0.00" departSpeed="13.90" departDelay="0.00" arrival="171.30" arrivalLane="c2w_1" arrivalPos="990.00" arrivalPosLat="0.00" arrivalSpeed="13.90" duration="161.30" routeLength="1978.19" waitingTime="6.90" waitingCount="1" stopTime="0.00" timeLoss="18.23" rerouteNo="1" devices="tripinfo_bus_n2w_10 routing_bus_n2w_10" vType="Bus" speedFactor="1.00" vaporized=""/>
    <tripinfo id="car_n2s_22" depart="22.00" departLane="n2sep_1" departPos="3.60" departPosLat="0.00" departSpeed="13.90" departDelay="0.00" arrival="173.15" arrivalLane="c2s_1" arrivalPos="990.00" arrivalPosLat="0.00" arrivalSpeed="14.53" duration="151.15" routeLength="1997.01" waitingTime="0.00" waitingCount="0" stopTime="0.00" timeLoss="13.74" rerouteNo="1" devices="tripinfo_car_n2s_22 routing_car_n2s_22" vType="Car" speedFactor="1.05" vaporized=""/>
    <tripinfo id="bus_s2n_17" depart="17.00" departLane="s2sep_1" departPos="12.10" departPosLat="0.00" departSpeed="13.90" departDelay="0.00" arrival="174.30" arrivalLane="c2n_1" arrivalPos="990.00" arrivalPosLat="0.00" arrivalSpeed="13.86" duration="157.30" routeLength="1988.51" waitingTime="0.85" waitingCount="1" stopTime="0.00" timeLoss="14.24" rerouteNo="1" devices="tripinfo_bus_s2n_17 routing_bus_s2n_17" vType="Bus" speedFactor="1.00" vaporized=""/>
    <tripinfo id="car_n2e_0" depart="0.00" departLane="n2sep_1" departPos="3.60" departPosLat="0.00" departSpeed="13.90" departDelay="0.00" arrival="174.90" arrivalLane="c2e_1" arrivalPos="990.00" arrivalPosLat="0.00" arrivalSpeed="14.73" duration="174.90" routeLength="1996.47" waitingTime="26.30" waitingCount="2" stopTime="0.00" timeLoss="38.72" rerouteNo="1" devices="tripinfo_car_n2e_0 routing_car_n2e_0" vType="Car" speedFactor="1.06" vaporized=""/>
    <tripinfo id="car_n2w_28" depart="28.00" departLane="n2sep_1" departPos="3.60" departPosLat="0.00" departSpeed="13.90" departDelay="0.00" arrival="176.20" arrivalLane="c2w_1" arrivalPos="990.00" arrivalPosLat="0.00" arrivalSpeed="14.31" duration="148.20" routeLength="1986.69" waitingTime="0.00" waitingCount="0" stopTime="0.00" timeLoss="8.74" rerouteNo="1" devices="tripinfo_car_n2w_28 routing_car_n2w_28" vType="Car" speedFactor="1.03" vaporized=""/>
    <tripinfo id="car_n2w_30" depart="30.00" departLane="n2sep_1" departPos="3.60" departPosLat="0.00" departSpeed="13.90" departDelay="0.00" arrival="178.65" arrivalLane="c2w_1" arrivalPos="990.00" arrivalPosLat="0.00" arrivalSpeed="14.95" duration="148.65" routeLength="1986.69" waitingTime="0.00" waitingCount="0" stopTime="0.00" timeLoss="16.94" rerouteNo="1" devices="tripinfo_car_n2w_30 routing_car_n2w_30" vType="Car" speedFactor="1.09" vaporized=""/>
    <tripinfo id="car_n2e_35" depart="35.00" departLane="n2sep_1" departPos="3.60" departPosLat="0.00" departSpeed="13.90" departDelay="0.00" arrival="179.45" arrivalLane="c2e_1" arrivalPos="990.00" arrivalPosLat="0.00" arrivalSpeed="14.53" duration="144.45" routeLength="1996.47" waitingTime="0.00" waitingCount="0" stopTime="0.00" timeLoss="6.44" rerouteNo="1" devices="tripinfo_car_n2e_35 routing_car_n2e_35" vType="Car" speedFactor="1.05" vaporized=""/>
    <tripinfo id="car_s2n_52" depart="52.00" departLane="s2sep_1" departPos="3.60" departPosLat="0.00" departSpeed="13.90" departDelay="0.00" arrival="195.80" arrivalLane="c2n_1" arrivalPos="990.00" arrivalPosLat="0.00" arrivalSpeed="13.90" duration="143.80" routeLength="1997.01" waitingTime="0.00" waitingCount="0" stopTime="0.00" timeLoss="0.12" rerouteNo="1" devices="tripinfo_car_s2n_52 routing_car_s2n_52" vType="Car" speedFactor="1.00" vaporized=""/>
    <tripinfo id="car_n2e_61" depart="61.00" departLane="n2sep_1" departPos="3.60" departPosLat="0.00" departSpeed="13.90" departDelay="0.00" arrival="197.05" arrivalLane="c2e_1" arrivalPos="990.00" arrivalPosLat="0.00" arrivalSpeed="15.16" duration="136.05" routeLength="1996.47" waitingTime="0.00" waitingCount="0" stopTime="0.00" timeLoss="3.71" rerouteNo="1" devices="tripinfo_car_n2e_61 routing_car_n2e_61" vType="Car" speedFactor="1.09" vaporized=""/>
    <tripinfo id="car_w2e_13" depart="13.00" departLane="w2sep_1" departPos="3.60" departPosLat="0.00" departSpeed="13.90" departDelay="0.00" arrival="208.80" arrivalLane="c2e_1" arrivalPos="990.00" arrivalPosLat="0.00" arrivalSpeed="14.32" duration="195.80" routeLength="1997.01" waitingTime="48.30" waitingCount="1" stopTime="0.00" timeLoss="56.35" rerouteNo="1" devices="tripinfo_car_w2e_13 routing_car_w2e_13" vType="Car" speedFactor="1.03" vaporized=""/>
    <tripinfo id="car_e2n_34" depart="34.00" departLane="e2sep_1" departPos="3.60" departPosLat="0.00" departSpeed="13.90" departDelay="0.00" arrival="210.70" arrivalLane="c2n_1" arrivalPos="990.00" arrivalPosLat="0.00" arrivalSpeed="13.90" duration="176.70" routeLength="1986.69" waitingTime="26.00" waitingCount="1" stopTime="0.00" timeLoss="33.03" rerouteNo="1" devices="tripinfo_car_e2n_34 routing_car_e2n_34" vType="Car" speedFactor="1.00" vaporized=""/>
    <tripinfo id="car_w2s_15" depart="15.00" departLane="w2sep_1" departPos="3.60" departPosLat="0.00" departSpeed="13.90" departDelay="0.00" arrival="212.95" arrivalLane="c2s_1" arrivalPos="990.00" arrivalPosLat="0.00" arrivalSpeed="13.90" duration="197.95" routeLength="1986.69" waitingTime="44.20" waitingCount="1" stopTime="0.00" timeLoss="54.31" rerouteNo="1" devices="tripinfo_car_w2s_15 routing_car_w2s_15" vType="Car" speedFactor="1.00" vaporized=""/>
    <tripinfo id="car_e2n_56" depart="56.45" departLane="e2sep_1" departPos="3.60" departPosLat="0.00" departSpeed="13.90" departDelay="0.45" arrival="214.50" arrivalLane="c2n_1" arrivalPos="990.00" arrivalPosLat="0.00" arrivalSpeed="14.13" duration="158.05" routeLength="1986.69" waitingTime="2.50" waitingCount="1" stopTime="0.00" timeLoss="16.92" rerouteNo="1" devices="tripinfo_car_e2n_56 routing_car_e2n_56" vType="Car" speedFactor="1.02" vaporized=""/>
    <tripinfo id="car_w2s_26" depart="26.00" departLane="w2sep_1" departPos="3.60" departPosLat="0.00" departSpeed="13.90" departDelay="0.00" arrival="217.05" arrivalLane="c2s_1" arrivalPos="990.00" arrivalPosLat="0.00" arrivalSpeed="14.03" duration="191.05" routeLength="1986.69" waitingTime="36.55" waitingCount="1" stopTime="0.00" timeLoss="48.86" rerouteNo="1" devices="tripinfo_car_w2s_26 routing_car_w2s_26" vType="Car" speedFactor="1.01" vaporized=""/>
    <tripinfo id="car_w2s_32" depart="33.45" departLane="w2sep_1" departPos="3.60" departPosLat="0.00" departSpeed="13.90" departDelay="1.45" arrival="219.75" arrivalLane="c2s_1" arrivalPos="990.00" arrivalPosLat="0.00" arrivalSpeed="14.43" duration="186.30" routeLength="1986.69" waitingTime="29.25" waitingCount="1" stopTime="0.00" timeLoss="49.09" rerouteNo="1" devices="tripinfo_car_w2s_32 routing_car_w2s_32" vType="Car" speedFactor="1.05" vaporized=""/>
    <tripinfo id="car_e2n_72" depart="72.00" departLane="e2sep_1" departPos="3.60" departPosLat="0.00" departSpeed="13.90" departDelay="0.00" arrival="220.30" arrivalLane="c2n_1" arrivalPos="990.00" arrivalPosLat="0.00" arrivalSpeed="13.90" duration="148.30" routeLength="1986.69" waitingTime="0.00" waitingCount="0" stopTime="0.00" timeLoss="4.62" rerouteNo="1" devices="tripinfo_car_e2n_72 routing_car_e2n_72" vType="Car" speedFactor="1.00" vaporized=""/>
    <tripinfo id="car_w2s_34" depart="35.20" departLane="w2sep_1" departPos="3.60" departPosLat="0.00" departSpeed="13.90" departDelay="1.20" arrival="221.80" arrivalLane="c2s_1" arrivalPos="990.00" arrivalPosLat="0.00" arrivalSpeed="15.12" duration="186.60" routeLength="1986.69" waitingTime="28.50" waitingCount="1" stopTime="0.00" timeLoss="58.63" rerouteNo="1" devices="tripinfo_car_w2s_34 routing_car_w2s_34" vType="Car" speedFactor="1.12" vaporized=""/>
    <tripinfo id="car_w2n_32" depart="32.00" departLane="w2sep_1" departPos="3.60" departPosLat="0.00" departSpeed="13.90" departDelay="0.00" arrival="223.65" arrivalLane="c2n_1" arrivalPos="990.00" arrivalPosLat="0.00" arrivalSpeed="14.22" duration="191.65" routeLength="1996.47" waitingTime="36.75" waitingCount="2" stopTime="0.00" timeLoss="51.02" rerouteNo="1" devices="tripinfo_car_w2n_32 routing_car_w2n_32" vType="Car" speedFactor="1.03" vaporized=""/>
    <tripinfo id="car_w2s_67" depart="67.00" departLane="w2sep_1" departPos="3.60" departPosLat="0.00" departSpeed="13.90" departDelay="0.00" arrival="223.85" arrivalLane="c2s_1" arrivalPos="990.00" arrivalPosLat="0.00" arrivalSpeed="15.16" duration="156.85" routeLength="1986.69" waitingTime="5.75" waitingCount="1" stopTime="0.00" timeLoss="28.91" rerouteNo="1" devices="tripinfo_car_w2s_67 routing_car_w2s_67" vType="Car" speedFactor="1.12" vaporized=""/>
    <tripinfo id="car_w2s_79" depart="79.00" departLane="w2sep_1" departPos="3.60" departPosLat="0.00" departSpeed="13.90" departDelay="0.00" arrival="225.90" arrivalLane="c2s_1" arrivalPos="990.00" arrivalPosLat="0.00" arrivalSpeed="15.25" duration="146.90" routeLength="1986.69" waitingTime="0.00" waitingCount="0" stopTime="0.00" timeLoss="19.94" rerouteNo="1" devices="tripinfo_car_w2s_79 routing_car_w2s_79" vType="Car" speedFactor="1.13" vaporized=""/>
    <tripinfo id="car_w2n_52" depart="52.00" departLane="w2sep_1" departPos="3.60" departPosLat="0.00" departSpeed="13.90" departDelay="0.00" arrival="227.65" arrivalLane="c2n_1" arrivalPos="990.00" arrivalPosLat="0.00" arrivalSpeed="13.88" duration="175.65" routeLength="1996.47" waitingTime="15.50" waitingCount="2" stopTime="0.00" timeLoss="31.33" rerouteNo="1" devices="tripinfo_car_w2n_52 routing_car_w2n_52" vType="Car" speedFactor="1.00" vaporized=""/>
    <tripinfo id="car_e2s_55" depart="55.00" departLane="e2sep_1" departPos="3.60" departPosLat="0.00" departSpeed="13.90" departDelay="0.00" arrival="229.90" arrivalLane="c2s_1" arrivalPos="990.00" arrivalPosLat="0.00" arrivalSpeed="13.89" duration="174.90" routeLength="1996.47" waitingTime="17.70" waitingCount="2" stopTime="0.00" timeLoss="30.58" rerouteNo="1" devices="tripinfo_car_e2s_55 routing_car_e2s_55" vType="Car" speedFactor="1.00" vaporized=""/>
    <tripinfo id="car_e2s_57" depart="58.25" departLane="e2sep_1" departPos="3.60" departPosLat="0.00" departSpeed="13.90" departDelay="1.25" arrival="233.15" arrivalLane="c2s_1" arrivalPos="990.00" arrivalPosLat="0.00" arrivalSpeed="13.99" duration="174.90" routeLength="1996.47" waitingTime="11.85" waitingCount="1" stopTime="0.00" timeLoss="32.01" rerouteNo="1" devices="tripinfo_car_e2s_57 routing_car_e2s_57" vType="Car" speedFactor="1.01" vaporized=""/>
    <tripinfo id="car_w2e_91" depart="91.00" departLane="w2sep_1" departPos="3.60" departPosLat="0.00" departSpeed="13.90" departDelay="0.00" arrival="235.20" arrivalLane="c2e_1" arrivalPos="990.00" arrivalPosLat="0.00" arrivalSpeed="13.90" duration="144.20" routeLength="1997.01" waitingTime="0.00" waitingCount="0" stopTime="0.00" timeLoss="0.51" rerouteNo="1" devices="tripinfo_car_w2e_91 routing_car_w2e_91" vType="Car" speedFactor="1.00" vaporized=""/>
    <tripinfo id="car_e2s_77" depart="77.00" departLane="e2sep_1" departPos="3.60" departPosLat="0.00" departSpeed="13.90" departDelay="0.00" arrival="236.45" arrivalLane="c2s_1" arrivalPos="990.00" arrivalPosLat="0.00" arrivalSpeed="13.86" duration="159.45" routeLength="1996.47" waitingTime="0.00" waitingCount="0" stopTime="0.00" timeLoss="15.12" rerouteNo="1" devices="tripinfo_car_e2s_77 routing_car_e2s_77" vType="Car" speedFactor="1.00" vaporized=""/>
    <tripinfo id="car_w2e_93" depart="93.00" departLane="w2sep_1" departPos="3.60" departPosLat="0.00" departSpeed="13.90" departDelay="0.00" arrival="237.05" arrivalLane="c2e_1" arrivalPos="990.00" arrivalPosLat="0.00" arrivalSpeed="15.50" duration="144.05" routeLength="1997.01" waitingTime="0.00" waitingCount="0" stopTime="0.00" timeLoss="22.11" rerouteNo="1" devices="tripinfo_car_w2e_93 routing_car_w2e_93" vType="Car" speedFactor="1.18" vaporized=""/>
    <tripinfo id="car_w2e_95" depart="95.00" departLane="w2sep_1" departPos="3.60" departPosLat="0.00" departSpeed="13.90" departDelay="0.00" arrival="239.00" arrivalLane="c2e_1" arrivalPos="990.00" arrivalPosLat="0.00" arrivalSpeed="15.47" duration="144.00" routeLength="1997.01" waitingTime="0.00" waitingCount="0" stopTime="0.00" timeLoss="19.55" rerouteNo="1" devices="tripinfo_car_w2e_95 routing_car_w2e_95" vType="Car" speedFactor="1.15" vaporized=""/>
    <tripinfo id="car_s2e_55" depart="55.00" departLane="s2sep_1" departPos="3.60" departPosLat="0.00" departSpeed="13.90" departDelay="0.00" arrival="246.45" arrivalLane="c2e_1" arrivalPos="990.00" arrivalPosLat="0.00" arrivalSpeed="16.10" duration="191.45" routeLength="1986.69" waitingTime="51.60" waitingCount="1" stopTime="0.00" timeLoss="67.39" rerouteNo="1" devices="tripinfo_car_s2e_55 routing_car_s2e_55" vType="Car" speedFactor="1.16" vaporized=""/>
    <tripinfo id="car_n2s_62" depart="62.30" departLane="n2sep_1" departPos="3.60" departPosLat="0.00" departSpeed="13.90" departDelay="0.30" arrival="253.95" arrivalLane="c2s_1" arrivalPos="990.00" arrivalPosLat="0.00" arrivalSpeed="14.27" duration="191.65" routeLength="1997.01" waitingTime="43.00" waitingCount="1" stopTime="0.00" timeLoss="51.67" rerouteNo="1" devices="tripinfo_car_n2s_62 routing_car_n2s_62" vType="Car" speedFactor="1.03" vaporized=""/>
    <tripinfo id="bus_n2w_82" depart="82.00" departLane="n2sep_1" departPos="12.10" departPosLat="0.00" departSpeed="13.90" departDelay="0.00" arrival="261.30" arrivalLane="c2w_1" arrivalPos="990.00" arrivalPosLat="0.00" arrivalSpeed="13.90" duration="179.30" routeLength="1978.19" waitingTime="25.05" waitingCount="1" stopTime="0.00" timeLoss="36.23" rerouteNo="1" devices="tripinfo_bus_n2w_82 routing_bus_n2w_82" vType="Bus" speedFactor="1.00" vaporized=""/>
    <tripinfo id="bus_s2e_68" depart="68.00" departLane="s2sep_1" departPos="12.10" departPosLat="0.00" departSpeed="13.90" departDelay="0.00" arrival="261.50" arrivalLane="c2e_1" arrivalPos="990.00" arrivalPosLat="0.00" arrivalSpeed="13.90" duration="193.50" routeLength="1978.19" waitingTime="38.60" waitingCount="1" stopTime="0.00" timeLoss="50.46" rerouteNo="1" devices="tripinfo_bus_s2e_68 routing_bus_s2e_68" vType="Bus" speedFactor="1.00" vaporized=""/>
    <tripinfo id="bus_n2w_85" depart="85.00" departLane="n2sep_1" departPos="12.10" departPosLat="0.00" departSpeed="13.90" departDelay="0.00" arrival="266.95" arrivalLane="c2w_1" arrivalPos="990.00" arrivalPosLat="0.00" arrivalSpeed="13.87" duration="181.95" routeLength="1978.19" waitingTime="23.00" waitingCount="1" stopTime="0.00" timeLoss="38.88" rerouteNo="1" devices="tripinfo_bus_n2w_85 routing_bus_n2w_85" vType="Bus" speedFactor="1.00" vaporized=""/>
    <tripinfo id="car_s2n_96" depart="96.00" departLane="s2sep_1" departPos="3.60" departPosLat="0.00" departSpeed="13.90" departDelay="0.00" arrival="266.95" arrivalLane="c2n_1" arrivalPos="990.00" arrivalPosLat="0.00" arrivalSpeed="13.97" duration="170.95" routeLength="1997.01" waitingTime="14.45" waitingCount="1" stopTime="0.00" timeLoss="28.01" rerouteNo="1" devices="tripinfo_car_s2n_96 routing_car_s2n_96" vType="Car" speedFactor="1.01" vaporized=""/>
    <tripinfo id="bus_s2e_79" depart="79.00" departLane="s2sep_1" departPos="12.10" departPosLat="0.00" departSpeed="13.90" departDelay="0.00" arrival="267.10" arrivalLane="c2e_1" arrivalPos="990.00" arrivalPosLat="0.00" arrivalSpeed="13.87" duration="188.10" routeLength="1978.19" waitingTime="30.25" waitingCount="1" stopTime="0.00" timeLoss="45.07" rerouteNo="1" devices="tripinfo_bus_s2e_79 routing_bus_s2e_79" vType="Bus" speedFactor="1.00" vaporized=""/>
    <tripinfo id="car_s2n_130" depart="130.00" departLane="s2sep_1" departPos="3.60" departPosLat="0.00" departSpeed="13.90" departDelay="0.00" arrival="268.85" arrivalLane="c2n_1" arrivalPos="990.00" arrivalPosLat="0.00" arrivalSpeed="15.48" duration="138.85" routeLength="1997.01" waitingTime="0.00" waitingCount="0" stopTime="0.00" timeLoss="15.92" rerouteNo="1" devices="tripinfo_car_s2n_130 routing_car_s2n_130" vType="Car" speedFactor="1.17" vaporized=""/>
    <tripinfo id="car_n2w_99" depart="99.00" departLane="n2sep_1" departPos="3.60" departPosLat="0.00" departSpeed="13.90" departDelay="0.00" arrival="269.30" arrivalLane="c2w_1" arrivalPos="990.00" arrivalPosLat="0.00" arrivalSpeed="15.63" duration="170.30" routeLength="1986.69" waitingTime="20.30" waitingCount="1" stopTime="0.00" timeLoss="47.69" rerouteNo="1" devices="tripinfo_car_n2w_99 routing_car_n2w_99" vType="Car" speedFactor="1.17" vaporized=""/>
    <tripinfo id="car_n2w_101" depart="101.00" departLane="n2sep_1" departPos="3.60" departPosLat="0.00" departSpeed="13.90" departDelay="0.00" arrival="273.25" arrivalLane="c2w_1" arrivalPos="990.00" arrivalPosLat="0.00" arrivalSpeed="13.89" duration="172.25" routeLength="1986.69" waitingTime="10.05" waitingCount="1" stopTime="0.00" timeLoss="28.61" rerouteNo="1" devices="tripinfo_car_n2w_101 routing_car_n2w_101" vType="Car" speedFactor="1.00" vaporized=""/>
    <tripinfo id="car_n2s_110" depart="110.00" departLane="n2sep_1" departPos="3.60" departPosLat="0.00" departSpeed="13.90" departDelay="0.00" arrival="274.30" arrivalLane="c2s_1" arrivalPos="990.00" arrivalPosLat="0.00" arrivalSpeed="13.90" duration="164.30" routeLength="1997.01" waitingTime="3.70" waitingCount="1" stopTime="0.00" timeLoss="20.61" rerouteNo="1" devices="tripinfo_car_n2s_110 routing_car_n2s_110" vType="Car" speedFactor="1.00" vaporized=""/>
    <tripinfo id="car_n2w_104" depart="104.00" departLane="n2sep_1" departPos="3.60" departPosLat="0.00" departSpeed="13.90" departDelay="0.00" arrival="276.20" arrivalLane="c2w_1" arrivalPos="990.00" arrivalPosLat="0.00" arrivalSpeed="14.09" duration="172.20" routeLength="1986.69" waitingTime="8.15" waitingCount="1" stopTime="0.00" timeLoss="31.30" rerouteNo="1" devices="tripinfo_car_n2w_104 routing_car_n2w_104" vType="Car" speedFactor="1.02" vaporized=""/>
    <tripinfo id="car_n2w_111" depart="111.50" departLane="n2sep_1" departPos="3.60" departPosLat="0.00" departSpeed="13.90" departDelay="0.50" arrival="278.25" arrivalLane="c2w_1" arrivalPos="990.00" arrivalPosLat="0.00" arrivalSpeed="14.85" duration="166.75" routeLength="1986.69" waitingTime="3.00" waitingCount="1" stopTime="0.00" timeLoss="36.39" rerouteNo="1" devices="tripinfo_car_n2w_111 routing_car_n2w_111" vType="Car" speedFactor="1.10" vaporized=""/>
    <tripinfo id="car_s2e_132" depart="132.00" departLane="s2sep_1" departPos="3.60" departPosLat="0.00" departSpeed="13.90" departDelay="0.00" arrival="279.40" arrivalLane="c2e_1" arrivalPos="990.00" arrivalPosLat="0.00" arrivalSpeed="13.94" duration="147.40" routeLength="1986.69" waitingTime="0.00" waitingCount="0" stopTime="0.00" timeLoss="4.16" rerouteNo="1" devices="tripinfo_car_s2e_132 routing_car_s2e_132" vType="Car" speedFactor="1.00" vaporized=""/>
    <tripinfo id="car_n2s_122" depart="122.00" departLane="n2sep_1" departPos="3.60" departPosLat="0.00" departSpeed="13.90" departDelay="0.00" arrival="279.50" arrivalLane="c2s_1" arrivalPos="990.00" arrivalPosLat="0.00" arrivalSpeed="13.90" duration="157.50" routeLength="1997.01" waitingTime="0.00" waitingCount="0" stopTime="0.00" timeLoss="13.80" rerouteNo="1" devices="tripinfo_car_n2s_122 routing_car_n2s_122" vType="Car" speedFactor="1.00" vaporized=""/>
    <tripinfo id="car_s2w_64" depart="64.00" departLane="s2sep_1" departPos="3.60" departPosLat="0.00" departSpeed="13.90" departDelay="0.00" arrival="281.45" arrivalLane="c2w_1" arrivalPos="990.00" arrivalPosLat="0.00" arrivalSpeed="14.50" duration="217.45" routeLength="1996.47" waitingTime="67.05" waitingCount="2" stopTime="0.00" timeLoss="79.63" rerouteNo="1" devices="tripinfo_car_s2w_64 routing_car_s2w_64" vType="Car" speedFactor="1.05" vaporized=""/>
    <tripinfo id="car_s2w_110" depart="110.00" departLane="s2sep_1" departPos="3.60" departPosLat="0.00" departSpeed="13.90" departDelay="0.00" arrival="283.35" arrivalLane="c2w_1" arrivalPos="990.00" arrivalPosLat="0.00" arrivalSpeed="15.65" duration="173.35" routeLength="1996.47" waitingTime="27.55" waitingCount="2" stopTime="0.00" timeLoss="51.01" rerouteNo="1" devices="tripinfo_car_s2w_110 routing_car_s2w_110" vType="Car" speedFactor="1.18" vaporized=""/>
    <tripinfo id="car_n2s_126" depart="126.00" departLane="n2sep_1" departPos="3.60" departPosLat="0.00" departSpeed="13.90" departDelay="0.00" arrival="283.35" arrivalLane="c2s_1" arrivalPos="990.00" arrivalPosLat="0.00" arrivalSpeed="13.88" duration="157.35" routeLength="1997.01" waitingTime="0.00" waitingCount="0" stopTime="0.00" timeLoss="13.65" rerouteNo="1" devices="tripinfo_car_n2s_126 routing_car_n2s_126" vType="Car" speedFactor="1.00" vaporized=""/>
    <tripinfo id="car_s2w_118" depart="118.00" departLane="s2sep_1" departPos="3.60" departPosLat="0.00" departSpeed="13.90" departDelay="0.00" arrival="288.55" arrivalLane="c2w_1" arrivalPos="990.00" arrivalPosLat="0.00" arrivalSpeed="14.42" duration="170.55" routeLength="1996.47" waitingTime="16.95" waitingCount="1" stopTime="0.00" timeLoss="31.48" rerouteNo="1" devices="tripinfo_car_s2w_118 routing_car_s2w_118" vType="Car" speedFactor="1.04" vaporized=""/>
    <tripinfo id="car_e2n_113" depart="113.00" departLane="e2sep_1" departPos="3.60" departPosLat="0.00" departSpeed="13.90" departDelay="0.00" arrival="291.20" arrivalLane="c2n_1" arrivalPos="990.00" arrivalPosLat="0.00" arrivalSpeed="16.10" duration="178.20" routeLength="1986.69" waitingTime="46.40" waitingCount="1" stopTime="0.00" timeLoss="54.15" rerouteNo="1" devices="tripinfo_car_e2n_113 routing_car_e2n_113" vType="Car" speedFactor="1.16" vaporized=""/>
    <tripinfo id="car_s2w_150" depart="150.00" departLane="s2sep_1" departPos="3.60" departPosLat="0.00" departSpeed="13.90" departDelay="0.00" arrival="295.25" arrivalLane="c2w_1" arrivalPos="990.00" arrivalPosLat="0.00" arrivalSpeed="14.23" duration="145.25" routeLength="1996.47" waitingTime="0.00" waitingCount="0" stopTime="0.00" timeLoss="4.24" rerouteNo="1" devices="tripinfo_car_s2w_150 routing_car_s2w_150" vType="Car" speedFactor="1.02" vaporized=""/>
    <tripinfo id="car_e2w_117" depart="117.00" departLane="e2sep_1" departPos="3.60" departPosLat="0.00" departSpeed="13.90" departDelay="0.00" arrival="298.50" arrivalLane="c2w_1" arrivalPos="990.00" arrivalPosLat="0.00" arrivalSpeed="15.11" duration="181.50" routeLength="1997.01" waitingTime="39.20" waitingCount="1" stopTime="0.00" timeLoss="49.89" rerouteNo="1" devices="tripinfo_car_e2w_117 routing_car_e2w_117" vType="Car" speedFactor="1.09" vaporized=""/>
    <tripinfo id="car_w2e_117" depart="118.40" departLane="w2sep_1" departPos="3.60" departPosLat="0.00" departSpeed="13.90" departDelay="1.40" arrival="299.50" arrivalLane="c2e_1" arrivalPos="990.00" arrivalPosLat="0.00" arrivalSpeed="14.15" duration="181.10" routeLength="1997.01" waitingTime="30.50" waitingCount="1" stopTime="0.00" timeLoss="39.97" rerouteNo="1" devices="tripinfo_car_w2e_117 routing_car_w2e_117" vType="Car" speedFactor="1.02" vaporized=""/>
    <tripinfo id="car_w2e_120" depart="120.20" departLane="w2sep_1" departPos="3.60" departPosLat="0.00" departSpeed="13.90" departDelay="0.20" arrival="303.00" arrivalLane="c2e_1" arrivalPos="990.00" arrivalPosLat="0.00" arrivalSpeed="14.46" duration="182.80" routeLength="1997.01" waitingTime="28.75" waitingCount="1" stopTime="0.00" timeLoss="45.07" rerouteNo="1" devices="tripinfo_car_w2e_120 routing_car_w2e_120" vType="Car" speedFactor="1.04" vaporized=""/>
    <tripinfo id="car_w2e_121" depart="122.00" departLane="w2sep_1" departPos="3.60" departPosLat="0.00" departSpeed="13.90" departDelay="1.00" arrival="305.45" arrivalLane="c2e_1" arrivalPos="990.00" arrivalPosLat="0.00" arrivalSpeed="14.92" duration="183.45" routeLength="1997.01" waitingTime="27.65" waitingCount="1" stopTime="0.00" timeLoss="51.39" rerouteNo="1" devices="tripinfo_car_w2e_121 routing_car_w2e_121" vType="Car" speedFactor="1.09" vaporized=""/>
    <tripinfo id="car_e2w_125" depart="125.00" departLane="e2sep_1" departPos="3.60" departPosLat="0.00" departSpeed="13.90" departDelay="0.00" arrival="305.80" arrivalLane="c2w_1" arrivalPos="990.00" arrivalPosLat="0.00" arrivalSpeed="13.90" duration="180.80" routeLength="1997.01" waitingTime="26.95" waitingCount="1" stopTime="0.00" timeLoss="37.11" rerouteNo="1" devices="tripinfo_car_e2w_125 routing_car_e2w_125" vType="Car" speedFactor="1.00" vaporized=""/>
    <tripinfo id="car_e2n_126" depart="126.45" departLane="e2sep_1" departPos="3.60" departPosLat="0.00" departSpeed="13.90" departDelay="0.45" arrival="307.50" arrivalLane="c2n_1" arrivalPos="990.00" arrivalPosLat="0.00" arrivalSpeed="13.90" duration="181.05" routeLength="1986.69" waitingTime="24.45" waitingCount="1" stopTime="0.00" timeLoss="37.39" rerouteNo="1" devices="tripinfo_car_e2n_126 routing_car_e2n_126" vType="Car" speedFactor="1.00" vaporized=""/>
    <tripinfo id="car_e2w_149" depart="149.00" departLane="e2sep_1" departPos="3.60" departPosLat="0.00" departSpeed="13.90" departDelay="0.00" arrival="307.75" arrivalLane="c2w_1" arrivalPos="990.00" arrivalPosLat="0.00" arrivalSpeed="15.25" duration="158.75" routeLength="1997.01" waitingTime="13.65" waitingCount="1" stopTime="0.00" timeLoss="32.99" rerouteNo="1" devices="tripinfo_car_e2w_149 routing_car_e2w_149" vType="Car" speedFactor="1.14" vaporized=""/>
    <tripinfo id="car_w2e_122" depart="123.80" departLane="w2sep_1" departPos="3.60" departPosLat="0.00" departSpeed="13.90" departDelay="1.80" arrival="309.45" arrivalLane="c2e_1" arrivalPos="990.00" arrivalPosLat="0.00" arrivalSpeed="14.03" duration="185.65" routeLength="1997.01" waitingTime="25.50" waitingCount="1" stopTime="0.00" timeLoss="43.38" rerouteNo="1" devices="tripinfo_car_w2e_122 routing_car_w2e_122" vType="Car" speedFactor="1.01" vaporized=""/>
    <tripinfo id="car_w2s_135" depart="135.00" departLane="w2sep_1" departPos="3.60" departPosLat="0.00" departSpeed="13.90" departDelay="0.00" arrival="311.30" arrivalLane="c2s_1" arrivalPos="990.00" arrivalPosLat="0.00" arrivalSpeed="13.90" duration="176.30" routeLength="1986.69" waitingTime="18.55" waitingCount="1" stopTime="0.00" timeLoss="32.60" rerouteNo="1" devices="tripinfo_car_w2s_135 routing_car_w2s_135" vType="Car" speedFactor="1.00" vaporized=""/>
    <tripinfo id="car_w2n_117" depart="117.00" departLane="w2sep_1" departPos="3.60" departPosLat="0.00" departSpeed="13.90" departDelay="0.00" arrival="311.50" arrivalLane="c2n_1" arrivalPos="990.00" arrivalPosLat="0.00" arrivalSpeed="14.30" duration="194.50" routeLength="1996.47" waitingTime="42.05" waitingCount="2" stopTime="0.00" timeLoss="54.45" rerouteNo="1" devices="tripinfo_car_w2n_117 routing_car_w2n_117" vType="Car" speedFactor="1.03" vaporized=""/>
    <tripinfo id="car_w2e_131" depart="132.45" departLane="w2sep_1" departPos="3.60" departPosLat="0.00" departSpeed="13.90" departDelay="1.45" arrival="311.60" arrivalLane="c2e_1" arrivalPos="990.00" arrivalPosLat="0.00" arrivalSpeed="14.87" duration="179.15" routeLength="1997.01" waitingTime="21.25" waitingCount="1" stopTime="0.00" timeLoss="48.03" rerouteNo="1" devices="tripinfo_car_w2e_131 routing_car_w2e_131" vType="Car" speedFactor="1.10" vaporized=""/>
    <tripinfo id="car_w2e_153" depart="153.00" departLane="w2sep_1" departPos="3.60" departPosLat="0.00" departSpeed="13.90" departDelay="0.00" arrival="314.90" arrivalLane="c2e_1" arrivalPos="990.00" arrivalPosLat="0.00" arrivalSpeed="14.08" duration="161.90" routeLength="1997.01" waitingTime="4.50" waitingCount="1" stopTime="0.00" timeLoss="20.43" rerouteNo="1" devices="tripinfo_car_w2e_153 routing_car_w2e_153" vType="Car" speedFactor="1.02" vaporized=""/>
    <tripinfo id="car_w2n_131" depart="131.00" departLane="w2sep_1" departPos="3.60" departPosLat="0.00" departSpeed="13.90" departDelay="0.00" arrival="315.60" arrivalLane="c2n_1" arrivalPos="990.00" arrivalPosLat="0.00" arrivalSpeed="14.12" duration="184.60" routeLength="1996.47" waitingTime="25.40" waitingCount="2" stopTime="0.00" timeLoss="42.64" rerouteNo="1" devices="tripinfo_car_w2n_131 routing_car_w2n_131" vType="Car" speedFactor="1.02" vaporized=""/>
    <tripinfo id="car_w2s_154" depart="154.55" departLane="w2sep_1" departPos="3.60" departPosLat="0.00" departSpeed="13.90" departDelay="0.55" arrival="316.60" arrivalLane="c2s_1" arrivalPos="990.00" arrivalPosLat="0.00" arrivalSpeed="13.90" duration="162.05" routeLength="1986.69" waitingTime="1.60" waitingCount="1" stopTime="0.00" timeLoss="18.35" rerouteNo="1" devices="tripinfo_car_w2s_154 routing_car_w2s_154" vType="Car" speedFactor="1.00" vaporized=""/>
    <tripinfo id="car_w2n_151" depart="151.00" departLane="w2sep_1" departPos="3.60" departPosLat="0.00" departSpeed="13.90" departDelay="0.00" arrival="317.60" arrivalLane="c2n_1" arrivalPos="990.00" arrivalPosLat="0.00" arrivalSpeed="15.19" duration="166.60" routeLength="1996.47" waitingTime="12.15" waitingCount="2" stopTime="0.00" timeLoss="39.08" rerouteNo="1" devices="tripinfo_car_w2n_151 routing_car_w2n_151" vType="Car" speedFactor="1.13" vaporized=""/>
    <tripinfo id="car_w2e_166" depart="166.00" departLane="w2sep_1" departPos="3.60" departPosLat="0.00" departSpeed="13.90" departDelay="0.00" arrival="317.65" arrivalLane="c2e_1" arrivalPos="990.00" arrivalPosLat="0.00" arrivalSpeed="14.35" duration="151.65" routeLength="1997.01" waitingTime="0.00" waitingCount="0" stopTime="0.00" timeLoss="13.50" rerouteNo="1" devices="tripinfo_car_w2e_166 routing_car_w2e_166" vType="Car" speedFactor="1.04" vaporized=""/>
    <tripinfo id="car_w2e_184" depart="184.00" departLane="w2sep_1" departPos="3.60" departPosLat="0.00" departSpeed="13.90" departDelay="0.00" arrival="321.80" arrivalLane="c2e_1" arrivalPos="990.00" arrivalPosLat="0.00" arrivalSpeed="14.66" duration="137.80" routeLength="1997.01" waitingTime="0.00" waitingCount="0" stopTime="0.00" timeLoss="1.67" rerouteNo="1" devices="tripinfo_car_w2e_184 routing_car_w2e_184" vType="Car" speedFactor="1.06" vaporized=""/>
    <tripinfo id="car_w2n_176" depart="176.00" departLane="w2sep_1" departPos="3.60" departPosLat="0.00" departSpeed="13.90" departDelay="0.00" arrival="322.00" arrivalLane="c2n_1" arrivalPos="990.00" arrivalPosLat="0.00" arrivalSpeed="14.21" duration="146.00" routeLength="1996.47" waitingTime="0.00" waitingCount="0" stopTime="0.00" timeLoss="4.94" rerouteNo="1" devices="tripinfo_car_w2n_176 routing_car_w2n_176" vType="Car" speedFactor="1.02" vaporized=""/>
    <tripinfo id="car_e2s_182" depart="182.00" departLane="e2sep_1" departPos="3.60" departPosLat="0.00" departSpeed="13.90" departDelay="0.00" arrival="327.05" arrivalLane="c2s_1" arrivalPos="990.00" arrivalPosLat="0.00" arrivalSpeed="14.17" duration="145.05" routeLength="1996.47" waitingTime="0.00" waitingCount="0" stopTime="0.00" timeLoss="3.50" rerouteNo="1" devices="tripinfo_car_e2s_182 routing_car_e2s_182" vType="Car" speedFactor="1.02" vaporized=""/>
    <tripinfo id="car_s2e_160" depart="160.00" departLane="s2sep_1" departPos="3.60" departPosLat="0.00" departSpeed="13.90" departDelay="0.00" arrival="337.45" arrivalLane="c2e_1" arrivalPos="990.00" arrivalPosLat="0.00" arrivalSpeed="16.38" duration="177.45" routeLength="1986.69" waitingTime="40.85" waitingCount="1" stopTime="0.00" timeLoss="55.58" rerouteNo="1" devices="tripinfo_car_s2e_160 routing_car_s2e_160" vType="Car" speedFactor="1.18" vaporized=""/>
    <tripinfo id="car_s2n_152" depart="153.10" departLane="s2sep_1" departPos="3.60" departPosLat="0.00" departSpeed="13.90" departDelay="1.10" arrival="338.35" arrivalLane="c2n_1" arrivalPos="990.00" arrivalPosLat="0.00" arrivalSpeed="15.56" duration="185.25" routeLength="1997.01" waitingTime="41.90" waitingCount="1" stopTime="0.00" timeLoss="56.90" rerouteNo="1" devices="tripinfo_car_s2n_152 routing_car_s2n_152" vType="Car" speedFactor="1.12" vaporized=""/>
    <tripinfo id="car_s2e_162" depart="162.00" departLane="s2sep_1" departPos="3.60" departPosLat="0.00" departSpeed="13.90" departDelay="0.00" arrival="342.45" arrivalLane="c2e_1" arrivalPos="990.00" arrivalPosLat="0.00" arrivalSpeed="16.04" duration="180.45" routeLength="1986.69" waitingTime="39.90" waitingCount="1" stopTime="0.00" timeLoss="55.99" rerouteNo="1" devices="tripinfo_car_s2e_162 routing_car_s2e_162" vType="Car" speedFactor="1.15" vaporized=""/>
    <tripinfo id="car_n2w_143" depart="143.00" departLane="n2sep_1" departPos="3.60" departPosLat="0.00" departSpeed="13.90" departDelay="0.00" arrival="345.65" arrivalLane="c2w_1" arrivalPos="990.00" arrivalPosLat="0.00" arrivalSpeed="13.90" duration="202.65" routeLength="1986.69" waitingTime="52.05" waitingCount="1" stopTime="0.00" timeLoss="58.95" rerouteNo="1" devices="tripinfo_car_n2w_143 routing_car_n2w_143" vType="Car" speedFactor="1.00" vaporized=""/>
    <tripinfo id="car_s2e_165" depart="165.00" departLane="s2sep_1" departPos="3.60" departPosLat="0.00" departSpeed="13.90" departDelay="0.00" arrival="345.65" arrivalLane="c2e_1" arrivalPos="990.00" arrivalPosLat="0.00" arrivalSpeed="16.21" duration="180.65" routeLength="1986.69" waitingTime="38.95" waitingCount="1" stopTime="0.00" timeLoss="58.04" rerouteNo="1" devices="tripinfo_car_s2e_165 routing_car_s2e_165" vType="Car" speedFactor="1.17" vaporized=""/>
    <tripinfo id="car_n2s_195" depart="196.40" departLane="n2sep_1" departPos="3.60" departPosLat="0.00" departSpeed="13.90" departDelay="1.40" arrival="346.05" arrivalLane="c2s_1" arrivalPos="990.00" arrivalPosLat="0.00" arrivalSpeed="15.32" duration="149.65" routeLength="1997.01" waitingTime="3.05" waitingCount="1" stopTime="0.00" timeLoss="19.27" rerouteNo="1" devices="tripinfo_car_n2s_195 routing_car_n2s_195" vType="Car" speedFactor="1.10" vaporized=""/>
    <tripinfo id="car_s2e_190" depart="190.00" departLane="s2sep_1" departPos="3.60" departPosLat="0.00" departSpeed="13.90" departDelay="0.00" arrival="348.50" arrivalLane="c2e_1" arrivalPos="990.00" arrivalPosLat="0.00" arrivalSpeed="16.27" duration="158.50" routeLength="1986.69" waitingTime="19.35" waitingCount="1" stopTime="0.00" timeLoss="36.70" rerouteNo="1" devices="tripinfo_car_s2e_190 routing_car_s2e_190" vType="Car" speedFactor="1.18" vaporized=""/>
    <tripinfo id="car_n2w_163" depart="163.00" departLane="n2sep_1" departPos="3.60" departPosLat="0.00" departSpeed="13.90" departDelay="0.00" arrival="349.95" arrivalLane="c2w_1" arrivalPos="990.00" arrivalPosLat="0.00" arrivalSpeed="13.96" duration="186.95" routeLength="1986.69" waitingTime="33.25" waitingCount="1" stopTime="0.00" timeLoss="44.01" rerouteNo="1" devices="tripinfo_car_n2w_163 routing_car_n2w_163" vType="Car" speedFactor="1.01" vaporized=""/>
    <tripinfo id="car_n2w_179" depart="179.00" departLane="n2sep_1" departPos="3.60" departPosLat="0.00" departSpeed="13.90" departDelay="0.00" arrival="353.70" arrivalLane="c2w_1" arrivalPos="990.00" arrivalPosLat="0.00" arrivalSpeed="13.88" duration="174.70" routeLength="1986.69" waitingTime="18.00" waitingCount="1" stopTime="0.00" timeLoss="31.02" rerouteNo="1" devices="tripinfo_car_n2w_179 routing_car_n2w_179" vType="Car" speedFactor="1.00" vaporized=""/>
    <tripinfo id="car_n2s_209" depart="209.00" departLane="n2sep_1" departPos="3.60" departPosLat="0.00" departSpeed="13.90" departDelay="0.00" arrival="354.35" arrivalLane="c2s_1" arrivalPos="990.00" arrivalPosLat="0.00" arrivalSpeed="14.49" duration="145.35" routeLength="1997.01" waitingTime="0.00" waitingCount="0" stopTime="0.00" timeLoss="7.54" rerouteNo="1" devices="tripinfo_car_n2s_209 routing_car_n2s_209" vType="Car" speedFactor="1.04" vaporized=""/>
    <tripinfo id="car_n2w_199" depart="199.00" departLane="n2sep_1" departPos="3.60" departPosLat="0.00" departSpeed="13.90" departDelay="0.00" arrival="356.50" arrivalLane="c2w_1" arrivalPos="990.00" arrivalPosLat="0.00" arrivalSpeed="14.22" duration="157.50" routeLength="1986.69" waitingTime="0.00" waitingCount="0" stopTime="0.00" timeLoss="18.04" rerouteNo="1" devices="tripinfo_car_n2w_199 routing_car_n2w_199" vType="Car" speedFactor="1.03" vaporized=""/>
    <tripinfo id="car_s2n_213" depart="213.00" departLane="s2sep_1" departPos="3.60" departPosLat="0.00" departSpeed="13.90" departDelay="0.00" arrival="357.35" arrivalLane="c2n_1" arrivalPos="990.00" arrivalPosLat="0.00" arrivalSpeed="14.21" duration="144.35" routeLength="1997.01" waitingTime="0.00" waitingCount="0" stopTime="0.00" timeLoss="3.74" rerouteNo="1" devices="tripinfo_car_s2n_213 routing_car_s2n_213" vType="Car" speedFactor="1.02" vaporized=""/>
    <tripinfo id="car_s2e_195" depart="195.00" departLane="s2sep_1" departPos="3.60" departPosLat="0.00" departSpeed="13.90" departDelay="0.00" arrival="357.65" arrivalLane="c2e_1" arrivalPos="990.00" arrivalPosLat="0.00" arrivalSpeed="14.00" duration="162.65" routeLength="1986.69" waitingTime="6.15" waitingCount="1" stopTime="0.00" timeLoss="20.02" rerouteNo="1" devices="tripinfo_car_s2e_195 routing_car_s2e_195" vType="Car" speedFactor="1.01" vaporized=""/>
    <tripinfo id="car_n2w_220" depart="220.00" departLane="n2sep_1" departPos="3.60" departPosLat="0.00" departSpeed="13.90" departDelay="0.00" arrival="360.85" arrivalLane="c2w_1" arrivalPos="990.00" arrivalPosLat="0.00" arrivalSpeed="14.68" duration="140.85" routeLength="1986.69" waitingTime="0.00" waitingCount="0" stopTime="0.00" timeLoss="4.91" rerouteNo="1" devices="tripinfo_car_n2w_220 routing_car_n2w_220" vType="Car" speedFactor="1.06" vaporized=""/>
    <tripinfo id="car_s2n_215" depart="216.15" departLane="s2sep_1" departPos="3.60" departPosLat="0.00" departSpeed="13.90" departDelay="1.15" arrival="361.25" arrivalLane="c2n_1" arrivalPos="990.00" arrivalPosLat="0.00" arrivalSpeed="14.48" duration="145.10" routeLength="1997.01" waitingTime="0.00" waitingCount="0" stopTime="0.00" timeLoss="7.38" rerouteNo="1" devices="tripinfo_car_s2n_215 routing_car_s2n_215" vType="Car" speedFactor="1.04" vaporized=""/>
    <tripinfo id="car_n2e_195" depart="195.00" departLane="n2sep_1" departPos="3.60" departPosLat="0.00" departSpeed="13.90" departDelay="0.00" arrival="364.00" arrivalLane="c2e_1" arrivalPos="990.00" arrivalPosLat="0.00" arrivalSpeed="14.35" duration="169.00" routeLength="1996.47" waitingTime="17.50" waitingCount="2" stopTime="0.00" timeLoss="29.19" rerouteNo="1" devices="tripinfo_car_n2e_195 routing_car_n2e_195" vType="Car" speedFactor="1.03" vaporized=""/>
    <tripinfo id="car_n2w_229" depart="229.00" departLane="n2sep_1" departPos="3.60" departPosLat="0.00" departSpeed="13.90" departDelay="0.00" arrival="365.20" arrivalLane="c2w_1" arrivalPos="990.00" arrivalPosLat="0.00" arrivalSpeed="15.23" duration="136.20" routeLength="1986.69" waitingTime="0.00" waitingCount="0" stopTime="0.00" timeLoss="5.26" rerouteNo="1" devices="tripinfo_car_n2w_229 routing_car_n2w_229" vType="Car" speedFactor="1.10" vaporized=""/>
    <tripinfo id="car_s2w_151" depart="151.40" departLane="s2sep_1" departPos="3.60" departPosLat="0.00" departSpeed="13.90" departDelay="0.40" arrival="369.80" arrivalLane="c2w_1" arrivalPos="990.00" arrivalPosLat="0.00" arrivalSpeed="15.04" duration="218.40" routeLength="1996.47" waitingTime="67.50" waitingCount="3" stopTime="0.00" timeLoss="85.07" rerouteNo="1" devices="tripinfo_car_s2w_151 routing_car_s2w_151" vType="Car" speedFactor="1.08" vaporized=""/>
    <tripinfo id="car_s2w_172" depart="172.00" departLane="s2sep_1" departPos="3.60" departPosLat="0.00" departSpeed="13.90" departDelay="0.00" arrival="375.80" arrivalLane="c2w_1" arrivalPos="990.00" arrivalPosLat="0.00" arrivalSpeed="14.21" duration="203.80" routeLength="1996.47" waitingTime="47.70" waitingCount="2" stopTime="0.00" timeLoss="62.59" rerouteNo="1" devices="tripinfo_car_s2w_172 routing_car_s2w_172" vType="Car" speedFactor="1.02" vaporized=""/>
    <tripinfo id="car_s2w_196" depart="196.45" departLane="s2sep_1" departPos="3.60" departPosLat="0.00" departSpeed="13.90" departDelay="0.45" arrival="378.30" arrivalLane="c2w_1" arrivalPos="990.00" arrivalPosLat="0.00" arrivalSpeed="14.91" duration="181.85" routeLength="1996.47" waitingTime="20.15" waitingCount="1" stopTime="0.00" timeLoss="49.07" rerouteNo="1" devices="tripinfo_car_s2w_196 routing_car_s2w_196" vType="Car" speedFactor="1.09" vaporized=""/>
    <tripinfo id="car_n2e_231" depart="231.00" departLane="n2sep_1" departPos="3.60" departPosLat="0.00" departSpeed="13.90" departDelay="0.00" arrival="379.45" arrivalLane="c2e_1" arrivalPos="990.00" arrivalPosLat="0.00" arrivalSpeed="13.90" duration="148.45" routeLength="1996.47" waitingTime="0.00" waitingCount="0" stopTime="0.00" timeLoss="4.12" rerouteNo="1" devices="tripinfo_car_n2e_231 routing_car_n2e_231" vType="Car" speedFactor="1.00" vaporized=""/>
    <tripinfo id="car_s2w_198" depart="198.15" departLane="s2sep_1" departPos="3.60" departPosLat="0.00" departSpeed="13.90" departDelay="0.15" arrival="382.30" arrivalLane="c2w_1" arrivalPos="990.00" arrivalPosLat="0.00" arrivalSpeed="14.12" duration="184.15" routeLength="1996.47" waitingTime="19.45" waitingCount="1" stopTime="0.00" timeLoss="42.22" rerouteNo="1" devices="tripinfo_car_s2w_198 routing_car_s2w_198" vType="Car" speedFactor="1.02" vaporized=""/>
    <tripinfo id="car_s2w_205" depart="205.00" departLane="s2sep_1" departPos="3.60" departPosLat="0.00" departSpeed="13.90" departDelay="0.00" arrival="384.25" arrivalLane="c2w_1" arrivalPos="990.00" arrivalPosLat="0.00" arrivalSpeed="15.31" duration="179.25" routeLength="1996.47" waitingTime="19.00" waitingCount="1" stopTime="0.00" timeLoss="53.50" rerouteNo="1" devices="tripinfo_car_s2w_205 routing_car_s2w_205" vType="Car" speedFactor="1.15" vaporized=""/>
    <tripinfo id="car_s2w_209" depart="209.00" departLane="s2sep_1" departPos="3.60" departPosLat="0.00" departSpeed="13.90" departDelay="0.00" arrival="388.00" arrivalLane="c2w_1" arrivalPos="990.00" arrivalPosLat="0.00" arrivalSpeed="13.98" duration="179.00" routeLength="1996.47" waitingTime="18.80" waitingCount="1" stopTime="0.00" timeLoss="35.66" rerouteNo="1" devices="tripinfo_car_s2w_209 routing_car_s2w_209" vType="Car" speedFactor="1.01" vaporized=""/>
    <tripinfo id="car_s2w_214" depart="214.45" departLane="s2sep_1" departPos="3.60" departPosLat="0.00" departSpeed="13.90" departDelay="0.45" arrival="390.15" arrivalLane="c2w_1" arrivalPos="990.00" arrivalPosLat="0.00" arrivalSpeed="14.81" duration="175.70" routeLength="1996.47" waitingTime="16.00" waitingCount="1" stopTime="0.00" timeLoss="43.52" rerouteNo="1" devices="tripinfo_car_s2w_214 routing_car_s2w_214" vType="Car" speedFactor="1.09" vaporized=""/>
    <tripinfo id="car_e2n_215" depart="215.00" departLane="e2sep_1" departPos="3.60" departPosLat="0.00" departSpeed="13.90" departDelay="0.00" arrival="390.50" arrivalLane="c2n_1" arrivalPos="990.00" arrivalPosLat="0.00" arrivalSpeed="14.42" duration="175.50" routeLength="1986.69" waitingTime="28.10" waitingCount="1" stopTime="0.00" timeLoss="37.05" rerouteNo="1" devices="tripinfo_car_e2n_215 routing_car_e2n_215" vType="Car" speedFactor="1.04" vaporized=""/>
    <tripinfo id="car_w2s_185" depart="185.35" departLane="w2sep_1" departPos="3.60" departPosLat="0.00" departSpeed="13.90" departDelay="0.35" arrival="390.65" arrivalLane="c2s_1" arrivalPos="990.00" arrivalPosLat="0.00" arrivalSpeed="13.90" duration="205.30" routeLength="1986.69" waitingTime="53.20" waitingCount="1" stopTime="0.00" timeLoss="61.60" rerouteNo="1" devices="tripinfo_car_w2s_185 routing_car_w2s_185" vType="Car" speedFactor="1.00" vaporized=""/>
    <tripinfo id="car_e2n_217" depart="217.00" departLane="e2sep_1" departPos="3.60" departPosLat="0.00" departSpeed="13.90" departDelay="0.00" arrival="393.35" arrivalLane="c2n_1" arrivalPos="990.00" arrivalPosLat="0.00" arrivalSpeed="15.05" duration="176.35" routeLength="1986.69" waitingTime="26.85" waitingCount="1" stopTime="0.00" timeLoss="44.67" rerouteNo="1" devices="tripinfo_car_e2n_217 routing_car_e2n_217" vType="Car" speedFactor="1.09" vaporized=""/>
    <tripinfo id="car_e2w_206" depart="206.00" departLane="e2sep_1" departPos="3.60" departPosLat="0.00" departSpeed="13.90" departDelay="0.00" arrival="393.70" arrivalLane="c2w_1" arrivalPos="990.00" arrivalPosLat="0.00" arrivalSpeed="13.87" duration="187.70" routeLength="1997.01" waitingTime="33.80" waitingCount="1" stopTime="0.00" timeLoss="44.02" rerouteNo="1" devices="tripinfo_car_e2w_206 routing_car_e2w_206" vType="Car" speedFactor="1.00" vaporized=""/>
    <tripinfo id="car_w2s_197" depart="197.00" departLane="w2sep_1" departPos="3.60" departPosLat="0.00" departSpeed="13.90" departDelay="0.00" arrival="393.90" arrivalLane="c2s_1" arrivalPos="990.00" arrivalPosLat="0.00" arrivalSpeed="14.33" duration="196.90" routeLength="1986.69" waitingTime="46.05" waitingCount="1" stopTime="0.00" timeLoss="58.04" rerouteNo="1" devices="tripinfo_car_w2s_197 routing_car_w2s_197" vType="Car" speedFactor="1.03" vaporized=""/>
    <tripinfo id="car_w2e_214" depart="214.00" departLane="w2sep_1" departPos="3.60" departPosLat="0.00" departSpeed="13.90" departDelay="0.00" arrival="394.05" arrivalLane="c2e_1" arrivalPos="990.00" arrivalPosLat="0.00" arrivalSpeed="14.13" duration="180.05" routeLength="1997.01" waitingTime="28.60" waitingCount="1" stopTime="0.00" timeLoss="38.71" rerouteNo="1" devices="tripinfo_car_w2e_214 routing_car_w2e_214" vType="Car" speedFactor="1.02" vaporized=""/>
    <tripinfo id="car_e2n_225" depart="225.00" departLane="e2sep_1" departPos="3.60" departPosLat="0.00" departSpeed="13.90" departDelay="0.00" arrival="396.25" arrivalLane="c2n_1" arrivalPos="990.00" arrivalPosLat="0.00" arrivalSpeed="15.03" duration="171.25" routeLength="1986.69" waitingTime="23.25" waitingCount="1" stopTime="0.00" timeLoss="39.21" rerouteNo="1" devices="tripinfo_car_e2n_225 routing_car_e2n_225" vType="Car" speedFactor="1.09" vaporized=""/>
    <tripinfo id="car_w2e_249" depart="249.00" departLane="w2sep_1" departPos="3.60" departPosLat="0.00" departSpeed="13.90" departDelay="0.00" arrival="397.30" arrivalLane="c2e_1" arrivalPos="990.00" arrivalPosLat="0.00" arrivalSpeed="14.74" duration="148.30" routeLength="1997.01" waitingTime="0.00" waitingCount="0" stopTime="0.00" timeLoss="13.35" rerouteNo="1" devices="tripinfo_car_w2e_249 routing_car_w2e_249" vType="Car" speedFactor="1.06" vaporized=""/>
    <tripinfo id="car_w2s_247" depart="247.00" departLane="w2sep_1" departPos="3.60" departPosLat="0.00" departSpeed="13.90" departDelay="0.00" arrival="398.20" arrivalLane="c2s_1" arrivalPos="990.00" arrivalPosLat="0.00" arrivalSpeed="14.08" duration="151.20" routeLength="1986.69" waitingTime="0.00" waitingCount="0" stopTime="0.00" timeLoss="9.51" rerouteNo="1" devices="tripinfo_car_w2s_247 routing_car_w2s_247" vType="Car" speedFactor="1.01" vaporized=""/>
    <tripinfo id="car_e2n_227" depart="227.00" departLane="e2sep_1" departPos="3.60" departPosLat="0.00" departSpeed="13.90" departDelay="0.00" arrival="398.65" arrivalLane="c2n_1" arrivalPos="990.00" arrivalPosLat="0.00" arrivalSpeed="15.35" duration="171.65" routeLength="1986.69" waitingTime="21.80" waitingCount="1" stopTime="0.00" timeLoss="43.56" rerouteNo="1" devices="tripinfo_car_e2n_227 routing_car_e2n_227" vType="Car" speedFactor="1.12" vaporized=""/>
    <tripinfo id="car_e2s_198" depart="198.00" departLane="e2sep_1" departPos="3.60" departPosLat="0.00" departSpeed="13.90" departDelay="0.00" arrival="403.40" arrivalLane="c2s_1" arrivalPos="990.00" arrivalPosLat="0.00" arrivalSpeed="13.90" duration="205.40" routeLength="1996.47" waitingTime="49.45" waitingCount="2" stopTime="0.00" timeLoss="61.05" rerouteNo="1" devices="tripinfo_car_e2s_198 routing_car_e2s_198" vType="Car" speedFactor="1.00" vaporized=""/>
    <tripinfo id="car_w2n_208" depart="208.00" departLane="w2sep_1" departPos="3.60" departPosLat="0.00" departSpeed="13.90" departDelay="0.00" arrival="404.50" arrivalLane="c2n_1" arrivalPos="990.00" arrivalPosLat="0.00" arrivalSpeed="13.92" duration="196.50" routeLength="1996.47" waitingTime="40.20" waitingCount="2" stopTime="0.00" timeLoss="52.41" rerouteNo="1" devices="tripinfo_car_w2n_208 routing_car_w2n_208" vType="Car" speedFactor="1.00" vaporized=""/>
    <tripinfo id="car_e2s_230" depart="230.00" departLane="e2sep_1" departPos="3.60" departPosLat="0.00" departSpeed="13.90" departDelay="0.00" arrival="405.85" arrivalLane="c2s_1" arrivalPos="990.00" arrivalPosLat="0.00" arrivalSpeed="14.60" duration="175.85" routeLength="1996.47" waitingTime="19.60" waitingCount="2" stopTime="0.00" timeLoss="40.34" rerouteNo="1" devices="tripinfo_car_e2s_230 routing_car_e2s_230" vType="Car" speedFactor="1.07" vaporized=""/>
    <tripinfo id="car_w2n_238" depart="238.00" departLane="w2sep_1" departPos="3.60" departPosLat="0.00" departSpeed="13.90" departDelay="0.00" arrival="408.55" arrivalLane="c2n_1" arrivalPos="990.00" arrivalPosLat="0.00" arrivalSpeed="13.89" duration="170.55" routeLength="1996.47" waitingTime="10.00" waitingCount="2" stopTime="0.00" timeLoss="26.22" rerouteNo="1" devices="tripinfo_car_w2n_238 routing_car_w2n_238" vType="Car" speedFactor="1.00" vaporized=""/>
    <tripinfo id="car_e2s_260" depart="260.00" departLane="e2sep_1" departPos="3.60" departPosLat="0.00" departSpeed="13.90" departDelay="0.00" arrival="409.50" arrivalLane="c2s_1" arrivalPos="990.00" arrivalPosLat="0.00" arrivalSpeed="14.00" duration="149.50" routeLength="1996.47" waitingTime="0.00" waitingCount="0" stopTime="0.00" timeLoss="6.44" rerouteNo="1" devices="tripinfo_car_e2s_260 routing_car_e2s_260" vType="Car" speedFactor="1.01" vaporized=""/>
    <tripinfo id="amb_w2e_300" depart="300.00" departLane="w2sep_1" departPos="6.60" departPosLat="0.00" departSpeed="13.90" departDelay="0.00" arrival="411.15" arrivalLane="c2e_1" arrivalPos="990.00" arrivalPosLat="-0.95" arrivalSpeed="20.84" duration="111.15" routeLength="1994.01" waitingTime="0.00" waitingCount="0" stopTime="0.00" timeLoss="15.51" rerouteNo="1" devices="tripinfo_amb_w2e_300 routing_amb_w2e_300 bluelight_amb_w2e_300 fcd_amb_w2e_300" vType="Ambulance" speedFactor="1.50" vaporized="">
        <example_device customValue1="0.00" customValue2="-1.00"/>
    </tripinfo>
    <tripinfo id="bus_e2n_262" depart="262.05" departLane="e2sep_1" departPos="12.10" departPosLat="0.00" departSpeed="13.90" departDelay="0.05" arrival="413.90" arrivalLane="c2n_1" arrivalPos="990.00" arrivalPosLat="0.00" arrivalSpeed="13.87" duration="151.85" routeLength="1978.19" waitingTime="0.00" waitingCount="0" stopTime="0.00" timeLoss="8.75" rerouteNo="1" devices="tripinfo_bus_e2n_262 routing_bus_e2n_262" vType="Bus" speedFactor="1.00" vaporized=""/>
    <tripinfo id="car_w2s_267" depart="267.00" departLane="w2sep_1" departPos="3.60" departPosLat="0.00" departSpeed="13.90" departDelay="0.00" arrival="414.65" arrivalLane="c2s_1" arrivalPos="990.00" arrivalPosLat="0.00" arrivalSpeed="13.94" duration="147.65" routeLength="1986.69" waitingTime="0.00" waitingCount="0" stopTime="0.00" timeLoss="4.42" rerouteNo="1" devices="tripinfo_car_w2s_267 routing_car_w2s_267" vType="Car" speedFactor="1.00" vaporized=""/>
    <tripinfo id="car_w2e_275" depart="275.00" departLane="w2sep_1" departPos="3.60" departPosLat="0.00" departSpeed="13.90" departDelay="0.00" arrival="415.20" arrivalLane="c2e_1" arrivalPos="990.00" arrivalPosLat="1.10" arrivalSpeed="14.34" duration="140.20" routeLength="1997.01" waitingTime="0.00" waitingCount="0" stopTime="0.00" timeLoss="0.90" rerouteNo="1" devices="tripinfo_car_w2e_275 routing_car_w2e_275" vType="Car@car_w2e_275" speedFactor="1.03" vaporized=""/>
    <tripinfo id="car_e2n_264" depart="264.00" departLane="e2sep_1" departPos="3.60" departPosLat="0.00" departSpeed="13.90" departDelay="0.00" arrival="416.25" arrivalLane="c2n_1" arrivalPos="990.00" arrivalPosLat="0.00" arrivalSpeed="15.68" duration="152.25" routeLength="1986.69" waitingTime="0.00" waitingCount="0" stopTime="0.00" timeLoss="30.17" rerouteNo="1" devices="tripinfo_car_e2n_264 routing_car_e2n_264" vType="Car" speedFactor="1.18" vaporized=""/>
    <tripinfo id="car_w2n_255" depart="255.00" departLane="w2sep_1" departPos="3.60" departPosLat="0.00" departSpeed="13.90" departDelay="0.00" arrival="418.15" arrivalLane="c2n_1" arrivalPos="990.00" arrivalPosLat="0.00" arrivalSpeed="15.59" duration="163.15" routeLength="1996.47" waitingTime="11.70" waitingCount="2" stopTime="0.00" timeLoss="39.68" rerouteNo="1" devices="tripinfo_car_w2n_255 routing_car_w2n_255" vType="Car" speedFactor="1.17" vaporized=""/>
    <tripinfo id="car_e2s_269" depart="269.00" departLane="e2sep_1" departPos="3.60" departPosLat="0.00" departSpeed="13.90" departDelay="0.00" arrival="421.00" arrivalLane="c2s_1" arrivalPos="990.00" arrivalPosLat="0.00" arrivalSpeed="13.90" duration="152.00" routeLength="1996.47" waitingTime="0.00" waitingCount="0" stopTime="0.00" timeLoss="7.68" rerouteNo="1" devices="tripinfo_car_e2s_269 routing_car_e2s_269" vType="Car" speedFactor="1.00" vaporized=""/>
    <tripinfo id="car_w2e_283" depart="283.00" departLane="w2sep_1" departPos="3.60" departPosLat="0.00" departSpeed="13.90" departDelay="0.00" arrival="427.15" arrivalLane="c2e_1" arrivalPos="990.00" arrivalPosLat="1.10" arrivalSpeed="13.90" duration="144.15" routeLength="1997.01" waitingTime="0.00" waitingCount="0" stopTime="0.00" timeLoss="0.45" rerouteNo="1" devices="tripinfo_car_w2e_283 routing_car_w2e_283" vType="Car@car_w2e_283" speedFactor="1.00" vaporized=""/>
    <tripinfo id="car_w2s_284" depart="284.45" departLane="w2sep_1" departPos="3.60" departPosLat="0.00" departSpeed="13.90" departDelay="0.45" arrival="428.55" arrivalLane="c2s_1" arrivalPos="990.00" arrivalPosLat="0.00" arrivalSpeed="14.85" duration="144.10" routeLength="1986.69" waitingTime="0.00" waitingCount="0" stopTime="0.00" timeLoss="9.59" rerouteNo="1" devices="tripinfo_car_w2s_284 routing_car_w2s_284" vType="Car" speedFactor="1.07" vaporized=""/>
    <tripinfo id="car_e2s_289" depart="289.00" departLane="e2sep_1" departPos="3.60" departPosLat="0.00" departSpeed="13.90" departDelay="0.00" arrival="431.10" arrivalLane="c2s_1" arrivalPos="990.00" arrivalPosLat="0.00" arrivalSpeed="15.68" duration="142.10" routeLength="1996.47" waitingTime="2.30" waitingCount="1" stopTime="0.00" timeLoss="15.76" rerouteNo="1" devices="tripinfo_car_e2s_289 routing_car_e2s_289" vType="Car" speedFactor="1.14" vaporized=""/>
    <tripinfo id="car_e2w_277" depart="277.45" departLane="e2sep_1" departPos="3.60" departPosLat="0.00" departSpeed="13.90" departDelay="0.45" arrival="433.45" arrivalLane="c2w_1" arrivalPos="990.00" arrivalPosLat="0.00" arrivalSpeed="14.75" duration="156.00" routeLength="1997.01" waitingTime="7.95" waitingCount="1" stopTime="0.00" timeLoss="20.55" rerouteNo="1" devices="tripinfo_car_e2w_277 routing_car_e2w_277" vType="Car" speedFactor="1.06" vaporized=""/>
    <tripinfo id="car_e2n_276" depart="276.00" departLane="e2sep_1" departPos="3.60" departPosLat="0.00" departSpeed="13.90" departDelay="0.00" arrival="433.75" arrivalLane="c2n_1" arrivalPos="990.00" arrivalPosLat="0.00" arrivalSpeed="14.23" duration="157.75" routeLength="1986.69" waitingTime="9.65" waitingCount="1" stopTime="0.00" timeLoss="17.36" rerouteNo="1" devices="tripinfo_car_e2n_276 routing_car_e2n_276" vType="Car" speedFactor="1.02" vaporized=""/>
    <tripinfo id="car_n2s_260" depart="260.00" departLane="n2sep_1" departPos="3.60" departPosLat="0.00" departSpeed="13.90" departDelay="0.00" arrival="450.50" arrivalLane="c2s_1" arrivalPos="990.00" arrivalPosLat="0.00" arrivalSpeed="15.27" duration="190.50" routeLength="1997.01" waitingTime="49.60" waitingCount="1" stopTime="0.00" timeLoss="59.71" rerouteNo="1" devices="tripinfo_car_n2s_260 routing_car_n2s_260" vType="Car" speedFactor="1.10" vaporized=""/>
    <tripinfo id="car_n2w_240" depart="240.00" departLane="n2sep_1" departPos="3.60" departPosLat="0.00" departSpeed="13.90" departDelay="0.00" arrival="452.30" arrivalLane="c2w_1" arrivalPos="990.00" arrivalPosLat="0.00" arrivalSpeed="13.90" duration="212.30" routeLength="1986.69" waitingTime="61.55" waitingCount="1" stopTime="0.00" timeLoss="68.64" rerouteNo="1" devices="tripinfo_car_n2w_240 routing_car_n2w_240" vType="Car" speedFactor="1.00" vaporized=""/>
    <tripinfo id="car_s2e_248" depart="248.00" departLane="s2sep_1" departPos="3.60" departPosLat="0.00" departSpeed="13.90" departDelay="0.00" arrival="452.30" arrivalLane="c2e_1" arrivalPos="990.00" arrivalPosLat="0.00" arrivalSpeed="14.38" duration="204.30" routeLength="1986.69" waitingTime="56.70" waitingCount="1" stopTime="0.00" timeLoss="65.44" rerouteNo="1" devices="tripinfo_car_s2e_248 routing_car_s2e_248" vType="Car" speedFactor="1.03" vaporized=""/>
    <tripinfo id="car_s2n_235" depart="235.00" departLane="s2sep_1" departPos="3.60" departPosLat="0.00" departSpeed="13.90" departDelay="0.00" arrival="452.40" arrivalLane="c2n_1" arrivalPos="990.00" arrivalPosLat="0.00" arrivalSpeed="13.90" duration="217.40" routeLength="1997.01" waitingTime="67.15" waitingCount="1" stopTime="0.00" timeLoss="73.71" rerouteNo="1" devices="tripinfo_car_s2n_235 routing_car_s2n_235" vType="Car" speedFactor="1.00" vaporized=""/>
    <tripinfo id="car_n2w_242" depart="242.00" departLane="n2sep_1" departPos="3.60" departPosLat="0.00" departSpeed="13.90" departDelay="0.00" arrival="454.85" arrivalLane="c2w_1" arrivalPos="990.00" arrivalPosLat="0.00" arrivalSpeed="14.73" duration="212.85" routeLength="1986.69" waitingTime="60.25" waitingCount="1" stopTime="0.00" timeLoss="78.92" rerouteNo="1" devices="tripinfo_car_n2w_242 routing_car_n2w_242" vType="Car" speedFactor="1.07" vaporized=""/>
    <tripinfo id="car_n2w_273" depart="273.00" departLane="n2sep_1" departPos="3.60" departPosLat="0.00" departSpeed="13.90" departDelay="0.00" arrival="457.15" arrivalLane="c2w_1" arrivalPos="990.00" arrivalPosLat="0.00" arrivalSpeed="15.06" duration="184.15" routeLength="1986.69" waitingTime="37.95" waitingCount="1" stopTime="0.00" timeLoss="53.93" rerouteNo="1" devices="tripinfo_car_n2w_273 routing_car_n2w_273" vType="Car" speedFactor="1.10" vaporized=""/>
    <tripinfo id="car_s2n_254" depart="254.00" departLane="s2sep_1" departPos="3.60" departPosLat="0.00" departSpeed="13.90" departDelay="0.00" arrival="457.65" arrivalLane="c2n_1" arrivalPos="990.00" arrivalPosLat="0.00" arrivalSpeed="13.90" duration="203.65" routeLength="1997.01" waitingTime="49.40" waitingCount="1" stopTime="0.00" timeLoss="59.95" rerouteNo="1" devices="tripinfo_car_s2n_254 routing_car_s2n_254" vType="Car" speedFactor="1.00" vaporized=""/>
    <tripinfo id="car_n2s_281" depart="281.00" departLane="n2sep_1" departPos="3.60" departPosLat="0.00" departSpeed="13.90" departDelay="0.00" arrival="459.25" arrivalLane="c2s_1" arrivalPos="990.00" arrivalPosLat="0.00" arrivalSpeed="14.35" duration="178.25" routeLength="1997.01" waitingTime="27.20" waitingCount="1" stopTime="0.00" timeLoss="39.06" rerouteNo="1" devices="tripinfo_car_n2s_281 routing_car_n2s_281" vType="Car" speedFactor="1.03" vaporized=""/>
    <tripinfo id="car_s2n_261" depart="261.00" departLane="s2sep_1" departPos="3.60" departPosLat="0.00" departSpeed="13.90" departDelay="0.00" arrival="459.80" arrivalLane="c2n_1" arrivalPos="990.00" arrivalPosLat="0.00" arrivalSpeed="14.87" duration="198.80" routeLength="1997.01" waitingTime="44.10" waitingCount="1" stopTime="0.00" timeLoss="67.77" rerouteNo="1" devices="tripinfo_car_s2n_261 routing_car_s2n_261" vType="Car" speedFactor="1.10" vaporized=""/>
    <tripinfo id="car_n2w_306" depart="306.00" departLane="n2sep_1" departPos="3.60" departPosLat="0.00" departSpeed="13.90" departDelay="0.00" arrival="460.05" arrivalLane="c2w_1" arrivalPos="990.00" arrivalPosLat="0.00" arrivalSpeed="15.37" duration="154.05" routeLength="1986.69" waitingTime="3.05" waitingCount="1" stopTime="0.00" timeLoss="25.07" rerouteNo="1" devices="tripinfo_car_n2w_306 routing_car_n2w_306" vType="Car" speedFactor="1.11" vaporized=""/>
    <tripinfo id="car_s2e_265" depart="265.00" departLane="s2sep_1" departPos="3.60" departPosLat="0.00" departSpeed="13.90" departDelay="0.00" arrival="461.15" arrivalLane="c2e_1" arrivalPos="990.00" arrivalPosLat="0.00" arrivalSpeed="13.96" duration="196.15" routeLength="1986.69" waitingTime="40.50" waitingCount="1" stopTime="0.00" timeLoss="53.09" rerouteNo="1" devices="tripinfo_car_s2e_265 routing_car_s2e_265" vType="Car" speedFactor="1.00" vaporized=""/>
    <tripinfo id="car_s2n_278" depart="278.00" departLane="s2sep_1" departPos="3.60" departPosLat="0.00" departSpeed="13.90" departDelay="0.00" arrival="461.75" arrivalLane="c2n_1" arrivalPos="990.00" arrivalPosLat="0.00" arrivalSpeed="15.39" duration="183.75" routeLength="1997.01" waitingTime="38.40" waitingCount="1" stopTime="0.00" timeLoss="59.12" rerouteNo="1" devices="tripinfo_car_s2n_278 routing_car_s2n_278" vType="Car" speedFactor="1.15" vaporized=""/>
    <tripinfo id="car_n2w_310" depart="310.00" departLane="n2sep_1" departPos="3.60" departPosLat="0.00" departSpeed="13.90" departDelay="0.00" arrival="462.40" arrivalLane="c2w_1" arrivalPos="990.00" arrivalPosLat="0.00" arrivalSpeed="15.89" duration="152.40" routeLength="1986.69" waitingTime="2.45" waitingCount="1" stopTime="0.00" timeLoss="29.01" rerouteNo="1" devices="tripinfo_car_n2w_310 routing_car_n2w_310" vType="Car" speedFactor="1.16" vaporized=""/>
    <tripinfo id="car_s2e_267" depart="267.00" departLane="s2sep_1" departPos="3.60" departPosLat="0.00" departSpeed="13.90" departDelay="0.00" arrival="463.75" arrivalLane="c2e_1" arrivalPos="990.00" arrivalPosLat="0.00" arrivalSpeed="14.72" duration="196.75" routeLength="1986.69" waitingTime="39.50" waitingCount="1" stopTime="0.00" timeLoss="62.57" rerouteNo="1" devices="tripinfo_car_s2e_267 routing_car_s2e_267" vType="Car" speedFactor="1.07" vaporized=""/>
    <tripinfo id="car_n2s_304" depart="304.00" departLane="n2sep_1" departPos="3.60" departPosLat="0.00" departSpeed="13.90" departDelay="0.00" arrival="464.55" arrivalLane="c2s_1" arrivalPos="990.00" arrivalPosLat="0.00" arrivalSpeed="13.95" duration="160.55" routeLength="1997.01" waitingTime="3.65" waitingCount="1" stopTime="0.00" timeLoss="17.43" rerouteNo="1" devices="tripinfo_car_n2s_304 routing_car_n2s_304" vType="Car" speedFactor="1.00" vaporized=""/>
    <tripinfo id="car_s2e_283" depart="284.45" departLane="s2sep_1" departPos="3.60" departPosLat="0.00" departSpeed="13.90" departDelay="1.45" arrival="467.40" arrivalLane="c2e_1" arrivalPos="990.00" arrivalPosLat="0.00" arrivalSpeed="14.32" duration="182.95" routeLength="1986.69" waitingTime="24.30" waitingCount="1" stopTime="0.00" timeLoss="43.78" rerouteNo="1" devices="tripinfo_car_s2e_283 routing_car_s2e_283" vType="Car" speedFactor="1.03" vaporized=""/>
    <tripinfo id="car_s2e_299" depart="299.00" departLane="s2sep_1" departPos="3.60" departPosLat="0.00" departSpeed="13.90" departDelay="0.00" arrival="469.15" arrivalLane="c2e_1" arrivalPos="990.00" arrivalPosLat="0.00" arrivalSpeed="15.87" duration="170.15" routeLength="1986.69" waitingTime="23.35" waitingCount="1" stopTime="0.00" timeLoss="52.95" rerouteNo="1" devices="tripinfo_car_s2e_299 routing_car_s2e_299" vType="Car" speedFactor="1.23" vaporized=""/>
    <tripinfo id="car_n2s_312" depart="312.00" departLane="n2sep_1" departPos="3.60" departPosLat="0.00" departSpeed="13.90" departDelay="0.00" arrival="470.25" arrivalLane="c2s_1" arrivalPos="990.00" arrivalPosLat="0.00" arrivalSpeed="13.90" duration="158.25" routeLength="1997.01" waitingTime="0.00" waitingCount="0" stopTime="0.00" timeLoss="14.57" rerouteNo="1" devices="tripinfo_car_n2s_312 routing_car_n2s_312" vType="Car" speedFactor="1.00" vaporized=""/>
    <tripinfo id="car_s2n_300" depart="300.20" departLane="s2sep_1" departPos="3.60" departPosLat="0.00" departSpeed="13.90" departDelay="0.20" arrival="471.05" arrivalLane="c2n_1" arrivalPos="990.00" arrivalPosLat="0.00" arrivalSpeed="14.06" duration="170.85" routeLength="1997.01" waitingTime="12.75" waitingCount="1" stopTime="0.00" timeLoss="28.80" rerouteNo="1" devices="tripinfo_car_s2n_300 routing_car_s2n_300" vType="Car" speedFactor="1.01" vaporized=""/>
    <tripinfo id="car_s2e_302" depart="302.00" departLane="s2sep_1" departPos="3.60" departPosLat="0.00" departSpeed="13.90" departDelay="0.00" arrival="471.35" arrivalLane="c2e_1" arrivalPos="990.00" arrivalPosLat="0.00" arrivalSpeed="15.24" duration="169.35" routeLength="1986.69" waitingTime="12.10" waitingCount="1" stopTime="0.00" timeLoss="41.03" rerouteNo="1" devices="tripinfo_car_s2e_302 routing_car_s2e_302" vType="Car" speedFactor="1.12" vaporized=""/>
</tripinfos>
