<?xml version="1.0" encoding="UTF-8"?>

<!-- generated on Sat Apr 24 18:41:21 2021 by Eclipse SUMO Version 1.4.0
<configuration xmlns:xsi="http://www.w3.org/2001/XMLSchema-instance" xsi:noNamespaceSchemaLocation="http://sumo.dlr.de/xsd/sumoConfiguration.xsd">

    <input>
        <net-file value="sumofiles/junction.net.xml"/>
        <route-files value="sumofiles/junction_preemption_360.rou.xml"/>
        <additional-files value="sumofiles/junction.det.xml"/>
    </input>

    <output>
        <tripinfo-output value="sumofiles/output/tripinfo_preemption_360.xml"/>
    </output>

    <time>
        <begin value="0"/>
        <end value="10000"/>
        <step-length value="0.05"/>
    </time>

    <processing>
        <lateral-resolution value="0.1"/>
    </processing>

    <report>
        <no-warnings value="true"/>
        <error-log value="sumofiles/output/errorlog_preemption_360.log"/>
        <no-step-log value="true"/>
    </report>

    <traci_server>
        <remote-port value="45371"/>
    </traci_server>

    <gui_only>
        <gui-settings-file value="sumofiles/junction-gui.settings.xml"/>
        <tracker-interval value="0.05"/>
    </gui_only>

</configuration>
-->

<tripinfos xmlns:xsi="http://www.w3.org/2001/XMLSchema-instance" xsi:noNamespaceSchemaLocation="http://sumo.dlr.de/xsd/tripinfo_file.xsd">
    <tripinfo id="car_s2e_2" depart="2.00" departLane="s2sep_1" departPos="3.60" departPosLat="0.00" departSpeed="13.90" departDelay="0.00" arrival="161.70" arrivalLane="c2e_1" arrivalPos="990.00" arrivalPosLat="0.00" arrivalSpeed="14.73" duration="159.70" routeLength="1986.69" waitingTime="16.75" waitingCount="1" stopTime="0.00" timeLoss="24.14" rerouteNo="1" devices="tripinfo_car_s2e_2 routing_car_s2e_2" vType="Car" speedFactor="1.06" vaporized=""/>
    <tripinfo id="car_n2s_2" depart="2.00" departLane="n2sep_1" departPos="3.60" departPosLat="0.00" departSpeed="13.90" departDelay="0.00" arrival="161.75" arrivalLane="c2s_1" arrivalPos="990.00" arrivalPosLat="0.00" arrivalSpeed="14.73" duration="159.75" routeLength="1997.01" waitingTime="16.75" waitingCount="1" stopTime="0.00" timeLoss="24.20" rerouteNo="1" devices="tripinfo_car_n2s_2 routing_car_n2s_2" vType="Car" speedFactor="1.06" vaporized=""/>
    <tripinfo id="car_n2s_7" depart="8.45" departLane="n2sep_1" departPos="3.60" departPosLat="0.00" departSpeed="13.90" departDelay="1.45" arrival="165.95" arrivalLane="c2s_1" arrivalPos="990.00" arrivalPosLat="0.00" arrivalSpeed="15.03" duration="157.50" routeLength="1997.01" waitingTime="8.25" waitingCount="1" stopTime="0.00" timeLoss="24.77" rerouteNo="1" devices="tripinfo_car_n2s_7 routing_car_n2s_7" vType="Car" speedFactor="1.08" vaporized=""/>
    <tripinfo id="car_n2w_7" depart="7.00" departLane="n2sep_1" departPos="3.60" departPosLat="0.00" departSpeed="13.90" departDelay="0.00" arrival="167.25" arrivalLane="c2w_1" arrivalPos="990.00" arrivalPosLat="0.00" arrivalSpeed="14.04" duration="160.25" routeLength="1986.69" waitingTime="9.25" waitingCount="1" stopTime="0.00" timeLoss="18.06" rerouteNo="1" devices="tripinfo_car_n2w_7 routing_car_n2w_7" vType="Car" speedFactor="1.01" vaporized=""/>
    <tripinfo id="car_s2e_10" depart="10.00" departLane="s2sep_1" departPos="3.60" departPosLat="0.00" departSpeed="13.90" departDelay="0.00" arrival="169.10" arrivalLane="c2e_1" arrivalPos="990.00" arrivalPosLat="0.00" arrivalSpeed="13.90" duration="159.10" routeLength="1986.69" waitingTime="5.80" waitingCount="1" stopTime="0.00" timeLoss="15.44" rerouteNo="1" devices="tripinfo_car_s2e_10 routing_car_s2e_10" vType="Car" speedFactor="1.00" vaporized=""/>
    <tripinfo id="car_s2n_16" depart="16.00" departLane="s2sep_1" departPos="3.60" departPosLat="0.00" departSpeed="13.90" departDelay="0.00" arrival="169.40" arrivalLane="c2n_1" arrivalPos="990.00" arrivalPosLat="0.00" arrivalSpeed="14.04" duration="153.40" routeLength="1997.01" waitingTime="1.30" waitingCount="1" stopTime="0.00" timeLoss="11.19" rerouteNo="1" devices="tripinfo_car_s2n_16 routing_car_s2n_16" vType="Car" speedFactor="1.01" vaporized=""/>
    <tripinfo id="car_s2e_21" depart="21.00" departLane="s2sep_1" departPos="3.60" departPosLat="0.00" departSpeed="13.90" departDelay="0.00" arrival="171.40" arrivalLane="c2e_1" arrivalPos="990.00" arrivalPosLat="0.00" arrivalSpeed="14.87" duration="150.40" routeLength="1986.69" waitingTime="0.00" waitingCount="0" stopTime="0.00" timeLoss="18.69" rerouteNo="1" devices="tripinfo_car_s2e_21 routing_car_s2e_21" vType="Car" speedFactor="1.09" vaporized=""/>
    <tripinfo id="car_n2s_24" depart="24.00" departLane="n2sep_1" departPos="3.60" departPosLat="0.00" departSpeed="13.90" departDelay="0.00" arrival="171.60" arrivalLane="c2s_1" arrivalPos="990.00" arrivalPosLat="0.00" arrivalSpeed="14.26" duration="147.60" routeLength="1997.01" waitingTime="0.00" waitingCount="0" stopTime="0.00" timeLoss="7.61" rerouteNo="1" devices="tripinfo_car_n2s_24 routing_car_n2s_24" vType="Car" speedFactor="1.03" vaporized=""/>
    <tripinfo id="car_n2w_39" depart="39.00" departLane="n2sep_1" departPos="3.60" departPosLat="0.00" departSpeed="13.90" departDelay="0.00" arrival="174.40" arrivalLane="c2w_1" arrivalPos="990.00" arrivalPosLat="0.00" arrivalSpeed="16.10" duration="135.40" routeLength="1986.69" waitingTime="0.00" waitingCount="0" stopTime="0.00" timeLoss="11.38" rerouteNo="1" devices="tripinfo_car_n2w_39 routing_car_n2w_39" vType="Car" speedFactor="1.16" vaporized=""/>
    <tripinfo id="car_n2e_32" depart="32.00" departLane="n2sep_1" departPos="3.60" departPosLat="0.00" departSpeed="13.90" departDelay="0.00" arrival="175.30" arrivalLane="c2e_1" arrivalPos="990.00" arrivalPosLat="0.00" arrivalSpeed="14.51" duration="143.30" routeLength="1996.47" waitingTime="0.00" waitingCount="0" stopTime="0.00" timeLoss="5.27" rerouteNo="1" devices="tripinfo_car_n2e_32 routing_car_n2e_32" vType="Car" speedFactor="1.05" vaporized=""/>
    <tripinfo id="car_n2s_55" depart="55.00" departLane="n2sep_1" departPos="3.60" departPosLat="0.00" departSpeed="13.90" departDelay="0.00" arrival="183.50" arrivalLane="c2s_1" arrivalPos="990.00" arrivalPosLat="0.00" arrivalSpeed="15.61" duration="128.50" routeLength="1997.01" waitingTime="0.00" waitingCount="0" stopTime="0.00" timeLoss="0.53" rerouteNo="1" devices="tripinfo_car_n2s_55 routing_car_n2s_55" vType="Car" speedFactor="1.12" vaporized=""/>
    <tripinfo id="car_s2e_37" depart="37.00" departLane="s2sep_1" departPos="3.60" departPosLat="0.00" departSpeed="13.90" departDelay="0.00" arrival="184.60" arrivalLane="c2e_1" arrivalPos="990.00" arrivalPosLat="0.00" arrivalSpeed="13.90" duration="147.60" routeLength="1986.69" waitingTime="0.00" waitingCount="0" stopTime="0.00" timeLoss="3.92" rerouteNo="1" devices="tripinfo_car_s2e_37 routing_car_s2e_37" vType="Car" speedFactor="1.00" vaporized=""/>
    <tripinfo id="bus_s2e_38" depart="39.05" departLane="s2sep_1" departPos="12.10" departPosLat="0.00" departSpeed="13.90" departDelay="1.05" arrival="191.00" arrivalLane="c2e_1" arrivalPos="990.00" arrivalPosLat="0.00" arrivalSpeed="13.89" duration="151.95" routeLength="1978.19" waitingTime="0.00" waitingCount="0" stopTime="0.00" timeLoss="8.90" rerouteNo="1" devices="tripinfo_bus_s2e_38 routing_bus_s2e_38" vType="Bus" speedFactor="1.00" vaporized=""/>
    <tripinfo id="car_s2w_48" depart="48.00" departLane="s2sep_1" departPos="3.60" departPosLat="0.00" departSpeed="13.90" departDelay="0.00" arrival="194.70" arrivalLane="c2w_1" arrivalPos="990.00" arrivalPosLat="0.00" arrivalSpeed="14.04" duration="146.70" routeLength="1996.47" waitingTime="0.00" waitingCount="0" stopTime="0.00" timeLoss="3.82" rerouteNo="1" devices="tripinfo_car_s2w_48 routing_car_s2w_48" vType="Car" speedFactor="1.01" vaporized=""/>
    <tripinfo id="car_n2e_33" depart="33.40" departLane="n2sep_1" departPos="3.60" departPosLat="0.00" departSpeed="13.90" departDelay="0.40" arrival="195.75" arrivalLane="c2e_1" arrivalPos="990.00" arrivalPosLat="0.00" arrivalSpeed="13.89" duration="162.35" routeLength="1996.47" waitingTime="7.00" waitingCount="1" stopTime="0.00" timeLoss="18.00" rerouteNo="1" devices="tripinfo_car_n2e_33 routing_car_n2e_33" vType="Car" speedFactor="1.00" vaporized=""/>
    <tripinfo id="car_w2s_17" depart="17.00" departLane="w2sep_1" departPos="3.60" departPosLat="0.00" departSpeed="13.90" departDelay="0.00" arrival="205.35" arrivalLane="c2s_1" arrivalPos="990.00" arrivalPosLat="0.00" arrivalSpeed="15.05" duration="188.35" routeLength="1986.69" waitingTime="48.45" waitingCount="1" stopTime="0.00" timeLoss="55.64" rerouteNo="1" devices="tripinfo_car_w2s_17 routing_car_w2s_17" vType="Car" speedFactor="1.08" vaporized=""/>
    <tripinfo id="car_s2w_57" depart="57.00" departLane="s2sep_1" departPos="3.60" departPosLat="0.00" departSpeed="13.90" departDelay="0.00" arrival="205.35" arrivalLane="c2w_1" arrivalPos="990.00" arrivalPosLat="0.00" arrivalSpeed="13.90" duration="148.35" routeLength="1996.47" waitingTime="0.00" waitingCount="0" stopTime="0.00" timeLoss="4.04" rerouteNo="1" devices="tripinfo_car_s2w_57 routing_car_s2w_57" vType="Car" speedFactor="1.00" vaporized=""/>
    <tripinfo id="car_e2n_10" depart="10.00" departLane="e2sep_1" departPos="3.60" departPosLat="0.00" departSpeed="13.90" departDelay="0.00" arrival="208.55" arrivalLane="c2n_1" arrivalPos="990.00" arrivalPosLat="0.00" arrivalSpeed="14.32" duration="198.55" routeLength="1986.69" waitingTime="52.30" waitingCount="1" stopTime="0.00" timeLoss="59.13" rerouteNo="1" devices="tripinfo_car_e2n_10 routing_car_e2n_10" vType="Car" speedFactor="1.03" vaporized=""/>
    <tripinfo id="car_w2e_26" depart="26.00" departLane="w2sep_1" departPos="3.60" departPosLat="0.00" departSpeed="13.90" departDelay="0.00" arrival="209.75" arrivalLane="c2e_1" arrivalPos="990.00" arrivalPosLat="0.00" arrivalSpeed="14.55" duration="183.75" routeLength="1997.01" waitingTime="37.85" waitingCount="1" stopTime="0.00" timeLoss="46.51" rerouteNo="1" devices="tripinfo_car_w2e_26 routing_car_w2e_26" vType="Car" speedFactor="1.05" vaporized=""/>
    <tripinfo id="car_e2n_13" depart="13.00" departLane="e2sep_1" departPos="3.60" departPosLat="0.00" departSpeed="13.90" departDelay="0.00" arrival="212.45" arrivalLane="c2n_1" arrivalPos="990.00" arrivalPosLat="0.00" arrivalSpeed="14.51" duration="199.45" routeLength="1986.69" waitingTime="49.35" waitingCount="1" stopTime="0.00" timeLoss="62.06" rerouteNo="1" devices="tripinfo_car_e2n_13 routing_car_e2n_13" vType="Car" speedFactor="1.05" vaporized=""/>
    <tripinfo id="car_e2w_21" depart="21.00" departLane="e2sep_1" departPos="3.60" departPosLat="0.00" departSpeed="13.90" departDelay="0.00" arrival="213.35" arrivalLane="c2w_1" arrivalPos="990.00" arrivalPosLat="0.00" arrivalSpeed="14.32" duration="192.35" routeLength="1997.01" waitingTime="42.80" waitingCount="1" stopTime="0.00" timeLoss="52.89" rerouteNo="1" devices="tripinfo_car_e2w_21 routing_car_e2w_21" vType="Car" speedFactor="1.03" vaporized=""/>
    <tripinfo id="car_w2s_42" depart="42.00" departLane="w2sep_1" departPos="3.60" departPosLat="0.00" departSpeed="13.90" departDelay="0.00" arrival="214.50" arrivalLane="c2s_1" arrivalPos="990.00" arrivalPosLat="0.00" arrivalSpeed="14.15" duration="172.50" routeLength="1986.69" waitingTime="20.65" waitingCount="1" stopTime="0.00" timeLoss="31.37" rerouteNo="1" devices="tripinfo_car_w2s_42 routing_car_w2s_42" vType="Car" speedFactor="1.02" vaporized=""/>
    <tripinfo id="car_e2w_51" depart="51.00" departLane="e2sep_1" departPos="3.60" departPosLat="0.00" departSpeed="13.90" departDelay="0.00" arrival="217.65" arrivalLane="c2w_1" arrivalPos="990.00" arrivalPosLat="0.00" arrivalSpeed="14.54" duration="166.65" routeLength="1997.01" waitingTime="15.30" waitingCount="1" stopTime="0.00" timeLoss="29.42" rerouteNo="1" devices="tripinfo_car_e2w_51 routing_car_e2w_51" vType="Car" speedFactor="1.05" vaporized=""/>
    <tripinfo id="car_e2n_30" depart="30.00" departLane="e2sep_1" departPos="3.60" departPosLat="0.00" departSpeed="13.90" departDelay="0.00" arrival="218.55" arrivalLane="c2n_1" arrivalPos="990.00" arrivalPosLat="0.00" arrivalSpeed="13.90" duration="188.55" routeLength="1986.69" waitingTime="33.20" waitingCount="1" stopTime="0.00" timeLoss="44.89" rerouteNo="1" devices="tripinfo_car_e2n_30 routing_car_e2n_30" vType="Car" speedFactor="1.00" vaporized=""/>
    <tripinfo id="bus_w2s_52" depart="52.00" departLane="w2sep_1" departPos="12.10" departPosLat="0.00" departSpeed="13.90" departDelay="0.00" arrival="221.25" arrivalLane="c2s_1" arrivalPos="990.00" arrivalPosLat="0.00" arrivalSpeed="13.89" duration="169.25" routeLength="1978.19" waitingTime="12.60" waitingCount="1" stopTime="0.00" timeLoss="26.17" rerouteNo="1" devices="tripinfo_bus_w2s_52 routing_bus_w2s_52" vType="Bus" speedFactor="1.00" vaporized=""/>
    <tripinfo id="car_e2w_73" depart="73.00" departLane="e2sep_1" departPos="3.60" departPosLat="0.00" departSpeed="13.90" departDelay="0.00" arrival="223.10" arrivalLane="c2w_1" arrivalPos="990.00" arrivalPosLat="0.00" arrivalSpeed="13.90" duration="150.10" routeLength="1997.01" waitingTime="0.00" waitingCount="0" stopTime="0.00" timeLoss="6.41" rerouteNo="1" devices="tripinfo_car_e2w_73 routing_car_e2w_73" vType="Car" speedFactor="1.00" vaporized=""/>
    <tripinfo id="car_e2n_73" depart="74.45" departLane="e2sep_1" departPos="3.60" departPosLat="0.00" departSpeed="13.90" departDelay="1.45" arrival="223.70" arrivalLane="c2n_1" arrivalPos="990.00" arrivalPosLat="0.00" arrivalSpeed="14.17" duration="149.25" routeLength="1986.69" waitingTime="0.00" waitingCount="0" stopTime="0.00" timeLoss="8.37" rerouteNo="1" devices="tripinfo_car_e2n_73 routing_car_e2n_73" vType="Car" speedFactor="1.02" vaporized=""/>
    <tripinfo id="car_e2w_86" depart="86.00" departLane="e2sep_1" departPos="3.60" departPosLat="0.00" departSpeed="13.90" departDelay="0.00" arrival="225.00" arrivalLane="c2w_1" arrivalPos="990.00" arrivalPosLat="0.00" arrivalSpeed="15.34" duration="139.00" routeLength="1997.01" waitingTime="0.00" waitingCount="0" stopTime="0.00" timeLoss="14.92" rerouteNo="1" devices="tripinfo_car_e2w_86 routing_car_e2w_86" vType="Car" speedFactor="1.16" vaporized=""/>
    <tripinfo id="car_w2s_56" depart="56.00" departLane="w2sep_1" departPos="3.60" departPosLat="0.00" departSpeed="13.90" departDelay="0.00" arrival="225.85" arrivalLane="c2s_1" arrivalPos="990.00" arrivalPosLat="0.00" arrivalSpeed="13.89" duration="169.85" routeLength="1986.69" waitingTime="8.80" waitingCount="1" stopTime="0.00" timeLoss="26.20" rerouteNo="1" devices="tripinfo_car_w2s_56 routing_car_w2s_56" vType="Car" speedFactor="1.00" vaporized=""/>
    <tripinfo id="car_e2n_83" depart="83.00" departLane="e2sep_1" departPos="3.60" departPosLat="0.00" departSpeed="13.90" departDelay="0.00" arrival="226.00" arrivalLane="c2n_1" arrivalPos="990.00" arrivalPosLat="0.00" arrivalSpeed="15.03" duration="143.00" routeLength="1986.69" waitingTime="0.00" waitingCount="0" stopTime="0.00" timeLoss="12.69" rerouteNo="1" devices="tripinfo_car_e2n_83 routing_car_e2n_83" vType="Car" speedFactor="1.10" vaporized=""/>
    <tripinfo id="car_w2s_69" depart="69.00" departLane="w2sep_1" departPos="3.60" departPosLat="0.00" departSpeed="13.90" departDelay="0.00" arrival="229.15" arrivalLane="c2s_1" arrivalPos="990.00" arrivalPosLat="0.00" arrivalSpeed="13.93" duration="160.15" routeLength="1986.69" waitingTime="0.00" waitingCount="0" stopTime="0.00" timeLoss="17.19" rerouteNo="1" devices="tripinfo_car_w2s_69 routing_car_w2s_69" vType="Car" speedFactor="1.01" vaporized=""/>
    <tripinfo id="car_e2s_49" depart="49.00" departLane="e2sep_1" departPos="3.60" departPosLat="0.00" departSpeed="13.90" departDelay="0.00" arrival="231.25" arrivalLane="c2s_1" arrivalPos="990.00" arrivalPosLat="0.00" arrivalSpeed="14.74" duration="182.25" routeLength="1996.47" waitingTime="27.90" waitingCount="3" stopTime="0.00" timeLoss="49.91" rerouteNo="1" devices="tripinfo_car_e2s_49 routing_car_e2s_49" vType="Car" speedFactor="1.09" vaporized=""/>
    <tripinfo id="car_e2n_87" depart="87.30" departLane="e2sep_1" departPos="3.60" departPosLat="0.00" departSpeed="13.90" departDelay="0.30" arrival="232.55" arrivalLane="c2n_1" arrivalPos="990.00" arrivalPosLat="0.00" arrivalSpeed="14.32" duration="145.25" routeLength="1986.69" waitingTime="0.00" waitingCount="0" stopTime="0.00" timeLoss="5.81" rerouteNo="1" devices="tripinfo_car_e2n_87 routing_car_e2n_87" vType="Car" speedFactor="1.03" vaporized=""/>
    <tripinfo id="car_e2s_65" depart="65.00" departLane="e2sep_1" departPos="3.60" departPosLat="0.00" departSpeed="13.90" departDelay="0.00" arrival="233.05" arrivalLane="c2s_1" arrivalPos="990.00" arrivalPosLat="0.00" arrivalSpeed="15.44" duration="168.05" routeLength="1996.47" waitingTime="16.10" waitingCount="2" stopTime="0.00" timeLoss="45.57" rerouteNo="1" devices="tripinfo_car_e2s_65 routing_car_e2s_65" vType="Car" speedFactor="1.18" vaporized=""/>
    <tripinfo id="car_w2n_28" depart="28.00" departLane="w2sep_1" departPos="3.60" departPosLat="0.00" departSpeed="13.90" departDelay="0.00" arrival="234.80" arrivalLane="c2n_1" arrivalPos="990.00" arrivalPosLat="0.00" arrivalSpeed="15.28" duration="206.80" routeLength="1996.47" waitingTime="56.90" waitingCount="2" stopTime="0.00" timeLoss="78.29" rerouteNo="1" devices="tripinfo_car_w2n_28 routing_car_w2n_28" vType="Car" speedFactor="1.12" vaporized=""/>
    <tripinfo id="car_e2w_102" depart="102.00" departLane="e2sep_1" departPos="3.60" departPosLat="0.00" departSpeed="13.90" departDelay="0.00" arrival="234.90" arrivalLane="c2w_1" arrivalPos="990.00" arrivalPosLat="0.00" arrivalSpeed="15.12" duration="132.90" routeLength="1997.01" waitingTime="0.00" waitingCount="0" stopTime="0.00" timeLoss="0.85" rerouteNo="1" devices="tripinfo_car_e2w_102 routing_car_e2w_102" vType="Car" speedFactor="1.09" vaporized=""/>
    <tripinfo id="car_w2n_36" depart="36.00" departLane="w2sep_1" departPos="3.60" departPosLat="0.00" departSpeed="13.90" departDelay="0.00" arrival="244.15" arrivalLane="c2n_1" arrivalPos="990.00" arrivalPosLat="0.00" arrivalSpeed="13.90" duration="208.15" routeLength="1996.47" waitingTime="47.35" waitingCount="3" stopTime="0.00" timeLoss="63.84" rerouteNo="1" devices="tripinfo_car_w2n_36 routing_car_w2n_36" vType="Car" speedFactor="1.00" vaporized=""/>
    <tripinfo id="car_n2w_62" depart="62.00" departLane="n2sep_1" departPos="3.60" departPosLat="0.00" departSpeed="13.90" departDelay="0.00" arrival="247.65" arrivalLane="c2w_1" arrivalPos="990.00" arrivalPosLat="0.00" arrivalSpeed="15.73" duration="185.65" routeLength="1986.69" waitingTime="50.80" waitingCount="1" stopTime="0.00" timeLoss="58.71" rerouteNo="1" devices="tripinfo_car_n2w_62 routing_car_n2w_62" vType="Car" speedFactor="1.13" vaporized=""/>
    <tripinfo id="car_n2s_70" depart="70.00" departLane="n2sep_1" departPos="3.60" departPosLat="0.00" departSpeed="13.90" departDelay="0.00" arrival="247.65" arrivalLane="c2s_1" arrivalPos="990.00" arrivalPosLat="0.00" arrivalSpeed="16.29" duration="177.65" routeLength="1997.01" waitingTime="45.50" waitingCount="1" stopTime="0.00" timeLoss="55.04" rerouteNo="1" devices="tripinfo_car_n2s_70 routing_car_n2s_70" vType="Car" speedFactor="1.17" vaporized=""/>
    <tripinfo id="car_w2n_105" depart="105.00" departLane="w2sep_1" departPos="3.60" departPosLat="0.00" departSpeed="13.90" departDelay="0.00" arrival="251.55" arrivalLane="c2n_1" arrivalPos="990.00" arrivalPosLat="0.00" arrivalSpeed="14.04" duration="146.55" routeLength="1996.47" waitingTime="0.00" waitingCount="0" stopTime="0.00" timeLoss="3.69" rerouteNo="1" devices="tripinfo_car_w2n_105 routing_car_w2n_105" vType="Car" speedFactor="1.01" vaporized=""/>
    <tripinfo id="car_s2e_50" depart="50.00" departLane="s2sep_1" departPos="3.60" departPosLat="0.00" departSpeed="13.90" departDelay="0.00" arrival="253.85" arrivalLane="c2e_1" arrivalPos="990.00" arrivalPosLat="0.00" arrivalSpeed="14.27" duration="203.85" routeLength="1986.69" waitingTime="54.10" waitingCount="1" stopTime="0.00" timeLoss="63.85" rerouteNo="1" devices="tripinfo_car_s2e_50 routing_car_s2e_50" vType="Car" speedFactor="1.03" vaporized=""/>
    <tripinfo id="car_s2e_67" depart="67.00" departLane="s2sep_1" departPos="3.60" departPosLat="0.00" departSpeed="13.90" departDelay="0.00" arrival="255.90" arrivalLane="c2e_1" arrivalPos="990.00" arrivalPosLat="0.00" arrivalSpeed="15.53" duration="188.90" routeLength="1986.69" waitingTime="40.85" waitingCount="1" stopTime="0.00" timeLoss="64.46" rerouteNo="1" devices="tripinfo_car_s2e_67 routing_car_s2e_67" vType="Car" speedFactor="1.15" vaporized=""/>
    <tripinfo id="car_s2n_64" depart="64.00" departLane="s2sep_1" departPos="3.60" departPosLat="0.00" departSpeed="13.90" departDelay="0.00" arrival="258.35" arrivalLane="c2n_1" arrivalPos="990.00" arrivalPosLat="0.00" arrivalSpeed="13.90" duration="194.35" routeLength="1997.01" waitingTime="41.55" waitingCount="1" stopTime="0.00" timeLoss="50.68" rerouteNo="1" devices="tripinfo_car_s2n_64 routing_car_s2n_64" vType="Car" speedFactor="1.00" vaporized=""/>
    <tripinfo id="car_s2n_82" depart="82.00" departLane="s2sep_1" departPos="3.60" departPosLat="0.00" departSpeed="13.90" departDelay="0.00" arrival="260.20" arrivalLane="c2n_1" arrivalPos="990.00" arrivalPosLat="0.00" arrivalSpeed="15.49" duration="178.20" routeLength="1997.01" waitingTime="32.65" waitingCount="1" stopTime="0.00" timeLoss="56.38" rerouteNo="1" devices="tripinfo_car_s2n_82 routing_car_s2n_82" vType="Car" speedFactor="1.18" vaporized=""/>
    <tripinfo id="bus_n2w_72" depart="72.00" departLane="n2sep_1" departPos="12.10" departPosLat="0.00" departSpeed="13.90" departDelay="0.00" arrival="263.60" arrivalLane="c2w_1" arrivalPos="990.00" arrivalPosLat="0.00" arrivalSpeed="13.90" duration="191.60" routeLength="1978.19" waitingTime="36.10" waitingCount="1" stopTime="0.00" timeLoss="48.54" rerouteNo="1" devices="tripinfo_bus_n2w_72 routing_bus_n2w_72" vType="Bus" speedFactor="1.00" vaporized=""/>
    <tripinfo id="car_s2n_87" depart="87.00" departLane="s2sep_1" departPos="3.60" departPosLat="0.00" departSpeed="13.90" departDelay="0.00" arrival="264.40" arrivalLane="c2n_1" arrivalPos="990.00" arrivalPosLat="0.00" arrivalSpeed="14.14" duration="177.40" routeLength="1997.01" waitingTime="23.60" waitingCount="1" stopTime="0.00" timeLoss="36.27" rerouteNo="1" devices="tripinfo_car_s2n_87 routing_car_s2n_87" vType="Car" speedFactor="1.02" vaporized=""/>
    <tripinfo id="car_n2w_89" depart="89.00" departLane="n2sep_1" departPos="3.60" departPosLat="0.00" departSpeed="13.90" departDelay="0.00" arrival="266.50" arrivalLane="c2w_1" arrivalPos="990.00" arrivalPosLat="0.00" arrivalSpeed="14.99" duration="177.50" routeLength="1986.69" waitingTime="25.70" waitingCount="1" stopTime="0.00" timeLoss="45.90" rerouteNo="1" devices="tripinfo_car_n2w_89 routing_car_n2w_89" vType="Car" speedFactor="1.09" vaporized=""/>
    <tripinfo id="car_s2e_115" depart="115.00" departLane="s2sep_1" departPos="3.60" departPosLat="0.00" departSpeed="13.90" departDelay="0.00" arrival="266.80" arrivalLane="c2e_1" arrivalPos="990.00" arrivalPosLat="0.00" arrivalSpeed="13.90" duration="151.80" routeLength="1986.69" waitingTime="0.00" waitingCount="0" stopTime="0.00" timeLoss="8.13" rerouteNo="1" devices="tripinfo_car_s2e_115 routing_car_s2e_115" vType="Car" speedFactor="1.00" vaporized=""/>
    <tripinfo id="car_n2w_95" depart="95.00" departLane="n2sep_1" departPos="3.60" departPosLat="0.00" departSpeed="13.90" departDelay="0.00" arrival="269.70" arrivalLane="c2w_1" arrivalPos="990.00" arrivalPosLat="0.00" arrivalSpeed="14.37" duration="174.70" routeLength="1986.69" waitingTime="17.75" waitingCount="1" stopTime="0.00" timeLoss="36.24" rerouteNo="1" devices="tripinfo_car_n2w_95 routing_car_n2w_95" vType="Car" speedFactor="1.04" vaporized=""/>
    <tripinfo id="car_n2s_110" depart="110.00" departLane="n2sep_1" departPos="3.60" departPosLat="0.00" departSpeed="13.90" departDelay="0.00" arrival="269.70" arrivalLane="c2s_1" arrivalPos="990.00" arrivalPosLat="0.00" arrivalSpeed="13.90" duration="159.70" routeLength="1997.01" waitingTime="1.65" waitingCount="1" stopTime="0.00" timeLoss="16.01" rerouteNo="1" devices="tripinfo_car_n2s_110 routing_car_n2s_110" vType="Car" speedFactor="1.00" vaporized=""/>
    <tripinfo id="car_n2e_102" depart="102.00" departLane="n2sep_1" departPos="3.60" departPosLat="0.00" departSpeed="13.90" departDelay="0.00" arrival="269.90" arrivalLane="c2e_1" arrivalPos="990.00" arrivalPosLat="0.00" arrivalSpeed="14.43" duration="167.90" routeLength="1996.47" waitingTime="15.15" waitingCount="2" stopTime="0.00" timeLoss="29.58" rerouteNo="1" devices="tripinfo_car_n2e_102 routing_car_n2e_102" vType="Car" speedFactor="1.04" vaporized=""/>
    <tripinfo id="car_n2w_135" depart="135.00" departLane="n2sep_1" departPos="3.60" departPosLat="0.00" departSpeed="13.90" departDelay="0.00" arrival="271.70" arrivalLane="c2w_1" arrivalPos="990.00" arrivalPosLat="0.00" arrivalSpeed="15.33" duration="136.70" routeLength="1986.69" waitingTime="0.00" waitingCount="0" stopTime="0.00" timeLoss="10.95" rerouteNo="1" devices="tripinfo_car_n2w_135 routing_car_n2w_135" vType="Car" speedFactor="1.14" vaporized=""/>
    <tripinfo id="car_n2e_116" depart="116.50" departLane="n2sep_1" departPos="3.60" departPosLat="0.00" departSpeed="13.90" departDelay="0.50" arrival="271.80" arrivalLane="c2e_1" arrivalPos="990.00" arrivalPosLat="0.00" arrivalSpeed="15.52" duration="155.30" routeLength="1996.47" waitingTime="2.85" waitingCount="1" stopTime="0.00" timeLoss="31.83" rerouteNo="1" devices="tripinfo_car_n2e_116 routing_car_n2e_116" vType="Car" speedFactor="1.17" vaporized=""/>
    <tripinfo id="car_n2s_115" depart="115.00" departLane="n2sep_1" departPos="3.60" departPosLat="0.00" departSpeed="13.90" departDelay="0.00" arrival="274.05" arrivalLane="c2s_1" arrivalPos="990.00" arrivalPosLat="0.00" arrivalSpeed="13.89" duration="159.05" routeLength="1997.01" waitingTime="0.00" waitingCount="0" stopTime="0.00" timeLoss="15.36" rerouteNo="1" devices="tripinfo_car_n2s_115 routing_car_n2s_115" vType="Car" speedFactor="1.00" vaporized=""/>
    <tripinfo id="car_s2n_135" depart="135.00" departLane="s2sep_1" departPos="3.60" departPosLat="0.00" departSpeed="13.90" departDelay="0.00" arrival="276.15" arrivalLane="c2n_1" arrivalPos="990.00" arrivalPosLat="0.00" arrivalSpeed="14.23" duration="141.15" routeLength="1997.01" waitingTime="0.00" waitingCount="0" stopTime="0.00" timeLoss="0.79" rerouteNo="1" devices="tripinfo_car_s2n_135 routing_car_s2n_135" vType="Car" speedFactor="1.02" vaporized=""/>
    <tripinfo id="car_s2e_146" depart="146.00" departLane="s2sep_1" departPos="3.60" departPosLat="0.00" departSpeed="13.90" departDelay="0.00" arrival="277.00" arrivalLane="c2e_1" arrivalPos="990.00" arrivalPosLat="0.00" arrivalSpeed="16.28" duration="131.00" routeLength="1986.69" waitingTime="0.00" waitingCount="0" stopTime="0.00" timeLoss="8.42" rerouteNo="1" devices="tripinfo_car_s2e_146 routing_car_s2e_146" vType="Car" speedFactor="1.17" vaporized=""/>
    <tripinfo id="car_n2s_116" depart="118.15" departLane="n2sep_1" departPos="3.60" departPosLat="0.00" departSpeed="13.90" departDelay="2.15" arrival="277.15" arrivalLane="c2s_1" arrivalPos="990.00" arrivalPosLat="0.00" arrivalSpeed="14.07" duration="159.00" routeLength="1997.01" waitingTime="0.00" waitingCount="0" stopTime="0.00" timeLoss="17.69" rerouteNo="1" devices="tripinfo_car_n2s_116 routing_car_n2s_116" vType="Car" speedFactor="1.02" vaporized=""/>
    <tripinfo id="car_s2n_136" depart="136.45" departLane="s2sep_1" departPos="3.60" departPosLat="0.00" departSpeed="13.90" departDelay="0.45" arrival="278.35" arrivalLane="c2n_1" arrivalPos="990.00" arrivalPosLat="0.00" arrivalSpeed="15.34" duration="141.90" routeLength="1997.01" waitingTime="0.00" waitingCount="0" stopTime="0.00" timeLoss="14.94" rerouteNo="1" devices="tripinfo_car_s2n_136 routing_car_s2n_136" vType="Car" speedFactor="1.13" vaporized=""/>
    <tripinfo id="car_s2w_74" depart="74.00" departLane="s2sep_1" departPos="3.60" departPosLat="0.00" departSpeed="13.90" departDelay="0.00" arrival="279.30" arrivalLane="c2w_1" arrivalPos="990.00" arrivalPosLat="0.00" arrivalSpeed="13.90" duration="205.30" routeLength="1996.47" waitingTime="49.35" waitingCount="2" stopTime="0.00" timeLoss="60.95" rerouteNo="1" devices="tripinfo_car_s2w_74 routing_car_s2w_74" vType="Car" speedFactor="1.00" vaporized=""/>
    <tripinfo id="car_s2w_128" depart="128.00" departLane="s2sep_1" departPos="3.60" departPosLat="0.00" departSpeed="13.90" departDelay="0.00" arrival="283.45" arrivalLane="c2w_1" arrivalPos="990.00" arrivalPosLat="0.00" arrivalSpeed="13.89" duration="155.45" routeLength="1996.47" waitingTime="0.85" waitingCount="1" stopTime="0.00" timeLoss="11.13" rerouteNo="1" devices="tripinfo_car_s2w_128 routing_car_s2w_128" vType="Car" speedFactor="1.00" vaporized=""/>
    <tripinfo id="car_s2w_141" depart="141.00" departLane="s2sep_1" departPos="3.60" departPosLat="0.00" departSpeed="13.90" departDelay="0.00" arrival="285.25" arrivalLane="c2w_1" arrivalPos="990.00" arrivalPosLat="0.00" arrivalSpeed="15.40" duration="144.25" routeLength="1996.47" waitingTime="0.00" waitingCount="0" stopTime="0.00" timeLoss="21.78" rerouteNo="1" devices="tripinfo_car_s2w_141 routing_car_s2w_141" vType="Car" speedFactor="1.18" vaporized=""/>
</tripinfos>
