<?xml version="1.0" encoding="UTF-8"?>

<!-- generated on Sat Apr 24 18:16:02 2021 by Eclipse SUMO Version 1.4.0
<configuration xmlns:xsi="http://www.w3.org/2001/XMLSchema-instance" xsi:noNamespaceSchemaLocation="http://sumo.dlr.de/xsd/sumoConfiguration.xsd">

    <input>
        <net-file value="sumofiles/junction.net.xml"/>
        <route-files value="sumofiles/junction_preemption_121.rou.xml"/>
        <additional-files value="sumofiles/junction.det.xml"/>
    </input>

    <output>
        <tripinfo-output value="sumofiles/output/tripinfo_preemption_121.xml"/>
    </output>

    <time>
        <begin value="0"/>
        <end value="10000"/>
        <step-length value="0.05"/>
    </time>

    <processing>
        <lateral-resolution value="0.1"/>
    </processing>

    <report>
        <no-warnings value="true"/>
        <error-log value="sumofiles/output/errorlog_preemption_121.log"/>
        <no-step-log value="true"/>
    </report>

    <traci_server>
        <remote-port value="47877"/>
    </traci_server>

    <gui_only>
        <gui-settings-file value="sumofiles/junction-gui.settings.xml"/>
        <tracker-interval value="0.05"/>
    </gui_only>

</configuration>
-->

<tripinfos xmlns:xsi="http://www.w3.org/2001/XMLSchema-instance" xsi:noNamespaceSchemaLocation="http://sumo.dlr.de/xsd/tripinfo_file.xsd">
    <tripinfo id="car_e2n_1" depart="1.00" departLane="e2sep_1" departPos="3.60" departPosLat="0.00" departSpeed="13.90" departDelay="0.00" arrival="140.30" arrivalLane="c2n_1" arrivalPos="990.00" arrivalPosLat="0.00" arrivalSpeed="14.73" duration="139.30" routeLength="1986.69" waitingTime="0.00" waitingCount="0" stopTime="0.00" timeLoss="3.74" rerouteNo="1" devices="tripinfo_car_e2n_1 routing_car_e2n_1" vType="Car" speedFactor="1.06" vaporized=""/>
    <tripinfo id="car_w2e_6" depart="6.00" departLane="w2sep_1" departPos="3.60" departPosLat="0.00" departSpeed="13.90" departDelay="0.00" arrival="141.70" arrivalLane="c2e_1" arrivalPos="990.00" arrivalPosLat="0.00" arrivalSpeed="14.73" duration="135.70" routeLength="1997.01" waitingTime="0.00" waitingCount="0" stopTime="0.00" timeLoss="0.12" rerouteNo="1" devices="tripinfo_car_w2e_6 routing_car_w2e_6" vType="Car" speedFactor="1.06" vaporized=""/>
    <tripinfo id="car_e2s_10" depart="10.00" departLane="e2sep_1" departPos="3.60" departPosLat="0.00" departSpeed="13.90" departDelay="0.00" arrival="147.15" arrivalLane="c2s_1" arrivalPos="990.00" arrivalPosLat="0.00" arrivalSpeed="15.05" duration="137.15" routeLength="1996.47" waitingTime="0.00" waitingCount="0" stopTime="0.00" timeLoss="3.85" rerouteNo="1" devices="tripinfo_car_e2s_10 routing_car_e2s_10" vType="Car" speedFactor="1.08" vaporized=""/>
    <tripinfo id="car_s2n_34" depart="34.00" departLane="s2sep_1" departPos="3.60" departPosLat="0.00" departSpeed="13.90" departDelay="0.00" arrival="162.65" arrivalLane="c2n_1" arrivalPos="990.00" arrivalPosLat="0.00" arrivalSpeed="15.61" duration="128.65" routeLength="1997.01" waitingTime="0.00" waitingCount="0" stopTime="0.00" timeLoss="0.71" rerouteNo="1" devices="tripinfo_car_s2n_34 routing_car_s2n_34" vType="Car" speedFactor="1.12" vaporized=""/>
    <tripinfo id="car_s2e_14" depart="14.00" departLane="s2sep_1" departPos="3.60" departPosLat="0.00" departSpeed="13.90" departDelay="0.00" arrival="165.65" arrivalLane="c2e_1" arrivalPos="990.00" arrivalPosLat="0.00" arrivalSpeed="13.90" duration="151.65" routeLength="1986.69" waitingTime="0.95" waitingCount="1" stopTime="0.00" timeLoss="7.97" rerouteNo="1" devices="tripinfo_car_s2e_14 routing_car_s2e_14" vType="Car" speedFactor="1.00" vaporized=""/>
    <tripinfo id="bus_n2w_9" depart="9.00" departLane="n2sep_1" departPos="12.10" departPosLat="0.00" departSpeed="13.90" departDelay="0.00" arrival="168.90" arrivalLane="c2w_1" arrivalPos="990.00" arrivalPosLat="0.00" arrivalSpeed="13.90" duration="159.90" routeLength="1978.19" waitingTime="6.25" waitingCount="1" stopTime="0.00" timeLoss="16.86" rerouteNo="1" devices="tripinfo_bus_n2w_9 routing_bus_n2w_9" vType="Bus" speedFactor="1.00" vaporized=""/>
    <tripinfo id="car_n2s_33" depart="33.00" departLane="n2sep_1" departPos="3.60" departPosLat="0.00" departSpeed="13.90" departDelay="0.00" arrival="170.70" arrivalLane="c2s_1" arrivalPos="990.00" arrivalPosLat="0.00" arrivalSpeed="14.55" duration="137.70" routeLength="1997.01" waitingTime="0.00" waitingCount="0" stopTime="0.00" timeLoss="0.48" rerouteNo="1" devices="tripinfo_car_n2s_33 routing_car_n2s_33" vType="Car" speedFactor="1.05" vaporized=""/>
    <tripinfo id="car_n2e_52" depart="52.00" departLane="n2sep_1" departPos="3.60" departPosLat="0.00" departSpeed="13.90" departDelay="0.00" arrival="181.05" arrivalLane="c2e_1" arrivalPos="990.00" arrivalPosLat="0.00" arrivalSpeed="16.10" duration="129.05" routeLength="1996.47" waitingTime="0.00" waitingCount="0" stopTime="0.00" timeLoss="4.44" rerouteNo="1" devices="tripinfo_car_n2e_52 routing_car_n2e_52" vType="Car" speedFactor="1.16" vaporized=""/>
    <tripinfo id="car_n2w_40" depart="40.00" departLane="n2sep_1" departPos="3.60" departPosLat="0.00" departSpeed="13.90" departDelay="0.00" arrival="181.55" arrivalLane="c2w_1" arrivalPos="990.00" arrivalPosLat="0.00" arrivalSpeed="14.54" duration="141.55" routeLength="1986.69" waitingTime="0.00" waitingCount="0" stopTime="0.00" timeLoss="4.18" rerouteNo="1" devices="tripinfo_car_n2w_40 routing_car_n2w_40" vType="Car" speedFactor="1.05" vaporized=""/>
    <tripinfo id="car_s2w_37" depart="37.00" departLane="s2sep_1" departPos="3.60" departPosLat="0.00" departSpeed="13.90" departDelay="0.00" arrival="187.85" arrivalLane="c2w_1" arrivalPos="990.00" arrivalPosLat="0.00" arrivalSpeed="13.90" duration="150.85" routeLength="1996.47" waitingTime="0.00" waitingCount="0" stopTime="0.00" timeLoss="6.50" rerouteNo="1" devices="tripinfo_car_s2w_37 routing_car_s2w_37" vType="Car" speedFactor="1.00" vaporized=""/>
    <tripinfo id="car_n2e_62" depart="62.00" departLane="n2sep_1" departPos="3.60" departPosLat="0.00" departSpeed="13.90" departDelay="0.00" arrival="206.05" arrivalLane="c2e_1" arrivalPos="990.00" arrivalPosLat="0.00" arrivalSpeed="14.27" duration="144.05" routeLength="1996.47" waitingTime="0.00" waitingCount="0" stopTime="0.00" timeLoss="3.41" rerouteNo="1" devices="tripinfo_car_n2e_62 routing_car_n2e_62" vType="Car" speedFactor="1.03" vaporized=""/>
    <tripinfo id="car_w2s_6" depart="7.35" departLane="w2sep_1" departPos="3.60" departPosLat="0.00" departSpeed="13.90" departDelay="1.35" arrival="209.90" arrivalLane="c2s_1" arrivalPos="990.00" arrivalPosLat="0.00" arrivalSpeed="14.04" duration="202.55" routeLength="1986.69" waitingTime="51.90" waitingCount="1" stopTime="0.00" timeLoss="60.37" rerouteNo="1" devices="tripinfo_car_w2s_6 routing_car_w2s_6" vType="Car" speedFactor="1.01" vaporized=""/>
    <tripinfo id="car_e2w_30" depart="31.20" departLane="e2sep_1" departPos="3.60" departPosLat="0.00" departSpeed="13.90" departDelay="1.20" arrival="212.25" arrivalLane="c2w_1" arrivalPos="990.00" arrivalPosLat="0.00" arrivalSpeed="15.05" duration="181.05" routeLength="1997.01" waitingTime="30.00" waitingCount="1" stopTime="0.00" timeLoss="48.31" rerouteNo="1" devices="tripinfo_car_e2w_30 routing_car_e2w_30" vType="Car" speedFactor="1.08" vaporized=""/>
    <tripinfo id="car_w2s_11" depart="11.00" departLane="w2sep_1" departPos="3.60" departPosLat="0.00" departSpeed="13.90" departDelay="0.00" arrival="213.65" arrivalLane="c2s_1" arrivalPos="990.00" arrivalPosLat="0.00" arrivalSpeed="14.30" duration="202.65" routeLength="1986.69" waitingTime="49.60" waitingCount="1" stopTime="0.00" timeLoss="63.19" rerouteNo="1" devices="tripinfo_car_w2s_11 routing_car_w2s_11" vType="Car" speedFactor="1.03" vaporized=""/>
    <tripinfo id="bus_e2n_22" depart="22.00" departLane="e2sep_1" departPos="12.10" departPosLat="0.00" departSpeed="13.90" departDelay="0.00" arrival="213.90" arrivalLane="c2n_1" arrivalPos="990.00" arrivalPosLat="0.00" arrivalSpeed="13.90" duration="191.90" routeLength="1978.19" waitingTime="38.40" waitingCount="1" stopTime="0.00" timeLoss="48.84" rerouteNo="1" devices="tripinfo_bus_e2n_22 routing_bus_e2n_22" vType="Bus" speedFactor="1.00" vaporized=""/>
    <tripinfo id="car_e2n_28" depart="28.00" departLane="e2sep_1" departPos="3.60" departPosLat="0.00" departSpeed="13.90" departDelay="0.00" arrival="217.45" arrivalLane="c2n_1" arrivalPos="990.00" arrivalPosLat="0.00" arrivalSpeed="14.48" duration="189.45" routeLength="1986.69" waitingTime="35.95" waitingCount="1" stopTime="0.00" timeLoss="52.07" rerouteNo="1" devices="tripinfo_car_e2n_28 routing_car_e2n_28" vType="Car" speedFactor="1.05" vaporized=""/>
    <tripinfo id="car_w2e_50" depart="50.00" departLane="w2sep_1" departPos="3.60" departPosLat="0.00" departSpeed="13.90" departDelay="0.00" arrival="217.65" arrivalLane="c2e_1" arrivalPos="990.00" arrivalPosLat="0.00" arrivalSpeed="13.90" duration="167.65" routeLength="1997.01" waitingTime="13.15" waitingCount="1" stopTime="0.00" timeLoss="23.95" rerouteNo="1" devices="tripinfo_car_w2e_50 routing_car_w2e_50" vType="Car" speedFactor="1.00" vaporized=""/>
    <tripinfo id="car_w2s_42" depart="42.00" departLane="w2sep_1" departPos="3.60" departPosLat="0.00" departSpeed="13.90" departDelay="0.00" arrival="218.00" arrivalLane="c2s_1" arrivalPos="990.00" arrivalPosLat="0.00" arrivalSpeed="13.89" duration="176.00" routeLength="1986.69" waitingTime="19.95" waitingCount="1" stopTime="0.00" timeLoss="32.34" rerouteNo="1" devices="tripinfo_car_w2s_42 routing_car_w2s_42" vType="Car" speedFactor="1.00" vaporized=""/>
    <tripinfo id="car_e2w_32" depart="34.85" departLane="e2sep_1" departPos="3.60" departPosLat="0.00" departSpeed="13.90" departDelay="2.85" arrival="218.90" arrivalLane="c2w_1" arrivalPos="990.00" arrivalPosLat="0.00" arrivalSpeed="14.26" duration="184.05" routeLength="1997.01" waitingTime="25.30" waitingCount="1" stopTime="0.00" timeLoss="44.04" rerouteNo="1" devices="tripinfo_car_e2w_32 routing_car_e2w_32" vType="Car" speedFactor="1.03" vaporized=""/>
    <tripinfo id="car_w2e_65" depart="65.00" departLane="w2sep_1" departPos="3.60" departPosLat="0.00" departSpeed="13.90" departDelay="0.00" arrival="220.55" arrivalLane="c2e_1" arrivalPos="990.00" arrivalPosLat="0.00" arrivalSpeed="14.46" duration="155.55" routeLength="1997.01" waitingTime="2.45" waitingCount="1" stopTime="0.00" timeLoss="18.32" rerouteNo="1" devices="tripinfo_car_w2e_65 routing_car_w2e_65" vType="Car" speedFactor="1.05" vaporized=""/>
    <tripinfo id="car_e2n_43" depart="43.00" departLane="e2sep_1" departPos="3.60" departPosLat="0.00" departSpeed="13.90" departDelay="0.00" arrival="222.90" arrivalLane="c2n_1" arrivalPos="990.00" arrivalPosLat="0.00" arrivalSpeed="13.90" duration="179.90" routeLength="1986.69" waitingTime="21.95" waitingCount="1" stopTime="0.00" timeLoss="36.22" rerouteNo="1" devices="tripinfo_car_e2n_43 routing_car_e2n_43" vType="Car" speedFactor="1.00" vaporized=""/>
    <tripinfo id="car_w2e_76" depart="76.00" departLane="w2sep_1" departPos="3.60" departPosLat="0.00" departSpeed="13.90" departDelay="0.00" arrival="224.60" arrivalLane="c2e_1" arrivalPos="990.00" arrivalPosLat="0.00" arrivalSpeed="13.89" duration="148.60" routeLength="1997.01" waitingTime="0.00" waitingCount="0" stopTime="0.00" timeLoss="4.91" rerouteNo="1" devices="tripinfo_car_w2e_76 routing_car_w2e_76" vType="Car" speedFactor="1.00" vaporized=""/>
    <tripinfo id="bus_e2n_52" depart="52.00" departLane="e2sep_1" departPos="12.10" departPosLat="0.00" departSpeed="13.90" departDelay="0.00" arrival="227.70" arrivalLane="c2n_1" arrivalPos="990.00" arrivalPosLat="0.00" arrivalSpeed="13.86" duration="175.70" routeLength="1978.19" waitingTime="16.20" waitingCount="1" stopTime="0.00" timeLoss="32.65" rerouteNo="1" devices="tripinfo_bus_e2n_52 routing_bus_e2n_52" vType="Bus" speedFactor="1.00" vaporized=""/>
    <tripinfo id="bus_w2e_78" depart="78.10" departLane="w2sep_1" departPos="12.10" departPosLat="0.00" departSpeed="13.90" departDelay="0.10" arrival="228.05" arrivalLane="c2e_1" arrivalPos="990.00" arrivalPosLat="0.00" arrivalSpeed="13.76" duration="149.95" routeLength="1988.51" waitingTime="0.00" waitingCount="0" stopTime="0.00" timeLoss="6.87" rerouteNo="1" devices="tripinfo_bus_w2e_78 routing_bus_w2e_78" vType="Bus" speedFactor="1.00" vaporized=""/>
    <tripinfo id="car_e2s_29" depart="29.40" departLane="e2sep_1" departPos="3.60" departPosLat="0.00" departSpeed="13.90" departDelay="0.40" arrival="229.75" arrivalLane="c2s_1" arrivalPos="990.00" arrivalPosLat="0.00" arrivalSpeed="14.04" duration="200.35" routeLength="1996.47" waitingTime="44.25" waitingCount="2" stopTime="0.00" timeLoss="57.52" rerouteNo="1" devices="tripinfo_car_e2s_29 routing_car_e2s_29" vType="Car" speedFactor="1.01" vaporized=""/>
    <tripinfo id="car_w2e_86" depart="86.00" departLane="w2sep_1" departPos="3.60" departPosLat="0.00" departSpeed="13.90" departDelay="0.00" arrival="230.35" arrivalLane="c2e_1" arrivalPos="990.00" arrivalPosLat="0.00" arrivalSpeed="15.54" duration="144.35" routeLength="1997.01" waitingTime="0.00" waitingCount="0" stopTime="0.00" timeLoss="21.74" rerouteNo="1" devices="tripinfo_car_w2e_86 routing_car_w2e_86" vType="Car" speedFactor="1.17" vaporized=""/>
    <tripinfo id="car_e2n_56" depart="56.00" departLane="e2sep_1" departPos="3.60" departPosLat="0.00" departSpeed="13.90" departDelay="0.00" arrival="231.55" arrivalLane="c2n_1" arrivalPos="990.00" arrivalPosLat="0.00" arrivalSpeed="14.12" duration="175.55" routeLength="1986.69" waitingTime="13.30" waitingCount="1" stopTime="0.00" timeLoss="34.43" rerouteNo="1" devices="tripinfo_car_e2n_56 routing_car_e2n_56" vType="Car" speedFactor="1.02" vaporized=""/>
    <tripinfo id="car_e2s_30" depart="33.00" departLane="e2sep_1" departPos="3.60" departPosLat="0.00" departSpeed="13.90" departDelay="3.00" arrival="233.35" arrivalLane="c2s_1" arrivalPos="990.00" arrivalPosLat="0.00" arrivalSpeed="14.29" duration="200.35" routeLength="1996.47" waitingTime="39.00" waitingCount="2" stopTime="0.00" timeLoss="60.29" rerouteNo="1" devices="tripinfo_car_e2s_30 routing_car_e2s_30" vType="Car" speedFactor="1.03" vaporized=""/>
    <tripinfo id="bus_e2w_61" depart="61.00" departLane="e2sep_1" departPos="12.10" departPosLat="0.00" departSpeed="13.90" departDelay="0.00" arrival="234.45" arrivalLane="c2w_1" arrivalPos="990.00" arrivalPosLat="0.00" arrivalSpeed="13.90" duration="173.45" routeLength="1988.51" waitingTime="10.00" waitingCount="1" stopTime="0.00" timeLoss="30.38" rerouteNo="1" devices="tripinfo_bus_e2w_61 routing_bus_e2w_61" vType="Bus" speedFactor="1.00" vaporized=""/>
    <tripinfo id="car_e2n_57" depart="57.45" departLane="e2sep_1" departPos="3.60" departPosLat="0.00" departSpeed="13.90" departDelay="0.45" arrival="234.80" arrivalLane="c2n_1" arrivalPos="990.00" arrivalPosLat="0.00" arrivalSpeed="13.99" duration="177.35" routeLength="1986.69" waitingTime="11.00" waitingCount="1" stopTime="0.00" timeLoss="35.10" rerouteNo="1" devices="tripinfo_car_e2n_57 routing_car_e2n_57" vType="Car" speedFactor="1.01" vaporized=""/>
    <tripinfo id="car_e2s_61" depart="62.55" departLane="e2sep_1" departPos="3.60" departPosLat="0.00" departSpeed="13.90" departDelay="1.55" arrival="235.70" arrivalLane="c2s_1" arrivalPos="990.00" arrivalPosLat="0.00" arrivalSpeed="14.90" duration="173.15" routeLength="1996.47" waitingTime="11.90" waitingCount="1" stopTime="0.00" timeLoss="40.83" rerouteNo="1" devices="tripinfo_car_e2s_61 routing_car_e2s_61" vType="Car" speedFactor="1.09" vaporized=""/>
    <tripinfo id="car_e2w_76" depart="76.00" departLane="e2sep_1" departPos="3.60" departPosLat="0.00" departSpeed="13.90" departDelay="0.00" arrival="237.05" arrivalLane="c2w_1" arrivalPos="990.00" arrivalPosLat="0.00" arrivalSpeed="15.36" duration="161.05" routeLength="1997.01" waitingTime="5.05" waitingCount="1" stopTime="0.00" timeLoss="34.09" rerouteNo="1" devices="tripinfo_car_e2w_76 routing_car_e2w_76" vType="Car" speedFactor="1.13" vaporized=""/>
    <tripinfo id="car_w2n_32" depart="32.00" departLane="w2sep_1" departPos="3.60" departPosLat="0.00" departSpeed="13.90" departDelay="0.00" arrival="238.30" arrivalLane="c2n_1" arrivalPos="990.00" arrivalPosLat="0.00" arrivalSpeed="15.11" duration="206.30" routeLength="1996.47" waitingTime="61.45" waitingCount="3" stopTime="0.00" timeLoss="73.96" rerouteNo="1" devices="tripinfo_car_w2n_32 routing_car_w2n_32" vType="Car" speedFactor="1.09" vaporized=""/>
    <tripinfo id="car_e2s_76" depart="77.25" departLane="e2sep_1" departPos="3.60" departPosLat="0.00" departSpeed="13.90" departDelay="1.25" arrival="239.95" arrivalLane="c2s_1" arrivalPos="990.00" arrivalPosLat="0.00" arrivalSpeed="13.89" duration="162.70" routeLength="1996.47" waitingTime="5.80" waitingCount="1" stopTime="0.00" timeLoss="18.35" rerouteNo="1" devices="tripinfo_car_e2s_76 routing_car_e2s_76" vType="Car" speedFactor="1.00" vaporized=""/>
    <tripinfo id="car_e2w_85" depart="85.00" departLane="e2sep_1" departPos="3.60" departPosLat="0.00" departSpeed="13.90" departDelay="0.00" arrival="241.15" arrivalLane="c2w_1" arrivalPos="990.00" arrivalPosLat="0.00" arrivalSpeed="13.96" duration="156.15" routeLength="1997.01" waitingTime="0.00" waitingCount="0" stopTime="0.00" timeLoss="13.22" rerouteNo="1" devices="tripinfo_car_e2w_85 routing_car_e2w_85" vType="Car" speedFactor="1.01" vaporized=""/>
    <tripinfo id="car_n2s_84" depart="84.00" departLane="n2sep_1" departPos="3.60" departPosLat="0.00" departSpeed="13.90" departDelay="0.00" arrival="246.75" arrivalLane="c2s_1" arrivalPos="990.00" arrivalPosLat="0.00" arrivalSpeed="16.04" duration="162.75" routeLength="1997.01" waitingTime="29.90" waitingCount="1" stopTime="0.00" timeLoss="38.29" rerouteNo="1" devices="tripinfo_car_n2s_84 routing_car_n2s_84" vType="Car" speedFactor="1.15" vaporized=""/>
    <tripinfo id="car_s2e_69" depart="69.00" departLane="s2sep_1" departPos="3.60" departPosLat="0.00" departSpeed="13.90" departDelay="0.00" arrival="248.10" arrivalLane="c2e_1" arrivalPos="990.00" arrivalPosLat="0.00" arrivalSpeed="15.61" duration="179.10" routeLength="1986.69" waitingTime="43.50" waitingCount="1" stopTime="0.00" timeLoss="51.14" rerouteNo="1" devices="tripinfo_car_s2e_69 routing_car_s2e_69" vType="Car" speedFactor="1.12" vaporized=""/>
    <tripinfo id="car_n2s_97" depart="97.00" departLane="n2sep_1" departPos="3.60" departPosLat="0.00" departSpeed="13.90" departDelay="0.00" arrival="250.00" arrivalLane="c2s_1" arrivalPos="990.00" arrivalPosLat="0.00" arrivalSpeed="16.32" duration="153.00" routeLength="1997.01" waitingTime="10.25" waitingCount="1" stopTime="0.00" timeLoss="31.21" rerouteNo="1" devices="tripinfo_car_n2s_97 routing_car_n2s_97" vType="Car" speedFactor="1.18" vaporized=""/>
    <tripinfo id="car_s2e_81" depart="81.00" departLane="s2sep_1" departPos="3.60" departPosLat="0.00" departSpeed="13.90" departDelay="0.00" arrival="250.95" arrivalLane="c2e_1" arrivalPos="990.00" arrivalPosLat="0.00" arrivalSpeed="16.24" duration="169.95" routeLength="1986.69" waitingTime="31.45" waitingCount="1" stopTime="0.00" timeLoss="48.02" rerouteNo="1" devices="tripinfo_car_s2e_81 routing_car_s2e_81" vType="Car" speedFactor="1.18" vaporized=""/>
    <tripinfo id="car_n2s_104" depart="104.00" departLane="n2sep_1" departPos="3.60" departPosLat="0.00" departSpeed="13.90" departDelay="0.00" arrival="258.60" arrivalLane="c2s_1" arrivalPos="990.00" arrivalPosLat="0.00" arrivalSpeed="14.32" duration="154.60" routeLength="1997.01" waitingTime="4.20" waitingCount="1" stopTime="0.00" timeLoss="15.14" rerouteNo="1" devices="tripinfo_car_n2s_104 routing_car_n2s_104" vType="Car" speedFactor="1.03" vaporized=""/>
    <tripinfo id="car_s2n_87" depart="87.00" departLane="s2sep_1" departPos="3.60" departPosLat="0.00" departSpeed="13.90" departDelay="0.00" arrival="260.10" arrivalLane="c2n_1" arrivalPos="990.00" arrivalPosLat="0.00" arrivalSpeed="13.90" duration="173.10" routeLength="1997.01" waitingTime="19.95" waitingCount="1" stopTime="0.00" timeLoss="29.40" rerouteNo="1" devices="tripinfo_car_s2n_87 routing_car_s2n_87" vType="Car" speedFactor="1.00" vaporized=""/>
    <tripinfo id="car_n2e_88" depart="88.00" departLane="n2sep_1" departPos="3.60" departPosLat="0.00" departSpeed="13.90" departDelay="0.00" arrival="261.90" arrivalLane="c2e_1" arrivalPos="990.00" arrivalPosLat="0.00" arrivalSpeed="14.17" duration="173.90" routeLength="1996.47" waitingTime="20.95" waitingCount="2" stopTime="0.00" timeLoss="32.37" rerouteNo="1" devices="tripinfo_car_n2e_88 routing_car_n2e_88" vType="Car" speedFactor="1.02" vaporized=""/>
    <tripinfo id="car_n2s_112" depart="112.00" departLane="n2sep_1" departPos="3.60" departPosLat="0.00" departSpeed="13.90" departDelay="0.00" arrival="263.35" arrivalLane="c2s_1" arrivalPos="990.00" arrivalPosLat="0.00" arrivalSpeed="14.04" duration="151.35" routeLength="1997.01" waitingTime="0.00" waitingCount="0" stopTime="0.00" timeLoss="9.13" rerouteNo="1" devices="tripinfo_car_n2s_112 routing_car_n2s_112" vType="Car" speedFactor="1.01" vaporized=""/>
    <tripinfo id="car_s2w_73" depart="73.00" departLane="s2sep_1" departPos="3.60" departPosLat="0.00" departSpeed="13.90" departDelay="0.00" arrival="264.30" arrivalLane="c2w_1" arrivalPos="990.00" arrivalPosLat="0.00" arrivalSpeed="13.90" duration="191.30" routeLength="1996.47" waitingTime="36.00" waitingCount="2" stopTime="0.00" timeLoss="46.98" rerouteNo="1" devices="tripinfo_car_s2w_73 routing_car_s2w_73" vType="Car" speedFactor="1.00" vaporized=""/>
    <tripinfo id="car_s2e_121" depart="121.00" departLane="s2sep_1" departPos="3.60" departPosLat="0.00" departSpeed="13.90" departDelay="0.00" arrival="269.00" arrivalLane="c2e_1" arrivalPos="990.00" arrivalPosLat="0.00" arrivalSpeed="13.90" duration="148.00" routeLength="1986.69" waitingTime="0.00" waitingCount="0" stopTime="0.00" timeLoss="4.34" rerouteNo="1" devices="tripinfo_car_s2e_121 routing_car_s2e_121" vType="Car" speedFactor="1.00" vaporized=""/>
    <tripinfo id="car_n2e_94" depart="94.00" departLane="n2sep_1" departPos="3.60" departPosLat="0.00" departSpeed="13.90" departDelay="0.00" arrival="273.20" arrivalLane="c2e_1" arrivalPos="990.00" arrivalPosLat="0.00" arrivalSpeed="13.89" duration="179.20" routeLength="1996.47" waitingTime="15.10" waitingCount="3" stopTime="0.00" timeLoss="34.88" rerouteNo="1" devices="tripinfo_car_n2e_94 routing_car_n2e_94" vType="Car" speedFactor="1.00" vaporized=""/>
    <tripinfo id="car_n2e_101" depart="101.00" departLane="n2sep_1" departPos="3.60" departPosLat="0.00" departSpeed="13.90" departDelay="0.00" arrival="275.05" arrivalLane="c2e_1" arrivalPos="990.00" arrivalPosLat="0.00" arrivalSpeed="15.28" duration="174.05" routeLength="1996.47" waitingTime="10.35" waitingCount="2" stopTime="0.00" timeLoss="49.45" rerouteNo="1" devices="tripinfo_car_n2e_101 routing_car_n2e_101" vType="Car" speedFactor="1.16" vaporized=""/>
    <tripinfo id="car_n2w_127" depart="127.45" departLane="n2sep_1" departPos="3.60" departPosLat="0.00" departSpeed="13.90" departDelay="0.45" arrival="275.80" arrivalLane="c2w_1" arrivalPos="990.00" arrivalPosLat="0.00" arrivalSpeed="14.13" duration="148.35" routeLength="1986.69" waitingTime="0.00" waitingCount="0" stopTime="0.00" timeLoss="7.05" rerouteNo="1" devices="tripinfo_car_n2w_127 routing_car_n2w_127" vType="Car" speedFactor="1.02" vaporized=""/>
    <tripinfo id="car_n2e_106" depart="106.00" departLane="n2sep_1" departPos="3.60" departPosLat="0.00" departSpeed="13.90" departDelay="0.00" arrival="277.85" arrivalLane="c2e_1" arrivalPos="990.00" arrivalPosLat="0.00" arrivalSpeed="14.33" duration="171.85" routeLength="1996.47" waitingTime="2.00" waitingCount="1" stopTime="0.00" timeLoss="32.76" rerouteNo="1" devices="tripinfo_car_n2e_106 routing_car_n2e_106" vType="Car" speedFactor="1.04" vaporized=""/>
    <tripinfo id="car_n2w_130" depart="130.00" departLane="n2sep_1" departPos="3.60" departPosLat="0.00" departSpeed="13.90" departDelay="0.00" arrival="281.35" arrivalLane="c2w_1" arrivalPos="990.00" arrivalPosLat="0.00" arrivalSpeed="13.94" duration="151.35" routeLength="1986.69" waitingTime="0.00" waitingCount="0" stopTime="0.00" timeLoss="8.11" rerouteNo="1" devices="tripinfo_car_n2w_130 routing_car_n2w_130" vType="Car" speedFactor="1.00" vaporized=""/>
    <tripinfo id="bus_n2e_126" depart="126.00" departLane="n2sep_1" departPos="12.10" departPosLat="0.00" departSpeed="13.90" departDelay="0.00" arrival="281.70" arrivalLane="c2e_1" arrivalPos="990.00" arrivalPosLat="0.00" arrivalSpeed="13.81" duration="155.70" routeLength="1987.97" waitingTime="0.00" waitingCount="0" stopTime="0.00" timeLoss="11.98" rerouteNo="1" devices="tripinfo_bus_n2e_126 routing_bus_n2e_126" vType="Bus" speedFactor="1.00" vaporized=""/>
    <tripinfo id="car_s2w_148" depart="148.00" departLane="s2sep_1" departPos="3.60" departPosLat="0.00" departSpeed="13.90" departDelay="0.00" arrival="283.40" arrivalLane="c2w_1" arrivalPos="990.00" arrivalPosLat="0.00" arrivalSpeed="15.22" duration="135.40" routeLength="1996.47" waitingTime="0.00" waitingCount="0" stopTime="0.00" timeLoss="7.88" rerouteNo="1" devices="tripinfo_car_s2w_148 routing_car_s2w_148" vType="Car" speedFactor="1.13" vaporized=""/>
    <tripinfo id="car_n2e_140" depart="140.00" departLane="n2sep_1" departPos="3.60" departPosLat="0.00" departSpeed="13.90" departDelay="0.00" arrival="288.60" arrivalLane="c2e_1" arrivalPos="990.00" arrivalPosLat="0.00" arrivalSpeed="13.90" duration="148.60" routeLength="1996.47" waitingTime="0.00" waitingCount="0" stopTime="0.00" timeLoss="4.28" rerouteNo="1" devices="tripinfo_car_n2e_140 routing_car_n2e_140" vType="Car" speedFactor="1.00" vaporized=""/>
    <tripinfo id="car_n2e_146" depart="146.00" departLane="n2sep_1" departPos="3.60" departPosLat="0.00" departSpeed="13.90" departDelay="0.00" arrival="293.15" arrivalLane="c2e_1" arrivalPos="990.00" arrivalPosLat="0.00" arrivalSpeed="14.22" duration="147.15" routeLength="1996.47" waitingTime="0.00" waitingCount="0" stopTime="0.00" timeLoss="6.16" rerouteNo="1" devices="tripinfo_car_n2e_146 routing_car_n2e_146" vType="Car" speedFactor="1.02" vaporized=""/>
    <tripinfo id="car_w2s_106" depart="106.00" departLane="w2sep_1" departPos="3.60" departPosLat="0.00" departSpeed="13.90" departDelay="0.00" arrival="294.80" arrivalLane="c2s_1" arrivalPos="990.00" arrivalPosLat="0.00" arrivalSpeed="15.18" duration="188.80" routeLength="1986.69" waitingTime="49.95" waitingCount="1" stopTime="0.00" timeLoss="57.21" rerouteNo="1" devices="tripinfo_car_w2s_106 routing_car_w2s_106" vType="Car" speedFactor="1.09" vaporized=""/>
    <tripinfo id="car_w2s_107" depart="107.30" departLane="w2sep_1" departPos="3.60" departPosLat="0.00" departSpeed="13.90" departDelay="0.30" arrival="301.35" arrivalLane="c2s_1" arrivalPos="990.00" arrivalPosLat="0.00" arrivalSpeed="14.50" duration="194.05" routeLength="1986.69" waitingTime="44.85" waitingCount="1" stopTime="0.00" timeLoss="56.33" rerouteNo="1" devices="tripinfo_car_w2s_107 routing_car_w2s_107" vType="Car" speedFactor="1.04" vaporized=""/>
    <tripinfo id="bus_e2n_96" depart="96.00" departLane="e2sep_1" departPos="12.10" departPosLat="0.00" departSpeed="13.90" departDelay="0.00" arrival="303.90" arrivalLane="c2n_1" arrivalPos="990.00" arrivalPosLat="0.00" arrivalSpeed="13.90" duration="207.90" routeLength="1978.19" waitingTime="54.10" waitingCount="1" stopTime="0.00" timeLoss="64.84" rerouteNo="1" devices="tripinfo_bus_e2n_96 routing_bus_e2n_96" vType="Bus" speedFactor="1.00" vaporized=""/>
    <tripinfo id="car_e2w_109" depart="109.00" departLane="e2sep_1" departPos="3.60" departPosLat="0.00" departSpeed="13.90" departDelay="0.00" arrival="304.25" arrivalLane="c2w_1" arrivalPos="990.00" arrivalPosLat="0.00" arrivalSpeed="15.12" duration="195.25" routeLength="1997.01" waitingTime="48.45" waitingCount="1" stopTime="0.00" timeLoss="63.18" rerouteNo="1" devices="tripinfo_car_e2w_109 routing_car_e2w_109" vType="Car" speedFactor="1.09" vaporized=""/>
    <tripinfo id="car_e2n_99" depart="99.00" departLane="e2sep_1" departPos="3.60" departPosLat="0.00" departSpeed="13.90" departDelay="0.00" arrival="306.70" arrivalLane="c2n_1" arrivalPos="990.00" arrivalPosLat="0.00" arrivalSpeed="15.09" duration="207.70" routeLength="1986.69" waitingTime="53.15" waitingCount="1" stopTime="0.00" timeLoss="77.35" rerouteNo="1" devices="tripinfo_car_e2n_99 routing_car_e2n_99" vType="Car" speedFactor="1.10" vaporized=""/>
    <tripinfo id="car_w2s_114" depart="114.00" departLane="w2sep_1" departPos="3.60" departPosLat="0.00" departSpeed="13.90" departDelay="0.00" arrival="307.20" arrivalLane="c2s_1" arrivalPos="990.00" arrivalPosLat="0.00" arrivalSpeed="13.90" duration="193.20" routeLength="1986.69" waitingTime="37.75" waitingCount="1" stopTime="0.00" timeLoss="49.53" rerouteNo="1" devices="tripinfo_car_w2s_114 routing_car_w2s_114" vType="Car" speedFactor="1.00" vaporized=""/>
    <tripinfo id="car_e2n_104" depart="104.00" departLane="e2sep_1" departPos="3.60" departPosLat="0.00" departSpeed="13.90" departDelay="0.00" arrival="310.40" arrivalLane="c2n_1" arrivalPos="990.00" arrivalPosLat="0.00" arrivalSpeed="14.13" duration="206.40" routeLength="1986.69" waitingTime="49.60" waitingCount="1" stopTime="0.00" timeLoss="65.31" rerouteNo="1" devices="tripinfo_car_e2n_104 routing_car_e2n_104" vType="Car" speedFactor="1.02" vaporized=""/>
    <tripinfo id="car_e2s_113" depart="113.00" departLane="e2sep_1" departPos="3.60" departPosLat="0.00" departSpeed="13.90" departDelay="0.00" arrival="311.20" arrivalLane="c2s_1" arrivalPos="990.00" arrivalPosLat="0.00" arrivalSpeed="13.88" duration="198.20" routeLength="1996.47" waitingTime="40.40" waitingCount="2" stopTime="0.00" timeLoss="53.88" rerouteNo="1" devices="tripinfo_car_e2s_113 routing_car_e2s_113" vType="Car" speedFactor="1.00" vaporized=""/>
    <tripinfo id="car_e2n_123" depart="123.00" departLane="e2sep_1" departPos="3.60" departPosLat="0.00" departSpeed="13.90" departDelay="0.00" arrival="312.25" arrivalLane="c2n_1" arrivalPos="990.00" arrivalPosLat="0.00" arrivalSpeed="15.43" duration="189.25" routeLength="1986.69" waitingTime="35.25" waitingCount="1" stopTime="0.00" timeLoss="66.34" rerouteNo="1" devices="tripinfo_car_e2n_123 routing_car_e2n_123" vType="Car" speedFactor="1.17" vaporized=""/>
    <tripinfo id="car_e2w_136" depart="136.00" departLane="e2sep_1" departPos="3.60" departPosLat="0.00" departSpeed="13.90" departDelay="0.00" arrival="314.35" arrivalLane="c2w_1" arrivalPos="990.00" arrivalPosLat="0.00" arrivalSpeed="13.90" duration="178.35" routeLength="1997.01" waitingTime="20.65" waitingCount="1" stopTime="0.00" timeLoss="34.64" rerouteNo="1" devices="tripinfo_car_e2w_136 routing_car_e2w_136" vType="Car" speedFactor="1.00" vaporized=""/>
    <tripinfo id="car_e2s_118" depart="118.00" departLane="e2sep_1" departPos="3.60" departPosLat="0.00" departSpeed="13.90" departDelay="0.00" arrival="314.70" arrivalLane="c2s_1" arrivalPos="990.00" arrivalPosLat="0.00" arrivalSpeed="13.87" duration="196.70" routeLength="1996.47" waitingTime="35.05" waitingCount="2" stopTime="0.00" timeLoss="52.35" rerouteNo="1" devices="tripinfo_car_e2s_118 routing_car_e2s_118" vType="Car" speedFactor="1.00" vaporized=""/>
    <tripinfo id="car_e2w_150" depart="150.00" departLane="e2sep_1" departPos="3.60" departPosLat="0.00" departSpeed="13.90" departDelay="0.00" arrival="316.70" arrivalLane="c2w_1" arrivalPos="990.00" arrivalPosLat="0.00" arrivalSpeed="14.80" duration="166.70" routeLength="1997.01" waitingTime="12.95" waitingCount="1" stopTime="0.00" timeLoss="33.97" rerouteNo="1" devices="tripinfo_car_e2w_150 routing_car_e2w_150" vType="Car" speedFactor="1.08" vaporized=""/>
    <tripinfo id="car_e2s_128" depart="128.00" departLane="e2sep_1" departPos="3.60" departPosLat="0.00" departSpeed="13.90" departDelay="0.00" arrival="316.75" arrivalLane="c2s_1" arrivalPos="990.00" arrivalPosLat="0.00" arrivalSpeed="14.77" duration="188.75" routeLength="1996.47" waitingTime="29.30" waitingCount="2" stopTime="0.00" timeLoss="57.04" rerouteNo="1" devices="tripinfo_car_e2s_128 routing_car_e2s_128" vType="Car" speedFactor="1.10" vaporized=""/>
    <tripinfo id="car_e2n_162" depart="162.00" departLane="e2sep_1" departPos="3.60" departPosLat="0.00" departSpeed="13.90" departDelay="0.00" arrival="317.90" arrivalLane="c2n_1" arrivalPos="990.00" arrivalPosLat="0.00" arrivalSpeed="14.12" duration="155.90" routeLength="1986.69" waitingTime="0.00" waitingCount="0" stopTime="0.00" timeLoss="14.46" rerouteNo="1" devices="tripinfo_car_e2n_162 routing_car_e2n_162" vType="Car" speedFactor="1.02" vaporized=""/>
    <tripinfo id="car_e2s_160" depart="160.00" departLane="e2sep_1" departPos="3.60" departPosLat="0.00" departSpeed="13.90" departDelay="0.00" arrival="318.75" arrivalLane="c2s_1" arrivalPos="990.00" arrivalPosLat="0.00" arrivalSpeed="15.03" duration="158.75" routeLength="1996.47" waitingTime="0.00" waitingCount="0" stopTime="0.00" timeLoss="29.78" rerouteNo="1" devices="tripinfo_car_e2s_160 routing_car_e2s_160" vType="Car" speedFactor="1.12" vaporized=""/>
    <tripinfo id="bus_w2e_178" depart="178.00" departLane="w2sep_1" departPos="12.10" departPosLat="0.00" departSpeed="13.90" departDelay="0.00" arrival="321.40" arrivalLane="c2e_1" arrivalPos="990.00" arrivalPosLat="0.00" arrivalSpeed="13.90" duration="143.40" routeLength="1988.51" waitingTime="0.00" waitingCount="0" stopTime="0.00" timeLoss="0.31" rerouteNo="1" devices="tripinfo_bus_w2e_178 routing_bus_w2e_178" vType="Bus" speedFactor="1.00" vaporized=""/>
    <tripinfo id="car_w2e_185" depart="185.00" departLane="w2sep_1" departPos="3.60" departPosLat="0.00" departSpeed="13.90" departDelay="0.00" arrival="323.80" arrivalLane="c2e_1" arrivalPos="990.00" arrivalPosLat="0.00" arrivalSpeed="15.68" duration="138.80" routeLength="1997.01" waitingTime="0.00" waitingCount="0" stopTime="0.00" timeLoss="16.16" rerouteNo="1" devices="tripinfo_car_w2e_185 routing_car_w2e_185" vType="Car" speedFactor="1.17" vaporized=""/>
    <tripinfo id="car_n2w_142" depart="142.00" departLane="n2sep_1" departPos="3.60" departPosLat="0.00" departSpeed="13.90" departDelay="0.00" arrival="337.00" arrivalLane="c2w_1" arrivalPos="990.00" arrivalPosLat="0.00" arrivalSpeed="15.88" duration="195.00" routeLength="1986.69" waitingTime="53.30" waitingCount="1" stopTime="0.00" timeLoss="69.26" rerouteNo="1" devices="tripinfo_car_n2w_142 routing_car_n2w_142" vType="Car" speedFactor="1.14" vaporized=""/>
    <tripinfo id="car_n2w_169" depart="169.00" departLane="n2sep_1" departPos="3.60" departPosLat="0.00" departSpeed="13.90" departDelay="0.00" arrival="340.25" arrivalLane="c2w_1" arrivalPos="990.00" arrivalPosLat="0.00" arrivalSpeed="16.30" duration="171.25" routeLength="1986.69" waitingTime="31.65" waitingCount="1" stopTime="0.00" timeLoss="49.35" rerouteNo="1" devices="tripinfo_car_n2w_169 routing_car_n2w_169" vType="Car" speedFactor="1.18" vaporized=""/>
    <tripinfo id="car_n2s_175" depart="175.00" departLane="n2sep_1" departPos="3.60" departPosLat="0.00" departSpeed="13.90" departDelay="0.00" arrival="340.75" arrivalLane="c2s_1" arrivalPos="990.00" arrivalPosLat="0.00" arrivalSpeed="16.05" duration="165.75" routeLength="1997.01" waitingTime="30.10" waitingCount="1" stopTime="0.00" timeLoss="41.29" rerouteNo="1" devices="tripinfo_car_n2s_175 routing_car_n2s_175" vType="Car" speedFactor="1.15" vaporized=""/>
    <tripinfo id="car_s2e_183" depart="183.00" departLane="s2sep_1" departPos="3.60" departPosLat="0.00" departSpeed="13.90" departDelay="0.00" arrival="345.30" arrivalLane="c2e_1" arrivalPos="990.00" arrivalPosLat="0.00" arrivalSpeed="13.97" duration="162.30" routeLength="1986.69" waitingTime="12.25" waitingCount="1" stopTime="0.00" timeLoss="19.36" rerouteNo="1" devices="tripinfo_car_s2e_183 routing_car_s2e_183" vType="Car" speedFactor="1.01" vaporized=""/>
    <tripinfo id="car_n2e_163" depart="163.00" departLane="n2sep_1" departPos="3.60" departPosLat="0.00" departSpeed="13.90" departDelay="0.00" arrival="349.85" arrivalLane="c2e_1" arrivalPos="990.00" arrivalPosLat="0.00" arrivalSpeed="13.89" duration="186.85" routeLength="1996.47" waitingTime="32.00" waitingCount="1" stopTime="0.00" timeLoss="42.52" rerouteNo="1" devices="tripinfo_car_n2e_163 routing_car_n2e_163" vType="Car" speedFactor="1.00" vaporized=""/>
    <tripinfo id="car_s2n_208" depart="208.45" departLane="s2sep_1" departPos="3.60" departPosLat="0.00" departSpeed="13.90" departDelay="0.45" arrival="354.55" arrivalLane="c2n_1" arrivalPos="990.00" arrivalPosLat="0.00" arrivalSpeed="14.17" duration="146.10" routeLength="1997.01" waitingTime="0.00" waitingCount="0" stopTime="0.00" timeLoss="5.17" rerouteNo="1" devices="tripinfo_car_s2n_208 routing_car_s2n_208" vType="Car" speedFactor="1.02" vaporized=""/>
    <tripinfo id="car_s2e_207" depart="207.00" departLane="s2sep_1" departPos="3.60" departPosLat="0.00" departSpeed="13.90" departDelay="0.00" arrival="355.25" arrivalLane="c2e_1" arrivalPos="990.00" arrivalPosLat="0.00" arrivalSpeed="13.90" duration="148.25" routeLength="1986.69" waitingTime="0.00" waitingCount="0" stopTime="0.00" timeLoss="4.60" rerouteNo="1" devices="tripinfo_car_s2e_207 routing_car_s2e_207" vType="Car" speedFactor="1.00" vaporized=""/>
    <tripinfo id="car_n2s_199" depart="199.00" departLane="n2sep_1" departPos="3.60" departPosLat="0.00" departSpeed="13.90" departDelay="0.00" arrival="355.65" arrivalLane="c2s_1" arrivalPos="990.00" arrivalPosLat="0.00" arrivalSpeed="14.21" duration="156.65" routeLength="1997.01" waitingTime="2.60" waitingCount="1" stopTime="0.00" timeLoss="16.07" rerouteNo="1" devices="tripinfo_car_n2s_199 routing_car_n2s_199" vType="Car" speedFactor="1.02" vaporized=""/>
    <tripinfo id="bus_n2w_185" depart="185.00" departLane="n2sep_1" departPos="12.10" departPosLat="0.00" departSpeed="13.90" departDelay="0.00" arrival="355.75" arrivalLane="c2w_1" arrivalPos="990.00" arrivalPosLat="0.00" arrivalSpeed="13.90" duration="170.75" routeLength="1978.19" waitingTime="14.60" waitingCount="1" stopTime="0.00" timeLoss="27.70" rerouteNo="1" devices="tripinfo_bus_n2w_185 routing_bus_n2w_185" vType="Bus" speedFactor="1.00" vaporized=""/>
    <tripinfo id="car_s2n_211" depart="211.00" departLane="s2sep_1" departPos="3.60" departPosLat="0.00" departSpeed="13.90" departDelay="0.00" arrival="356.45" arrivalLane="c2n_1" arrivalPos="990.00" arrivalPosLat="0.00" arrivalSpeed="15.64" duration="145.45" routeLength="1997.01" waitingTime="0.00" waitingCount="0" stopTime="0.00" timeLoss="23.64" rerouteNo="1" devices="tripinfo_car_s2n_211 routing_car_s2n_211" vType="Car" speedFactor="1.18" vaporized=""/>
    <tripinfo id="car_n2e_193" depart="193.00" departLane="n2sep_1" departPos="3.60" departPosLat="0.00" departSpeed="13.90" departDelay="0.00" arrival="359.25" arrivalLane="c2e_1" arrivalPos="990.00" arrivalPosLat="0.00" arrivalSpeed="14.43" duration="166.25" routeLength="1996.47" waitingTime="13.05" waitingCount="2" stopTime="0.00" timeLoss="27.49" rerouteNo="1" devices="tripinfo_car_n2e_193 routing_car_n2e_193" vType="Car" speedFactor="1.04" vaporized=""/>
    <tripinfo id="car_n2s_203" depart="203.00" departLane="n2sep_1" departPos="3.60" departPosLat="0.00" departSpeed="13.90" departDelay="0.00" arrival="359.90" arrivalLane="c2s_1" arrivalPos="990.00" arrivalPosLat="0.00" arrivalSpeed="14.21" duration="156.90" routeLength="1997.01" waitingTime="0.00" waitingCount="0" stopTime="0.00" timeLoss="16.43" rerouteNo="1" devices="tripinfo_car_n2s_203 routing_car_n2s_203" vType="Car" speedFactor="1.02" vaporized=""/>
    <tripinfo id="car_n2e_210" depart="210.00" departLane="n2sep_1" departPos="3.60" departPosLat="0.00" departSpeed="13.90" departDelay="0.00" arrival="364.55" arrivalLane="c2e_1" arrivalPos="990.00" arrivalPosLat="0.00" arrivalSpeed="13.90" duration="154.55" routeLength="1996.47" waitingTime="0.00" waitingCount="0" stopTime="0.00" timeLoss="10.23" rerouteNo="1" devices="tripinfo_car_n2e_210 routing_car_n2e_210" vType="Car" speedFactor="1.00" vaporized=""/>
    <tripinfo id="bus_s2w_168" depart="168.00" departLane="s2sep_1" departPos="12.10" departPosLat="0.00" departSpeed="13.90" departDelay="0.00" arrival="365.50" arrivalLane="c2w_1" arrivalPos="990.00" arrivalPosLat="0.00" arrivalSpeed="13.90" duration="197.50" routeLength="1987.97" waitingTime="38.60" waitingCount="2" stopTime="0.00" timeLoss="53.80" rerouteNo="1" devices="tripinfo_bus_s2w_168 routing_bus_s2w_168" vType="Bus" speedFactor="1.00" vaporized=""/>
    <tripinfo id="car_n2e_226" depart="226.00" departLane="n2sep_1" departPos="3.60" departPosLat="0.00" departSpeed="13.90" departDelay="0.00" arrival="369.80" arrivalLane="c2e_1" arrivalPos="990.00" arrivalPosLat="0.00" arrivalSpeed="14.37" duration="143.80" routeLength="1996.47" waitingTime="0.00" waitingCount="0" stopTime="0.00" timeLoss="4.27" rerouteNo="1" devices="tripinfo_car_n2e_226 routing_car_n2e_226" vType="Car" speedFactor="1.03" vaporized=""/>
    <tripinfo id="car_n2w_229" depart="229.00" departLane="n2sep_1" departPos="3.60" departPosLat="0.00" departSpeed="13.90" departDelay="0.00" arrival="375.30" arrivalLane="c2w_1" arrivalPos="990.00" arrivalPosLat="0.00" arrivalSpeed="14.13" duration="146.30" routeLength="1986.69" waitingTime="0.00" waitingCount="0" stopTime="0.00" timeLoss="5.00" rerouteNo="1" devices="tripinfo_car_n2w_229 routing_car_n2w_229" vType="Car" speedFactor="1.02" vaporized=""/>
    <tripinfo id="car_w2e_210" depart="210.00" departLane="w2sep_1" departPos="3.60" departPosLat="0.00" departSpeed="13.90" departDelay="0.00" arrival="387.10" arrivalLane="c2e_1" arrivalPos="990.00" arrivalPosLat="0.00" arrivalSpeed="14.67" duration="177.10" routeLength="1997.01" waitingTime="31.30" waitingCount="1" stopTime="0.00" timeLoss="40.98" rerouteNo="1" devices="tripinfo_car_w2e_210 routing_car_w2e_210" vType="Car" speedFactor="1.06" vaporized=""/>
    <tripinfo id="car_e2w_213" depart="213.00" departLane="e2sep_1" departPos="3.60" departPosLat="0.00" departSpeed="13.90" departDelay="0.00" arrival="388.60" arrivalLane="c2w_1" arrivalPos="990.00" arrivalPosLat="0.00" arrivalSpeed="14.35" duration="175.60" routeLength="1997.01" waitingTime="29.10" waitingCount="1" stopTime="0.00" timeLoss="36.45" rerouteNo="1" devices="tripinfo_car_e2w_213 routing_car_e2w_213" vType="Car" speedFactor="1.03" vaporized=""/>
    <tripinfo id="car_w2e_221" depart="221.00" departLane="w2sep_1" departPos="3.60" departPosLat="0.00" departSpeed="13.90" departDelay="0.00" arrival="393.55" arrivalLane="c2e_1" arrivalPos="990.00" arrivalPosLat="0.00" arrivalSpeed="14.00" duration="172.55" routeLength="1997.01" waitingTime="20.25" waitingCount="1" stopTime="0.00" timeLoss="29.92" rerouteNo="1" devices="tripinfo_car_w2e_221 routing_car_w2e_221" vType="Car" speedFactor="1.01" vaporized=""/>
    <tripinfo id="bus_w2n_206" depart="206.00" departLane="w2sep_1" departPos="12.10" departPosLat="0.00" departSpeed="13.90" departDelay="0.00" arrival="395.20" arrivalLane="c2n_1" arrivalPos="990.00" arrivalPosLat="0.00" arrivalSpeed="13.90" duration="189.20" routeLength="1987.97" waitingTime="34.60" waitingCount="1" stopTime="0.00" timeLoss="45.47" rerouteNo="1" devices="tripinfo_bus_w2n_206 routing_bus_w2n_206" vType="Bus" speedFactor="1.00" vaporized=""/>
    <tripinfo id="car_e2w_255" depart="255.00" departLane="e2sep_1" departPos="3.60" departPosLat="0.00" departSpeed="13.90" departDelay="0.00" arrival="396.65" arrivalLane="c2w_1" arrivalPos="990.00" arrivalPosLat="0.00" arrivalSpeed="14.21" duration="141.65" routeLength="1997.01" waitingTime="0.00" waitingCount="0" stopTime="0.00" timeLoss="1.03" rerouteNo="1" devices="tripinfo_car_e2w_255 routing_car_e2w_255" vType="Car" speedFactor="1.02" vaporized=""/>
    <tripinfo id="car_w2e_232" depart="232.00" departLane="w2sep_1" departPos="3.60" departPosLat="0.00" departSpeed="13.90" departDelay="0.00" arrival="396.85" arrivalLane="c2e_1" arrivalPos="990.00" arrivalPosLat="0.00" arrivalSpeed="14.27" duration="164.85" routeLength="1997.01" waitingTime="11.75" waitingCount="1" stopTime="0.00" timeLoss="25.37" rerouteNo="1" devices="tripinfo_car_w2e_232 routing_car_w2e_232" vType="Car" speedFactor="1.03" vaporized=""/>
    <tripinfo id="car_w2s_247" depart="247.00" departLane="w2sep_1" departPos="3.60" departPosLat="0.00" departSpeed="13.90" departDelay="0.00" arrival="396.85" arrivalLane="c2s_1" arrivalPos="990.00" arrivalPosLat="0.00" arrivalSpeed="13.92" duration="149.85" routeLength="1986.69" waitingTime="0.00" waitingCount="0" stopTime="0.00" timeLoss="6.43" rerouteNo="1" devices="tripinfo_car_w2s_247 routing_car_w2s_247" vType="Car" speedFactor="1.00" vaporized=""/>
    <tripinfo id="car_w2n_225" depart="225.00" departLane="w2sep_1" departPos="3.60" departPosLat="0.00" departSpeed="13.90" departDelay="0.00" arrival="398.30" arrivalLane="c2n_1" arrivalPos="990.00" arrivalPosLat="0.00" arrivalSpeed="14.98" duration="173.30" routeLength="1996.47" waitingTime="19.65" waitingCount="2" stopTime="0.00" timeLoss="40.53" rerouteNo="1" devices="tripinfo_car_w2n_225 routing_car_w2n_225" vType="Car" speedFactor="1.09" vaporized=""/>
    <tripinfo id="car_w2s_253" depart="253.00" departLane="w2sep_1" departPos="3.60" departPosLat="0.00" departSpeed="13.90" departDelay="0.00" arrival="401.55" arrivalLane="c2s_1" arrivalPos="990.00" arrivalPosLat="0.00" arrivalSpeed="13.99" duration="148.55" routeLength="1986.69" waitingTime="0.00" waitingCount="0" stopTime="0.00" timeLoss="5.87" rerouteNo="1" devices="tripinfo_car_w2s_253 routing_car_w2s_253" vType="Car" speedFactor="1.01" vaporized=""/>
    <tripinfo id="car_e2w_268" depart="268.00" departLane="e2sep_1" departPos="3.60" departPosLat="0.00" departSpeed="13.90" departDelay="0.00" arrival="402.50" arrivalLane="c2w_1" arrivalPos="990.00" arrivalPosLat="0.00" arrivalSpeed="15.16" duration="134.50" routeLength="1997.01" waitingTime="0.00" waitingCount="0" stopTime="0.00" timeLoss="2.77" rerouteNo="1" devices="tripinfo_car_e2w_268 routing_car_e2w_268" vType="Car" speedFactor="1.09" vaporized=""/>
    <tripinfo id="car_e2n_261" depart="261.00" departLane="e2sep_1" departPos="3.60" departPosLat="0.00" departSpeed="13.90" departDelay="0.00" arrival="404.45" arrivalLane="c2n_1" arrivalPos="990.00" arrivalPosLat="0.00" arrivalSpeed="14.42" duration="143.45" routeLength="1986.69" waitingTime="0.00" waitingCount="0" stopTime="0.00" timeLoss="4.99" rerouteNo="1" devices="tripinfo_car_e2n_261 routing_car_e2n_261" vType="Car" speedFactor="1.04" vaporized=""/>
    <tripinfo id="car_w2s_257" depart="257.00" departLane="w2sep_1" departPos="3.60" departPosLat="0.00" departSpeed="13.90" departDelay="0.00" arrival="405.35" arrivalLane="c2s_1" arrivalPos="990.00" arrivalPosLat="0.00" arrivalSpeed="14.11" duration="148.35" routeLength="1986.69" waitingTime="0.00" waitingCount="0" stopTime="0.00" timeLoss="7.06" rerouteNo="1" devices="tripinfo_car_w2s_257 routing_car_w2s_257" vType="Car" speedFactor="1.02" vaporized=""/>
    <tripinfo id="car_e2w_277" depart="277.00" departLane="e2sep_1" departPos="3.60" departPosLat="0.00" departSpeed="13.90" departDelay="0.00" arrival="407.05" arrivalLane="c2w_1" arrivalPos="990.00" arrivalPosLat="0.00" arrivalSpeed="15.58" duration="130.05" routeLength="1997.01" waitingTime="0.00" waitingCount="0" stopTime="0.00" timeLoss="1.95" rerouteNo="1" devices="tripinfo_car_e2w_277 routing_car_e2w_277" vType="Car" speedFactor="1.12" vaporized=""/>
    <tripinfo id="car_e2s_219" depart="219.00" departLane="e2sep_1" departPos="3.60" departPosLat="0.00" departSpeed="13.90" departDelay="0.00" arrival="407.55" arrivalLane="c2s_1" arrivalPos="990.00" arrivalPosLat="0.00" arrivalSpeed="14.96" duration="188.55" routeLength="1996.47" waitingTime="38.65" waitingCount="2" stopTime="0.00" timeLoss="57.61" rerouteNo="1" devices="tripinfo_car_e2s_219 routing_car_e2s_219" vType="Car" speedFactor="1.10" vaporized=""/>
    <tripinfo id="car_w2n_243" depart="243.00" departLane="w2sep_1" departPos="3.60" departPosLat="0.00" departSpeed="13.90" departDelay="0.00" arrival="411.75" arrivalLane="c2n_1" arrivalPos="990.00" arrivalPosLat="0.00" arrivalSpeed="13.90" duration="168.75" routeLength="1996.47" waitingTime="4.90" waitingCount="1" stopTime="0.00" timeLoss="24.43" rerouteNo="1" devices="tripinfo_car_w2n_243 routing_car_w2n_243" vType="Car" speedFactor="1.00" vaporized=""/>
    <tripinfo id="car_e2s_227" depart="227.00" departLane="e2sep_1" departPos="3.60" departPosLat="0.00" departSpeed="13.90" departDelay="0.00" arrival="412.15" arrivalLane="c2s_1" arrivalPos="990.00" arrivalPosLat="0.00" arrivalSpeed="13.89" duration="185.15" routeLength="1996.47" waitingTime="25.50" waitingCount="2" stopTime="0.00" timeLoss="40.85" rerouteNo="1" devices="tripinfo_car_e2s_227 routing_car_e2s_227" vType="Car" speedFactor="1.00" vaporized=""/>
    <tripinfo id="amb_w2e_300" depart="300.00" departLane="w2sep_1" departPos="6.60" departPosLat="0.00" departSpeed="13.90" departDelay="0.00" arrival="413.05" arrivalLane="c2e_1" arrivalPos="990.00" arrivalPosLat="-0.95" arrivalSpeed="20.85" duration="113.05" routeLength="1994.01" waitingTime="0.00" waitingCount="0" stopTime="0.00" timeLoss="17.37" rerouteNo="1" devices="tripinfo_amb_w2e_300 routing_amb_w2e_300 bluelight_amb_w2e_300 fcd_amb_w2e_300" vType="Ambulance" speedFactor="1.50" vaporized="">
        <example_device customValue1="0.00" customValue2="-1.00"/>
    </tripinfo>
    <tripinfo id="car_w2s_272" depart="272.00" departLane="w2sep_1" departPos="3.60" departPosLat="0.00" departSpeed="13.90" departDelay="0.00" arrival="414.85" arrivalLane="c2s_1" arrivalPos="990.00" arrivalPosLat="0.00" arrivalSpeed="14.55" duration="142.85" routeLength="1986.69" waitingTime="0.00" waitingCount="0" stopTime="0.00" timeLoss="6.89" rerouteNo="1" devices="tripinfo_car_w2s_272 routing_car_w2s_272" vType="Car" speedFactor="1.06" vaporized=""/>
    <tripinfo id="car_w2e_284" depart="284.00" departLane="w2sep_1" departPos="3.60" departPosLat="0.00" departSpeed="13.90" departDelay="0.00" arrival="427.80" arrivalLane="c2e_1" arrivalPos="990.00" arrivalPosLat="1.10" arrivalSpeed="13.90" duration="143.80" routeLength="1997.01" waitingTime="0.00" waitingCount="0" stopTime="0.00" timeLoss="0.13" rerouteNo="1" devices="tripinfo_car_w2e_284 routing_car_w2e_284" vType="Car@car_w2e_284" speedFactor="1.00" vaporized=""/>
    <tripinfo id="car_e2w_279" depart="279.00" departLane="e2sep_1" departPos="3.60" departPosLat="0.00" departSpeed="13.90" departDelay="0.00" arrival="433.60" arrivalLane="c2w_1" arrivalPos="990.00" arrivalPosLat="0.00" arrivalSpeed="15.25" duration="154.60" routeLength="1997.01" waitingTime="18.25" waitingCount="1" stopTime="0.00" timeLoss="23.61" rerouteNo="1" devices="tripinfo_car_e2w_279 routing_car_e2w_279" vType="Car" speedFactor="1.10" vaporized=""/>
    <tripinfo id="car_w2s_290" depart="290.00" departLane="w2sep_1" departPos="3.60" departPosLat="0.00" departSpeed="13.90" departDelay="0.00" arrival="435.95" arrivalLane="c2s_1" arrivalPos="990.00" arrivalPosLat="0.00" arrivalSpeed="14.09" duration="145.95" routeLength="1986.69" waitingTime="0.00" waitingCount="0" stopTime="0.00" timeLoss="4.23" rerouteNo="1" devices="tripinfo_car_w2s_290 routing_car_w2s_290" vType="Car" speedFactor="1.01" vaporized=""/>
    <tripinfo id="car_e2s_282" depart="282.00" departLane="e2sep_1" departPos="3.60" departPosLat="0.00" departSpeed="13.90" departDelay="0.00" arrival="441.80" arrivalLane="c2s_1" arrivalPos="990.00" arrivalPosLat="0.00" arrivalSpeed="13.90" duration="159.80" routeLength="1996.47" waitingTime="6.50" waitingCount="1" stopTime="0.00" timeLoss="15.49" rerouteNo="1" devices="tripinfo_car_e2s_282 routing_car_e2s_282" vType="Car" speedFactor="1.00" vaporized=""/>
    <tripinfo id="car_w2n_293" depart="293.00" departLane="w2sep_1" departPos="3.60" departPosLat="0.00" departSpeed="13.90" departDelay="0.00" arrival="442.05" arrivalLane="c2n_1" arrivalPos="990.00" arrivalPosLat="0.00" arrivalSpeed="13.90" duration="149.05" routeLength="1996.47" waitingTime="0.00" waitingCount="0" stopTime="0.00" timeLoss="4.70" rerouteNo="1" devices="tripinfo_car_w2n_293 routing_car_w2n_293" vType="Car" speedFactor="1.00" vaporized=""/>
    <tripinfo id="car_w2n_294" depart="294.55" departLane="w2sep_1" departPos="3.60" departPosLat="0.00" departSpeed="13.90" departDelay="0.55" arrival="443.90" arrivalLane="c2n_1" arrivalPos="990.00" arrivalPosLat="0.00" arrivalSpeed="15.42" duration="149.35" routeLength="1996.47" waitingTime="0.00" waitingCount="0" stopTime="0.00" timeLoss="25.86" rerouteNo="1" devices="tripinfo_car_w2n_294 routing_car_w2n_294" vType="Car" speedFactor="1.17" vaporized=""/>
    <tripinfo id="car_e2s_292" depart="292.00" departLane="e2sep_1" departPos="3.60" departPosLat="0.00" departSpeed="13.90" departDelay="0.00" arrival="444.35" arrivalLane="c2s_1" arrivalPos="990.00" arrivalPosLat="0.00" arrivalSpeed="14.62" duration="152.35" routeLength="1996.47" waitingTime="1.80" waitingCount="1" stopTime="0.00" timeLoss="16.80" rerouteNo="1" devices="tripinfo_car_e2s_292 routing_car_e2s_292" vType="Car" speedFactor="1.06" vaporized=""/>
    <tripinfo id="car_e2s_294" depart="294.00" departLane="e2sep_1" departPos="3.60" departPosLat="0.00" departSpeed="13.90" departDelay="0.00" arrival="447.80" arrivalLane="c2s_1" arrivalPos="990.00" arrivalPosLat="0.00" arrivalSpeed="14.10" duration="153.80" routeLength="1996.47" waitingTime="0.00" waitingCount="0" stopTime="0.00" timeLoss="11.87" rerouteNo="1" devices="tripinfo_car_e2s_294 routing_car_e2s_294" vType="Car" speedFactor="1.02" vaporized=""/>
    <tripinfo id="car_n2w_242" depart="242.00" departLane="n2sep_1" departPos="3.60" departPosLat="0.00" departSpeed="13.90" departDelay="0.00" arrival="447.90" arrivalLane="c2w_1" arrivalPos="990.00" arrivalPosLat="0.00" arrivalSpeed="15.95" duration="205.90" routeLength="1986.69" waitingTime="72.50" waitingCount="1" stopTime="0.00" timeLoss="80.70" rerouteNo="1" devices="tripinfo_car_n2w_242 routing_car_n2w_242" vType="Car" speedFactor="1.15" vaporized=""/>
    <tripinfo id="car_s2n_267" depart="267.00" departLane="s2sep_1" departPos="3.60" departPosLat="0.00" departSpeed="13.90" departDelay="0.00" arrival="454.10" arrivalLane="c2n_1" arrivalPos="990.00" arrivalPosLat="0.00" arrivalSpeed="14.50" duration="187.10" routeLength="1997.01" waitingTime="41.85" waitingCount="1" stopTime="0.00" timeLoss="49.38" rerouteNo="1" devices="tripinfo_car_s2n_267 routing_car_s2n_267" vType="Car" speedFactor="1.04" vaporized=""/>
    <tripinfo id="car_s2e_275" depart="276.45" departLane="s2sep_1" departPos="3.60" departPosLat="0.00" departSpeed="13.90" departDelay="1.45" arrival="455.65" arrivalLane="c2e_1" arrivalPos="990.00" arrivalPosLat="0.00" arrivalSpeed="15.12" duration="179.20" routeLength="1986.69" waitingTime="31.50" waitingCount="1" stopTime="0.00" timeLoss="47.13" rerouteNo="1" devices="tripinfo_car_s2e_275 routing_car_s2e_275" vType="Car" speedFactor="1.09" vaporized=""/>
    <tripinfo id="car_n2w_251" depart="251.00" departLane="n2sep_1" departPos="3.60" departPosLat="0.00" departSpeed="13.90" departDelay="0.00" arrival="457.00" arrivalLane="c2w_1" arrivalPos="990.00" arrivalPosLat="0.00" arrivalSpeed="14.49" duration="206.00" routeLength="1986.69" waitingTime="58.75" waitingCount="1" stopTime="0.00" timeLoss="68.23" rerouteNo="1" devices="tripinfo_car_n2w_251 routing_car_n2w_251" vType="Car" speedFactor="1.04" vaporized=""/>
    <tripinfo id="car_s2n_275" depart="275.00" departLane="s2sep_1" departPos="3.60" departPosLat="0.00" departSpeed="13.90" departDelay="0.00" arrival="459.75" arrivalLane="c2n_1" arrivalPos="990.00" arrivalPosLat="0.00" arrivalSpeed="14.04" duration="184.75" routeLength="1997.01" waitingTime="32.45" waitingCount="1" stopTime="0.00" timeLoss="42.49" rerouteNo="1" devices="tripinfo_car_s2n_275 routing_car_s2n_275" vType="Car" speedFactor="1.01" vaporized=""/>
    <tripinfo id="car_n2w_261" depart="261.00" departLane="n2sep_1" departPos="3.60" departPosLat="0.00" departSpeed="13.90" departDelay="0.00" arrival="459.85" arrivalLane="c2w_1" arrivalPos="990.00" arrivalPosLat="0.00" arrivalSpeed="15.07" duration="198.85" routeLength="1986.69" waitingTime="52.60" waitingCount="1" stopTime="0.00" timeLoss="67.28" rerouteNo="1" devices="tripinfo_car_n2w_261 routing_car_n2w_261" vType="Car" speedFactor="1.09" vaporized=""/>
    <tripinfo id="car_s2n_284" depart="284.00" departLane="s2sep_1" departPos="3.60" departPosLat="0.00" departSpeed="13.90" departDelay="0.00" arrival="462.35" arrivalLane="c2n_1" arrivalPos="990.00" arrivalPosLat="0.00" arrivalSpeed="14.74" duration="178.35" routeLength="1997.01" waitingTime="29.15" waitingCount="1" stopTime="0.00" timeLoss="44.39" rerouteNo="1" devices="tripinfo_car_s2n_284 routing_car_s2n_284" vType="Car" speedFactor="1.07" vaporized=""/>
    <tripinfo id="car_n2s_283" depart="285.15" departLane="n2sep_1" departPos="3.60" departPosLat="0.00" departSpeed="13.90" departDelay="2.15" arrival="463.60" arrivalLane="c2s_1" arrivalPos="990.00" arrivalPosLat="0.00" arrivalSpeed="13.90" duration="178.45" routeLength="1997.01" waitingTime="20.85" waitingCount="1" stopTime="0.00" timeLoss="34.76" rerouteNo="1" devices="tripinfo_car_n2s_283 routing_car_n2s_283" vType="Car" speedFactor="1.00" vaporized=""/>
    <tripinfo id="car_n2w_290" depart="290.00" departLane="n2sep_1" departPos="3.60" departPosLat="0.00" departSpeed="13.90" departDelay="0.00" arrival="464.90" arrivalLane="c2w_1" arrivalPos="990.00" arrivalPosLat="0.00" arrivalSpeed="14.37" duration="174.90" routeLength="1986.69" waitingTime="19.70" waitingCount="1" stopTime="0.00" timeLoss="36.02" rerouteNo="1" devices="tripinfo_car_n2w_290 routing_car_n2w_290" vType="Car" speedFactor="1.03" vaporized=""/>
    <tripinfo id="car_n2s_311" depart="311.00" departLane="n2sep_1" departPos="3.60" departPosLat="0.00" departSpeed="13.90" departDelay="0.00" arrival="465.90" arrivalLane="c2s_1" arrivalPos="990.00" arrivalPosLat="0.00" arrivalSpeed="14.94" duration="154.90" routeLength="1997.01" waitingTime="6.55" waitingCount="1" stopTime="0.00" timeLoss="23.78" rerouteNo="1" devices="tripinfo_car_n2s_311 routing_car_n2s_311" vType="Car" speedFactor="1.10" vaporized=""/>
    <tripinfo id="car_s2w_314" depart="314.00" departLane="s2sep_1" departPos="3.60" departPosLat="0.00" departSpeed="13.90" departDelay="0.00" arrival="466.90" arrivalLane="c2w_1" arrivalPos="990.00" arrivalPosLat="0.00" arrivalSpeed="15.72" duration="152.90" routeLength="1996.47" waitingTime="13.25" waitingCount="2" stopTime="0.00" timeLoss="30.26" rerouteNo="1" devices="tripinfo_car_s2w_314 routing_car_s2w_314" vType="Car" speedFactor="1.18" vaporized=""/>
    <tripinfo id="bus_s2e_314" depart="315.65" departLane="s2sep_1" departPos="12.10" departPosLat="0.00" departSpeed="13.90" departDelay="1.65" arrival="467.60" arrivalLane="c2e_1" arrivalPos="990.00" arrivalPosLat="0.00" arrivalSpeed="13.90" duration="151.95" routeLength="1978.19" waitingTime="0.00" waitingCount="0" stopTime="0.00" timeLoss="8.89" rerouteNo="1" devices="tripinfo_bus_s2e_314 routing_bus_s2e_314" vType="Bus" speedFactor="1.00" vaporized=""/>
    <tripinfo id="car_n2s_321" depart="321.00" departLane="n2sep_1" departPos="3.60" departPosLat="0.00" departSpeed="13.90" departDelay="0.00" arrival="468.30" arrivalLane="c2s_1" arrivalPos="990.00" arrivalPosLat="0.00" arrivalSpeed="15.07" duration="147.30" routeLength="1997.01" waitingTime="0.00" waitingCount="0" stopTime="0.00" timeLoss="16.76" rerouteNo="1" devices="tripinfo_car_n2s_321 routing_car_n2s_321" vType="Car" speedFactor="1.10" vaporized=""/>
    <tripinfo id="car_s2e_321" depart="321.00" departLane="s2sep_1" departPos="3.60" departPosLat="0.00" departSpeed="13.90" departDelay="0.00" arrival="470.70" arrivalLane="c2e_1" arrivalPos="990.00" arrivalPosLat="0.00" arrivalSpeed="14.76" duration="149.70" routeLength="1986.69" waitingTime="0.00" waitingCount="0" stopTime="0.00" timeLoss="15.56" rerouteNo="1" devices="tripinfo_car_s2e_321 routing_car_s2e_321" vType="Car" speedFactor="1.07" vaporized=""/>
</tripinfos>
