<?xml version="1.0" encoding="UTF-8"?>

<!-- generated on Sat Apr 24 18:14:12 2021 by Eclipse SUMO Version 1.4.0
<configuration xmlns:xsi="http://www.w3.org/2001/XMLSchema-instance" xsi:noNamespaceSchemaLocation="http://sumo.dlr.de/xsd/sumoConfiguration.xsd">

    <input>
        <net-file value="sumofiles/junction.net.xml"/>
        <route-files value="sumofiles/junction_preemption_98.rou.xml"/>
        <additional-files value="sumofiles/junction.det.xml"/>
    </input>

    <output>
        <tripinfo-output value="sumofiles/output/tripinfo_preemption_98.xml"/>
    </output>

    <time>
        <begin value="0"/>
        <end value="10000"/>
        <step-length value="0.05"/>
    </time>

    <processing>
        <lateral-resolution value="0.1"/>
    </processing>

    <report>
        <no-warnings value="true"/>
        <error-log value="sumofiles/output/errorlog_preemption_98.log"/>
        <no-step-log value="true"/>
    </report>

    <traci_server>
        <remote-port value="46495"/>
    </traci_server>

    <gui_only>
        <gui-settings-file value="sumofiles/junction-gui.settings.xml"/>
        <tracker-interval value="0.05"/>
    </gui_only>

</configuration>
-->

<tripinfos xmlns:xsi="http://www.w3.org/2001/XMLSchema-instance" xsi:noNamespaceSchemaLocation="http://sumo.dlr.de/xsd/tripinfo_file.xsd">
    <tripinfo id="car_e2s_0" depart="0.00" departLane="e2sep_1" departPos="3.60" departPosLat="0.00" departSpeed="13.90" departDelay="0.00" arrival="139.70" arrivalLane="c2s_1" arrivalPos="990.00" arrivalPosLat="0.00" arrivalSpeed="14.73" duration="139.70" routeLength="1996.47" waitingTime="0.00" waitingCount="0" stopTime="0.00" timeLoss="3.52" rerouteNo="1" devices="tripinfo_car_e2s_0 routing_car_e2s_0" vType="Car" speedFactor="1.06" vaporized=""/>
    <tripinfo id="car_e2s_2" depart="2.00" departLane="e2sep_1" departPos="3.60" departPosLat="0.00" departSpeed="13.90" departDelay="0.00" arrival="149.70" arrivalLane="c2s_1" arrivalPos="990.00" arrivalPosLat="0.00" arrivalSpeed="14.04" duration="147.70" routeLength="1996.47" waitingTime="0.00" waitingCount="0" stopTime="0.00" timeLoss="4.86" rerouteNo="1" devices="tripinfo_car_e2s_2 routing_car_e2s_2" vType="Car" speedFactor="1.01" vaporized=""/>
    <tripinfo id="car_e2s_17" depart="17.00" departLane="e2sep_1" departPos="3.60" departPosLat="0.00" departSpeed="13.90" departDelay="0.00" arrival="154.05" arrivalLane="c2s_1" arrivalPos="990.00" arrivalPosLat="0.00" arrivalSpeed="15.14" duration="137.05" routeLength="1996.47" waitingTime="0.00" waitingCount="0" stopTime="0.00" timeLoss="4.72" rerouteNo="1" devices="tripinfo_car_e2s_17 routing_car_e2s_17" vType="Car" speedFactor="1.09" vaporized=""/>
    <tripinfo id="car_s2e_5" depart="5.00" departLane="s2sep_1" departPos="3.60" departPosLat="0.00" departSpeed="13.90" departDelay="0.00" arrival="160.30" arrivalLane="c2e_1" arrivalPos="990.00" arrivalPosLat="0.00" arrivalSpeed="15.05" duration="155.30" routeLength="1986.69" waitingTime="15.05" waitingCount="1" stopTime="0.00" timeLoss="22.61" rerouteNo="1" devices="tripinfo_car_s2e_5 routing_car_s2e_5" vType="Car" speedFactor="1.08" vaporized=""/>
    <tripinfo id="car_n2s_0" depart="0.00" departLane="n2sep_1" departPos="3.60" departPosLat="0.00" departSpeed="13.90" departDelay="0.00" arrival="162.10" arrivalLane="c2s_1" arrivalPos="990.00" arrivalPosLat="0.00" arrivalSpeed="14.73" duration="162.10" routeLength="1997.01" waitingTime="18.75" waitingCount="1" stopTime="0.00" timeLoss="26.56" rerouteNo="1" devices="tripinfo_car_n2s_0 routing_car_n2s_0" vType="Car" speedFactor="1.06" vaporized=""/>
    <tripinfo id="car_s2w_13" depart="13.00" departLane="s2sep_1" departPos="3.60" departPosLat="0.00" departSpeed="13.90" departDelay="0.00" arrival="164.75" arrivalLane="c2w_1" arrivalPos="990.00" arrivalPosLat="0.00" arrivalSpeed="14.54" duration="151.75" routeLength="1996.47" waitingTime="4.75" waitingCount="1" stopTime="0.00" timeLoss="13.73" rerouteNo="1" devices="tripinfo_car_s2w_13 routing_car_s2w_13" vType="Car" speedFactor="1.05" vaporized=""/>
    <tripinfo id="car_s2n_22" depart="22.00" departLane="s2sep_1" departPos="3.60" departPosLat="0.00" departSpeed="13.90" departDelay="0.00" arrival="167.30" arrivalLane="c2n_1" arrivalPos="990.00" arrivalPosLat="0.00" arrivalSpeed="13.90" duration="145.30" routeLength="1997.01" waitingTime="0.00" waitingCount="0" stopTime="0.00" timeLoss="1.59" rerouteNo="1" devices="tripinfo_car_s2n_22 routing_car_s2n_22" vType="Car" speedFactor="1.00" vaporized=""/>
    <tripinfo id="car_n2e_12" depart="12.00" departLane="n2sep_1" departPos="3.60" departPosLat="0.00" departSpeed="13.90" departDelay="0.00" arrival="170.85" arrivalLane="c2e_1" arrivalPos="990.00" arrivalPosLat="0.00" arrivalSpeed="13.90" duration="158.85" routeLength="1996.47" waitingTime="3.35" waitingCount="2" stopTime="0.00" timeLoss="14.54" rerouteNo="1" devices="tripinfo_car_n2e_12 routing_car_n2e_12" vType="Car" speedFactor="1.00" vaporized=""/>
    <tripinfo id="car_n2e_17" depart="17.00" departLane="n2sep_1" departPos="3.60" departPosLat="0.00" departSpeed="13.90" departDelay="0.00" arrival="174.15" arrivalLane="c2e_1" arrivalPos="990.00" arrivalPosLat="0.00" arrivalSpeed="14.27" duration="157.15" routeLength="1996.47" waitingTime="0.00" waitingCount="0" stopTime="0.00" timeLoss="17.07" rerouteNo="1" devices="tripinfo_car_n2e_17 routing_car_n2e_17" vType="Car" speedFactor="1.03" vaporized=""/>
    <tripinfo id="car_n2e_38" depart="38.00" departLane="n2sep_1" departPos="3.60" departPosLat="0.00" departSpeed="13.90" departDelay="0.00" arrival="185.80" arrivalLane="c2e_1" arrivalPos="990.00" arrivalPosLat="0.00" arrivalSpeed="13.90" duration="147.80" routeLength="1996.47" waitingTime="0.00" waitingCount="0" stopTime="0.00" timeLoss="3.49" rerouteNo="1" devices="tripinfo_car_n2e_38 routing_car_n2e_38" vType="Car" speedFactor="1.00" vaporized=""/>
    <tripinfo id="car_n2e_52" depart="52.00" departLane="n2sep_1" departPos="3.60" departPosLat="0.00" departSpeed="13.90" departDelay="0.00" arrival="197.30" arrivalLane="c2e_1" arrivalPos="990.00" arrivalPosLat="0.00" arrivalSpeed="14.15" duration="145.30" routeLength="1996.47" waitingTime="0.00" waitingCount="0" stopTime="0.00" timeLoss="3.56" rerouteNo="1" devices="tripinfo_car_n2e_52 routing_car_n2e_52" vType="Car" speedFactor="1.02" vaporized=""/>
    <tripinfo id="car_e2n_20" depart="20.00" departLane="e2sep_1" departPos="3.60" departPosLat="0.00" departSpeed="13.90" departDelay="0.00" arrival="207.50" arrivalLane="c2n_1" arrivalPos="990.00" arrivalPosLat="0.00" arrivalSpeed="14.55" duration="187.50" routeLength="1986.69" waitingTime="42.25" waitingCount="1" stopTime="0.00" timeLoss="50.28" rerouteNo="1" devices="tripinfo_car_e2n_20 routing_car_e2n_20" vType="Car" speedFactor="1.05" vaporized=""/>
    <tripinfo id="car_w2e_12" depart="12.00" departLane="w2sep_1" departPos="3.60" departPosLat="0.00" departSpeed="13.90" departDelay="0.00" arrival="208.80" arrivalLane="c2e_1" arrivalPos="990.00" arrivalPosLat="0.00" arrivalSpeed="14.32" duration="196.80" routeLength="1997.01" waitingTime="50.55" waitingCount="1" stopTime="0.00" timeLoss="57.34" rerouteNo="1" devices="tripinfo_car_w2e_12 routing_car_w2e_12" vType="Car" speedFactor="1.03" vaporized=""/>
    <tripinfo id="car_e2w_37" depart="37.00" departLane="e2sep_1" departPos="3.60" departPosLat="0.00" departSpeed="13.90" departDelay="0.00" arrival="212.80" arrivalLane="c2w_1" arrivalPos="990.00" arrivalPosLat="0.00" arrivalSpeed="13.90" duration="175.80" routeLength="1997.01" waitingTime="23.85" waitingCount="1" stopTime="0.00" timeLoss="32.10" rerouteNo="1" devices="tripinfo_car_e2w_37 routing_car_e2w_37" vType="Car" speedFactor="1.00" vaporized=""/>
    <tripinfo id="car_w2e_16" depart="16.00" departLane="w2sep_1" departPos="3.60" departPosLat="0.00" departSpeed="13.90" departDelay="0.00" arrival="213.90" arrivalLane="c2e_1" arrivalPos="990.00" arrivalPosLat="0.00" arrivalSpeed="14.04" duration="197.90" routeLength="1997.01" waitingTime="44.95" waitingCount="1" stopTime="0.00" timeLoss="55.70" rerouteNo="1" devices="tripinfo_car_w2e_16 routing_car_w2e_16" vType="Car" speedFactor="1.01" vaporized=""/>
    <tripinfo id="car_e2w_82" depart="82.00" departLane="e2sep_1" departPos="3.60" departPosLat="0.00" departSpeed="13.90" departDelay="0.00" arrival="214.85" arrivalLane="c2w_1" arrivalPos="990.00" arrivalPosLat="0.00" arrivalSpeed="15.22" duration="132.85" routeLength="1997.01" waitingTime="0.00" waitingCount="0" stopTime="0.00" timeLoss="5.89" rerouteNo="1" devices="tripinfo_car_e2w_82 routing_car_e2w_82" vType="Car" speedFactor="1.13" vaporized=""/>
    <tripinfo id="car_w2s_19" depart="19.20" departLane="w2sep_1" departPos="3.60" departPosLat="0.00" departSpeed="13.90" departDelay="0.20" arrival="215.50" arrivalLane="c2s_1" arrivalPos="990.00" arrivalPosLat="0.00" arrivalSpeed="14.27" duration="196.30" routeLength="1986.69" waitingTime="41.85" waitingCount="1" stopTime="0.00" timeLoss="56.29" rerouteNo="1" devices="tripinfo_car_w2s_19 routing_car_w2s_19" vType="Car" speedFactor="1.03" vaporized=""/>
    <tripinfo id="car_w2n_35" depart="35.00" departLane="w2sep_1" departPos="3.60" departPosLat="0.00" departSpeed="13.90" departDelay="0.00" arrival="216.05" arrivalLane="c2n_1" arrivalPos="990.00" arrivalPosLat="0.00" arrivalSpeed="13.90" duration="181.05" routeLength="1996.47" waitingTime="25.20" waitingCount="2" stopTime="0.00" timeLoss="36.73" rerouteNo="1" devices="tripinfo_car_w2n_35 routing_car_w2n_35" vType="Car" speedFactor="1.00" vaporized=""/>
    <tripinfo id="car_w2e_17" depart="17.50" departLane="w2sep_1" departPos="3.60" departPosLat="0.00" departSpeed="13.90" departDelay="0.50" arrival="216.30" arrivalLane="c2e_1" arrivalPos="990.00" arrivalPosLat="0.00" arrivalSpeed="14.81" duration="198.80" routeLength="1997.01" waitingTime="43.95" waitingCount="1" stopTime="0.00" timeLoss="66.07" rerouteNo="1" devices="tripinfo_car_w2e_17 routing_car_w2e_17" vType="Car" speedFactor="1.08" vaporized=""/>
    <tripinfo id="car_w2s_29" depart="29.00" departLane="w2sep_1" departPos="3.60" departPosLat="0.00" departSpeed="13.90" departDelay="0.00" arrival="219.20" arrivalLane="c2s_1" arrivalPos="990.00" arrivalPosLat="0.00" arrivalSpeed="14.51" duration="190.20" routeLength="1986.69" waitingTime="38.05" waitingCount="1" stopTime="0.00" timeLoss="52.83" rerouteNo="1" devices="tripinfo_car_w2s_29 routing_car_w2s_29" vType="Car" speedFactor="1.05" vaporized=""/>
    <tripinfo id="car_w2s_44" depart="44.00" departLane="w2sep_1" departPos="3.60" departPosLat="0.00" departSpeed="13.90" departDelay="0.00" arrival="221.20" arrivalLane="c2s_1" arrivalPos="990.00" arrivalPosLat="0.00" arrivalSpeed="15.54" duration="177.20" routeLength="1986.69" waitingTime="28.75" waitingCount="1" stopTime="0.00" timeLoss="53.15" rerouteNo="1" devices="tripinfo_car_w2s_44 routing_car_w2s_44" vType="Car" speedFactor="1.16" vaporized=""/>
    <tripinfo id="car_w2e_55" depart="55.00" departLane="w2sep_1" departPos="3.60" departPosLat="0.00" departSpeed="13.90" departDelay="0.00" arrival="223.45" arrivalLane="c2e_1" arrivalPos="990.00" arrivalPosLat="0.00" arrivalSpeed="14.04" duration="168.45" routeLength="1997.01" waitingTime="12.75" waitingCount="1" stopTime="0.00" timeLoss="26.18" rerouteNo="1" devices="tripinfo_car_w2e_55 routing_car_w2e_55" vType="Car" speedFactor="1.01" vaporized=""/>
    <tripinfo id="car_w2s_64" depart="64.00" departLane="w2sep_1" departPos="3.60" departPosLat="0.00" departSpeed="13.90" departDelay="0.00" arrival="223.85" arrivalLane="c2s_1" arrivalPos="990.00" arrivalPosLat="0.00" arrivalSpeed="15.02" duration="159.85" routeLength="1986.69" waitingTime="9.55" waitingCount="1" stopTime="0.00" timeLoss="28.13" rerouteNo="1" devices="tripinfo_car_w2s_64 routing_car_w2s_64" vType="Car" speedFactor="1.09" vaporized=""/>
    <tripinfo id="car_w2s_82" depart="82.00" departLane="w2sep_1" departPos="3.60" departPosLat="0.00" departSpeed="13.90" departDelay="0.00" arrival="230.45" arrivalLane="c2s_1" arrivalPos="990.00" arrivalPosLat="0.00" arrivalSpeed="13.90" duration="148.45" routeLength="1986.69" waitingTime="0.00" waitingCount="0" stopTime="0.00" timeLoss="4.79" rerouteNo="1" devices="tripinfo_car_w2s_82 routing_car_w2s_82" vType="Car" speedFactor="1.00" vaporized=""/>
    <tripinfo id="car_e2s_21" depart="21.45" departLane="e2sep_1" departPos="3.60" departPosLat="0.00" departSpeed="13.90" departDelay="0.45" arrival="232.50" arrivalLane="c2s_1" arrivalPos="990.00" arrivalPosLat="0.00" arrivalSpeed="15.11" duration="211.05" routeLength="1996.47" waitingTime="58.05" waitingCount="2" stopTime="0.00" timeLoss="82.54" rerouteNo="1" devices="tripinfo_car_e2s_21 routing_car_e2s_21" vType="Car" speedFactor="1.12" vaporized=""/>
    <tripinfo id="car_e2s_83" depart="83.25" departLane="e2sep_1" departPos="3.60" departPosLat="0.00" departSpeed="13.90" departDelay="0.25" arrival="234.40" arrivalLane="c2s_1" arrivalPos="990.00" arrivalPosLat="0.00" arrivalSpeed="15.62" duration="151.15" routeLength="1996.47" waitingTime="6.20" waitingCount="1" stopTime="0.00" timeLoss="28.67" rerouteNo="1" devices="tripinfo_car_e2s_83 routing_car_e2s_83" vType="Car" speedFactor="1.18" vaporized=""/>
    <tripinfo id="car_e2s_87" depart="87.00" departLane="e2sep_1" departPos="3.60" departPosLat="0.00" departSpeed="13.90" departDelay="0.00" arrival="238.80" arrivalLane="c2s_1" arrivalPos="990.00" arrivalPosLat="0.00" arrivalSpeed="13.96" duration="151.80" routeLength="1996.47" waitingTime="0.00" waitingCount="0" stopTime="0.00" timeLoss="8.23" rerouteNo="1" devices="tripinfo_car_e2s_87 routing_car_e2s_87" vType="Car" speedFactor="1.01" vaporized=""/>
    <tripinfo id="bus_e2s_100" depart="100.00" departLane="e2sep_1" departPos="12.10" departPosLat="0.00" departSpeed="13.90" departDelay="0.00" arrival="249.30" arrivalLane="c2s_1" arrivalPos="990.00" arrivalPosLat="0.00" arrivalSpeed="13.90" duration="149.30" routeLength="1987.97" waitingTime="0.00" waitingCount="0" stopTime="0.00" timeLoss="5.59" rerouteNo="1" devices="tripinfo_bus_e2s_100 routing_bus_e2s_100" vType="Bus" speedFactor="1.00" vaporized=""/>
    <tripinfo id="car_n2w_66" depart="66.00" departLane="n2sep_1" departPos="3.60" departPosLat="0.00" departSpeed="13.90" departDelay="0.00" arrival="252.50" arrivalLane="c2w_1" arrivalPos="990.00" arrivalPosLat="0.00" arrivalSpeed="14.55" duration="186.50" routeLength="1986.69" waitingTime="42.05" waitingCount="1" stopTime="0.00" timeLoss="49.29" rerouteNo="1" devices="tripinfo_car_n2w_66 routing_car_n2w_66" vType="Car" speedFactor="1.05" vaporized=""/>
    <tripinfo id="car_s2n_65" depart="65.00" departLane="s2sep_1" departPos="3.60" departPosLat="0.00" departSpeed="13.90" departDelay="0.00" arrival="253.90" arrivalLane="c2n_1" arrivalPos="990.00" arrivalPosLat="0.00" arrivalSpeed="14.27" duration="188.90" routeLength="1997.01" waitingTime="41.80" waitingCount="1" stopTime="0.00" timeLoss="48.91" rerouteNo="1" devices="tripinfo_car_s2n_65 routing_car_s2n_65" vType="Car" speedFactor="1.03" vaporized=""/>
    <tripinfo id="car_s2n_66" depart="66.40" departLane="s2sep_1" departPos="3.60" departPosLat="0.00" departSpeed="13.90" departDelay="0.40" arrival="256.20" arrivalLane="c2n_1" arrivalPos="990.00" arrivalPosLat="0.00" arrivalSpeed="15.29" duration="189.80" routeLength="1997.01" waitingTime="40.65" waitingCount="1" stopTime="0.00" timeLoss="61.84" rerouteNo="1" devices="tripinfo_car_s2n_66 routing_car_s2n_66" vType="Car" speedFactor="1.12" vaporized=""/>
    <tripinfo id="car_n2w_74" depart="74.00" departLane="n2sep_1" departPos="3.60" departPosLat="0.00" departSpeed="13.90" departDelay="0.00" arrival="259.25" arrivalLane="c2w_1" arrivalPos="990.00" arrivalPosLat="0.00" arrivalSpeed="13.90" duration="185.25" routeLength="1986.69" waitingTime="31.80" waitingCount="1" stopTime="0.00" timeLoss="41.59" rerouteNo="1" devices="tripinfo_car_n2w_74 routing_car_n2w_74" vType="Car" speedFactor="1.00" vaporized=""/>
    <tripinfo id="car_n2w_83" depart="83.00" departLane="n2sep_1" departPos="3.60" departPosLat="0.00" departSpeed="13.90" departDelay="0.00" arrival="263.30" arrivalLane="c2w_1" arrivalPos="990.00" arrivalPosLat="0.00" arrivalSpeed="13.89" duration="180.30" routeLength="1986.69" waitingTime="23.90" waitingCount="1" stopTime="0.00" timeLoss="36.64" rerouteNo="1" devices="tripinfo_car_n2w_83 routing_car_n2w_83" vType="Car" speedFactor="1.00" vaporized=""/>
    <tripinfo id="bus_s2e_71" depart="71.00" departLane="s2sep_1" departPos="12.10" departPosLat="0.00" departSpeed="13.90" departDelay="0.00" arrival="263.40" arrivalLane="c2e_1" arrivalPos="990.00" arrivalPosLat="0.00" arrivalSpeed="13.90" duration="192.40" routeLength="1978.19" waitingTime="36.65" waitingCount="1" stopTime="0.00" timeLoss="49.34" rerouteNo="1" devices="tripinfo_bus_s2e_71 routing_bus_s2e_71" vType="Bus" speedFactor="1.00" vaporized=""/>
    <tripinfo id="car_n2w_103" depart="103.00" departLane="n2sep_1" departPos="3.60" departPosLat="0.00" departSpeed="13.90" departDelay="0.00" arrival="265.10" arrivalLane="c2w_1" arrivalPos="990.00" arrivalPosLat="0.00" arrivalSpeed="15.40" duration="162.10" routeLength="1986.69" waitingTime="14.05" waitingCount="1" stopTime="0.00" timeLoss="40.31" rerouteNo="1" devices="tripinfo_car_n2w_103 routing_car_n2w_103" vType="Car" speedFactor="1.18" vaporized=""/>
    <tripinfo id="car_s2e_86" depart="86.00" departLane="s2sep_1" departPos="3.60" departPosLat="0.00" departSpeed="13.90" departDelay="0.00" arrival="265.90" arrivalLane="c2e_1" arrivalPos="990.00" arrivalPosLat="0.00" arrivalSpeed="15.56" duration="179.90" routeLength="1986.69" waitingTime="31.85" waitingCount="1" stopTime="0.00" timeLoss="55.43" rerouteNo="1" devices="tripinfo_car_s2e_86 routing_car_s2e_86" vType="Car" speedFactor="1.15" vaporized=""/>
    <tripinfo id="car_s2n_94" depart="94.00" departLane="s2sep_1" departPos="3.60" departPosLat="0.00" departSpeed="13.90" departDelay="0.00" arrival="266.05" arrivalLane="c2n_1" arrivalPos="990.00" arrivalPosLat="0.00" arrivalSpeed="14.17" duration="172.05" routeLength="1997.01" waitingTime="17.55" waitingCount="1" stopTime="0.00" timeLoss="31.12" rerouteNo="1" devices="tripinfo_car_s2n_94 routing_car_s2n_94" vType="Car" speedFactor="1.02" vaporized=""/>
    <tripinfo id="car_n2w_121" depart="121.00" departLane="n2sep_1" departPos="3.60" departPosLat="0.00" departSpeed="13.90" departDelay="0.00" arrival="267.80" arrivalLane="c2w_1" arrivalPos="990.00" arrivalPosLat="0.00" arrivalSpeed="14.39" duration="146.80" routeLength="1986.69" waitingTime="0.00" waitingCount="0" stopTime="0.00" timeLoss="9.08" rerouteNo="1" devices="tripinfo_car_n2w_121 routing_car_n2w_121" vType="Car" speedFactor="1.04" vaporized=""/>
    <tripinfo id="car_s2w_87" depart="87.25" departLane="s2sep_1" departPos="3.60" departPosLat="0.00" departSpeed="13.90" departDelay="0.25" arrival="269.60" arrivalLane="c2w_1" arrivalPos="990.00" arrivalPosLat="0.00" arrivalSpeed="15.41" duration="182.35" routeLength="1996.47" waitingTime="31.90" waitingCount="3" stopTime="0.00" timeLoss="59.18" rerouteNo="1" devices="tripinfo_car_s2w_87 routing_car_s2w_87" vType="Car" speedFactor="1.17" vaporized=""/>
    <tripinfo id="car_s2e_113" depart="113.00" departLane="s2sep_1" departPos="3.60" departPosLat="0.00" departSpeed="13.90" departDelay="0.00" arrival="270.50" arrivalLane="c2e_1" arrivalPos="990.00" arrivalPosLat="0.00" arrivalSpeed="14.31" duration="157.50" routeLength="1986.69" waitingTime="1.90" waitingCount="1" stopTime="0.00" timeLoss="18.07" rerouteNo="1" devices="tripinfo_car_s2e_113 routing_car_s2e_113" vType="Car" speedFactor="1.03" vaporized=""/>
    <tripinfo id="car_s2n_98" depart="98.00" departLane="s2sep_1" departPos="3.60" departPosLat="0.00" departSpeed="13.90" departDelay="0.00" arrival="271.05" arrivalLane="c2n_1" arrivalPos="990.00" arrivalPosLat="0.00" arrivalSpeed="13.90" duration="173.05" routeLength="1997.01" waitingTime="13.15" waitingCount="1" stopTime="0.00" timeLoss="29.38" rerouteNo="1" devices="tripinfo_car_s2n_98 routing_car_s2n_98" vType="Car" speedFactor="1.00" vaporized=""/>
    <tripinfo id="car_s2w_121" depart="121.00" departLane="s2sep_1" departPos="3.60" departPosLat="0.00" departSpeed="13.90" departDelay="0.00" arrival="271.85" arrivalLane="c2w_1" arrivalPos="990.00" arrivalPosLat="0.00" arrivalSpeed="14.84" duration="150.85" routeLength="1996.47" waitingTime="1.40" waitingCount="1" stopTime="0.00" timeLoss="18.19" rerouteNo="1" devices="tripinfo_car_s2w_121 routing_car_s2w_121" vType="Car" speedFactor="1.09" vaporized=""/>
    <tripinfo id="car_n2e_92" depart="92.00" departLane="n2sep_1" departPos="3.60" departPosLat="0.00" departSpeed="13.90" departDelay="0.00" arrival="275.90" arrivalLane="c2e_1" arrivalPos="990.00" arrivalPosLat="0.00" arrivalSpeed="13.90" duration="183.90" routeLength="1996.47" waitingTime="27.30" waitingCount="2" stopTime="0.00" timeLoss="39.59" rerouteNo="1" devices="tripinfo_car_n2e_92 routing_car_n2e_92" vType="Car" speedFactor="1.00" vaporized=""/>
    <tripinfo id="car_s2n_133" depart="133.00" departLane="s2sep_1" departPos="3.60" departPosLat="0.00" departSpeed="13.90" departDelay="0.00" arrival="277.90" arrivalLane="c2n_1" arrivalPos="990.00" arrivalPosLat="0.00" arrivalSpeed="13.90" duration="144.90" routeLength="1997.01" waitingTime="0.00" waitingCount="0" stopTime="0.00" timeLoss="1.22" rerouteNo="1" devices="tripinfo_car_s2n_133 routing_car_s2n_133" vType="Car" speedFactor="1.00" vaporized=""/>
    <tripinfo id="car_s2n_145" depart="145.00" departLane="s2sep_1" departPos="3.60" departPosLat="0.00" departSpeed="13.90" departDelay="0.00" arrival="280.05" arrivalLane="c2n_1" arrivalPos="990.00" arrivalPosLat="0.00" arrivalSpeed="15.42" duration="135.05" routeLength="1997.01" waitingTime="0.00" waitingCount="0" stopTime="0.00" timeLoss="9.28" rerouteNo="1" devices="tripinfo_car_s2n_145 routing_car_s2n_145" vType="Car" speedFactor="1.14" vaporized=""/>
    <tripinfo id="car_s2w_141" depart="141.00" departLane="s2sep_1" departPos="3.60" departPosLat="0.00" departSpeed="13.90" departDelay="0.00" arrival="288.90" arrivalLane="c2w_1" arrivalPos="990.00" arrivalPosLat="0.00" arrivalSpeed="13.90" duration="147.90" routeLength="1996.47" waitingTime="0.00" waitingCount="0" stopTime="0.00" timeLoss="3.55" rerouteNo="1" devices="tripinfo_car_s2w_141 routing_car_s2w_141" vType="Car" speedFactor="1.00" vaporized=""/>
    <tripinfo id="car_w2e_112" depart="112.00" departLane="w2sep_1" departPos="3.60" departPosLat="0.00" departSpeed="13.90" departDelay="0.00" arrival="291.30" arrivalLane="c2e_1" arrivalPos="990.00" arrivalPosLat="0.00" arrivalSpeed="16.10" duration="179.30" routeLength="1997.01" waitingTime="47.40" waitingCount="1" stopTime="0.00" timeLoss="55.25" rerouteNo="1" devices="tripinfo_car_w2e_112 routing_car_w2e_112" vType="Car" speedFactor="1.16" vaporized=""/>
    <tripinfo id="car_e2w_104" depart="104.00" departLane="e2sep_1" departPos="3.60" departPosLat="0.00" departSpeed="13.90" departDelay="0.00" arrival="294.70" arrivalLane="c2w_1" arrivalPos="990.00" arrivalPosLat="0.00" arrivalSpeed="15.32" duration="190.70" routeLength="1997.01" waitingTime="48.30" waitingCount="1" stopTime="0.00" timeLoss="60.36" rerouteNo="1" devices="tripinfo_car_e2w_104 routing_car_e2w_104" vType="Car" speedFactor="1.10" vaporized=""/>
    <tripinfo id="car_w2s_116" depart="117.45" departLane="w2sep_1" departPos="3.60" departPosLat="0.00" departSpeed="13.90" departDelay="1.45" arrival="297.05" arrivalLane="c2s_1" arrivalPos="990.00" arrivalPosLat="0.00" arrivalSpeed="15.18" duration="179.60" routeLength="1986.69" waitingTime="33.80" waitingCount="1" stopTime="0.00" timeLoss="48.04" rerouteNo="1" devices="tripinfo_car_w2s_116 routing_car_w2s_116" vType="Car" speedFactor="1.09" vaporized=""/>
    <tripinfo id="car_w2s_136" depart="137.50" departLane="w2sep_1" departPos="3.60" departPosLat="0.00" departSpeed="13.90" departDelay="1.50" arrival="301.25" arrivalLane="c2s_1" arrivalPos="990.00" arrivalPosLat="0.00" arrivalSpeed="15.21" duration="163.75" routeLength="1986.69" waitingTime="12.90" waitingCount="1" stopTime="0.00" timeLoss="32.65" rerouteNo="1" devices="tripinfo_car_w2s_136 routing_car_w2s_136" vType="Car" speedFactor="1.10" vaporized=""/>
    <tripinfo id="car_e2w_128" depart="128.00" departLane="e2sep_1" departPos="3.60" departPosLat="0.00" departSpeed="13.90" departDelay="0.00" arrival="303.55" arrivalLane="c2w_1" arrivalPos="990.00" arrivalPosLat="0.00" arrivalSpeed="13.90" duration="175.55" routeLength="1997.01" waitingTime="22.85" waitingCount="1" stopTime="0.00" timeLoss="31.86" rerouteNo="1" devices="tripinfo_car_e2w_128 routing_car_e2w_128" vType="Car" speedFactor="1.00" vaporized=""/>
    <tripinfo id="car_e2w_147" depart="147.00" departLane="e2sep_1" departPos="3.60" departPosLat="0.00" departSpeed="13.90" departDelay="0.00" arrival="306.95" arrivalLane="c2w_1" arrivalPos="990.00" arrivalPosLat="0.00" arrivalSpeed="14.19" duration="159.95" routeLength="1997.01" waitingTime="6.50" waitingCount="1" stopTime="0.00" timeLoss="19.55" rerouteNo="1" devices="tripinfo_car_e2w_147 routing_car_e2w_147" vType="Car" speedFactor="1.02" vaporized=""/>
    <tripinfo id="car_w2e_139" depart="139.25" departLane="w2sep_1" departPos="3.60" departPosLat="0.00" departSpeed="13.90" departDelay="0.25" arrival="307.05" arrivalLane="c2e_1" arrivalPos="990.00" arrivalPosLat="0.00" arrivalSpeed="13.94" duration="167.80" routeLength="1997.01" waitingTime="10.60" waitingCount="1" stopTime="0.00" timeLoss="24.59" rerouteNo="1" devices="tripinfo_car_w2e_139 routing_car_w2e_139" vType="Car" speedFactor="1.00" vaporized=""/>
    <tripinfo id="car_e2n_163" depart="163.00" departLane="e2sep_1" departPos="3.60" departPosLat="0.00" departSpeed="13.90" departDelay="0.00" arrival="308.45" arrivalLane="c2n_1" arrivalPos="990.00" arrivalPosLat="0.00" arrivalSpeed="14.12" duration="145.45" routeLength="1986.69" waitingTime="0.00" waitingCount="0" stopTime="0.00" timeLoss="4.04" rerouteNo="1" devices="tripinfo_car_e2n_163 routing_car_e2n_163" vType="Car" speedFactor="1.02" vaporized=""/>
    <tripinfo id="car_e2w_167" depart="167.00" departLane="e2sep_1" departPos="3.60" departPosLat="0.00" departSpeed="13.90" departDelay="0.00" arrival="308.75" arrivalLane="c2w_1" arrivalPos="990.00" arrivalPosLat="0.00" arrivalSpeed="15.48" duration="141.75" routeLength="1997.01" waitingTime="0.00" waitingCount="0" stopTime="0.00" timeLoss="19.83" rerouteNo="1" devices="tripinfo_car_e2w_167 routing_car_e2w_167" vType="Car" speedFactor="1.18" vaporized=""/>
    <tripinfo id="car_e2n_167" depart="168.25" departLane="e2sep_1" departPos="3.60" departPosLat="0.00" departSpeed="13.90" departDelay="1.25" arrival="310.45" arrivalLane="c2n_1" arrivalPos="990.00" arrivalPosLat="0.00" arrivalSpeed="15.46" duration="142.20" routeLength="1986.69" waitingTime="0.00" waitingCount="0" stopTime="0.00" timeLoss="17.77" rerouteNo="1" devices="tripinfo_car_e2n_167 routing_car_e2n_167" vType="Car" speedFactor="1.15" vaporized=""/>
    <tripinfo id="car_w2e_141" depart="141.10" departLane="w2sep_1" departPos="3.60" departPosLat="0.00" departSpeed="13.90" departDelay="0.10" arrival="311.50" arrivalLane="c2e_1" arrivalPos="990.00" arrivalPosLat="0.00" arrivalSpeed="13.89" duration="170.40" routeLength="1997.01" waitingTime="8.75" waitingCount="1" stopTime="0.00" timeLoss="26.74" rerouteNo="1" devices="tripinfo_car_w2e_141 routing_car_w2e_141" vType="Car" speedFactor="1.00" vaporized=""/>
    <tripinfo id="car_w2n_116" depart="116.00" departLane="w2sep_1" departPos="3.60" departPosLat="0.00" departSpeed="13.90" departDelay="0.00" arrival="316.40" arrivalLane="c2n_1" arrivalPos="990.00" arrivalPosLat="0.00" arrivalSpeed="14.15" duration="200.40" routeLength="1996.47" waitingTime="46.75" waitingCount="2" stopTime="0.00" timeLoss="58.61" rerouteNo="1" devices="tripinfo_car_w2n_116 routing_car_w2n_116" vType="Car" speedFactor="1.02" vaporized=""/>
    <tripinfo id="car_w2e_170" depart="170.00" departLane="w2sep_1" departPos="3.60" departPosLat="0.00" departSpeed="13.90" departDelay="0.00" arrival="316.55" arrivalLane="c2e_1" arrivalPos="990.00" arrivalPosLat="0.00" arrivalSpeed="14.45" duration="146.55" routeLength="1997.01" waitingTime="0.00" waitingCount="0" stopTime="0.00" timeLoss="8.39" rerouteNo="1" devices="tripinfo_car_w2e_170 routing_car_w2e_170" vType="Car" speedFactor="1.04" vaporized=""/>
    <tripinfo id="bus_w2s_168" depart="168.00" departLane="w2sep_1" departPos="12.10" departPosLat="0.00" departSpeed="13.90" departDelay="0.00" arrival="317.35" arrivalLane="c2s_1" arrivalPos="990.00" arrivalPosLat="0.00" arrivalSpeed="13.90" duration="149.35" routeLength="1978.19" waitingTime="0.00" waitingCount="0" stopTime="0.00" timeLoss="6.29" rerouteNo="1" devices="tripinfo_bus_w2s_168 routing_bus_w2s_168" vType="Bus" speedFactor="1.00" vaporized=""/>
    <tripinfo id="car_e2w_185" depart="185.00" departLane="e2sep_1" departPos="3.60" departPosLat="0.00" departSpeed="13.90" departDelay="0.00" arrival="317.55" arrivalLane="c2w_1" arrivalPos="990.00" arrivalPosLat="0.00" arrivalSpeed="15.32" duration="132.55" routeLength="1997.01" waitingTime="0.00" waitingCount="0" stopTime="0.00" timeLoss="2.20" rerouteNo="1" devices="tripinfo_car_e2w_185 routing_car_e2w_185" vType="Car" speedFactor="1.10" vaporized=""/>
    <tripinfo id="car_w2s_182" depart="182.00" departLane="w2sep_1" departPos="3.60" departPosLat="0.00" departSpeed="13.90" departDelay="0.00" arrival="319.70" arrivalLane="c2s_1" arrivalPos="990.00" arrivalPosLat="0.00" arrivalSpeed="15.74" duration="137.70" routeLength="1986.69" waitingTime="0.00" waitingCount="0" stopTime="0.00" timeLoss="15.92" rerouteNo="1" devices="tripinfo_car_w2s_182 routing_car_w2s_182" vType="Car" speedFactor="1.18" vaporized=""/>
    <tripinfo id="car_w2n_117" depart="119.15" departLane="w2sep_1" departPos="3.60" departPosLat="0.00" departSpeed="13.90" departDelay="2.15" arrival="319.75" arrivalLane="c2n_1" arrivalPos="990.00" arrivalPosLat="0.00" arrivalSpeed="14.38" duration="200.60" routeLength="1996.47" waitingTime="40.95" waitingCount="2" stopTime="0.00" timeLoss="61.52" rerouteNo="1" devices="tripinfo_car_w2n_117 routing_car_w2n_117" vType="Car" speedFactor="1.04" vaporized=""/>
    <tripinfo id="car_e2s_134" depart="134.00" departLane="e2sep_1" departPos="3.60" departPosLat="0.00" departSpeed="13.90" departDelay="0.00" arrival="321.75" arrivalLane="c2s_1" arrivalPos="990.00" arrivalPosLat="0.00" arrivalSpeed="15.72" duration="187.75" routeLength="1996.47" waitingTime="42.70" waitingCount="2" stopTime="0.00" timeLoss="64.25" rerouteNo="1" devices="tripinfo_car_e2s_134 routing_car_e2s_134" vType="Car" speedFactor="1.17" vaporized=""/>
    <tripinfo id="car_w2n_123" depart="123.00" departLane="w2sep_1" departPos="3.60" departPosLat="0.00" departSpeed="13.90" departDelay="0.00" arrival="323.65" arrivalLane="c2n_1" arrivalPos="990.00" arrivalPosLat="0.00" arrivalSpeed="14.02" duration="200.65" routeLength="1996.47" waitingTime="36.00" waitingCount="2" stopTime="0.00" timeLoss="57.79" rerouteNo="1" devices="tripinfo_car_w2n_123 routing_car_w2n_123" vType="Car" speedFactor="1.01" vaporized=""/>
    <tripinfo id="car_w2e_193" depart="193.00" departLane="w2sep_1" departPos="3.60" departPosLat="0.00" departSpeed="13.90" departDelay="0.00" arrival="326.25" arrivalLane="c2e_1" arrivalPos="990.00" arrivalPosLat="0.00" arrivalSpeed="15.11" duration="133.25" routeLength="1997.01" waitingTime="0.00" waitingCount="0" stopTime="0.00" timeLoss="1.04" rerouteNo="1" devices="tripinfo_car_w2e_193 routing_car_w2e_193" vType="Car" speedFactor="1.09" vaporized=""/>
    <tripinfo id="car_w2n_128" depart="128.00" departLane="w2sep_1" departPos="3.60" departPosLat="0.00" departSpeed="13.90" departDelay="0.00" arrival="328.45" arrivalLane="c2n_1" arrivalPos="990.00" arrivalPosLat="0.00" arrivalSpeed="13.89" duration="200.45" routeLength="1996.47" waitingTime="32.00" waitingCount="3" stopTime="0.00" timeLoss="56.12" rerouteNo="1" devices="tripinfo_car_w2n_128 routing_car_w2n_128" vType="Car" speedFactor="1.00" vaporized=""/>
    <tripinfo id="car_w2n_133" depart="133.00" departLane="w2sep_1" departPos="3.60" departPosLat="0.00" departSpeed="13.90" departDelay="0.00" arrival="332.30" arrivalLane="c2n_1" arrivalPos="990.00" arrivalPosLat="0.00" arrivalSpeed="13.88" duration="199.30" routeLength="1996.47" waitingTime="27.95" waitingCount="2" stopTime="0.00" timeLoss="54.95" rerouteNo="1" devices="tripinfo_car_w2n_133 routing_car_w2n_133" vType="Car" speedFactor="1.00" vaporized=""/>
    <tripinfo id="car_e2s_168" depart="169.85" departLane="e2sep_1" departPos="3.60" departPosLat="0.00" departSpeed="13.90" departDelay="1.85" arrival="334.90" arrivalLane="c2s_1" arrivalPos="990.00" arrivalPosLat="0.00" arrivalSpeed="13.97" duration="165.05" routeLength="1996.47" waitingTime="8.75" waitingCount="2" stopTime="0.00" timeLoss="21.45" rerouteNo="1" devices="tripinfo_car_e2s_168 routing_car_e2s_168" vType="Car" speedFactor="1.01" vaporized=""/>
    <tripinfo id="car_w2n_136" depart="136.00" departLane="w2sep_1" departPos="3.60" departPosLat="0.00" departSpeed="13.90" departDelay="0.00" arrival="335.25" arrivalLane="c2n_1" arrivalPos="990.00" arrivalPosLat="0.00" arrivalSpeed="14.06" duration="199.25" routeLength="1996.47" waitingTime="25.75" waitingCount="2" stopTime="0.00" timeLoss="57.31" rerouteNo="1" devices="tripinfo_car_w2n_136 routing_car_w2n_136" vType="Car" speedFactor="1.02" vaporized=""/>
    <tripinfo id="car_w2n_178" depart="178.00" departLane="w2sep_1" departPos="3.60" departPosLat="0.00" departSpeed="13.90" departDelay="0.00" arrival="337.60" arrivalLane="c2n_1" arrivalPos="990.00" arrivalPosLat="0.00" arrivalSpeed="14.45" duration="159.60" routeLength="1996.47" waitingTime="0.00" waitingCount="0" stopTime="0.00" timeLoss="22.90" rerouteNo="1" devices="tripinfo_car_w2n_178 routing_car_w2n_178" vType="Car" speedFactor="1.06" vaporized=""/>
    <tripinfo id="car_s2e_149" depart="149.00" departLane="s2sep_1" departPos="3.60" departPosLat="0.00" departSpeed="13.90" departDelay="0.00" arrival="337.70" arrivalLane="c2e_1" arrivalPos="990.00" arrivalPosLat="0.00" arrivalSpeed="15.73" duration="188.70" routeLength="1986.69" waitingTime="50.25" waitingCount="1" stopTime="0.00" timeLoss="61.74" rerouteNo="1" devices="tripinfo_car_s2e_149 routing_car_s2e_149" vType="Car" speedFactor="1.13" vaporized=""/>
    <tripinfo id="car_e2s_170" depart="171.65" departLane="e2sep_1" departPos="3.60" departPosLat="0.00" departSpeed="13.90" departDelay="1.65" arrival="338.60" arrivalLane="c2s_1" arrivalPos="990.00" arrivalPosLat="0.00" arrivalSpeed="14.18" duration="166.95" routeLength="1996.47" waitingTime="4.05" waitingCount="2" stopTime="0.00" timeLoss="25.76" rerouteNo="1" devices="tripinfo_car_e2s_170 routing_car_e2s_170" vType="Car" speedFactor="1.02" vaporized=""/>
    <tripinfo id="car_w2n_184" depart="184.00" departLane="w2sep_1" departPos="3.60" departPosLat="0.00" departSpeed="13.90" departDelay="0.00" arrival="340.20" arrivalLane="c2n_1" arrivalPos="990.00" arrivalPosLat="0.00" arrivalSpeed="14.22" duration="156.20" routeLength="1996.47" waitingTime="0.00" waitingCount="0" stopTime="0.00" timeLoss="16.43" rerouteNo="1" devices="tripinfo_car_w2n_184 routing_car_w2n_184" vType="Car" speedFactor="1.03" vaporized=""/>
    <tripinfo id="car_e2s_175" depart="175.00" departLane="e2sep_1" departPos="3.60" departPosLat="0.00" departSpeed="13.90" departDelay="0.00" arrival="342.00" arrivalLane="c2s_1" arrivalPos="990.00" arrivalPosLat="0.00" arrivalSpeed="14.13" duration="167.00" routeLength="1996.47" waitingTime="1.95" waitingCount="1" stopTime="0.00" timeLoss="25.45" rerouteNo="1" devices="tripinfo_car_e2s_175 routing_car_e2s_175" vType="Car" speedFactor="1.02" vaporized=""/>
    <tripinfo id="car_s2n_150" depart="150.30" departLane="s2sep_1" departPos="3.60" departPosLat="0.00" departSpeed="13.90" departDelay="0.30" arrival="343.60" arrivalLane="c2n_1" arrivalPos="990.00" arrivalPosLat="0.00" arrivalSpeed="14.99" duration="193.30" routeLength="1997.01" waitingTime="48.10" waitingCount="1" stopTime="0.00" timeLoss="60.54" rerouteNo="1" devices="tripinfo_car_s2n_150 routing_car_s2n_150" vType="Car" speedFactor="1.08" vaporized=""/>
    <tripinfo id="bus_n2s_167" depart="167.00" departLane="n2sep_1" departPos="12.10" departPosLat="0.00" departSpeed="13.90" departDelay="0.00" arrival="349.60" arrivalLane="c2s_1" arrivalPos="990.00" arrivalPosLat="0.00" arrivalSpeed="13.89" duration="182.60" routeLength="1988.51" waitingTime="28.20" waitingCount="1" stopTime="0.00" timeLoss="39.51" rerouteNo="1" devices="tripinfo_bus_n2s_167 routing_bus_n2s_167" vType="Bus" speedFactor="1.00" vaporized=""/>
    <tripinfo id="car_n2w_171" depart="171.00" departLane="n2sep_1" departPos="3.60" departPosLat="0.00" departSpeed="13.90" departDelay="0.00" arrival="350.90" arrivalLane="c2w_1" arrivalPos="990.00" arrivalPosLat="0.00" arrivalSpeed="14.22" duration="179.90" routeLength="1986.69" waitingTime="25.70" waitingCount="1" stopTime="0.00" timeLoss="39.47" rerouteNo="1" devices="tripinfo_car_n2w_171 routing_car_n2w_171" vType="Car" speedFactor="1.02" vaporized=""/>
    <tripinfo id="car_n2s_169" depart="169.00" departLane="n2sep_1" departPos="3.60" departPosLat="0.00" departSpeed="13.90" departDelay="0.00" arrival="351.95" arrivalLane="c2s_1" arrivalPos="990.00" arrivalPosLat="0.00" arrivalSpeed="15.65" duration="182.95" routeLength="1997.01" waitingTime="27.35" waitingCount="1" stopTime="0.00" timeLoss="60.35" rerouteNo="1" devices="tripinfo_car_n2s_169 routing_car_n2s_169" vType="Car" speedFactor="1.17" vaporized=""/>
    <tripinfo id="bus_s2n_150" depart="152.65" departLane="s2sep_1" departPos="12.10" departPosLat="0.00" departSpeed="13.90" departDelay="2.65" arrival="352.85" arrivalLane="c2n_1" arrivalPos="990.00" arrivalPosLat="0.00" arrivalSpeed="13.90" duration="200.20" routeLength="1988.51" waitingTime="44.20" waitingCount="1" stopTime="0.00" timeLoss="57.11" rerouteNo="1" devices="tripinfo_bus_s2n_150 routing_bus_s2n_150" vType="Bus" speedFactor="1.00" vaporized=""/>
    <tripinfo id="car_s2e_164" depart="164.00" departLane="s2sep_1" departPos="3.60" departPosLat="0.00" departSpeed="13.90" departDelay="0.00" arrival="354.75" arrivalLane="c2e_1" arrivalPos="990.00" arrivalPosLat="0.00" arrivalSpeed="13.90" duration="190.75" routeLength="1986.69" waitingTime="35.15" waitingCount="1" stopTime="0.00" timeLoss="47.06" rerouteNo="1" devices="tripinfo_car_s2e_164 routing_car_s2e_164" vType="Car" speedFactor="1.00" vaporized=""/>
    <tripinfo id="car_s2n_173" depart="173.00" departLane="s2sep_1" departPos="3.60" departPosLat="0.00" departSpeed="13.90" departDelay="0.00" arrival="358.05" arrivalLane="c2n_1" arrivalPos="990.00" arrivalPosLat="0.00" arrivalSpeed="13.90" duration="185.05" routeLength="1997.01" waitingTime="27.40" waitingCount="1" stopTime="0.00" timeLoss="41.35" rerouteNo="1" devices="tripinfo_car_s2n_173 routing_car_s2n_173" vType="Car" speedFactor="1.00" vaporized=""/>
    <tripinfo id="bus_s2w_177" depart="177.00" departLane="s2sep_1" departPos="12.10" departPosLat="0.00" departSpeed="13.90" departDelay="0.00" arrival="359.50" arrivalLane="c2w_1" arrivalPos="990.00" arrivalPosLat="0.00" arrivalSpeed="13.90" duration="182.50" routeLength="1987.97" waitingTime="22.25" waitingCount="2" stopTime="0.00" timeLoss="38.80" rerouteNo="1" devices="tripinfo_bus_s2w_177 routing_bus_s2w_177" vType="Bus" speedFactor="1.00" vaporized=""/>
    <tripinfo id="car_s2e_178" depart="178.50" departLane="s2sep_1" departPos="3.60" departPosLat="0.00" departSpeed="13.90" departDelay="0.50" arrival="360.00" arrivalLane="c2e_1" arrivalPos="990.00" arrivalPosLat="0.00" arrivalSpeed="13.90" duration="181.50" routeLength="1986.69" waitingTime="20.10" waitingCount="1" stopTime="0.00" timeLoss="37.82" rerouteNo="1" devices="tripinfo_car_s2e_178 routing_car_s2e_178" vType="Car" speedFactor="1.00" vaporized=""/>
    <tripinfo id="car_n2s_227" depart="227.00" departLane="n2sep_1" departPos="3.60" departPosLat="0.00" departSpeed="13.90" departDelay="0.00" arrival="360.25" arrivalLane="c2s_1" arrivalPos="990.00" arrivalPosLat="0.00" arrivalSpeed="15.59" duration="133.25" routeLength="1997.01" waitingTime="0.00" waitingCount="0" stopTime="0.00" timeLoss="5.12" rerouteNo="1" devices="tripinfo_car_n2s_227 routing_car_n2s_227" vType="Car" speedFactor="1.12" vaporized=""/>
    <tripinfo id="car_s2n_203" depart="203.00" departLane="s2sep_1" departPos="3.60" departPosLat="0.00" departSpeed="13.90" departDelay="0.00" arrival="362.25" arrivalLane="c2n_1" arrivalPos="990.00" arrivalPosLat="0.00" arrivalSpeed="13.89" duration="159.25" routeLength="1997.01" waitingTime="0.00" waitingCount="0" stopTime="0.00" timeLoss="15.57" rerouteNo="1" devices="tripinfo_car_s2n_203 routing_car_s2n_203" vType="Car" speedFactor="1.00" vaporized=""/>
    <tripinfo id="car_s2e_223" depart="223.00" departLane="s2sep_1" departPos="3.60" departPosLat="0.00" departSpeed="13.90" departDelay="0.00" arrival="362.80" arrivalLane="c2e_1" arrivalPos="990.00" arrivalPosLat="0.00" arrivalSpeed="15.03" duration="139.80" routeLength="1986.69" waitingTime="0.00" waitingCount="0" stopTime="0.00" timeLoss="8.12" rerouteNo="1" devices="tripinfo_car_s2e_223 routing_car_s2e_223" vType="Car" speedFactor="1.09" vaporized=""/>
    <tripinfo id="car_s2w_193" depart="193.00" departLane="s2sep_1" departPos="3.60" departPosLat="0.00" departSpeed="13.90" departDelay="0.00" arrival="363.20" arrivalLane="c2w_1" arrivalPos="990.00" arrivalPosLat="0.00" arrivalSpeed="14.34" duration="170.20" routeLength="1996.47" waitingTime="9.65" waitingCount="2" stopTime="0.00" timeLoss="30.70" rerouteNo="1" devices="tripinfo_car_s2w_193 routing_car_s2w_193" vType="Car" speedFactor="1.03" vaporized=""/>
    <tripinfo id="car_s2n_214" depart="214.00" departLane="s2sep_1" departPos="3.60" departPosLat="0.00" departSpeed="13.90" departDelay="0.00" arrival="365.10" arrivalLane="c2n_1" arrivalPos="990.00" arrivalPosLat="0.00" arrivalSpeed="14.23" duration="151.10" routeLength="1997.01" waitingTime="0.00" waitingCount="0" stopTime="0.00" timeLoss="11.67" rerouteNo="1" devices="tripinfo_car_s2n_214 routing_car_s2n_214" vType="Car" speedFactor="1.03" vaporized=""/>
    <tripinfo id="car_n2w_220" depart="220.00" departLane="n2sep_1" departPos="3.60" departPosLat="0.00" departSpeed="13.90" departDelay="0.00" arrival="367.00" arrivalLane="c2w_1" arrivalPos="990.00" arrivalPosLat="0.00" arrivalSpeed="14.11" duration="147.00" routeLength="1986.69" waitingTime="0.00" waitingCount="0" stopTime="0.00" timeLoss="5.68" rerouteNo="1" devices="tripinfo_car_n2w_220 routing_car_n2w_220" vType="Car" speedFactor="1.02" vaporized=""/>
    <tripinfo id="car_n2e_162" depart="162.00" departLane="n2sep_1" departPos="3.60" departPosLat="0.00" departSpeed="13.90" departDelay="0.00" arrival="367.05" arrivalLane="c2e_1" arrivalPos="990.00" arrivalPosLat="0.00" arrivalSpeed="15.54" duration="205.05" routeLength="1996.47" waitingTime="63.90" waitingCount="2" stopTime="0.00" timeLoss="76.12" rerouteNo="1" devices="tripinfo_car_n2e_162 routing_car_n2e_162" vType="Car" speedFactor="1.12" vaporized=""/>
    <tripinfo id="car_s2n_216" depart="216.00" departLane="s2sep_1" departPos="3.60" departPosLat="0.00" departSpeed="13.90" departDelay="0.00" arrival="367.75" arrivalLane="c2n_1" arrivalPos="990.00" arrivalPosLat="0.00" arrivalSpeed="14.36" duration="151.75" routeLength="1997.01" waitingTime="0.00" waitingCount="0" stopTime="0.00" timeLoss="13.95" rerouteNo="1" devices="tripinfo_car_s2n_216 routing_car_s2n_216" vType="Car" speedFactor="1.04" vaporized=""/>
    <tripinfo id="car_s2n_226" depart="226.00" departLane="s2sep_1" departPos="3.60" departPosLat="0.00" departSpeed="13.90" departDelay="0.00" arrival="371.40" arrivalLane="c2n_1" arrivalPos="990.00" arrivalPosLat="0.00" arrivalSpeed="14.01" duration="145.40" routeLength="1997.01" waitingTime="0.00" waitingCount="0" stopTime="0.00" timeLoss="3.09" rerouteNo="1" devices="tripinfo_car_s2n_226 routing_car_s2n_226" vType="Car" speedFactor="1.01" vaporized=""/>
    <tripinfo id="car_s2w_238" depart="238.00" departLane="s2sep_1" departPos="3.60" departPosLat="0.00" departSpeed="13.90" departDelay="0.00" arrival="377.45" arrivalLane="c2w_1" arrivalPos="990.00" arrivalPosLat="0.00" arrivalSpeed="14.80" duration="139.45" routeLength="1996.47" waitingTime="0.00" waitingCount="0" stopTime="0.00" timeLoss="3.93" rerouteNo="1" devices="tripinfo_car_s2w_238 routing_car_s2w_238" vType="Car" speedFactor="1.07" vaporized=""/>
    <tripinfo id="car_w2e_247" depart="247.00" departLane="w2sep_1" departPos="3.60" departPosLat="0.00" departSpeed="13.90" departDelay="0.00" arrival="387.25" arrivalLane="c2e_1" arrivalPos="990.00" arrivalPosLat="0.00" arrivalSpeed="14.91" duration="140.25" routeLength="1997.01" waitingTime="0.00" waitingCount="0" stopTime="0.00" timeLoss="6.31" rerouteNo="1" devices="tripinfo_car_w2e_247 routing_car_w2e_247" vType="Car" speedFactor="1.07" vaporized=""/>
    <tripinfo id="car_e2n_192" depart="192.00" departLane="e2sep_1" departPos="3.60" departPosLat="0.00" departSpeed="13.90" departDelay="0.00" arrival="390.15" arrivalLane="c2n_1" arrivalPos="990.00" arrivalPosLat="0.00" arrivalSpeed="14.00" duration="198.15" routeLength="1986.69" waitingTime="48.60" waitingCount="1" stopTime="0.00" timeLoss="55.53" rerouteNo="1" devices="tripinfo_car_e2n_192 routing_car_e2n_192" vType="Car" speedFactor="1.01" vaporized=""/>
    <tripinfo id="car_w2s_218" depart="218.00" departLane="w2sep_1" departPos="3.60" departPosLat="0.00" departSpeed="13.90" departDelay="0.00" arrival="390.15" arrivalLane="c2s_1" arrivalPos="990.00" arrivalPosLat="0.00" arrivalSpeed="14.00" duration="172.15" routeLength="1986.69" waitingTime="21.95" waitingCount="1" stopTime="0.00" timeLoss="29.47" rerouteNo="1" devices="tripinfo_car_w2s_218 routing_car_w2s_218" vType="Car" speedFactor="1.01" vaporized=""/>
    <tripinfo id="car_e2w_216" depart="216.00" departLane="e2sep_1" departPos="3.60" departPosLat="0.00" departSpeed="13.90" departDelay="0.00" arrival="392.90" arrivalLane="c2w_1" arrivalPos="990.00" arrivalPosLat="0.00" arrivalSpeed="13.90" duration="176.90" routeLength="1997.01" waitingTime="24.15" waitingCount="1" stopTime="0.00" timeLoss="33.19" rerouteNo="1" devices="tripinfo_car_e2w_216 routing_car_e2w_216" vType="Car" speedFactor="1.00" vaporized=""/>
    <tripinfo id="car_e2s_212" depart="212.00" departLane="e2sep_1" departPos="3.60" departPosLat="0.00" departSpeed="13.90" departDelay="0.00" arrival="395.15" arrivalLane="c2s_1" arrivalPos="990.00" arrivalPosLat="0.00" arrivalSpeed="14.13" duration="183.15" routeLength="1996.47" waitingTime="29.20" waitingCount="2" stopTime="0.00" timeLoss="41.22" rerouteNo="1" devices="tripinfo_car_e2s_212 routing_car_e2s_212" vType="Car" speedFactor="1.02" vaporized=""/>
    <tripinfo id="car_e2n_216" depart="217.50" departLane="e2sep_1" departPos="3.60" departPosLat="0.00" departSpeed="13.90" departDelay="1.50" arrival="396.05" arrivalLane="c2n_1" arrivalPos="990.00" arrivalPosLat="0.00" arrivalSpeed="13.92" duration="178.55" routeLength="1986.69" waitingTime="21.80" waitingCount="1" stopTime="0.00" timeLoss="35.15" rerouteNo="1" devices="tripinfo_car_e2n_216 routing_car_e2n_216" vType="Car" speedFactor="1.00" vaporized=""/>
    <tripinfo id="car_e2w_223" depart="224.85" departLane="e2sep_1" departPos="3.60" departPosLat="0.00" departSpeed="13.90" departDelay="1.85" arrival="397.50" arrivalLane="c2w_1" arrivalPos="990.00" arrivalPosLat="0.00" arrivalSpeed="14.49" duration="172.65" routeLength="1997.01" waitingTime="14.55" waitingCount="1" stopTime="0.00" timeLoss="34.94" rerouteNo="1" devices="tripinfo_car_e2w_223 routing_car_e2w_223" vType="Car" speedFactor="1.04" vaporized=""/>
    <tripinfo id="car_e2n_220" depart="221.20" departLane="e2sep_1" departPos="3.60" departPosLat="0.00" departSpeed="13.90" departDelay="1.20" arrival="398.30" arrivalLane="c2n_1" arrivalPos="990.00" arrivalPosLat="0.00" arrivalSpeed="14.86" duration="177.10" routeLength="1986.69" waitingTime="18.35" waitingCount="1" stopTime="0.00" timeLoss="45.55" rerouteNo="1" devices="tripinfo_car_e2n_220 routing_car_e2n_220" vType="Car" speedFactor="1.09" vaporized=""/>
    <tripinfo id="car_e2s_218" depart="219.35" departLane="e2sep_1" departPos="3.60" departPosLat="0.00" departSpeed="13.90" departDelay="1.35" arrival="398.80" arrivalLane="c2s_1" arrivalPos="990.00" arrivalPosLat="0.00" arrivalSpeed="14.18" duration="179.45" routeLength="1996.47" waitingTime="17.65" waitingCount="1" stopTime="0.00" timeLoss="38.26" rerouteNo="1" devices="tripinfo_car_e2s_218 routing_car_e2s_218" vType="Car" speedFactor="1.02" vaporized=""/>
    <tripinfo id="car_e2s_220" depart="223.00" departLane="e2sep_1" departPos="3.60" departPosLat="0.00" departSpeed="13.90" departDelay="3.00" arrival="401.75" arrivalLane="c2s_1" arrivalPos="990.00" arrivalPosLat="0.00" arrivalSpeed="14.34" duration="178.75" routeLength="1996.47" waitingTime="14.40" waitingCount="1" stopTime="0.00" timeLoss="39.68" rerouteNo="1" devices="tripinfo_car_e2s_220 routing_car_e2s_220" vType="Car" speedFactor="1.04" vaporized=""/>
    <tripinfo id="car_w2e_262" depart="262.00" departLane="w2sep_1" departPos="3.60" departPosLat="0.00" departSpeed="13.90" departDelay="0.00" arrival="403.80" arrivalLane="c2e_1" arrivalPos="990.00" arrivalPosLat="0.00" arrivalSpeed="15.23" duration="141.80" routeLength="1997.01" waitingTime="0.00" waitingCount="0" stopTime="0.00" timeLoss="10.65" rerouteNo="1" devices="tripinfo_car_w2e_262 routing_car_w2e_262" vType="Car" speedFactor="1.10" vaporized=""/>
    <tripinfo id="bus_e2n_224" depart="227.65" departLane="e2sep_1" departPos="12.10" departPosLat="0.00" departSpeed="13.90" departDelay="3.65" arrival="405.15" arrivalLane="c2n_1" arrivalPos="990.00" arrivalPosLat="0.00" arrivalSpeed="13.89" duration="177.50" routeLength="1978.19" waitingTime="14.25" waitingCount="1" stopTime="0.00" timeLoss="34.45" rerouteNo="1" devices="tripinfo_bus_e2n_224 routing_bus_e2n_224" vType="Bus" speedFactor="1.00" vaporized=""/>
    <tripinfo id="amb_w2e_300" depart="300.00" departLane="w2sep_1" departPos="6.60" departPosLat="0.00" departSpeed="13.90" departDelay="0.00" arrival="407.55" arrivalLane="c2e_1" arrivalPos="990.00" arrivalPosLat="0.85" arrivalSpeed="20.68" duration="107.55" routeLength="1994.01" waitingTime="0.00" waitingCount="0" stopTime="0.00" timeLoss="11.91" rerouteNo="1" devices="tripinfo_amb_w2e_300 routing_amb_w2e_300 bluelight_amb_w2e_300 fcd_amb_w2e_300" vType="Ambulance" speedFactor="1.50" vaporized="">
        <example_device customValue1="0.00" customValue2="-1.00"/>
    </tripinfo>
    <tripinfo id="car_e2w_258" depart="258.00" departLane="e2sep_1" departPos="3.60" departPosLat="0.00" departSpeed="13.90" departDelay="0.00" arrival="408.10" arrivalLane="c2w_1" arrivalPos="990.00" arrivalPosLat="0.00" arrivalSpeed="14.03" duration="150.10" routeLength="1997.01" waitingTime="0.00" waitingCount="0" stopTime="0.00" timeLoss="7.71" rerouteNo="1" devices="tripinfo_car_e2w_258 routing_car_e2w_258" vType="Car" speedFactor="1.01" vaporized=""/>
    <tripinfo id="bus_w2s_259" depart="259.00" departLane="w2sep_1" departPos="12.10" departPosLat="0.00" departSpeed="13.90" departDelay="0.00" arrival="408.95" arrivalLane="c2s_1" arrivalPos="990.00" arrivalPosLat="0.00" arrivalSpeed="13.89" duration="149.95" routeLength="1978.19" waitingTime="0.00" waitingCount="0" stopTime="0.00" timeLoss="6.90" rerouteNo="1" devices="tripinfo_bus_w2s_259 routing_bus_w2s_259" vType="Bus" speedFactor="1.00" vaporized=""/>
    <tripinfo id="car_e2n_241" depart="241.00" departLane="e2sep_1" departPos="3.60" departPosLat="0.00" departSpeed="13.90" departDelay="0.00" arrival="409.80" arrivalLane="c2n_1" arrivalPos="990.00" arrivalPosLat="0.00" arrivalSpeed="13.89" duration="168.80" routeLength="1986.69" waitingTime="7.10" waitingCount="1" stopTime="0.00" timeLoss="25.13" rerouteNo="1" devices="tripinfo_car_e2n_241 routing_car_e2n_241" vType="Car" speedFactor="1.00" vaporized=""/>
    <tripinfo id="car_e2s_251" depart="251.00" departLane="e2sep_1" departPos="3.60" departPosLat="0.00" departSpeed="13.90" departDelay="0.00" arrival="412.85" arrivalLane="c2s_1" arrivalPos="990.00" arrivalPosLat="0.00" arrivalSpeed="14.35" duration="161.85" routeLength="1996.47" waitingTime="7.70" waitingCount="1" stopTime="0.00" timeLoss="22.35" rerouteNo="1" devices="tripinfo_car_e2s_251 routing_car_e2s_251" vType="Car" speedFactor="1.03" vaporized=""/>
    <tripinfo id="car_e2w_266" depart="266.55" departLane="e2sep_1" departPos="3.60" departPosLat="0.00" departSpeed="13.90" departDelay="0.55" arrival="414.10" arrivalLane="c2w_1" arrivalPos="990.00" arrivalPosLat="0.00" arrivalSpeed="13.94" duration="147.55" routeLength="1997.01" waitingTime="0.00" waitingCount="0" stopTime="0.00" timeLoss="4.30" rerouteNo="1" devices="tripinfo_car_e2w_266 routing_car_e2w_266" vType="Car" speedFactor="1.00" vaporized=""/>
    <tripinfo id="car_e2s_254" depart="254.00" departLane="e2sep_1" departPos="3.60" departPosLat="0.00" departSpeed="13.90" departDelay="0.00" arrival="414.75" arrivalLane="c2s_1" arrivalPos="990.00" arrivalPosLat="0.00" arrivalSpeed="15.51" duration="160.75" routeLength="1996.47" waitingTime="6.85" waitingCount="1" stopTime="0.00" timeLoss="37.29" rerouteNo="1" devices="tripinfo_car_e2s_254 routing_car_e2s_254" vType="Car" speedFactor="1.17" vaporized=""/>
    <tripinfo id="car_e2n_268" depart="268.40" departLane="e2sep_1" departPos="3.60" departPosLat="0.00" departSpeed="13.90" departDelay="0.40" arrival="414.85" arrivalLane="c2n_1" arrivalPos="990.00" arrivalPosLat="0.00" arrivalSpeed="14.88" duration="146.45" routeLength="1986.69" waitingTime="0.00" waitingCount="0" stopTime="0.00" timeLoss="12.27" rerouteNo="1" devices="tripinfo_car_e2n_268 routing_car_e2n_268" vType="Car" speedFactor="1.07" vaporized=""/>
    <tripinfo id="car_e2s_263" depart="263.00" departLane="e2sep_1" departPos="3.60" departPosLat="0.00" departSpeed="13.90" departDelay="0.00" arrival="416.70" arrivalLane="c2s_1" arrivalPos="990.00" arrivalPosLat="0.00" arrivalSpeed="15.69" duration="153.70" routeLength="1996.47" waitingTime="2.95" waitingCount="1" stopTime="0.00" timeLoss="31.07" rerouteNo="1" devices="tripinfo_car_e2s_263 routing_car_e2s_263" vType="Car" speedFactor="1.18" vaporized=""/>
    <tripinfo id="car_w2n_216" depart="216.00" departLane="w2sep_1" departPos="3.60" departPosLat="0.00" departSpeed="13.90" departDelay="0.00" arrival="417.20" arrivalLane="c2n_1" arrivalPos="990.00" arrivalPosLat="0.00" arrivalSpeed="15.68" duration="201.20" routeLength="1996.47" waitingTime="58.15" waitingCount="4" stopTime="0.00" timeLoss="75.46" rerouteNo="1" devices="tripinfo_car_w2n_216 routing_car_w2n_216" vType="Car" speedFactor="1.15" vaporized=""/>
    <tripinfo id="car_e2s_265" depart="265.00" departLane="e2sep_1" departPos="3.60" departPosLat="0.00" departSpeed="13.90" departDelay="0.00" arrival="421.35" arrivalLane="c2s_1" arrivalPos="990.00" arrivalPosLat="0.00" arrivalSpeed="13.95" duration="156.35" routeLength="1996.47" waitingTime="1.05" waitingCount="1" stopTime="0.00" timeLoss="12.64" rerouteNo="1" devices="tripinfo_car_e2s_265 routing_car_e2s_265" vType="Car" speedFactor="1.00" vaporized=""/>
    <tripinfo id="car_w2n_226" depart="226.00" departLane="w2sep_1" departPos="3.60" departPosLat="0.00" departSpeed="13.90" departDelay="0.00" arrival="421.70" arrivalLane="c2n_1" arrivalPos="990.00" arrivalPosLat="0.00" arrivalSpeed="14.68" duration="195.70" routeLength="1996.47" waitingTime="42.60" waitingCount="2" stopTime="0.00" timeLoss="59.14" rerouteNo="1" devices="tripinfo_car_w2n_226 routing_car_w2n_226" vType="Car" speedFactor="1.06" vaporized=""/>
    <tripinfo id="car_w2n_227" depart="227.35" departLane="w2sep_1" departPos="3.60" departPosLat="0.00" departSpeed="13.90" departDelay="0.35" arrival="424.55" arrivalLane="c2n_1" arrivalPos="990.00" arrivalPosLat="0.00" arrivalSpeed="15.02" duration="197.20" routeLength="1996.47" waitingTime="39.15" waitingCount="2" stopTime="0.00" timeLoss="64.57" rerouteNo="1" devices="tripinfo_car_w2n_227 routing_car_w2n_227" vType="Car" speedFactor="1.09" vaporized=""/>
    <tripinfo id="car_w2n_230" depart="230.00" departLane="w2sep_1" departPos="3.60" departPosLat="0.00" departSpeed="13.90" departDelay="0.00" arrival="427.20" arrivalLane="c2n_1" arrivalPos="990.00" arrivalPosLat="0.00" arrivalSpeed="15.10" duration="197.20" routeLength="1996.47" waitingTime="36.95" waitingCount="2" stopTime="0.00" timeLoss="65.65" rerouteNo="1" devices="tripinfo_car_w2n_230 routing_car_w2n_230" vType="Car" speedFactor="1.10" vaporized=""/>
    <tripinfo id="car_w2s_280" depart="280.00" departLane="w2sep_1" departPos="3.60" departPosLat="0.00" departSpeed="13.90" departDelay="0.00" arrival="428.40" arrivalLane="c2s_1" arrivalPos="990.00" arrivalPosLat="0.00" arrivalSpeed="13.90" duration="148.40" routeLength="1986.69" waitingTime="0.00" waitingCount="0" stopTime="0.00" timeLoss="4.70" rerouteNo="1" devices="tripinfo_car_w2s_280 routing_car_w2s_280" vType="Car" speedFactor="1.00" vaporized=""/>
    <tripinfo id="car_w2n_244" depart="244.00" departLane="w2sep_1" departPos="3.60" departPosLat="0.00" departSpeed="13.90" departDelay="0.00" arrival="432.50" arrivalLane="c2n_1" arrivalPos="990.00" arrivalPosLat="0.00" arrivalSpeed="13.90" duration="188.50" routeLength="1996.47" waitingTime="21.45" waitingCount="1" stopTime="0.00" timeLoss="44.16" rerouteNo="1" devices="tripinfo_car_w2n_244 routing_car_w2n_244" vType="Car" speedFactor="1.00" vaporized=""/>
    <tripinfo id="car_e2n_276" depart="276.00" departLane="e2sep_1" departPos="3.60" departPosLat="0.00" departSpeed="13.90" departDelay="0.00" arrival="435.05" arrivalLane="c2n_1" arrivalPos="990.00" arrivalPosLat="0.00" arrivalSpeed="14.57" duration="159.05" routeLength="1986.69" waitingTime="6.95" waitingCount="1" stopTime="0.00" timeLoss="23.61" rerouteNo="1" devices="tripinfo_car_e2n_276 routing_car_e2n_276" vType="Car" speedFactor="1.06" vaporized=""/>
    <tripinfo id="car_e2s_269" depart="270.20" departLane="e2sep_1" departPos="3.60" departPosLat="0.00" departSpeed="13.90" departDelay="1.20" arrival="436.05" arrivalLane="c2s_1" arrivalPos="990.00" arrivalPosLat="0.00" arrivalSpeed="13.90" duration="165.85" routeLength="1996.47" waitingTime="8.80" waitingCount="1" stopTime="0.00" timeLoss="21.53" rerouteNo="1" devices="tripinfo_car_e2s_269 routing_car_e2s_269" vType="Car" speedFactor="1.00" vaporized=""/>
    <tripinfo id="car_e2n_292" depart="292.00" departLane="e2sep_1" departPos="3.60" departPosLat="0.00" departSpeed="13.90" departDelay="0.00" arrival="438.05" arrivalLane="c2n_1" arrivalPos="990.00" arrivalPosLat="0.00" arrivalSpeed="14.35" duration="146.05" routeLength="1986.69" waitingTime="0.00" waitingCount="0" stopTime="0.00" timeLoss="7.56" rerouteNo="1" devices="tripinfo_car_e2n_292 routing_car_e2n_292" vType="Car" speedFactor="1.04" vaporized=""/>
    <tripinfo id="car_e2s_279" depart="279.00" departLane="e2sep_1" departPos="3.60" departPosLat="0.00" departSpeed="13.90" departDelay="0.00" arrival="439.30" arrivalLane="c2s_1" arrivalPos="990.00" arrivalPosLat="0.00" arrivalSpeed="14.29" duration="160.30" routeLength="1996.47" waitingTime="5.15" waitingCount="1" stopTime="0.00" timeLoss="20.45" rerouteNo="1" devices="tripinfo_car_e2s_279 routing_car_e2s_279" vType="Car" speedFactor="1.03" vaporized=""/>
    <tripinfo id="car_w2n_254" depart="254.00" departLane="w2sep_1" departPos="3.60" departPosLat="0.00" departSpeed="13.90" departDelay="0.00" arrival="442.15" arrivalLane="c2n_1" arrivalPos="990.00" arrivalPosLat="0.00" arrivalSpeed="13.89" duration="188.15" routeLength="1996.47" waitingTime="24.15" waitingCount="3" stopTime="0.00" timeLoss="43.79" rerouteNo="1" devices="tripinfo_car_w2n_254 routing_car_w2n_254" vType="Car" speedFactor="1.00" vaporized=""/>
    <tripinfo id="car_w2n_276" depart="276.00" departLane="w2sep_1" departPos="3.60" departPosLat="0.00" departSpeed="13.90" departDelay="0.00" arrival="445.05" arrivalLane="c2n_1" arrivalPos="990.00" arrivalPosLat="0.00" arrivalSpeed="14.14" duration="169.05" routeLength="1996.47" waitingTime="5.80" waitingCount="2" stopTime="0.00" timeLoss="28.03" rerouteNo="1" devices="tripinfo_car_w2n_276 routing_car_w2n_276" vType="Car" speedFactor="1.02" vaporized=""/>
    <tripinfo id="car_n2s_259" depart="259.00" departLane="n2sep_1" departPos="3.60" departPosLat="0.00" departSpeed="13.90" departDelay="0.00" arrival="447.80" arrivalLane="c2s_1" arrivalPos="990.00" arrivalPosLat="0.00" arrivalSpeed="15.24" duration="188.80" routeLength="1997.01" waitingTime="45.15" waitingCount="1" stopTime="0.00" timeLoss="57.74" rerouteNo="1" devices="tripinfo_car_n2s_259 routing_car_n2s_259" vType="Car" speedFactor="1.10" vaporized=""/>
    <tripinfo id="car_s2n_251" depart="251.00" departLane="s2sep_1" departPos="3.60" departPosLat="0.00" departSpeed="13.90" departDelay="0.00" arrival="450.05" arrivalLane="c2n_1" arrivalPos="990.00" arrivalPosLat="0.00" arrivalSpeed="14.79" duration="199.05" routeLength="1997.01" waitingTime="53.80" waitingCount="1" stopTime="0.00" timeLoss="64.13" rerouteNo="1" devices="tripinfo_car_s2n_251 routing_car_s2n_251" vType="Car" speedFactor="1.06" vaporized=""/>
    <tripinfo id="car_n2w_255" depart="255.00" departLane="n2sep_1" departPos="3.60" departPosLat="0.00" departSpeed="13.90" departDelay="0.00" arrival="450.35" arrivalLane="c2w_1" arrivalPos="990.00" arrivalPosLat="0.00" arrivalSpeed="14.13" duration="195.35" routeLength="1986.69" waitingTime="46.30" waitingCount="1" stopTime="0.00" timeLoss="54.08" rerouteNo="1" devices="tripinfo_car_n2w_255 routing_car_n2w_255" vType="Car" speedFactor="1.02" vaporized=""/>
    <tripinfo id="car_s2e_245" depart="245.00" departLane="s2sep_1" departPos="3.60" departPosLat="0.00" departSpeed="13.90" departDelay="0.00" arrival="451.50" arrivalLane="c2e_1" arrivalPos="990.00" arrivalPosLat="0.00" arrivalSpeed="13.90" duration="206.50" routeLength="1986.69" waitingTime="55.80" waitingCount="1" stopTime="0.00" timeLoss="62.85" rerouteNo="1" devices="tripinfo_car_s2e_245 routing_car_s2e_245" vType="Car" speedFactor="1.00" vaporized=""/>
    <tripinfo id="car_s2n_256" depart="256.00" departLane="s2sep_1" departPos="3.60" departPosLat="0.00" departSpeed="13.90" departDelay="0.00" arrival="453.05" arrivalLane="c2n_1" arrivalPos="990.00" arrivalPosLat="0.00" arrivalSpeed="15.18" duration="197.05" routeLength="1997.01" waitingTime="51.80" waitingCount="1" stopTime="0.00" timeLoss="66.26" rerouteNo="1" devices="tripinfo_car_s2n_256 routing_car_s2n_256" vType="Car" speedFactor="1.10" vaporized=""/>
    <tripinfo id="car_n2w_272" depart="272.00" departLane="n2sep_1" departPos="3.60" departPosLat="0.00" departSpeed="13.90" departDelay="0.00" arrival="455.20" arrivalLane="c2w_1" arrivalPos="990.00" arrivalPosLat="0.00" arrivalSpeed="14.33" duration="183.20" routeLength="1986.69" waitingTime="32.90" waitingCount="1" stopTime="0.00" timeLoss="43.91" rerouteNo="1" devices="tripinfo_car_n2w_272 routing_car_n2w_272" vType="Car" speedFactor="1.03" vaporized=""/>
    <tripinfo id="car_s2n_269" depart="269.00" departLane="s2sep_1" departPos="3.60" departPosLat="0.00" departSpeed="13.90" departDelay="0.00" arrival="455.90" arrivalLane="c2n_1" arrivalPos="990.00" arrivalPosLat="0.00" arrivalSpeed="15.22" duration="186.90" routeLength="1997.01" waitingTime="41.30" waitingCount="1" stopTime="0.00" timeLoss="56.63" rerouteNo="1" devices="tripinfo_car_s2n_269 routing_car_s2n_269" vType="Car" speedFactor="1.10" vaporized=""/>
    <tripinfo id="car_n2s_307" depart="307.00" departLane="n2sep_1" departPos="3.60" departPosLat="0.00" departSpeed="13.90" departDelay="0.00" arrival="455.90" arrivalLane="c2s_1" arrivalPos="990.00" arrivalPosLat="0.00" arrivalSpeed="15.48" duration="148.90" routeLength="1997.01" waitingTime="4.80" waitingCount="1" stopTime="0.00" timeLoss="19.90" rerouteNo="1" devices="tripinfo_car_n2s_307 routing_car_n2s_307" vType="Car" speedFactor="1.11" vaporized=""/>
    <tripinfo id="car_n2w_291" depart="291.00" departLane="n2sep_1" departPos="3.60" departPosLat="0.00" departSpeed="13.90" departDelay="0.00" arrival="457.30" arrivalLane="c2w_1" arrivalPos="990.00" arrivalPosLat="0.00" arrivalSpeed="15.41" duration="166.30" routeLength="1986.69" waitingTime="21.30" waitingCount="1" stopTime="0.00" timeLoss="40.53" rerouteNo="1" devices="tripinfo_car_n2w_291 routing_car_n2w_291" vType="Car" speedFactor="1.14" vaporized=""/>
    <tripinfo id="car_s2n_280" depart="280.00" departLane="s2sep_1" departPos="3.60" departPosLat="0.00" departSpeed="13.90" departDelay="0.00" arrival="458.40" arrivalLane="c2n_1" arrivalPos="990.00" arrivalPosLat="0.00" arrivalSpeed="15.36" duration="178.40" routeLength="1997.01" waitingTime="31.55" waitingCount="1" stopTime="0.00" timeLoss="49.93" rerouteNo="1" devices="tripinfo_car_s2n_280 routing_car_s2n_280" vType="Car" speedFactor="1.12" vaporized=""/>
    <tripinfo id="car_s2e_290" depart="291.25" departLane="s2sep_1" departPos="3.60" departPosLat="0.00" departSpeed="13.90" departDelay="1.25" arrival="460.05" arrivalLane="c2e_1" arrivalPos="990.00" arrivalPosLat="0.00" arrivalSpeed="14.85" duration="168.80" routeLength="1986.69" waitingTime="15.05" waitingCount="1" stopTime="0.00" timeLoss="34.28" rerouteNo="1" devices="tripinfo_car_s2e_290 routing_car_s2e_290" vType="Car" speedFactor="1.07" vaporized=""/>
    <tripinfo id="car_n2s_332" depart="332.00" departLane="n2sep_1" departPos="3.60" departPosLat="0.00" departSpeed="13.90" departDelay="0.00" arrival="461.85" arrivalLane="c2s_1" arrivalPos="990.00" arrivalPosLat="0.00" arrivalSpeed="15.56" duration="129.85" routeLength="1997.01" waitingTime="0.00" waitingCount="0" stopTime="0.00" timeLoss="1.47" rerouteNo="1" devices="tripinfo_car_n2s_332 routing_car_n2s_332" vType="Car" speedFactor="1.12" vaporized=""/>
    <tripinfo id="car_n2w_298" depart="298.40" departLane="n2sep_1" departPos="3.60" departPosLat="0.00" departSpeed="13.90" departDelay="0.40" arrival="461.90" arrivalLane="c2w_1" arrivalPos="990.00" arrivalPosLat="0.00" arrivalSpeed="14.10" duration="163.50" routeLength="1986.69" waitingTime="5.65" waitingCount="1" stopTime="0.00" timeLoss="21.97" rerouteNo="1" devices="tripinfo_car_n2w_298 routing_car_n2w_298" vType="Car" speedFactor="1.02" vaporized=""/>
    <tripinfo id="car_s2n_288" depart="288.00" departLane="s2sep_1" departPos="3.60" departPosLat="0.00" departSpeed="13.90" departDelay="0.00" arrival="463.45" arrivalLane="c2n_1" arrivalPos="990.00" arrivalPosLat="0.00" arrivalSpeed="14.01" duration="175.45" routeLength="1997.01" waitingTime="19.20" waitingCount="1" stopTime="0.00" timeLoss="32.95" rerouteNo="1" devices="tripinfo_car_s2n_288 routing_car_s2n_288" vType="Car" speedFactor="1.01" vaporized=""/>
    <tripinfo id="car_n2w_317" depart="317.00" departLane="n2sep_1" departPos="3.60" departPosLat="0.00" departSpeed="13.90" departDelay="0.00" arrival="464.35" arrivalLane="c2w_1" arrivalPos="990.00" arrivalPosLat="0.00" arrivalSpeed="14.83" duration="147.35" routeLength="1986.69" waitingTime="0.00" waitingCount="0" stopTime="0.00" timeLoss="14.61" rerouteNo="1" devices="tripinfo_car_n2w_317 routing_car_n2w_317" vType="Car" speedFactor="1.08" vaporized=""/>
    <tripinfo id="car_s2w_277" depart="277.00" departLane="s2sep_1" departPos="3.60" departPosLat="0.00" departSpeed="13.90" departDelay="0.00" arrival="466.40" arrivalLane="c2w_1" arrivalPos="990.00" arrivalPosLat="0.00" arrivalSpeed="15.53" duration="189.40" routeLength="1996.47" waitingTime="48.60" waitingCount="2" stopTime="0.00" timeLoss="64.21" rerouteNo="1" devices="tripinfo_car_s2w_277 routing_car_s2w_277" vType="Car" speedFactor="1.15" vaporized=""/>
</tripinfos>
