<?xml version="1.0" encoding="UTF-8"?>

<!-- generated on Thu 22 Apr 2021 02:51:36 PM CEST by Eclipse SUMO GUI Version 1.4.0
<configuration xmlns:xsi="http://www.w3.org/2001/XMLSchema-instance" xsi:noNamespaceSchemaLocation="http://sumo.dlr.de/xsd/sumoConfiguration.xsd">

    <input>
        <net-file value="sumofiles/junction.net.xml"/>
        <route-files value="sumofiles/junction.rou.xml"/>
        <additional-files value="sumofiles/junction.det.xml"/>
    </input>

    <output>
        <tripinfo-output value="sumofiles/output/tripinfo.xml"/>
    </output>

    <time>
        <begin value="0"/>
        <end value="10000"/>
        <step-length value="0.05"/>
    </time>

    <processing>
        <lateral-resolution value="0.1"/>
    </processing>

    <traci_server>
        <remote-port value="56671"/>
    </traci_server>

    <gui_only>
        <gui-settings-file value="sumofiles/junction-gui.settings.xml"/>
        <start value="true"/>
        <tracker-interval value="0.05"/>
    </gui_only>

</configuration>
-->

<tripinfos xmlns:xsi="http://www.w3.org/2001/XMLSchema-instance" xsi:noNamespaceSchemaLocation="http://sumo.dlr.de/xsd/tripinfo_file.xsd">
    <tripinfo id="car_w2n.0" depart="14.00" departLane="w2sep_1" departPos="3.60" departPosLat="0.00" departSpeed="13.90" departDelay="0.00" arrival="158.60" arrivalLane="c2n_1" arrivalPos="990.00" arrivalPosLat="0.00" arrivalSpeed="14.54" duration="144.60" routeLength="1996.47" waitingTime="0.00" waitingCount="0" stopTime="0.00" timeLoss="6.58" rerouteNo="1" devices="tripinfo_car_w2n.0 routing_car_w2n.0" vType="Car" speedFactor="1.05" vaporized=""/>
    <tripinfo id="car_n2w.0" depart="0.20" departLane="n2sep_1" departPos="3.60" departPosLat="0.00" departSpeed="13.90" departDelay="0.00" arrival="161.70" arrivalLane="c2w_1" arrivalPos="990.00" arrivalPosLat="0.00" arrivalSpeed="14.73" duration="161.50" routeLength="1986.69" waitingTime="18.55" waitingCount="1" stopTime="0.00" timeLoss="25.94" rerouteNo="1" devices="tripinfo_car_n2w.0 routing_car_n2w.0" vType="Car" speedFactor="1.06" vaporized=""/>
    <tripinfo id="car_s2n.0" depart="5.85" departLane="s2sep_1" departPos="3.60" departPosLat="0.00" departSpeed="13.90" departDelay="0.00" arrival="163.10" arrivalLane="c2n_1" arrivalPos="990.00" arrivalPosLat="0.00" arrivalSpeed="14.72" duration="157.25" routeLength="1997.01" waitingTime="12.90" waitingCount="1" stopTime="0.00" timeLoss="21.68" rerouteNo="1" devices="tripinfo_car_s2n.0 routing_car_s2n.0" vType="Car" speedFactor="1.06" vaporized=""/>
    <tripinfo id="car_s2n.1" depart="13.65" departLane="s2sep_1" departPos="3.60" departPosLat="0.00" departSpeed="13.90" departDelay="0.00" arrival="169.25" arrivalLane="c2n_1" arrivalPos="990.00" arrivalPosLat="0.00" arrivalSpeed="13.90" duration="155.60" routeLength="1997.01" waitingTime="2.10" waitingCount="1" stopTime="0.00" timeLoss="11.91" rerouteNo="1" devices="tripinfo_car_s2n.1 routing_car_s2n.1" vType="Car" speedFactor="1.00" vaporized=""/>
    <tripinfo id="car_s2e.0" depart="15.35" departLane="s2sep_1" departPos="3.60" departPosLat="0.00" departSpeed="13.90" departDelay="0.00" arrival="169.45" arrivalLane="c2e_1" arrivalPos="990.00" arrivalPosLat="0.00" arrivalSpeed="14.04" duration="154.10" routeLength="1986.69" waitingTime="0.00" waitingCount="0" stopTime="0.00" timeLoss="11.90" rerouteNo="1" devices="tripinfo_car_s2e.0 routing_car_s2e.0" vType="Car" speedFactor="1.01" vaporized=""/>
    <tripinfo id="car_n2s.0" depart="31.90" departLane="n2sep_1" departPos="3.60" departPosLat="0.00" departSpeed="13.90" departDelay="0.00" arrival="170.05" arrivalLane="c2s_1" arrivalPos="990.00" arrivalPosLat="0.00" arrivalSpeed="14.55" duration="138.15" routeLength="1997.01" waitingTime="0.00" waitingCount="0" stopTime="0.00" timeLoss="0.94" rerouteNo="1" devices="tripinfo_car_n2s.0 routing_car_n2s.0" vType="Car" speedFactor="1.05" vaporized=""/>
    <tripinfo id="car_n2e.0" depart="26.30" departLane="n2sep_1" departPos="3.60" departPosLat="0.00" departSpeed="13.90" departDelay="0.00" arrival="173.25" arrivalLane="c2e_1" arrivalPos="990.00" arrivalPosLat="0.00" arrivalSpeed="14.24" duration="146.95" routeLength="1996.47" waitingTime="0.00" waitingCount="0" stopTime="0.00" timeLoss="6.34" rerouteNo="1" devices="tripinfo_car_n2e.0 routing_car_n2e.0" vType="Car" speedFactor="1.03" vaporized=""/>
    <tripinfo id="car_s2e.1" depart="39.30" departLane="s2sep_1" departPos="3.60" departPosLat="0.00" departSpeed="13.90" departDelay="0.00" arrival="180.80" arrivalLane="c2e_1" arrivalPos="990.00" arrivalPosLat="0.00" arrivalSpeed="14.54" duration="141.50" routeLength="1986.69" waitingTime="0.00" waitingCount="0" stopTime="0.00" timeLoss="4.14" rerouteNo="1" devices="tripinfo_car_s2e.1 routing_car_s2e.1" vType="Car" speedFactor="1.05" vaporized=""/>
    <tripinfo id="car_w2s.0" depart="37.90" departLane="w2sep_1" departPos="3.60" departPosLat="0.00" departSpeed="13.90" departDelay="0.00" arrival="205.30" arrivalLane="c2s_1" arrivalPos="990.00" arrivalPosLat="0.00" arrivalSpeed="15.61" duration="167.40" routeLength="1986.69" waitingTime="30.20" waitingCount="1" stopTime="0.00" timeLoss="39.47" rerouteNo="1" devices="tripinfo_car_w2s.0 routing_car_w2s.0" vType="Car" speedFactor="1.12" vaporized=""/>
    <tripinfo id="car_e2n.0" depart="12.40" departLane="e2sep_1" departPos="3.60" departPosLat="0.00" departSpeed="13.90" departDelay="0.00" arrival="207.60" arrivalLane="c2n_1" arrivalPos="990.00" arrivalPosLat="0.00" arrivalSpeed="15.05" duration="195.20" routeLength="1986.69" waitingTime="49.05" waitingCount="1" stopTime="0.00" timeLoss="62.51" rerouteNo="1" devices="tripinfo_car_e2n.0 routing_car_e2n.0" vType="Car" speedFactor="1.08" vaporized=""/>
    <tripinfo id="car_w2e.0" depart="12.60" departLane="w2sep_1" departPos="3.60" departPosLat="0.00" departSpeed="13.90" departDelay="0.00" arrival="208.65" arrivalLane="c2e_1" arrivalPos="990.00" arrivalPosLat="0.00" arrivalSpeed="14.32" duration="196.05" routeLength="1997.01" waitingTime="49.90" waitingCount="1" stopTime="0.00" timeLoss="56.60" rerouteNo="1" devices="tripinfo_car_w2e.0 routing_car_w2e.0" vType="Car" speedFactor="1.03" vaporized=""/>
    <tripinfo id="car_e2w.0" depart="10.60" departLane="e2sep_1" departPos="3.60" departPosLat="0.00" departSpeed="13.90" departDelay="0.00" arrival="210.00" arrivalLane="c2w_1" arrivalPos="990.00" arrivalPosLat="0.00" arrivalSpeed="14.04" duration="199.40" routeLength="1997.01" waitingTime="50.70" waitingCount="1" stopTime="0.00" timeLoss="57.17" rerouteNo="1" devices="tripinfo_car_e2w.0 routing_car_e2w.0" vType="Car" speedFactor="1.01" vaporized=""/>
    <tripinfo id="car_e2n.1" depart="19.50" departLane="e2sep_1" departPos="3.60" departPosLat="0.00" departSpeed="13.90" departDelay="0.00" arrival="211.95" arrivalLane="c2n_1" arrivalPos="990.00" arrivalPosLat="0.00" arrivalSpeed="15.04" duration="192.45" routeLength="1986.69" waitingTime="46.75" waitingCount="1" stopTime="0.00" timeLoss="59.76" rerouteNo="1" devices="tripinfo_car_e2n.1 routing_car_e2n.1" vType="Car" speedFactor="1.08" vaporized=""/>
    <tripinfo id="car_w2e.1" depart="39.20" departLane="w2sep_1" departPos="3.60" departPosLat="0.00" departSpeed="13.90" departDelay="0.50" arrival="215.55" arrivalLane="c2e_1" arrivalPos="990.00" arrivalPosLat="0.00" arrivalSpeed="13.90" duration="176.35" routeLength="1997.01" waitingTime="21.95" waitingCount="1" stopTime="0.00" timeLoss="32.65" rerouteNo="1" devices="tripinfo_car_w2e.1 routing_car_w2e.1" vType="Car" speedFactor="1.00" vaporized=""/>
    <tripinfo id="car_e2w.1" depart="23.65" departLane="e2sep_1" departPos="3.60" departPosLat="0.00" departSpeed="13.90" departDelay="0.00" arrival="215.80" arrivalLane="c2w_1" arrivalPos="990.00" arrivalPosLat="0.00" arrivalSpeed="14.32" duration="192.15" routeLength="1997.01" waitingTime="41.10" waitingCount="1" stopTime="0.00" timeLoss="52.69" rerouteNo="1" devices="tripinfo_car_e2w.1 routing_car_e2w.1" vType="Car" speedFactor="1.03" vaporized=""/>
    <tripinfo id="car_w2s.1" depart="54.35" departLane="w2sep_1" departPos="3.60" departPosLat="0.00" departSpeed="13.90" departDelay="0.00" arrival="217.00" arrivalLane="c2s_1" arrivalPos="990.00" arrivalPosLat="0.00" arrivalSpeed="14.04" duration="162.65" routeLength="1986.69" waitingTime="9.50" waitingCount="1" stopTime="0.00" timeLoss="20.43" rerouteNo="1" devices="tripinfo_car_w2s.1 routing_car_w2s.1" vType="Car" speedFactor="1.01" vaporized=""/>
    <tripinfo id="car_w2e.2" depart="57.10" departLane="w2sep_1" departPos="3.60" departPosLat="0.00" departSpeed="13.90" departDelay="0.00" arrival="217.85" arrivalLane="c2e_1" arrivalPos="990.00" arrivalPosLat="0.00" arrivalSpeed="14.87" duration="160.75" routeLength="1997.01" waitingTime="8.65" waitingCount="1" stopTime="0.00" timeLoss="29.00" rerouteNo="1" devices="tripinfo_car_w2e.2 routing_car_w2e.2" vType="Car" speedFactor="1.09" vaporized=""/>
    <tripinfo id="car_w2e.3" depart="64.20" departLane="w2sep_1" departPos="3.60" departPosLat="0.00" departSpeed="13.90" departDelay="0.00" arrival="220.00" arrivalLane="c2e_1" arrivalPos="990.00" arrivalPosLat="0.00" arrivalSpeed="15.23" duration="155.80" routeLength="1997.01" waitingTime="5.65" waitingCount="1" stopTime="0.00" timeLoss="27.85" rerouteNo="1" devices="tripinfo_car_w2e.3 routing_car_w2e.3" vType="Car" speedFactor="1.12" vaporized=""/>
    <tripinfo id="car_w2s.2" depart="60.85" departLane="w2sep_1" departPos="3.60" departPosLat="0.00" departSpeed="13.90" departDelay="0.00" arrival="220.55" arrivalLane="c2s_1" arrivalPos="990.00" arrivalPosLat="0.00" arrivalSpeed="14.52" duration="159.70" routeLength="1986.69" waitingTime="6.50" waitingCount="1" stopTime="0.00" timeLoss="22.48" rerouteNo="1" devices="tripinfo_car_w2s.2 routing_car_w2s.2" vType="Car" speedFactor="1.05" vaporized=""/>
    <tripinfo id="car_e2w.2" depart="44.30" departLane="e2sep_1" departPos="3.60" departPosLat="0.00" departSpeed="13.90" departDelay="0.00" arrival="221.00" arrivalLane="c2w_1" arrivalPos="990.00" arrivalPosLat="0.00" arrivalSpeed="13.90" duration="176.70" routeLength="1997.01" waitingTime="18.40" waitingCount="1" stopTime="0.00" timeLoss="33.03" rerouteNo="1" devices="tripinfo_car_e2w.2 routing_car_e2w.2" vType="Car" speedFactor="1.00" vaporized=""/>
    <tripinfo id="car_w2s.3" depart="77.00" departLane="w2sep_1" departPos="3.60" departPosLat="0.00" departSpeed="13.90" departDelay="0.00" arrival="222.95" arrivalLane="c2s_1" arrivalPos="990.00" arrivalPosLat="0.00" arrivalSpeed="15.98" duration="145.95" routeLength="1986.69" waitingTime="0.00" waitingCount="0" stopTime="0.00" timeLoss="23.35" rerouteNo="1" devices="tripinfo_car_w2s.3 routing_car_w2s.3" vType="Car" speedFactor="1.17" vaporized=""/>
    <tripinfo id="car_e2w.3" depart="49.05" departLane="e2sep_1" departPos="3.60" departPosLat="0.00" departSpeed="13.90" departDelay="0.00" arrival="224.75" arrivalLane="c2w_1" arrivalPos="990.00" arrivalPosLat="0.00" arrivalSpeed="13.88" duration="175.70" routeLength="1997.01" waitingTime="15.75" waitingCount="1" stopTime="0.00" timeLoss="32.00" rerouteNo="1" devices="tripinfo_car_e2w.3 routing_car_e2w.3" vType="Car" speedFactor="1.00" vaporized=""/>
    <tripinfo id="car_w2e.4" depart="65.55" departLane="w2sep_1" departPos="3.60" departPosLat="0.00" departSpeed="13.90" departDelay="1.20" arrival="226.35" arrivalLane="c2e_1" arrivalPos="990.00" arrivalPosLat="0.00" arrivalSpeed="13.90" duration="160.80" routeLength="1997.01" waitingTime="1.40" waitingCount="1" stopTime="0.00" timeLoss="17.11" rerouteNo="1" devices="tripinfo_car_w2e.4 routing_car_w2e.4" vType="Car" speedFactor="1.00" vaporized=""/>
    <tripinfo id="car_w2n.1" depart="92.50" departLane="w2sep_1" departPos="3.60" departPosLat="0.00" departSpeed="13.90" departDelay="0.00" arrival="227.60" arrivalLane="c2n_1" arrivalPos="990.00" arrivalPosLat="0.00" arrivalSpeed="15.32" duration="135.10" routeLength="1996.47" waitingTime="0.00" waitingCount="0" stopTime="0.00" timeLoss="4.16" rerouteNo="1" devices="tripinfo_car_w2n.1 routing_car_w2n.1" vType="Car" speedFactor="1.10" vaporized=""/>
    <tripinfo id="car_w2e.5" depart="67.35" departLane="w2sep_1" departPos="3.60" departPosLat="0.00" departSpeed="13.90" departDelay="1.95" arrival="228.35" arrivalLane="c2e_1" arrivalPos="990.00" arrivalPosLat="0.00" arrivalSpeed="15.17" duration="161.00" routeLength="1997.01" waitingTime="0.60" waitingCount="1" stopTime="0.00" timeLoss="34.04" rerouteNo="1" devices="tripinfo_car_w2e.5 routing_car_w2e.5" vType="Car" speedFactor="1.13" vaporized=""/>
    <tripinfo id="car_w2e.6" depart="69.05" departLane="w2sep_1" departPos="3.60" departPosLat="0.00" departSpeed="13.90" departDelay="0.00" arrival="230.20" arrivalLane="c2e_1" arrivalPos="990.00" arrivalPosLat="0.00" arrivalSpeed="15.60" duration="161.15" routeLength="1997.01" waitingTime="0.00" waitingCount="0" stopTime="0.00" timeLoss="39.24" rerouteNo="1" devices="tripinfo_car_w2e.6 routing_car_w2e.6" vType="Car" speedFactor="1.18" vaporized=""/>
    <tripinfo id="car_w2s.4" depart="81.20" departLane="w2sep_1" departPos="3.60" departPosLat="0.00" departSpeed="13.90" departDelay="0.00" arrival="232.75" arrivalLane="c2s_1" arrivalPos="990.00" arrivalPosLat="0.00" arrivalSpeed="14.17" duration="151.55" routeLength="1986.69" waitingTime="0.00" waitingCount="0" stopTime="0.00" timeLoss="10.63" rerouteNo="1" devices="tripinfo_car_w2s.4 routing_car_w2s.4" vType="Car" speedFactor="1.02" vaporized=""/>
    <tripinfo id="car_e2s.0" depart="25.10" departLane="e2sep_1" departPos="3.60" departPosLat="0.00" departSpeed="13.90" departDelay="1.45" arrival="235.30" arrivalLane="c2s_1" arrivalPos="990.00" arrivalPosLat="0.00" arrivalSpeed="14.98" duration="210.20" routeLength="1996.47" waitingTime="57.10" waitingCount="2" stopTime="0.00" timeLoss="77.86" rerouteNo="1" devices="tripinfo_car_e2s.0 routing_car_e2s.0" vType="Car" speedFactor="1.09" vaporized=""/>
    <tripinfo id="car_w2n.2" depart="96.10" departLane="w2sep_1" departPos="3.60" departPosLat="0.00" departSpeed="13.90" departDelay="0.00" arrival="236.10" arrivalLane="c2n_1" arrivalPos="990.00" arrivalPosLat="0.00" arrivalSpeed="15.18" duration="140.00" routeLength="1996.47" waitingTime="0.00" waitingCount="0" stopTime="0.00" timeLoss="7.83" rerouteNo="1" devices="tripinfo_car_w2n.2 routing_car_w2n.2" vType="Car" speedFactor="1.09" vaporized=""/>
    <tripinfo id="car_e2w.4" depart="95.85" departLane="e2sep_1" departPos="3.60" departPosLat="0.00" departSpeed="13.90" departDelay="0.00" arrival="237.30" arrivalLane="c2w_1" arrivalPos="990.00" arrivalPosLat="0.00" arrivalSpeed="14.15" duration="141.45" routeLength="1997.01" waitingTime="0.00" waitingCount="0" stopTime="0.00" timeLoss="0.33" rerouteNo="1" devices="tripinfo_car_e2w.4 routing_car_e2w.4" vType="Car" speedFactor="1.02" vaporized=""/>
    <tripinfo id="car_e2s.1" depart="41.85" departLane="e2sep_1" departPos="3.60" departPosLat="0.00" departSpeed="13.90" departDelay="0.00" arrival="240.65" arrivalLane="c2s_1" arrivalPos="990.00" arrivalPosLat="0.00" arrivalSpeed="13.90" duration="198.80" routeLength="1996.47" waitingTime="39.70" waitingCount="2" stopTime="0.00" timeLoss="54.45" rerouteNo="1" devices="tripinfo_car_e2s.1 routing_car_e2s.1" vType="Car" speedFactor="1.00" vaporized=""/>
    <tripinfo id="car_e2s.2" depart="51.50" departLane="e2sep_1" departPos="3.60" departPosLat="0.00" departSpeed="13.90" departDelay="0.00" arrival="242.50" arrivalLane="c2s_1" arrivalPos="990.00" arrivalPosLat="0.00" arrivalSpeed="15.31" duration="191.00" routeLength="1996.47" waitingTime="28.65" waitingCount="2" stopTime="0.00" timeLoss="66.40" rerouteNo="1" devices="tripinfo_car_e2s.2 routing_car_e2s.2" vType="Car" speedFactor="1.16" vaporized=""/>
    <tripinfo id="car_w2n.3" depart="97.45" departLane="w2sep_1" departPos="3.60" departPosLat="0.00" departSpeed="13.90" departDelay="0.90" arrival="242.50" arrivalLane="c2n_1" arrivalPos="990.00" arrivalPosLat="0.00" arrivalSpeed="14.50" duration="145.05" routeLength="1996.47" waitingTime="0.00" waitingCount="0" stopTime="0.00" timeLoss="6.74" rerouteNo="1" devices="tripinfo_car_w2n.3 routing_car_w2n.3" vType="Car" speedFactor="1.04" vaporized=""/>
    <tripinfo id="car_s2e.2" depart="52.50" departLane="s2sep_1" departPos="3.60" departPosLat="0.00" departSpeed="13.90" departDelay="0.00" arrival="254.40" arrivalLane="c2e_1" arrivalPos="990.00" arrivalPosLat="0.00" arrivalSpeed="14.15" duration="201.90" routeLength="1986.69" waitingTime="54.00" waitingCount="1" stopTime="0.00" timeLoss="60.79" rerouteNo="1" devices="tripinfo_car_s2e.2 routing_car_s2e.2" vType="Car" speedFactor="1.02" vaporized=""/>
    <tripinfo id="car_n2w.1" depart="64.70" departLane="n2sep_1" departPos="3.60" departPosLat="0.00" departSpeed="13.90" departDelay="0.00" arrival="255.70" arrivalLane="c2w_1" arrivalPos="990.00" arrivalPosLat="0.00" arrivalSpeed="13.90" duration="191.00" routeLength="1986.69" waitingTime="40.35" waitingCount="1" stopTime="0.00" timeLoss="47.30" rerouteNo="1" devices="tripinfo_car_n2w.1 routing_car_n2w.1" vType="Car" speedFactor="1.00" vaporized=""/>
    <tripinfo id="car_s2e.3" depart="59.60" departLane="s2sep_1" departPos="3.60" departPosLat="0.00" departSpeed="13.90" departDelay="0.00" arrival="258.55" arrivalLane="c2e_1" arrivalPos="990.00" arrivalPosLat="0.00" arrivalSpeed="14.25" duration="198.95" routeLength="1986.69" waitingTime="47.85" waitingCount="1" stopTime="0.00" timeLoss="58.96" rerouteNo="1" devices="tripinfo_car_s2e.3 routing_car_s2e.3" vType="Car" speedFactor="1.03" vaporized=""/>
    <tripinfo id="car_n2w.2" depart="75.45" departLane="n2sep_1" departPos="3.60" departPosLat="0.00" departSpeed="13.90" departDelay="0.00" arrival="259.95" arrivalLane="c2w_1" arrivalPos="990.00" arrivalPosLat="0.00" arrivalSpeed="13.96" duration="184.50" routeLength="1986.69" waitingTime="29.95" waitingCount="1" stopTime="0.00" timeLoss="41.58" rerouteNo="1" devices="tripinfo_car_n2w.2 routing_car_n2w.2" vType="Car" speedFactor="1.01" vaporized=""/>
    <tripinfo id="car_n2s.1" depart="77.50" departLane="n2sep_1" departPos="3.60" departPosLat="0.00" departSpeed="13.90" departDelay="0.00" arrival="260.20" arrivalLane="c2s_1" arrivalPos="990.00" arrivalPosLat="0.00" arrivalSpeed="13.90" duration="182.70" routeLength="1997.01" waitingTime="27.15" waitingCount="1" stopTime="0.00" timeLoss="39.00" rerouteNo="1" devices="tripinfo_car_n2s.1 routing_car_n2s.1" vType="Car" speedFactor="1.00" vaporized=""/>
    <tripinfo id="car_n2s.2" depart="93.60" departLane="n2sep_1" departPos="3.60" departPosLat="0.00" departSpeed="13.90" departDelay="0.00" arrival="262.10" arrivalLane="c2s_1" arrivalPos="990.00" arrivalPosLat="0.00" arrivalSpeed="15.36" duration="168.50" routeLength="1997.01" waitingTime="23.60" waitingCount="1" stopTime="0.00" timeLoss="44.43" rerouteNo="1" devices="tripinfo_car_n2s.2 routing_car_n2s.2" vType="Car" speedFactor="1.16" vaporized=""/>
    <tripinfo id="car_s2n.2" depart="83.85" departLane="s2sep_1" departPos="3.60" departPosLat="0.00" departSpeed="13.90" departDelay="0.00" arrival="262.50" arrivalLane="c2n_1" arrivalPos="990.00" arrivalPosLat="0.00" arrivalSpeed="13.90" duration="178.65" routeLength="1997.01" waitingTime="24.40" waitingCount="1" stopTime="0.00" timeLoss="34.97" rerouteNo="1" devices="tripinfo_car_s2n.2 routing_car_s2n.2" vType="Car" speedFactor="1.00" vaporized=""/>
    <tripinfo id="car_s2e.4" depart="67.60" departLane="s2sep_1" departPos="3.60" departPosLat="0.00" departSpeed="13.90" departDelay="1.20" arrival="263.00" arrivalLane="c2e_1" arrivalPos="990.00" arrivalPosLat="0.00" arrivalSpeed="13.89" duration="195.40" routeLength="1986.69" waitingTime="36.65" waitingCount="1" stopTime="0.00" timeLoss="51.71" rerouteNo="1" devices="tripinfo_car_s2e.4 routing_car_s2e.4" vType="Car" speedFactor="1.00" vaporized=""/>
    <tripinfo id="car_n2w.3" depart="94.95" departLane="n2sep_1" departPos="3.60" departPosLat="0.00" departSpeed="13.90" departDelay="0.00" arrival="263.90" arrivalLane="c2w_1" arrivalPos="990.00" arrivalPosLat="0.00" arrivalSpeed="14.30" duration="168.95" routeLength="1986.69" waitingTime="15.75" waitingCount="1" stopTime="0.00" timeLoss="29.54" rerouteNo="1" devices="tripinfo_car_n2w.3 routing_car_n2w.3" vType="Car" speedFactor="1.03" vaporized=""/>
    <tripinfo id="car_n2e.1" depart="74.20" departLane="n2sep_1" departPos="3.60" departPosLat="0.00" departSpeed="13.90" departDelay="0.00" arrival="264.85" arrivalLane="c2e_1" arrivalPos="990.00" arrivalPosLat="0.00" arrivalSpeed="15.26" duration="190.65" routeLength="1996.47" waitingTime="45.55" waitingCount="2" stopTime="0.00" timeLoss="65.64" rerouteNo="1" devices="tripinfo_car_n2e.1 routing_car_n2e.1" vType="Car" speedFactor="1.15" vaporized=""/>
    <tripinfo id="car_s2n.3" depart="96.15" departLane="s2sep_1" departPos="3.60" departPosLat="0.00" departSpeed="13.90" departDelay="0.00" arrival="265.65" arrivalLane="c2n_1" arrivalPos="990.00" arrivalPosLat="0.00" arrivalSpeed="14.36" duration="169.50" routeLength="1997.01" waitingTime="15.65" waitingCount="1" stopTime="0.00" timeLoss="31.04" rerouteNo="1" devices="tripinfo_car_s2n.3 routing_car_s2n.3" vType="Car" speedFactor="1.04" vaporized=""/>
    <tripinfo id="car_n2s.3" depart="128.65" departLane="n2sep_1" departPos="3.60" departPosLat="0.00" departSpeed="13.90" departDelay="1.45" arrival="265.70" arrivalLane="c2s_1" arrivalPos="990.00" arrivalPosLat="0.00" arrivalSpeed="15.83" duration="137.05" routeLength="1997.01" waitingTime="0.00" waitingCount="0" stopTime="0.00" timeLoss="11.30" rerouteNo="1" devices="tripinfo_car_n2s.3 routing_car_n2s.3" vType="Car" speedFactor="1.14" vaporized=""/>
    <tripinfo id="car_n2e.2" depart="100.00" departLane="n2sep_1" departPos="3.60" departPosLat="0.00" departSpeed="13.90" departDelay="0.00" arrival="267.25" arrivalLane="c2e_1" arrivalPos="990.00" arrivalPosLat="0.00" arrivalSpeed="14.90" duration="167.25" routeLength="1996.47" waitingTime="15.35" waitingCount="2" stopTime="0.00" timeLoss="34.63" rerouteNo="1" devices="tripinfo_car_n2e.2 routing_car_n2e.2" vType="Car" speedFactor="1.09" vaporized=""/>
    <tripinfo id="car_n2w.4" depart="101.35" departLane="n2sep_1" departPos="3.60" departPosLat="0.00" departSpeed="13.90" departDelay="0.00" arrival="268.85" arrivalLane="c2w_1" arrivalPos="990.00" arrivalPosLat="0.00" arrivalSpeed="13.90" duration="167.50" routeLength="1986.69" waitingTime="8.05" waitingCount="1" stopTime="0.00" timeLoss="23.81" rerouteNo="1" devices="tripinfo_car_n2w.4 routing_car_n2w.4" vType="Car" speedFactor="1.00" vaporized=""/>
    <tripinfo id="car_n2w.5" depart="123.50" departLane="n2sep_1" departPos="3.60" departPosLat="0.00" departSpeed="13.90" departDelay="0.00" arrival="272.95" arrivalLane="c2w_1" arrivalPos="990.00" arrivalPosLat="0.00" arrivalSpeed="13.89" duration="149.45" routeLength="1986.69" waitingTime="0.00" waitingCount="0" stopTime="0.00" timeLoss="5.77" rerouteNo="1" devices="tripinfo_car_n2w.5 routing_car_n2w.5" vType="Car" speedFactor="1.00" vaporized=""/>
    <tripinfo id="car_s2n.4" depart="132.90" departLane="s2sep_1" departPos="3.60" departPosLat="0.00" departSpeed="13.90" departDelay="0.00" arrival="274.85" arrivalLane="c2n_1" arrivalPos="990.00" arrivalPosLat="0.00" arrivalSpeed="14.12" duration="141.95" routeLength="1997.01" waitingTime="0.00" waitingCount="0" stopTime="0.00" timeLoss="0.48" rerouteNo="1" devices="tripinfo_car_s2n.4 routing_car_s2n.4" vType="Car" speedFactor="1.02" vaporized=""/>
</tripinfos>
