<?xml version="1.0" encoding="UTF-8"?>

<!-- generated on Sat Apr 24 18:23:25 2021 by Eclipse SUMO Version 1.4.0
<configuration xmlns:xsi="http://www.w3.org/2001/XMLSchema-instance" xsi:noNamespaceSchemaLocation="http://sumo.dlr.de/xsd/sumoConfiguration.xsd">

    <input>
        <net-file value="sumofiles/junction.net.xml"/>
        <route-files value="sumofiles/junction_preemption_172.rou.xml"/>
        <additional-files value="sumofiles/junction.det.xml"/>
    </input>

    <output>
        <tripinfo-output value="sumofiles/output/tripinfo_preemption_172.xml"/>
    </output>

    <time>
        <begin value="0"/>
        <end value="10000"/>
        <step-length value="0.05"/>
    </time>

    <processing>
        <lateral-resolution value="0.1"/>
    </processing>

    <report>
        <no-warnings value="true"/>
        <error-log value="sumofiles/output/errorlog_preemption_172.log"/>
        <no-step-log value="true"/>
    </report>

    <traci_server>
        <remote-port value="43957"/>
    </traci_server>

    <gui_only>
        <gui-settings-file value="sumofiles/junction-gui.settings.xml"/>
        <tracker-interval value="0.05"/>
    </gui_only>

</configuration>
-->

<tripinfos xmlns:xsi="http://www.w3.org/2001/XMLSchema-instance" xsi:noNamespaceSchemaLocation="http://sumo.dlr.de/xsd/tripinfo_file.xsd">
    <tripinfo id="car_e2w_2" depart="2.00" departLane="e2sep_1" departPos="3.60" departPosLat="0.00" departSpeed="13.90" departDelay="0.00" arrival="137.70" arrivalLane="c2w_1" arrivalPos="990.00" arrivalPosLat="0.00" arrivalSpeed="14.73" duration="135.70" routeLength="1997.01" waitingTime="0.00" waitingCount="0" stopTime="0.00" timeLoss="0.15" rerouteNo="1" devices="tripinfo_car_e2w_2 routing_car_e2w_2" vType="Car" speedFactor="1.06" vaporized=""/>
    <tripinfo id="car_e2s_7" depart="7.00" departLane="e2sep_1" departPos="3.60" departPosLat="0.00" departSpeed="13.90" departDelay="0.00" arrival="147.35" arrivalLane="c2s_1" arrivalPos="990.00" arrivalPosLat="0.00" arrivalSpeed="14.73" duration="140.35" routeLength="1996.47" waitingTime="0.00" waitingCount="0" stopTime="0.00" timeLoss="4.18" rerouteNo="1" devices="tripinfo_car_e2s_7 routing_car_e2s_7" vType="Car" speedFactor="1.06" vaporized=""/>
    <tripinfo id="car_w2n_9" depart="9.00" departLane="w2sep_1" departPos="3.60" departPosLat="0.00" departSpeed="13.90" departDelay="0.00" arrival="155.10" arrivalLane="c2n_1" arrivalPos="990.00" arrivalPosLat="0.00" arrivalSpeed="14.04" duration="146.10" routeLength="1996.47" waitingTime="0.00" waitingCount="0" stopTime="0.00" timeLoss="3.25" rerouteNo="1" devices="tripinfo_car_w2n_9 routing_car_w2n_9" vType="Car" speedFactor="1.01" vaporized=""/>
    <tripinfo id="car_n2w_10" depart="10.00" departLane="n2sep_1" departPos="3.60" departPosLat="0.00" departSpeed="13.90" departDelay="0.00" arrival="160.35" arrivalLane="c2w_1" arrivalPos="990.00" arrivalPosLat="0.00" arrivalSpeed="15.05" duration="150.35" routeLength="1986.69" waitingTime="10.05" waitingCount="1" stopTime="0.00" timeLoss="17.64" rerouteNo="1" devices="tripinfo_car_n2w_10 routing_car_n2w_10" vType="Car" speedFactor="1.08" vaporized=""/>
    <tripinfo id="car_n2e_31" depart="31.00" departLane="n2sep_1" departPos="3.60" departPosLat="0.00" departSpeed="13.90" departDelay="0.00" arrival="167.35" arrivalLane="c2e_1" arrivalPos="990.00" arrivalPosLat="0.00" arrivalSpeed="15.16" duration="136.35" routeLength="1996.47" waitingTime="0.00" waitingCount="0" stopTime="0.00" timeLoss="4.02" rerouteNo="1" devices="tripinfo_car_n2e_31 routing_car_n2e_31" vType="Car" speedFactor="1.09" vaporized=""/>
    <tripinfo id="car_s2w_30" depart="30.00" departLane="s2sep_1" departPos="3.60" departPosLat="0.00" departSpeed="13.90" departDelay="0.00" arrival="173.75" arrivalLane="c2w_1" arrivalPos="990.00" arrivalPosLat="0.00" arrivalSpeed="14.32" duration="143.75" routeLength="1996.47" waitingTime="0.00" waitingCount="0" stopTime="0.00" timeLoss="3.68" rerouteNo="1" devices="tripinfo_car_s2w_30 routing_car_s2w_30" vType="Car" speedFactor="1.03" vaporized=""/>
    <tripinfo id="bus_s2n_38" depart="38.00" departLane="s2sep_1" departPos="12.10" departPosLat="0.00" departSpeed="13.90" departDelay="0.00" arrival="181.40" arrivalLane="c2n_1" arrivalPos="990.00" arrivalPosLat="0.00" arrivalSpeed="13.90" duration="143.40" routeLength="1988.51" waitingTime="0.00" waitingCount="0" stopTime="0.00" timeLoss="0.32" rerouteNo="1" devices="tripinfo_bus_s2n_38 routing_bus_s2n_38" vType="Bus" speedFactor="1.00" vaporized=""/>
    <tripinfo id="car_n2e_39" depart="39.00" departLane="n2sep_1" departPos="3.60" departPosLat="0.00" departSpeed="13.90" departDelay="0.00" arrival="181.65" arrivalLane="c2e_1" arrivalPos="990.00" arrivalPosLat="0.00" arrivalSpeed="14.55" duration="142.65" routeLength="1996.47" waitingTime="0.00" waitingCount="0" stopTime="0.00" timeLoss="4.79" rerouteNo="1" devices="tripinfo_car_n2e_39 routing_car_n2e_39" vType="Car" speedFactor="1.05" vaporized=""/>
    <tripinfo id="car_n2w_42" depart="42.00" departLane="n2sep_1" departPos="3.60" departPosLat="0.00" departSpeed="13.90" departDelay="0.00" arrival="190.10" arrivalLane="c2w_1" arrivalPos="990.00" arrivalPosLat="0.00" arrivalSpeed="13.90" duration="148.10" routeLength="1986.69" waitingTime="0.00" waitingCount="0" stopTime="0.00" timeLoss="4.40" rerouteNo="1" devices="tripinfo_car_n2w_42 routing_car_n2w_42" vType="Car" speedFactor="1.00" vaporized=""/>
    <tripinfo id="car_n2s_45" depart="45.00" departLane="n2sep_1" departPos="3.60" departPosLat="0.00" departSpeed="13.90" departDelay="0.00" arrival="191.70" arrivalLane="c2s_1" arrivalPos="990.00" arrivalPosLat="0.00" arrivalSpeed="13.90" duration="146.70" routeLength="1997.01" waitingTime="0.00" waitingCount="0" stopTime="0.00" timeLoss="3.03" rerouteNo="1" devices="tripinfo_car_n2s_45 routing_car_n2s_45" vType="Car" speedFactor="1.00" vaporized=""/>
    <tripinfo id="car_s2w_40" depart="40.00" departLane="s2sep_1" departPos="3.60" departPosLat="0.00" departSpeed="13.90" departDelay="0.00" arrival="192.30" arrivalLane="c2w_1" arrivalPos="990.00" arrivalPosLat="0.00" arrivalSpeed="15.23" duration="152.30" routeLength="1996.47" waitingTime="6.10" waitingCount="1" stopTime="0.00" timeLoss="23.76" rerouteNo="1" devices="tripinfo_car_s2w_40 routing_car_s2w_40" vType="Car" speedFactor="1.12" vaporized=""/>
    <tripinfo id="car_n2s_53" depart="53.00" departLane="n2sep_1" departPos="3.60" departPosLat="0.00" departSpeed="13.90" departDelay="0.00" arrival="193.60" arrivalLane="c2s_1" arrivalPos="990.00" arrivalPosLat="0.00" arrivalSpeed="15.36" duration="140.60" routeLength="1997.01" waitingTime="0.00" waitingCount="0" stopTime="0.00" timeLoss="16.56" rerouteNo="1" devices="tripinfo_car_n2s_53 routing_car_n2s_53" vType="Car" speedFactor="1.16" vaporized=""/>
    <tripinfo id="car_w2e_19" depart="19.00" departLane="w2sep_1" departPos="3.60" departPosLat="0.00" departSpeed="13.90" departDelay="0.00" arrival="207.65" arrivalLane="c2e_1" arrivalPos="990.00" arrivalPosLat="0.00" arrivalSpeed="14.54" duration="188.65" routeLength="1997.01" waitingTime="43.85" waitingCount="1" stopTime="0.00" timeLoss="51.27" rerouteNo="1" devices="tripinfo_car_w2e_19 routing_car_w2e_19" vType="Car" speedFactor="1.05" vaporized=""/>
    <tripinfo id="car_w2s_29" depart="29.00" departLane="w2sep_1" departPos="3.60" departPosLat="0.00" departSpeed="13.90" departDelay="0.00" arrival="207.70" arrivalLane="c2s_1" arrivalPos="990.00" arrivalPosLat="0.00" arrivalSpeed="15.05" duration="178.70" routeLength="1986.69" waitingTime="35.35" waitingCount="1" stopTime="0.00" timeLoss="46.00" rerouteNo="1" devices="tripinfo_car_w2s_29 routing_car_w2s_29" vType="Car" speedFactor="1.08" vaporized=""/>
    <tripinfo id="car_e2w_16" depart="16.00" departLane="e2sep_1" departPos="3.60" departPosLat="0.00" departSpeed="13.90" departDelay="0.00" arrival="208.70" arrivalLane="c2w_1" arrivalPos="990.00" arrivalPosLat="0.00" arrivalSpeed="14.32" duration="192.70" routeLength="1997.01" waitingTime="46.05" waitingCount="1" stopTime="0.00" timeLoss="53.25" rerouteNo="1" devices="tripinfo_car_e2w_16 routing_car_e2w_16" vType="Car" speedFactor="1.03" vaporized=""/>
    <tripinfo id="car_e2n_17" depart="17.40" departLane="e2sep_1" departPos="3.60" departPosLat="0.00" departSpeed="13.90" departDelay="0.40" arrival="212.95" arrivalLane="c2n_1" arrivalPos="990.00" arrivalPosLat="0.00" arrivalSpeed="13.90" duration="195.55" routeLength="1986.69" waitingTime="41.60" waitingCount="1" stopTime="0.00" timeLoss="51.92" rerouteNo="1" devices="tripinfo_car_e2n_17 routing_car_e2n_17" vType="Car" speedFactor="1.00" vaporized=""/>
    <tripinfo id="car_w2s_43" depart="43.00" departLane="w2sep_1" departPos="3.60" departPosLat="0.00" departSpeed="13.90" departDelay="0.00" arrival="213.60" arrivalLane="c2s_1" arrivalPos="990.00" arrivalPosLat="0.00" arrivalSpeed="14.53" duration="170.60" routeLength="1986.69" waitingTime="21.90" waitingCount="1" stopTime="0.00" timeLoss="33.22" rerouteNo="1" devices="tripinfo_car_w2s_43 routing_car_w2s_43" vType="Car" speedFactor="1.05" vaporized=""/>
    <tripinfo id="car_e2w_71" depart="71.00" departLane="e2sep_1" departPos="3.60" departPosLat="0.00" departSpeed="13.90" departDelay="0.00" arrival="214.70" arrivalLane="c2w_1" arrivalPos="990.00" arrivalPosLat="0.00" arrivalSpeed="15.61" duration="143.70" routeLength="1997.01" waitingTime="1.55" waitingCount="1" stopTime="0.00" timeLoss="15.75" rerouteNo="1" devices="tripinfo_car_e2w_71 routing_car_e2w_71" vType="Car" speedFactor="1.12" vaporized=""/>
    <tripinfo id="car_e2n_38" depart="38.00" departLane="e2sep_1" departPos="3.60" departPosLat="0.00" departSpeed="13.90" departDelay="0.00" arrival="216.50" arrivalLane="c2n_1" arrivalPos="990.00" arrivalPosLat="0.00" arrivalSpeed="14.23" duration="178.50" routeLength="1986.69" waitingTime="25.65" waitingCount="1" stopTime="0.00" timeLoss="38.50" rerouteNo="1" devices="tripinfo_car_e2n_38 routing_car_e2n_38" vType="Car" speedFactor="1.03" vaporized=""/>
    <tripinfo id="car_w2s_56" depart="56.00" departLane="w2sep_1" departPos="3.60" departPosLat="0.00" departSpeed="13.90" departDelay="0.00" arrival="218.90" arrivalLane="c2s_1" arrivalPos="990.00" arrivalPosLat="0.00" arrivalSpeed="14.04" duration="162.90" routeLength="1986.69" waitingTime="7.60" waitingCount="1" stopTime="0.00" timeLoss="20.69" rerouteNo="1" devices="tripinfo_car_w2s_56 routing_car_w2s_56" vType="Car" speedFactor="1.01" vaporized=""/>
    <tripinfo id="car_e2n_54" depart="54.00" departLane="e2sep_1" departPos="3.60" departPosLat="0.00" departSpeed="13.90" departDelay="0.00" arrival="219.95" arrivalLane="c2n_1" arrivalPos="990.00" arrivalPosLat="0.00" arrivalSpeed="14.12" duration="165.95" routeLength="1986.69" waitingTime="9.55" waitingCount="1" stopTime="0.00" timeLoss="24.86" rerouteNo="1" devices="tripinfo_car_e2n_54 routing_car_e2n_54" vType="Car" speedFactor="1.02" vaporized=""/>
    <tripinfo id="car_e2n_65" depart="65.00" departLane="e2sep_1" departPos="3.60" departPosLat="0.00" departSpeed="13.90" departDelay="0.00" arrival="222.20" arrivalLane="c2n_1" arrivalPos="990.00" arrivalPosLat="0.00" arrivalSpeed="14.84" duration="157.20" routeLength="1986.69" waitingTime="4.85" waitingCount="1" stopTime="0.00" timeLoss="25.46" rerouteNo="1" devices="tripinfo_car_e2n_65 routing_car_e2n_65" vType="Car" speedFactor="1.09" vaporized=""/>
    <tripinfo id="car_w2s_66" depart="66.00" departLane="w2sep_1" departPos="3.60" departPosLat="0.00" departSpeed="13.90" departDelay="0.00" arrival="222.20" arrivalLane="c2s_1" arrivalPos="990.00" arrivalPosLat="0.00" arrivalSpeed="14.22" duration="156.20" routeLength="1986.69" waitingTime="0.00" waitingCount="0" stopTime="0.00" timeLoss="16.24" rerouteNo="1" devices="tripinfo_car_w2s_66 routing_car_w2s_66" vType="Car" speedFactor="1.03" vaporized=""/>
    <tripinfo id="car_w2e_75" depart="75.00" departLane="w2sep_1" departPos="3.60" departPosLat="0.00" departSpeed="13.90" departDelay="0.00" arrival="224.15" arrivalLane="c2e_1" arrivalPos="990.00" arrivalPosLat="0.00" arrivalSpeed="13.90" duration="149.15" routeLength="1997.01" waitingTime="0.00" waitingCount="0" stopTime="0.00" timeLoss="5.47" rerouteNo="1" devices="tripinfo_car_w2e_75 routing_car_w2e_75" vType="Car" speedFactor="1.00" vaporized=""/>
    <tripinfo id="car_w2s_72" depart="72.00" departLane="w2sep_1" departPos="3.60" departPosLat="0.00" departSpeed="13.90" departDelay="0.00" arrival="225.95" arrivalLane="c2s_1" arrivalPos="990.00" arrivalPosLat="0.00" arrivalSpeed="13.88" duration="153.95" routeLength="1986.69" waitingTime="0.00" waitingCount="0" stopTime="0.00" timeLoss="10.25" rerouteNo="1" devices="tripinfo_car_w2s_72 routing_car_w2s_72" vType="Car" speedFactor="1.00" vaporized=""/>
    <tripinfo id="car_w2n_23" depart="23.00" departLane="w2sep_1" departPos="3.60" departPosLat="0.00" departSpeed="13.90" departDelay="0.00" arrival="226.00" arrivalLane="c2n_1" arrivalPos="990.00" arrivalPosLat="0.00" arrivalSpeed="14.02" duration="203.00" routeLength="1996.47" waitingTime="46.95" waitingCount="2" stopTime="0.00" timeLoss="60.14" rerouteNo="1" devices="tripinfo_car_w2n_23 routing_car_w2n_23" vType="Car" speedFactor="1.01" vaporized=""/>
    <tripinfo id="car_e2s_49" depart="49.00" departLane="e2sep_1" departPos="3.60" departPosLat="0.00" departSpeed="13.90" departDelay="0.00" arrival="229.45" arrivalLane="c2s_1" arrivalPos="990.00" arrivalPosLat="0.00" arrivalSpeed="13.87" duration="180.45" routeLength="1996.47" waitingTime="22.80" waitingCount="2" stopTime="0.00" timeLoss="36.11" rerouteNo="1" devices="tripinfo_car_e2s_49 routing_car_e2s_49" vType="Car" speedFactor="1.00" vaporized=""/>
    <tripinfo id="car_w2n_48" depart="48.00" departLane="w2sep_1" departPos="3.60" departPosLat="0.00" departSpeed="13.90" departDelay="0.00" arrival="229.80" arrivalLane="c2n_1" arrivalPos="990.00" arrivalPosLat="0.00" arrivalSpeed="13.88" duration="181.80" routeLength="1996.47" waitingTime="21.25" waitingCount="2" stopTime="0.00" timeLoss="37.47" rerouteNo="1" devices="tripinfo_car_w2n_48 routing_car_w2n_48" vType="Car" speedFactor="1.00" vaporized=""/>
    <tripinfo id="car_e2s_75" depart="75.00" departLane="e2sep_1" departPos="3.60" departPosLat="0.00" departSpeed="13.90" departDelay="0.00" arrival="231.35" arrivalLane="c2s_1" arrivalPos="990.00" arrivalPosLat="0.00" arrivalSpeed="15.04" duration="156.35" routeLength="1996.47" waitingTime="8.70" waitingCount="1" stopTime="0.00" timeLoss="28.83" rerouteNo="1" devices="tripinfo_car_e2s_75 routing_car_e2s_75" vType="Car" speedFactor="1.13" vaporized=""/>
    <tripinfo id="car_w2n_84" depart="84.00" departLane="w2sep_1" departPos="3.60" departPosLat="0.00" departSpeed="13.90" departDelay="0.00" arrival="231.65" arrivalLane="c2n_1" arrivalPos="990.00" arrivalPosLat="0.00" arrivalSpeed="15.23" duration="147.65" routeLength="1996.47" waitingTime="0.00" waitingCount="0" stopTime="0.00" timeLoss="22.62" rerouteNo="1" devices="tripinfo_car_w2n_84 routing_car_w2n_84" vType="Car" speedFactor="1.15" vaporized=""/>
    <tripinfo id="car_w2e_90" depart="90.00" departLane="w2sep_1" departPos="3.60" departPosLat="0.00" departSpeed="13.90" departDelay="0.00" arrival="232.75" arrivalLane="c2e_1" arrivalPos="990.00" arrivalPosLat="0.00" arrivalSpeed="14.17" duration="142.75" routeLength="1997.01" waitingTime="0.00" waitingCount="0" stopTime="0.00" timeLoss="1.82" rerouteNo="1" devices="tripinfo_car_w2e_90 routing_car_w2e_90" vType="Car" speedFactor="1.02" vaporized=""/>
    <tripinfo id="car_w2n_85" depart="85.25" departLane="w2sep_1" departPos="3.60" departPosLat="0.00" departSpeed="13.90" departDelay="0.25" arrival="235.30" arrivalLane="c2n_1" arrivalPos="990.00" arrivalPosLat="0.00" arrivalSpeed="13.95" duration="150.05" routeLength="1996.47" waitingTime="0.00" waitingCount="0" stopTime="0.00" timeLoss="6.45" rerouteNo="1" devices="tripinfo_car_w2n_85 routing_car_w2n_85" vType="Car" speedFactor="1.01" vaporized=""/>
    <tripinfo id="car_e2s_89" depart="89.00" departLane="e2sep_1" departPos="3.60" departPosLat="0.00" departSpeed="13.90" departDelay="0.00" arrival="237.25" arrivalLane="c2s_1" arrivalPos="990.00" arrivalPosLat="0.00" arrivalSpeed="13.90" duration="148.25" routeLength="1996.47" waitingTime="0.00" waitingCount="0" stopTime="0.00" timeLoss="3.91" rerouteNo="1" devices="tripinfo_car_e2s_89 routing_car_e2s_89" vType="Car" speedFactor="1.00" vaporized=""/>
    <tripinfo id="car_w2n_100" depart="100.00" departLane="w2sep_1" departPos="3.60" departPosLat="0.00" departSpeed="13.90" departDelay="0.00" arrival="243.95" arrivalLane="c2n_1" arrivalPos="990.00" arrivalPosLat="0.00" arrivalSpeed="14.32" duration="143.95" routeLength="1996.47" waitingTime="0.00" waitingCount="0" stopTime="0.00" timeLoss="3.87" rerouteNo="1" devices="tripinfo_car_w2n_100 routing_car_w2n_100" vType="Car" speedFactor="1.03" vaporized=""/>
    <tripinfo id="car_n2s_77" depart="77.00" departLane="n2sep_1" departPos="3.60" departPosLat="0.00" departSpeed="13.90" departDelay="0.00" arrival="255.75" arrivalLane="c2s_1" arrivalPos="990.00" arrivalPosLat="0.00" arrivalSpeed="13.90" duration="178.75" routeLength="1997.01" waitingTime="27.95" waitingCount="1" stopTime="0.00" timeLoss="35.06" rerouteNo="1" devices="tripinfo_car_n2s_77 routing_car_n2s_77" vType="Car" speedFactor="1.00" vaporized=""/>
    <tripinfo id="car_n2s_98" depart="98.25" departLane="n2sep_1" departPos="3.60" departPosLat="0.00" departSpeed="13.90" departDelay="0.25" arrival="257.65" arrivalLane="c2s_1" arrivalPos="990.00" arrivalPosLat="0.00" arrivalSpeed="15.38" duration="159.40" routeLength="1997.01" waitingTime="14.10" waitingCount="1" stopTime="0.00" timeLoss="35.36" rerouteNo="1" devices="tripinfo_car_n2s_98 routing_car_n2s_98" vType="Car" speedFactor="1.16" vaporized=""/>
    <tripinfo id="car_n2w_90" depart="90.00" departLane="n2sep_1" departPos="3.60" departPosLat="0.00" departSpeed="13.90" departDelay="0.00" arrival="257.95" arrivalLane="c2w_1" arrivalPos="990.00" arrivalPosLat="0.00" arrivalSpeed="13.90" duration="167.95" routeLength="1986.69" waitingTime="15.45" waitingCount="1" stopTime="0.00" timeLoss="24.27" rerouteNo="1" devices="tripinfo_car_n2w_90 routing_car_n2w_90" vType="Car" speedFactor="1.00" vaporized=""/>
    <tripinfo id="bus_s2e_76" depart="76.00" departLane="s2sep_1" departPos="12.10" departPosLat="0.00" departSpeed="13.90" departDelay="0.00" arrival="258.95" arrivalLane="c2e_1" arrivalPos="990.00" arrivalPosLat="0.00" arrivalSpeed="13.90" duration="182.95" routeLength="1978.19" waitingTime="29.25" waitingCount="1" stopTime="0.00" timeLoss="39.88" rerouteNo="1" devices="tripinfo_bus_s2e_76 routing_bus_s2e_76" vType="Bus" speedFactor="1.00" vaporized=""/>
    <tripinfo id="car_n2w_97" depart="97.00" departLane="n2sep_1" departPos="3.60" departPosLat="0.00" departSpeed="13.90" departDelay="0.00" arrival="259.75" arrivalLane="c2w_1" arrivalPos="990.00" arrivalPosLat="0.00" arrivalSpeed="15.48" duration="162.75" routeLength="1986.69" waitingTime="14.75" waitingCount="1" stopTime="0.00" timeLoss="40.97" rerouteNo="1" devices="tripinfo_car_n2w_97 routing_car_n2w_97" vType="Car" speedFactor="1.18" vaporized=""/>
    <tripinfo id="car_n2s_114" depart="114.00" departLane="n2sep_1" departPos="3.60" departPosLat="0.00" departSpeed="13.90" departDelay="0.00" arrival="260.75" arrivalLane="c2s_1" arrivalPos="990.00" arrivalPosLat="0.00" arrivalSpeed="15.05" duration="146.75" routeLength="1997.01" waitingTime="0.00" waitingCount="0" stopTime="0.00" timeLoss="14.69" rerouteNo="1" devices="tripinfo_car_n2s_114 routing_car_n2s_114" vType="Car" speedFactor="1.09" vaporized=""/>
    <tripinfo id="car_s2n_117" depart="117.00" departLane="s2sep_1" departPos="3.60" departPosLat="0.00" departSpeed="13.90" departDelay="0.00" arrival="261.55" arrivalLane="c2n_1" arrivalPos="990.00" arrivalPosLat="0.00" arrivalSpeed="14.04" duration="144.55" routeLength="1997.01" waitingTime="0.00" waitingCount="0" stopTime="0.00" timeLoss="2.33" rerouteNo="1" devices="tripinfo_car_s2n_117 routing_car_s2n_117" vType="Car" speedFactor="1.01" vaporized=""/>
    <tripinfo id="car_s2e_105" depart="105.00" departLane="s2sep_1" departPos="3.60" departPosLat="0.00" departSpeed="13.90" departDelay="0.00" arrival="263.20" arrivalLane="c2e_1" arrivalPos="990.00" arrivalPosLat="0.00" arrivalSpeed="14.13" duration="158.20" routeLength="1986.69" waitingTime="2.75" waitingCount="1" stopTime="0.00" timeLoss="17.07" rerouteNo="1" devices="tripinfo_car_s2e_105 routing_car_s2e_105" vType="Car" speedFactor="1.02" vaporized=""/>
    <tripinfo id="car_n2e_88" depart="88.00" departLane="n2sep_1" departPos="3.60" departPosLat="0.00" departSpeed="13.90" departDelay="0.00" arrival="265.05" arrivalLane="c2e_1" arrivalPos="990.00" arrivalPosLat="0.00" arrivalSpeed="15.46" duration="177.05" routeLength="1996.47" waitingTime="31.05" waitingCount="2" stopTime="0.00" timeLoss="53.86" rerouteNo="1" devices="tripinfo_car_n2e_88 routing_car_n2e_88" vType="Car" speedFactor="1.17" vaporized=""/>
    <tripinfo id="car_n2e_106" depart="106.00" departLane="n2sep_1" departPos="3.60" departPosLat="0.00" departSpeed="13.90" departDelay="0.00" arrival="267.35" arrivalLane="c2e_1" arrivalPos="990.00" arrivalPosLat="0.00" arrivalSpeed="14.92" duration="161.35" routeLength="1996.47" waitingTime="9.50" waitingCount="2" stopTime="0.00" timeLoss="29.16" rerouteNo="1" devices="tripinfo_car_n2e_106 routing_car_n2e_106" vType="Car" speedFactor="1.09" vaporized=""/>
    <tripinfo id="car_n2w_124" depart="124.00" departLane="n2sep_1" departPos="3.60" departPosLat="0.00" departSpeed="13.90" departDelay="0.00" arrival="269.50" arrivalLane="c2w_1" arrivalPos="990.00" arrivalPosLat="0.00" arrivalSpeed="14.13" duration="145.50" routeLength="1986.69" waitingTime="0.00" waitingCount="0" stopTime="0.00" timeLoss="4.16" rerouteNo="1" devices="tripinfo_car_n2w_124 routing_car_n2w_124" vType="Car" speedFactor="1.02" vaporized=""/>
    <tripinfo id="car_s2n_129" depart="129.00" departLane="s2sep_1" departPos="3.60" departPosLat="0.00" departSpeed="13.90" departDelay="0.00" arrival="273.25" arrivalLane="c2n_1" arrivalPos="990.00" arrivalPosLat="0.00" arrivalSpeed="13.90" duration="144.25" routeLength="1997.01" waitingTime="0.00" waitingCount="0" stopTime="0.00" timeLoss="0.58" rerouteNo="1" devices="tripinfo_car_s2n_129 routing_car_s2n_129" vType="Car" speedFactor="1.00" vaporized=""/>
    <tripinfo id="car_n2w_129" depart="129.00" departLane="n2sep_1" departPos="3.60" departPosLat="0.00" departSpeed="13.90" departDelay="0.00" arrival="276.90" arrivalLane="c2w_1" arrivalPos="990.00" arrivalPosLat="0.00" arrivalSpeed="13.94" duration="147.90" routeLength="1986.69" waitingTime="0.00" waitingCount="0" stopTime="0.00" timeLoss="4.70" rerouteNo="1" devices="tripinfo_car_n2w_129 routing_car_n2w_129" vType="Car" speedFactor="1.00" vaporized=""/>
    <tripinfo id="car_n2w_138" depart="138.00" departLane="n2sep_1" departPos="3.60" departPosLat="0.00" departSpeed="13.90" departDelay="0.00" arrival="282.90" arrivalLane="c2w_1" arrivalPos="990.00" arrivalPosLat="0.00" arrivalSpeed="14.23" duration="144.90" routeLength="1986.69" waitingTime="0.00" waitingCount="0" stopTime="0.00" timeLoss="4.56" rerouteNo="1" devices="tripinfo_car_n2w_138 routing_car_n2w_138" vType="Car" speedFactor="1.02" vaporized=""/>
    <tripinfo id="car_n2e_145" depart="145.00" departLane="n2sep_1" departPos="3.60" departPosLat="0.00" departSpeed="13.90" departDelay="0.00" arrival="282.90" arrivalLane="c2e_1" arrivalPos="990.00" arrivalPosLat="0.00" arrivalSpeed="15.05" duration="137.90" routeLength="1996.47" waitingTime="0.00" waitingCount="0" stopTime="0.00" timeLoss="4.56" rerouteNo="1" devices="tripinfo_car_n2e_145 routing_car_n2e_145" vType="Car" speedFactor="1.08" vaporized=""/>
    <tripinfo id="car_s2w_66" depart="66.00" departLane="s2sep_1" departPos="3.60" departPosLat="0.00" departSpeed="13.90" departDelay="0.00" arrival="286.40" arrivalLane="c2w_1" arrivalPos="990.00" arrivalPosLat="0.00" arrivalSpeed="14.52" duration="220.40" routeLength="1996.47" waitingTime="69.30" waitingCount="3" stopTime="0.00" timeLoss="82.56" rerouteNo="1" devices="tripinfo_car_s2w_66 routing_car_s2w_66" vType="Car" speedFactor="1.05" vaporized=""/>
    <tripinfo id="car_s2w_82" depart="82.00" departLane="s2sep_1" departPos="3.60" departPosLat="0.00" departSpeed="13.90" departDelay="0.00" arrival="288.30" arrivalLane="c2w_1" arrivalPos="990.00" arrivalPosLat="0.00" arrivalSpeed="15.66" duration="206.30" routeLength="1996.47" waitingTime="54.40" waitingCount="2" stopTime="0.00" timeLoss="83.86" rerouteNo="1" devices="tripinfo_car_s2w_82 routing_car_s2w_82" vType="Car" speedFactor="1.18" vaporized=""/>
    <tripinfo id="car_e2n_122" depart="122.00" departLane="e2sep_1" departPos="3.60" departPosLat="0.00" departSpeed="13.90" departDelay="0.00" arrival="290.70" arrivalLane="c2n_1" arrivalPos="990.00" arrivalPosLat="0.00" arrivalSpeed="16.25" duration="168.70" routeLength="1986.69" waitingTime="37.25" waitingCount="1" stopTime="0.00" timeLoss="45.76" rerouteNo="1" devices="tripinfo_car_e2n_122 routing_car_e2n_122" vType="Car" speedFactor="1.17" vaporized=""/>
    <tripinfo id="car_s2w_97" depart="97.00" departLane="s2sep_1" departPos="3.60" departPosLat="0.00" departSpeed="13.90" departDelay="0.00" arrival="290.75" arrivalLane="c2w_1" arrivalPos="990.00" arrivalPosLat="0.00" arrivalSpeed="15.12" duration="193.75" routeLength="1996.47" waitingTime="39.80" waitingCount="2" stopTime="0.00" timeLoss="62.82" rerouteNo="1" devices="tripinfo_car_s2w_97 routing_car_s2w_97" vType="Car" speedFactor="1.10" vaporized=""/>
    <tripinfo id="car_e2n_159" depart="159.00" departLane="e2sep_1" departPos="3.60" departPosLat="0.00" departSpeed="13.90" departDelay="0.00" arrival="294.75" arrivalLane="c2n_1" arrivalPos="990.00" arrivalPosLat="0.00" arrivalSpeed="16.26" duration="135.75" routeLength="1986.69" waitingTime="0.00" waitingCount="0" stopTime="0.00" timeLoss="13.16" rerouteNo="1" devices="tripinfo_car_e2n_159 routing_car_e2n_159" vType="Car" speedFactor="1.17" vaporized=""/>
    <tripinfo id="car_s2w_120" depart="120.00" departLane="s2sep_1" departPos="3.60" departPosLat="0.00" departSpeed="13.90" departDelay="0.00" arrival="295.90" arrivalLane="c2w_1" arrivalPos="990.00" arrivalPosLat="0.00" arrivalSpeed="13.90" duration="175.90" routeLength="1996.47" waitingTime="19.50" waitingCount="1" stopTime="0.00" timeLoss="31.60" rerouteNo="1" devices="tripinfo_car_s2w_120 routing_car_s2w_120" vType="Car" speedFactor="1.00" vaporized=""/>
    <tripinfo id="car_w2e_114" depart="114.00" departLane="w2sep_1" departPos="3.60" departPosLat="0.00" departSpeed="13.90" departDelay="0.00" arrival="297.90" arrivalLane="c2e_1" arrivalPos="990.00" arrivalPosLat="0.00" arrivalSpeed="14.50" duration="183.90" routeLength="1997.01" waitingTime="38.75" waitingCount="1" stopTime="0.00" timeLoss="46.17" rerouteNo="1" devices="tripinfo_car_w2e_114 routing_car_w2e_114" vType="Car" speedFactor="1.04" vaporized=""/>
    <tripinfo id="car_w2e_118" depart="118.00" departLane="w2sep_1" departPos="3.60" departPosLat="0.00" departSpeed="13.90" departDelay="0.00" arrival="304.15" arrivalLane="c2e_1" arrivalPos="990.00" arrivalPosLat="0.00" arrivalSpeed="13.90" duration="186.15" routeLength="1997.01" waitingTime="32.40" waitingCount="1" stopTime="0.00" timeLoss="42.48" rerouteNo="1" devices="tripinfo_car_w2e_118 routing_car_w2e_118" vType="Car" speedFactor="1.00" vaporized=""/>
    <tripinfo id="car_e2n_160" depart="160.25" departLane="e2sep_1" departPos="3.60" departPosLat="0.00" departSpeed="13.90" departDelay="0.25" arrival="304.15" arrivalLane="c2n_1" arrivalPos="990.00" arrivalPosLat="0.00" arrivalSpeed="14.46" duration="143.90" routeLength="1986.69" waitingTime="0.00" waitingCount="0" stopTime="0.00" timeLoss="5.75" rerouteNo="1" devices="tripinfo_car_e2n_160 routing_car_e2n_160" vType="Car" speedFactor="1.04" vaporized=""/>
    <tripinfo id="car_w2s_119" depart="119.50" departLane="w2sep_1" departPos="3.60" departPosLat="0.00" departSpeed="13.90" departDelay="0.50" arrival="305.15" arrivalLane="c2s_1" arrivalPos="990.00" arrivalPosLat="0.00" arrivalSpeed="13.90" duration="185.65" routeLength="1986.69" waitingTime="29.85" waitingCount="1" stopTime="0.00" timeLoss="41.99" rerouteNo="1" devices="tripinfo_car_w2s_119 routing_car_w2s_119" vType="Car" speedFactor="1.00" vaporized=""/>
    <tripinfo id="car_w2s_126" depart="126.00" departLane="w2sep_1" departPos="3.60" departPosLat="0.00" departSpeed="13.90" departDelay="0.00" arrival="307.45" arrivalLane="c2s_1" arrivalPos="990.00" arrivalPosLat="0.00" arrivalSpeed="14.93" duration="181.45" routeLength="1986.69" waitingTime="25.90" waitingCount="1" stopTime="0.00" timeLoss="50.34" rerouteNo="1" devices="tripinfo_car_w2s_126 routing_car_w2s_126" vType="Car" speedFactor="1.10" vaporized=""/>
    <tripinfo id="car_e2w_168" depart="168.00" departLane="e2sep_1" departPos="3.60" departPosLat="0.00" departSpeed="13.90" departDelay="0.00" arrival="309.25" arrivalLane="c2w_1" arrivalPos="990.00" arrivalPosLat="0.00" arrivalSpeed="14.22" duration="141.25" routeLength="1997.01" waitingTime="0.00" waitingCount="0" stopTime="0.00" timeLoss="0.78" rerouteNo="1" devices="tripinfo_car_e2w_168 routing_car_e2w_168" vType="Car" speedFactor="1.02" vaporized=""/>
    <tripinfo id="car_w2s_147" depart="147.00" departLane="w2sep_1" departPos="3.60" departPosLat="0.00" departSpeed="13.90" departDelay="0.00" arrival="309.65" arrivalLane="c2s_1" arrivalPos="990.00" arrivalPosLat="0.00" arrivalSpeed="15.20" duration="162.65" routeLength="1986.69" waitingTime="15.30" waitingCount="1" stopTime="0.00" timeLoss="34.26" rerouteNo="1" devices="tripinfo_car_w2s_147 routing_car_w2s_147" vType="Car" speedFactor="1.12" vaporized=""/>
    <tripinfo id="car_w2e_131" depart="131.00" departLane="w2sep_1" departPos="3.60" departPosLat="0.00" departSpeed="13.90" departDelay="0.00" arrival="310.05" arrivalLane="c2e_1" arrivalPos="990.00" arrivalPosLat="0.00" arrivalSpeed="13.90" duration="179.05" routeLength="1997.01" waitingTime="22.80" waitingCount="1" stopTime="0.00" timeLoss="35.35" rerouteNo="1" devices="tripinfo_car_w2e_131 routing_car_w2e_131" vType="Car" speedFactor="1.00" vaporized=""/>
    <tripinfo id="car_w2n_121" depart="121.35" departLane="w2sep_1" departPos="3.60" departPosLat="0.00" departSpeed="13.90" departDelay="0.35" arrival="314.30" arrivalLane="c2n_1" arrivalPos="990.00" arrivalPosLat="0.00" arrivalSpeed="13.90" duration="192.95" routeLength="1996.47" waitingTime="33.20" waitingCount="2" stopTime="0.00" timeLoss="48.64" rerouteNo="1" devices="tripinfo_car_w2n_121 routing_car_w2n_121" vType="Car" speedFactor="1.00" vaporized=""/>
    <tripinfo id="car_w2e_155" depart="155.00" departLane="w2sep_1" departPos="3.60" departPosLat="0.00" departSpeed="13.90" departDelay="0.00" arrival="314.55" arrivalLane="c2e_1" arrivalPos="990.00" arrivalPosLat="0.00" arrivalSpeed="13.96" duration="159.55" routeLength="1997.01" waitingTime="1.95" waitingCount="1" stopTime="0.00" timeLoss="16.58" rerouteNo="1" devices="tripinfo_car_w2e_155 routing_car_w2e_155" vType="Car" speedFactor="1.01" vaporized=""/>
    <tripinfo id="car_w2n_142" depart="142.00" departLane="w2sep_1" departPos="3.60" departPosLat="0.00" departSpeed="13.90" departDelay="0.00" arrival="316.35" arrivalLane="c2n_1" arrivalPos="990.00" arrivalPosLat="0.00" arrivalSpeed="15.20" duration="174.35" routeLength="1996.47" waitingTime="23.85" waitingCount="2" stopTime="0.00" timeLoss="46.82" rerouteNo="1" devices="tripinfo_car_w2n_142 routing_car_w2n_142" vType="Car" speedFactor="1.13" vaporized=""/>
    <tripinfo id="car_w2e_176" depart="176.00" departLane="w2sep_1" departPos="3.60" departPosLat="0.00" departSpeed="13.90" departDelay="0.00" arrival="317.15" arrivalLane="c2e_1" arrivalPos="990.00" arrivalPosLat="0.00" arrivalSpeed="14.53" duration="141.15" routeLength="1997.01" waitingTime="0.00" waitingCount="0" stopTime="0.00" timeLoss="5.06" rerouteNo="1" devices="tripinfo_car_w2e_176 routing_car_w2e_176" vType="Car" speedFactor="1.06" vaporized=""/>
    <tripinfo id="car_e2s_111" depart="111.00" departLane="e2sep_1" departPos="3.60" departPosLat="0.00" departSpeed="13.90" departDelay="0.00" arrival="317.95" arrivalLane="c2s_1" arrivalPos="990.00" arrivalPosLat="0.00" arrivalSpeed="14.42" duration="206.95" routeLength="1996.47" waitingTime="56.80" waitingCount="2" stopTime="0.00" timeLoss="67.87" rerouteNo="1" devices="tripinfo_car_e2s_111 routing_car_e2s_111" vType="Car" speedFactor="1.04" vaporized=""/>
    <tripinfo id="car_e2s_134" depart="134.00" departLane="e2sep_1" departPos="3.60" departPosLat="0.00" departSpeed="13.90" departDelay="0.00" arrival="320.15" arrivalLane="c2s_1" arrivalPos="990.00" arrivalPosLat="0.00" arrivalSpeed="15.49" duration="186.15" routeLength="1996.47" waitingTime="39.20" waitingCount="2" stopTime="0.00" timeLoss="59.83" rerouteNo="1" devices="tripinfo_car_e2s_134 routing_car_e2s_134" vType="Car" speedFactor="1.14" vaporized=""/>
    <tripinfo id="car_w2n_149" depart="149.00" departLane="w2sep_1" departPos="3.60" departPosLat="0.00" departSpeed="13.90" departDelay="0.00" arrival="320.20" arrivalLane="c2n_1" arrivalPos="990.00" arrivalPosLat="0.00" arrivalSpeed="14.10" duration="171.20" routeLength="1996.47" waitingTime="8.90" waitingCount="2" stopTime="0.00" timeLoss="29.13" rerouteNo="1" devices="tripinfo_car_w2n_149 routing_car_w2n_149" vType="Car" speedFactor="1.02" vaporized=""/>
    <tripinfo id="car_e2s_153" depart="153.00" departLane="e2sep_1" departPos="3.60" departPosLat="0.00" departSpeed="13.90" departDelay="0.00" arrival="322.20" arrivalLane="c2s_1" arrivalPos="990.00" arrivalPosLat="0.00" arrivalSpeed="15.85" duration="169.20" routeLength="1996.47" waitingTime="20.70" waitingCount="2" stopTime="0.00" timeLoss="46.72" rerouteNo="1" devices="tripinfo_car_e2s_153 routing_car_e2s_153" vType="Car" speedFactor="1.18" vaporized=""/>
    <tripinfo id="car_e2s_154" depart="154.25" departLane="e2sep_1" departPos="3.60" departPosLat="0.00" departSpeed="13.90" departDelay="0.25" arrival="324.35" arrivalLane="c2s_1" arrivalPos="990.00" arrivalPosLat="0.00" arrivalSpeed="15.68" duration="170.10" routeLength="1996.47" waitingTime="17.05" waitingCount="2" stopTime="0.00" timeLoss="45.10" rerouteNo="1" devices="tripinfo_car_e2s_154 routing_car_e2s_154" vType="Car" speedFactor="1.15" vaporized=""/>
    <tripinfo id="car_e2s_169" depart="169.45" departLane="e2sep_1" departPos="3.60" departPosLat="0.00" departSpeed="13.90" departDelay="0.45" arrival="329.75" arrivalLane="c2s_1" arrivalPos="990.00" arrivalPosLat="0.00" arrivalSpeed="14.17" duration="160.30" routeLength="1996.47" waitingTime="4.20" waitingCount="1" stopTime="0.00" timeLoss="18.76" rerouteNo="1" devices="tripinfo_car_e2s_169 routing_car_e2s_169" vType="Car" speedFactor="1.02" vaporized=""/>
    <tripinfo id="car_e2s_177" depart="177.00" departLane="e2sep_1" departPos="3.60" departPosLat="0.00" departSpeed="13.90" departDelay="0.00" arrival="334.35" arrivalLane="c2s_1" arrivalPos="990.00" arrivalPosLat="0.00" arrivalSpeed="13.89" duration="157.35" routeLength="1996.47" waitingTime="0.00" waitingCount="0" stopTime="0.00" timeLoss="13.04" rerouteNo="1" devices="tripinfo_car_e2s_177 routing_car_e2s_177" vType="Car" speedFactor="1.00" vaporized=""/>
    <tripinfo id="car_e2s_190" depart="190.00" departLane="e2sep_1" departPos="3.60" departPosLat="0.00" departSpeed="13.90" departDelay="0.00" arrival="336.60" arrivalLane="c2s_1" arrivalPos="990.00" arrivalPosLat="0.00" arrivalSpeed="14.79" duration="146.60" routeLength="1996.47" waitingTime="0.00" waitingCount="0" stopTime="0.00" timeLoss="13.79" rerouteNo="1" devices="tripinfo_car_e2s_190 routing_car_e2s_190" vType="Car" speedFactor="1.09" vaporized=""/>
    <tripinfo id="car_s2n_180" depart="180.00" departLane="s2sep_1" departPos="3.60" departPosLat="0.00" departSpeed="13.90" departDelay="0.00" arrival="343.55" arrivalLane="c2n_1" arrivalPos="990.00" arrivalPosLat="0.00" arrivalSpeed="14.35" duration="163.55" routeLength="1997.01" waitingTime="17.10" waitingCount="1" stopTime="0.00" timeLoss="24.37" rerouteNo="1" devices="tripinfo_car_s2n_180 routing_car_s2n_180" vType="Car" speedFactor="1.03" vaporized=""/>
    <tripinfo id="car_n2s_185" depart="185.00" departLane="n2sep_1" departPos="3.60" departPosLat="0.00" departSpeed="13.90" departDelay="0.00" arrival="343.95" arrivalLane="c2s_1" arrivalPos="990.00" arrivalPosLat="0.00" arrivalSpeed="15.32" duration="158.95" routeLength="1997.01" waitingTime="18.00" waitingCount="1" stopTime="0.00" timeLoss="28.58" rerouteNo="1" devices="tripinfo_car_n2s_185 routing_car_n2s_185" vType="Car" speedFactor="1.10" vaporized=""/>
    <tripinfo id="car_n2w_150" depart="150.00" departLane="n2sep_1" departPos="3.60" departPosLat="0.00" departSpeed="13.90" departDelay="0.00" arrival="345.65" arrivalLane="c2w_1" arrivalPos="990.00" arrivalPosLat="0.00" arrivalSpeed="13.90" duration="195.65" routeLength="1986.69" waitingTime="44.85" waitingCount="1" stopTime="0.00" timeLoss="51.95" rerouteNo="1" devices="tripinfo_car_n2w_150 routing_car_n2w_150" vType="Car" speedFactor="1.00" vaporized=""/>
    <tripinfo id="car_s2n_198" depart="198.00" departLane="s2sep_1" departPos="3.60" departPosLat="0.00" departSpeed="13.90" departDelay="0.00" arrival="345.65" arrivalLane="c2n_1" arrivalPos="990.00" arrivalPosLat="0.00" arrivalSpeed="15.51" duration="147.65" routeLength="1997.01" waitingTime="6.35" waitingCount="1" stopTime="0.00" timeLoss="22.49" rerouteNo="1" devices="tripinfo_car_s2n_198 routing_car_s2n_198" vType="Car" speedFactor="1.15" vaporized=""/>
    <tripinfo id="car_n2w_162" depart="162.00" departLane="n2sep_1" departPos="3.60" departPosLat="0.00" departSpeed="13.90" departDelay="0.00" arrival="349.30" arrivalLane="c2w_1" arrivalPos="990.00" arrivalPosLat="0.00" arrivalSpeed="14.18" duration="187.30" routeLength="1986.69" waitingTime="35.25" waitingCount="1" stopTime="0.00" timeLoss="46.74" rerouteNo="1" devices="tripinfo_car_n2w_162 routing_car_n2w_162" vType="Car" speedFactor="1.02" vaporized=""/>
    <tripinfo id="car_n2e_169" depart="169.00" departLane="n2sep_1" departPos="3.60" departPosLat="0.00" departSpeed="13.90" departDelay="0.00" arrival="350.50" arrivalLane="c2e_1" arrivalPos="990.00" arrivalPosLat="0.00" arrivalSpeed="13.90" duration="181.50" routeLength="1996.47" waitingTime="26.10" waitingCount="2" stopTime="0.00" timeLoss="37.16" rerouteNo="1" devices="tripinfo_car_n2e_169 routing_car_n2e_169" vType="Car" speedFactor="1.00" vaporized=""/>
    <tripinfo id="car_n2s_194" depart="194.00" departLane="n2sep_1" departPos="3.60" departPosLat="0.00" departSpeed="13.90" departDelay="0.00" arrival="351.05" arrivalLane="c2s_1" arrivalPos="990.00" arrivalPosLat="0.00" arrivalSpeed="14.32" duration="157.05" routeLength="1997.01" waitingTime="6.15" waitingCount="1" stopTime="0.00" timeLoss="17.62" rerouteNo="1" devices="tripinfo_car_n2s_194 routing_car_n2s_194" vType="Car" speedFactor="1.03" vaporized=""/>
    <tripinfo id="car_n2e_179" depart="179.00" departLane="n2sep_1" departPos="3.60" departPosLat="0.00" departSpeed="13.90" departDelay="0.00" arrival="352.30" arrivalLane="c2e_1" arrivalPos="990.00" arrivalPosLat="0.00" arrivalSpeed="15.48" duration="173.30" routeLength="1996.47" waitingTime="24.75" waitingCount="1" stopTime="0.00" timeLoss="50.97" rerouteNo="1" devices="tripinfo_car_n2e_179 routing_car_n2e_179" vType="Car" speedFactor="1.18" vaporized=""/>
    <tripinfo id="car_n2s_211" depart="211.00" departLane="n2sep_1" departPos="3.60" departPosLat="0.00" departSpeed="13.90" departDelay="0.00" arrival="355.40" arrivalLane="c2s_1" arrivalPos="990.00" arrivalPosLat="0.00" arrivalSpeed="14.20" duration="144.40" routeLength="1997.01" waitingTime="0.00" waitingCount="0" stopTime="0.00" timeLoss="3.81" rerouteNo="1" devices="tripinfo_car_n2s_211 routing_car_n2s_211" vType="Car" speedFactor="1.02" vaporized=""/>
    <tripinfo id="car_n2w_215" depart="215.00" departLane="n2sep_1" departPos="3.60" departPosLat="0.00" departSpeed="13.90" departDelay="0.00" arrival="357.70" arrivalLane="c2w_1" arrivalPos="990.00" arrivalPosLat="0.00" arrivalSpeed="15.18" duration="142.70" routeLength="1986.69" waitingTime="0.00" waitingCount="0" stopTime="0.00" timeLoss="11.14" rerouteNo="1" devices="tripinfo_car_n2w_215 routing_car_n2w_215" vType="Car" speedFactor="1.09" vaporized=""/>
    <tripinfo id="car_s2e_216" depart="216.00" departLane="s2sep_1" departPos="3.60" departPosLat="0.00" departSpeed="13.90" departDelay="0.00" arrival="358.75" arrivalLane="c2e_1" arrivalPos="990.00" arrivalPosLat="0.00" arrivalSpeed="14.42" duration="142.75" routeLength="1986.69" waitingTime="0.00" waitingCount="0" stopTime="0.00" timeLoss="4.30" rerouteNo="1" devices="tripinfo_car_s2e_216 routing_car_s2e_216" vType="Car" speedFactor="1.04" vaporized=""/>
    <tripinfo id="car_n2s_213" depart="213.00" departLane="n2sep_1" departPos="3.60" departPosLat="0.00" departSpeed="13.90" departDelay="0.00" arrival="359.25" arrivalLane="c2s_1" arrivalPos="990.00" arrivalPosLat="0.00" arrivalSpeed="14.11" duration="146.25" routeLength="1997.01" waitingTime="0.00" waitingCount="0" stopTime="0.00" timeLoss="4.93" rerouteNo="1" devices="tripinfo_car_n2s_213 routing_car_n2s_213" vType="Car" speedFactor="1.02" vaporized=""/>
    <tripinfo id="car_s2e_228" depart="228.00" departLane="s2sep_1" departPos="3.60" departPosLat="0.00" departSpeed="13.90" departDelay="0.00" arrival="364.70" arrivalLane="c2e_1" arrivalPos="990.00" arrivalPosLat="0.00" arrivalSpeed="15.12" duration="136.70" routeLength="1986.69" waitingTime="0.00" waitingCount="0" stopTime="0.00" timeLoss="4.63" rerouteNo="1" devices="tripinfo_car_s2e_228 routing_car_s2e_228" vType="Car" speedFactor="1.09" vaporized=""/>
    <tripinfo id="car_n2w_224" depart="224.00" departLane="n2sep_1" departPos="3.60" departPosLat="0.00" departSpeed="13.90" departDelay="0.00" arrival="364.95" arrivalLane="c2w_1" arrivalPos="990.00" arrivalPosLat="0.00" arrivalSpeed="14.69" duration="140.95" routeLength="1986.69" waitingTime="0.00" waitingCount="0" stopTime="0.00" timeLoss="5.00" rerouteNo="1" devices="tripinfo_car_n2w_224 routing_car_n2w_224" vType="Car" speedFactor="1.06" vaporized=""/>
    <tripinfo id="car_s2e_235" depart="235.00" departLane="s2sep_1" departPos="3.60" departPosLat="0.00" departSpeed="13.90" departDelay="0.00" arrival="370.90" arrivalLane="c2e_1" arrivalPos="990.00" arrivalPosLat="0.00" arrivalSpeed="15.25" duration="135.90" routeLength="1986.69" waitingTime="0.00" waitingCount="0" stopTime="0.00" timeLoss="4.93" rerouteNo="1" devices="tripinfo_car_s2e_235 routing_car_s2e_235" vType="Car" speedFactor="1.10" vaporized=""/>
    <tripinfo id="car_e2n_186" depart="186.00" departLane="e2sep_1" departPos="3.60" departPosLat="0.00" departSpeed="13.90" departDelay="0.00" arrival="390.10" arrivalLane="c2n_1" arrivalPos="990.00" arrivalPosLat="0.00" arrivalSpeed="14.00" duration="204.10" routeLength="1986.69" waitingTime="55.20" waitingCount="1" stopTime="0.00" timeLoss="61.49" rerouteNo="1" devices="tripinfo_car_e2n_186 routing_car_e2n_186" vType="Car" speedFactor="1.01" vaporized=""/>
    <tripinfo id="car_e2w_192" depart="192.00" departLane="e2sep_1" departPos="3.60" departPosLat="0.00" departSpeed="13.90" departDelay="0.00" arrival="391.65" arrivalLane="c2w_1" arrivalPos="990.00" arrivalPosLat="0.00" arrivalSpeed="14.13" duration="199.65" routeLength="1997.01" waitingTime="48.45" waitingCount="1" stopTime="0.00" timeLoss="58.35" rerouteNo="1" devices="tripinfo_car_e2w_192 routing_car_e2w_192" vType="Car" speedFactor="1.02" vaporized=""/>
    <tripinfo id="car_w2s_191" depart="191.45" departLane="w2sep_1" departPos="3.60" departPosLat="0.00" departSpeed="13.90" departDelay="0.45" arrival="393.10" arrivalLane="c2s_1" arrivalPos="990.00" arrivalPosLat="0.00" arrivalSpeed="14.38" duration="201.65" routeLength="1986.69" waitingTime="48.95" waitingCount="1" stopTime="0.00" timeLoss="62.75" rerouteNo="1" devices="tripinfo_car_w2s_191 routing_car_w2s_191" vType="Car" speedFactor="1.03" vaporized=""/>
    <tripinfo id="bus_w2e_190" depart="190.00" departLane="w2sep_1" departPos="12.10" departPosLat="0.00" departSpeed="13.90" departDelay="0.00" arrival="394.20" arrivalLane="c2e_1" arrivalPos="990.00" arrivalPosLat="0.00" arrivalSpeed="13.90" duration="204.20" routeLength="1988.51" waitingTime="51.15" waitingCount="1" stopTime="0.00" timeLoss="61.13" rerouteNo="1" devices="tripinfo_bus_w2e_190 routing_bus_w2e_190" vType="Bus" speedFactor="1.00" vaporized=""/>
    <tripinfo id="car_e2w_223" depart="223.00" departLane="e2sep_1" departPos="3.60" departPosLat="0.00" departSpeed="13.90" departDelay="0.00" arrival="395.10" arrivalLane="c2w_1" arrivalPos="990.00" arrivalPosLat="0.00" arrivalSpeed="14.46" duration="172.10" routeLength="1997.01" waitingTime="21.70" waitingCount="1" stopTime="0.00" timeLoss="34.39" rerouteNo="1" devices="tripinfo_car_e2w_223 routing_car_e2w_223" vType="Car" speedFactor="1.04" vaporized=""/>
    <tripinfo id="car_e2n_226" depart="226.00" departLane="e2sep_1" departPos="3.60" departPosLat="0.00" departSpeed="13.90" departDelay="0.00" arrival="397.20" arrivalLane="c2n_1" arrivalPos="990.00" arrivalPosLat="0.00" arrivalSpeed="14.04" duration="171.20" routeLength="1986.69" waitingTime="17.15" waitingCount="1" stopTime="0.00" timeLoss="28.95" rerouteNo="1" devices="tripinfo_car_e2n_226 routing_car_e2n_226" vType="Car" speedFactor="1.01" vaporized=""/>
    <tripinfo id="car_w2e_192" depart="193.25" departLane="w2sep_1" departPos="3.60" departPosLat="0.00" departSpeed="13.90" departDelay="1.25" arrival="399.30" arrivalLane="c2e_1" arrivalPos="990.00" arrivalPosLat="0.00" arrivalSpeed="13.89" duration="206.05" routeLength="1997.01" waitingTime="46.30" waitingCount="1" stopTime="0.00" timeLoss="62.36" rerouteNo="1" devices="tripinfo_car_w2e_192 routing_car_w2e_192" vType="Car" speedFactor="1.00" vaporized=""/>
    <tripinfo id="car_w2s_230" depart="230.00" departLane="w2sep_1" departPos="3.60" departPosLat="0.00" departSpeed="13.90" departDelay="0.00" arrival="399.90" arrivalLane="c2s_1" arrivalPos="990.00" arrivalPosLat="0.00" arrivalSpeed="15.59" duration="169.90" routeLength="1986.69" waitingTime="25.65" waitingCount="1" stopTime="0.00" timeLoss="41.83" rerouteNo="1" devices="tripinfo_car_w2s_230 routing_car_w2s_230" vType="Car" speedFactor="1.12" vaporized=""/>
    <tripinfo id="car_e2w_250" depart="250.00" departLane="e2sep_1" departPos="3.60" departPosLat="0.00" departSpeed="13.90" departDelay="0.00" arrival="400.40" arrivalLane="c2w_1" arrivalPos="990.00" arrivalPosLat="0.00" arrivalSpeed="13.90" duration="150.40" routeLength="1997.01" waitingTime="0.00" waitingCount="0" stopTime="0.00" timeLoss="6.70" rerouteNo="1" devices="tripinfo_car_e2w_250 routing_car_e2w_250" vType="Car" speedFactor="1.00" vaporized=""/>
    <tripinfo id="car_e2w_267" depart="267.00" departLane="e2sep_1" departPos="3.60" departPosLat="0.00" departSpeed="13.90" departDelay="0.00" arrival="402.30" arrivalLane="c2w_1" arrivalPos="990.00" arrivalPosLat="0.00" arrivalSpeed="15.50" duration="135.30" routeLength="1997.01" waitingTime="0.00" waitingCount="0" stopTime="0.00" timeLoss="12.39" rerouteNo="1" devices="tripinfo_car_e2w_267 routing_car_e2w_267" vType="Car" speedFactor="1.17" vaporized=""/>
    <tripinfo id="car_w2n_200" depart="200.50" departLane="w2sep_1" departPos="3.60" departPosLat="0.00" departSpeed="13.90" departDelay="0.50" arrival="402.95" arrivalLane="c2n_1" arrivalPos="990.00" arrivalPosLat="0.00" arrivalSpeed="13.90" duration="202.45" routeLength="1996.47" waitingTime="42.70" waitingCount="2" stopTime="0.00" timeLoss="58.14" rerouteNo="1" devices="tripinfo_car_w2n_200 routing_car_w2n_200" vType="Car" speedFactor="1.00" vaporized=""/>
    <tripinfo id="bus_w2e_199" depart="199.00" departLane="w2sep_1" departPos="12.10" departPosLat="0.00" departSpeed="13.90" departDelay="0.00" arrival="403.10" arrivalLane="c2e_1" arrivalPos="990.00" arrivalPosLat="0.00" arrivalSpeed="13.80" duration="204.10" routeLength="1988.51" waitingTime="45.05" waitingCount="1" stopTime="0.00" timeLoss="61.02" rerouteNo="1" devices="tripinfo_bus_w2e_199 routing_bus_w2e_199" vType="Bus" speedFactor="1.00" vaporized=""/>
    <tripinfo id="car_w2s_278" depart="278.00" departLane="w2sep_1" departPos="3.60" departPosLat="0.00" departSpeed="13.90" departDelay="0.00" arrival="405.40" arrivalLane="c2s_1" arrivalPos="990.00" arrivalPosLat="0.00" arrivalSpeed="16.36" duration="127.40" routeLength="1986.69" waitingTime="0.00" waitingCount="0" stopTime="0.00" timeLoss="5.34" rerouteNo="1" devices="tripinfo_car_w2s_278 routing_car_w2s_278" vType="Car" speedFactor="1.18" vaporized=""/>
    <tripinfo id="car_w2e_206" depart="206.00" departLane="w2sep_1" departPos="3.60" departPosLat="0.00" departSpeed="13.90" departDelay="0.00" arrival="406.25" arrivalLane="c2e_1" arrivalPos="990.00" arrivalPosLat="0.00" arrivalSpeed="14.39" duration="200.25" routeLength="1997.01" waitingTime="37.10" waitingCount="1" stopTime="0.00" timeLoss="62.44" rerouteNo="1" devices="tripinfo_car_w2e_206 routing_car_w2e_206" vType="Car" speedFactor="1.04" vaporized=""/>
    <tripinfo id="car_w2n_202" depart="202.35" departLane="w2sep_1" departPos="3.60" departPosLat="0.00" departSpeed="13.90" departDelay="0.35" arrival="406.90" arrivalLane="c2n_1" arrivalPos="990.00" arrivalPosLat="0.00" arrivalSpeed="13.91" duration="204.55" routeLength="1996.47" waitingTime="39.80" waitingCount="2" stopTime="0.00" timeLoss="60.46" rerouteNo="1" devices="tripinfo_car_w2n_202 routing_car_w2n_202" vType="Car" speedFactor="1.00" vaporized=""/>
    <tripinfo id="car_w2e_224" depart="224.00" departLane="w2sep_1" departPos="3.60" departPosLat="0.00" departSpeed="13.90" departDelay="0.00" arrival="408.40" arrivalLane="c2e_1" arrivalPos="990.00" arrivalPosLat="0.00" arrivalSpeed="14.81" duration="184.40" routeLength="1997.01" waitingTime="29.00" waitingCount="1" stopTime="0.00" timeLoss="52.68" rerouteNo="1" devices="tripinfo_car_w2e_224 routing_car_w2e_224" vType="Car" speedFactor="1.09" vaporized=""/>
    <tripinfo id="car_w2n_236" depart="236.00" departLane="w2sep_1" departPos="3.60" departPosLat="0.00" departSpeed="13.90" departDelay="0.00" arrival="409.25" arrivalLane="c2n_1" arrivalPos="990.00" arrivalPosLat="0.00" arrivalSpeed="14.56" duration="173.25" routeLength="1996.47" waitingTime="13.45" waitingCount="2" stopTime="0.00" timeLoss="37.73" rerouteNo="1" devices="tripinfo_car_w2n_236 routing_car_w2n_236" vType="Car" speedFactor="1.07" vaporized=""/>
    <tripinfo id="amb_w2e_300" depart="300.00" departLane="w2sep_1" departPos="6.60" departPosLat="0.00" departSpeed="13.90" departDelay="0.00" arrival="411.30" arrivalLane="c2e_1" arrivalPos="990.00" arrivalPosLat="-0.95" arrivalSpeed="20.13" duration="111.30" routeLength="1994.01" waitingTime="0.00" waitingCount="0" stopTime="0.00" timeLoss="15.63" rerouteNo="1" devices="tripinfo_amb_w2e_300 routing_amb_w2e_300 bluelight_amb_w2e_300 fcd_amb_w2e_300" vType="Ambulance" speedFactor="1.50" vaporized="">
        <example_device customValue1="0.00" customValue2="-1.00"/>
    </tripinfo>
    <tripinfo id="car_w2e_244" depart="244.00" departLane="w2sep_1" departPos="3.60" departPosLat="0.00" departSpeed="13.90" departDelay="0.00" arrival="411.80" arrivalLane="c2e_1" arrivalPos="990.00" arrivalPosLat="1.10" arrivalSpeed="13.87" duration="167.80" routeLength="1997.01" waitingTime="6.30" waitingCount="1" stopTime="0.00" timeLoss="24.10" rerouteNo="1" devices="tripinfo_car_w2e_244 routing_car_w2e_244" vType="Car@car_w2e_244" speedFactor="1.00" vaporized=""/>
    <tripinfo id="car_w2n_246" depart="246.00" departLane="w2sep_1" departPos="3.60" departPosLat="0.00" departSpeed="13.90" departDelay="0.00" arrival="413.70" arrivalLane="c2n_1" arrivalPos="990.00" arrivalPosLat="0.00" arrivalSpeed="13.89" duration="167.70" routeLength="1996.47" waitingTime="2.85" waitingCount="1" stopTime="0.00" timeLoss="23.39" rerouteNo="1" devices="tripinfo_car_w2n_246 routing_car_w2n_246" vType="Car" speedFactor="1.00" vaporized=""/>
    <tripinfo id="car_e2s_209" depart="209.00" departLane="e2sep_1" departPos="3.60" departPosLat="0.00" departSpeed="13.90" departDelay="0.00" arrival="418.25" arrivalLane="c2s_1" arrivalPos="990.00" arrivalPosLat="0.00" arrivalSpeed="14.00" duration="209.25" routeLength="1996.47" waitingTime="54.75" waitingCount="3" stopTime="0.00" timeLoss="65.90" rerouteNo="1" devices="tripinfo_car_e2s_209 routing_car_e2s_209" vType="Car" speedFactor="1.01" vaporized=""/>
    <tripinfo id="car_e2s_262" depart="262.00" departLane="e2sep_1" departPos="3.60" departPosLat="0.00" departSpeed="13.90" departDelay="0.00" arrival="422.25" arrivalLane="c2s_1" arrivalPos="990.00" arrivalPosLat="0.00" arrivalSpeed="14.08" duration="160.25" routeLength="1996.47" waitingTime="7.40" waitingCount="1" stopTime="0.00" timeLoss="17.93" rerouteNo="1" devices="tripinfo_car_e2s_262 routing_car_e2s_262" vType="Car" speedFactor="1.01" vaporized=""/>
    <tripinfo id="car_w2e_282" depart="282.00" departLane="w2sep_1" departPos="3.60" departPosLat="0.00" departSpeed="13.90" departDelay="0.00" arrival="425.65" arrivalLane="c2e_1" arrivalPos="990.00" arrivalPosLat="1.10" arrivalSpeed="13.94" duration="143.65" routeLength="1997.01" waitingTime="0.00" waitingCount="0" stopTime="0.00" timeLoss="0.42" rerouteNo="1" devices="tripinfo_car_w2e_282 routing_car_w2e_282" vType="Car@car_w2e_282" speedFactor="1.00" vaporized=""/>
    <tripinfo id="car_w2e_285" depart="285.00" departLane="w2sep_1" departPos="3.60" departPosLat="0.00" departSpeed="13.90" departDelay="0.00" arrival="428.25" arrivalLane="c2e_1" arrivalPos="990.00" arrivalPosLat="1.10" arrivalSpeed="14.72" duration="143.25" routeLength="1997.01" waitingTime="0.00" waitingCount="0" stopTime="0.00" timeLoss="9.08" rerouteNo="1" devices="tripinfo_car_w2e_285 routing_car_w2e_285" vType="Car@car_w2e_285" speedFactor="1.07" vaporized=""/>
    <tripinfo id="car_e2n_298" depart="298.00" departLane="e2sep_1" departPos="3.60" departPosLat="0.00" departSpeed="13.90" departDelay="0.00" arrival="429.15" arrivalLane="c2n_1" arrivalPos="990.00" arrivalPosLat="0.00" arrivalSpeed="16.02" duration="131.15" routeLength="1986.69" waitingTime="0.00" waitingCount="0" stopTime="0.00" timeLoss="6.54" rerouteNo="1" devices="tripinfo_car_e2n_298 routing_car_e2n_298" vType="Car" speedFactor="1.15" vaporized=""/>
    <tripinfo id="car_e2s_264" depart="264.00" departLane="e2sep_1" departPos="3.60" departPosLat="0.00" departSpeed="13.90" departDelay="0.00" arrival="431.65" arrivalLane="c2s_1" arrivalPos="990.00" arrivalPosLat="0.00" arrivalSpeed="14.80" duration="167.65" routeLength="1996.47" waitingTime="17.35" waitingCount="1" stopTime="0.00" timeLoss="32.12" rerouteNo="1" devices="tripinfo_car_e2s_264 routing_car_e2s_264" vType="Car" speedFactor="1.06" vaporized=""/>
    <tripinfo id="car_e2s_279" depart="279.00" departLane="e2sep_1" departPos="3.60" departPosLat="0.00" departSpeed="13.90" departDelay="0.00" arrival="438.90" arrivalLane="c2s_1" arrivalPos="990.00" arrivalPosLat="0.00" arrivalSpeed="13.96" duration="159.90" routeLength="1996.47" waitingTime="6.20" waitingCount="1" stopTime="0.00" timeLoss="16.18" rerouteNo="1" devices="tripinfo_car_e2s_279 routing_car_e2s_279" vType="Car" speedFactor="1.00" vaporized=""/>
    <tripinfo id="car_e2s_291" depart="291.00" departLane="e2sep_1" departPos="3.60" departPosLat="0.00" departSpeed="13.90" departDelay="0.00" arrival="442.15" arrivalLane="c2s_1" arrivalPos="990.00" arrivalPosLat="0.00" arrivalSpeed="14.28" duration="151.15" routeLength="1996.47" waitingTime="0.00" waitingCount="0" stopTime="0.00" timeLoss="11.19" rerouteNo="1" devices="tripinfo_car_e2s_291 routing_car_e2s_291" vType="Car" speedFactor="1.03" vaporized=""/>
    <tripinfo id="car_n2s_275" depart="275.00" departLane="n2sep_1" departPos="3.60" departPosLat="0.00" departSpeed="13.90" departDelay="0.00" arrival="446.50" arrivalLane="c2s_1" arrivalPos="990.00" arrivalPosLat="0.00" arrivalSpeed="15.21" duration="171.50" routeLength="1997.01" waitingTime="31.50" waitingCount="1" stopTime="0.00" timeLoss="40.36" rerouteNo="1" devices="tripinfo_car_n2s_275 routing_car_n2s_275" vType="Car" speedFactor="1.10" vaporized=""/>
    <tripinfo id="car_s2e_251" depart="251.00" departLane="s2sep_1" departPos="3.60" departPosLat="0.00" departSpeed="13.90" departDelay="0.00" arrival="447.05" arrivalLane="c2e_1" arrivalPos="990.00" arrivalPosLat="0.00" arrivalSpeed="14.91" duration="196.05" routeLength="1986.69" waitingTime="54.65" waitingCount="1" stopTime="0.00" timeLoss="62.12" rerouteNo="1" devices="tripinfo_car_s2e_251 routing_car_s2e_251" vType="Car" speedFactor="1.07" vaporized=""/>
    <tripinfo id="car_s2e_274" depart="275.55" departLane="s2sep_1" departPos="3.60" departPosLat="0.00" departSpeed="13.90" departDelay="1.55" arrival="451.45" arrivalLane="c2e_1" arrivalPos="990.00" arrivalPosLat="0.00" arrivalSpeed="15.23" duration="175.90" routeLength="1986.69" waitingTime="26.05" waitingCount="1" stopTime="0.00" timeLoss="44.87" rerouteNo="1" devices="tripinfo_car_s2e_274 routing_car_s2e_274" vType="Car" speedFactor="1.10" vaporized=""/>
    <tripinfo id="car_n2s_298" depart="298.00" departLane="n2sep_1" departPos="3.60" departPosLat="0.00" departSpeed="13.90" departDelay="0.00" arrival="451.55" arrivalLane="c2s_1" arrivalPos="990.00" arrivalPosLat="0.00" arrivalSpeed="14.74" duration="153.55" routeLength="1997.01" waitingTime="7.75" waitingCount="1" stopTime="0.00" timeLoss="18.08" rerouteNo="1" devices="tripinfo_car_n2s_298 routing_car_n2s_298" vType="Car" speedFactor="1.06" vaporized=""/>
    <tripinfo id="car_s2n_274" depart="274.00" departLane="s2sep_1" departPos="3.60" departPosLat="0.00" departSpeed="13.90" departDelay="0.00" arrival="453.30" arrivalLane="c2n_1" arrivalPos="990.00" arrivalPosLat="0.00" arrivalSpeed="14.03" duration="179.30" routeLength="1997.01" waitingTime="26.95" waitingCount="1" stopTime="0.00" timeLoss="36.88" rerouteNo="1" devices="tripinfo_car_s2n_274 routing_car_s2n_274" vType="Car" speedFactor="1.01" vaporized=""/>
    <tripinfo id="car_s2e_316" depart="316.40" departLane="s2sep_1" departPos="3.60" departPosLat="0.00" departSpeed="13.90" departDelay="0.40" arrival="453.50" arrivalLane="c2e_1" arrivalPos="990.00" arrivalPosLat="0.00" arrivalSpeed="16.45" duration="137.10" routeLength="1986.69" waitingTime="0.00" waitingCount="0" stopTime="0.00" timeLoss="19.91" rerouteNo="1" devices="tripinfo_car_s2e_316 routing_car_s2e_316" vType="Car" speedFactor="1.23" vaporized=""/>
    <tripinfo id="car_n2w_299" depart="299.35" departLane="n2sep_1" departPos="3.60" departPosLat="0.00" departSpeed="13.90" departDelay="0.35" arrival="454.05" arrivalLane="c2w_1" arrivalPos="990.00" arrivalPosLat="0.00" arrivalSpeed="14.35" duration="154.70" routeLength="1986.69" waitingTime="4.05" waitingCount="1" stopTime="0.00" timeLoss="15.54" rerouteNo="1" devices="tripinfo_car_n2w_299 routing_car_n2w_299" vType="Car" speedFactor="1.03" vaporized=""/>
    <tripinfo id="car_n2s_305" depart="305.00" departLane="n2sep_1" departPos="3.60" departPosLat="0.00" departSpeed="13.90" departDelay="0.00" arrival="458.30" arrivalLane="c2s_1" arrivalPos="990.00" arrivalPosLat="0.00" arrivalSpeed="14.02" duration="153.30" routeLength="1997.01" waitingTime="0.00" waitingCount="0" stopTime="0.00" timeLoss="10.78" rerouteNo="1" devices="tripinfo_car_n2s_305 routing_car_n2s_305" vType="Car" speedFactor="1.01" vaporized=""/>
    <tripinfo id="car_n2w_324" depart="324.00" departLane="n2sep_1" departPos="3.60" departPosLat="0.00" departSpeed="13.90" departDelay="0.00" arrival="458.55" arrivalLane="c2w_1" arrivalPos="990.00" arrivalPosLat="0.00" arrivalSpeed="15.47" duration="134.55" routeLength="1986.69" waitingTime="0.00" waitingCount="0" stopTime="0.00" timeLoss="5.57" rerouteNo="1" devices="tripinfo_car_n2w_324 routing_car_n2w_324" vType="Car" speedFactor="1.11" vaporized=""/>
    <tripinfo id="car_s2n_288" depart="288.00" departLane="s2sep_1" departPos="3.60" departPosLat="0.00" departSpeed="13.90" departDelay="0.00" arrival="459.10" arrivalLane="c2n_1" arrivalPos="990.00" arrivalPosLat="0.00" arrivalSpeed="13.90" duration="171.10" routeLength="1997.01" waitingTime="16.30" waitingCount="1" stopTime="0.00" timeLoss="27.43" rerouteNo="1" devices="tripinfo_car_s2n_288 routing_car_s2n_288" vType="Car" speedFactor="1.00" vaporized=""/>
    <tripinfo id="car_s2n_304" depart="304.00" departLane="s2sep_1" departPos="3.60" departPosLat="0.00" departSpeed="13.90" departDelay="0.00" arrival="461.20" arrivalLane="c2n_1" arrivalPos="990.00" arrivalPosLat="0.00" arrivalSpeed="15.07" duration="157.20" routeLength="1997.01" waitingTime="7.85" waitingCount="1" stopTime="0.00" timeLoss="28.70" rerouteNo="1" devices="tripinfo_car_s2n_304 routing_car_s2n_304" vType="Car" speedFactor="1.12" vaporized=""/>
    <tripinfo id="bus_n2s_306" depart="307.10" departLane="n2sep_1" departPos="12.10" departPosLat="0.00" departSpeed="13.90" departDelay="1.10" arrival="463.00" arrivalLane="c2s_1" arrivalPos="990.00" arrivalPosLat="0.00" arrivalSpeed="13.86" duration="155.90" routeLength="1988.51" waitingTime="0.00" waitingCount="0" stopTime="0.00" timeLoss="12.82" rerouteNo="1" devices="tripinfo_bus_n2s_306 routing_bus_n2s_306" vType="Bus" speedFactor="1.00" vaporized=""/>
    <tripinfo id="car_n2s_325" depart="325.30" departLane="n2sep_1" departPos="3.60" departPosLat="0.00" departSpeed="13.90" departDelay="0.30" arrival="465.40" arrivalLane="c2s_1" arrivalPos="990.00" arrivalPosLat="0.00" arrivalSpeed="15.57" duration="140.10" routeLength="1997.01" waitingTime="0.00" waitingCount="0" stopTime="0.00" timeLoss="16.67" rerouteNo="1" devices="tripinfo_car_n2s_325 routing_car_n2s_325" vType="Car" speedFactor="1.16" vaporized=""/>
    <tripinfo id="car_s2e_317" depart="318.00" departLane="s2sep_1" departPos="3.60" departPosLat="0.00" departSpeed="13.90" departDelay="1.00" arrival="465.80" arrivalLane="c2e_1" arrivalPos="990.00" arrivalPosLat="0.00" arrivalSpeed="14.11" duration="147.80" routeLength="1986.69" waitingTime="0.00" waitingCount="0" stopTime="0.00" timeLoss="6.30" rerouteNo="1" devices="tripinfo_car_s2e_317 routing_car_s2e_317" vType="Car" speedFactor="1.02" vaporized=""/>
    <tripinfo id="car_n2w_328" depart="328.00" departLane="n2sep_1" departPos="3.60" departPosLat="0.00" departSpeed="13.90" departDelay="0.00" arrival="466.95" arrivalLane="c2w_1" arrivalPos="990.00" arrivalPosLat="0.00" arrivalSpeed="15.05" duration="138.95" routeLength="1986.69" waitingTime="0.00" waitingCount="0" stopTime="0.00" timeLoss="6.20" rerouteNo="1" devices="tripinfo_car_n2w_328 routing_car_n2w_328" vType="Car" speedFactor="1.08" vaporized=""/>
    <tripinfo id="car_s2n_318" depart="319.80" departLane="s2sep_1" departPos="3.60" departPosLat="0.00" departSpeed="13.90" departDelay="1.80" arrival="468.45" arrivalLane="c2n_1" arrivalPos="990.00" arrivalPosLat="0.00" arrivalSpeed="13.95" duration="148.65" routeLength="1997.01" waitingTime="0.00" waitingCount="0" stopTime="0.00" timeLoss="5.52" rerouteNo="1" devices="tripinfo_car_s2n_318 routing_car_s2n_318" vType="Car" speedFactor="1.00" vaporized=""/>
</tripinfos>
