<?xml version="1.0" encoding="UTF-8"?>

<!-- generated on Sat Apr 24 18:11:33 2021 by Eclipse SUMO Version 1.4.0
<configuration xmlns:xsi="http://www.w3.org/2001/XMLSchema-instance" xsi:noNamespaceSchemaLocation="http://sumo.dlr.de/xsd/sumoConfiguration.xsd">

    <input>
        <net-file value="sumofiles/junction.net.xml"/>
        <route-files value="sumofiles/junction_preemption_74.rou.xml"/>
        <additional-files value="sumofiles/junction.det.xml"/>
    </input>

    <output>
        <tripinfo-output value="sumofiles/output/tripinfo_preemption_74.xml"/>
    </output>

    <time>
        <begin value="0"/>
        <end value="10000"/>
        <step-length value="0.05"/>
    </time>

    <processing>
        <lateral-resolution value="0.1"/>
    </processing>

    <report>
        <no-warnings value="true"/>
        <error-log value="sumofiles/output/errorlog_preemption_74.log"/>
        <no-step-log value="true"/>
    </report>

    <traci_server>
        <remote-port value="54297"/>
    </traci_server>

    <gui_only>
        <gui-settings-file value="sumofiles/junction-gui.settings.xml"/>
        <tracker-interval value="0.05"/>
    </gui_only>

</configuration>
-->

<tripinfos xmlns:xsi="http://www.w3.org/2001/XMLSchema-instance" xsi:noNamespaceSchemaLocation="http://sumo.dlr.de/xsd/tripinfo_file.xsd">
    <tripinfo id="car_e2n_0" depart="0.00" departLane="e2sep_1" departPos="3.60" departPosLat="0.00" departSpeed="13.90" departDelay="0.00" arrival="139.30" arrivalLane="c2n_1" arrivalPos="990.00" arrivalPosLat="0.00" arrivalSpeed="14.73" duration="139.30" routeLength="1986.69" waitingTime="0.00" waitingCount="0" stopTime="0.00" timeLoss="3.74" rerouteNo="1" devices="tripinfo_car_e2n_0 routing_car_e2n_0" vType="Car" speedFactor="1.06" vaporized=""/>
    <tripinfo id="car_w2n_1" depart="1.00" departLane="w2sep_1" departPos="3.60" departPosLat="0.00" departSpeed="13.90" departDelay="0.00" arrival="143.55" arrivalLane="c2n_1" arrivalPos="990.00" arrivalPosLat="0.00" arrivalSpeed="14.72" duration="142.55" routeLength="1996.47" waitingTime="0.00" waitingCount="0" stopTime="0.00" timeLoss="6.35" rerouteNo="1" devices="tripinfo_car_w2n_1 routing_car_w2n_1" vType="Car" speedFactor="1.06" vaporized=""/>
    <tripinfo id="car_e2s_10" depart="10.00" departLane="e2sep_1" departPos="3.60" departPosLat="0.00" departSpeed="13.90" departDelay="0.00" arrival="157.60" arrivalLane="c2s_1" arrivalPos="990.00" arrivalPosLat="0.00" arrivalSpeed="13.90" duration="147.60" routeLength="1996.47" waitingTime="0.00" waitingCount="0" stopTime="0.00" timeLoss="3.28" rerouteNo="1" devices="tripinfo_car_e2s_10 routing_car_e2s_10" vType="Car" speedFactor="1.00" vaporized=""/>
    <tripinfo id="car_s2e_4" depart="4.00" departLane="s2sep_1" departPos="3.60" departPosLat="0.00" departSpeed="13.90" departDelay="0.00" arrival="160.30" arrivalLane="c2e_1" arrivalPos="990.00" arrivalPosLat="0.00" arrivalSpeed="15.05" duration="156.30" routeLength="1986.69" waitingTime="16.05" waitingCount="1" stopTime="0.00" timeLoss="23.61" rerouteNo="1" devices="tripinfo_car_s2e_4 routing_car_s2e_4" vType="Car" speedFactor="1.08" vaporized=""/>
    <tripinfo id="car_n2s_28" depart="28.00" departLane="n2sep_1" departPos="3.60" departPosLat="0.00" departSpeed="13.90" departDelay="0.00" arrival="162.20" arrivalLane="c2s_1" arrivalPos="990.00" arrivalPosLat="0.00" arrivalSpeed="15.59" duration="134.20" routeLength="1997.01" waitingTime="0.00" waitingCount="0" stopTime="0.00" timeLoss="6.24" rerouteNo="1" devices="tripinfo_car_n2s_28 routing_car_n2s_28" vType="Car" speedFactor="1.12" vaporized=""/>
    <tripinfo id="car_w2n_16" depart="16.00" departLane="w2sep_1" departPos="3.60" departPosLat="0.00" departSpeed="13.90" departDelay="0.00" arrival="162.40" arrivalLane="c2n_1" arrivalPos="990.00" arrivalPosLat="0.00" arrivalSpeed="14.04" duration="146.40" routeLength="1996.47" waitingTime="0.00" waitingCount="0" stopTime="0.00" timeLoss="3.55" rerouteNo="1" devices="tripinfo_car_w2n_16 routing_car_w2n_16" vType="Car" speedFactor="1.01" vaporized=""/>
    <tripinfo id="car_n2w_22" depart="22.00" departLane="n2sep_1" departPos="3.60" departPosLat="0.00" departSpeed="13.90" departDelay="0.00" arrival="165.95" arrivalLane="c2w_1" arrivalPos="990.00" arrivalPosLat="0.00" arrivalSpeed="14.27" duration="143.95" routeLength="1986.69" waitingTime="0.00" waitingCount="0" stopTime="0.00" timeLoss="3.97" rerouteNo="1" devices="tripinfo_car_n2w_22 routing_car_n2w_22" vType="Car" speedFactor="1.03" vaporized=""/>
    <tripinfo id="car_n2e_1" depart="1.00" departLane="n2sep_1" departPos="3.60" departPosLat="0.00" departSpeed="13.90" departDelay="0.00" arrival="167.85" arrivalLane="c2e_1" arrivalPos="990.00" arrivalPosLat="0.00" arrivalSpeed="14.04" duration="166.85" routeLength="1996.47" waitingTime="14.65" waitingCount="1" stopTime="0.00" timeLoss="24.00" rerouteNo="1" devices="tripinfo_car_n2e_1 routing_car_n2e_1" vType="Car" speedFactor="1.01" vaporized=""/>
    <tripinfo id="car_s2w_19" depart="19.00" departLane="s2sep_1" departPos="3.60" departPosLat="0.00" departSpeed="13.90" departDelay="0.00" arrival="168.90" arrivalLane="c2w_1" arrivalPos="990.00" arrivalPosLat="0.00" arrivalSpeed="15.06" duration="149.90" routeLength="1996.47" waitingTime="3.65" waitingCount="2" stopTime="0.00" timeLoss="17.55" rerouteNo="1" devices="tripinfo_car_s2w_19 routing_car_s2w_19" vType="Car" speedFactor="1.09" vaporized=""/>
    <tripinfo id="car_s2w_22" depart="22.00" departLane="s2sep_1" departPos="3.60" departPosLat="0.00" departSpeed="13.90" departDelay="0.00" arrival="173.30" arrivalLane="c2w_1" arrivalPos="990.00" arrivalPosLat="0.00" arrivalSpeed="14.54" duration="151.30" routeLength="1996.47" waitingTime="1.35" waitingCount="1" stopTime="0.00" timeLoss="13.44" rerouteNo="1" devices="tripinfo_car_s2w_22 routing_car_s2w_22" vType="Car" speedFactor="1.05" vaporized=""/>
    <tripinfo id="car_n2s_40" depart="40.00" departLane="n2sep_1" departPos="3.60" departPosLat="0.00" departSpeed="13.90" departDelay="0.00" arrival="183.85" arrivalLane="c2s_1" arrivalPos="990.00" arrivalPosLat="0.00" arrivalSpeed="13.90" duration="143.85" routeLength="1997.01" waitingTime="0.00" waitingCount="0" stopTime="0.00" timeLoss="0.16" rerouteNo="1" devices="tripinfo_car_n2s_40 routing_car_n2s_40" vType="Car" speedFactor="1.00" vaporized=""/>
    <tripinfo id="car_s2w_50" depart="50.00" departLane="s2sep_1" departPos="3.60" departPosLat="0.00" departSpeed="13.90" departDelay="0.00" arrival="187.30" arrivalLane="c2w_1" arrivalPos="990.00" arrivalPosLat="0.00" arrivalSpeed="16.10" duration="137.30" routeLength="1996.47" waitingTime="0.00" waitingCount="0" stopTime="0.00" timeLoss="12.69" rerouteNo="1" devices="tripinfo_car_s2w_50 routing_car_s2w_50" vType="Car" speedFactor="1.16" vaporized=""/>
    <tripinfo id="car_s2e_48" depart="48.00" departLane="s2sep_1" departPos="3.60" departPosLat="0.00" departSpeed="13.90" departDelay="0.00" arrival="195.15" arrivalLane="c2e_1" arrivalPos="990.00" arrivalPosLat="0.00" arrivalSpeed="13.90" duration="147.15" routeLength="1986.69" waitingTime="0.00" waitingCount="0" stopTime="0.00" timeLoss="3.51" rerouteNo="1" devices="tripinfo_car_s2e_48 routing_car_s2e_48" vType="Car" speedFactor="1.00" vaporized=""/>
    <tripinfo id="car_n2e_64" depart="64.00" departLane="n2sep_1" departPos="3.60" departPosLat="0.00" departSpeed="13.90" departDelay="0.00" arrival="200.55" arrivalLane="c2e_1" arrivalPos="990.00" arrivalPosLat="0.00" arrivalSpeed="15.15" duration="136.55" routeLength="1996.47" waitingTime="0.00" waitingCount="0" stopTime="0.00" timeLoss="4.20" rerouteNo="1" devices="tripinfo_car_n2e_64 routing_car_n2e_64" vType="Car" speedFactor="1.09" vaporized=""/>
    <tripinfo id="car_e2n_11" depart="11.45" departLane="e2sep_1" departPos="3.60" departPosLat="0.00" departSpeed="13.90" departDelay="0.45" arrival="207.55" arrivalLane="c2n_1" arrivalPos="990.00" arrivalPosLat="0.00" arrivalSpeed="14.54" duration="196.10" routeLength="1986.69" waitingTime="47.45" waitingCount="1" stopTime="0.00" timeLoss="58.75" rerouteNo="1" devices="tripinfo_car_e2n_11 routing_car_e2n_11" vType="Car" speedFactor="1.05" vaporized=""/>
    <tripinfo id="car_w2e_18" depart="18.00" departLane="w2sep_1" departPos="3.60" departPosLat="0.00" departSpeed="13.90" departDelay="0.00" arrival="207.85" arrivalLane="c2e_1" arrivalPos="990.00" arrivalPosLat="0.00" arrivalSpeed="15.05" duration="189.85" routeLength="1997.01" waitingTime="43.30" waitingCount="1" stopTime="0.00" timeLoss="57.14" rerouteNo="1" devices="tripinfo_car_w2e_18 routing_car_w2e_18" vType="Car" speedFactor="1.08" vaporized=""/>
    <tripinfo id="car_w2s_8" depart="8.00" departLane="w2sep_1" departPos="3.60" departPosLat="0.00" departSpeed="13.90" departDelay="0.00" arrival="208.60" arrivalLane="c2s_1" arrivalPos="990.00" arrivalPosLat="0.00" arrivalSpeed="14.32" duration="200.60" routeLength="1986.69" waitingTime="54.20" waitingCount="1" stopTime="0.00" timeLoss="61.15" rerouteNo="1" devices="tripinfo_car_w2s_8 routing_car_w2s_8" vType="Car" speedFactor="1.03" vaporized=""/>
    <tripinfo id="car_e2n_18" depart="18.00" departLane="e2sep_1" departPos="3.60" departPosLat="0.00" departSpeed="13.90" departDelay="0.00" arrival="212.70" arrivalLane="c2n_1" arrivalPos="990.00" arrivalPosLat="0.00" arrivalSpeed="14.32" duration="194.70" routeLength="1986.69" waitingTime="44.05" waitingCount="1" stopTime="0.00" timeLoss="55.24" rerouteNo="1" devices="tripinfo_car_e2n_18 routing_car_e2n_18" vType="Car" speedFactor="1.03" vaporized=""/>
    <tripinfo id="car_w2e_31" depart="31.00" departLane="w2sep_1" departPos="3.60" departPosLat="0.00" departSpeed="13.90" departDelay="0.00" arrival="215.80" arrivalLane="c2e_1" arrivalPos="990.00" arrivalPosLat="0.00" arrivalSpeed="13.90" duration="184.80" routeLength="1997.01" waitingTime="31.00" waitingCount="1" stopTime="0.00" timeLoss="41.10" rerouteNo="1" devices="tripinfo_car_w2e_31 routing_car_w2e_31" vType="Car" speedFactor="1.00" vaporized=""/>
    <tripinfo id="car_e2n_65" depart="65.00" departLane="e2sep_1" departPos="3.60" departPosLat="0.00" departSpeed="13.90" departDelay="0.00" arrival="216.60" arrivalLane="c2n_1" arrivalPos="990.00" arrivalPosLat="0.00" arrivalSpeed="14.25" duration="151.60" routeLength="1986.69" waitingTime="0.00" waitingCount="0" stopTime="0.00" timeLoss="11.61" rerouteNo="1" devices="tripinfo_car_e2n_65 routing_car_e2n_65" vType="Car" speedFactor="1.03" vaporized=""/>
    <tripinfo id="car_w2s_66" depart="66.00" departLane="w2sep_1" departPos="3.60" departPosLat="0.00" departSpeed="13.90" departDelay="0.00" arrival="218.40" arrivalLane="c2s_1" arrivalPos="990.00" arrivalPosLat="0.00" arrivalSpeed="14.55" duration="152.40" routeLength="1986.69" waitingTime="2.70" waitingCount="1" stopTime="0.00" timeLoss="15.19" rerouteNo="1" devices="tripinfo_car_w2s_66 routing_car_w2s_66" vType="Car" speedFactor="1.05" vaporized=""/>
    <tripinfo id="car_w2n_36" depart="36.00" departLane="w2sep_1" departPos="3.60" departPosLat="0.00" departSpeed="13.90" departDelay="0.00" arrival="219.55" arrivalLane="c2n_1" arrivalPos="990.00" arrivalPosLat="0.00" arrivalSpeed="14.46" duration="183.55" routeLength="1996.47" waitingTime="29.25" waitingCount="2" stopTime="0.00" timeLoss="45.55" rerouteNo="1" devices="tripinfo_car_w2n_36 routing_car_w2n_36" vType="Car" speedFactor="1.05" vaporized=""/>
    <tripinfo id="car_w2e_45" depart="45.00" departLane="w2sep_1" departPos="3.60" departPosLat="0.00" departSpeed="13.90" departDelay="0.00" arrival="219.85" arrivalLane="c2e_1" arrivalPos="990.00" arrivalPosLat="0.00" arrivalSpeed="13.89" duration="174.85" routeLength="1997.01" waitingTime="18.15" waitingCount="1" stopTime="0.00" timeLoss="31.15" rerouteNo="1" devices="tripinfo_car_w2e_45 routing_car_w2e_45" vType="Car" speedFactor="1.00" vaporized=""/>
    <tripinfo id="car_w2s_82" depart="82.00" departLane="w2sep_1" departPos="3.60" departPosLat="0.00" departSpeed="13.90" departDelay="0.00" arrival="220.45" arrivalLane="c2s_1" arrivalPos="990.00" arrivalPosLat="0.00" arrivalSpeed="15.82" duration="138.45" routeLength="1986.69" waitingTime="0.00" waitingCount="0" stopTime="0.00" timeLoss="16.54" rerouteNo="1" devices="tripinfo_car_w2s_82 routing_car_w2s_82" vType="Car" speedFactor="1.18" vaporized=""/>
    <tripinfo id="car_w2e_53" depart="53.00" departLane="w2sep_1" departPos="3.60" departPosLat="0.00" departSpeed="13.90" departDelay="0.00" arrival="223.00" arrivalLane="c2e_1" arrivalPos="990.00" arrivalPosLat="0.00" arrivalSpeed="13.99" duration="170.00" routeLength="1997.01" waitingTime="12.05" waitingCount="1" stopTime="0.00" timeLoss="27.74" rerouteNo="1" devices="tripinfo_car_w2e_53 routing_car_w2e_53" vType="Car" speedFactor="1.01" vaporized=""/>
    <tripinfo id="car_e2s_51" depart="51.00" departLane="e2sep_1" departPos="3.60" departPosLat="0.00" departSpeed="13.90" departDelay="0.00" arrival="226.60" arrivalLane="c2s_1" arrivalPos="990.00" arrivalPosLat="0.00" arrivalSpeed="14.15" duration="175.60" routeLength="1996.47" waitingTime="21.80" waitingCount="2" stopTime="0.00" timeLoss="33.82" rerouteNo="1" devices="tripinfo_car_e2s_51 routing_car_e2s_51" vType="Car" speedFactor="1.02" vaporized=""/>
    <tripinfo id="car_e2s_72" depart="72.00" departLane="e2sep_1" departPos="3.60" departPosLat="0.00" departSpeed="13.90" departDelay="0.00" arrival="228.75" arrivalLane="c2s_1" arrivalPos="990.00" arrivalPosLat="0.00" arrivalSpeed="15.21" duration="156.75" routeLength="1996.47" waitingTime="10.55" waitingCount="1" stopTime="0.00" timeLoss="28.21" rerouteNo="1" devices="tripinfo_car_e2s_72 routing_car_e2s_72" vType="Car" speedFactor="1.12" vaporized=""/>
    <tripinfo id="car_w2n_90" depart="90.00" departLane="w2sep_1" departPos="3.60" departPosLat="0.00" departSpeed="13.90" departDelay="0.00" arrival="237.60" arrivalLane="c2n_1" arrivalPos="990.00" arrivalPosLat="0.00" arrivalSpeed="13.90" duration="147.60" routeLength="1996.47" waitingTime="0.00" waitingCount="0" stopTime="0.00" timeLoss="3.29" rerouteNo="1" devices="tripinfo_car_w2n_90 routing_car_w2n_90" vType="Car" speedFactor="1.00" vaporized=""/>
    <tripinfo id="car_w2s_95" depart="95.00" departLane="w2sep_1" departPos="3.60" departPosLat="0.00" departSpeed="13.90" departDelay="0.00" arrival="240.55" arrivalLane="c2s_1" arrivalPos="990.00" arrivalPosLat="0.00" arrivalSpeed="14.17" duration="145.55" routeLength="1986.69" waitingTime="0.00" waitingCount="0" stopTime="0.00" timeLoss="4.65" rerouteNo="1" devices="tripinfo_car_w2s_95 routing_car_w2s_95" vType="Car" speedFactor="1.02" vaporized=""/>
    <tripinfo id="car_s2n_86" depart="86.50" departLane="s2sep_1" departPos="3.60" departPosLat="0.00" departSpeed="13.90" departDelay="0.50" arrival="247.75" arrivalLane="c2n_1" arrivalPos="990.00" arrivalPosLat="0.00" arrivalSpeed="16.29" duration="161.25" routeLength="1997.01" waitingTime="19.05" waitingCount="1" stopTime="0.00" timeLoss="38.64" rerouteNo="1" devices="tripinfo_car_s2n_86 routing_car_s2n_86" vType="Car" speedFactor="1.17" vaporized=""/>
    <tripinfo id="car_s2e_78" depart="78.00" departLane="s2sep_1" departPos="3.60" departPosLat="0.00" departSpeed="13.90" departDelay="0.00" arrival="255.65" arrivalLane="c2e_1" arrivalPos="990.00" arrivalPosLat="0.00" arrivalSpeed="13.90" duration="177.65" routeLength="1986.69" waitingTime="26.35" waitingCount="1" stopTime="0.00" timeLoss="33.96" rerouteNo="1" devices="tripinfo_car_s2e_78 routing_car_s2e_78" vType="Car" speedFactor="1.00" vaporized=""/>
    <tripinfo id="car_s2w_73" depart="73.00" departLane="s2sep_1" departPos="3.60" departPosLat="0.00" departSpeed="13.90" departDelay="0.00" arrival="256.75" arrivalLane="c2w_1" arrivalPos="990.00" arrivalPosLat="0.00" arrivalSpeed="13.90" duration="183.75" routeLength="1996.47" waitingTime="32.05" waitingCount="1" stopTime="0.00" timeLoss="39.44" rerouteNo="1" devices="tripinfo_car_s2w_73 routing_car_s2w_73" vType="Car" speedFactor="1.00" vaporized=""/>
    <tripinfo id="car_s2w_79" depart="79.50" departLane="s2sep_1" departPos="3.60" departPosLat="0.00" departSpeed="13.90" departDelay="0.50" arrival="258.80" arrivalLane="c2w_1" arrivalPos="990.00" arrivalPosLat="0.00" arrivalSpeed="15.20" duration="179.30" routeLength="1996.47" waitingTime="25.75" waitingCount="1" stopTime="0.00" timeLoss="51.77" rerouteNo="1" devices="tripinfo_car_s2w_79 routing_car_s2w_79" vType="Car" speedFactor="1.13" vaporized=""/>
    <tripinfo id="car_n2e_80" depart="80.00" departLane="n2sep_1" departPos="3.60" departPosLat="0.00" departSpeed="13.90" departDelay="0.00" arrival="261.45" arrivalLane="c2e_1" arrivalPos="990.00" arrivalPosLat="0.00" arrivalSpeed="13.90" duration="181.45" routeLength="1996.47" waitingTime="25.50" waitingCount="2" stopTime="0.00" timeLoss="37.12" rerouteNo="1" devices="tripinfo_car_n2e_80 routing_car_n2e_80" vType="Car" speedFactor="1.00" vaporized=""/>
    <tripinfo id="car_s2w_85" depart="85.00" departLane="s2sep_1" departPos="3.60" departPosLat="0.00" departSpeed="13.90" departDelay="0.00" arrival="263.30" arrivalLane="c2w_1" arrivalPos="990.00" arrivalPosLat="0.00" arrivalSpeed="13.96" duration="178.30" routeLength="1996.47" waitingTime="21.65" waitingCount="1" stopTime="0.00" timeLoss="34.70" rerouteNo="1" devices="tripinfo_car_s2w_85 routing_car_s2w_85" vType="Car" speedFactor="1.01" vaporized=""/>
    <tripinfo id="car_n2e_84" depart="84.00" departLane="n2sep_1" departPos="3.60" departPosLat="0.00" departSpeed="13.90" departDelay="0.00" arrival="263.35" arrivalLane="c2e_1" arrivalPos="990.00" arrivalPosLat="0.00" arrivalSpeed="15.31" duration="179.35" routeLength="1996.47" waitingTime="24.05" waitingCount="1" stopTime="0.00" timeLoss="54.32" rerouteNo="1" devices="tripinfo_car_n2e_84 routing_car_n2e_84" vType="Car" speedFactor="1.15" vaporized=""/>
    <tripinfo id="car_s2w_97" depart="97.00" departLane="s2sep_1" departPos="3.60" departPosLat="0.00" departSpeed="13.90" departDelay="0.00" arrival="265.10" arrivalLane="c2w_1" arrivalPos="990.00" arrivalPosLat="0.00" arrivalSpeed="15.45" duration="168.10" routeLength="1996.47" waitingTime="19.50" waitingCount="1" stopTime="0.00" timeLoss="45.75" rerouteNo="1" devices="tripinfo_car_s2w_97 routing_car_s2w_97" vType="Car" speedFactor="1.18" vaporized=""/>
    <tripinfo id="car_n2e_102" depart="102.00" departLane="n2sep_1" departPos="3.60" departPosLat="0.00" departSpeed="13.90" departDelay="0.00" arrival="265.30" arrivalLane="c2e_1" arrivalPos="990.00" arrivalPosLat="0.00" arrivalSpeed="15.47" duration="163.30" routeLength="1996.47" waitingTime="14.00" waitingCount="1" stopTime="0.00" timeLoss="38.67" rerouteNo="1" devices="tripinfo_car_n2e_102 routing_car_n2e_102" vType="Car" speedFactor="1.16" vaporized=""/>
    <tripinfo id="car_s2n_126" depart="126.00" departLane="s2sep_1" departPos="3.60" departPosLat="0.00" departSpeed="13.90" departDelay="0.00" arrival="269.95" arrivalLane="c2n_1" arrivalPos="990.00" arrivalPosLat="0.00" arrivalSpeed="13.90" duration="143.95" routeLength="1997.01" waitingTime="0.00" waitingCount="0" stopTime="0.00" timeLoss="0.25" rerouteNo="1" devices="tripinfo_car_s2n_126 routing_car_s2n_126" vType="Car" speedFactor="1.00" vaporized=""/>
    <tripinfo id="car_n2w_124" depart="124.00" departLane="n2sep_1" departPos="3.60" departPosLat="0.00" departSpeed="13.90" departDelay="0.00" arrival="270.60" arrivalLane="c2w_1" arrivalPos="990.00" arrivalPosLat="0.00" arrivalSpeed="14.04" duration="146.60" routeLength="1986.69" waitingTime="0.00" waitingCount="0" stopTime="0.00" timeLoss="4.34" rerouteNo="1" devices="tripinfo_car_n2w_124 routing_car_n2w_124" vType="Car" speedFactor="1.01" vaporized=""/>
    <tripinfo id="car_n2s_138" depart="138.00" departLane="n2sep_1" departPos="3.60" departPosLat="0.00" departSpeed="13.90" departDelay="0.00" arrival="272.40" arrivalLane="c2s_1" arrivalPos="990.00" arrivalPosLat="0.00" arrivalSpeed="15.23" duration="134.40" routeLength="1997.01" waitingTime="0.00" waitingCount="0" stopTime="0.00" timeLoss="3.27" rerouteNo="1" devices="tripinfo_car_n2s_138 routing_car_n2s_138" vType="Car" speedFactor="1.10" vaporized=""/>
    <tripinfo id="car_n2w_125" depart="125.45" departLane="n2sep_1" departPos="3.60" departPosLat="0.00" departSpeed="13.90" departDelay="0.45" arrival="276.10" arrivalLane="c2w_1" arrivalPos="990.00" arrivalPosLat="0.00" arrivalSpeed="13.90" duration="150.65" routeLength="1986.69" waitingTime="0.00" waitingCount="0" stopTime="0.00" timeLoss="6.97" rerouteNo="1" devices="tripinfo_car_n2w_125 routing_car_n2w_125" vType="Car" speedFactor="1.00" vaporized=""/>
    <tripinfo id="car_n2e_133" depart="133.00" departLane="n2sep_1" departPos="3.60" departPosLat="0.00" departSpeed="13.90" departDelay="0.00" arrival="279.15" arrivalLane="c2e_1" arrivalPos="990.00" arrivalPosLat="0.00" arrivalSpeed="14.13" duration="146.15" routeLength="1996.47" waitingTime="0.00" waitingCount="0" stopTime="0.00" timeLoss="4.22" rerouteNo="1" devices="tripinfo_car_n2e_133 routing_car_n2e_133" vType="Car" speedFactor="1.02" vaporized=""/>
    <tripinfo id="car_s2w_144" depart="144.00" departLane="s2sep_1" departPos="3.60" departPosLat="0.00" departSpeed="13.90" departDelay="0.00" arrival="288.55" arrivalLane="c2w_1" arrivalPos="990.00" arrivalPosLat="0.00" arrivalSpeed="14.23" duration="144.55" routeLength="1996.47" waitingTime="0.00" waitingCount="0" stopTime="0.00" timeLoss="3.52" rerouteNo="1" devices="tripinfo_car_s2w_144 routing_car_s2w_144" vType="Car" speedFactor="1.02" vaporized=""/>
    <tripinfo id="car_w2s_100" depart="100.00" departLane="w2sep_1" departPos="3.60" departPosLat="0.00" departSpeed="13.90" departDelay="0.00" arrival="294.20" arrivalLane="c2s_1" arrivalPos="990.00" arrivalPosLat="0.00" arrivalSpeed="15.32" duration="194.20" routeLength="1986.69" waitingTime="53.15" waitingCount="1" stopTime="0.00" timeLoss="63.87" rerouteNo="1" devices="tripinfo_car_w2s_100 routing_car_w2s_100" vType="Car" speedFactor="1.10" vaporized=""/>
    <tripinfo id="car_e2n_96" depart="96.00" departLane="e2sep_1" departPos="3.60" departPosLat="0.00" departSpeed="13.90" departDelay="0.00" arrival="300.65" arrivalLane="c2n_1" arrivalPos="990.00" arrivalPosLat="0.00" arrivalSpeed="13.90" duration="204.65" routeLength="1986.69" waitingTime="54.55" waitingCount="1" stopTime="0.00" timeLoss="60.96" rerouteNo="1" devices="tripinfo_car_e2n_96 routing_car_e2n_96" vType="Car" speedFactor="1.00" vaporized=""/>
    <tripinfo id="car_w2e_110" depart="110.00" departLane="w2sep_1" departPos="3.60" departPosLat="0.00" departSpeed="13.90" departDelay="0.00" arrival="301.55" arrivalLane="c2e_1" arrivalPos="990.00" arrivalPosLat="0.00" arrivalSpeed="14.15" duration="191.55" routeLength="1997.01" waitingTime="42.10" waitingCount="1" stopTime="0.00" timeLoss="50.44" rerouteNo="1" devices="tripinfo_car_w2e_110 routing_car_w2e_110" vType="Car" speedFactor="1.02" vaporized=""/>
    <tripinfo id="car_e2w_143" depart="143.00" departLane="e2sep_1" departPos="3.60" departPosLat="0.00" departSpeed="13.90" departDelay="0.00" arrival="303.50" arrivalLane="c2w_1" arrivalPos="990.00" arrivalPosLat="0.00" arrivalSpeed="15.88" duration="160.50" routeLength="1997.01" waitingTime="16.10" waitingCount="1" stopTime="0.00" timeLoss="34.72" rerouteNo="1" devices="tripinfo_car_e2w_143 routing_car_e2w_143" vType="Car" speedFactor="1.14" vaporized=""/>
    <tripinfo id="car_e2n_103" depart="103.00" departLane="e2sep_1" departPos="3.60" departPosLat="0.00" departSpeed="13.90" departDelay="0.00" arrival="304.05" arrivalLane="c2n_1" arrivalPos="990.00" arrivalPosLat="0.00" arrivalSpeed="14.28" duration="201.05" routeLength="1986.69" waitingTime="49.60" waitingCount="1" stopTime="0.00" timeLoss="61.61" rerouteNo="1" devices="tripinfo_car_e2n_103 routing_car_e2n_103" vType="Car" speedFactor="1.03" vaporized=""/>
    <tripinfo id="car_w2e_112" depart="112.00" departLane="w2sep_1" departPos="3.60" departPosLat="0.00" departSpeed="13.90" departDelay="0.00" arrival="304.10" arrivalLane="c2e_1" arrivalPos="990.00" arrivalPosLat="0.00" arrivalSpeed="14.99" duration="192.10" routeLength="1997.01" waitingTime="41.05" waitingCount="1" stopTime="0.00" timeLoss="60.50" rerouteNo="1" devices="tripinfo_car_w2e_112 routing_car_w2e_112" vType="Car" speedFactor="1.09" vaporized=""/>
    <tripinfo id="car_e2w_167" depart="167.00" departLane="e2sep_1" departPos="3.60" departPosLat="0.00" departSpeed="13.90" departDelay="0.00" arrival="306.75" arrivalLane="c2w_1" arrivalPos="990.00" arrivalPosLat="0.00" arrivalSpeed="16.22" duration="139.75" routeLength="1997.01" waitingTime="0.00" waitingCount="0" stopTime="0.00" timeLoss="17.14" rerouteNo="1" devices="tripinfo_car_e2w_167 routing_car_e2w_167" vType="Car" speedFactor="1.17" vaporized=""/>
    <tripinfo id="car_e2n_116" depart="116.00" departLane="e2sep_1" departPos="3.60" departPosLat="0.00" departSpeed="13.90" departDelay="0.00" arrival="307.10" arrivalLane="c2n_1" arrivalPos="990.00" arrivalPosLat="0.00" arrivalSpeed="14.36" duration="191.10" routeLength="1986.69" waitingTime="38.45" waitingCount="1" stopTime="0.00" timeLoss="52.66" rerouteNo="1" devices="tripinfo_car_e2n_116 routing_car_e2n_116" vType="Car" speedFactor="1.04" vaporized=""/>
    <tripinfo id="car_e2n_132" depart="132.00" departLane="e2sep_1" departPos="3.60" departPosLat="0.00" departSpeed="13.90" departDelay="0.00" arrival="308.95" arrivalLane="c2n_1" arrivalPos="990.00" arrivalPosLat="0.00" arrivalSpeed="15.46" duration="176.95" routeLength="1986.69" waitingTime="30.40" waitingCount="1" stopTime="0.00" timeLoss="54.04" rerouteNo="1" devices="tripinfo_car_e2n_132 routing_car_e2n_132" vType="Car" speedFactor="1.17" vaporized=""/>
    <tripinfo id="car_w2e_141" depart="141.00" departLane="w2sep_1" departPos="3.60" departPosLat="0.00" departSpeed="13.90" departDelay="0.00" arrival="309.05" arrivalLane="c2e_1" arrivalPos="990.00" arrivalPosLat="0.00" arrivalSpeed="13.90" duration="168.05" routeLength="1997.01" waitingTime="12.05" waitingCount="1" stopTime="0.00" timeLoss="24.36" rerouteNo="1" devices="tripinfo_car_w2e_141 routing_car_w2e_141" vType="Car" speedFactor="1.00" vaporized=""/>
    <tripinfo id="car_w2s_141" depart="142.45" departLane="w2sep_1" departPos="3.60" departPosLat="0.00" departSpeed="13.90" departDelay="1.45" arrival="309.55" arrivalLane="c2s_1" arrivalPos="990.00" arrivalPosLat="0.00" arrivalSpeed="13.90" duration="167.10" routeLength="1986.69" waitingTime="9.65" waitingCount="1" stopTime="0.00" timeLoss="23.42" rerouteNo="1" devices="tripinfo_car_w2s_141 routing_car_w2s_141" vType="Car" speedFactor="1.00" vaporized=""/>
    <tripinfo id="car_w2e_164" depart="164.00" departLane="w2sep_1" departPos="3.60" departPosLat="0.00" departSpeed="13.90" departDelay="0.00" arrival="310.95" arrivalLane="c2e_1" arrivalPos="990.00" arrivalPosLat="0.00" arrivalSpeed="15.30" duration="146.95" routeLength="1997.01" waitingTime="0.00" waitingCount="0" stopTime="0.00" timeLoss="22.46" rerouteNo="1" devices="tripinfo_car_w2e_164 routing_car_w2e_164" vType="Car" speedFactor="1.15" vaporized=""/>
    <tripinfo id="car_e2s_123" depart="123.00" departLane="e2sep_1" departPos="3.60" departPosLat="0.00" departSpeed="13.90" departDelay="0.00" arrival="312.00" arrivalLane="c2s_1" arrivalPos="990.00" arrivalPosLat="0.00" arrivalSpeed="14.90" duration="189.00" routeLength="1996.47" waitingTime="40.80" waitingCount="2" stopTime="0.00" timeLoss="56.34" rerouteNo="1" devices="tripinfo_car_e2s_123 routing_car_e2s_123" vType="Car" speedFactor="1.09" vaporized=""/>
    <tripinfo id="car_e2n_138" depart="138.00" departLane="e2sep_1" departPos="3.60" departPosLat="0.00" departSpeed="13.90" departDelay="0.00" arrival="312.85" arrivalLane="c2n_1" arrivalPos="990.00" arrivalPosLat="0.00" arrivalSpeed="13.93" duration="174.85" routeLength="1986.69" waitingTime="16.70" waitingCount="1" stopTime="0.00" timeLoss="31.65" rerouteNo="1" devices="tripinfo_car_e2n_138 routing_car_e2n_138" vType="Car" speedFactor="1.00" vaporized=""/>
    <tripinfo id="car_w2n_118" depart="118.00" departLane="w2sep_1" departPos="3.60" departPosLat="0.00" departSpeed="13.90" departDelay="0.00" arrival="315.90" arrivalLane="c2n_1" arrivalPos="990.00" arrivalPosLat="0.00" arrivalSpeed="14.43" duration="197.90" routeLength="1996.47" waitingTime="45.60" waitingCount="2" stopTime="0.00" timeLoss="59.57" rerouteNo="1" devices="tripinfo_car_w2n_118 routing_car_w2n_118" vType="Car" speedFactor="1.04" vaporized=""/>
    <tripinfo id="car_w2n_126" depart="126.00" departLane="w2sep_1" departPos="3.60" departPosLat="0.00" departSpeed="13.90" departDelay="0.00" arrival="320.70" arrivalLane="c2n_1" arrivalPos="990.00" arrivalPosLat="0.00" arrivalSpeed="13.89" duration="194.70" routeLength="1996.47" waitingTime="35.35" waitingCount="2" stopTime="0.00" timeLoss="50.36" rerouteNo="1" devices="tripinfo_car_w2n_126 routing_car_w2n_126" vType="Car" speedFactor="1.00" vaporized=""/>
    <tripinfo id="car_w2n_132" depart="132.00" departLane="w2sep_1" departPos="3.60" departPosLat="0.00" departSpeed="13.90" departDelay="0.00" arrival="324.45" arrivalLane="c2n_1" arrivalPos="990.00" arrivalPosLat="0.00" arrivalSpeed="13.88" duration="192.45" routeLength="1996.47" waitingTime="27.90" waitingCount="2" stopTime="0.00" timeLoss="48.10" rerouteNo="1" devices="tripinfo_car_w2n_132 routing_car_w2n_132" vType="Car" speedFactor="1.00" vaporized=""/>
    <tripinfo id="car_w2n_154" depart="154.00" departLane="w2sep_1" departPos="3.60" departPosLat="0.00" departSpeed="13.90" departDelay="0.00" arrival="327.40" arrivalLane="c2n_1" arrivalPos="990.00" arrivalPosLat="0.00" arrivalSpeed="14.04" duration="173.40" routeLength="1996.47" waitingTime="7.55" waitingCount="1" stopTime="0.00" timeLoss="31.31" rerouteNo="1" devices="tripinfo_car_w2n_154 routing_car_w2n_154" vType="Car" speedFactor="1.02" vaporized=""/>
    <tripinfo id="car_w2n_172" depart="172.00" departLane="w2sep_1" departPos="3.60" departPosLat="0.00" departSpeed="13.90" departDelay="0.00" arrival="330.15" arrivalLane="c2n_1" arrivalPos="990.00" arrivalPosLat="0.00" arrivalSpeed="14.11" duration="158.15" routeLength="1996.47" waitingTime="0.95" waitingCount="1" stopTime="0.00" timeLoss="17.04" rerouteNo="1" devices="tripinfo_car_w2n_172 routing_car_w2n_172" vType="Car" speedFactor="1.02" vaporized=""/>
    <tripinfo id="car_e2s_188" depart="188.00" departLane="e2sep_1" departPos="3.60" departPosLat="0.00" departSpeed="13.90" departDelay="0.00" arrival="331.20" arrivalLane="c2s_1" arrivalPos="990.00" arrivalPosLat="0.00" arrivalSpeed="14.35" duration="143.20" routeLength="1996.47" waitingTime="0.00" waitingCount="0" stopTime="0.00" timeLoss="3.41" rerouteNo="1" devices="tripinfo_car_e2s_188 routing_car_e2s_188" vType="Car" speedFactor="1.03" vaporized=""/>
    <tripinfo id="car_w2n_179" depart="179.00" departLane="w2sep_1" departPos="3.60" departPosLat="0.00" departSpeed="13.90" departDelay="0.00" arrival="333.20" arrivalLane="c2n_1" arrivalPos="990.00" arrivalPosLat="0.00" arrivalSpeed="13.84" duration="154.20" routeLength="1996.47" waitingTime="0.00" waitingCount="0" stopTime="0.00" timeLoss="9.85" rerouteNo="1" devices="tripinfo_car_w2n_179 routing_car_w2n_179" vType="Car" speedFactor="1.00" vaporized=""/>
    <tripinfo id="car_w2n_186" depart="186.00" departLane="w2sep_1" departPos="3.60" departPosLat="0.00" departSpeed="13.90" departDelay="0.00" arrival="334.90" arrivalLane="c2n_1" arrivalPos="990.00" arrivalPosLat="0.00" arrivalSpeed="15.25" duration="148.90" routeLength="1996.47" waitingTime="0.00" waitingCount="0" stopTime="0.00" timeLoss="26.57" rerouteNo="1" devices="tripinfo_car_w2n_186 routing_car_w2n_186" vType="Car" speedFactor="1.18" vaporized=""/>
    <tripinfo id="car_e2s_197" depart="197.00" departLane="e2sep_1" departPos="3.60" departPosLat="0.00" departSpeed="13.90" departDelay="0.00" arrival="335.10" arrivalLane="c2s_1" arrivalPos="990.00" arrivalPosLat="0.00" arrivalSpeed="15.08" duration="138.10" routeLength="1996.47" waitingTime="0.00" waitingCount="0" stopTime="0.00" timeLoss="5.31" rerouteNo="1" devices="tripinfo_car_e2s_197 routing_car_e2s_197" vType="Car" speedFactor="1.09" vaporized=""/>
    <tripinfo id="car_s2e_148" depart="148.00" departLane="s2sep_1" departPos="3.60" departPosLat="0.00" departSpeed="13.90" departDelay="0.00" arrival="337.55" arrivalLane="c2e_1" arrivalPos="990.00" arrivalPosLat="0.00" arrivalSpeed="15.73" duration="189.55" routeLength="1986.69" waitingTime="51.00" waitingCount="1" stopTime="0.00" timeLoss="62.63" rerouteNo="1" devices="tripinfo_car_s2e_148 routing_car_s2e_148" vType="Car" speedFactor="1.13" vaporized=""/>
    <tripinfo id="car_n2w_157" depart="157.00" departLane="n2sep_1" departPos="3.60" departPosLat="0.00" departSpeed="13.90" departDelay="0.00" arrival="339.65" arrivalLane="c2w_1" arrivalPos="990.00" arrivalPosLat="0.00" arrivalSpeed="16.38" duration="182.65" routeLength="1986.69" waitingTime="39.90" waitingCount="1" stopTime="0.00" timeLoss="60.73" rerouteNo="1" devices="tripinfo_car_n2w_157 routing_car_n2w_157" vType="Car" speedFactor="1.18" vaporized=""/>
    <tripinfo id="car_n2s_151" depart="151.00" departLane="n2sep_1" departPos="3.60" departPosLat="0.00" departSpeed="13.90" departDelay="0.00" arrival="341.00" arrivalLane="c2s_1" arrivalPos="990.00" arrivalPosLat="0.00" arrivalSpeed="15.04" duration="190.00" routeLength="1997.01" waitingTime="49.50" waitingCount="1" stopTime="0.00" timeLoss="57.27" rerouteNo="1" devices="tripinfo_car_n2s_151 routing_car_n2s_151" vType="Car" speedFactor="1.08" vaporized=""/>
    <tripinfo id="car_s2e_153" depart="153.00" departLane="s2sep_1" departPos="3.60" departPosLat="0.00" departSpeed="13.90" departDelay="0.00" arrival="342.30" arrivalLane="c2e_1" arrivalPos="990.00" arrivalPosLat="0.00" arrivalSpeed="15.55" duration="189.30" routeLength="1986.69" waitingTime="48.90" waitingCount="1" stopTime="0.00" timeLoss="60.95" rerouteNo="1" devices="tripinfo_car_s2e_153 routing_car_s2e_153" vType="Car" speedFactor="1.12" vaporized=""/>
    <tripinfo id="car_n2s_155" depart="155.00" departLane="n2sep_1" departPos="3.60" departPosLat="0.00" departSpeed="13.90" departDelay="0.00" arrival="348.75" arrivalLane="c2s_1" arrivalPos="990.00" arrivalPosLat="0.00" arrivalSpeed="13.90" duration="193.75" routeLength="1997.01" waitingTime="40.60" waitingCount="1" stopTime="0.00" timeLoss="50.08" rerouteNo="1" devices="tripinfo_car_n2s_155 routing_car_n2s_155" vType="Car" speedFactor="1.00" vaporized=""/>
    <tripinfo id="car_s2e_171" depart="171.40" departLane="s2sep_1" departPos="3.60" departPosLat="0.00" departSpeed="13.90" departDelay="0.40" arrival="350.05" arrivalLane="c2e_1" arrivalPos="990.00" arrivalPosLat="0.00" arrivalSpeed="14.21" duration="178.65" routeLength="1986.69" waitingTime="24.95" waitingCount="1" stopTime="0.00" timeLoss="38.10" rerouteNo="1" devices="tripinfo_car_s2e_171 routing_car_s2e_171" vType="Car" speedFactor="1.02" vaporized=""/>
    <tripinfo id="car_n2w_164" depart="164.00" departLane="n2sep_1" departPos="3.60" departPosLat="0.00" departSpeed="13.90" departDelay="0.00" arrival="352.55" arrivalLane="c2w_1" arrivalPos="990.00" arrivalPosLat="0.00" arrivalSpeed="13.97" duration="188.55" routeLength="1986.69" waitingTime="34.30" waitingCount="1" stopTime="0.00" timeLoss="45.59" rerouteNo="1" devices="tripinfo_car_n2w_164 routing_car_n2w_164" vType="Car" speedFactor="1.01" vaporized=""/>
    <tripinfo id="car_n2s_181" depart="181.00" departLane="n2sep_1" departPos="3.60" departPosLat="0.00" departSpeed="13.90" departDelay="0.00" arrival="353.85" arrivalLane="c2s_1" arrivalPos="990.00" arrivalPosLat="0.00" arrivalSpeed="14.17" duration="172.85" routeLength="1997.01" waitingTime="19.75" waitingCount="1" stopTime="0.00" timeLoss="31.93" rerouteNo="1" devices="tripinfo_car_n2s_181 routing_car_n2s_181" vType="Car" speedFactor="1.02" vaporized=""/>
    <tripinfo id="car_s2e_183" depart="183.35" departLane="s2sep_1" departPos="3.60" departPosLat="0.00" departSpeed="13.90" departDelay="0.35" arrival="355.05" arrivalLane="c2e_1" arrivalPos="990.00" arrivalPosLat="0.00" arrivalSpeed="13.90" duration="171.70" routeLength="1986.69" waitingTime="13.35" waitingCount="1" stopTime="0.00" timeLoss="28.03" rerouteNo="1" devices="tripinfo_car_s2e_183 routing_car_s2e_183" vType="Car" speedFactor="1.00" vaporized=""/>
    <tripinfo id="car_n2s_190" depart="190.00" departLane="n2sep_1" departPos="3.60" departPosLat="0.00" departSpeed="13.90" departDelay="0.00" arrival="356.15" arrivalLane="c2s_1" arrivalPos="990.00" arrivalPosLat="0.00" arrivalSpeed="15.03" duration="166.15" routeLength="1997.01" waitingTime="16.65" waitingCount="1" stopTime="0.00" timeLoss="35.78" rerouteNo="1" devices="tripinfo_car_n2s_190 routing_car_n2s_190" vType="Car" speedFactor="1.10" vaporized=""/>
    <tripinfo id="car_s2e_210" depart="210.00" departLane="s2sep_1" departPos="3.60" departPosLat="0.00" departSpeed="13.90" departDelay="0.00" arrival="358.00" arrivalLane="c2e_1" arrivalPos="990.00" arrivalPosLat="0.00" arrivalSpeed="14.24" duration="148.00" routeLength="1986.69" waitingTime="0.00" waitingCount="0" stopTime="0.00" timeLoss="8.57" rerouteNo="1" devices="tripinfo_car_s2e_210 routing_car_s2e_210" vType="Car" speedFactor="1.03" vaporized=""/>
    <tripinfo id="car_n2w_214" depart="214.00" departLane="n2sep_1" departPos="3.60" departPosLat="0.00" departSpeed="13.90" departDelay="0.00" arrival="361.65" arrivalLane="c2w_1" arrivalPos="990.00" arrivalPosLat="0.00" arrivalSpeed="13.92" duration="147.65" routeLength="1986.69" waitingTime="0.00" waitingCount="0" stopTime="0.00" timeLoss="4.22" rerouteNo="1" devices="tripinfo_car_n2w_214 routing_car_n2w_214" vType="Car" speedFactor="1.00" vaporized=""/>
    <tripinfo id="car_s2w_170" depart="170.00" departLane="s2sep_1" departPos="3.60" departPosLat="0.00" departSpeed="13.90" departDelay="0.00" arrival="364.85" arrivalLane="c2w_1" arrivalPos="990.00" arrivalPosLat="0.00" arrivalSpeed="14.40" duration="194.85" routeLength="1996.47" waitingTime="42.20" waitingCount="2" stopTime="0.00" timeLoss="56.08" rerouteNo="1" devices="tripinfo_car_s2w_170 routing_car_s2w_170" vType="Car" speedFactor="1.04" vaporized=""/>
    <tripinfo id="car_s2w_182" depart="182.00" departLane="s2sep_1" departPos="3.60" departPosLat="0.00" departSpeed="13.90" departDelay="0.00" arrival="367.70" arrivalLane="c2w_1" arrivalPos="990.00" arrivalPosLat="0.00" arrivalSpeed="14.57" duration="185.70" routeLength="1996.47" waitingTime="30.80" waitingCount="2" stopTime="0.00" timeLoss="48.97" rerouteNo="1" devices="tripinfo_car_s2w_182 routing_car_s2w_182" vType="Car" speedFactor="1.06" vaporized=""/>
    <tripinfo id="car_s2w_190" depart="190.00" departLane="s2sep_1" departPos="3.60" departPosLat="0.00" departSpeed="13.90" departDelay="0.00" arrival="371.65" arrivalLane="c2w_1" arrivalPos="990.00" arrivalPosLat="0.00" arrivalSpeed="13.99" duration="181.65" routeLength="1996.47" waitingTime="18.15" waitingCount="2" stopTime="0.00" timeLoss="38.36" rerouteNo="1" devices="tripinfo_car_s2w_190 routing_car_s2w_190" vType="Car" speedFactor="1.01" vaporized=""/>
    <tripinfo id="car_w2e_200" depart="200.00" departLane="w2sep_1" departPos="3.60" departPosLat="0.00" departSpeed="13.90" departDelay="0.00" arrival="388.40" arrivalLane="c2e_1" arrivalPos="990.00" arrivalPosLat="0.00" arrivalSpeed="14.38" duration="188.40" routeLength="1997.01" waitingTime="42.30" waitingCount="1" stopTime="0.00" timeLoss="49.49" rerouteNo="1" devices="tripinfo_car_w2e_200 routing_car_w2e_200" vType="Car" speedFactor="1.03" vaporized=""/>
    <tripinfo id="car_w2e_212" depart="212.00" departLane="w2sep_1" departPos="3.60" departPosLat="0.00" departSpeed="13.90" departDelay="0.00" arrival="390.55" arrivalLane="c2e_1" arrivalPos="990.00" arrivalPosLat="0.00" arrivalSpeed="15.53" duration="178.55" routeLength="1997.01" waitingTime="37.30" waitingCount="1" stopTime="0.00" timeLoss="53.36" rerouteNo="1" devices="tripinfo_car_w2e_212 routing_car_w2e_212" vType="Car" speedFactor="1.15" vaporized=""/>
    <tripinfo id="car_e2w_204" depart="204.00" departLane="e2sep_1" departPos="3.60" departPosLat="0.00" departSpeed="13.90" departDelay="0.00" arrival="390.75" arrivalLane="c2w_1" arrivalPos="990.00" arrivalPosLat="0.00" arrivalSpeed="13.90" duration="186.75" routeLength="1997.01" waitingTime="35.85" waitingCount="1" stopTime="0.00" timeLoss="43.06" rerouteNo="1" devices="tripinfo_car_e2w_204 routing_car_e2w_204" vType="Car" speedFactor="1.00" vaporized=""/>
    <tripinfo id="car_e2n_206" depart="206.00" departLane="e2sep_1" departPos="3.60" departPosLat="0.00" departSpeed="13.90" departDelay="0.00" arrival="391.80" arrivalLane="c2n_1" arrivalPos="990.00" arrivalPosLat="0.00" arrivalSpeed="14.13" duration="185.80" routeLength="1986.69" waitingTime="33.45" waitingCount="1" stopTime="0.00" timeLoss="44.49" rerouteNo="1" devices="tripinfo_car_e2n_206 routing_car_e2n_206" vType="Car" speedFactor="1.02" vaporized=""/>
    <tripinfo id="car_e2w_222" depart="222.00" departLane="e2sep_1" departPos="3.60" departPosLat="0.00" departSpeed="13.90" departDelay="0.00" arrival="394.10" arrivalLane="c2w_1" arrivalPos="990.00" arrivalPosLat="0.00" arrivalSpeed="14.45" duration="172.10" routeLength="1997.01" waitingTime="22.70" waitingCount="1" stopTime="0.00" timeLoss="34.31" rerouteNo="1" devices="tripinfo_car_e2w_222 routing_car_e2w_222" vType="Car" speedFactor="1.04" vaporized=""/>
    <tripinfo id="car_w2s_242" depart="242.00" departLane="w2sep_1" departPos="3.60" departPosLat="0.00" departSpeed="13.90" departDelay="0.00" arrival="395.80" arrivalLane="c2s_1" arrivalPos="990.00" arrivalPosLat="0.00" arrivalSpeed="14.21" duration="153.80" routeLength="1986.69" waitingTime="1.50" waitingCount="1" stopTime="0.00" timeLoss="13.19" rerouteNo="1" devices="tripinfo_car_w2s_242 routing_car_w2s_242" vType="Car" speedFactor="1.02" vaporized=""/>
    <tripinfo id="car_w2e_213" depart="213.25" departLane="w2sep_1" departPos="3.60" departPosLat="0.00" departSpeed="13.90" departDelay="0.25" arrival="396.40" arrivalLane="c2e_1" arrivalPos="990.00" arrivalPosLat="0.00" arrivalSpeed="13.90" duration="183.15" routeLength="1997.01" waitingTime="27.95" waitingCount="1" stopTime="0.00" timeLoss="39.47" rerouteNo="1" devices="tripinfo_car_w2e_213 routing_car_w2e_213" vType="Car" speedFactor="1.00" vaporized=""/>
    <tripinfo id="car_e2w_256" depart="256.00" departLane="e2sep_1" departPos="3.60" departPosLat="0.00" departSpeed="13.90" departDelay="0.00" arrival="396.55" arrivalLane="c2w_1" arrivalPos="990.00" arrivalPosLat="0.00" arrivalSpeed="14.96" duration="140.55" routeLength="1997.01" waitingTime="0.00" waitingCount="0" stopTime="0.00" timeLoss="8.94" rerouteNo="1" devices="tripinfo_car_e2w_256 routing_car_e2w_256" vType="Car" speedFactor="1.09" vaporized=""/>
    <tripinfo id="bus_w2n_234" depart="234.00" departLane="w2sep_1" departPos="12.10" departPosLat="0.00" departSpeed="13.90" departDelay="0.00" arrival="403.20" arrivalLane="c2n_1" arrivalPos="990.00" arrivalPosLat="0.00" arrivalSpeed="13.90" duration="169.20" routeLength="1987.97" waitingTime="10.25" waitingCount="2" stopTime="0.00" timeLoss="25.50" rerouteNo="1" devices="tripinfo_bus_w2n_234 routing_bus_w2n_234" vType="Bus" speedFactor="1.00" vaporized=""/>
    <tripinfo id="car_w2n_236" depart="236.00" departLane="w2sep_1" departPos="3.60" departPosLat="0.00" departSpeed="13.90" departDelay="0.00" arrival="407.75" arrivalLane="c2n_1" arrivalPos="990.00" arrivalPosLat="0.00" arrivalSpeed="13.99" duration="171.75" routeLength="1996.47" waitingTime="6.80" waitingCount="2" stopTime="0.00" timeLoss="28.42" rerouteNo="1" devices="tripinfo_car_w2n_236 routing_car_w2n_236" vType="Car" speedFactor="1.01" vaporized=""/>
    <tripinfo id="car_w2n_270" depart="270.45" departLane="w2sep_1" departPos="3.60" departPosLat="0.00" departSpeed="13.90" departDelay="0.45" arrival="411.05" arrivalLane="c2n_1" arrivalPos="990.00" arrivalPosLat="0.00" arrivalSpeed="15.51" duration="140.60" routeLength="1996.47" waitingTime="0.00" waitingCount="0" stopTime="0.00" timeLoss="11.92" rerouteNo="1" devices="tripinfo_car_w2n_270 routing_car_w2n_270" vType="Car" speedFactor="1.12" vaporized=""/>
    <tripinfo id="amb_w2e_300" depart="300.00" departLane="w2sep_1" departPos="6.60" departPosLat="0.00" departSpeed="13.90" departDelay="0.00" arrival="411.20" arrivalLane="c2e_1" arrivalPos="990.00" arrivalPosLat="-0.95" arrivalSpeed="20.44" duration="111.20" routeLength="1994.01" waitingTime="0.00" waitingCount="0" stopTime="0.00" timeLoss="15.53" rerouteNo="1" devices="tripinfo_amb_w2e_300 routing_amb_w2e_300 bluelight_amb_w2e_300 fcd_amb_w2e_300" vType="Ambulance" speedFactor="1.50" vaporized="">
        <example_device customValue1="0.00" customValue2="-1.00"/>
    </tripinfo>
    <tripinfo id="car_w2e_269" depart="269.00" departLane="w2sep_1" departPos="3.60" departPosLat="0.00" departSpeed="13.90" departDelay="0.00" arrival="411.50" arrivalLane="c2e_1" arrivalPos="990.00" arrivalPosLat="1.10" arrivalSpeed="14.04" duration="142.50" routeLength="1997.01" waitingTime="0.00" waitingCount="0" stopTime="0.00" timeLoss="0.24" rerouteNo="1" devices="tripinfo_car_w2e_269 routing_car_w2e_269" vType="Car@car_w2e_269" speedFactor="1.01" vaporized=""/>
    <tripinfo id="car_w2s_270" depart="272.15" departLane="w2sep_1" departPos="3.60" departPosLat="0.00" departSpeed="13.90" departDelay="2.15" arrival="413.55" arrivalLane="c2s_1" arrivalPos="990.00" arrivalPosLat="0.00" arrivalSpeed="15.25" duration="141.40" routeLength="1986.69" waitingTime="0.00" waitingCount="0" stopTime="0.00" timeLoss="10.45" rerouteNo="1" devices="tripinfo_car_w2s_270 routing_car_w2s_270" vType="Car" speedFactor="1.10" vaporized=""/>
    <tripinfo id="bus_w2s_273" depart="274.70" departLane="w2sep_1" departPos="12.10" departPosLat="0.00" departSpeed="13.90" departDelay="1.70" arrival="426.55" arrivalLane="c2s_1" arrivalPos="990.00" arrivalPosLat="0.00" arrivalSpeed="13.90" duration="151.85" routeLength="1978.19" waitingTime="0.00" waitingCount="0" stopTime="0.00" timeLoss="8.77" rerouteNo="1" devices="tripinfo_bus_w2s_273 routing_bus_w2s_273" vType="Bus" speedFactor="1.00" vaporized=""/>
    <tripinfo id="car_w2s_276" depart="276.40" departLane="w2sep_1" departPos="3.60" departPosLat="0.00" departSpeed="13.90" departDelay="0.40" arrival="431.45" arrivalLane="c2s_1" arrivalPos="990.00" arrivalPosLat="0.00" arrivalSpeed="13.89" duration="155.05" routeLength="1986.69" waitingTime="0.00" waitingCount="0" stopTime="0.00" timeLoss="11.37" rerouteNo="1" devices="tripinfo_car_w2s_276 routing_car_w2s_276" vType="Car" speedFactor="1.00" vaporized=""/>
    <tripinfo id="car_e2w_294" depart="294.00" departLane="e2sep_1" departPos="3.60" departPosLat="0.00" departSpeed="13.90" departDelay="0.00" arrival="431.55" arrivalLane="c2w_1" arrivalPos="990.00" arrivalPosLat="0.00" arrivalSpeed="14.80" duration="137.55" routeLength="1997.01" waitingTime="0.00" waitingCount="0" stopTime="0.00" timeLoss="2.61" rerouteNo="1" devices="tripinfo_car_e2w_294 routing_car_e2w_294" vType="Car" speedFactor="1.06" vaporized=""/>
    <tripinfo id="car_w2n_280" depart="280.00" departLane="w2sep_1" departPos="3.60" departPosLat="0.00" departSpeed="13.90" departDelay="0.00" arrival="431.75" arrivalLane="c2n_1" arrivalPos="990.00" arrivalPosLat="0.00" arrivalSpeed="13.90" duration="151.75" routeLength="1996.47" waitingTime="0.00" waitingCount="0" stopTime="0.00" timeLoss="7.42" rerouteNo="1" devices="tripinfo_car_w2n_280 routing_car_w2n_280" vType="Car" speedFactor="1.00" vaporized=""/>
    <tripinfo id="car_e2s_272" depart="272.00" departLane="e2sep_1" departPos="3.60" departPosLat="0.00" departSpeed="13.90" departDelay="0.00" arrival="433.90" arrivalLane="c2s_1" arrivalPos="990.00" arrivalPosLat="0.00" arrivalSpeed="14.60" duration="161.90" routeLength="1996.47" waitingTime="15.60" waitingCount="1" stopTime="0.00" timeLoss="26.37" rerouteNo="1" devices="tripinfo_car_e2s_272 routing_car_e2s_272" vType="Car" speedFactor="1.07" vaporized=""/>
    <tripinfo id="car_e2s_276" depart="276.00" departLane="e2sep_1" departPos="3.60" departPosLat="0.00" departSpeed="13.90" departDelay="0.00" arrival="439.30" arrivalLane="c2s_1" arrivalPos="990.00" arrivalPosLat="0.00" arrivalSpeed="13.90" duration="163.30" routeLength="1996.47" waitingTime="10.30" waitingCount="1" stopTime="0.00" timeLoss="18.95" rerouteNo="1" devices="tripinfo_car_e2s_276 routing_car_e2s_276" vType="Car" speedFactor="1.00" vaporized=""/>
    <tripinfo id="car_w2n_295" depart="295.00" departLane="w2sep_1" departPos="3.60" departPosLat="0.00" departSpeed="13.90" departDelay="0.00" arrival="442.90" arrivalLane="c2n_1" arrivalPos="990.00" arrivalPosLat="0.00" arrivalSpeed="13.90" duration="147.90" routeLength="1996.47" waitingTime="0.00" waitingCount="0" stopTime="0.00" timeLoss="3.56" rerouteNo="1" devices="tripinfo_car_w2n_295 routing_car_w2n_295" vType="Car" speedFactor="1.00" vaporized=""/>
    <tripinfo id="car_e2s_278" depart="278.00" departLane="e2sep_1" departPos="3.60" departPosLat="0.00" departSpeed="13.90" departDelay="0.00" arrival="443.30" arrivalLane="c2s_1" arrivalPos="990.00" arrivalPosLat="0.00" arrivalSpeed="13.88" duration="165.30" routeLength="1996.47" waitingTime="7.25" waitingCount="1" stopTime="0.00" timeLoss="20.97" rerouteNo="1" devices="tripinfo_car_e2s_278 routing_car_e2s_278" vType="Car" speedFactor="1.00" vaporized=""/>
    <tripinfo id="car_e2s_295" depart="295.35" departLane="e2sep_1" departPos="3.60" departPosLat="0.00" departSpeed="13.90" departDelay="0.35" arrival="445.10" arrivalLane="c2s_1" arrivalPos="990.00" arrivalPosLat="0.00" arrivalSpeed="15.32" duration="149.75" routeLength="1996.47" waitingTime="0.00" waitingCount="0" stopTime="0.00" timeLoss="26.28" rerouteNo="1" devices="tripinfo_car_e2s_295 routing_car_e2s_295" vType="Car" speedFactor="1.17" vaporized=""/>
    <tripinfo id="car_s2n_265" depart="265.00" departLane="s2sep_1" departPos="3.60" departPosLat="0.00" departSpeed="13.90" departDelay="0.00" arrival="450.80" arrivalLane="c2n_1" arrivalPos="990.00" arrivalPosLat="0.00" arrivalSpeed="15.16" duration="185.80" routeLength="1997.01" waitingTime="44.65" waitingCount="1" stopTime="0.00" timeLoss="54.09" rerouteNo="1" devices="tripinfo_car_s2n_265 routing_car_s2n_265" vType="Car" speedFactor="1.09" vaporized=""/>
    <tripinfo id="car_s2e_258" depart="258.00" departLane="s2sep_1" departPos="3.60" departPosLat="0.00" departSpeed="13.90" departDelay="0.00" arrival="451.25" arrivalLane="c2e_1" arrivalPos="990.00" arrivalPosLat="0.00" arrivalSpeed="14.50" duration="193.25" routeLength="1986.69" waitingTime="48.35" waitingCount="1" stopTime="0.00" timeLoss="55.59" rerouteNo="1" devices="tripinfo_car_s2e_258 routing_car_s2e_258" vType="Car" speedFactor="1.04" vaporized=""/>
    <tripinfo id="car_n2w_246" depart="246.00" departLane="n2sep_1" departPos="3.60" departPosLat="0.00" departSpeed="13.90" departDelay="0.00" arrival="453.05" arrivalLane="c2w_1" arrivalPos="990.00" arrivalPosLat="0.00" arrivalSpeed="14.13" duration="207.05" routeLength="1986.69" waitingTime="58.70" waitingCount="1" stopTime="0.00" timeLoss="65.75" rerouteNo="1" devices="tripinfo_car_n2w_246 routing_car_n2w_246" vType="Car" speedFactor="1.02" vaporized=""/>
    <tripinfo id="car_s2e_269" depart="269.00" departLane="s2sep_1" departPos="3.60" departPosLat="0.00" departSpeed="13.90" departDelay="0.00" arrival="454.85" arrivalLane="c2e_1" arrivalPos="990.00" arrivalPosLat="0.00" arrivalSpeed="15.08" duration="185.85" routeLength="1986.69" waitingTime="41.20" waitingCount="1" stopTime="0.00" timeLoss="53.82" rerouteNo="1" devices="tripinfo_car_s2e_269 routing_car_s2e_269" vType="Car" speedFactor="1.09" vaporized=""/>
    <tripinfo id="car_n2s_267" depart="267.00" departLane="n2sep_1" departPos="3.60" departPosLat="0.00" departSpeed="13.90" departDelay="0.00" arrival="455.05" arrivalLane="c2s_1" arrivalPos="990.00" arrivalPosLat="0.00" arrivalSpeed="14.69" duration="188.05" routeLength="1997.01" waitingTime="42.05" waitingCount="1" stopTime="0.00" timeLoss="52.11" rerouteNo="1" devices="tripinfo_car_n2s_267 routing_car_n2s_267" vType="Car" speedFactor="1.06" vaporized=""/>
    <tripinfo id="car_n2w_257" depart="257.00" departLane="n2sep_1" departPos="3.60" departPosLat="0.00" departSpeed="13.90" departDelay="0.00" arrival="456.75" arrivalLane="c2w_1" arrivalPos="990.00" arrivalPosLat="0.00" arrivalSpeed="14.40" duration="199.75" routeLength="1986.69" waitingTime="49.80" waitingCount="1" stopTime="0.00" timeLoss="61.29" rerouteNo="1" devices="tripinfo_car_n2w_257 routing_car_n2w_257" vType="Car" speedFactor="1.04" vaporized=""/>
    <tripinfo id="car_n2s_288" depart="288.00" departLane="n2sep_1" departPos="3.60" departPosLat="0.00" departSpeed="13.90" departDelay="0.00" arrival="458.70" arrivalLane="c2s_1" arrivalPos="990.00" arrivalPosLat="0.00" arrivalSpeed="14.88" duration="170.70" routeLength="1997.01" waitingTime="23.25" waitingCount="1" stopTime="0.00" timeLoss="36.76" rerouteNo="1" devices="tripinfo_car_n2s_288 routing_car_n2s_288" vType="Car" speedFactor="1.07" vaporized=""/>
    <tripinfo id="car_n2w_294" depart="294.00" departLane="n2sep_1" departPos="3.60" departPosLat="0.00" departSpeed="13.90" departDelay="0.00" arrival="461.75" arrivalLane="c2w_1" arrivalPos="990.00" arrivalPosLat="0.00" arrivalSpeed="14.37" duration="167.75" routeLength="1986.69" waitingTime="16.10" waitingCount="1" stopTime="0.00" timeLoss="28.87" rerouteNo="1" devices="tripinfo_car_n2w_294 routing_car_n2w_294" vType="Car" speedFactor="1.03" vaporized=""/>
    <tripinfo id="bus_s2n_279" depart="279.00" departLane="s2sep_1" departPos="12.10" departPosLat="0.00" departSpeed="13.90" departDelay="0.00" arrival="463.05" arrivalLane="c2n_1" arrivalPos="990.00" arrivalPosLat="0.00" arrivalSpeed="13.90" duration="184.05" routeLength="1988.51" waitingTime="29.15" waitingCount="1" stopTime="0.00" timeLoss="40.97" rerouteNo="1" devices="tripinfo_bus_s2n_279 routing_bus_s2n_279" vType="Bus" speedFactor="1.00" vaporized=""/>
    <tripinfo id="car_n2s_307" depart="307.00" departLane="n2sep_1" departPos="3.60" departPosLat="0.00" departSpeed="13.90" departDelay="0.00" arrival="463.80" arrivalLane="c2s_1" arrivalPos="990.00" arrivalPosLat="0.00" arrivalSpeed="14.81" duration="156.80" routeLength="1997.01" waitingTime="6.95" waitingCount="1" stopTime="0.00" timeLoss="22.01" rerouteNo="1" devices="tripinfo_car_n2s_307 routing_car_n2s_307" vType="Car" speedFactor="1.07" vaporized=""/>
    <tripinfo id="car_s2n_303" depart="303.00" departLane="s2sep_1" departPos="3.60" departPosLat="0.00" departSpeed="13.90" departDelay="0.00" arrival="466.05" arrivalLane="c2n_1" arrivalPos="990.00" arrivalPosLat="0.00" arrivalSpeed="15.08" duration="163.05" routeLength="1997.01" waitingTime="12.00" waitingCount="1" stopTime="0.00" timeLoss="32.01" rerouteNo="1" devices="tripinfo_car_s2n_303 routing_car_s2n_303" vType="Car" speedFactor="1.10" vaporized=""/>
    <tripinfo id="car_n2w_301" depart="301.00" departLane="n2sep_1" departPos="3.60" departPosLat="0.00" departSpeed="13.90" departDelay="0.00" arrival="466.70" arrivalLane="c2w_1" arrivalPos="990.00" arrivalPosLat="0.00" arrivalSpeed="14.02" duration="165.70" routeLength="1986.69" waitingTime="8.85" waitingCount="1" stopTime="0.00" timeLoss="23.31" rerouteNo="1" devices="tripinfo_car_n2w_301 routing_car_n2w_301" vType="Car" speedFactor="1.01" vaporized=""/>
    <tripinfo id="car_s2n_311" depart="311.00" departLane="s2sep_1" departPos="3.60" departPosLat="0.00" departSpeed="13.90" departDelay="0.00" arrival="468.05" arrivalLane="c2n_1" arrivalPos="990.00" arrivalPosLat="0.00" arrivalSpeed="15.77" duration="157.05" routeLength="1997.01" waitingTime="10.60" waitingCount="1" stopTime="0.00" timeLoss="34.98" rerouteNo="1" devices="tripinfo_car_s2n_311 routing_car_s2n_311" vType="Car" speedFactor="1.18" vaporized=""/>
    <tripinfo id="bus_s2e_294" depart="295.05" departLane="s2sep_1" departPos="12.10" departPosLat="0.00" departSpeed="13.90" departDelay="1.05" arrival="468.15" arrivalLane="c2e_1" arrivalPos="990.00" arrivalPosLat="0.00" arrivalSpeed="13.90" duration="173.10" routeLength="1978.19" waitingTime="13.35" waitingCount="1" stopTime="0.00" timeLoss="30.03" rerouteNo="1" devices="tripinfo_bus_s2e_294 routing_bus_s2e_294" vType="Bus" speedFactor="1.00" vaporized=""/>
    <tripinfo id="car_n2w_316" depart="316.00" departLane="n2sep_1" departPos="3.60" departPosLat="0.00" departSpeed="13.90" departDelay="0.00" arrival="471.30" arrivalLane="c2w_1" arrivalPos="990.00" arrivalPosLat="0.00" arrivalSpeed="13.89" duration="155.30" routeLength="1986.69" waitingTime="0.00" waitingCount="0" stopTime="0.00" timeLoss="11.60" rerouteNo="1" devices="tripinfo_car_n2w_316 routing_car_n2w_316" vType="Car" speedFactor="1.00" vaporized=""/>
    <tripinfo id="car_s2n_327" depart="327.00" departLane="s2sep_1" departPos="3.60" departPosLat="0.00" departSpeed="13.90" departDelay="0.00" arrival="472.60" arrivalLane="c2n_1" arrivalPos="990.00" arrivalPosLat="0.00" arrivalSpeed="14.74" duration="145.60" routeLength="1997.01" waitingTime="0.00" waitingCount="0" stopTime="0.00" timeLoss="10.16" rerouteNo="1" devices="tripinfo_car_s2n_327 routing_car_s2n_327" vType="Car" speedFactor="1.06" vaporized=""/>
    <tripinfo id="car_s2e_319" depart="319.00" departLane="s2sep_1" departPos="3.60" departPosLat="0.00" departSpeed="13.90" departDelay="0.00" arrival="472.90" arrivalLane="c2e_1" arrivalPos="990.00" arrivalPosLat="0.00" arrivalSpeed="14.33" duration="153.90" routeLength="1986.69" waitingTime="0.00" waitingCount="0" stopTime="0.00" timeLoss="14.62" rerouteNo="1" devices="tripinfo_car_s2e_319 routing_car_s2e_319" vType="Car" speedFactor="1.03" vaporized=""/>
    <tripinfo id="car_n2w_336" depart="336.00" departLane="n2sep_1" departPos="3.60" departPosLat="0.00" departSpeed="13.90" departDelay="0.00" arrival="473.35" arrivalLane="c2w_1" arrivalPos="990.00" arrivalPosLat="0.00" arrivalSpeed="15.05" duration="137.35" routeLength="1986.69" waitingTime="0.00" waitingCount="0" stopTime="0.00" timeLoss="8.89" rerouteNo="1" devices="tripinfo_car_n2w_336 routing_car_n2w_336" vType="Car" speedFactor="1.12" vaporized=""/>
</tripinfos>
