<?xml version="1.0" encoding="UTF-8"?>

<!-- generated on 2021-05-18 05:16:57 by Eclipse SUMO sumo Version 1.9.1
<configuration xmlns:xsi="http://www.w3.org/2001/XMLSchema-instance" xsi:noNamespaceSchemaLocation="http://sumo.dlr.de/xsd/sumoConfiguration.xsd">

    <input>
        <net-file value="sumofiles/junction.net.xml"/>
        <route-files value="sumofiles/junction_radius_21.rou.xml"/>
        <additional-files value="sumofiles/junction.det.xml"/>
    </input>

    <output>
        <tripinfo-output value="sumofiles/output/tripinfo_radius_21.xml"/>
    </output>

    <time>
        <begin value="0"/>
        <end value="10000"/>
        <step-length value="1.0"/>
    </time>

    <processing>
        <lateral-resolution value="0.5"/>
    </processing>

    <report>
        <no-warnings value="true"/>
        <error-log value="sumofiles/output/errorlog_radius_21.log"/>
        <no-step-log value="true"/>
    </report>

    <traci_server>
        <remote-port value="41703"/>
    </traci_server>

    <gui_only>
        <gui-settings-file value="sumofiles/junction-gui.settings.xml"/>
        <tracker-interval value="1"/>
    </gui_only>

</configuration>
-->

<tripinfos xmlns:xsi="http://www.w3.org/2001/XMLSchema-instance" xsi:noNamespaceSchemaLocation="http://sumo.dlr.de/xsd/tripinfo_file.xsd">
    <tripinfo id="car_e2w_2" depart="2.00" departLane="e2sep_1" departPos="3.60" departPosLat="0.00" departSpeed="13.90" departDelay="0.00" arrival="145.00" arrivalLane="c2w_1" arrivalPos="990.00" arrivalPosLat="0.00" arrivalSpeed="14.04" duration="143.00" routeLength="1997.01" waitingTime="0.00" waitingCount="0" stopTime="0.00" timeLoss="0.06" rerouteNo="1" devices="tripinfo_car_e2w_2 routing_car_e2w_2" vType="Car" speedFactor="1.01" vaporized=""/>
    <tripinfo id="car_w2e_6" depart="6.00" departLane="w2sep_1" departPos="3.60" departPosLat="0.00" departSpeed="13.90" departDelay="0.00" arrival="150.00" arrivalLane="c2e_1" arrivalPos="990.00" arrivalPosLat="0.00" arrivalSpeed="13.90" duration="144.00" routeLength="1997.01" waitingTime="0.00" waitingCount="0" stopTime="0.00" timeLoss="0.03" rerouteNo="1" devices="tripinfo_car_w2e_6 routing_car_w2e_6" vType="Car" speedFactor="1.00" vaporized=""/>
    <tripinfo id="car_w2n_13" depart="14.00" departLane="w2sep_1" departPos="3.60" departPosLat="0.00" departSpeed="13.90" departDelay="1.00" arrival="150.00" arrivalLane="c2n_1" arrivalPos="990.00" arrivalPosLat="0.00" arrivalSpeed="15.16" duration="136.00" routeLength="1996.47" waitingTime="0.00" waitingCount="0" stopTime="0.00" timeLoss="3.14" rerouteNo="1" devices="tripinfo_car_w2n_13 routing_car_w2n_13" vType="Car" speedFactor="1.09" vaporized=""/>
    <tripinfo id="car_n2s_0" depart="0.00" departLane="n2sep_1" departPos="3.60" departPosLat="0.00" departSpeed="13.90" departDelay="0.00" arrival="161.00" arrivalLane="c2s_1" arrivalPos="990.00" arrivalPosLat="0.00" arrivalSpeed="14.73" duration="161.00" routeLength="1997.01" waitingTime="14.00" waitingCount="1" stopTime="0.00" timeLoss="24.76" rerouteNo="1" devices="tripinfo_car_n2s_0 routing_car_n2s_0" vType="Car" speedFactor="1.06" vaporized=""/>
    <tripinfo id="car_s2e_0" depart="0.00" departLane="s2sep_1" departPos="3.60" departPosLat="0.00" departSpeed="13.90" departDelay="0.00" arrival="161.00" arrivalLane="c2e_1" arrivalPos="990.00" arrivalPosLat="0.00" arrivalSpeed="14.73" duration="161.00" routeLength="1986.69" waitingTime="14.00" waitingCount="1" stopTime="0.00" timeLoss="24.85" rerouteNo="1" devices="tripinfo_car_s2e_0 routing_car_s2e_0" vType="Car" speedFactor="1.06" vaporized=""/>
    <tripinfo id="car_s2e_4" depart="4.00" departLane="s2sep_1" departPos="3.60" departPosLat="0.00" departSpeed="13.90" departDelay="0.00" arrival="164.00" arrivalLane="c2e_1" arrivalPos="990.00" arrivalPosLat="0.00" arrivalSpeed="15.00" duration="160.00" routeLength="1986.69" waitingTime="12.00" waitingCount="1" stopTime="0.00" timeLoss="27.13" rerouteNo="1" devices="tripinfo_car_s2e_4 routing_car_s2e_4" vType="Car" speedFactor="1.08" vaporized=""/>
    <tripinfo id="car_s2w_11" depart="11.00" departLane="s2sep_1" departPos="3.60" departPosLat="0.00" departSpeed="13.90" departDelay="0.00" arrival="166.00" arrivalLane="c2w_1" arrivalPos="990.00" arrivalPosLat="0.00" arrivalSpeed="14.04" duration="155.00" routeLength="1996.47" waitingTime="0.00" waitingCount="0" stopTime="0.00" timeLoss="11.62" rerouteNo="1" devices="tripinfo_car_s2w_11 routing_car_s2w_11" vType="Car" speedFactor="1.01" vaporized=""/>
    <tripinfo id="car_s2e_6" depart="6.00" departLane="s2sep_1" departPos="3.60" departPosLat="0.00" departSpeed="13.90" departDelay="0.00" arrival="169.00" arrivalLane="c2e_1" arrivalPos="990.00" arrivalPosLat="0.00" arrivalSpeed="14.53" duration="163.00" routeLength="1986.69" waitingTime="9.00" waitingCount="1" stopTime="0.00" timeLoss="25.13" rerouteNo="1" devices="tripinfo_car_s2e_6 routing_car_s2e_6" vType="Car" speedFactor="1.05" vaporized=""/>
    <tripinfo id="car_s2w_16" depart="16.00" departLane="s2sep_1" departPos="3.60" departPosLat="0.00" departSpeed="13.90" departDelay="0.00" arrival="170.00" arrivalLane="c2w_1" arrivalPos="990.00" arrivalPosLat="0.00" arrivalSpeed="14.25" duration="154.00" routeLength="1996.47" waitingTime="0.00" waitingCount="0" stopTime="0.00" timeLoss="12.78" rerouteNo="1" devices="tripinfo_car_s2w_16 routing_car_s2w_16" vType="Car" speedFactor="1.03" vaporized=""/>
    <tripinfo id="car_s2e_11" depart="13.00" departLane="s2sep_1" departPos="3.60" departPosLat="0.00" departSpeed="13.90" departDelay="2.00" arrival="172.00" arrivalLane="c2e_1" arrivalPos="990.00" arrivalPosLat="0.00" arrivalSpeed="14.97" duration="159.00" routeLength="1986.69" waitingTime="6.00" waitingCount="1" stopTime="0.00" timeLoss="25.69" rerouteNo="1" devices="tripinfo_car_s2e_11 routing_car_s2e_11" vType="Car" speedFactor="1.08" vaporized=""/>
    <tripinfo id="car_s2e_26" depart="26.00" departLane="s2sep_1" departPos="3.60" departPosLat="0.00" departSpeed="13.90" departDelay="0.00" arrival="178.00" arrivalLane="c2e_1" arrivalPos="990.00" arrivalPosLat="0.00" arrivalSpeed="13.90" duration="152.00" routeLength="1986.69" waitingTime="0.00" waitingCount="0" stopTime="0.00" timeLoss="7.48" rerouteNo="1" devices="tripinfo_car_s2e_26 routing_car_s2e_26" vType="Car" speedFactor="1.00" vaporized=""/>
    <tripinfo id="car_n2w_28" depart="28.00" departLane="n2sep_1" departPos="3.60" departPosLat="0.00" departSpeed="13.90" departDelay="0.00" arrival="178.00" arrivalLane="c2w_1" arrivalPos="990.00" arrivalPosLat="0.00" arrivalSpeed="13.90" duration="150.00" routeLength="1986.69" waitingTime="0.00" waitingCount="0" stopTime="0.00" timeLoss="5.67" rerouteNo="1" devices="tripinfo_car_n2w_28 routing_car_n2w_28" vType="Car" speedFactor="1.00" vaporized=""/>
    <tripinfo id="car_n2e_40" depart="40.00" departLane="n2sep_1" departPos="3.60" departPosLat="0.00" departSpeed="13.90" departDelay="0.00" arrival="179.00" arrivalLane="c2e_1" arrivalPos="990.00" arrivalPosLat="0.00" arrivalSpeed="14.84" duration="139.00" routeLength="1996.47" waitingTime="0.00" waitingCount="0" stopTime="0.00" timeLoss="14.35" rerouteNo="1" devices="tripinfo_car_n2e_40 routing_car_n2e_40" vType="Car" speedFactor="1.16" vaporized=""/>
    <tripinfo id="car_s2w_22" depart="22.00" departLane="s2sep_1" departPos="3.60" departPosLat="0.00" departSpeed="13.90" departDelay="0.00" arrival="182.00" arrivalLane="c2w_1" arrivalPos="990.00" arrivalPosLat="0.00" arrivalSpeed="13.89" duration="160.00" routeLength="1996.47" waitingTime="0.00" waitingCount="0" stopTime="0.00" timeLoss="15.18" rerouteNo="1" devices="tripinfo_car_s2w_22 routing_car_s2w_22" vType="Car" speedFactor="1.00" vaporized=""/>
    <tripinfo id="car_s2w_33" depart="33.00" departLane="s2sep_1" departPos="3.60" departPosLat="0.00" departSpeed="13.90" departDelay="0.00" arrival="186.00" arrivalLane="c2w_1" arrivalPos="990.00" arrivalPosLat="0.00" arrivalSpeed="13.88" duration="153.00" routeLength="1996.47" waitingTime="0.00" waitingCount="0" stopTime="0.00" timeLoss="7.65" rerouteNo="1" devices="tripinfo_car_s2w_33 routing_car_s2w_33" vType="Car" speedFactor="1.00" vaporized=""/>
    <tripinfo id="car_s2n_44" depart="44.00" departLane="s2sep_1" departPos="3.60" departPosLat="0.00" departSpeed="13.90" departDelay="0.00" arrival="186.00" arrivalLane="c2n_1" arrivalPos="990.00" arrivalPosLat="0.00" arrivalSpeed="14.15" duration="142.00" routeLength="1997.01" waitingTime="0.00" waitingCount="0" stopTime="0.00" timeLoss="0.24" rerouteNo="1" devices="tripinfo_car_s2n_44 routing_car_s2n_44" vType="Car" speedFactor="1.02" vaporized=""/>
    <tripinfo id="car_s2w_55" depart="55.00" departLane="s2sep_1" departPos="3.60" departPosLat="0.00" departSpeed="13.90" departDelay="0.00" arrival="191.00" arrivalLane="c2w_1" arrivalPos="990.00" arrivalPosLat="0.00" arrivalSpeed="15.60" duration="136.00" routeLength="1996.47" waitingTime="0.00" waitingCount="0" stopTime="0.00" timeLoss="6.41" rerouteNo="1" devices="tripinfo_car_s2w_55 routing_car_s2w_55" vType="Car" speedFactor="1.12" vaporized=""/>
    <tripinfo id="car_e2w_22" depart="22.00" departLane="e2sep_1" departPos="3.60" departPosLat="0.00" departSpeed="13.90" departDelay="0.00" arrival="204.00" arrivalLane="c2w_1" arrivalPos="990.00" arrivalPosLat="0.00" arrivalSpeed="15.61" duration="182.00" routeLength="1997.01" waitingTime="42.00" waitingCount="1" stopTime="0.00" timeLoss="53.82" rerouteNo="1" devices="tripinfo_car_e2w_22 routing_car_e2w_22" vType="Car" speedFactor="1.12" vaporized=""/>
    <tripinfo id="car_e2n_5" depart="5.00" departLane="e2sep_1" departPos="3.60" departPosLat="0.00" departSpeed="13.90" departDelay="0.00" arrival="207.00" arrivalLane="c2n_1" arrivalPos="990.00" arrivalPosLat="0.00" arrivalSpeed="14.32" duration="202.00" routeLength="1986.69" waitingTime="51.00" waitingCount="1" stopTime="0.00" timeLoss="62.71" rerouteNo="1" devices="tripinfo_car_e2n_5 routing_car_e2n_5" vType="Car" speedFactor="1.03" vaporized=""/>
    <tripinfo id="car_w2s_12" depart="12.00" departLane="w2sep_1" departPos="3.60" departPosLat="0.00" departSpeed="13.90" departDelay="0.00" arrival="207.00" arrivalLane="c2s_1" arrivalPos="990.00" arrivalPosLat="0.00" arrivalSpeed="14.32" duration="195.00" routeLength="1986.69" waitingTime="45.00" waitingCount="1" stopTime="0.00" timeLoss="55.68" rerouteNo="1" devices="tripinfo_car_w2s_12 routing_car_w2s_12" vType="Car" speedFactor="1.03" vaporized=""/>
    <tripinfo id="car_w2e_55" depart="55.00" departLane="w2sep_1" departPos="3.60" departPosLat="0.00" departSpeed="13.90" departDelay="0.00" arrival="209.00" arrivalLane="c2e_1" arrivalPos="990.00" arrivalPosLat="0.00" arrivalSpeed="14.55" duration="154.00" routeLength="1997.01" waitingTime="5.00" waitingCount="1" stopTime="0.00" timeLoss="15.97" rerouteNo="1" devices="tripinfo_car_w2e_55 routing_car_w2e_55" vType="Car" speedFactor="1.05" vaporized=""/>
    <tripinfo id="car_w2s_65" depart="67.00" departLane="w2sep_1" departPos="3.60" departPosLat="0.00" departSpeed="13.90" departDelay="2.00" arrival="210.00" arrivalLane="c2s_1" arrivalPos="990.00" arrivalPosLat="0.00" arrivalSpeed="16.13" duration="143.00" routeLength="1986.69" waitingTime="0.00" waitingCount="0" stopTime="0.00" timeLoss="20.26" rerouteNo="1" devices="tripinfo_car_w2s_65 routing_car_w2s_65" vType="Car" speedFactor="1.18" vaporized=""/>
    <tripinfo id="car_e2n_46" depart="48.00" departLane="e2sep_1" departPos="3.60" departPosLat="0.00" departSpeed="13.90" departDelay="2.00" arrival="212.00" arrivalLane="c2n_1" arrivalPos="990.00" arrivalPosLat="0.00" arrivalSpeed="15.15" duration="164.00" routeLength="1986.69" waitingTime="13.00" waitingCount="1" stopTime="0.00" timeLoss="32.06" rerouteNo="1" devices="tripinfo_car_e2n_46 routing_car_e2n_46" vType="Car" speedFactor="1.09" vaporized=""/>
    <tripinfo id="car_e2w_46" depart="46.00" departLane="e2sep_1" departPos="3.60" departPosLat="0.00" departSpeed="13.90" departDelay="0.00" arrival="214.00" arrivalLane="c2w_1" arrivalPos="990.00" arrivalPosLat="0.00" arrivalSpeed="14.04" duration="168.00" routeLength="1997.01" waitingTime="13.00" waitingCount="1" stopTime="0.00" timeLoss="25.16" rerouteNo="1" devices="tripinfo_car_e2w_46 routing_car_e2w_46" vType="Car" speedFactor="1.01" vaporized=""/>
    <tripinfo id="car_e2n_62" depart="62.00" departLane="e2sep_1" departPos="3.60" departPosLat="0.00" departSpeed="13.90" departDelay="0.00" arrival="215.00" arrivalLane="c2n_1" arrivalPos="990.00" arrivalPosLat="0.00" arrivalSpeed="15.64" duration="153.00" routeLength="1986.69" waitingTime="7.00" waitingCount="1" stopTime="0.00" timeLoss="25.81" rerouteNo="1" devices="tripinfo_car_e2n_62 routing_car_e2n_62" vType="Car" speedFactor="1.13" vaporized=""/>
    <tripinfo id="car_w2e_65" depart="65.00" departLane="w2sep_1" departPos="3.60" departPosLat="0.00" departSpeed="13.90" departDelay="0.00" arrival="215.00" arrivalLane="c2e_1" arrivalPos="990.00" arrivalPosLat="0.00" arrivalSpeed="13.90" duration="150.00" routeLength="1997.01" waitingTime="0.00" waitingCount="0" stopTime="0.00" timeLoss="5.97" rerouteNo="1" devices="tripinfo_car_w2e_65 routing_car_w2e_65" vType="Car" speedFactor="1.00" vaporized=""/>
    <tripinfo id="car_w2e_69" depart="71.00" departLane="w2sep_1" departPos="3.60" departPosLat="0.00" departSpeed="13.90" departDelay="2.00" arrival="220.00" arrivalLane="c2e_1" arrivalPos="990.00" arrivalPosLat="0.00" arrivalSpeed="13.97" duration="149.00" routeLength="1997.01" waitingTime="0.00" waitingCount="0" stopTime="0.00" timeLoss="5.46" rerouteNo="1" devices="tripinfo_car_w2e_69 routing_car_w2e_69" vType="Car" speedFactor="1.01" vaporized=""/>
    <tripinfo id="car_w2n_21" depart="21.00" departLane="w2sep_1" departPos="3.60" departPosLat="0.00" departSpeed="13.90" departDelay="0.00" arrival="221.00" arrivalLane="c2n_1" arrivalPos="990.00" arrivalPosLat="0.00" arrivalSpeed="14.55" duration="200.00" routeLength="1996.47" waitingTime="43.00" waitingCount="2" stopTime="0.00" timeLoss="61.59" rerouteNo="1" devices="tripinfo_car_w2n_21 routing_car_w2n_21" vType="Car" speedFactor="1.05" vaporized=""/>
    <tripinfo id="car_e2s_24" depart="24.00" departLane="e2sep_1" departPos="3.60" departPosLat="0.00" departSpeed="13.90" departDelay="0.00" arrival="221.00" arrivalLane="c2s_1" arrivalPos="990.00" arrivalPosLat="0.00" arrivalSpeed="14.54" duration="197.00" routeLength="1996.47" waitingTime="42.00" waitingCount="2" stopTime="0.00" timeLoss="58.71" rerouteNo="1" devices="tripinfo_car_e2s_24 routing_car_e2s_24" vType="Car" speedFactor="1.05" vaporized=""/>
    <tripinfo id="car_w2e_86" depart="86.00" departLane="w2sep_1" departPos="3.60" departPosLat="0.00" departSpeed="13.90" departDelay="0.00" arrival="222.00" arrivalLane="c2e_1" arrivalPos="990.00" arrivalPosLat="0.00" arrivalSpeed="15.62" duration="136.00" routeLength="1997.01" waitingTime="0.00" waitingCount="0" stopTime="0.00" timeLoss="13.47" rerouteNo="1" devices="tripinfo_car_w2e_86 routing_car_w2e_86" vType="Car" speedFactor="1.18" vaporized=""/>
    <tripinfo id="car_w2n_67" depart="69.00" departLane="w2sep_1" departPos="3.60" departPosLat="0.00" departSpeed="13.90" departDelay="2.00" arrival="223.00" arrivalLane="c2n_1" arrivalPos="990.00" arrivalPosLat="0.00" arrivalSpeed="15.61" duration="154.00" routeLength="1996.47" waitingTime="5.00" waitingCount="1" stopTime="0.00" timeLoss="28.61" rerouteNo="1" devices="tripinfo_car_w2n_67 routing_car_w2n_67" vType="Car" speedFactor="1.15" vaporized=""/>
    <tripinfo id="car_e2w_94" depart="94.00" departLane="e2sep_1" departPos="3.60" departPosLat="0.00" departSpeed="13.90" departDelay="0.00" arrival="227.00" arrivalLane="c2w_1" arrivalPos="990.00" arrivalPosLat="0.00" arrivalSpeed="15.18" duration="133.00" routeLength="1997.01" waitingTime="0.00" waitingCount="0" stopTime="0.00" timeLoss="0.48" rerouteNo="1" devices="tripinfo_car_e2w_94 routing_car_e2w_94" vType="Car" speedFactor="1.09" vaporized=""/>
    <tripinfo id="bus_e2s_57" depart="57.00" departLane="e2sep_1" departPos="12.10" departPosLat="0.00" departSpeed="13.90" departDelay="0.00" arrival="230.00" arrivalLane="c2s_1" arrivalPos="990.00" arrivalPosLat="0.00" arrivalSpeed="13.90" duration="173.00" routeLength="1987.97" waitingTime="8.00" waitingCount="2" stopTime="0.00" timeLoss="28.70" rerouteNo="1" devices="tripinfo_bus_e2s_57 routing_bus_e2s_57" vType="Bus" speedFactor="1.00" vaporized=""/>
    <tripinfo id="car_e2s_73" depart="73.00" departLane="e2sep_1" departPos="3.60" departPosLat="0.00" departSpeed="13.90" departDelay="0.00" arrival="232.00" arrivalLane="c2s_1" arrivalPos="990.00" arrivalPosLat="0.00" arrivalSpeed="15.56" duration="159.00" routeLength="1996.47" waitingTime="7.00" waitingCount="1" stopTime="0.00" timeLoss="35.62" rerouteNo="1" devices="tripinfo_car_e2s_73 routing_car_e2s_73" vType="Car" speedFactor="1.17" vaporized=""/>
    <tripinfo id="car_w2n_99" depart="100.00" departLane="w2sep_1" departPos="3.60" departPosLat="0.00" departSpeed="13.90" departDelay="1.00" arrival="248.00" arrivalLane="c2n_1" arrivalPos="990.00" arrivalPosLat="0.00" arrivalSpeed="13.90" duration="148.00" routeLength="1996.47" waitingTime="0.00" waitingCount="0" stopTime="0.00" timeLoss="2.98" rerouteNo="1" devices="tripinfo_car_w2n_99 routing_car_w2n_99" vType="Car" speedFactor="1.00" vaporized=""/>
    <tripinfo id="car_n2s_54" depart="54.00" departLane="n2sep_1" departPos="3.60" departPosLat="0.00" departSpeed="13.90" departDelay="0.00" arrival="253.00" arrivalLane="c2s_1" arrivalPos="990.00" arrivalPosLat="0.00" arrivalSpeed="14.27" duration="199.00" routeLength="1997.01" waitingTime="50.00" waitingCount="1" stopTime="0.00" timeLoss="58.50" rerouteNo="1" devices="tripinfo_car_n2s_54 routing_car_n2s_54" vType="Car" speedFactor="1.03" vaporized=""/>
    <tripinfo id="car_s2n_59" depart="59.00" departLane="s2sep_1" departPos="3.60" departPosLat="0.00" departSpeed="13.90" departDelay="0.00" arrival="255.00" arrivalLane="c2n_1" arrivalPos="990.00" arrivalPosLat="0.00" arrivalSpeed="13.90" duration="196.00" routeLength="1997.01" waitingTime="42.00" waitingCount="1" stopTime="0.00" timeLoss="52.02" rerouteNo="1" devices="tripinfo_car_s2n_59 routing_car_s2n_59" vType="Car" speedFactor="1.00" vaporized=""/>
    <tripinfo id="car_n2w_58" depart="58.00" departLane="n2sep_1" departPos="3.60" departPosLat="0.00" departSpeed="13.90" departDelay="0.00" arrival="257.00" arrivalLane="c2w_1" arrivalPos="990.00" arrivalPosLat="0.00" arrivalSpeed="13.90" duration="199.00" routeLength="1986.69" waitingTime="44.00" waitingCount="1" stopTime="0.00" timeLoss="55.15" rerouteNo="1" devices="tripinfo_car_n2w_58 routing_car_n2w_58" vType="Car" speedFactor="1.00" vaporized=""/>
    <tripinfo id="car_s2n_73" depart="73.00" departLane="s2sep_1" departPos="3.60" departPosLat="0.00" departSpeed="13.90" departDelay="0.00" arrival="259.00" arrivalLane="c2n_1" arrivalPos="990.00" arrivalPosLat="0.00" arrivalSpeed="13.89" duration="186.00" routeLength="1997.01" waitingTime="29.00" waitingCount="1" stopTime="0.00" timeLoss="42.21" rerouteNo="1" devices="tripinfo_car_s2n_73 routing_car_s2n_73" vType="Car" speedFactor="1.00" vaporized=""/>
    <tripinfo id="car_n2w_91" depart="91.00" departLane="n2sep_1" departPos="3.60" departPosLat="0.00" departSpeed="13.90" departDelay="0.00" arrival="261.00" arrivalLane="c2w_1" arrivalPos="990.00" arrivalPosLat="0.00" arrivalSpeed="14.30" duration="170.00" routeLength="1986.69" waitingTime="14.00" waitingCount="1" stopTime="0.00" timeLoss="29.93" rerouteNo="1" devices="tripinfo_car_n2w_91 routing_car_n2w_91" vType="Car" speedFactor="1.03" vaporized=""/>
    <tripinfo id="car_s2n_74" depart="75.00" departLane="s2sep_1" departPos="3.60" departPosLat="0.00" departSpeed="13.90" departDelay="1.00" arrival="262.00" arrivalLane="c2n_1" arrivalPos="990.00" arrivalPosLat="0.00" arrivalSpeed="14.11" duration="187.00" routeLength="1997.01" waitingTime="27.00" waitingCount="1" stopTime="0.00" timeLoss="45.99" rerouteNo="1" devices="tripinfo_car_s2n_74 routing_car_s2n_74" vType="Car" speedFactor="1.02" vaporized=""/>
    <tripinfo id="car_s2e_79" depart="79.00" departLane="s2sep_1" departPos="3.60" departPosLat="0.00" departSpeed="13.90" departDelay="0.00" arrival="262.00" arrivalLane="c2e_1" arrivalPos="990.00" arrivalPosLat="0.00" arrivalSpeed="13.90" duration="183.00" routeLength="1986.69" waitingTime="25.00" waitingCount="1" stopTime="0.00" timeLoss="39.21" rerouteNo="1" devices="tripinfo_car_s2e_79 routing_car_s2e_79" vType="Car" speedFactor="1.00" vaporized=""/>
    <tripinfo id="car_s2e_87" depart="87.00" departLane="s2sep_1" departPos="3.60" departPosLat="0.00" departSpeed="13.90" departDelay="0.00" arrival="264.00" arrivalLane="c2e_1" arrivalPos="990.00" arrivalPosLat="0.00" arrivalSpeed="14.96" duration="177.00" routeLength="1986.69" waitingTime="24.00" waitingCount="1" stopTime="0.00" timeLoss="46.78" rerouteNo="1" devices="tripinfo_car_s2e_87 routing_car_s2e_87" vType="Car" speedFactor="1.10" vaporized=""/>
    <tripinfo id="car_n2w_93" depart="93.00" departLane="n2sep_1" departPos="3.60" departPosLat="0.00" departSpeed="13.90" departDelay="0.00" arrival="264.00" arrivalLane="c2w_1" arrivalPos="990.00" arrivalPosLat="0.00" arrivalSpeed="14.12" duration="171.00" routeLength="1986.69" waitingTime="12.00" waitingCount="1" stopTime="0.00" timeLoss="30.04" rerouteNo="1" devices="tripinfo_car_n2w_93 routing_car_n2w_93" vType="Car" speedFactor="1.02" vaporized=""/>
    <tripinfo id="car_s2e_89" depart="89.00" departLane="s2sep_1" departPos="3.60" departPosLat="0.00" departSpeed="13.90" departDelay="0.00" arrival="266.00" arrivalLane="c2e_1" arrivalPos="990.00" arrivalPosLat="0.00" arrivalSpeed="15.52" duration="177.00" routeLength="1986.69" waitingTime="23.00" waitingCount="1" stopTime="0.00" timeLoss="52.79" rerouteNo="1" devices="tripinfo_car_s2e_89 routing_car_s2e_89" vType="Car" speedFactor="1.16" vaporized=""/>
    <tripinfo id="car_n2w_95" depart="95.00" departLane="n2sep_1" departPos="3.60" departPosLat="0.00" departSpeed="13.90" departDelay="0.00" arrival="267.00" arrivalLane="c2w_1" arrivalPos="990.00" arrivalPosLat="0.00" arrivalSpeed="14.43" duration="172.00" routeLength="1986.69" waitingTime="10.00" waitingCount="1" stopTime="0.00" timeLoss="34.02" rerouteNo="1" devices="tripinfo_car_n2w_95 routing_car_n2w_95" vType="Car" speedFactor="1.04" vaporized=""/>
    <tripinfo id="car_s2e_95" depart="95.00" departLane="s2sep_1" departPos="3.60" departPosLat="0.00" departSpeed="13.90" departDelay="0.00" arrival="269.00" arrivalLane="c2e_1" arrivalPos="990.00" arrivalPosLat="0.00" arrivalSpeed="15.02" duration="174.00" routeLength="1986.69" waitingTime="19.00" waitingCount="1" stopTime="0.00" timeLoss="41.42" rerouteNo="1" devices="tripinfo_car_s2e_95 routing_car_s2e_95" vType="Car" speedFactor="1.09" vaporized=""/>
    <tripinfo id="car_n2s_107" depart="107.00" departLane="n2sep_1" departPos="3.60" departPosLat="0.00" departSpeed="13.90" departDelay="0.00" arrival="269.00" arrivalLane="c2s_1" arrivalPos="990.00" arrivalPosLat="0.00" arrivalSpeed="13.90" duration="162.00" routeLength="1997.01" waitingTime="1.00" waitingCount="1" stopTime="0.00" timeLoss="17.35" rerouteNo="1" devices="tripinfo_car_n2s_107 routing_car_n2s_107" vType="Car" speedFactor="1.00" vaporized=""/>
    <tripinfo id="car_s2n_121" depart="121.00" departLane="s2sep_1" departPos="3.60" departPosLat="0.00" departSpeed="13.90" departDelay="0.00" arrival="269.00" arrivalLane="c2n_1" arrivalPos="990.00" arrivalPosLat="0.00" arrivalSpeed="15.73" duration="148.00" routeLength="1997.01" waitingTime="0.00" waitingCount="0" stopTime="0.00" timeLoss="20.28" rerouteNo="1" devices="tripinfo_car_s2n_121 routing_car_s2n_121" vType="Car" speedFactor="1.13" vaporized=""/>
    <tripinfo id="car_n2s_123" depart="124.00" departLane="n2sep_1" departPos="3.60" departPosLat="0.00" departSpeed="13.90" departDelay="1.00" arrival="271.00" arrivalLane="c2s_1" arrivalPos="990.00" arrivalPosLat="0.00" arrivalSpeed="15.11" duration="147.00" routeLength="1997.01" waitingTime="0.00" waitingCount="0" stopTime="0.00" timeLoss="17.83" rerouteNo="1" devices="tripinfo_car_n2s_123 routing_car_n2s_123" vType="Car" speedFactor="1.12" vaporized=""/>
    <tripinfo id="car_s2e_115" depart="115.00" departLane="s2sep_1" departPos="3.60" departPosLat="0.00" departSpeed="13.90" departDelay="0.00" arrival="274.00" arrivalLane="c2e_1" arrivalPos="990.00" arrivalPosLat="0.00" arrivalSpeed="14.22" duration="159.00" routeLength="1986.69" waitingTime="0.00" waitingCount="0" stopTime="0.00" timeLoss="18.07" rerouteNo="1" devices="tripinfo_car_s2e_115 routing_car_s2e_115" vType="Car" speedFactor="1.02" vaporized=""/>
    <tripinfo id="car_n2s_125" depart="126.00" departLane="n2sep_1" departPos="3.60" departPosLat="0.00" departSpeed="13.90" departDelay="1.00" arrival="274.00" arrivalLane="c2s_1" arrivalPos="990.00" arrivalPosLat="0.00" arrivalSpeed="14.09" duration="148.00" routeLength="1997.01" waitingTime="0.00" waitingCount="0" stopTime="0.00" timeLoss="6.52" rerouteNo="1" devices="tripinfo_car_n2s_125 routing_car_n2s_125" vType="Car" speedFactor="1.02" vaporized=""/>
    <tripinfo id="car_s2e_131" depart="131.00" departLane="s2sep_1" departPos="3.60" departPosLat="0.00" departSpeed="13.90" departDelay="0.00" arrival="276.00" arrivalLane="c2e_1" arrivalPos="990.00" arrivalPosLat="0.00" arrivalSpeed="15.50" duration="145.00" routeLength="1986.69" waitingTime="0.00" waitingCount="0" stopTime="0.00" timeLoss="20.15" rerouteNo="1" devices="tripinfo_car_s2e_131 routing_car_s2e_131" vType="Car" speedFactor="1.15" vaporized=""/>
    <tripinfo id="car_n2e_122" depart="122.00" departLane="n2sep_1" departPos="3.60" departPosLat="0.00" departSpeed="13.90" departDelay="0.00" arrival="279.00" arrivalLane="c2e_1" arrivalPos="990.00" arrivalPosLat="0.00" arrivalSpeed="14.97" duration="157.00" routeLength="1996.47" waitingTime="9.00" waitingCount="1" stopTime="0.00" timeLoss="23.24" rerouteNo="1" devices="tripinfo_car_n2e_122 routing_car_n2e_122" vType="Car" speedFactor="1.08" vaporized=""/>
    <tripinfo id="car_n2e_142" depart="142.00" departLane="n2sep_1" departPos="3.60" departPosLat="0.00" departSpeed="13.90" departDelay="0.00" arrival="288.00" arrivalLane="c2e_1" arrivalPos="990.00" arrivalPosLat="0.00" arrivalSpeed="14.22" duration="146.00" routeLength="1996.47" waitingTime="0.00" waitingCount="0" stopTime="0.00" timeLoss="4.50" rerouteNo="1" devices="tripinfo_car_n2e_142 routing_car_n2e_142" vType="Car" speedFactor="1.02" vaporized=""/>
    <tripinfo id="car_n2e_149" depart="149.00" departLane="n2sep_1" departPos="3.60" departPosLat="0.00" departSpeed="13.90" departDelay="0.00" arrival="294.00" arrivalLane="c2e_1" arrivalPos="990.00" arrivalPosLat="0.00" arrivalSpeed="14.17" duration="145.00" routeLength="1996.47" waitingTime="0.00" waitingCount="0" stopTime="0.00" timeLoss="3.31" rerouteNo="1" devices="tripinfo_car_n2e_149 routing_car_n2e_149" vType="Car" speedFactor="1.02" vaporized=""/>
    <tripinfo id="car_e2n_94" depart="96.00" departLane="e2sep_1" departPos="3.60" departPosLat="0.00" departSpeed="13.90" departDelay="2.00" arrival="297.00" arrivalLane="c2n_1" arrivalPos="990.00" arrivalPosLat="0.00" arrivalSpeed="14.42" duration="201.00" routeLength="1986.69" waitingTime="51.00" waitingCount="1" stopTime="0.00" timeLoss="62.20" rerouteNo="1" devices="tripinfo_car_e2n_94 routing_car_e2n_94" vType="Car" speedFactor="1.04" vaporized=""/>
    <tripinfo id="car_w2s_98" depart="98.00" departLane="w2sep_1" departPos="3.60" departPosLat="0.00" departSpeed="13.90" departDelay="0.00" arrival="299.00" arrivalLane="c2s_1" arrivalPos="990.00" arrivalPosLat="0.00" arrivalSpeed="13.90" duration="201.00" routeLength="1986.69" waitingTime="48.00" waitingCount="1" stopTime="0.00" timeLoss="57.53" rerouteNo="1" devices="tripinfo_car_w2s_98 routing_car_w2s_98" vType="Car" speedFactor="1.00" vaporized=""/>
    <tripinfo id="car_w2e_99" depart="102.00" departLane="w2sep_1" departPos="3.60" departPosLat="0.00" departSpeed="13.90" departDelay="3.00" arrival="302.00" arrivalLane="c2e_1" arrivalPos="990.00" arrivalPosLat="0.00" arrivalSpeed="13.90" duration="200.00" routeLength="1997.01" waitingTime="44.00" waitingCount="1" stopTime="0.00" timeLoss="56.05" rerouteNo="1" devices="tripinfo_car_w2e_99 routing_car_w2e_99" vType="Car" speedFactor="1.00" vaporized=""/>
    <tripinfo id="car_e2n_97" depart="98.00" departLane="e2sep_1" departPos="3.60" departPosLat="0.00" departSpeed="13.90" departDelay="1.00" arrival="303.00" arrivalLane="c2n_1" arrivalPos="990.00" arrivalPosLat="0.00" arrivalSpeed="14.04" duration="205.00" routeLength="1986.69" waitingTime="48.00" waitingCount="1" stopTime="0.00" timeLoss="62.11" rerouteNo="1" devices="tripinfo_car_e2n_97 routing_car_e2n_97" vType="Car" speedFactor="1.01" vaporized=""/>
    <tripinfo id="car_e2w_104" depart="104.00" departLane="e2sep_1" departPos="3.60" departPosLat="0.00" departSpeed="13.90" departDelay="0.00" arrival="303.00" arrivalLane="c2w_1" arrivalPos="990.00" arrivalPosLat="0.00" arrivalSpeed="14.13" duration="199.00" routeLength="1997.01" waitingTime="45.00" waitingCount="1" stopTime="0.00" timeLoss="57.34" rerouteNo="1" devices="tripinfo_car_e2w_104 routing_car_e2w_104" vType="Car" speedFactor="1.02" vaporized=""/>
    <tripinfo id="car_e2n_104" depart="106.00" departLane="e2sep_1" departPos="3.60" departPosLat="0.00" departSpeed="13.90" departDelay="2.00" arrival="305.00" arrivalLane="c2n_1" arrivalPos="990.00" arrivalPosLat="0.00" arrivalSpeed="14.92" duration="199.00" routeLength="1986.69" waitingTime="44.00" waitingCount="1" stopTime="0.00" timeLoss="67.57" rerouteNo="1" devices="tripinfo_car_e2n_104 routing_car_e2n_104" vType="Car" speedFactor="1.10" vaporized=""/>
    <tripinfo id="car_w2e_100" depart="104.00" departLane="w2sep_1" departPos="3.60" departPosLat="0.00" departSpeed="13.90" departDelay="4.00" arrival="306.00" arrivalLane="c2e_1" arrivalPos="990.00" arrivalPosLat="0.00" arrivalSpeed="13.89" duration="202.00" routeLength="1997.01" waitingTime="42.00" waitingCount="1" stopTime="0.00" timeLoss="58.26" rerouteNo="1" devices="tripinfo_car_w2e_100 routing_car_w2e_100" vType="Car" speedFactor="1.00" vaporized=""/>
    <tripinfo id="car_e2n_108" depart="108.00" departLane="e2sep_1" departPos="3.60" departPosLat="0.00" departSpeed="13.90" departDelay="0.00" arrival="307.00" arrivalLane="c2n_1" arrivalPos="990.00" arrivalPosLat="0.00" arrivalSpeed="15.41" duration="199.00" routeLength="1986.69" waitingTime="44.00" waitingCount="1" stopTime="0.00" timeLoss="73.10" rerouteNo="1" devices="tripinfo_car_e2n_108 routing_car_e2n_108" vType="Car" speedFactor="1.14" vaporized=""/>
    <tripinfo id="car_w2e_101" depart="106.00" departLane="w2sep_1" departPos="3.60" departPosLat="0.00" departSpeed="13.90" departDelay="5.00" arrival="308.00" arrivalLane="c2e_1" arrivalPos="990.00" arrivalPosLat="0.00" arrivalSpeed="15.48" duration="202.00" routeLength="1997.01" waitingTime="41.00" waitingCount="1" stopTime="0.00" timeLoss="78.81" rerouteNo="1" devices="tripinfo_car_w2e_101 routing_car_w2e_101" vType="Car" speedFactor="1.17" vaporized=""/>
    <tripinfo id="car_w2s_106" depart="110.00" departLane="w2sep_1" departPos="3.60" departPosLat="0.00" departSpeed="13.90" departDelay="4.00" arrival="309.00" arrivalLane="c2s_1" arrivalPos="990.00" arrivalPosLat="0.00" arrivalSpeed="13.90" duration="199.00" routeLength="1986.69" waitingTime="39.00" waitingCount="1" stopTime="0.00" timeLoss="55.36" rerouteNo="1" devices="tripinfo_car_w2s_106 routing_car_w2s_106" vType="Car" speedFactor="1.00" vaporized=""/>
    <tripinfo id="car_e2n_136" depart="136.00" departLane="e2sep_1" departPos="3.60" departPosLat="0.00" departSpeed="13.90" departDelay="0.00" arrival="309.00" arrivalLane="c2n_1" arrivalPos="990.00" arrivalPosLat="0.00" arrivalSpeed="15.75" duration="173.00" routeLength="1986.69" waitingTime="25.00" waitingCount="1" stopTime="0.00" timeLoss="50.23" rerouteNo="1" devices="tripinfo_car_e2n_136 routing_car_e2n_136" vType="Car" speedFactor="1.17" vaporized=""/>
    <tripinfo id="car_w2s_129" depart="129.00" departLane="w2sep_1" departPos="3.60" departPosLat="0.00" departSpeed="13.90" departDelay="0.00" arrival="311.00" arrivalLane="c2s_1" arrivalPos="990.00" arrivalPosLat="0.00" arrivalSpeed="15.62" duration="182.00" routeLength="1986.69" waitingTime="34.00" waitingCount="1" stopTime="0.00" timeLoss="59.97" rerouteNo="1" devices="tripinfo_car_w2s_129 routing_car_w2s_129" vType="Car" speedFactor="1.18" vaporized=""/>
    <tripinfo id="car_e2w_127" depart="127.00" departLane="e2sep_1" departPos="3.60" departPosLat="0.00" departSpeed="13.90" departDelay="0.00" arrival="313.00" arrivalLane="c2w_1" arrivalPos="990.00" arrivalPosLat="0.00" arrivalSpeed="13.90" duration="186.00" routeLength="1997.01" waitingTime="26.00" waitingCount="1" stopTime="0.00" timeLoss="41.46" rerouteNo="1" devices="tripinfo_car_e2w_127 routing_car_e2w_127" vType="Car" speedFactor="1.00" vaporized=""/>
    <tripinfo id="car_w2s_154" depart="154.00" departLane="w2sep_1" departPos="3.60" departPosLat="0.00" departSpeed="13.90" departDelay="0.00" arrival="313.00" arrivalLane="c2s_1" arrivalPos="990.00" arrivalPosLat="0.00" arrivalSpeed="15.73" duration="159.00" routeLength="1986.69" waitingTime="11.00" waitingCount="1" stopTime="0.00" timeLoss="36.97" rerouteNo="1" devices="tripinfo_car_w2s_154 routing_car_w2s_154" vType="Car" speedFactor="1.18" vaporized=""/>
    <tripinfo id="car_w2e_136" depart="136.00" departLane="w2sep_1" departPos="3.60" departPosLat="0.00" departSpeed="13.90" departDelay="0.00" arrival="315.00" arrivalLane="c2e_1" arrivalPos="990.00" arrivalPosLat="0.00" arrivalSpeed="13.97" duration="179.00" routeLength="1997.01" waitingTime="19.00" waitingCount="1" stopTime="0.00" timeLoss="35.13" rerouteNo="1" devices="tripinfo_car_w2e_136 routing_car_w2e_136" vType="Car" speedFactor="1.01" vaporized=""/>
    <tripinfo id="car_w2s_173" depart="173.00" departLane="w2sep_1" departPos="3.60" departPosLat="0.00" departSpeed="13.90" departDelay="0.00" arrival="315.00" arrivalLane="c2s_1" arrivalPos="990.00" arrivalPosLat="0.00" arrivalSpeed="15.52" duration="142.00" routeLength="1986.69" waitingTime="0.00" waitingCount="0" stopTime="0.00" timeLoss="16.79" rerouteNo="1" devices="tripinfo_car_w2s_173 routing_car_w2s_173" vType="Car" speedFactor="1.15" vaporized=""/>
    <tripinfo id="car_e2n_139" depart="140.00" departLane="e2sep_1" departPos="3.60" departPosLat="0.00" departSpeed="13.90" departDelay="1.00" arrival="317.00" arrivalLane="c2n_1" arrivalPos="990.00" arrivalPosLat="0.00" arrivalSpeed="14.21" duration="177.00" routeLength="1986.69" waitingTime="17.00" waitingCount="1" stopTime="0.00" timeLoss="36.35" rerouteNo="1" devices="tripinfo_car_e2n_139 routing_car_e2n_139" vType="Car" speedFactor="1.02" vaporized=""/>
    <tripinfo id="car_e2s_138" depart="138.00" departLane="e2sep_1" departPos="3.60" departPosLat="0.00" departSpeed="13.90" departDelay="0.00" arrival="321.00" arrivalLane="c2s_1" arrivalPos="990.00" arrivalPosLat="0.00" arrivalSpeed="14.45" duration="183.00" routeLength="1996.47" waitingTime="27.00" waitingCount="2" stopTime="0.00" timeLoss="44.09" rerouteNo="1" devices="tripinfo_car_e2s_138 routing_car_e2s_138" vType="Car" speedFactor="1.04" vaporized=""/>
    <tripinfo id="car_e2n_178" depart="178.00" departLane="e2sep_1" departPos="3.60" departPosLat="0.00" departSpeed="13.90" departDelay="0.00" arrival="322.00" arrivalLane="c2n_1" arrivalPos="990.00" arrivalPosLat="0.00" arrivalSpeed="14.49" duration="144.00" routeLength="1986.69" waitingTime="0.00" waitingCount="0" stopTime="0.00" timeLoss="6.08" rerouteNo="1" devices="tripinfo_car_e2n_178 routing_car_e2n_178" vType="Car" speedFactor="1.04" vaporized=""/>
    <tripinfo id="car_w2e_179" depart="179.00" departLane="w2sep_1" departPos="3.60" departPosLat="0.00" departSpeed="13.90" departDelay="0.00" arrival="325.00" arrivalLane="c2e_1" arrivalPos="990.00" arrivalPosLat="0.00" arrivalSpeed="14.00" duration="146.00" routeLength="1997.01" waitingTime="0.00" waitingCount="0" stopTime="0.00" timeLoss="2.50" rerouteNo="1" devices="tripinfo_car_w2e_179 routing_car_w2e_179" vType="Car" speedFactor="1.01" vaporized=""/>
    <tripinfo id="car_e2w_190" depart="191.00" departLane="e2sep_1" departPos="3.60" departPosLat="0.00" departSpeed="13.90" departDelay="1.00" arrival="325.00" arrivalLane="c2w_1" arrivalPos="990.00" arrivalPosLat="0.00" arrivalSpeed="15.16" duration="134.00" routeLength="1997.01" waitingTime="0.00" waitingCount="0" stopTime="0.00" timeLoss="1.35" rerouteNo="1" devices="tripinfo_car_e2w_190 routing_car_e2w_190" vType="Car" speedFactor="1.09" vaporized=""/>
    <tripinfo id="car_w2n_106" depart="108.00" departLane="w2sep_1" departPos="3.60" departPosLat="0.00" departSpeed="13.90" departDelay="2.00" arrival="328.00" arrivalLane="c2n_1" arrivalPos="990.00" arrivalPosLat="0.00" arrivalSpeed="13.94" duration="220.00" routeLength="1996.47" waitingTime="57.00" waitingCount="2" stopTime="0.00" timeLoss="75.65" rerouteNo="1" devices="tripinfo_car_w2n_106 routing_car_w2n_106" vType="Car" speedFactor="1.00" vaporized=""/>
    <tripinfo id="car_e2s_151" depart="151.00" departLane="e2sep_1" departPos="3.60" departPosLat="0.00" departSpeed="13.90" departDelay="0.00" arrival="329.00" arrivalLane="c2s_1" arrivalPos="990.00" arrivalPosLat="0.00" arrivalSpeed="13.90" duration="178.00" routeLength="1996.47" waitingTime="17.00" waitingCount="1" stopTime="0.00" timeLoss="32.70" rerouteNo="1" devices="tripinfo_car_e2s_151 routing_car_e2s_151" vType="Car" speedFactor="1.00" vaporized=""/>
    <tripinfo id="car_e2s_160" depart="160.00" departLane="e2sep_1" departPos="3.60" departPosLat="0.00" departSpeed="13.90" departDelay="0.00" arrival="331.00" arrivalLane="c2s_1" arrivalPos="990.00" arrivalPosLat="0.00" arrivalSpeed="14.80" duration="171.00" routeLength="1996.47" waitingTime="16.00" waitingCount="1" stopTime="0.00" timeLoss="37.65" rerouteNo="1" devices="tripinfo_car_e2s_160 routing_car_e2s_160" vType="Car" speedFactor="1.09" vaporized=""/>
    <tripinfo id="car_e2s_161" depart="162.00" departLane="e2sep_1" departPos="3.60" departPosLat="0.00" departSpeed="13.90" departDelay="1.00" arrival="334.00" arrivalLane="c2s_1" arrivalPos="990.00" arrivalPosLat="0.00" arrivalSpeed="14.34" duration="172.00" routeLength="1996.47" waitingTime="13.00" waitingCount="1" stopTime="0.00" timeLoss="32.48" rerouteNo="1" devices="tripinfo_car_e2s_161 routing_car_e2s_161" vType="Car" speedFactor="1.03" vaporized=""/>
    <tripinfo id="car_w2n_162" depart="162.00" departLane="w2sep_1" departPos="3.60" departPosLat="0.00" departSpeed="13.90" departDelay="0.00" arrival="334.00" arrivalLane="c2n_1" arrivalPos="990.00" arrivalPosLat="0.00" arrivalSpeed="13.90" duration="172.00" routeLength="1996.47" waitingTime="11.00" waitingCount="1" stopTime="0.00" timeLoss="26.98" rerouteNo="1" devices="tripinfo_car_w2n_162 routing_car_w2n_162" vType="Car" speedFactor="1.00" vaporized=""/>
    <tripinfo id="car_e2s_172" depart="172.00" departLane="e2sep_1" departPos="3.60" departPosLat="0.00" departSpeed="13.90" departDelay="0.00" arrival="338.00" arrivalLane="c2s_1" arrivalPos="990.00" arrivalPosLat="0.00" arrivalSpeed="14.30" duration="166.00" routeLength="1996.47" waitingTime="5.00" waitingCount="1" stopTime="0.00" timeLoss="25.42" rerouteNo="1" devices="tripinfo_car_e2s_172 routing_car_e2s_172" vType="Car" speedFactor="1.03" vaporized=""/>
    <tripinfo id="car_n2w_156" depart="156.00" departLane="n2sep_1" departPos="3.60" departPosLat="0.00" departSpeed="13.90" departDelay="0.00" arrival="341.00" arrivalLane="c2w_1" arrivalPos="990.00" arrivalPosLat="0.00" arrivalSpeed="15.32" duration="185.00" routeLength="1986.69" waitingTime="41.00" waitingCount="1" stopTime="0.00" timeLoss="54.05" rerouteNo="1" devices="tripinfo_car_n2w_156 routing_car_n2w_156" vType="Car" speedFactor="1.10" vaporized=""/>
    <tripinfo id="car_e2s_189" depart="189.00" departLane="e2sep_1" departPos="3.60" departPosLat="0.00" departSpeed="13.90" departDelay="0.00" arrival="341.00" arrivalLane="c2s_1" arrivalPos="990.00" arrivalPosLat="0.00" arrivalSpeed="14.36" duration="152.00" routeLength="1996.47" waitingTime="0.00" waitingCount="0" stopTime="0.00" timeLoss="12.46" rerouteNo="1" devices="tripinfo_car_e2s_189 routing_car_e2s_189" vType="Car" speedFactor="1.04" vaporized=""/>
    <tripinfo id="car_n2s_149" depart="151.00" departLane="n2sep_1" departPos="3.60" departPosLat="0.00" departSpeed="13.90" departDelay="2.00" arrival="344.00" arrivalLane="c2s_1" arrivalPos="990.00" arrivalPosLat="0.00" arrivalSpeed="14.60" duration="193.00" routeLength="1997.01" waitingTime="43.00" waitingCount="1" stopTime="0.00" timeLoss="56.24" rerouteNo="1" devices="tripinfo_car_n2s_149 routing_car_n2s_149" vType="Car" speedFactor="1.06" vaporized=""/>
    <tripinfo id="car_s2n_144" depart="144.00" departLane="s2sep_1" departPos="3.60" departPosLat="0.00" departSpeed="13.90" departDelay="0.00" arrival="345.00" arrivalLane="c2n_1" arrivalPos="990.00" arrivalPosLat="0.00" arrivalSpeed="13.90" duration="201.00" routeLength="1997.01" waitingTime="47.00" waitingCount="1" stopTime="0.00" timeLoss="56.74" rerouteNo="1" devices="tripinfo_car_s2n_144 routing_car_s2n_144" vType="Car" speedFactor="1.00" vaporized=""/>
    <tripinfo id="car_s2n_154" depart="154.00" departLane="s2sep_1" departPos="3.60" departPosLat="0.00" departSpeed="13.90" departDelay="0.00" arrival="348.00" arrivalLane="c2n_1" arrivalPos="990.00" arrivalPosLat="0.00" arrivalSpeed="14.30" duration="194.00" routeLength="1997.01" waitingTime="40.00" waitingCount="1" stopTime="0.00" timeLoss="54.52" rerouteNo="1" devices="tripinfo_car_s2n_154 routing_car_s2n_154" vType="Car" speedFactor="1.03" vaporized=""/>
    <tripinfo id="car_n2w_172" depart="172.00" departLane="n2sep_1" departPos="3.60" departPosLat="0.00" departSpeed="13.90" departDelay="0.00" arrival="350.00" arrivalLane="c2w_1" arrivalPos="990.00" arrivalPosLat="0.00" arrivalSpeed="14.13" duration="178.00" routeLength="1986.69" waitingTime="23.00" waitingCount="1" stopTime="0.00" timeLoss="36.02" rerouteNo="1" devices="tripinfo_car_n2w_172 routing_car_n2w_172" vType="Car" speedFactor="1.02" vaporized=""/>
    <tripinfo id="car_s2n_187" depart="187.00" departLane="s2sep_1" departPos="3.60" departPosLat="0.00" departSpeed="13.90" departDelay="0.00" arrival="350.00" arrivalLane="c2n_1" arrivalPos="990.00" arrivalPosLat="0.00" arrivalSpeed="14.86" duration="163.00" routeLength="1997.01" waitingTime="12.00" waitingCount="1" stopTime="0.00" timeLoss="31.36" rerouteNo="1" devices="tripinfo_car_s2n_187 routing_car_s2n_187" vType="Car" speedFactor="1.09" vaporized=""/>
    <tripinfo id="car_n2e_159" depart="159.00" departLane="n2sep_1" departPos="3.60" departPosLat="0.00" departSpeed="13.90" departDelay="0.00" arrival="353.00" arrivalLane="c2e_1" arrivalPos="990.00" arrivalPosLat="0.00" arrivalSpeed="14.00" duration="194.00" routeLength="1996.47" waitingTime="34.00" waitingCount="2" stopTime="0.00" timeLoss="49.81" rerouteNo="1" devices="tripinfo_car_n2e_159 routing_car_n2e_159" vType="Car" speedFactor="1.01" vaporized=""/>
    <tripinfo id="car_n2s_176" depart="177.00" departLane="n2sep_1" departPos="3.60" departPosLat="0.00" departSpeed="13.90" departDelay="1.00" arrival="353.00" arrivalLane="c2s_1" arrivalPos="990.00" arrivalPosLat="0.00" arrivalSpeed="13.92" duration="176.00" routeLength="1997.01" waitingTime="17.00" waitingCount="1" stopTime="0.00" timeLoss="31.60" rerouteNo="1" devices="tripinfo_car_n2s_176 routing_car_n2s_176" vType="Car" speedFactor="1.00" vaporized=""/>
    <tripinfo id="car_s2n_209" depart="209.00" departLane="s2sep_1" departPos="3.60" departPosLat="0.00" departSpeed="13.90" departDelay="0.00" arrival="353.00" arrivalLane="c2n_1" arrivalPos="990.00" arrivalPosLat="0.00" arrivalSpeed="15.09" duration="144.00" routeLength="1997.01" waitingTime="0.00" waitingCount="0" stopTime="0.00" timeLoss="12.25" rerouteNo="1" devices="tripinfo_car_s2n_209 routing_car_s2n_209" vType="Car" speedFactor="1.10" vaporized=""/>
    <tripinfo id="car_n2w_179" depart="179.00" departLane="n2sep_1" departPos="3.60" departPosLat="0.00" departSpeed="13.90" departDelay="0.00" arrival="355.00" arrivalLane="c2w_1" arrivalPos="990.00" arrivalPosLat="0.00" arrivalSpeed="14.20" duration="176.00" routeLength="1986.69" waitingTime="16.00" waitingCount="1" stopTime="0.00" timeLoss="34.79" rerouteNo="1" devices="tripinfo_car_n2w_179 routing_car_n2w_179" vType="Car" speedFactor="1.02" vaporized=""/>
    <tripinfo id="car_n2e_175" depart="175.00" departLane="n2sep_1" departPos="3.60" departPosLat="0.00" departSpeed="13.90" departDelay="0.00" arrival="357.00" arrivalLane="c2e_1" arrivalPos="990.00" arrivalPosLat="0.00" arrivalSpeed="13.89" duration="182.00" routeLength="1996.47" waitingTime="18.00" waitingCount="2" stopTime="0.00" timeLoss="37.55" rerouteNo="1" devices="tripinfo_car_n2e_175 routing_car_n2e_175" vType="Car" speedFactor="1.00" vaporized=""/>
    <tripinfo id="car_n2s_180" depart="181.00" departLane="n2sep_1" departPos="3.60" departPosLat="0.00" departSpeed="13.90" departDelay="1.00" arrival="357.00" arrivalLane="c2s_1" arrivalPos="990.00" arrivalPosLat="0.00" arrivalSpeed="14.12" duration="176.00" routeLength="1997.01" waitingTime="14.00" waitingCount="1" stopTime="0.00" timeLoss="34.48" rerouteNo="1" devices="tripinfo_car_n2s_180 routing_car_n2s_180" vType="Car" speedFactor="1.02" vaporized=""/>
    <tripinfo id="car_s2w_199" depart="199.00" departLane="s2sep_1" departPos="3.60" departPosLat="0.00" departSpeed="13.90" departDelay="0.00" arrival="359.00" arrivalLane="c2w_1" arrivalPos="990.00" arrivalPosLat="0.00" arrivalSpeed="14.68" duration="160.00" routeLength="1996.47" waitingTime="11.00" waitingCount="1" stopTime="0.00" timeLoss="23.13" rerouteNo="1" devices="tripinfo_car_s2w_199 routing_car_s2w_199" vType="Car" speedFactor="1.06" vaporized=""/>
    <tripinfo id="car_n2s_213" depart="213.00" departLane="n2sep_1" departPos="3.60" departPosLat="0.00" departSpeed="13.90" departDelay="0.00" arrival="360.00" arrivalLane="c2s_1" arrivalPos="990.00" arrivalPosLat="0.00" arrivalSpeed="14.71" duration="147.00" routeLength="1997.01" waitingTime="0.00" waitingCount="0" stopTime="0.00" timeLoss="11.55" rerouteNo="1" devices="tripinfo_car_n2s_213 routing_car_n2s_213" vType="Car" speedFactor="1.07" vaporized=""/>
    <tripinfo id="car_n2s_225" depart="225.00" departLane="n2sep_1" departPos="3.60" departPosLat="0.00" departSpeed="13.90" departDelay="0.00" arrival="363.00" arrivalLane="c2s_1" arrivalPos="990.00" arrivalPosLat="0.00" arrivalSpeed="14.83" duration="138.00" routeLength="1997.01" waitingTime="0.00" waitingCount="0" stopTime="0.00" timeLoss="3.38" rerouteNo="1" devices="tripinfo_car_n2s_225 routing_car_n2s_225" vType="Car" speedFactor="1.07" vaporized=""/>
    <tripinfo id="car_s2e_217" depart="217.00" departLane="s2sep_1" departPos="3.60" departPosLat="0.00" departSpeed="13.90" departDelay="0.00" arrival="367.00" arrivalLane="c2e_1" arrivalPos="990.00" arrivalPosLat="0.00" arrivalSpeed="13.90" duration="150.00" routeLength="1986.69" waitingTime="0.00" waitingCount="0" stopTime="0.00" timeLoss="5.50" rerouteNo="1" devices="tripinfo_car_s2e_217 routing_car_s2e_217" vType="Car" speedFactor="1.00" vaporized=""/>
    <tripinfo id="car_s2w_200" depart="201.00" departLane="s2sep_1" departPos="3.60" departPosLat="0.00" departSpeed="13.90" departDelay="1.00" arrival="368.00" arrivalLane="c2w_1" arrivalPos="990.00" arrivalPosLat="0.00" arrivalSpeed="14.04" duration="167.00" routeLength="1996.47" waitingTime="8.00" waitingCount="1" stopTime="0.00" timeLoss="23.27" rerouteNo="1" devices="tripinfo_car_s2w_200 routing_car_s2w_200" vType="Car" speedFactor="1.01" vaporized=""/>
    <tripinfo id="car_s2w_204" depart="204.00" departLane="s2sep_1" departPos="3.60" departPosLat="0.00" departSpeed="13.90" departDelay="0.00" arrival="370.00" arrivalLane="c2w_1" arrivalPos="990.00" arrivalPosLat="0.00" arrivalSpeed="15.17" duration="166.00" routeLength="1996.47" waitingTime="7.00" waitingCount="1" stopTime="0.00" timeLoss="36.79" rerouteNo="1" devices="tripinfo_car_s2w_204 routing_car_s2w_204" vType="Car" speedFactor="1.12" vaporized=""/>
    <tripinfo id="car_s2e_225" depart="225.00" departLane="s2sep_1" departPos="3.60" departPosLat="0.00" departSpeed="13.90" departDelay="0.00" arrival="373.00" arrivalLane="c2e_1" arrivalPos="990.00" arrivalPosLat="0.00" arrivalSpeed="14.09" duration="148.00" routeLength="1986.69" waitingTime="0.00" waitingCount="0" stopTime="0.00" timeLoss="5.77" rerouteNo="1" devices="tripinfo_car_s2e_225 routing_car_s2e_225" vType="Car" speedFactor="1.01" vaporized=""/>
    <tripinfo id="car_s2e_227" depart="227.00" departLane="s2sep_1" departPos="3.60" departPosLat="0.00" departSpeed="13.90" departDelay="0.00" arrival="376.00" arrivalLane="c2e_1" arrivalPos="990.00" arrivalPosLat="0.00" arrivalSpeed="14.34" duration="149.00" routeLength="1986.69" waitingTime="0.00" waitingCount="0" stopTime="0.00" timeLoss="10.05" rerouteNo="1" devices="tripinfo_car_s2e_227 routing_car_s2e_227" vType="Car" speedFactor="1.03" vaporized=""/>
    <tripinfo id="car_w2s_190" depart="190.00" departLane="w2sep_1" departPos="3.60" departPosLat="0.00" departSpeed="13.90" departDelay="0.00" arrival="387.00" arrivalLane="c2s_1" arrivalPos="990.00" arrivalPosLat="0.00" arrivalSpeed="14.50" duration="197.00" routeLength="1986.69" waitingTime="48.00" waitingCount="1" stopTime="0.00" timeLoss="58.60" rerouteNo="1" devices="tripinfo_car_w2s_190 routing_car_w2s_190" vType="Car" speedFactor="1.04" vaporized=""/>
    <tripinfo id="car_e2w_238" depart="239.00" departLane="e2sep_1" departPos="3.60" departPosLat="0.00" departSpeed="13.90" departDelay="1.00" arrival="388.00" arrivalLane="c2w_1" arrivalPos="990.00" arrivalPosLat="0.00" arrivalSpeed="15.27" duration="149.00" routeLength="1997.01" waitingTime="1.00" waitingCount="1" stopTime="0.00" timeLoss="17.78" rerouteNo="1" devices="tripinfo_car_e2w_238 routing_car_e2w_238" vType="Car" speedFactor="1.10" vaporized=""/>
    <tripinfo id="car_e2n_218" depart="218.00" departLane="e2sep_1" departPos="3.60" departPosLat="0.00" departSpeed="13.90" departDelay="0.00" arrival="389.00" arrivalLane="c2n_1" arrivalPos="990.00" arrivalPosLat="0.00" arrivalSpeed="13.90" duration="171.00" routeLength="1986.69" waitingTime="18.00" waitingCount="1" stopTime="0.00" timeLoss="27.51" rerouteNo="1" devices="tripinfo_car_e2n_218 routing_car_e2n_218" vType="Car" speedFactor="1.00" vaporized=""/>
    <tripinfo id="car_w2s_216" depart="216.00" departLane="w2sep_1" departPos="3.60" departPosLat="0.00" departSpeed="13.90" departDelay="0.00" arrival="393.00" arrivalLane="c2s_1" arrivalPos="990.00" arrivalPosLat="0.00" arrivalSpeed="13.90" duration="177.00" routeLength="1986.69" waitingTime="21.00" waitingCount="1" stopTime="0.00" timeLoss="33.16" rerouteNo="1" devices="tripinfo_car_w2s_216 routing_car_w2s_216" vType="Car" speedFactor="1.00" vaporized=""/>
    <tripinfo id="car_w2e_235" depart="235.00" departLane="w2sep_1" departPos="3.60" departPosLat="0.00" departSpeed="13.90" departDelay="0.00" arrival="393.00" arrivalLane="c2e_1" arrivalPos="990.00" arrivalPosLat="0.00" arrivalSpeed="16.25" duration="158.00" routeLength="1997.01" waitingTime="10.00" waitingCount="1" stopTime="0.00" timeLoss="34.66" rerouteNo="1" devices="tripinfo_car_w2e_235 routing_car_w2e_235" vType="Car" speedFactor="1.17" vaporized=""/>
    <tripinfo id="car_e2n_237" depart="237.00" departLane="e2sep_1" departPos="3.60" departPosLat="0.00" departSpeed="13.90" departDelay="0.00" arrival="393.00" arrivalLane="c2n_1" arrivalPos="990.00" arrivalPosLat="0.00" arrivalSpeed="14.12" duration="156.00" routeLength="1986.69" waitingTime="1.00" waitingCount="1" stopTime="0.00" timeLoss="14.60" rerouteNo="1" devices="tripinfo_car_e2n_237 routing_car_e2n_237" vType="Car" speedFactor="1.02" vaporized=""/>
    <tripinfo id="car_w2n_243" depart="243.00" departLane="w2sep_1" departPos="3.60" departPosLat="0.00" departSpeed="13.90" departDelay="0.00" arrival="396.00" arrivalLane="c2n_1" arrivalPos="990.00" arrivalPosLat="0.00" arrivalSpeed="15.08" duration="153.00" routeLength="1996.47" waitingTime="1.00" waitingCount="1" stopTime="0.00" timeLoss="20.49" rerouteNo="1" devices="tripinfo_car_w2n_243 routing_car_w2n_243" vType="Car" speedFactor="1.10" vaporized=""/>
    <tripinfo id="car_w2s_220" depart="220.00" departLane="w2sep_1" departPos="3.60" departPosLat="0.00" departSpeed="13.90" departDelay="0.00" arrival="397.00" arrivalLane="c2s_1" arrivalPos="990.00" arrivalPosLat="0.00" arrivalSpeed="13.89" duration="177.00" routeLength="1986.69" waitingTime="18.00" waitingCount="1" stopTime="0.00" timeLoss="33.40" rerouteNo="1" devices="tripinfo_car_w2s_220 routing_car_w2s_220" vType="Car" speedFactor="1.00" vaporized=""/>
    <tripinfo id="car_w2n_245" depart="245.00" departLane="w2sep_1" departPos="3.60" departPosLat="0.00" departSpeed="13.90" departDelay="0.00" arrival="400.00" arrivalLane="c2n_1" arrivalPos="990.00" arrivalPosLat="0.00" arrivalSpeed="13.95" duration="155.00" routeLength="1996.47" waitingTime="0.00" waitingCount="0" stopTime="0.00" timeLoss="11.36" rerouteNo="1" devices="tripinfo_car_w2n_245 routing_car_w2n_245" vType="Car" speedFactor="1.00" vaporized=""/>
    <tripinfo id="car_e2w_260" depart="260.00" departLane="e2sep_1" departPos="3.60" departPosLat="0.00" departSpeed="13.90" departDelay="0.00" arrival="402.00" arrivalLane="c2w_1" arrivalPos="990.00" arrivalPosLat="0.00" arrivalSpeed="14.23" duration="142.00" routeLength="1997.01" waitingTime="0.00" waitingCount="0" stopTime="0.00" timeLoss="0.64" rerouteNo="1" devices="tripinfo_car_e2w_260 routing_car_e2w_260" vType="Car" speedFactor="1.02" vaporized=""/>
    <tripinfo id="bus_w2s_231" depart="231.00" departLane="w2sep_1" departPos="12.10" departPosLat="0.00" departSpeed="13.90" departDelay="0.00" arrival="403.00" arrivalLane="c2s_1" arrivalPos="990.00" arrivalPosLat="0.00" arrivalSpeed="13.88" duration="172.00" routeLength="1978.19" waitingTime="10.00" waitingCount="1" stopTime="0.00" timeLoss="27.97" rerouteNo="1" devices="tripinfo_bus_w2s_231 routing_bus_w2s_231" vType="Bus" speedFactor="1.00" vaporized=""/>
    <tripinfo id="car_e2w_277" depart="277.00" departLane="e2sep_1" departPos="3.60" departPosLat="0.00" departSpeed="13.90" departDelay="0.00" arrival="406.00" arrivalLane="c2w_1" arrivalPos="990.00" arrivalPosLat="0.00" arrivalSpeed="17.00" duration="129.00" routeLength="1997.01" waitingTime="0.00" waitingCount="0" stopTime="0.00" timeLoss="11.37" rerouteNo="1" devices="tripinfo_car_e2w_277 routing_car_e2w_277" vType="Car" speedFactor="1.23" vaporized=""/>
    <tripinfo id="car_e2n_261" depart="262.00" departLane="e2sep_1" departPos="3.60" departPosLat="0.00" departSpeed="13.90" departDelay="1.00" arrival="407.00" arrivalLane="c2n_1" arrivalPos="990.00" arrivalPosLat="0.00" arrivalSpeed="14.75" duration="145.00" routeLength="1986.69" waitingTime="0.00" waitingCount="0" stopTime="0.00" timeLoss="8.86" rerouteNo="1" devices="tripinfo_car_e2n_261 routing_car_e2n_261" vType="Car" speedFactor="1.06" vaporized=""/>
    <tripinfo id="car_w2s_247" depart="247.00" departLane="w2sep_1" departPos="3.60" departPosLat="0.00" departSpeed="13.90" departDelay="0.00" arrival="408.00" arrivalLane="c2s_1" arrivalPos="990.00" arrivalPosLat="0.00" arrivalSpeed="13.94" duration="161.00" routeLength="1986.69" waitingTime="0.00" waitingCount="0" stopTime="0.00" timeLoss="16.95" rerouteNo="1" devices="tripinfo_car_w2s_247 routing_car_w2s_247" vType="Car" speedFactor="1.00" vaporized=""/>
    <tripinfo id="car_e2n_265" depart="265.00" departLane="e2sep_1" departPos="3.60" departPosLat="0.00" departSpeed="13.90" departDelay="0.00" arrival="409.00" arrivalLane="c2n_1" arrivalPos="990.00" arrivalPosLat="0.00" arrivalSpeed="15.66" duration="144.00" routeLength="1986.69" waitingTime="0.00" waitingCount="0" stopTime="0.00" timeLoss="19.02" rerouteNo="1" devices="tripinfo_car_e2n_265 routing_car_e2n_265" vType="Car" speedFactor="1.15" vaporized=""/>
    <tripinfo id="bus_w2s_260" depart="260.00" departLane="w2sep_1" departPos="12.10" departPosLat="0.00" departSpeed="13.90" departDelay="0.00" arrival="412.00" arrivalLane="c2s_1" arrivalPos="990.00" arrivalPosLat="0.00" arrivalSpeed="13.84" duration="152.00" routeLength="1978.19" waitingTime="0.00" waitingCount="0" stopTime="0.00" timeLoss="8.84" rerouteNo="1" devices="tripinfo_bus_w2s_260 routing_bus_w2s_260" vType="Bus" speedFactor="1.00" vaporized=""/>
    <tripinfo id="car_w2e_269" depart="269.00" departLane="w2sep_1" departPos="3.60" departPosLat="0.00" departSpeed="13.90" departDelay="0.00" arrival="414.00" arrivalLane="c2e_1" arrivalPos="990.00" arrivalPosLat="0.00" arrivalSpeed="13.90" duration="145.00" routeLength="1997.01" waitingTime="0.00" waitingCount="0" stopTime="0.00" timeLoss="0.80" rerouteNo="1" devices="tripinfo_car_w2e_269 routing_car_w2e_269" vType="Car" speedFactor="1.00" vaporized=""/>
    <tripinfo id="car_e2w_281" depart="281.00" departLane="e2sep_1" departPos="3.60" departPosLat="0.00" departSpeed="13.90" departDelay="0.00" arrival="414.00" arrivalLane="c2w_1" arrivalPos="990.00" arrivalPosLat="0.00" arrivalSpeed="15.56" duration="133.00" routeLength="1997.01" waitingTime="0.00" waitingCount="0" stopTime="0.00" timeLoss="3.73" rerouteNo="1" devices="tripinfo_car_e2w_281 routing_car_e2w_281" vType="Car" speedFactor="1.12" vaporized=""/>
    <tripinfo id="car_e2s_202" depart="202.00" departLane="e2sep_1" departPos="3.60" departPosLat="0.00" departSpeed="13.90" departDelay="0.00" arrival="415.00" arrivalLane="c2s_1" arrivalPos="990.00" arrivalPosLat="0.00" arrivalSpeed="14.96" duration="213.00" routeLength="1996.47" waitingTime="59.00" waitingCount="2" stopTime="0.00" timeLoss="79.97" rerouteNo="1" devices="tripinfo_car_e2s_202 routing_car_e2s_202" vType="Car" speedFactor="1.09" vaporized=""/>
    <tripinfo id="car_e2n_268" depart="268.00" departLane="e2sep_1" departPos="3.60" departPosLat="0.00" departSpeed="13.90" departDelay="0.00" arrival="415.00" arrivalLane="c2n_1" arrivalPos="990.00" arrivalPosLat="0.00" arrivalSpeed="14.35" duration="147.00" routeLength="1986.69" waitingTime="0.00" waitingCount="0" stopTime="0.00" timeLoss="7.41" rerouteNo="1" devices="tripinfo_car_e2n_268 routing_car_e2n_268" vType="Car" speedFactor="1.03" vaporized=""/>
    <tripinfo id="car_e2s_228" depart="228.00" departLane="e2sep_1" departPos="3.60" departPosLat="0.00" departSpeed="13.90" departDelay="0.00" arrival="418.00" arrivalLane="c2s_1" arrivalPos="990.00" arrivalPosLat="0.00" arrivalSpeed="14.72" duration="190.00" routeLength="1996.47" waitingTime="32.00" waitingCount="2" stopTime="0.00" timeLoss="53.85" rerouteNo="1" devices="tripinfo_car_e2s_228 routing_car_e2s_228" vType="Car" speedFactor="1.06" vaporized=""/>
    <tripinfo id="car_e2s_243" depart="243.00" departLane="e2sep_1" departPos="3.60" departPosLat="0.00" departSpeed="13.90" departDelay="0.00" arrival="420.00" arrivalLane="c2s_1" arrivalPos="990.00" arrivalPosLat="0.00" arrivalSpeed="14.95" duration="177.00" routeLength="1996.47" waitingTime="20.00" waitingCount="2" stopTime="0.00" timeLoss="44.97" rerouteNo="1" devices="tripinfo_car_e2s_243 routing_car_e2s_243" vType="Car" speedFactor="1.10" vaporized=""/>
    <tripinfo id="car_e2s_254" depart="254.00" departLane="e2sep_1" departPos="3.60" departPosLat="0.00" departSpeed="13.90" departDelay="0.00" arrival="423.00" arrivalLane="c2s_1" arrivalPos="990.00" arrivalPosLat="0.00" arrivalSpeed="14.80" duration="169.00" routeLength="1996.47" waitingTime="16.00" waitingCount="1" stopTime="0.00" timeLoss="33.60" rerouteNo="1" devices="tripinfo_car_e2s_254 routing_car_e2s_254" vType="Car" speedFactor="1.07" vaporized=""/>
    <tripinfo id="car_e2s_273" depart="273.00" departLane="e2sep_1" departPos="3.60" departPosLat="0.00" departSpeed="13.90" departDelay="0.00" arrival="426.00" arrivalLane="c2s_1" arrivalPos="990.00" arrivalPosLat="0.00" arrivalSpeed="14.77" duration="153.00" routeLength="1996.47" waitingTime="0.00" waitingCount="0" stopTime="0.00" timeLoss="17.13" rerouteNo="1" devices="tripinfo_car_e2s_273 routing_car_e2s_273" vType="Car" speedFactor="1.07" vaporized=""/>
    <tripinfo id="car_w2n_280" depart="280.00" departLane="w2sep_1" departPos="3.60" departPosLat="0.00" departSpeed="13.90" departDelay="0.00" arrival="426.00" arrivalLane="c2n_1" arrivalPos="990.00" arrivalPosLat="0.00" arrivalSpeed="14.06" duration="146.00" routeLength="1996.47" waitingTime="0.00" waitingCount="0" stopTime="0.00" timeLoss="2.81" rerouteNo="1" devices="tripinfo_car_w2n_280 routing_car_w2n_280" vType="Car" speedFactor="1.01" vaporized=""/>
    <tripinfo id="car_w2n_291" depart="291.00" departLane="w2sep_1" departPos="3.60" departPosLat="0.00" departSpeed="13.90" departDelay="0.00" arrival="428.00" arrivalLane="c2n_1" arrivalPos="990.00" arrivalPosLat="0.00" arrivalSpeed="15.56" duration="137.00" routeLength="1996.47" waitingTime="0.00" waitingCount="0" stopTime="0.00" timeLoss="12.41" rerouteNo="1" devices="tripinfo_car_w2n_291 routing_car_w2n_291" vType="Car" speedFactor="1.16" vaporized=""/>
    <tripinfo id="car_n2s_258" depart="258.00" departLane="n2sep_1" departPos="3.60" departPosLat="0.00" departSpeed="13.90" departDelay="0.00" arrival="433.00" arrivalLane="c2s_1" arrivalPos="990.00" arrivalPosLat="0.00" arrivalSpeed="15.33" duration="175.00" routeLength="1997.01" waitingTime="32.00" waitingCount="1" stopTime="0.00" timeLoss="44.31" rerouteNo="1" devices="tripinfo_car_n2s_258 routing_car_n2s_258" vType="Car" speedFactor="1.10" vaporized=""/>
    <tripinfo id="car_n2w_242" depart="242.00" departLane="n2sep_1" departPos="3.60" departPosLat="0.00" departSpeed="13.90" departDelay="0.00" arrival="434.00" arrivalLane="c2w_1" arrivalPos="990.00" arrivalPosLat="0.00" arrivalSpeed="14.03" duration="192.00" routeLength="1986.69" waitingTime="39.00" waitingCount="1" stopTime="0.00" timeLoss="49.20" rerouteNo="1" devices="tripinfo_car_n2w_242 routing_car_n2w_242" vType="Car" speedFactor="1.01" vaporized=""/>
    <tripinfo id="car_s2n_228" depart="229.00" departLane="s2sep_1" departPos="3.60" departPosLat="0.00" departSpeed="13.90" departDelay="1.00" arrival="435.00" arrivalLane="c2n_1" arrivalPos="990.00" arrivalPosLat="0.00" arrivalSpeed="13.90" duration="206.00" routeLength="1997.01" waitingTime="49.00" waitingCount="1" stopTime="0.00" timeLoss="62.07" rerouteNo="1" devices="tripinfo_car_s2n_228 routing_car_s2n_228" vType="Car" speedFactor="1.00" vaporized=""/>
    <tripinfo id="car_n2w_244" depart="244.00" departLane="n2sep_1" departPos="3.60" departPosLat="0.00" departSpeed="13.90" departDelay="0.00" arrival="436.00" arrivalLane="c2w_1" arrivalPos="990.00" arrivalPosLat="0.00" arrivalSpeed="15.65" duration="192.00" routeLength="1986.69" waitingTime="39.00" waitingCount="1" stopTime="0.00" timeLoss="69.26" rerouteNo="1" devices="tripinfo_car_n2w_244 routing_car_n2w_244" vType="Car" speedFactor="1.18" vaporized=""/>
    <tripinfo id="car_n2s_271" depart="271.00" departLane="n2sep_1" departPos="3.60" departPosLat="0.00" departSpeed="13.90" departDelay="0.00" arrival="437.00" arrivalLane="c2s_1" arrivalPos="990.00" arrivalPosLat="0.00" arrivalSpeed="15.52" duration="166.00" routeLength="1997.01" waitingTime="21.00" waitingCount="1" stopTime="0.00" timeLoss="36.64" rerouteNo="1" devices="tripinfo_car_n2s_271 routing_car_n2s_271" vType="Car" speedFactor="1.12" vaporized=""/>
    <tripinfo id="car_n2w_290" depart="290.00" departLane="n2sep_1" departPos="3.60" departPosLat="0.00" departSpeed="13.90" departDelay="0.00" arrival="439.00" arrivalLane="c2w_1" arrivalPos="990.00" arrivalPosLat="0.00" arrivalSpeed="15.42" duration="149.00" routeLength="1986.69" waitingTime="2.00" waitingCount="1" stopTime="0.00" timeLoss="19.79" rerouteNo="1" devices="tripinfo_car_n2w_290 routing_car_n2w_290" vType="Car" speedFactor="1.11" vaporized=""/>
    <tripinfo id="bus_s2e_255" depart="257.00" departLane="s2sep_1" departPos="12.10" departPosLat="0.00" departSpeed="13.90" departDelay="2.00" arrival="440.00" arrivalLane="c2e_1" arrivalPos="990.00" arrivalPosLat="0.00" arrivalSpeed="13.90" duration="183.00" routeLength="1978.19" waitingTime="26.00" waitingCount="1" stopTime="0.00" timeLoss="40.08" rerouteNo="1" devices="tripinfo_bus_s2e_255 routing_bus_s2e_255" vType="Bus" speedFactor="1.00" vaporized=""/>
    <tripinfo id="car_s2n_258" depart="259.00" departLane="s2sep_1" departPos="3.60" departPosLat="0.00" departSpeed="13.90" departDelay="1.00" arrival="441.00" arrivalLane="c2n_1" arrivalPos="990.00" arrivalPosLat="0.00" arrivalSpeed="14.33" duration="182.00" routeLength="1997.01" waitingTime="25.00" waitingCount="1" stopTime="0.00" timeLoss="41.77" rerouteNo="1" devices="tripinfo_car_s2n_258 routing_car_s2n_258" vType="Car" speedFactor="1.03" vaporized=""/>
    <tripinfo id="car_n2w_301" depart="301.00" departLane="n2sep_1" departPos="3.60" departPosLat="0.00" departSpeed="13.90" departDelay="0.00" arrival="442.00" arrivalLane="c2w_1" arrivalPos="990.00" arrivalPosLat="0.00" arrivalSpeed="15.77" duration="141.00" routeLength="1986.69" waitingTime="0.00" waitingCount="0" stopTime="0.00" timeLoss="14.83" rerouteNo="1" devices="tripinfo_car_n2w_301 routing_car_n2w_301" vType="Car" speedFactor="1.14" vaporized=""/>
    <tripinfo id="car_s2e_274" depart="274.00" departLane="s2sep_1" departPos="3.60" departPosLat="0.00" departSpeed="13.90" departDelay="0.00" arrival="443.00" arrivalLane="c2e_1" arrivalPos="990.00" arrivalPosLat="0.00" arrivalSpeed="15.61" duration="169.00" routeLength="1986.69" waitingTime="15.00" waitingCount="1" stopTime="0.00" timeLoss="42.82" rerouteNo="1" devices="tripinfo_car_s2e_274 routing_car_s2e_274" vType="Car" speedFactor="1.14" vaporized=""/>
    <tripinfo id="car_s2n_271" depart="271.00" departLane="s2sep_1" departPos="3.60" departPosLat="0.00" departSpeed="13.90" departDelay="0.00" arrival="445.00" arrivalLane="c2n_1" arrivalPos="990.00" arrivalPosLat="0.00" arrivalSpeed="14.01" duration="174.00" routeLength="1997.01" waitingTime="15.00" waitingCount="1" stopTime="0.00" timeLoss="31.44" rerouteNo="1" devices="tripinfo_car_s2n_271 routing_car_s2n_271" vType="Car" speedFactor="1.01" vaporized=""/>
    <tripinfo id="car_s2e_301" depart="301.00" departLane="s2sep_1" departPos="3.60" departPosLat="0.00" departSpeed="13.90" departDelay="0.00" arrival="446.00" arrivalLane="c2e_1" arrivalPos="990.00" arrivalPosLat="0.00" arrivalSpeed="15.49" duration="145.00" routeLength="1986.69" waitingTime="0.00" waitingCount="0" stopTime="0.00" timeLoss="16.46" rerouteNo="1" devices="tripinfo_car_s2e_301 routing_car_s2e_301" vType="Car" speedFactor="1.12" vaporized=""/>
    <tripinfo id="car_s2n_275" depart="276.00" departLane="s2sep_1" departPos="3.60" departPosLat="0.00" departSpeed="13.90" departDelay="1.00" arrival="449.00" arrivalLane="c2n_1" arrivalPos="990.00" arrivalPosLat="0.00" arrivalSpeed="14.40" duration="173.00" routeLength="1997.01" waitingTime="13.00" waitingCount="1" stopTime="0.00" timeLoss="33.82" rerouteNo="1" devices="tripinfo_car_s2n_275 routing_car_s2n_275" vType="Car" speedFactor="1.04" vaporized=""/>
    <tripinfo id="car_s2w_254" depart="254.00" departLane="s2sep_1" departPos="3.60" departPosLat="0.00" departSpeed="13.90" departDelay="0.00" arrival="451.00" arrivalLane="c2w_1" arrivalPos="990.00" arrivalPosLat="0.00" arrivalSpeed="13.90" duration="197.00" routeLength="1996.47" waitingTime="35.00" waitingCount="2" stopTime="0.00" timeLoss="52.58" rerouteNo="1" devices="tripinfo_car_s2w_254 routing_car_s2w_254" vType="Car" speedFactor="1.00" vaporized=""/>
    <tripinfo id="car_n2e_273" depart="273.00" departLane="n2sep_1" departPos="3.60" departPosLat="0.00" departSpeed="13.90" departDelay="0.00" arrival="453.00" arrivalLane="c2e_1" arrivalPos="990.00" arrivalPosLat="0.00" arrivalSpeed="14.35" duration="180.00" routeLength="1996.47" waitingTime="23.00" waitingCount="2" stopTime="0.00" timeLoss="40.13" rerouteNo="1" devices="tripinfo_car_n2e_273 routing_car_n2e_273" vType="Car" speedFactor="1.03" vaporized=""/>
    <tripinfo id="car_s2w_285" depart="285.00" departLane="s2sep_1" departPos="3.60" departPosLat="0.00" departSpeed="13.90" departDelay="0.00" arrival="455.00" arrivalLane="c2w_1" arrivalPos="990.00" arrivalPosLat="0.00" arrivalSpeed="13.94" duration="170.00" routeLength="1996.47" waitingTime="8.00" waitingCount="1" stopTime="0.00" timeLoss="26.18" rerouteNo="1" devices="tripinfo_car_s2w_285 routing_car_s2w_285" vType="Car" speedFactor="1.00" vaporized=""/>
    <tripinfo id="car_n2e_288" depart="288.00" departLane="n2sep_1" departPos="3.60" departPosLat="0.00" departSpeed="13.90" departDelay="0.00" arrival="458.00" arrivalLane="c2e_1" arrivalPos="990.00" arrivalPosLat="0.00" arrivalSpeed="14.22" duration="170.00" routeLength="1996.47" waitingTime="12.00" waitingCount="1" stopTime="0.00" timeLoss="28.14" rerouteNo="1" devices="tripinfo_car_n2e_288 routing_car_n2e_288" vType="Car" speedFactor="1.02" vaporized=""/>
    <tripinfo id="car_s2w_310" depart="310.00" departLane="s2sep_1" departPos="3.60" departPosLat="0.00" departSpeed="13.90" departDelay="0.00" arrival="458.00" arrivalLane="c2w_1" arrivalPos="990.00" arrivalPosLat="0.00" arrivalSpeed="14.38" duration="148.00" routeLength="1996.47" waitingTime="0.00" waitingCount="0" stopTime="0.00" timeLoss="8.69" rerouteNo="1" devices="tripinfo_car_s2w_310 routing_car_s2w_310" vType="Car" speedFactor="1.04" vaporized=""/>
    <tripinfo id="car_n2e_299" depart="299.00" departLane="n2sep_1" departPos="3.60" departPosLat="0.00" departSpeed="13.90" departDelay="0.00" arrival="460.00" arrivalLane="c2e_1" arrivalPos="990.00" arrivalPosLat="0.00" arrivalSpeed="14.81" duration="161.00" routeLength="1996.47" waitingTime="9.00" waitingCount="1" stopTime="0.00" timeLoss="27.40" rerouteNo="1" devices="tripinfo_car_n2e_299 routing_car_n2e_299" vType="Car" speedFactor="1.08" vaporized=""/>
    <tripinfo id="car_s2n_315" depart="315.00" departLane="s2sep_1" departPos="3.60" departPosLat="0.00" departSpeed="13.90" departDelay="0.00" arrival="460.00" arrivalLane="c2n_1" arrivalPos="990.00" arrivalPosLat="0.00" arrivalSpeed="13.96" duration="145.00" routeLength="1997.01" waitingTime="0.00" waitingCount="0" stopTime="0.00" timeLoss="1.03" rerouteNo="1" devices="tripinfo_car_s2n_315 routing_car_s2n_315" vType="Car" speedFactor="1.00" vaporized=""/>
    <tripinfo id="car_n2w_321" depart="321.00" departLane="n2sep_1" departPos="3.60" departPosLat="0.00" departSpeed="13.90" departDelay="0.00" arrival="463.00" arrivalLane="c2w_1" arrivalPos="990.00" arrivalPosLat="0.00" arrivalSpeed="14.79" duration="142.00" routeLength="1986.69" waitingTime="0.00" waitingCount="0" stopTime="0.00" timeLoss="6.25" rerouteNo="1" devices="tripinfo_car_n2w_321 routing_car_n2w_321" vType="Car" speedFactor="1.06" vaporized=""/>
    <tripinfo id="car_s2w_319" depart="319.00" departLane="s2sep_1" departPos="3.60" departPosLat="0.00" departSpeed="13.90" departDelay="0.00" arrival="466.00" arrivalLane="c2w_1" arrivalPos="990.00" arrivalPosLat="0.00" arrivalSpeed="14.85" duration="147.00" routeLength="1996.47" waitingTime="0.00" waitingCount="0" stopTime="0.00" timeLoss="12.38" rerouteNo="1" devices="tripinfo_car_s2w_319 routing_car_s2w_319" vType="Car" speedFactor="1.07" vaporized=""/>
    <tripinfo id="car_s2w_320" depart="321.00" departLane="s2sep_1" departPos="3.60" departPosLat="0.00" departSpeed="13.90" departDelay="1.00" arrival="472.00" arrivalLane="c2w_1" arrivalPos="990.00" arrivalPosLat="0.00" arrivalSpeed="13.90" duration="151.00" routeLength="1996.47" waitingTime="0.00" waitingCount="0" stopTime="0.00" timeLoss="6.50" rerouteNo="1" devices="tripinfo_car_s2w_320 routing_car_s2w_320" vType="Car" speedFactor="1.00" vaporized=""/>
    <tripinfo id="car_e2w_297" depart="297.00" departLane="e2sep_1" departPos="3.60" departPosLat="0.00" departSpeed="13.90" departDelay="0.00" arrival="475.00" arrivalLane="c2w_1" arrivalPos="990.00" arrivalPosLat="0.00" arrivalSpeed="15.58" duration="178.00" routeLength="1997.01" waitingTime="38.00" waitingCount="1" stopTime="0.00" timeLoss="50.49" rerouteNo="1" devices="tripinfo_car_e2w_297 routing_car_e2w_297" vType="Car" speedFactor="1.13" vaporized=""/>
    <tripinfo id="car_e2n_281" depart="283.00" departLane="e2sep_1" departPos="3.60" departPosLat="0.00" departSpeed="13.90" departDelay="2.00" arrival="478.00" arrivalLane="c2n_1" arrivalPos="990.00" arrivalPosLat="0.00" arrivalSpeed="14.11" duration="195.00" routeLength="1986.69" waitingTime="43.00" waitingCount="1" stopTime="0.00" timeLoss="53.65" rerouteNo="1" devices="tripinfo_car_e2n_281 routing_car_e2n_281" vType="Car" speedFactor="1.02" vaporized=""/>
    <tripinfo id="car_w2e_293" depart="293.00" departLane="w2sep_1" departPos="3.60" departPosLat="0.00" departSpeed="13.90" departDelay="0.00" arrival="480.00" arrivalLane="c2e_1" arrivalPos="990.00" arrivalPosLat="0.00" arrivalSpeed="13.90" duration="187.00" routeLength="1997.01" waitingTime="33.00" waitingCount="1" stopTime="0.00" timeLoss="42.61" rerouteNo="1" devices="tripinfo_car_w2e_293 routing_car_w2e_293" vType="Car" speedFactor="1.00" vaporized=""/>
    <tripinfo id="car_w2s_312" depart="312.00" departLane="w2sep_1" departPos="3.60" departPosLat="0.00" departSpeed="13.90" departDelay="0.00" arrival="482.00" arrivalLane="c2s_1" arrivalPos="990.00" arrivalPosLat="0.00" arrivalSpeed="13.90" duration="170.00" routeLength="1986.69" waitingTime="15.00" waitingCount="1" stopTime="0.00" timeLoss="26.14" rerouteNo="1" devices="tripinfo_car_w2s_312 routing_car_w2s_312" vType="Car" speedFactor="1.00" vaporized=""/>
    <tripinfo id="car_e2w_304" depart="304.00" departLane="e2sep_1" departPos="3.60" departPosLat="0.00" departSpeed="13.90" departDelay="0.00" arrival="484.00" arrivalLane="c2w_1" arrivalPos="990.00" arrivalPosLat="0.00" arrivalSpeed="13.93" duration="180.00" routeLength="1997.01" waitingTime="25.00" waitingCount="1" stopTime="0.00" timeLoss="36.57" rerouteNo="1" devices="tripinfo_car_e2w_304 routing_car_e2w_304" vType="Car" speedFactor="1.00" vaporized=""/>
    <tripinfo id="car_w2s_326" depart="326.00" departLane="w2sep_1" departPos="3.60" departPosLat="0.00" departSpeed="13.90" departDelay="0.00" arrival="485.00" arrivalLane="c2s_1" arrivalPos="990.00" arrivalPosLat="0.00" arrivalSpeed="14.87" duration="159.00" routeLength="1986.69" waitingTime="7.00" waitingCount="1" stopTime="0.00" timeLoss="25.16" rerouteNo="1" devices="tripinfo_car_w2s_326 routing_car_w2s_326" vType="Car" speedFactor="1.08" vaporized=""/>
    <tripinfo id="car_e2n_340" depart="340.00" departLane="e2sep_1" departPos="3.60" departPosLat="0.00" departSpeed="13.90" departDelay="0.00" arrival="486.00" arrivalLane="c2n_1" arrivalPos="990.00" arrivalPosLat="0.00" arrivalSpeed="15.66" duration="146.00" routeLength="1986.69" waitingTime="1.00" waitingCount="1" stopTime="0.00" timeLoss="17.73" rerouteNo="1" devices="tripinfo_car_e2n_340 routing_car_e2n_340" vType="Car" speedFactor="1.13" vaporized=""/>
    <tripinfo id="car_e2w_310" depart="311.00" departLane="e2sep_1" departPos="3.60" departPosLat="0.00" departSpeed="13.90" departDelay="1.00" arrival="488.00" arrivalLane="c2w_1" arrivalPos="990.00" arrivalPosLat="0.00" arrivalSpeed="14.10" duration="177.00" routeLength="1997.01" waitingTime="19.00" waitingCount="1" stopTime="0.00" timeLoss="35.18" rerouteNo="1" devices="tripinfo_car_e2w_310 routing_car_e2w_310" vType="Car" speedFactor="1.02" vaporized=""/>
    <tripinfo id="car_e2w_322" depart="322.00" departLane="e2sep_1" departPos="3.60" departPosLat="0.00" departSpeed="13.90" departDelay="0.00" arrival="490.00" arrivalLane="c2w_1" arrivalPos="990.00" arrivalPosLat="0.00" arrivalSpeed="15.14" duration="168.00" routeLength="1997.01" waitingTime="17.00" waitingCount="1" stopTime="0.00" timeLoss="39.79" rerouteNo="1" devices="tripinfo_car_e2w_322 routing_car_e2w_322" vType="Car" speedFactor="1.12" vaporized=""/>
    <tripinfo id="bus_e2s_309" depart="309.00" departLane="e2sep_1" departPos="12.10" departPosLat="0.00" departSpeed="13.90" departDelay="0.00" arrival="492.00" arrivalLane="c2s_1" arrivalPos="990.00" arrivalPosLat="0.00" arrivalSpeed="13.89" duration="183.00" routeLength="1987.97" waitingTime="20.00" waitingCount="2" stopTime="0.00" timeLoss="38.86" rerouteNo="1" devices="tripinfo_bus_e2s_309 routing_bus_e2s_309" vType="Bus" speedFactor="1.00" vaporized=""/>
    <tripinfo id="car_e2w_325" depart="325.00" departLane="e2sep_1" departPos="3.60" departPosLat="0.00" departSpeed="13.90" departDelay="0.00" arrival="492.00" arrivalLane="c2w_1" arrivalPos="990.00" arrivalPosLat="0.00" arrivalSpeed="15.67" duration="167.00" routeLength="1997.01" waitingTime="15.00" waitingCount="1" stopTime="0.00" timeLoss="44.67" rerouteNo="1" devices="tripinfo_car_e2w_325 routing_car_e2w_325" vType="Car" speedFactor="1.18" vaporized=""/>
    <tripinfo id="bus_e2s_313" depart="314.00" departLane="e2sep_1" departPos="12.10" departPosLat="0.00" departSpeed="13.90" departDelay="1.00" arrival="497.00" arrivalLane="c2s_1" arrivalPos="990.00" arrivalPosLat="0.00" arrivalSpeed="13.86" duration="183.00" routeLength="1987.97" waitingTime="15.00" waitingCount="2" stopTime="0.00" timeLoss="39.11" rerouteNo="1" devices="tripinfo_bus_e2s_313 routing_bus_e2s_313" vType="Bus" speedFactor="1.00" vaporized=""/>
    <tripinfo id="car_w2e_356" depart="356.00" departLane="w2sep_1" departPos="3.60" departPosLat="0.00" departSpeed="13.90" departDelay="0.00" arrival="497.00" arrivalLane="c2e_1" arrivalPos="990.00" arrivalPosLat="0.00" arrivalSpeed="14.31" duration="141.00" routeLength="1997.01" waitingTime="0.00" waitingCount="0" stopTime="0.00" timeLoss="0.70" rerouteNo="1" devices="tripinfo_car_w2e_356 routing_car_w2e_356" vType="Car" speedFactor="1.03" vaporized=""/>
    <tripinfo id="car_e2n_349" depart="349.00" departLane="e2sep_1" departPos="3.60" departPosLat="0.00" departSpeed="13.90" departDelay="0.00" arrival="498.00" arrivalLane="c2n_1" arrivalPos="990.00" arrivalPosLat="0.00" arrivalSpeed="13.96" duration="149.00" routeLength="1986.69" waitingTime="0.00" waitingCount="0" stopTime="0.00" timeLoss="5.77" rerouteNo="1" devices="tripinfo_car_e2n_349 routing_car_e2n_349" vType="Car" speedFactor="1.00" vaporized=""/>
    <tripinfo id="car_w2n_337" depart="337.00" departLane="w2sep_1" departPos="3.60" departPosLat="0.00" departSpeed="13.90" departDelay="0.00" arrival="501.00" arrivalLane="c2n_1" arrivalPos="990.00" arrivalPosLat="0.00" arrivalSpeed="14.86" duration="164.00" routeLength="1996.47" waitingTime="12.00" waitingCount="1" stopTime="0.00" timeLoss="29.25" rerouteNo="1" devices="tripinfo_car_w2n_337 routing_car_w2n_337" vType="Car" speedFactor="1.08" vaporized=""/>
    <tripinfo id="car_w2e_359" depart="359.00" departLane="w2sep_1" departPos="3.60" departPosLat="0.00" departSpeed="13.90" departDelay="0.00" arrival="503.00" arrivalLane="c2e_1" arrivalPos="990.00" arrivalPosLat="0.00" arrivalSpeed="14.21" duration="144.00" routeLength="1997.01" waitingTime="0.00" waitingCount="0" stopTime="0.00" timeLoss="2.57" rerouteNo="1" devices="tripinfo_car_w2e_359 routing_car_w2e_359" vType="Car" speedFactor="1.02" vaporized=""/>
    <tripinfo id="car_w2n_346" depart="346.00" departLane="w2sep_1" departPos="3.60" departPosLat="0.00" departSpeed="13.90" departDelay="0.00" arrival="504.00" arrivalLane="c2n_1" arrivalPos="990.00" arrivalPosLat="0.00" arrivalSpeed="14.56" duration="158.00" routeLength="1996.47" waitingTime="3.00" waitingCount="1" stopTime="0.00" timeLoss="19.85" rerouteNo="1" devices="tripinfo_car_w2n_346 routing_car_w2n_346" vType="Car" speedFactor="1.05" vaporized=""/>
    <tripinfo id="car_e2s_335" depart="335.00" departLane="e2sep_1" departPos="3.60" departPosLat="0.00" departSpeed="13.90" departDelay="0.00" arrival="507.00" arrivalLane="c2s_1" arrivalPos="990.00" arrivalPosLat="0.00" arrivalSpeed="13.90" duration="172.00" routeLength="1996.47" waitingTime="5.00" waitingCount="2" stopTime="0.00" timeLoss="27.53" rerouteNo="1" devices="tripinfo_car_e2s_335 routing_car_e2s_335" vType="Car" speedFactor="1.00" vaporized=""/>
    <tripinfo id="bus_w2n_351" depart="351.00" departLane="w2sep_1" departPos="12.10" departPosLat="0.00" departSpeed="13.90" departDelay="0.00" arrival="509.00" arrivalLane="c2n_1" arrivalPos="990.00" arrivalPosLat="0.00" arrivalSpeed="13.87" duration="158.00" routeLength="1987.97" waitingTime="0.00" waitingCount="0" stopTime="0.00" timeLoss="13.81" rerouteNo="1" devices="tripinfo_bus_w2n_351 routing_bus_w2n_351" vType="Bus" speedFactor="1.00" vaporized=""/>
    <tripinfo id="car_w2e_365" depart="365.00" departLane="w2sep_1" departPos="3.60" departPosLat="0.00" departSpeed="13.90" departDelay="0.00" arrival="511.00" arrivalLane="c2e_1" arrivalPos="990.00" arrivalPosLat="0.00" arrivalSpeed="13.90" duration="146.00" routeLength="1997.01" waitingTime="0.00" waitingCount="0" stopTime="0.00" timeLoss="1.42" rerouteNo="1" devices="tripinfo_car_w2e_365 routing_car_w2e_365" vType="Car" speedFactor="1.00" vaporized=""/>
    <tripinfo id="car_w2n_366" depart="367.00" departLane="w2sep_1" departPos="3.60" departPosLat="0.00" departSpeed="13.90" departDelay="1.00" arrival="511.00" arrivalLane="c2n_1" arrivalPos="990.00" arrivalPosLat="0.00" arrivalSpeed="15.28" duration="144.00" routeLength="1996.47" waitingTime="0.00" waitingCount="0" stopTime="0.00" timeLoss="17.52" rerouteNo="1" devices="tripinfo_car_w2n_366 routing_car_w2n_366" vType="Car" speedFactor="1.14" vaporized=""/>
    <tripinfo id="car_e2s_361" depart="361.00" departLane="e2sep_1" departPos="3.60" departPosLat="0.00" departSpeed="13.90" departDelay="0.00" arrival="512.00" arrivalLane="c2s_1" arrivalPos="990.00" arrivalPosLat="0.00" arrivalSpeed="14.22" duration="151.00" routeLength="1996.47" waitingTime="0.00" waitingCount="0" stopTime="0.00" timeLoss="9.70" rerouteNo="1" devices="tripinfo_car_e2s_361 routing_car_e2s_361" vType="Car" speedFactor="1.02" vaporized=""/>
    <tripinfo id="car_w2n_377" depart="377.00" departLane="w2sep_1" departPos="3.60" departPosLat="0.00" departSpeed="13.90" departDelay="0.00" arrival="515.00" arrivalLane="c2n_1" arrivalPos="990.00" arrivalPosLat="0.00" arrivalSpeed="15.03" duration="138.00" routeLength="1996.47" waitingTime="0.00" waitingCount="0" stopTime="0.00" timeLoss="4.00" rerouteNo="1" devices="tripinfo_car_w2n_377 routing_car_w2n_377" vType="Car" speedFactor="1.08" vaporized=""/>
    <tripinfo id="car_w2e_370" depart="370.00" departLane="w2sep_1" departPos="3.60" departPosLat="0.00" departSpeed="13.90" departDelay="0.00" arrival="518.00" arrivalLane="c2e_1" arrivalPos="990.00" arrivalPosLat="1.00" arrivalSpeed="15.15" duration="148.00" routeLength="1997.01" waitingTime="2.00" waitingCount="1" stopTime="0.00" timeLoss="15.96" rerouteNo="1" devices="tripinfo_car_w2e_370 routing_car_w2e_370" vType="Car" speedFactor="1.09" vaporized=""/>
    <tripinfo id="car_w2n_380" depart="381.00" departLane="w2sep_1" departPos="3.60" departPosLat="0.00" departSpeed="13.90" departDelay="1.00" arrival="518.00" arrivalLane="c2n_1" arrivalPos="990.00" arrivalPosLat="0.00" arrivalSpeed="15.23" duration="137.00" routeLength="1996.47" waitingTime="0.00" waitingCount="0" stopTime="0.00" timeLoss="5.52" rerouteNo="1" devices="tripinfo_car_w2n_380 routing_car_w2n_380" vType="Car" speedFactor="1.10" vaporized=""/>
    <tripinfo id="car_w2e_379" depart="379.00" departLane="w2sep_1" departPos="3.60" departPosLat="0.00" departSpeed="13.90" departDelay="0.00" arrival="523.00" arrivalLane="c2e_1" arrivalPos="990.00" arrivalPosLat="1.00" arrivalSpeed="14.79" duration="144.00" routeLength="1997.01" waitingTime="0.00" waitingCount="0" stopTime="0.00" timeLoss="8.82" rerouteNo="1" devices="tripinfo_car_w2e_379 routing_car_w2e_379" vType="Car" speedFactor="1.06" vaporized=""/>
    <tripinfo id="car_w2e_383" depart="383.00" departLane="w2sep_1" departPos="3.60" departPosLat="0.00" departSpeed="13.90" departDelay="0.00" arrival="528.00" arrivalLane="c2e_1" arrivalPos="990.00" arrivalPosLat="1.00" arrivalSpeed="14.26" duration="145.00" routeLength="1997.01" waitingTime="0.00" waitingCount="0" stopTime="0.00" timeLoss="4.80" rerouteNo="1" devices="tripinfo_car_w2e_383 routing_car_w2e_383" vType="Car" speedFactor="1.03" vaporized=""/>
    <tripinfo id="amb_w2e_390" depart="390.00" departLane="w2sep_1" departPos="6.60" departPosLat="0.00" departSpeed="13.90" departDelay="0.00" arrival="530.00" arrivalLane="c2e_1" arrivalPos="990.00" arrivalPosLat="0.00" arrivalSpeed="17.66" duration="140.00" routeLength="1994.01" waitingTime="0.00" waitingCount="0" stopTime="0.00" timeLoss="43.68" rerouteNo="1" devices="tripinfo_amb_w2e_390 routing_amb_w2e_390 bluelight_amb_w2e_390" vType="Ambulance" speedFactor="1.50" vaporized="">
        <bluelight/>
    </tripinfo>
    <tripinfo id="car_s2e_334" depart="334.00" departLane="s2sep_1" departPos="3.60" departPosLat="0.00" departSpeed="13.90" departDelay="0.00" arrival="533.00" arrivalLane="c2e_1" arrivalPos="990.00" arrivalPosLat="1.00" arrivalSpeed="15.76" duration="199.00" routeLength="1986.69" waitingTime="60.00" waitingCount="1" stopTime="0.00" timeLoss="72.57" rerouteNo="1" devices="tripinfo_car_s2e_334 routing_car_s2e_334" vType="Car@car_s2e_334" speedFactor="1.14" vaporized=""/>
    <tripinfo id="car_n2w_365" depart="365.00" departLane="n2sep_1" departPos="3.60" departPosLat="0.00" departSpeed="13.90" departDelay="0.00" arrival="539.00" arrivalLane="c2w_1" arrivalPos="990.00" arrivalPosLat="0.00" arrivalSpeed="13.90" duration="174.00" routeLength="1986.69" waitingTime="21.00" waitingCount="1" stopTime="0.00" timeLoss="30.50" rerouteNo="1" devices="tripinfo_car_n2w_365 routing_car_n2w_365" vType="Car" speedFactor="1.00" vaporized=""/>
    <tripinfo id="car_n2w_366" depart="367.00" departLane="n2sep_1" departPos="3.60" departPosLat="0.00" departSpeed="13.90" departDelay="1.00" arrival="542.00" arrivalLane="c2w_1" arrivalPos="990.00" arrivalPosLat="0.00" arrivalSpeed="14.59" duration="175.00" routeLength="1986.69" waitingTime="20.00" waitingCount="1" stopTime="0.00" timeLoss="38.71" rerouteNo="1" devices="tripinfo_car_n2w_366 routing_car_n2w_366" vType="Car" speedFactor="1.06" vaporized=""/>
    <tripinfo id="car_s2e_339" depart="339.00" departLane="s2sep_1" departPos="3.60" departPosLat="0.00" departSpeed="13.90" departDelay="0.00" arrival="543.00" arrivalLane="c2e_1" arrivalPos="990.00" arrivalPosLat="0.00" arrivalSpeed="13.90" duration="204.00" routeLength="1986.69" waitingTime="48.00" waitingCount="1" stopTime="0.00" timeLoss="59.58" rerouteNo="1" devices="tripinfo_car_s2e_339 routing_car_s2e_339" vType="Car" speedFactor="1.00" vaporized=""/>
    <tripinfo id="car_s2e_348" depart="348.00" departLane="s2sep_1" departPos="3.60" departPosLat="0.00" departSpeed="13.90" departDelay="0.00" arrival="546.00" arrivalLane="c2e_1" arrivalPos="990.00" arrivalPosLat="0.00" arrivalSpeed="14.39" duration="198.00" routeLength="1986.69" waitingTime="43.00" waitingCount="1" stopTime="0.00" timeLoss="59.28" rerouteNo="1" devices="tripinfo_car_s2e_348 routing_car_s2e_348" vType="Car" speedFactor="1.04" vaporized=""/>
    <tripinfo id="car_s2w_330" depart="330.00" departLane="s2sep_1" departPos="3.60" departPosLat="0.00" departSpeed="13.90" departDelay="0.00" arrival="547.00" arrivalLane="c2w_1" arrivalPos="990.00" arrivalPosLat="0.00" arrivalSpeed="13.90" duration="217.00" routeLength="1996.47" waitingTime="56.00" waitingCount="1" stopTime="0.00" timeLoss="72.02" rerouteNo="1" devices="tripinfo_car_s2w_330 routing_car_s2w_330" vType="Car" speedFactor="1.00" vaporized=""/>
    <tripinfo id="car_s2e_373" depart="373.00" departLane="s2sep_1" departPos="3.60" departPosLat="0.00" departSpeed="13.90" departDelay="0.00" arrival="549.00" arrivalLane="c2e_1" arrivalPos="990.00" arrivalPosLat="0.00" arrivalSpeed="14.28" duration="176.00" routeLength="1986.69" waitingTime="19.00" waitingCount="1" stopTime="0.00" timeLoss="36.43" rerouteNo="1" devices="tripinfo_car_s2e_373 routing_car_s2e_373" vType="Car" speedFactor="1.03" vaporized=""/>
    <tripinfo id="car_n2w_402" depart="402.00" departLane="n2sep_1" departPos="3.60" departPosLat="0.00" departSpeed="13.90" departDelay="0.00" arrival="552.00" arrivalLane="c2w_1" arrivalPos="990.00" arrivalPosLat="0.00" arrivalSpeed="13.90" duration="150.00" routeLength="1986.69" waitingTime="0.00" waitingCount="0" stopTime="0.00" timeLoss="6.08" rerouteNo="1" devices="tripinfo_car_n2w_402 routing_car_n2w_402" vType="Car" speedFactor="1.00" vaporized=""/>
    <tripinfo id="car_n2e_369" depart="369.00" departLane="n2sep_1" departPos="3.60" departPosLat="0.00" departSpeed="13.90" departDelay="0.00" arrival="553.00" arrivalLane="c2e_1" arrivalPos="990.00" arrivalPosLat="0.00" arrivalSpeed="13.89" duration="184.00" routeLength="1996.47" waitingTime="19.00" waitingCount="2" stopTime="0.00" timeLoss="39.48" rerouteNo="1" devices="tripinfo_car_n2e_369 routing_car_n2e_369" vType="Car" speedFactor="1.00" vaporized=""/>
    <tripinfo id="car_n2w_412" depart="412.00" departLane="n2sep_1" departPos="3.60" departPosLat="0.00" departSpeed="13.90" departDelay="0.00" arrival="554.00" arrivalLane="c2w_1" arrivalPos="990.00" arrivalPosLat="0.00" arrivalSpeed="15.34" duration="142.00" routeLength="1986.69" waitingTime="0.00" waitingCount="0" stopTime="0.00" timeLoss="16.48" rerouteNo="1" devices="tripinfo_car_n2w_412 routing_car_n2w_412" vType="Car" speedFactor="1.15" vaporized=""/>
    <tripinfo id="car_n2e_394" depart="394.00" departLane="n2sep_1" departPos="3.60" departPosLat="0.00" departSpeed="13.90" departDelay="0.00" arrival="555.00" arrivalLane="c2e_1" arrivalPos="990.00" arrivalPosLat="0.00" arrivalSpeed="14.69" duration="161.00" routeLength="1996.47" waitingTime="2.00" waitingCount="1" stopTime="0.00" timeLoss="27.46" rerouteNo="1" devices="tripinfo_car_n2e_394 routing_car_n2e_394" vType="Car" speedFactor="1.08" vaporized=""/>
    <tripinfo id="car_s2w_364" depart="364.00" departLane="s2sep_1" departPos="3.60" departPosLat="0.00" departSpeed="13.90" departDelay="0.00" arrival="556.00" arrivalLane="c2w_1" arrivalPos="990.00" arrivalPosLat="0.00" arrivalSpeed="14.82" duration="192.00" routeLength="1996.47" waitingTime="32.00" waitingCount="2" stopTime="0.00" timeLoss="59.15" rerouteNo="1" devices="tripinfo_car_s2w_364 routing_car_s2w_364" vType="Car" speedFactor="1.09" vaporized=""/>
    <tripinfo id="car_s2w_396" depart="396.00" departLane="s2sep_1" departPos="3.60" departPosLat="0.00" departSpeed="13.90" departDelay="0.00" arrival="561.00" arrivalLane="c2w_1" arrivalPos="990.00" arrivalPosLat="0.00" arrivalSpeed="13.90" duration="165.00" routeLength="1996.47" waitingTime="4.00" waitingCount="1" stopTime="0.00" timeLoss="19.96" rerouteNo="1" devices="tripinfo_car_s2w_396 routing_car_s2w_396" vType="Car" speedFactor="1.00" vaporized=""/>
    <tripinfo id="car_s2w_399" depart="399.00" departLane="s2sep_1" departPos="3.60" departPosLat="0.00" departSpeed="13.90" departDelay="0.00" arrival="563.00" arrivalLane="c2w_1" arrivalPos="990.00" arrivalPosLat="0.00" arrivalSpeed="14.68" duration="164.00" routeLength="1996.47" waitingTime="4.00" waitingCount="1" stopTime="0.00" timeLoss="29.90" rerouteNo="1" devices="tripinfo_car_s2w_399 routing_car_s2w_399" vType="Car" speedFactor="1.08" vaporized=""/>
    <tripinfo id="car_s2w_401" depart="401.00" departLane="s2sep_1" departPos="3.60" departPosLat="0.00" departSpeed="13.90" departDelay="0.00" arrival="566.00" arrivalLane="c2w_1" arrivalPos="990.00" arrivalPosLat="0.00" arrivalSpeed="14.08" duration="165.00" routeLength="1996.47" waitingTime="3.00" waitingCount="1" stopTime="0.00" timeLoss="22.84" rerouteNo="1" devices="tripinfo_car_s2w_401 routing_car_s2w_401" vType="Car" speedFactor="1.02" vaporized=""/>
    <tripinfo id="car_s2e_417" depart="417.00" departLane="s2sep_1" departPos="3.60" departPosLat="0.00" departSpeed="13.90" departDelay="0.00" arrival="566.00" arrivalLane="c2e_1" arrivalPos="990.00" arrivalPosLat="0.00" arrivalSpeed="13.92" duration="149.00" routeLength="1986.69" waitingTime="0.00" waitingCount="0" stopTime="0.00" timeLoss="5.32" rerouteNo="1" devices="tripinfo_car_s2e_417 routing_car_s2e_417" vType="Car" speedFactor="1.00" vaporized=""/>
</tripinfos>
