<?xml version="1.0" encoding="UTF-8"?>

<!-- generated on Sat Apr 24 18:20:39 2021 by Eclipse SUMO Version 1.4.0
<configuration xmlns:xsi="http://www.w3.org/2001/XMLSchema-instance" xsi:noNamespaceSchemaLocation="http://sumo.dlr.de/xsd/sumoConfiguration.xsd">

    <input>
        <net-file value="sumofiles/junction.net.xml"/>
        <route-files value="sumofiles/junction_preemption_231.rou.xml"/>
        <additional-files value="sumofiles/junction.det.xml"/>
    </input>

    <output>
        <tripinfo-output value="sumofiles/output/tripinfo_preemption_231.xml"/>
    </output>

    <time>
        <begin value="0"/>
        <end value="10000"/>
        <step-length value="0.05"/>
    </time>

    <processing>
        <lateral-resolution value="0.1"/>
    </processing>

    <report>
        <no-warnings value="true"/>
        <error-log value="sumofiles/output/errorlog_preemption_231.log"/>
        <no-step-log value="true"/>
    </report>

    <traci_server>
        <remote-port value="52087"/>
    </traci_server>

    <gui_only>
        <gui-settings-file value="sumofiles/junction-gui.settings.xml"/>
        <tracker-interval value="0.05"/>
    </gui_only>

</configuration>
-->

<tripinfos xmlns:xsi="http://www.w3.org/2001/XMLSchema-instance" xsi:noNamespaceSchemaLocation="http://sumo.dlr.de/xsd/tripinfo_file.xsd">
    <tripinfo id="car_e2w_2" depart="2.00" departLane="e2sep_1" departPos="3.60" departPosLat="0.00" departSpeed="13.90" departDelay="0.00" arrival="144.30" arrivalLane="c2w_1" arrivalPos="990.00" arrivalPosLat="0.00" arrivalSpeed="14.04" duration="142.30" routeLength="1997.01" waitingTime="0.00" waitingCount="0" stopTime="0.00" timeLoss="0.07" rerouteNo="1" devices="tripinfo_car_e2w_2 routing_car_e2w_2" vType="Car" speedFactor="1.01" vaporized=""/>
    <tripinfo id="car_e2w_3" depart="3.45" departLane="e2sep_1" departPos="3.60" departPosLat="0.00" departSpeed="13.90" departDelay="0.45" arrival="146.85" arrivalLane="c2w_1" arrivalPos="990.00" arrivalPosLat="0.00" arrivalSpeed="14.87" duration="143.40" routeLength="1997.01" waitingTime="0.00" waitingCount="0" stopTime="0.00" timeLoss="10.67" rerouteNo="1" devices="tripinfo_car_e2w_3 routing_car_e2w_3" vType="Car" speedFactor="1.08" vaporized=""/>
    <tripinfo id="car_w2n_1" depart="1.00" departLane="w2sep_1" departPos="3.60" departPosLat="0.00" departSpeed="13.90" departDelay="0.00" arrival="149.10" arrivalLane="c2n_1" arrivalPos="990.00" arrivalPosLat="0.00" arrivalSpeed="14.73" duration="148.10" routeLength="1996.47" waitingTime="4.95" waitingCount="1" stopTime="0.00" timeLoss="11.90" rerouteNo="1" devices="tripinfo_car_w2n_1 routing_car_w2n_1" vType="Car" speedFactor="1.06" vaporized=""/>
    <tripinfo id="car_e2s_13" depart="13.00" departLane="e2sep_1" departPos="3.60" departPosLat="0.00" departSpeed="13.90" departDelay="0.00" arrival="155.65" arrivalLane="c2s_1" arrivalPos="990.00" arrivalPosLat="0.00" arrivalSpeed="14.54" duration="142.65" routeLength="1996.47" waitingTime="0.00" waitingCount="0" stopTime="0.00" timeLoss="4.63" rerouteNo="1" devices="tripinfo_car_e2s_13 routing_car_e2s_13" vType="Car" speedFactor="1.05" vaporized=""/>
    <tripinfo id="car_s2n_1" depart="1.00" departLane="s2sep_1" departPos="3.60" departPosLat="0.00" departSpeed="13.90" departDelay="0.00" arrival="161.90" arrivalLane="c2n_1" arrivalPos="990.00" arrivalPosLat="0.00" arrivalSpeed="14.73" duration="160.90" routeLength="1997.01" waitingTime="17.75" waitingCount="1" stopTime="0.00" timeLoss="25.32" rerouteNo="1" devices="tripinfo_car_s2n_1 routing_car_s2n_1" vType="Car" speedFactor="1.06" vaporized=""/>
    <tripinfo id="car_s2e_20" depart="20.00" departLane="s2sep_1" departPos="3.60" departPosLat="0.00" departSpeed="13.90" departDelay="0.00" arrival="165.45" arrivalLane="c2e_1" arrivalPos="990.00" arrivalPosLat="0.00" arrivalSpeed="14.32" duration="145.45" routeLength="1986.69" waitingTime="0.00" waitingCount="0" stopTime="0.00" timeLoss="5.97" rerouteNo="1" devices="tripinfo_car_s2e_20 routing_car_s2e_20" vType="Car" speedFactor="1.03" vaporized=""/>
    <tripinfo id="car_n2w_11" depart="11.00" departLane="n2sep_1" departPos="3.60" departPosLat="0.00" departSpeed="13.90" departDelay="0.00" arrival="165.65" arrivalLane="c2w_1" arrivalPos="990.00" arrivalPosLat="0.00" arrivalSpeed="13.90" duration="154.65" routeLength="1986.69" waitingTime="3.95" waitingCount="1" stopTime="0.00" timeLoss="11.00" rerouteNo="1" devices="tripinfo_car_n2w_11 routing_car_n2w_11" vType="Car" speedFactor="1.00" vaporized=""/>
    <tripinfo id="car_s2n_22" depart="23.50" departLane="s2sep_1" departPos="3.60" departPosLat="0.00" departSpeed="13.90" departDelay="1.50" arrival="168.55" arrivalLane="c2n_1" arrivalPos="990.00" arrivalPosLat="0.00" arrivalSpeed="14.26" duration="145.05" routeLength="1997.01" waitingTime="0.00" waitingCount="0" stopTime="0.00" timeLoss="5.06" rerouteNo="1" devices="tripinfo_car_s2n_22 routing_car_s2n_22" vType="Car" speedFactor="1.03" vaporized=""/>
    <tripinfo id="car_s2w_14" depart="14.00" departLane="s2sep_1" departPos="3.60" departPosLat="0.00" departSpeed="13.90" departDelay="0.00" arrival="169.60" arrivalLane="c2w_1" arrivalPos="990.00" arrivalPosLat="0.00" arrivalSpeed="14.03" duration="155.60" routeLength="1996.47" waitingTime="1.60" waitingCount="1" stopTime="0.00" timeLoss="12.78" rerouteNo="1" devices="tripinfo_car_s2w_14 routing_car_s2w_14" vType="Car" speedFactor="1.01" vaporized=""/>
    <tripinfo id="car_s2n_34" depart="34.00" departLane="s2sep_1" departPos="3.60" departPosLat="0.00" departSpeed="13.90" departDelay="0.00" arrival="171.15" arrivalLane="c2n_1" arrivalPos="990.00" arrivalPosLat="0.00" arrivalSpeed="15.87" duration="137.15" routeLength="1997.01" waitingTime="0.00" waitingCount="0" stopTime="0.00" timeLoss="13.08" rerouteNo="1" devices="tripinfo_car_s2n_34 routing_car_s2n_34" vType="Car" speedFactor="1.16" vaporized=""/>
    <tripinfo id="car_s2w_22" depart="22.00" departLane="s2sep_1" departPos="3.60" departPosLat="0.00" departSpeed="13.90" departDelay="0.00" arrival="171.85" arrivalLane="c2w_1" arrivalPos="990.00" arrivalPosLat="0.00" arrivalSpeed="14.84" duration="149.85" routeLength="1996.47" waitingTime="0.00" waitingCount="0" stopTime="0.00" timeLoss="17.50" rerouteNo="1" devices="tripinfo_car_s2w_22 routing_car_s2w_22" vType="Car" speedFactor="1.09" vaporized=""/>
    <tripinfo id="car_n2w_29" depart="29.00" departLane="n2sep_1" departPos="3.60" departPosLat="0.00" departSpeed="13.90" departDelay="0.00" arrival="177.20" arrivalLane="c2w_1" arrivalPos="990.00" arrivalPosLat="0.00" arrivalSpeed="13.90" duration="148.20" routeLength="1986.69" waitingTime="0.00" waitingCount="0" stopTime="0.00" timeLoss="4.54" rerouteNo="1" devices="tripinfo_car_n2w_29 routing_car_n2w_29" vType="Car" speedFactor="1.00" vaporized=""/>
    <tripinfo id="car_s2e_29" depart="29.00" departLane="s2sep_1" departPos="3.60" departPosLat="0.00" departSpeed="13.90" departDelay="0.00" arrival="177.45" arrivalLane="c2e_1" arrivalPos="990.00" arrivalPosLat="0.00" arrivalSpeed="13.90" duration="148.45" routeLength="1986.69" waitingTime="0.00" waitingCount="0" stopTime="0.00" timeLoss="4.78" rerouteNo="1" devices="tripinfo_car_s2e_29 routing_car_s2e_29" vType="Car" speedFactor="1.00" vaporized=""/>
    <tripinfo id="car_s2e_39" depart="39.00" departLane="s2sep_1" departPos="3.60" departPosLat="0.00" departSpeed="13.90" departDelay="0.00" arrival="179.85" arrivalLane="c2e_1" arrivalPos="990.00" arrivalPosLat="0.00" arrivalSpeed="14.91" duration="140.85" routeLength="1986.69" waitingTime="0.00" waitingCount="0" stopTime="0.00" timeLoss="9.13" rerouteNo="1" devices="tripinfo_car_s2e_39 routing_car_s2e_39" vType="Car" speedFactor="1.09" vaporized=""/>
    <tripinfo id="car_n2w_41" depart="41.00" departLane="n2sep_1" departPos="3.60" departPosLat="0.00" departSpeed="13.90" departDelay="0.00" arrival="185.30" arrivalLane="c2w_1" arrivalPos="990.00" arrivalPosLat="0.00" arrivalSpeed="14.27" duration="144.30" routeLength="1986.69" waitingTime="0.00" waitingCount="0" stopTime="0.00" timeLoss="4.32" rerouteNo="1" devices="tripinfo_car_n2w_41 routing_car_n2w_41" vType="Car" speedFactor="1.03" vaporized=""/>
    <tripinfo id="car_n2e_31" depart="31.00" departLane="n2sep_1" departPos="3.60" departPosLat="0.00" departSpeed="13.90" departDelay="0.00" arrival="185.70" arrivalLane="c2e_1" arrivalPos="990.00" arrivalPosLat="0.00" arrivalSpeed="13.90" duration="154.70" routeLength="1996.47" waitingTime="0.10" waitingCount="1" stopTime="0.00" timeLoss="10.39" rerouteNo="1" devices="tripinfo_car_n2e_31 routing_car_n2e_31" vType="Car" speedFactor="1.00" vaporized=""/>
    <tripinfo id="car_n2w_44" depart="44.00" departLane="n2sep_1" departPos="3.60" departPosLat="0.00" departSpeed="13.90" departDelay="0.00" arrival="189.10" arrivalLane="c2w_1" arrivalPos="990.00" arrivalPosLat="0.00" arrivalSpeed="14.53" duration="145.10" routeLength="1986.69" waitingTime="0.00" waitingCount="0" stopTime="0.00" timeLoss="7.90" rerouteNo="1" devices="tripinfo_car_n2w_44 routing_car_n2w_44" vType="Car" speedFactor="1.05" vaporized=""/>
    <tripinfo id="car_e2w_17" depart="17.00" departLane="e2sep_1" departPos="3.60" departPosLat="0.00" departSpeed="13.90" departDelay="0.00" arrival="207.50" arrivalLane="c2w_1" arrivalPos="990.00" arrivalPosLat="0.00" arrivalSpeed="15.05" duration="190.50" routeLength="1997.01" waitingTime="47.05" waitingCount="1" stopTime="0.00" timeLoss="57.80" rerouteNo="1" devices="tripinfo_car_e2w_17 routing_car_e2w_17" vType="Car" speedFactor="1.08" vaporized=""/>
    <tripinfo id="car_e2n_7" depart="7.00" departLane="e2sep_1" departPos="3.60" departPosLat="0.00" departSpeed="13.90" departDelay="0.00" arrival="208.55" arrivalLane="c2n_1" arrivalPos="990.00" arrivalPosLat="0.00" arrivalSpeed="14.32" duration="201.55" routeLength="1986.69" waitingTime="52.80" waitingCount="1" stopTime="0.00" timeLoss="62.13" rerouteNo="1" devices="tripinfo_car_e2n_7 routing_car_e2n_7" vType="Car" speedFactor="1.03" vaporized=""/>
    <tripinfo id="car_w2e_36" depart="36.00" departLane="w2sep_1" departPos="3.60" departPosLat="0.00" departSpeed="13.90" departDelay="0.00" arrival="209.50" arrivalLane="c2e_1" arrivalPos="990.00" arrivalPosLat="0.00" arrivalSpeed="14.15" duration="173.50" routeLength="1997.01" waitingTime="25.15" waitingCount="1" stopTime="0.00" timeLoss="32.35" rerouteNo="1" devices="tripinfo_car_w2e_36 routing_car_w2e_36" vType="Car" speedFactor="1.02" vaporized=""/>
    <tripinfo id="car_w2s_54" depart="54.00" departLane="w2sep_1" departPos="3.60" departPosLat="0.00" departSpeed="13.90" departDelay="0.00" arrival="212.95" arrivalLane="c2s_1" arrivalPos="990.00" arrivalPosLat="0.00" arrivalSpeed="13.90" duration="158.95" routeLength="1986.69" waitingTime="6.80" waitingCount="1" stopTime="0.00" timeLoss="15.27" rerouteNo="1" devices="tripinfo_car_w2s_54 routing_car_w2s_54" vType="Car" speedFactor="1.00" vaporized=""/>
    <tripinfo id="car_e2w_23" depart="23.00" departLane="e2sep_1" departPos="3.60" departPosLat="0.00" departSpeed="13.90" departDelay="0.00" arrival="213.20" arrivalLane="c2w_1" arrivalPos="990.00" arrivalPosLat="0.00" arrivalSpeed="14.55" duration="190.20" routeLength="1997.01" waitingTime="41.70" waitingCount="1" stopTime="0.00" timeLoss="52.95" rerouteNo="1" devices="tripinfo_car_e2w_23 routing_car_e2w_23" vType="Car" speedFactor="1.05" vaporized=""/>
    <tripinfo id="car_w2s_69" depart="70.45" departLane="w2sep_1" departPos="3.60" departPosLat="0.00" departSpeed="13.90" departDelay="1.45" arrival="214.80" arrivalLane="c2s_1" arrivalPos="990.00" arrivalPosLat="0.00" arrivalSpeed="15.45" duration="144.35" routeLength="1986.69" waitingTime="0.00" waitingCount="0" stopTime="0.00" timeLoss="21.74" rerouteNo="1" devices="tripinfo_car_w2s_69 routing_car_w2s_69" vType="Car" speedFactor="1.17" vaporized=""/>
    <tripinfo id="car_e2w_24" depart="24.40" departLane="e2sep_1" departPos="3.60" departPosLat="0.00" departSpeed="13.90" departDelay="0.40" arrival="215.55" arrivalLane="c2w_1" arrivalPos="990.00" arrivalPosLat="0.00" arrivalSpeed="15.34" duration="191.15" routeLength="1997.01" waitingTime="40.80" waitingCount="1" stopTime="0.00" timeLoss="63.20" rerouteNo="1" devices="tripinfo_car_e2w_24 routing_car_e2w_24" vType="Car" speedFactor="1.12" vaporized=""/>
    <tripinfo id="car_w2e_58" depart="58.00" departLane="w2sep_1" departPos="3.60" departPosLat="0.00" departSpeed="13.90" departDelay="0.00" arrival="215.70" arrivalLane="c2e_1" arrivalPos="990.00" arrivalPosLat="0.00" arrivalSpeed="13.90" duration="157.70" routeLength="1997.01" waitingTime="3.20" waitingCount="1" stopTime="0.00" timeLoss="14.01" rerouteNo="1" devices="tripinfo_car_w2e_58 routing_car_w2e_58" vType="Car" speedFactor="1.00" vaporized=""/>
    <tripinfo id="car_e2w_48" depart="48.00" departLane="e2sep_1" departPos="3.60" departPosLat="0.00" departSpeed="13.90" departDelay="0.00" arrival="217.95" arrivalLane="c2w_1" arrivalPos="990.00" arrivalPosLat="0.00" arrivalSpeed="15.37" duration="169.95" routeLength="1997.01" waitingTime="22.90" waitingCount="1" stopTime="0.00" timeLoss="41.99" rerouteNo="1" devices="tripinfo_car_e2w_48 routing_car_e2w_48" vType="Car" speedFactor="1.12" vaporized=""/>
    <tripinfo id="car_w2e_69" depart="69.00" departLane="w2sep_1" departPos="3.60" departPosLat="0.00" departSpeed="13.90" departDelay="0.00" arrival="219.50" arrivalLane="c2e_1" arrivalPos="990.00" arrivalPosLat="0.00" arrivalSpeed="13.95" duration="150.50" routeLength="1997.01" waitingTime="0.00" waitingCount="0" stopTime="0.00" timeLoss="7.55" rerouteNo="1" devices="tripinfo_car_w2e_69 routing_car_w2e_69" vType="Car" speedFactor="1.01" vaporized=""/>
    <tripinfo id="car_e2w_77" depart="77.00" departLane="e2sep_1" departPos="3.60" departPosLat="0.00" departSpeed="13.90" departDelay="0.00" arrival="219.95" arrivalLane="c2w_1" arrivalPos="990.00" arrivalPosLat="0.00" arrivalSpeed="15.84" duration="142.95" routeLength="1997.01" waitingTime="0.00" waitingCount="0" stopTime="0.00" timeLoss="21.16" rerouteNo="1" devices="tripinfo_car_e2w_77 routing_car_e2w_77" vType="Car" speedFactor="1.18" vaporized=""/>
    <tripinfo id="car_w2s_74" depart="74.00" departLane="w2sep_1" departPos="3.60" departPosLat="0.00" departSpeed="13.90" departDelay="0.00" arrival="221.30" arrivalLane="c2s_1" arrivalPos="990.00" arrivalPosLat="0.00" arrivalSpeed="14.17" duration="147.30" routeLength="1986.69" waitingTime="0.00" waitingCount="0" stopTime="0.00" timeLoss="6.37" rerouteNo="1" devices="tripinfo_car_w2s_74 routing_car_w2s_74" vType="Car" speedFactor="1.02" vaporized=""/>
    <tripinfo id="car_e2n_70" depart="70.00" departLane="e2sep_1" departPos="3.60" departPosLat="0.00" departSpeed="13.90" departDelay="0.00" arrival="221.45" arrivalLane="c2n_1" arrivalPos="990.00" arrivalPosLat="0.00" arrivalSpeed="13.90" duration="151.45" routeLength="1986.69" waitingTime="0.00" waitingCount="0" stopTime="0.00" timeLoss="7.76" rerouteNo="1" devices="tripinfo_car_e2n_70 routing_car_e2n_70" vType="Car" speedFactor="1.00" vaporized=""/>
    <tripinfo id="car_e2s_26" depart="26.05" departLane="e2sep_1" departPos="3.60" departPosLat="0.00" departSpeed="13.90" departDelay="0.05" arrival="226.60" arrivalLane="c2s_1" arrivalPos="990.00" arrivalPosLat="0.00" arrivalSpeed="13.90" duration="200.55" routeLength="1996.47" waitingTime="41.75" waitingCount="2" stopTime="0.00" timeLoss="56.21" rerouteNo="1" devices="tripinfo_car_e2s_26 routing_car_e2s_26" vType="Car" speedFactor="1.00" vaporized=""/>
    <tripinfo id="car_e2n_81" depart="81.00" departLane="e2sep_1" departPos="3.60" departPosLat="0.00" departSpeed="13.90" departDelay="0.00" arrival="227.00" arrivalLane="c2n_1" arrivalPos="990.00" arrivalPosLat="0.00" arrivalSpeed="14.15" duration="146.00" routeLength="1986.69" waitingTime="0.00" waitingCount="0" stopTime="0.00" timeLoss="4.89" rerouteNo="1" devices="tripinfo_car_e2n_81 routing_car_e2n_81" vType="Car" speedFactor="1.02" vaporized=""/>
    <tripinfo id="car_e2s_28" depart="28.00" departLane="e2sep_1" departPos="3.60" departPosLat="0.00" departSpeed="13.90" departDelay="0.00" arrival="229.35" arrivalLane="c2s_1" arrivalPos="990.00" arrivalPosLat="0.00" arrivalSpeed="14.42" duration="201.35" routeLength="1996.47" waitingTime="39.35" waitingCount="2" stopTime="0.00" timeLoss="63.32" rerouteNo="1" devices="tripinfo_car_e2s_28 routing_car_e2s_28" vType="Car" speedFactor="1.05" vaporized=""/>
    <tripinfo id="car_e2n_85" depart="85.00" departLane="e2sep_1" departPos="3.60" departPosLat="0.00" departSpeed="13.90" departDelay="0.00" arrival="229.45" arrivalLane="c2n_1" arrivalPos="990.00" arrivalPosLat="0.00" arrivalSpeed="14.91" duration="144.45" routeLength="1986.69" waitingTime="0.00" waitingCount="0" stopTime="0.00" timeLoss="12.41" rerouteNo="1" devices="tripinfo_car_e2n_85 routing_car_e2n_85" vType="Car" speedFactor="1.09" vaporized=""/>
    <tripinfo id="car_w2s_97" depart="97.00" departLane="w2sep_1" departPos="3.60" departPosLat="0.00" departSpeed="13.90" departDelay="0.00" arrival="231.20" arrivalLane="c2s_1" arrivalPos="990.00" arrivalPosLat="0.00" arrivalSpeed="15.44" duration="134.20" routeLength="1986.69" waitingTime="0.00" waitingCount="0" stopTime="0.00" timeLoss="11.27" rerouteNo="1" devices="tripinfo_car_w2s_97 routing_car_w2s_97" vType="Car" speedFactor="1.17" vaporized=""/>
    <tripinfo id="car_e2s_39" depart="39.00" departLane="e2sep_1" departPos="3.60" departPosLat="0.00" departSpeed="13.90" departDelay="0.00" arrival="237.45" arrivalLane="c2s_1" arrivalPos="990.00" arrivalPosLat="0.00" arrivalSpeed="14.04" duration="198.45" routeLength="1996.47" waitingTime="34.60" waitingCount="3" stopTime="0.00" timeLoss="55.57" rerouteNo="1" devices="tripinfo_car_e2s_39 routing_car_e2s_39" vType="Car" speedFactor="1.01" vaporized=""/>
    <tripinfo id="car_e2s_59" depart="59.00" departLane="e2sep_1" departPos="3.60" departPosLat="0.00" departSpeed="13.90" departDelay="0.00" arrival="239.40" arrivalLane="c2s_1" arrivalPos="990.00" arrivalPosLat="0.00" arrivalSpeed="15.39" duration="180.40" routeLength="1996.47" waitingTime="22.35" waitingCount="3" stopTime="0.00" timeLoss="55.38" rerouteNo="1" devices="tripinfo_car_e2s_59 routing_car_e2s_59" vType="Car" speedFactor="1.15" vaporized=""/>
    <tripinfo id="car_e2s_94" depart="94.00" departLane="e2sep_1" departPos="3.60" departPosLat="0.00" departSpeed="13.90" departDelay="0.00" arrival="244.10" arrivalLane="c2s_1" arrivalPos="990.00" arrivalPosLat="0.00" arrivalSpeed="13.89" duration="150.10" routeLength="1996.47" waitingTime="0.00" waitingCount="0" stopTime="0.00" timeLoss="5.77" rerouteNo="1" devices="tripinfo_car_e2s_94 routing_car_e2s_94" vType="Car" speedFactor="1.00" vaporized=""/>
    <tripinfo id="car_s2e_78" depart="78.00" departLane="s2sep_1" departPos="3.60" departPosLat="0.00" departSpeed="13.90" departDelay="0.00" arrival="246.20" arrivalLane="c2e_1" arrivalPos="990.00" arrivalPosLat="0.00" arrivalSpeed="16.10" duration="168.20" routeLength="1986.69" waitingTime="36.15" waitingCount="1" stopTime="0.00" timeLoss="44.14" rerouteNo="1" devices="tripinfo_car_s2e_78 routing_car_s2e_78" vType="Car" speedFactor="1.16" vaporized=""/>
    <tripinfo id="car_w2n_101" depart="101.00" departLane="w2sep_1" departPos="3.60" departPosLat="0.00" departSpeed="13.90" departDelay="0.00" arrival="246.45" arrivalLane="c2n_1" arrivalPos="990.00" arrivalPosLat="0.00" arrivalSpeed="14.13" duration="145.45" routeLength="1996.47" waitingTime="0.00" waitingCount="0" stopTime="0.00" timeLoss="3.52" rerouteNo="1" devices="tripinfo_car_w2n_101 routing_car_w2n_101" vType="Car" speedFactor="1.02" vaporized=""/>
    <tripinfo id="car_n2s_58" depart="58.50" departLane="n2sep_1" departPos="3.60" departPosLat="0.00" departSpeed="13.90" departDelay="0.50" arrival="249.95" arrivalLane="c2s_1" arrivalPos="990.00" arrivalPosLat="0.00" arrivalSpeed="16.38" duration="191.45" routeLength="1997.01" waitingTime="48.35" waitingCount="1" stopTime="0.00" timeLoss="69.51" rerouteNo="1" devices="tripinfo_car_n2s_58 routing_car_n2s_58" vType="Car" speedFactor="1.18" vaporized=""/>
    <tripinfo id="car_s2n_84" depart="85.05" departLane="s2sep_1" departPos="3.60" departPosLat="0.00" departSpeed="13.90" departDelay="1.05" arrival="255.15" arrivalLane="c2n_1" arrivalPos="990.00" arrivalPosLat="0.00" arrivalSpeed="14.50" duration="170.10" routeLength="1997.01" waitingTime="19.85" waitingCount="1" stopTime="0.00" timeLoss="32.37" rerouteNo="1" devices="tripinfo_car_s2n_84 routing_car_s2n_84" vType="Car" speedFactor="1.04" vaporized=""/>
    <tripinfo id="car_n2w_55" depart="55.00" departLane="n2sep_1" departPos="3.60" departPosLat="0.00" departSpeed="13.90" departDelay="0.00" arrival="255.65" arrivalLane="c2w_1" arrivalPos="990.00" arrivalPosLat="0.00" arrivalSpeed="13.90" duration="200.65" routeLength="1986.69" waitingTime="50.10" waitingCount="1" stopTime="0.00" timeLoss="56.95" rerouteNo="1" devices="tripinfo_car_n2w_55 routing_car_n2w_55" vType="Car" speedFactor="1.00" vaporized=""/>
    <tripinfo id="car_n2w_57" depart="57.00" departLane="n2sep_1" departPos="3.60" departPosLat="0.00" departSpeed="13.90" departDelay="0.00" arrival="257.65" arrivalLane="c2w_1" arrivalPos="990.00" arrivalPosLat="0.00" arrivalSpeed="15.19" duration="200.65" routeLength="1986.69" waitingTime="49.10" waitingCount="1" stopTime="0.00" timeLoss="73.73" rerouteNo="1" devices="tripinfo_car_n2w_57 routing_car_n2w_57" vType="Car" speedFactor="1.13" vaporized=""/>
    <tripinfo id="car_s2n_136" depart="136.00" departLane="s2sep_1" departPos="3.60" departPosLat="0.00" departSpeed="13.90" departDelay="0.00" arrival="259.50" arrivalLane="c2n_1" arrivalPos="990.00" arrivalPosLat="0.00" arrivalSpeed="16.36" duration="123.50" routeLength="1997.01" waitingTime="0.00" waitingCount="0" stopTime="0.00" timeLoss="1.59" rerouteNo="1" devices="tripinfo_car_s2n_136 routing_car_s2n_136" vType="Car" speedFactor="1.18" vaporized=""/>
    <tripinfo id="car_s2e_88" depart="88.75" departLane="s2sep_1" departPos="3.60" departPosLat="0.00" departSpeed="13.90" departDelay="0.75" arrival="260.50" arrivalLane="c2e_1" arrivalPos="990.00" arrivalPosLat="0.00" arrivalSpeed="13.90" duration="171.75" routeLength="1986.69" waitingTime="13.70" waitingCount="1" stopTime="0.00" timeLoss="28.08" rerouteNo="1" devices="tripinfo_car_s2e_88 routing_car_s2e_88" vType="Car" speedFactor="1.00" vaporized=""/>
    <tripinfo id="car_n2s_76" depart="76.00" departLane="n2sep_1" departPos="3.60" departPosLat="0.00" departSpeed="13.90" departDelay="0.00" arrival="262.40" arrivalLane="c2s_1" arrivalPos="990.00" arrivalPosLat="0.00" arrivalSpeed="13.90" duration="186.40" routeLength="1997.01" waitingTime="32.25" waitingCount="1" stopTime="0.00" timeLoss="42.69" rerouteNo="1" devices="tripinfo_car_n2s_76 routing_car_n2s_76" vType="Car" speedFactor="1.00" vaporized=""/>
    <tripinfo id="car_n2s_124" depart="124.00" departLane="n2sep_1" departPos="3.60" departPosLat="0.00" departSpeed="13.90" departDelay="0.00" arrival="264.40" arrivalLane="c2s_1" arrivalPos="990.00" arrivalPosLat="0.00" arrivalSpeed="15.19" duration="140.40" routeLength="1997.01" waitingTime="0.00" waitingCount="0" stopTime="0.00" timeLoss="13.46" rerouteNo="1" devices="tripinfo_car_n2s_124 routing_car_n2s_124" vType="Car" speedFactor="1.13" vaporized=""/>
    <tripinfo id="car_s2e_103" depart="103.30" departLane="s2sep_1" departPos="3.60" departPosLat="0.00" departSpeed="13.90" departDelay="0.30" arrival="264.80" arrivalLane="c2e_1" arrivalPos="990.00" arrivalPosLat="0.00" arrivalSpeed="13.93" duration="161.50" routeLength="1986.69" waitingTime="4.00" waitingCount="1" stopTime="0.00" timeLoss="18.27" rerouteNo="1" devices="tripinfo_car_s2e_103 routing_car_s2e_103" vType="Car" speedFactor="1.00" vaporized=""/>
    <tripinfo id="car_n2w_87" depart="87.00" departLane="n2sep_1" departPos="3.60" departPosLat="0.00" departSpeed="13.90" departDelay="0.00" arrival="265.10" arrivalLane="c2w_1" arrivalPos="990.00" arrivalPosLat="0.00" arrivalSpeed="13.90" duration="178.10" routeLength="1986.69" waitingTime="22.05" waitingCount="1" stopTime="0.00" timeLoss="34.44" rerouteNo="1" devices="tripinfo_car_n2w_87 routing_car_n2w_87" vType="Car" speedFactor="1.00" vaporized=""/>
    <tripinfo id="car_n2e_78" depart="78.00" departLane="n2sep_1" departPos="3.60" departPosLat="0.00" departSpeed="13.90" departDelay="0.00" arrival="266.90" arrivalLane="c2e_1" arrivalPos="990.00" arrivalPosLat="0.00" arrivalSpeed="14.91" duration="188.90" routeLength="1996.47" waitingTime="32.95" waitingCount="2" stopTime="0.00" timeLoss="57.97" rerouteNo="1" devices="tripinfo_car_n2e_78 routing_car_n2e_78" vType="Car" speedFactor="1.10" vaporized=""/>
    <tripinfo id="car_s2w_82" depart="82.00" departLane="s2sep_1" departPos="3.60" departPosLat="0.00" departSpeed="13.90" departDelay="0.00" arrival="267.45" arrivalLane="c2w_1" arrivalPos="990.00" arrivalPosLat="0.00" arrivalSpeed="14.90" duration="185.45" routeLength="1996.47" waitingTime="37.40" waitingCount="2" stopTime="0.00" timeLoss="53.26" rerouteNo="1" devices="tripinfo_car_s2w_82 routing_car_s2w_82" vType="Car" speedFactor="1.09" vaporized=""/>
    <tripinfo id="car_n2w_137" depart="137.00" departLane="n2sep_1" departPos="3.60" departPosLat="0.00" departSpeed="13.90" departDelay="0.00" arrival="270.75" arrivalLane="c2w_1" arrivalPos="990.00" arrivalPosLat="0.00" arrivalSpeed="15.97" duration="133.75" routeLength="1986.69" waitingTime="0.00" waitingCount="0" stopTime="0.00" timeLoss="9.32" rerouteNo="1" devices="tripinfo_car_n2w_137 routing_car_n2w_137" vType="Car" speedFactor="1.15" vaporized=""/>
    <tripinfo id="car_n2e_81" depart="81.00" departLane="n2sep_1" departPos="3.60" departPosLat="0.00" departSpeed="13.90" departDelay="0.00" arrival="271.80" arrivalLane="c2e_1" arrivalPos="990.00" arrivalPosLat="0.00" arrivalSpeed="14.32" duration="190.80" routeLength="1996.47" waitingTime="31.35" waitingCount="3" stopTime="0.00" timeLoss="50.73" rerouteNo="1" devices="tripinfo_car_n2e_81 routing_car_n2e_81" vType="Car" speedFactor="1.03" vaporized=""/>
    <tripinfo id="car_n2s_131" depart="131.00" departLane="n2sep_1" departPos="3.60" departPosLat="0.00" departSpeed="13.90" departDelay="0.00" arrival="273.20" arrivalLane="c2s_1" arrivalPos="990.00" arrivalPosLat="0.00" arrivalSpeed="14.12" duration="142.20" routeLength="1997.01" waitingTime="0.00" waitingCount="0" stopTime="0.00" timeLoss="0.72" rerouteNo="1" devices="tripinfo_car_n2s_131 routing_car_n2s_131" vType="Car" speedFactor="1.02" vaporized=""/>
    <tripinfo id="car_n2e_90" depart="90.00" departLane="n2sep_1" departPos="3.60" departPosLat="0.00" departSpeed="13.90" departDelay="0.00" arrival="276.95" arrivalLane="c2e_1" arrivalPos="990.00" arrivalPosLat="0.00" arrivalSpeed="13.90" duration="186.95" routeLength="1996.47" waitingTime="18.60" waitingCount="3" stopTime="0.00" timeLoss="42.63" rerouteNo="1" devices="tripinfo_car_n2e_90 routing_car_n2e_90" vType="Car" speedFactor="1.00" vaporized=""/>
    <tripinfo id="car_s2w_83" depart="83.35" departLane="s2sep_1" departPos="3.60" departPosLat="0.00" departSpeed="13.90" departDelay="0.35" arrival="279.50" arrivalLane="c2w_1" arrivalPos="990.00" arrivalPosLat="0.00" arrivalSpeed="14.42" duration="196.15" routeLength="1996.47" waitingTime="37.45" waitingCount="3" stopTime="0.00" timeLoss="57.05" rerouteNo="1" devices="tripinfo_car_s2w_83 routing_car_s2w_83" vType="Car" speedFactor="1.04" vaporized=""/>
    <tripinfo id="car_n2e_115" depart="115.00" departLane="n2sep_1" departPos="3.60" departPosLat="0.00" departSpeed="13.90" departDelay="0.00" arrival="280.05" arrivalLane="c2e_1" arrivalPos="990.00" arrivalPosLat="0.00" arrivalSpeed="14.17" duration="165.05" routeLength="1996.47" waitingTime="1.85" waitingCount="1" stopTime="0.00" timeLoss="24.07" rerouteNo="1" devices="tripinfo_car_n2e_115 routing_car_n2e_115" vType="Car" speedFactor="1.02" vaporized=""/>
    <tripinfo id="car_n2e_140" depart="140.00" departLane="n2sep_1" departPos="3.60" departPosLat="0.00" departSpeed="13.90" departDelay="0.00" arrival="281.90" arrivalLane="c2e_1" arrivalPos="990.00" arrivalPosLat="0.00" arrivalSpeed="15.42" duration="141.90" routeLength="1996.47" waitingTime="0.00" waitingCount="0" stopTime="0.00" timeLoss="18.73" rerouteNo="1" devices="tripinfo_car_n2e_140 routing_car_n2e_140" vType="Car" speedFactor="1.17" vaporized=""/>
    <tripinfo id="car_s2w_86" depart="86.85" departLane="s2sep_1" departPos="3.60" departPosLat="0.00" departSpeed="13.90" departDelay="0.85" arrival="284.70" arrivalLane="c2w_1" arrivalPos="990.00" arrivalPosLat="0.00" arrivalSpeed="14.04" duration="197.85" routeLength="1996.47" waitingTime="27.90" waitingCount="3" stopTime="0.00" timeLoss="54.98" rerouteNo="1" devices="tripinfo_car_s2w_86 routing_car_s2w_86" vType="Car" speedFactor="1.01" vaporized=""/>
    <tripinfo id="car_s2w_102" depart="102.00" departLane="s2sep_1" departPos="3.60" departPosLat="0.00" departSpeed="13.90" departDelay="0.00" arrival="286.95" arrivalLane="c2w_1" arrivalPos="990.00" arrivalPosLat="0.00" arrivalSpeed="14.92" duration="184.95" routeLength="1996.47" waitingTime="19.75" waitingCount="3" stopTime="0.00" timeLoss="53.27" rerouteNo="1" devices="tripinfo_car_s2w_102 routing_car_s2w_102" vType="Car" speedFactor="1.10" vaporized=""/>
    <tripinfo id="car_s2w_124" depart="124.00" departLane="s2sep_1" departPos="3.60" departPosLat="0.00" departSpeed="13.90" departDelay="0.00" arrival="289.40" arrivalLane="c2w_1" arrivalPos="990.00" arrivalPosLat="0.00" arrivalSpeed="14.84" duration="165.40" routeLength="1996.47" waitingTime="7.20" waitingCount="2" stopTime="0.00" timeLoss="32.05" rerouteNo="1" devices="tripinfo_car_s2w_124 routing_car_s2w_124" vType="Car" speedFactor="1.08" vaporized=""/>
    <tripinfo id="car_w2e_129" depart="129.00" departLane="w2sep_1" departPos="3.60" departPosLat="0.00" departSpeed="13.90" departDelay="0.00" arrival="293.45" arrivalLane="c2e_1" arrivalPos="990.00" arrivalPosLat="0.00" arrivalSpeed="15.56" duration="164.45" routeLength="1997.01" waitingTime="28.10" waitingCount="1" stopTime="0.00" timeLoss="36.07" rerouteNo="1" devices="tripinfo_car_w2e_129 routing_car_w2e_129" vType="Car" speedFactor="1.12" vaporized=""/>
    <tripinfo id="car_e2w_114" depart="114.00" departLane="e2sep_1" departPos="3.60" departPosLat="0.00" departSpeed="13.90" departDelay="0.00" arrival="300.85" arrivalLane="c2w_1" arrivalPos="990.00" arrivalPosLat="0.00" arrivalSpeed="13.90" duration="186.85" routeLength="1997.01" waitingTime="35.50" waitingCount="1" stopTime="0.00" timeLoss="43.17" rerouteNo="1" devices="tripinfo_car_e2w_114 routing_car_e2w_114" vType="Car" speedFactor="1.00" vaporized=""/>
    <tripinfo id="car_w2e_138" depart="138.00" departLane="w2sep_1" departPos="3.60" departPosLat="0.00" departSpeed="13.90" departDelay="0.00" arrival="303.05" arrivalLane="c2e_1" arrivalPos="990.00" arrivalPosLat="0.00" arrivalSpeed="13.97" duration="165.05" routeLength="1997.01" waitingTime="13.15" waitingCount="1" stopTime="0.00" timeLoss="22.12" rerouteNo="1" devices="tripinfo_car_w2e_138 routing_car_w2e_138" vType="Car" speedFactor="1.01" vaporized=""/>
    <tripinfo id="car_e2w_142" depart="142.00" departLane="e2sep_1" departPos="3.60" departPosLat="0.00" departSpeed="13.90" departDelay="0.00" arrival="303.95" arrivalLane="c2w_1" arrivalPos="990.00" arrivalPosLat="0.00" arrivalSpeed="14.39" duration="161.95" routeLength="1997.01" waitingTime="10.60" waitingCount="1" stopTime="0.00" timeLoss="23.76" rerouteNo="1" devices="tripinfo_car_e2w_142 routing_car_e2w_142" vType="Car" speedFactor="1.04" vaporized=""/>
    <tripinfo id="car_w2n_149" depart="149.00" departLane="w2sep_1" departPos="3.60" departPosLat="0.00" departSpeed="13.90" departDelay="0.00" arrival="303.95" arrivalLane="c2n_1" arrivalPos="990.00" arrivalPosLat="0.00" arrivalSpeed="14.22" duration="154.95" routeLength="1996.47" waitingTime="2.70" waitingCount="2" stopTime="0.00" timeLoss="13.84" rerouteNo="1" devices="tripinfo_car_w2n_149 routing_car_w2n_149" vType="Car" speedFactor="1.02" vaporized=""/>
    <tripinfo id="car_w2e_155" depart="155.00" departLane="w2sep_1" departPos="3.60" departPosLat="0.00" departSpeed="13.90" departDelay="0.00" arrival="305.90" arrivalLane="c2e_1" arrivalPos="990.00" arrivalPosLat="0.00" arrivalSpeed="14.57" duration="150.90" routeLength="1997.01" waitingTime="0.00" waitingCount="0" stopTime="0.00" timeLoss="14.78" rerouteNo="1" devices="tripinfo_car_w2e_155 routing_car_w2e_155" vType="Car" speedFactor="1.06" vaporized=""/>
    <tripinfo id="car_e2s_108" depart="108.00" departLane="e2sep_1" departPos="3.60" departPosLat="0.00" departSpeed="13.90" departDelay="0.00" arrival="307.50" arrivalLane="c2s_1" arrivalPos="990.00" arrivalPosLat="0.00" arrivalSpeed="13.90" duration="199.50" routeLength="1996.47" waitingTime="44.50" waitingCount="2" stopTime="0.00" timeLoss="55.16" rerouteNo="1" devices="tripinfo_car_e2s_108 routing_car_e2s_108" vType="Car" speedFactor="1.00" vaporized=""/>
    <tripinfo id="car_e2s_114" depart="115.50" departLane="e2sep_1" departPos="3.60" departPosLat="0.00" departSpeed="13.90" departDelay="1.50" arrival="309.45" arrivalLane="c2s_1" arrivalPos="990.00" arrivalPosLat="0.00" arrivalSpeed="15.26" duration="193.95" routeLength="1996.47" waitingTime="36.35" waitingCount="2" stopTime="0.00" timeLoss="67.63" rerouteNo="1" devices="tripinfo_car_e2s_114 routing_car_e2s_114" vType="Car" speedFactor="1.14" vaporized=""/>
    <tripinfo id="car_e2s_136" depart="136.00" departLane="e2sep_1" departPos="3.60" departPosLat="0.00" departSpeed="13.90" departDelay="0.00" arrival="314.05" arrivalLane="c2s_1" arrivalPos="990.00" arrivalPosLat="0.00" arrivalSpeed="13.89" duration="178.05" routeLength="1996.47" waitingTime="16.50" waitingCount="2" stopTime="0.00" timeLoss="33.71" rerouteNo="1" devices="tripinfo_car_e2s_136 routing_car_e2s_136" vType="Car" speedFactor="1.00" vaporized=""/>
    <tripinfo id="car_w2e_175" depart="175.00" departLane="w2sep_1" departPos="3.60" departPosLat="0.00" departSpeed="13.90" departDelay="0.00" arrival="314.50" arrivalLane="c2e_1" arrivalPos="990.00" arrivalPosLat="0.00" arrivalSpeed="14.38" duration="139.50" routeLength="1997.01" waitingTime="0.00" waitingCount="0" stopTime="0.00" timeLoss="0.58" rerouteNo="1" devices="tripinfo_car_w2e_175 routing_car_w2e_175" vType="Car" speedFactor="1.03" vaporized=""/>
    <tripinfo id="car_e2s_146" depart="146.00" departLane="e2sep_1" departPos="3.60" departPosLat="0.00" departSpeed="13.90" departDelay="0.00" arrival="319.20" arrivalLane="c2s_1" arrivalPos="990.00" arrivalPosLat="0.00" arrivalSpeed="14.20" duration="173.20" routeLength="1996.47" waitingTime="10.15" waitingCount="2" stopTime="0.00" timeLoss="31.99" rerouteNo="1" devices="tripinfo_car_e2s_146 routing_car_e2s_146" vType="Car" speedFactor="1.02" vaporized=""/>
    <tripinfo id="car_e2s_173" depart="173.00" departLane="e2sep_1" departPos="3.60" departPosLat="0.00" departSpeed="13.90" departDelay="0.00" arrival="321.70" arrivalLane="c2s_1" arrivalPos="990.00" arrivalPosLat="0.00" arrivalSpeed="14.91" duration="148.70" routeLength="1996.47" waitingTime="1.40" waitingCount="1" stopTime="0.00" timeLoss="15.89" rerouteNo="1" devices="tripinfo_car_e2s_173 routing_car_e2s_173" vType="Car" speedFactor="1.09" vaporized=""/>
    <tripinfo id="car_e2n_180" depart="180.00" departLane="e2sep_1" departPos="3.60" departPosLat="0.00" departSpeed="13.90" departDelay="0.00" arrival="327.30" arrivalLane="c2n_1" arrivalPos="990.00" arrivalPosLat="0.00" arrivalSpeed="13.90" duration="147.30" routeLength="1986.69" waitingTime="0.00" waitingCount="0" stopTime="0.00" timeLoss="3.61" rerouteNo="1" devices="tripinfo_car_e2n_180 routing_car_e2n_180" vType="Car" speedFactor="1.00" vaporized=""/>
    <tripinfo id="car_w2e_187" depart="187.00" departLane="w2sep_1" departPos="3.60" departPosLat="0.00" departSpeed="13.90" departDelay="0.00" arrival="328.55" arrivalLane="c2e_1" arrivalPos="990.00" arrivalPosLat="0.00" arrivalSpeed="14.13" duration="141.55" routeLength="1997.01" waitingTime="0.00" waitingCount="0" stopTime="0.00" timeLoss="0.27" rerouteNo="1" devices="tripinfo_car_w2e_187 routing_car_w2e_187" vType="Car" speedFactor="1.02" vaporized=""/>
    <tripinfo id="car_w2n_190" depart="190.00" departLane="w2sep_1" departPos="3.60" departPosLat="0.00" departSpeed="13.90" departDelay="0.00" arrival="329.35" arrivalLane="c2n_1" arrivalPos="990.00" arrivalPosLat="0.00" arrivalSpeed="15.41" duration="139.35" routeLength="1996.47" waitingTime="0.00" waitingCount="0" stopTime="0.00" timeLoss="13.60" rerouteNo="1" devices="tripinfo_car_w2n_190 routing_car_w2n_190" vType="Car" speedFactor="1.15" vaporized=""/>
    <tripinfo id="car_s2e_169" depart="169.00" departLane="s2sep_1" departPos="3.60" departPosLat="0.00" departSpeed="13.90" departDelay="0.00" arrival="343.75" arrivalLane="c2e_1" arrivalPos="990.00" arrivalPosLat="0.00" arrivalSpeed="15.32" duration="174.75" routeLength="1986.69" waitingTime="33.75" waitingCount="1" stopTime="0.00" timeLoss="44.42" rerouteNo="1" devices="tripinfo_car_s2e_169 routing_car_s2e_169" vType="Car" speedFactor="1.10" vaporized=""/>
    <tripinfo id="car_s2n_153" depart="153.00" departLane="s2sep_1" departPos="3.60" departPosLat="0.00" departSpeed="13.90" departDelay="0.00" arrival="344.45" arrivalLane="c2n_1" arrivalPos="990.00" arrivalPosLat="0.00" arrivalSpeed="14.17" duration="191.45" routeLength="1997.01" waitingTime="40.55" waitingCount="1" stopTime="0.00" timeLoss="50.51" rerouteNo="1" devices="tripinfo_car_s2n_153 routing_car_s2n_153" vType="Car" speedFactor="1.02" vaporized=""/>
    <tripinfo id="car_n2s_172" depart="172.00" departLane="n2sep_1" departPos="3.60" departPosLat="0.00" departSpeed="13.90" departDelay="0.00" arrival="345.20" arrivalLane="c2s_1" arrivalPos="990.00" arrivalPosLat="0.00" arrivalSpeed="14.00" duration="173.20" routeLength="1997.01" waitingTime="23.40" waitingCount="1" stopTime="0.00" timeLoss="30.57" rerouteNo="1" devices="tripinfo_car_n2s_172 routing_car_n2s_172" vType="Car" speedFactor="1.01" vaporized=""/>
    <tripinfo id="car_s2n_156" depart="156.00" departLane="s2sep_1" departPos="3.60" departPosLat="0.00" departSpeed="13.90" departDelay="0.00" arrival="346.35" arrivalLane="c2n_1" arrivalPos="990.00" arrivalPosLat="0.00" arrivalSpeed="15.64" duration="190.35" routeLength="1997.01" waitingTime="39.60" waitingCount="1" stopTime="0.00" timeLoss="68.53" rerouteNo="1" devices="tripinfo_car_s2n_156 routing_car_s2n_156" vType="Car" speedFactor="1.18" vaporized=""/>
    <tripinfo id="car_n2s_191" depart="191.00" departLane="n2sep_1" departPos="3.60" departPosLat="0.00" departSpeed="13.90" departDelay="0.00" arrival="349.90" arrivalLane="c2s_1" arrivalPos="990.00" arrivalPosLat="0.00" arrivalSpeed="13.89" duration="158.90" routeLength="1997.01" waitingTime="4.80" waitingCount="1" stopTime="0.00" timeLoss="15.22" rerouteNo="1" devices="tripinfo_car_n2s_191 routing_car_n2s_191" vType="Car" speedFactor="1.00" vaporized=""/>
    <tripinfo id="car_s2e_188" depart="188.00" departLane="s2sep_1" departPos="3.60" departPosLat="0.00" departSpeed="13.90" departDelay="0.00" arrival="351.40" arrivalLane="c2e_1" arrivalPos="990.00" arrivalPosLat="0.00" arrivalSpeed="14.32" duration="163.40" routeLength="1986.69" waitingTime="12.15" waitingCount="1" stopTime="0.00" timeLoss="23.93" rerouteNo="1" devices="tripinfo_car_s2e_188 routing_car_s2e_188" vType="Car" speedFactor="1.03" vaporized=""/>
    <tripinfo id="car_n2w_211" depart="211.00" departLane="n2sep_1" departPos="3.60" departPosLat="0.00" departSpeed="13.90" departDelay="0.00" arrival="351.40" arrivalLane="c2w_1" arrivalPos="990.00" arrivalPosLat="0.00" arrivalSpeed="14.69" duration="140.40" routeLength="1986.69" waitingTime="0.00" waitingCount="0" stopTime="0.00" timeLoss="4.45" rerouteNo="1" devices="tripinfo_car_n2w_211 routing_car_n2w_211" vType="Car" speedFactor="1.06" vaporized=""/>
    <tripinfo id="car_n2s_214" depart="214.00" departLane="n2sep_1" departPos="3.60" departPosLat="0.00" departSpeed="13.90" departDelay="0.00" arrival="352.65" arrivalLane="c2s_1" arrivalPos="990.00" arrivalPosLat="0.00" arrivalSpeed="14.98" duration="138.65" routeLength="1997.01" waitingTime="0.00" waitingCount="0" stopTime="0.00" timeLoss="6.60" rerouteNo="1" devices="tripinfo_car_n2s_214 routing_car_n2s_214" vType="Car" speedFactor="1.09" vaporized=""/>
    <tripinfo id="car_s2n_199" depart="199.00" departLane="s2sep_1" departPos="3.60" departPosLat="0.00" departSpeed="13.90" departDelay="0.00" arrival="354.25" arrivalLane="c2n_1" arrivalPos="990.00" arrivalPosLat="0.00" arrivalSpeed="14.00" duration="155.25" routeLength="1997.01" waitingTime="0.65" waitingCount="1" stopTime="0.00" timeLoss="12.55" rerouteNo="1" devices="tripinfo_car_s2n_199 routing_car_s2n_199" vType="Car" speedFactor="1.01" vaporized=""/>
    <tripinfo id="car_s2e_210" depart="210.00" departLane="s2sep_1" departPos="3.60" departPosLat="0.00" departSpeed="13.90" departDelay="0.00" arrival="355.65" arrivalLane="c2e_1" arrivalPos="990.00" arrivalPosLat="0.00" arrivalSpeed="15.15" duration="145.65" routeLength="1986.69" waitingTime="0.00" waitingCount="0" stopTime="0.00" timeLoss="13.94" rerouteNo="1" devices="tripinfo_car_s2e_210 routing_car_s2e_210" vType="Car" speedFactor="1.09" vaporized=""/>
    <tripinfo id="car_s2n_201" depart="201.00" departLane="s2sep_1" departPos="3.60" departPosLat="0.00" departSpeed="13.90" departDelay="0.00" arrival="358.05" arrivalLane="c2n_1" arrivalPos="990.00" arrivalPosLat="0.00" arrivalSpeed="14.11" duration="157.05" routeLength="1997.01" waitingTime="0.00" waitingCount="0" stopTime="0.00" timeLoss="15.70" rerouteNo="1" devices="tripinfo_car_s2n_201 routing_car_s2n_201" vType="Car" speedFactor="1.02" vaporized=""/>
    <tripinfo id="car_s2e_215" depart="215.00" departLane="s2sep_1" departPos="3.60" departPosLat="0.00" departSpeed="13.90" departDelay="0.00" arrival="358.60" arrivalLane="c2e_1" arrivalPos="990.00" arrivalPosLat="0.00" arrivalSpeed="15.49" duration="143.60" routeLength="1986.69" waitingTime="0.00" waitingCount="0" stopTime="0.00" timeLoss="15.50" rerouteNo="1" devices="tripinfo_car_s2e_215 routing_car_s2e_215" vType="Car" speedFactor="1.12" vaporized=""/>
    <tripinfo id="car_s2w_151" depart="151.00" departLane="s2sep_1" departPos="3.60" departPosLat="0.00" departSpeed="13.90" departDelay="0.00" arrival="360.10" arrivalLane="c2w_1" arrivalPos="990.00" arrivalPosLat="0.00" arrivalSpeed="13.90" duration="209.10" routeLength="1996.47" waitingTime="53.70" waitingCount="2" stopTime="0.00" timeLoss="64.79" rerouteNo="1" devices="tripinfo_car_s2w_151 routing_car_s2w_151" vType="Car" speedFactor="1.00" vaporized=""/>
    <tripinfo id="car_s2n_202" depart="202.60" departLane="s2sep_1" departPos="3.60" departPosLat="0.00" departSpeed="13.90" departDelay="0.60" arrival="360.25" arrivalLane="c2n_1" arrivalPos="990.00" arrivalPosLat="0.00" arrivalSpeed="14.86" duration="157.65" routeLength="1997.01" waitingTime="0.00" waitingCount="0" stopTime="0.00" timeLoss="26.08" rerouteNo="1" devices="tripinfo_car_s2n_202 routing_car_s2n_202" vType="Car" speedFactor="1.09" vaporized=""/>
    <tripinfo id="car_n2s_226" depart="226.00" departLane="n2sep_1" departPos="3.60" departPosLat="0.00" departSpeed="13.90" departDelay="0.00" arrival="361.60" arrivalLane="c2s_1" arrivalPos="990.00" arrivalPosLat="0.00" arrivalSpeed="14.80" duration="135.60" routeLength="1997.01" waitingTime="0.00" waitingCount="0" stopTime="0.00" timeLoss="0.68" rerouteNo="1" devices="tripinfo_car_n2s_226 routing_car_n2s_226" vType="Car" speedFactor="1.07" vaporized=""/>
    <tripinfo id="car_s2w_157" depart="157.35" departLane="s2sep_1" departPos="3.60" departPosLat="0.00" departSpeed="13.90" departDelay="0.35" arrival="363.30" arrivalLane="c2w_1" arrivalPos="990.00" arrivalPosLat="0.00" arrivalSpeed="14.29" duration="205.95" routeLength="1996.47" waitingTime="45.25" waitingCount="2" stopTime="0.00" timeLoss="66.18" rerouteNo="1" devices="tripinfo_car_s2w_157 routing_car_s2w_157" vType="Car" speedFactor="1.03" vaporized=""/>
    <tripinfo id="car_n2e_156" depart="156.00" departLane="n2sep_1" departPos="3.60" departPosLat="0.00" departSpeed="13.90" departDelay="0.00" arrival="366.75" arrivalLane="c2e_1" arrivalPos="990.00" arrivalPosLat="0.00" arrivalSpeed="13.90" duration="210.75" routeLength="1996.47" waitingTime="55.10" waitingCount="2" stopTime="0.00" timeLoss="66.40" rerouteNo="1" devices="tripinfo_car_n2e_156 routing_car_n2e_156" vType="Car" speedFactor="1.00" vaporized=""/>
    <tripinfo id="car_s2n_235" depart="235.00" departLane="s2sep_1" departPos="3.60" departPosLat="0.00" departSpeed="13.90" departDelay="0.00" arrival="369.70" arrivalLane="c2n_1" arrivalPos="990.00" arrivalPosLat="0.00" arrivalSpeed="14.91" duration="134.70" routeLength="1997.01" waitingTime="0.00" waitingCount="0" stopTime="0.00" timeLoss="0.75" rerouteNo="1" devices="tripinfo_car_s2n_235 routing_car_s2n_235" vType="Car" speedFactor="1.07" vaporized=""/>
    <tripinfo id="bus_n2e_202" depart="202.00" departLane="n2sep_1" departPos="12.10" departPosLat="0.00" departSpeed="13.90" departDelay="0.00" arrival="372.40" arrivalLane="c2e_1" arrivalPos="990.00" arrivalPosLat="0.00" arrivalSpeed="13.88" duration="170.40" routeLength="1987.97" waitingTime="14.90" waitingCount="1" stopTime="0.00" timeLoss="26.67" rerouteNo="1" devices="tripinfo_bus_n2e_202 routing_bus_n2e_202" vType="Bus" speedFactor="1.00" vaporized=""/>
    <tripinfo id="car_n2e_241" depart="241.00" departLane="n2sep_1" departPos="3.60" departPosLat="0.00" departSpeed="13.90" departDelay="0.00" arrival="381.70" arrivalLane="c2e_1" arrivalPos="990.00" arrivalPosLat="0.00" arrivalSpeed="14.80" duration="140.70" routeLength="1996.47" waitingTime="0.00" waitingCount="0" stopTime="0.00" timeLoss="5.13" rerouteNo="1" devices="tripinfo_car_n2e_241 routing_car_n2e_241" vType="Car" speedFactor="1.06" vaporized=""/>
    <tripinfo id="car_w2s_208" depart="208.00" departLane="w2sep_1" departPos="3.60" departPosLat="0.00" departSpeed="13.90" departDelay="0.00" arrival="388.10" arrivalLane="c2s_1" arrivalPos="990.00" arrivalPosLat="0.00" arrivalSpeed="14.42" duration="180.10" routeLength="1986.69" waitingTime="34.05" waitingCount="1" stopTime="0.00" timeLoss="41.66" rerouteNo="1" devices="tripinfo_car_w2s_208 routing_car_w2s_208" vType="Car" speedFactor="1.04" vaporized=""/>
    <tripinfo id="car_e2w_196" depart="196.45" departLane="e2sep_1" departPos="3.60" departPosLat="0.00" departSpeed="13.90" departDelay="0.45" arrival="389.95" arrivalLane="c2w_1" arrivalPos="990.00" arrivalPosLat="0.00" arrivalSpeed="14.49" duration="193.50" routeLength="1997.01" waitingTime="43.45" waitingCount="1" stopTime="0.00" timeLoss="55.70" rerouteNo="1" devices="tripinfo_car_e2w_196 routing_car_e2w_196" vType="Car" speedFactor="1.04" vaporized=""/>
    <tripinfo id="car_e2n_195" depart="195.00" departLane="e2sep_1" departPos="3.60" departPosLat="0.00" departSpeed="13.90" departDelay="0.00" arrival="390.55" arrivalLane="c2n_1" arrivalPos="990.00" arrivalPosLat="0.00" arrivalSpeed="13.92" duration="195.55" routeLength="1986.69" waitingTime="45.20" waitingCount="1" stopTime="0.00" timeLoss="52.11" rerouteNo="1" devices="tripinfo_car_e2n_195 routing_car_e2n_195" vType="Car" speedFactor="1.00" vaporized=""/>
    <tripinfo id="car_w2s_232" depart="232.00" departLane="w2sep_1" departPos="3.60" departPosLat="0.00" departSpeed="13.90" departDelay="0.00" arrival="394.40" arrivalLane="c2s_1" arrivalPos="990.00" arrivalPosLat="0.00" arrivalSpeed="13.90" duration="162.40" routeLength="1986.69" waitingTime="8.85" waitingCount="1" stopTime="0.00" timeLoss="18.72" rerouteNo="1" devices="tripinfo_car_w2s_232 routing_car_w2s_232" vType="Car" speedFactor="1.00" vaporized=""/>
    <tripinfo id="car_e2w_213" depart="213.00" departLane="e2sep_1" departPos="3.60" departPosLat="0.00" departSpeed="13.90" departDelay="0.00" arrival="395.70" arrivalLane="c2w_1" arrivalPos="990.00" arrivalPosLat="0.00" arrivalSpeed="14.04" duration="182.70" routeLength="1997.01" waitingTime="29.30" waitingCount="1" stopTime="0.00" timeLoss="40.42" rerouteNo="1" devices="tripinfo_car_e2w_213 routing_car_e2w_213" vType="Car" speedFactor="1.01" vaporized=""/>
    <tripinfo id="car_e2w_218" depart="218.00" departLane="e2sep_1" departPos="3.60" departPosLat="0.00" departSpeed="13.90" departDelay="0.00" arrival="398.00" arrivalLane="c2w_1" arrivalPos="990.00" arrivalPosLat="0.00" arrivalSpeed="14.95" duration="180.00" routeLength="1997.01" waitingTime="28.40" waitingCount="1" stopTime="0.00" timeLoss="49.01" rerouteNo="1" devices="tripinfo_car_e2w_218 routing_car_e2w_218" vType="Car" speedFactor="1.10" vaporized=""/>
    <tripinfo id="car_w2s_234" depart="234.00" departLane="w2sep_1" departPos="3.60" departPosLat="0.00" departSpeed="13.90" departDelay="0.00" arrival="398.40" arrivalLane="c2s_1" arrivalPos="990.00" arrivalPosLat="0.00" arrivalSpeed="13.88" duration="164.40" routeLength="1986.69" waitingTime="6.10" waitingCount="1" stopTime="0.00" timeLoss="20.71" rerouteNo="1" devices="tripinfo_car_w2s_234 routing_car_w2s_234" vType="Car" speedFactor="1.00" vaporized=""/>
    <tripinfo id="car_w2e_249" depart="249.00" departLane="w2sep_1" departPos="3.60" departPosLat="0.00" departSpeed="13.90" departDelay="0.00" arrival="398.75" arrivalLane="c2e_1" arrivalPos="990.00" arrivalPosLat="0.00" arrivalSpeed="14.13" duration="149.75" routeLength="1997.01" waitingTime="0.00" waitingCount="0" stopTime="0.00" timeLoss="8.45" rerouteNo="1" devices="tripinfo_car_w2e_249 routing_car_w2e_249" vType="Car" speedFactor="1.02" vaporized=""/>
    <tripinfo id="car_e2n_236" depart="236.00" departLane="e2sep_1" departPos="3.60" departPosLat="0.00" departSpeed="13.90" departDelay="0.00" arrival="400.65" arrivalLane="c2n_1" arrivalPos="990.00" arrivalPosLat="0.00" arrivalSpeed="14.09" duration="164.65" routeLength="1986.69" waitingTime="10.40" waitingCount="1" stopTime="0.00" timeLoss="22.95" rerouteNo="1" devices="tripinfo_car_e2n_236 routing_car_e2n_236" vType="Car" speedFactor="1.01" vaporized=""/>
    <tripinfo id="car_w2s_244" depart="244.00" departLane="w2sep_1" departPos="3.60" departPosLat="0.00" departSpeed="13.90" departDelay="0.00" arrival="401.80" arrivalLane="c2s_1" arrivalPos="990.00" arrivalPosLat="0.00" arrivalSpeed="13.86" duration="157.80" routeLength="1986.69" waitingTime="0.00" waitingCount="0" stopTime="0.00" timeLoss="14.15" rerouteNo="1" devices="tripinfo_car_w2s_244 routing_car_w2s_244" vType="Car" speedFactor="1.00" vaporized=""/>
    <tripinfo id="car_e2w_230" depart="230.00" departLane="e2sep_1" departPos="3.60" departPosLat="0.00" departSpeed="13.90" departDelay="0.00" arrival="402.05" arrivalLane="c2w_1" arrivalPos="990.00" arrivalPosLat="0.00" arrivalSpeed="13.89" duration="172.05" routeLength="1997.01" waitingTime="14.50" waitingCount="1" stopTime="0.00" timeLoss="28.37" rerouteNo="1" devices="tripinfo_car_e2w_230 routing_car_e2w_230" vType="Car" speedFactor="1.00" vaporized=""/>
    <tripinfo id="car_e2s_208" depart="208.00" departLane="e2sep_1" departPos="3.60" departPosLat="0.00" departSpeed="13.90" departDelay="0.00" arrival="404.30" arrivalLane="c2s_1" arrivalPos="990.00" arrivalPosLat="0.00" arrivalSpeed="14.33" duration="196.30" routeLength="1996.47" waitingTime="42.30" waitingCount="2" stopTime="0.00" timeLoss="57.97" rerouteNo="1" devices="tripinfo_car_e2s_208 routing_car_e2s_208" vType="Car" speedFactor="1.04" vaporized=""/>
    <tripinfo id="car_e2w_238" depart="238.00" departLane="e2sep_1" departPos="3.60" departPosLat="0.00" departSpeed="13.90" departDelay="0.00" arrival="404.80" arrivalLane="c2w_1" arrivalPos="990.00" arrivalPosLat="0.00" arrivalSpeed="14.27" duration="166.80" routeLength="1997.01" waitingTime="8.65" waitingCount="1" stopTime="0.00" timeLoss="27.90" rerouteNo="1" devices="tripinfo_car_e2w_238 routing_car_e2w_238" vType="Car" speedFactor="1.03" vaporized=""/>
    <tripinfo id="car_w2e_262" depart="262.45" departLane="w2sep_1" departPos="3.60" departPosLat="0.00" departSpeed="13.90" departDelay="0.45" arrival="405.50" arrivalLane="c2e_1" arrivalPos="990.00" arrivalPosLat="0.00" arrivalSpeed="14.88" duration="143.05" routeLength="1997.01" waitingTime="0.00" waitingCount="0" stopTime="0.00" timeLoss="8.87" rerouteNo="1" devices="tripinfo_car_w2e_262 routing_car_w2e_262" vType="Car" speedFactor="1.07" vaporized=""/>
    <tripinfo id="car_e2n_251" depart="251.00" departLane="e2sep_1" departPos="3.60" departPosLat="0.00" departSpeed="13.90" departDelay="0.00" arrival="406.05" arrivalLane="c2n_1" arrivalPos="990.00" arrivalPosLat="0.00" arrivalSpeed="14.02" duration="155.05" routeLength="1986.69" waitingTime="0.00" waitingCount="0" stopTime="0.00" timeLoss="12.66" rerouteNo="1" devices="tripinfo_car_e2n_251 routing_car_e2n_251" vType="Car" speedFactor="1.01" vaporized=""/>
    <tripinfo id="car_e2w_256" depart="256.00" departLane="e2sep_1" departPos="3.60" departPosLat="0.00" departSpeed="13.90" departDelay="0.00" arrival="406.60" arrivalLane="c2w_1" arrivalPos="990.00" arrivalPosLat="0.00" arrivalSpeed="15.42" duration="150.60" routeLength="1997.01" waitingTime="0.00" waitingCount="0" stopTime="0.00" timeLoss="28.53" rerouteNo="1" devices="tripinfo_car_e2w_256 routing_car_e2w_256" vType="Car" speedFactor="1.18" vaporized=""/>
    <tripinfo id="car_w2s_261" depart="261.00" departLane="w2sep_1" departPos="3.60" departPosLat="0.00" departSpeed="13.90" departDelay="0.00" arrival="409.00" arrivalLane="c2s_1" arrivalPos="990.00" arrivalPosLat="0.00" arrivalSpeed="13.94" duration="148.00" routeLength="1986.69" waitingTime="0.00" waitingCount="0" stopTime="0.00" timeLoss="4.80" rerouteNo="1" devices="tripinfo_car_w2s_261 routing_car_w2s_261" vType="Car" speedFactor="1.00" vaporized=""/>
    <tripinfo id="car_e2w_258" depart="258.00" departLane="e2sep_1" departPos="3.60" departPosLat="0.00" departSpeed="13.90" departDelay="0.00" arrival="410.60" arrivalLane="c2w_1" arrivalPos="990.00" arrivalPosLat="0.00" arrivalSpeed="13.95" duration="152.60" routeLength="1997.01" waitingTime="0.00" waitingCount="0" stopTime="0.00" timeLoss="9.55" rerouteNo="1" devices="tripinfo_car_e2w_258 routing_car_e2w_258" vType="Car" speedFactor="1.00" vaporized=""/>
    <tripinfo id="car_e2s_251" depart="252.45" departLane="e2sep_1" departPos="3.60" departPosLat="0.00" departSpeed="13.90" departDelay="1.45" arrival="411.20" arrivalLane="c2s_1" arrivalPos="990.00" arrivalPosLat="0.00" arrivalSpeed="14.90" duration="158.75" routeLength="1996.47" waitingTime="4.80" waitingCount="1" stopTime="0.00" timeLoss="27.13" rerouteNo="1" devices="tripinfo_car_e2s_251 routing_car_e2s_251" vType="Car" speedFactor="1.10" vaporized=""/>
    <tripinfo id="car_e2s_269" depart="270.45" departLane="e2sep_1" departPos="3.60" departPosLat="0.00" departSpeed="13.90" departDelay="1.45" arrival="413.95" arrivalLane="c2s_1" arrivalPos="990.00" arrivalPosLat="0.00" arrivalSpeed="15.19" duration="143.50" routeLength="1996.47" waitingTime="0.00" waitingCount="0" stopTime="0.00" timeLoss="12.66" rerouteNo="1" devices="tripinfo_car_e2s_269 routing_car_e2s_269" vType="Car" speedFactor="1.10" vaporized=""/>
    <tripinfo id="car_e2w_269" depart="269.00" departLane="e2sep_1" departPos="3.60" departPosLat="0.00" departSpeed="13.90" departDelay="0.00" arrival="414.90" arrivalLane="c2w_1" arrivalPos="990.00" arrivalPosLat="0.00" arrivalSpeed="13.89" duration="145.90" routeLength="1997.01" waitingTime="0.00" waitingCount="0" stopTime="0.00" timeLoss="2.22" rerouteNo="1" devices="tripinfo_car_e2w_269 routing_car_e2w_269" vType="Car" speedFactor="1.00" vaporized=""/>
    <tripinfo id="car_w2n_201" depart="201.00" departLane="w2sep_1" departPos="3.60" departPosLat="0.00" departSpeed="13.90" departDelay="0.00" arrival="415.40" arrivalLane="c2n_1" arrivalPos="990.00" arrivalPosLat="0.00" arrivalSpeed="14.21" duration="214.40" routeLength="1996.47" waitingTime="62.10" waitingCount="3" stopTime="0.00" timeLoss="73.20" rerouteNo="1" devices="tripinfo_car_w2n_201 routing_car_w2n_201" vType="Car" speedFactor="1.02" vaporized=""/>
    <tripinfo id="car_w2s_284" depart="284.00" departLane="w2sep_1" departPos="3.60" departPosLat="0.00" departSpeed="13.90" departDelay="0.00" arrival="426.90" arrivalLane="c2s_1" arrivalPos="990.00" arrivalPosLat="0.00" arrivalSpeed="14.35" duration="142.90" routeLength="1986.69" waitingTime="0.00" waitingCount="0" stopTime="0.00" timeLoss="3.74" rerouteNo="1" devices="tripinfo_car_w2s_284 routing_car_w2s_284" vType="Car" speedFactor="1.03" vaporized=""/>
    <tripinfo id="car_w2e_287" depart="287.20" departLane="w2sep_1" departPos="3.60" departPosLat="0.00" departSpeed="13.90" departDelay="0.20" arrival="428.80" arrivalLane="c2e_1" arrivalPos="990.00" arrivalPosLat="0.00" arrivalSpeed="15.55" duration="141.60" routeLength="1997.01" waitingTime="0.00" waitingCount="0" stopTime="0.00" timeLoss="13.12" rerouteNo="1" devices="tripinfo_car_w2e_287 routing_car_w2e_287" vType="Car@car_w2e_287" speedFactor="1.12" vaporized=""/>
    <tripinfo id="amb_w2e_300" depart="300.65" departLane="w2sep_1" departPos="6.60" departPosLat="0.00" departSpeed="13.90" departDelay="0.65" arrival="430.30" arrivalLane="c2e_1" arrivalPos="990.00" arrivalPosLat="-0.95" arrivalSpeed="17.82" duration="129.65" routeLength="1994.01" waitingTime="0.00" waitingCount="0" stopTime="0.00" timeLoss="34.00" rerouteNo="1" devices="tripinfo_amb_w2e_300 routing_amb_w2e_300 bluelight_amb_w2e_300 fcd_amb_w2e_300" vType="Ambulance" speedFactor="1.50" vaporized="">
        <example_device customValue1="0.00" customValue2="-1.00"/>
    </tripinfo>
    <tripinfo id="car_w2s_285" depart="285.40" departLane="w2sep_1" departPos="3.60" departPosLat="0.00" departSpeed="13.90" departDelay="0.40" arrival="435.05" arrivalLane="c2s_1" arrivalPos="990.00" arrivalPosLat="0.00" arrivalSpeed="13.90" duration="149.65" routeLength="1986.69" waitingTime="0.00" waitingCount="0" stopTime="0.00" timeLoss="5.97" rerouteNo="1" devices="tripinfo_car_w2s_285 routing_car_w2s_285" vType="Car" speedFactor="1.00" vaporized=""/>
    <tripinfo id="car_w2s_289" depart="289.00" departLane="w2sep_1" departPos="3.60" departPosLat="0.00" departSpeed="13.90" departDelay="0.00" arrival="440.40" arrivalLane="c2s_1" arrivalPos="990.00" arrivalPosLat="0.00" arrivalSpeed="14.01" duration="151.40" routeLength="1986.69" waitingTime="0.00" waitingCount="0" stopTime="0.00" timeLoss="8.91" rerouteNo="1" devices="tripinfo_car_w2s_289 routing_car_w2s_289" vType="Car" speedFactor="1.01" vaporized=""/>
    <tripinfo id="car_w2n_290" depart="290.85" departLane="w2sep_1" departPos="3.60" departPosLat="0.00" departSpeed="13.90" departDelay="0.85" arrival="440.75" arrivalLane="c2n_1" arrivalPos="990.00" arrivalPosLat="0.00" arrivalSpeed="14.35" duration="149.90" routeLength="1996.47" waitingTime="0.00" waitingCount="0" stopTime="0.00" timeLoss="10.07" rerouteNo="1" devices="tripinfo_car_w2n_290 routing_car_w2n_290" vType="Car" speedFactor="1.03" vaporized=""/>
    <tripinfo id="car_w2s_292" depart="294.60" departLane="w2sep_1" departPos="3.60" departPosLat="0.00" departSpeed="13.90" departDelay="2.60" arrival="442.40" arrivalLane="c2s_1" arrivalPos="990.00" arrivalPosLat="0.00" arrivalSpeed="15.30" duration="147.80" routeLength="1986.69" waitingTime="0.00" waitingCount="0" stopTime="0.00" timeLoss="22.05" rerouteNo="1" devices="tripinfo_car_w2s_292 routing_car_w2s_292" vType="Car" speedFactor="1.14" vaporized=""/>
    <tripinfo id="car_e2n_280" depart="280.00" departLane="e2sep_1" departPos="3.60" departPosLat="0.00" departSpeed="13.90" departDelay="0.00" arrival="442.85" arrivalLane="c2n_1" arrivalPos="990.00" arrivalPosLat="0.00" arrivalSpeed="15.56" duration="162.85" routeLength="1986.69" waitingTime="20.75" waitingCount="1" stopTime="0.00" timeLoss="38.23" rerouteNo="1" devices="tripinfo_car_e2n_280 routing_car_e2n_280" vType="Car" speedFactor="1.15" vaporized=""/>
    <tripinfo id="car_w2s_299" depart="299.00" departLane="w2sep_1" departPos="3.60" departPosLat="0.00" departSpeed="13.90" departDelay="0.00" arrival="444.15" arrivalLane="c2s_1" arrivalPos="990.00" arrivalPosLat="0.00" arrivalSpeed="15.97" duration="145.15" routeLength="1986.69" waitingTime="0.00" waitingCount="0" stopTime="0.00" timeLoss="27.97" rerouteNo="1" devices="tripinfo_car_w2s_299 routing_car_w2s_299" vType="Car" speedFactor="1.23" vaporized=""/>
    <tripinfo id="car_e2w_302" depart="302.30" departLane="e2sep_1" departPos="3.60" departPosLat="0.00" departSpeed="13.90" departDelay="0.30" arrival="447.45" arrivalLane="c2w_1" arrivalPos="990.00" arrivalPosLat="0.00" arrivalSpeed="14.11" duration="145.15" routeLength="1997.01" waitingTime="0.00" waitingCount="0" stopTime="0.00" timeLoss="3.61" rerouteNo="1" devices="tripinfo_car_e2w_302 routing_car_e2w_302" vType="Car" speedFactor="1.02" vaporized=""/>
    <tripinfo id="car_w2n_291" depart="292.75" departLane="w2sep_1" departPos="3.60" departPosLat="0.00" departSpeed="13.90" departDelay="1.75" arrival="448.05" arrivalLane="c2n_1" arrivalPos="990.00" arrivalPosLat="0.00" arrivalSpeed="14.84" duration="155.30" routeLength="1996.47" waitingTime="2.75" waitingCount="1" stopTime="0.00" timeLoss="20.18" rerouteNo="1" devices="tripinfo_car_w2n_291 routing_car_w2n_291" vType="Car" speedFactor="1.07" vaporized=""/>
    <tripinfo id="car_e2s_272" depart="272.15" departLane="e2sep_1" departPos="3.60" departPosLat="0.00" departSpeed="13.90" departDelay="0.15" arrival="451.10" arrivalLane="c2s_1" arrivalPos="990.00" arrivalPosLat="0.00" arrivalSpeed="14.34" duration="178.95" routeLength="1996.47" waitingTime="22.40" waitingCount="2" stopTime="0.00" timeLoss="39.00" rerouteNo="1" devices="tripinfo_car_e2s_272 routing_car_e2s_272" vType="Car" speedFactor="1.03" vaporized=""/>
    <tripinfo id="car_w2n_293" depart="296.35" departLane="w2sep_1" departPos="3.60" departPosLat="0.00" departSpeed="13.90" departDelay="3.35" arrival="453.05" arrivalLane="c2n_1" arrivalPos="990.00" arrivalPosLat="0.00" arrivalSpeed="14.41" duration="156.70" routeLength="1996.47" waitingTime="0.00" waitingCount="0" stopTime="0.00" timeLoss="17.57" rerouteNo="1" devices="tripinfo_car_w2n_293 routing_car_w2n_293" vType="Car" speedFactor="1.04" vaporized=""/>
    <tripinfo id="car_e2s_301" depart="301.00" departLane="e2sep_1" departPos="3.60" departPosLat="0.00" departSpeed="13.90" departDelay="0.00" arrival="453.40" arrivalLane="c2s_1" arrivalPos="990.00" arrivalPosLat="0.00" arrivalSpeed="15.26" duration="152.40" routeLength="1996.47" waitingTime="3.50" waitingCount="1" stopTime="0.00" timeLoss="23.47" rerouteNo="1" devices="tripinfo_car_e2s_301 routing_car_e2s_301" vType="Car" speedFactor="1.12" vaporized=""/>
    <tripinfo id="car_s2e_247" depart="247.00" departLane="s2sep_1" departPos="3.60" departPosLat="0.00" departSpeed="13.90" departDelay="0.00" arrival="454.15" arrivalLane="c2e_1" arrivalPos="990.00" arrivalPosLat="0.00" arrivalSpeed="16.25" duration="207.15" routeLength="1986.69" waitingTime="76.20" waitingCount="1" stopTime="0.00" timeLoss="84.23" rerouteNo="1" devices="tripinfo_car_s2e_247 routing_car_s2e_247" vType="Car" speedFactor="1.17" vaporized=""/>
    <tripinfo id="car_e2s_309" depart="309.00" departLane="e2sep_1" departPos="3.60" departPosLat="0.00" departSpeed="13.90" departDelay="0.00" arrival="455.80" arrivalLane="c2s_1" arrivalPos="990.00" arrivalPosLat="0.00" arrivalSpeed="15.25" duration="146.80" routeLength="1996.47" waitingTime="0.00" waitingCount="0" stopTime="0.00" timeLoss="17.21" rerouteNo="1" devices="tripinfo_car_e2s_309 routing_car_e2s_309" vType="Car" speedFactor="1.11" vaporized=""/>
    <tripinfo id="car_n2s_256" depart="256.00" departLane="n2sep_1" departPos="3.60" departPosLat="0.00" departSpeed="13.90" departDelay="0.00" arrival="460.85" arrivalLane="c2s_1" arrivalPos="990.00" arrivalPosLat="0.00" arrivalSpeed="15.22" duration="204.85" routeLength="1997.01" waitingTime="64.20" waitingCount="1" stopTime="0.00" timeLoss="73.73" rerouteNo="1" devices="tripinfo_car_n2s_256 routing_car_n2s_256" vType="Car" speedFactor="1.10" vaporized=""/>
    <tripinfo id="car_n2w_235" depart="235.00" departLane="n2sep_1" departPos="3.60" departPosLat="0.00" departSpeed="13.90" departDelay="0.00" arrival="464.20" arrivalLane="c2w_1" arrivalPos="990.00" arrivalPosLat="0.00" arrivalSpeed="13.90" duration="229.20" routeLength="1986.69" waitingTime="78.70" waitingCount="1" stopTime="0.00" timeLoss="85.51" rerouteNo="1" devices="tripinfo_car_n2w_235 routing_car_n2w_235" vType="Car" speedFactor="1.00" vaporized=""/>
    <tripinfo id="car_s2e_278" depart="278.00" departLane="s2sep_1" departPos="3.60" departPosLat="0.00" departSpeed="13.90" departDelay="0.00" arrival="465.50" arrivalLane="c2e_1" arrivalPos="990.00" arrivalPosLat="0.00" arrivalSpeed="14.23" duration="187.50" routeLength="1986.69" waitingTime="37.90" waitingCount="1" stopTime="0.00" timeLoss="47.10" rerouteNo="1" devices="tripinfo_car_s2e_278 routing_car_s2e_278" vType="Car" speedFactor="1.02" vaporized=""/>
    <tripinfo id="car_n2w_318" depart="318.00" departLane="n2sep_1" departPos="3.60" departPosLat="0.00" departSpeed="13.90" departDelay="0.00" arrival="466.25" arrivalLane="c2w_1" arrivalPos="990.00" arrivalPosLat="0.00" arrivalSpeed="15.18" duration="148.25" routeLength="1986.69" waitingTime="5.05" waitingCount="1" stopTime="0.00" timeLoss="21.00" rerouteNo="1" devices="tripinfo_car_n2w_318 routing_car_n2w_318" vType="Car" speedFactor="1.13" vaporized=""/>
    <tripinfo id="car_s2e_311" depart="311.00" departLane="s2sep_1" departPos="3.60" departPosLat="0.00" departSpeed="13.90" departDelay="0.00" arrival="467.50" arrivalLane="c2e_1" arrivalPos="990.00" arrivalPosLat="0.00" arrivalSpeed="15.58" duration="156.50" routeLength="1986.69" waitingTime="7.75" waitingCount="1" stopTime="0.00" timeLoss="33.08" rerouteNo="1" devices="tripinfo_car_s2e_311 routing_car_s2e_311" vType="Car" speedFactor="1.16" vaporized=""/>
    <tripinfo id="car_s2n_307" depart="307.00" departLane="s2sep_1" departPos="3.60" departPosLat="0.00" departSpeed="13.90" departDelay="0.00" arrival="468.65" arrivalLane="c2n_1" arrivalPos="990.00" arrivalPosLat="0.00" arrivalSpeed="13.90" duration="161.65" routeLength="1997.01" waitingTime="8.35" waitingCount="1" stopTime="0.00" timeLoss="17.99" rerouteNo="1" devices="tripinfo_car_s2n_307 routing_car_s2n_307" vType="Car" speedFactor="1.00" vaporized=""/>
    <tripinfo id="car_s2w_249" depart="249.00" departLane="s2sep_1" departPos="3.60" departPosLat="0.00" departSpeed="13.90" departDelay="0.00" arrival="468.80" arrivalLane="c2w_1" arrivalPos="990.00" arrivalPosLat="0.00" arrivalSpeed="15.09" duration="219.80" routeLength="1996.47" waitingTime="73.20" waitingCount="2" stopTime="0.00" timeLoss="88.41" rerouteNo="1" devices="tripinfo_car_s2w_249 routing_car_s2w_249" vType="Car" speedFactor="1.10" vaporized=""/>
    <tripinfo id="car_s2w_279" depart="279.40" departLane="s2sep_1" departPos="3.60" departPosLat="0.00" departSpeed="13.90" departDelay="0.40" arrival="472.50" arrivalLane="c2w_1" arrivalPos="990.00" arrivalPosLat="0.00" arrivalSpeed="14.72" duration="193.10" routeLength="1996.47" waitingTime="37.45" waitingCount="2" stopTime="0.00" timeLoss="57.08" rerouteNo="1" devices="tripinfo_car_s2w_279 routing_car_s2w_279" vType="Car" speedFactor="1.06" vaporized=""/>
    <tripinfo id="car_s2e_325" depart="325.00" departLane="s2sep_1" departPos="3.60" departPosLat="0.00" departSpeed="13.90" departDelay="0.00" arrival="474.20" arrivalLane="c2e_1" arrivalPos="990.00" arrivalPosLat="0.00" arrivalSpeed="13.93" duration="149.20" routeLength="1986.69" waitingTime="0.00" waitingCount="0" stopTime="0.00" timeLoss="5.84" rerouteNo="1" devices="tripinfo_car_s2e_325 routing_car_s2e_325" vType="Car" speedFactor="1.00" vaporized=""/>
    <tripinfo id="car_s2w_299" depart="299.00" departLane="s2sep_1" departPos="3.60" departPosLat="0.00" departSpeed="13.90" departDelay="0.00" arrival="477.65" arrivalLane="c2w_1" arrivalPos="990.00" arrivalPosLat="0.00" arrivalSpeed="14.06" duration="178.65" routeLength="1996.47" waitingTime="17.25" waitingCount="1" stopTime="0.00" timeLoss="36.00" rerouteNo="1" devices="tripinfo_car_s2w_299 routing_car_s2w_299" vType="Car" speedFactor="1.01" vaporized=""/>
    <tripinfo id="car_n2e_333" depart="333.00" departLane="n2sep_1" departPos="3.60" departPosLat="0.00" departSpeed="13.90" departDelay="0.00" arrival="481.10" arrivalLane="c2e_1" arrivalPos="990.00" arrivalPosLat="0.00" arrivalSpeed="13.90" duration="148.10" routeLength="1996.47" waitingTime="0.00" waitingCount="0" stopTime="0.00" timeLoss="3.79" rerouteNo="1" devices="tripinfo_car_n2e_333 routing_car_n2e_333" vType="Car" speedFactor="1.00" vaporized=""/>
    <tripinfo id="car_n2s_340" depart="340.00" departLane="n2sep_1" departPos="3.60" departPosLat="0.00" departSpeed="13.90" departDelay="0.00" arrival="483.10" arrivalLane="c2s_1" arrivalPos="990.00" arrivalPosLat="0.00" arrivalSpeed="14.80" duration="143.10" routeLength="1997.01" waitingTime="0.00" waitingCount="0" stopTime="0.00" timeLoss="8.12" rerouteNo="1" devices="tripinfo_car_n2s_340 routing_car_n2s_340" vType="Car" speedFactor="1.06" vaporized=""/>
</tripinfos>
