<?xml version="1.0" encoding="UTF-8"?>

<!-- generated on 2021-05-18 05:16:42 by Eclipse SUMO sumo Version 1.9.1
<configuration xmlns:xsi="http://www.w3.org/2001/XMLSchema-instance" xsi:noNamespaceSchemaLocation="http://sumo.dlr.de/xsd/sumoConfiguration.xsd">

    <input>
        <net-file value="sumofiles/junction.net.xml"/>
        <route-files value="sumofiles/junction_radius_4.rou.xml"/>
        <additional-files value="sumofiles/junction.det.xml"/>
    </input>

    <output>
        <tripinfo-output value="sumofiles/output/tripinfo_radius_4.xml"/>
    </output>

    <time>
        <begin value="0"/>
        <end value="10000"/>
        <step-length value="1.0"/>
    </time>

    <processing>
        <lateral-resolution value="0.5"/>
    </processing>

    <report>
        <no-warnings value="true"/>
        <error-log value="sumofiles/output/errorlog_radius_4.log"/>
        <no-step-log value="true"/>
    </report>

    <traci_server>
        <remote-port value="53575"/>
    </traci_server>

    <gui_only>
        <gui-settings-file value="sumofiles/junction-gui.settings.xml"/>
        <tracker-interval value="1"/>
    </gui_only>

</configuration>
-->

<tripinfos xmlns:xsi="http://www.w3.org/2001/XMLSchema-instance" xsi:noNamespaceSchemaLocation="http://sumo.dlr.de/xsd/tripinfo_file.xsd">
    <tripinfo id="car_e2w_8" depart="8.00" departLane="e2sep_1" departPos="3.60" departPosLat="0.00" departSpeed="13.90" departDelay="0.00" arrival="141.00" arrivalLane="c2w_1" arrivalPos="990.00" arrivalPosLat="0.00" arrivalSpeed="15.05" duration="133.00" routeLength="1997.01" waitingTime="0.00" waitingCount="0" stopTime="0.00" timeLoss="0.13" rerouteNo="1" devices="tripinfo_car_e2w_8 routing_car_e2w_8" vType="Car" speedFactor="1.08" vaporized=""/>
    <tripinfo id="car_s2n_11" depart="11.00" departLane="s2sep_1" departPos="3.60" departPosLat="0.00" departSpeed="13.90" departDelay="0.00" arrival="163.00" arrivalLane="c2n_1" arrivalPos="990.00" arrivalPosLat="0.00" arrivalSpeed="14.32" duration="152.00" routeLength="1997.01" waitingTime="2.00" waitingCount="1" stopTime="0.00" timeLoss="11.73" rerouteNo="1" devices="tripinfo_car_s2n_11 routing_car_s2n_11" vType="Car" speedFactor="1.03" vaporized=""/>
    <tripinfo id="car_s2n_19" depart="19.00" departLane="s2sep_1" departPos="3.60" departPosLat="0.00" departSpeed="13.90" departDelay="0.00" arrival="168.00" arrivalLane="c2n_1" arrivalPos="990.00" arrivalPosLat="0.00" arrivalSpeed="14.04" duration="149.00" routeLength="1997.01" waitingTime="0.00" waitingCount="0" stopTime="0.00" timeLoss="6.14" rerouteNo="1" devices="tripinfo_car_s2n_19 routing_car_s2n_19" vType="Car" speedFactor="1.01" vaporized=""/>
    <tripinfo id="car_n2e_3" depart="3.00" departLane="n2sep_1" departPos="3.60" departPosLat="0.00" departSpeed="13.90" departDelay="0.00" arrival="169.00" arrivalLane="c2e_1" arrivalPos="990.00" arrivalPosLat="0.00" arrivalSpeed="14.73" duration="166.00" routeLength="1996.47" waitingTime="13.00" waitingCount="2" stopTime="0.00" timeLoss="29.51" rerouteNo="1" devices="tripinfo_car_n2e_3 routing_car_n2e_3" vType="Car" speedFactor="1.06" vaporized=""/>
    <tripinfo id="car_s2n_27" depart="27.00" departLane="s2sep_1" departPos="3.60" departPosLat="0.00" departSpeed="13.90" departDelay="0.00" arrival="171.00" arrivalLane="c2n_1" arrivalPos="990.00" arrivalPosLat="0.00" arrivalSpeed="14.22" duration="144.00" routeLength="1997.01" waitingTime="0.00" waitingCount="0" stopTime="0.00" timeLoss="3.79" rerouteNo="1" devices="tripinfo_car_s2n_27 routing_car_s2n_27" vType="Car" speedFactor="1.03" vaporized=""/>
    <tripinfo id="car_n2e_5" depart="5.00" departLane="n2sep_1" departPos="3.60" departPosLat="0.00" departSpeed="13.90" departDelay="0.00" arrival="173.00" arrivalLane="c2e_1" arrivalPos="990.00" arrivalPosLat="0.00" arrivalSpeed="14.72" duration="168.00" routeLength="1996.47" waitingTime="10.00" waitingCount="2" stopTime="0.00" timeLoss="31.86" rerouteNo="1" devices="tripinfo_car_n2e_5 routing_car_n2e_5" vType="Car" speedFactor="1.06" vaporized=""/>
    <tripinfo id="car_n2e_20" depart="20.00" departLane="n2sep_1" departPos="3.60" departPosLat="0.00" departSpeed="13.90" departDelay="0.00" arrival="177.00" arrivalLane="c2e_1" arrivalPos="990.00" arrivalPosLat="0.00" arrivalSpeed="15.03" duration="157.00" routeLength="1996.47" waitingTime="1.00" waitingCount="1" stopTime="0.00" timeLoss="23.35" rerouteNo="1" devices="tripinfo_car_n2e_20 routing_car_n2e_20" vType="Car" speedFactor="1.08" vaporized=""/>
    <tripinfo id="car_s2n_33" depart="33.00" departLane="s2sep_1" departPos="3.60" departPosLat="0.00" departSpeed="13.90" departDelay="0.00" arrival="178.00" arrivalLane="c2n_1" arrivalPos="990.00" arrivalPosLat="0.00" arrivalSpeed="13.90" duration="145.00" routeLength="1997.01" waitingTime="0.00" waitingCount="0" stopTime="0.00" timeLoss="1.31" rerouteNo="1" devices="tripinfo_car_s2n_33 routing_car_s2n_33" vType="Car" speedFactor="1.00" vaporized=""/>
    <tripinfo id="car_n2e_54" depart="54.00" departLane="n2sep_1" departPos="3.60" departPosLat="0.00" departSpeed="13.90" departDelay="0.00" arrival="196.00" arrivalLane="c2e_1" arrivalPos="990.00" arrivalPosLat="0.00" arrivalSpeed="14.55" duration="142.00" routeLength="1996.47" waitingTime="0.00" waitingCount="0" stopTime="0.00" timeLoss="4.04" rerouteNo="1" devices="tripinfo_car_n2e_54 routing_car_n2e_54" vType="Car" speedFactor="1.05" vaporized=""/>
    <tripinfo id="car_e2n_30" depart="30.00" departLane="e2sep_1" departPos="3.60" departPosLat="0.00" departSpeed="13.90" departDelay="0.00" arrival="206.00" arrivalLane="c2n_1" arrivalPos="990.00" arrivalPosLat="0.00" arrivalSpeed="14.55" duration="176.00" routeLength="1986.69" waitingTime="29.00" waitingCount="1" stopTime="0.00" timeLoss="38.84" rerouteNo="1" devices="tripinfo_car_e2n_30 routing_car_e2n_30" vType="Car" speedFactor="1.05" vaporized=""/>
    <tripinfo id="car_e2w_44" depart="45.00" departLane="e2sep_1" departPos="3.60" departPosLat="0.00" departSpeed="13.90" departDelay="1.00" arrival="206.00" arrivalLane="c2w_1" arrivalPos="990.00" arrivalPosLat="0.00" arrivalSpeed="15.16" duration="161.00" routeLength="1997.01" waitingTime="17.00" waitingCount="1" stopTime="0.00" timeLoss="28.77" rerouteNo="1" devices="tripinfo_car_e2w_44 routing_car_e2w_44" vType="Car" speedFactor="1.09" vaporized=""/>
    <tripinfo id="car_w2e_8" depart="8.00" departLane="w2sep_1" departPos="3.60" departPosLat="0.00" departSpeed="13.90" departDelay="0.00" arrival="209.00" arrivalLane="c2e_1" arrivalPos="990.00" arrivalPosLat="0.00" arrivalSpeed="14.04" duration="201.00" routeLength="1997.01" waitingTime="50.00" waitingCount="1" stopTime="0.00" timeLoss="58.46" rerouteNo="1" devices="tripinfo_car_w2e_8 routing_car_w2e_8" vType="Car" speedFactor="1.01" vaporized=""/>
    <tripinfo id="car_e2w_56" depart="56.00" departLane="e2sep_1" departPos="3.60" departPosLat="0.00" departSpeed="13.90" departDelay="0.00" arrival="211.00" arrivalLane="c2w_1" arrivalPos="990.00" arrivalPosLat="0.00" arrivalSpeed="15.60" duration="155.00" routeLength="1997.01" waitingTime="9.00" waitingCount="1" stopTime="0.00" timeLoss="26.20" rerouteNo="1" devices="tripinfo_car_e2w_56 routing_car_e2w_56" vType="Car" speedFactor="1.12" vaporized=""/>
    <tripinfo id="car_w2s_16" depart="18.00" departLane="w2sep_1" departPos="3.60" departPosLat="0.00" departSpeed="13.90" departDelay="2.00" arrival="212.00" arrivalLane="c2s_1" arrivalPos="990.00" arrivalPosLat="0.00" arrivalSpeed="14.54" duration="194.00" routeLength="1986.69" waitingTime="40.00" waitingCount="1" stopTime="0.00" timeLoss="56.22" rerouteNo="1" devices="tripinfo_car_w2s_16 routing_car_w2s_16" vType="Car" speedFactor="1.05" vaporized=""/>
    <tripinfo id="car_w2e_16" depart="16.00" departLane="w2sep_1" departPos="3.60" departPosLat="0.00" departSpeed="13.90" departDelay="0.00" arrival="214.00" arrivalLane="c2e_1" arrivalPos="990.00" arrivalPosLat="0.00" arrivalSpeed="13.90" duration="198.00" routeLength="1997.01" waitingTime="41.00" waitingCount="1" stopTime="0.00" timeLoss="53.77" rerouteNo="1" devices="tripinfo_car_w2e_16 routing_car_w2e_16" vType="Car" speedFactor="1.00" vaporized=""/>
    <tripinfo id="car_e2n_50" depart="50.00" departLane="e2sep_1" departPos="3.60" departPosLat="0.00" departSpeed="13.90" departDelay="0.00" arrival="214.00" arrivalLane="c2n_1" arrivalPos="990.00" arrivalPosLat="0.00" arrivalSpeed="14.27" duration="164.00" routeLength="1986.69" waitingTime="10.00" waitingCount="1" stopTime="0.00" timeLoss="23.61" rerouteNo="1" devices="tripinfo_car_e2n_50 routing_car_e2n_50" vType="Car" speedFactor="1.03" vaporized=""/>
    <tripinfo id="car_w2e_27" depart="27.00" departLane="w2sep_1" departPos="3.60" departPosLat="0.00" departSpeed="13.90" departDelay="0.00" arrival="216.00" arrivalLane="c2e_1" arrivalPos="990.00" arrivalPosLat="0.00" arrivalSpeed="14.81" duration="189.00" routeLength="1997.01" waitingTime="38.00" waitingCount="1" stopTime="0.00" timeLoss="56.97" rerouteNo="1" devices="tripinfo_car_w2e_27 routing_car_w2e_27" vType="Car" speedFactor="1.09" vaporized=""/>
    <tripinfo id="car_e2n_66" depart="66.00" departLane="e2sep_1" departPos="3.60" departPosLat="0.00" departSpeed="13.90" departDelay="0.00" arrival="216.00" arrivalLane="c2n_1" arrivalPos="990.00" arrivalPosLat="0.00" arrivalSpeed="15.75" duration="150.00" routeLength="1986.69" waitingTime="5.00" waitingCount="1" stopTime="0.00" timeLoss="27.57" rerouteNo="1" devices="tripinfo_car_e2n_66 routing_car_e2n_66" vType="Car" speedFactor="1.18" vaporized=""/>
    <tripinfo id="car_w2s_32" depart="32.00" departLane="w2sep_1" departPos="3.60" departPosLat="0.00" departSpeed="13.90" departDelay="0.00" arrival="218.00" arrivalLane="c2s_1" arrivalPos="990.00" arrivalPosLat="0.00" arrivalSpeed="14.54" duration="186.00" routeLength="1986.69" waitingTime="32.00" waitingCount="1" stopTime="0.00" timeLoss="48.18" rerouteNo="1" devices="tripinfo_car_w2s_32 routing_car_w2s_32" vType="Car" speedFactor="1.05" vaporized=""/>
    <tripinfo id="car_w2s_36" depart="39.00" departLane="w2sep_1" departPos="3.60" departPosLat="0.00" departSpeed="13.90" departDelay="3.00" arrival="220.00" arrivalLane="c2s_1" arrivalPos="990.00" arrivalPosLat="0.00" arrivalSpeed="15.66" duration="181.00" routeLength="1986.69" waitingTime="27.00" waitingCount="1" stopTime="0.00" timeLoss="56.66" rerouteNo="1" devices="tripinfo_car_w2s_36 routing_car_w2s_36" vType="Car" speedFactor="1.16" vaporized=""/>
    <tripinfo id="car_w2e_35" depart="35.00" departLane="w2sep_1" departPos="3.60" departPosLat="0.00" departSpeed="13.90" departDelay="0.00" arrival="223.00" arrivalLane="c2e_1" arrivalPos="990.00" arrivalPosLat="0.00" arrivalSpeed="13.90" duration="188.00" routeLength="1997.01" waitingTime="27.00" waitingCount="1" stopTime="0.00" timeLoss="43.71" rerouteNo="1" devices="tripinfo_car_w2e_35 routing_car_w2e_35" vType="Car" speedFactor="1.00" vaporized=""/>
    <tripinfo id="car_e2w_98" depart="98.00" departLane="e2sep_1" departPos="3.60" departPosLat="0.00" departSpeed="13.90" departDelay="0.00" arrival="223.00" arrivalLane="c2w_1" arrivalPos="990.00" arrivalPosLat="0.00" arrivalSpeed="16.10" duration="125.00" routeLength="1997.01" waitingTime="0.00" waitingCount="0" stopTime="0.00" timeLoss="0.72" rerouteNo="1" devices="tripinfo_car_e2w_98 routing_car_e2w_98" vType="Car" speedFactor="1.16" vaporized=""/>
    <tripinfo id="car_e2n_75" depart="75.00" departLane="e2sep_1" departPos="3.60" departPosLat="0.00" departSpeed="13.90" departDelay="0.00" arrival="224.00" arrivalLane="c2n_1" arrivalPos="990.00" arrivalPosLat="0.00" arrivalSpeed="13.97" duration="149.00" routeLength="1986.69" waitingTime="0.00" waitingCount="0" stopTime="0.00" timeLoss="6.00" rerouteNo="1" devices="tripinfo_car_e2n_75 routing_car_e2n_75" vType="Car" speedFactor="1.01" vaporized=""/>
    <tripinfo id="car_w2n_36" depart="37.00" departLane="w2sep_1" departPos="3.60" departPosLat="0.00" departSpeed="13.90" departDelay="1.00" arrival="229.00" arrivalLane="c2n_1" arrivalPos="990.00" arrivalPosLat="0.00" arrivalSpeed="13.90" duration="192.00" routeLength="1996.47" waitingTime="27.00" waitingCount="2" stopTime="0.00" timeLoss="47.05" rerouteNo="1" devices="tripinfo_car_w2n_36 routing_car_w2n_36" vType="Car" speedFactor="1.00" vaporized=""/>
    <tripinfo id="car_w2s_58" depart="58.00" departLane="w2sep_1" departPos="3.60" departPosLat="0.00" departSpeed="13.90" departDelay="0.00" arrival="229.00" arrivalLane="c2s_1" arrivalPos="990.00" arrivalPosLat="0.00" arrivalSpeed="13.90" duration="171.00" routeLength="1986.69" waitingTime="8.00" waitingCount="1" stopTime="0.00" timeLoss="26.75" rerouteNo="1" devices="tripinfo_car_w2s_58 routing_car_w2s_58" vType="Car" speedFactor="1.00" vaporized=""/>
    <tripinfo id="car_w2n_38" depart="41.00" departLane="w2sep_1" departPos="3.60" departPosLat="0.00" departSpeed="13.90" departDelay="3.00" arrival="232.00" arrivalLane="c2n_1" arrivalPos="990.00" arrivalPosLat="0.00" arrivalSpeed="14.10" duration="191.00" routeLength="1996.47" waitingTime="24.00" waitingCount="2" stopTime="0.00" timeLoss="48.57" rerouteNo="1" devices="tripinfo_car_w2n_38 routing_car_w2n_38" vType="Car" speedFactor="1.02" vaporized=""/>
    <tripinfo id="car_w2e_84" depart="84.00" departLane="w2sep_1" departPos="3.60" departPosLat="0.00" departSpeed="13.90" departDelay="0.00" arrival="232.00" arrivalLane="c2e_1" arrivalPos="990.00" arrivalPosLat="0.00" arrivalSpeed="14.17" duration="148.00" routeLength="1997.01" waitingTime="0.00" waitingCount="0" stopTime="0.00" timeLoss="6.85" rerouteNo="1" devices="tripinfo_car_w2e_84 routing_car_w2e_84" vType="Car" speedFactor="1.02" vaporized=""/>
    <tripinfo id="car_w2s_59" depart="60.00" departLane="w2sep_1" departPos="3.60" departPosLat="0.00" departSpeed="13.90" departDelay="1.00" arrival="233.00" arrivalLane="c2s_1" arrivalPos="990.00" arrivalPosLat="0.00" arrivalSpeed="13.89" duration="173.00" routeLength="1986.69" waitingTime="5.00" waitingCount="1" stopTime="0.00" timeLoss="28.91" rerouteNo="1" devices="tripinfo_car_w2s_59 routing_car_w2s_59" vType="Car" speedFactor="1.00" vaporized=""/>
    <tripinfo id="car_w2n_81" depart="81.00" departLane="w2sep_1" departPos="3.60" departPosLat="0.00" departSpeed="13.90" departDelay="0.00" arrival="236.00" arrivalLane="c2n_1" arrivalPos="990.00" arrivalPosLat="0.00" arrivalSpeed="13.89" duration="155.00" routeLength="1996.47" waitingTime="0.00" waitingCount="0" stopTime="0.00" timeLoss="10.46" rerouteNo="1" devices="tripinfo_car_w2n_81 routing_car_w2n_81" vType="Car" speedFactor="1.00" vaporized=""/>
    <tripinfo id="bus_e2s_18" depart="18.00" departLane="e2sep_1" departPos="12.10" departPosLat="0.00" departSpeed="13.90" departDelay="0.00" arrival="240.00" arrivalLane="c2s_1" arrivalPos="990.00" arrivalPosLat="0.00" arrivalSpeed="13.89" duration="222.00" routeLength="1987.97" waitingTime="59.00" waitingCount="2" stopTime="0.00" timeLoss="77.83" rerouteNo="1" devices="tripinfo_bus_e2s_18 routing_bus_e2s_18" vType="Bus" speedFactor="1.00" vaporized=""/>
    <tripinfo id="car_e2s_21" depart="21.00" departLane="e2sep_1" departPos="3.60" departPosLat="0.00" departSpeed="13.90" departDelay="0.00" arrival="244.00" arrivalLane="c2s_1" arrivalPos="990.00" arrivalPosLat="0.00" arrivalSpeed="14.30" duration="223.00" routeLength="1996.47" waitingTime="56.00" waitingCount="2" stopTime="0.00" timeLoss="82.13" rerouteNo="1" devices="tripinfo_car_e2s_21 routing_car_e2s_21" vType="Car" speedFactor="1.03" vaporized=""/>
    <tripinfo id="car_s2e_80" depart="80.00" departLane="s2sep_1" departPos="3.60" departPosLat="0.00" departSpeed="13.90" departDelay="0.00" arrival="244.00" arrivalLane="c2e_1" arrivalPos="990.00" arrivalPosLat="0.00" arrivalSpeed="16.29" duration="164.00" routeLength="1986.69" waitingTime="30.00" waitingCount="1" stopTime="0.00" timeLoss="41.51" rerouteNo="1" devices="tripinfo_car_s2e_80 routing_car_s2e_80" vType="Car" speedFactor="1.17" vaporized=""/>
    <tripinfo id="car_e2s_30" depart="32.00" departLane="e2sep_1" departPos="3.60" departPosLat="0.00" departSpeed="13.90" departDelay="2.00" arrival="246.00" arrivalLane="c2s_1" arrivalPos="990.00" arrivalPosLat="0.00" arrivalSpeed="15.16" duration="214.00" routeLength="1996.47" waitingTime="53.00" waitingCount="2" stopTime="0.00" timeLoss="84.78" rerouteNo="1" devices="tripinfo_car_e2s_30 routing_car_e2s_30" vType="Car" speedFactor="1.12" vaporized=""/>
    <tripinfo id="car_e2s_31" depart="34.00" departLane="e2sep_1" departPos="3.60" departPosLat="0.00" departSpeed="13.90" departDelay="3.00" arrival="250.00" arrivalLane="c2s_1" arrivalPos="990.00" arrivalPosLat="0.00" arrivalSpeed="13.89" duration="216.00" routeLength="1996.47" waitingTime="45.00" waitingCount="2" stopTime="0.00" timeLoss="70.87" rerouteNo="1" devices="tripinfo_car_e2s_31 routing_car_e2s_31" vType="Car" speedFactor="1.00" vaporized=""/>
    <tripinfo id="car_e2s_43" depart="43.00" departLane="e2sep_1" departPos="3.60" departPosLat="0.00" departSpeed="13.90" departDelay="0.00" arrival="253.00" arrivalLane="c2s_1" arrivalPos="990.00" arrivalPosLat="0.00" arrivalSpeed="13.99" duration="210.00" routeLength="1996.47" waitingTime="39.00" waitingCount="2" stopTime="0.00" timeLoss="66.46" rerouteNo="1" devices="tripinfo_car_e2s_43 routing_car_e2s_43" vType="Car" speedFactor="1.01" vaporized=""/>
    <tripinfo id="car_n2s_63" depart="63.00" departLane="n2sep_1" departPos="3.60" departPosLat="0.00" departSpeed="13.90" departDelay="0.00" arrival="255.00" arrivalLane="c2s_1" arrivalPos="990.00" arrivalPosLat="0.00" arrivalSpeed="15.13" duration="192.00" routeLength="1997.01" waitingTime="46.00" waitingCount="1" stopTime="0.00" timeLoss="64.31" rerouteNo="1" devices="tripinfo_car_n2s_63 routing_car_n2s_63" vType="Car" speedFactor="1.13" vaporized=""/>
    <tripinfo id="car_s2e_87" depart="87.00" departLane="s2sep_1" departPos="3.60" departPosLat="0.00" departSpeed="13.90" departDelay="0.00" arrival="258.00" arrivalLane="c2e_1" arrivalPos="990.00" arrivalPosLat="0.00" arrivalSpeed="13.90" duration="171.00" routeLength="1986.69" waitingTime="15.00" waitingCount="1" stopTime="0.00" timeLoss="26.43" rerouteNo="1" devices="tripinfo_car_s2e_87 routing_car_s2e_87" vType="Car" speedFactor="1.00" vaporized=""/>
    <tripinfo id="bus_n2w_73" depart="73.00" departLane="n2sep_1" departPos="12.10" departPosLat="0.00" departSpeed="13.90" departDelay="0.00" arrival="260.00" arrivalLane="c2w_1" arrivalPos="990.00" arrivalPosLat="0.00" arrivalSpeed="13.90" duration="187.00" routeLength="1978.19" waitingTime="30.00" waitingCount="1" stopTime="0.00" timeLoss="44.06" rerouteNo="1" devices="tripinfo_bus_n2w_73 routing_bus_n2w_73" vType="Bus" speedFactor="1.00" vaporized=""/>
    <tripinfo id="car_s2e_105" depart="105.00" departLane="s2sep_1" departPos="3.60" departPosLat="0.00" departSpeed="13.90" departDelay="0.00" arrival="261.00" arrivalLane="c2e_1" arrivalPos="990.00" arrivalPosLat="0.00" arrivalSpeed="14.37" duration="156.00" routeLength="1986.69" waitingTime="1.00" waitingCount="1" stopTime="0.00" timeLoss="16.94" rerouteNo="1" devices="tripinfo_car_s2e_105 routing_car_s2e_105" vType="Car" speedFactor="1.04" vaporized=""/>
    <tripinfo id="car_n2w_92" depart="92.00" departLane="n2sep_1" departPos="3.60" departPosLat="0.00" departSpeed="13.90" departDelay="0.00" arrival="263.00" arrivalLane="c2w_1" arrivalPos="990.00" arrivalPosLat="0.00" arrivalSpeed="16.00" duration="171.00" routeLength="1986.69" waitingTime="22.00" waitingCount="1" stopTime="0.00" timeLoss="48.61" rerouteNo="1" devices="tripinfo_car_n2w_92 routing_car_n2w_92" vType="Car" speedFactor="1.18" vaporized=""/>
    <tripinfo id="car_s2e_109" depart="109.00" departLane="s2sep_1" departPos="3.60" departPosLat="0.00" departSpeed="13.90" departDelay="0.00" arrival="263.00" arrivalLane="c2e_1" arrivalPos="990.00" arrivalPosLat="0.00" arrivalSpeed="14.83" duration="154.00" routeLength="1986.69" waitingTime="0.00" waitingCount="0" stopTime="0.00" timeLoss="21.75" rerouteNo="1" devices="tripinfo_car_s2e_109 routing_car_s2e_109" vType="Car" speedFactor="1.09" vaporized=""/>
    <tripinfo id="car_n2s_99" depart="99.00" departLane="n2sep_1" departPos="3.60" departPosLat="0.00" departSpeed="13.90" departDelay="0.00" arrival="264.00" arrivalLane="c2s_1" arrivalPos="990.00" arrivalPosLat="0.00" arrivalSpeed="14.32" duration="165.00" routeLength="1997.01" waitingTime="8.00" waitingCount="1" stopTime="0.00" timeLoss="24.67" rerouteNo="1" devices="tripinfo_car_n2s_99 routing_car_n2s_99" vType="Car" speedFactor="1.03" vaporized=""/>
    <tripinfo id="car_n2e_97" depart="97.00" departLane="n2sep_1" departPos="3.60" departPosLat="0.00" departSpeed="13.90" departDelay="0.00" arrival="265.00" arrivalLane="c2e_1" arrivalPos="990.00" arrivalPosLat="0.00" arrivalSpeed="14.98" duration="168.00" routeLength="1996.47" waitingTime="13.00" waitingCount="2" stopTime="0.00" timeLoss="37.07" rerouteNo="1" devices="tripinfo_car_n2e_97 routing_car_n2e_97" vType="Car" speedFactor="1.10" vaporized=""/>
    <tripinfo id="car_n2w_121" depart="121.00" departLane="n2sep_1" departPos="3.60" departPosLat="0.00" departSpeed="13.90" departDelay="0.00" arrival="265.00" arrivalLane="c2w_1" arrivalPos="990.00" arrivalPosLat="0.00" arrivalSpeed="15.76" duration="144.00" routeLength="1986.69" waitingTime="0.00" waitingCount="0" stopTime="0.00" timeLoss="20.43" rerouteNo="1" devices="tripinfo_car_n2w_121 routing_car_n2w_121" vType="Car" speedFactor="1.17" vaporized=""/>
    <tripinfo id="car_n2e_104" depart="104.00" departLane="n2sep_1" departPos="3.60" departPosLat="0.00" departSpeed="13.90" departDelay="0.00" arrival="268.00" arrivalLane="c2e_1" arrivalPos="990.00" arrivalPosLat="0.00" arrivalSpeed="15.04" duration="164.00" routeLength="1996.47" waitingTime="6.00" waitingCount="2" stopTime="0.00" timeLoss="31.22" rerouteNo="1" devices="tripinfo_car_n2e_104 routing_car_n2e_104" vType="Car" speedFactor="1.09" vaporized=""/>
    <tripinfo id="car_n2s_115" depart="115.00" departLane="n2sep_1" departPos="3.60" departPosLat="0.00" departSpeed="13.90" departDelay="0.00" arrival="269.00" arrivalLane="c2s_1" arrivalPos="990.00" arrivalPosLat="0.00" arrivalSpeed="13.90" duration="154.00" routeLength="1997.01" waitingTime="0.00" waitingCount="0" stopTime="0.00" timeLoss="9.98" rerouteNo="1" devices="tripinfo_car_n2s_115 routing_car_n2s_115" vType="Car" speedFactor="1.00" vaporized=""/>
    <tripinfo id="car_n2e_108" depart="108.00" departLane="n2sep_1" departPos="3.60" departPosLat="0.00" departSpeed="13.90" departDelay="0.00" arrival="271.00" arrivalLane="c2e_1" arrivalPos="990.00" arrivalPosLat="0.00" arrivalSpeed="14.45" duration="163.00" routeLength="1996.47" waitingTime="2.00" waitingCount="1" stopTime="0.00" timeLoss="24.12" rerouteNo="1" devices="tripinfo_car_n2e_108 routing_car_n2e_108" vType="Car" speedFactor="1.04" vaporized=""/>
    <tripinfo id="car_s2w_64" depart="64.00" departLane="s2sep_1" departPos="3.60" departPosLat="0.00" departSpeed="13.90" departDelay="0.00" arrival="273.00" arrivalLane="c2w_1" arrivalPos="990.00" arrivalPosLat="0.00" arrivalSpeed="13.90" duration="209.00" routeLength="1996.47" waitingTime="48.00" waitingCount="2" stopTime="0.00" timeLoss="64.41" rerouteNo="1" devices="tripinfo_car_s2w_64 routing_car_s2w_64" vType="Car" speedFactor="1.00" vaporized=""/>
    <tripinfo id="car_s2w_66" depart="66.00" departLane="s2sep_1" departPos="3.60" departPosLat="0.00" departSpeed="13.90" departDelay="0.00" arrival="275.00" arrivalLane="c2w_1" arrivalPos="990.00" arrivalPosLat="0.00" arrivalSpeed="15.41" duration="209.00" routeLength="1996.47" waitingTime="46.00" waitingCount="2" stopTime="0.00" timeLoss="83.49" rerouteNo="1" devices="tripinfo_car_s2w_66 routing_car_s2w_66" vType="Car" speedFactor="1.15" vaporized=""/>
    <tripinfo id="car_n2e_117" depart="117.00" departLane="n2sep_1" departPos="3.60" departPosLat="0.00" departSpeed="13.90" departDelay="0.00" arrival="275.00" arrivalLane="c2e_1" arrivalPos="990.00" arrivalPosLat="0.00" arrivalSpeed="13.89" duration="158.00" routeLength="1996.47" waitingTime="0.00" waitingCount="0" stopTime="0.00" timeLoss="13.25" rerouteNo="1" devices="tripinfo_car_n2e_117 routing_car_n2e_117" vType="Car" speedFactor="1.00" vaporized=""/>
    <tripinfo id="car_s2w_119" depart="119.00" departLane="s2sep_1" departPos="3.60" departPosLat="0.00" departSpeed="13.90" departDelay="0.00" arrival="280.00" arrivalLane="c2w_1" arrivalPos="990.00" arrivalPosLat="0.00" arrivalSpeed="13.90" duration="161.00" routeLength="1996.47" waitingTime="2.00" waitingCount="1" stopTime="0.00" timeLoss="15.68" rerouteNo="1" devices="tripinfo_car_s2w_119 routing_car_s2w_119" vType="Car" speedFactor="1.00" vaporized=""/>
    <tripinfo id="car_s2w_128" depart="128.00" departLane="s2sep_1" departPos="3.60" departPosLat="0.00" departSpeed="13.90" departDelay="0.00" arrival="283.00" arrivalLane="c2w_1" arrivalPos="990.00" arrivalPosLat="0.00" arrivalSpeed="13.91" duration="155.00" routeLength="1996.47" waitingTime="0.00" waitingCount="0" stopTime="0.00" timeLoss="10.73" rerouteNo="1" devices="tripinfo_car_s2w_128 routing_car_s2w_128" vType="Car" speedFactor="1.00" vaporized=""/>
    <tripinfo id="car_s2e_139" depart="139.00" departLane="s2sep_1" departPos="3.60" departPosLat="0.00" departSpeed="13.90" departDelay="0.00" arrival="285.00" arrivalLane="c2e_1" arrivalPos="990.00" arrivalPosLat="0.00" arrivalSpeed="14.23" duration="146.00" routeLength="1986.69" waitingTime="0.00" waitingCount="0" stopTime="0.00" timeLoss="5.05" rerouteNo="1" devices="tripinfo_car_s2e_139 routing_car_s2e_139" vType="Car" speedFactor="1.02" vaporized=""/>
    <tripinfo id="car_w2e_133" depart="133.00" departLane="w2sep_1" departPos="3.60" departPosLat="0.00" departSpeed="13.90" departDelay="0.00" arrival="293.00" arrivalLane="c2e_1" arrivalPos="990.00" arrivalPosLat="0.00" arrivalSpeed="15.88" duration="160.00" routeLength="1997.01" waitingTime="15.00" waitingCount="1" stopTime="0.00" timeLoss="34.10" rerouteNo="1" devices="tripinfo_car_w2e_133 routing_car_w2e_133" vType="Car" speedFactor="1.14" vaporized=""/>
    <tripinfo id="car_e2w_99" depart="100.00" departLane="e2sep_1" departPos="3.60" departPosLat="0.00" departSpeed="13.90" departDelay="1.00" arrival="299.00" arrivalLane="c2w_1" arrivalPos="990.00" arrivalPosLat="0.00" arrivalSpeed="14.15" duration="199.00" routeLength="1997.01" waitingTime="47.00" waitingCount="1" stopTime="0.00" timeLoss="56.96" rerouteNo="1" devices="tripinfo_car_e2w_99 routing_car_e2w_99" vType="Car" speedFactor="1.02" vaporized=""/>
    <tripinfo id="car_w2s_130" depart="130.00" departLane="w2sep_1" departPos="3.60" departPosLat="0.00" departSpeed="13.90" departDelay="0.00" arrival="299.00" arrivalLane="c2s_1" arrivalPos="990.00" arrivalPosLat="0.00" arrivalSpeed="13.90" duration="169.00" routeLength="1986.69" waitingTime="16.00" waitingCount="1" stopTime="0.00" timeLoss="25.52" rerouteNo="1" devices="tripinfo_car_w2s_130 routing_car_w2s_130" vType="Car" speedFactor="1.00" vaporized=""/>
    <tripinfo id="car_e2n_128" depart="128.00" departLane="e2sep_1" departPos="3.60" departPosLat="0.00" departSpeed="13.90" departDelay="0.00" arrival="301.00" arrivalLane="c2n_1" arrivalPos="990.00" arrivalPosLat="0.00" arrivalSpeed="15.23" duration="173.00" routeLength="1986.69" waitingTime="23.00" waitingCount="1" stopTime="0.00" timeLoss="41.66" rerouteNo="1" devices="tripinfo_car_e2n_128 routing_car_e2n_128" vType="Car" speedFactor="1.10" vaporized=""/>
    <tripinfo id="car_w2s_166" depart="166.00" departLane="w2sep_1" departPos="3.60" departPosLat="0.00" departSpeed="13.90" departDelay="0.00" arrival="301.00" arrivalLane="c2s_1" arrivalPos="990.00" arrivalPosLat="0.00" arrivalSpeed="15.45" duration="135.00" routeLength="1986.69" waitingTime="0.00" waitingCount="0" stopTime="0.00" timeLoss="10.49" rerouteNo="1" devices="tripinfo_car_w2s_166 routing_car_w2s_166" vType="Car" speedFactor="1.15" vaporized=""/>
    <tripinfo id="car_e2w_114" depart="114.00" departLane="e2sep_1" departPos="3.60" departPosLat="0.00" departSpeed="13.90" departDelay="0.00" arrival="303.00" arrivalLane="c2w_1" arrivalPos="990.00" arrivalPosLat="0.00" arrivalSpeed="14.03" duration="189.00" routeLength="1997.01" waitingTime="34.00" waitingCount="1" stopTime="0.00" timeLoss="46.54" rerouteNo="1" devices="tripinfo_car_e2w_114 routing_car_e2w_114" vType="Car" speedFactor="1.01" vaporized=""/>
    <tripinfo id="car_e2n_163" depart="163.00" departLane="e2sep_1" departPos="3.60" departPosLat="0.00" departSpeed="13.90" departDelay="0.00" arrival="305.00" arrivalLane="c2n_1" arrivalPos="990.00" arrivalPosLat="0.00" arrivalSpeed="16.35" duration="142.00" routeLength="1986.69" waitingTime="1.00" waitingCount="1" stopTime="0.00" timeLoss="19.50" rerouteNo="1" devices="tripinfo_car_e2n_163 routing_car_e2n_163" vType="Car" speedFactor="1.18" vaporized=""/>
    <tripinfo id="car_e2w_126" depart="126.00" departLane="e2sep_1" departPos="3.60" departPosLat="0.00" departSpeed="13.90" departDelay="0.00" arrival="307.00" arrivalLane="c2w_1" arrivalPos="990.00" arrivalPosLat="0.00" arrivalSpeed="14.11" duration="181.00" routeLength="1997.01" waitingTime="24.00" waitingCount="1" stopTime="0.00" timeLoss="38.90" rerouteNo="1" devices="tripinfo_car_e2w_126 routing_car_e2w_126" vType="Car" speedFactor="1.02" vaporized=""/>
    <tripinfo id="car_e2s_119" depart="119.00" departLane="e2sep_1" departPos="3.60" departPosLat="0.00" departSpeed="13.90" departDelay="0.00" arrival="310.00" arrivalLane="c2s_1" arrivalPos="990.00" arrivalPosLat="0.00" arrivalSpeed="13.90" duration="191.00" routeLength="1996.47" waitingTime="30.00" waitingCount="2" stopTime="0.00" timeLoss="45.82" rerouteNo="1" devices="tripinfo_car_e2s_119 routing_car_e2s_119" vType="Car" speedFactor="1.00" vaporized=""/>
    <tripinfo id="car_e2w_132" depart="132.00" departLane="e2sep_1" departPos="3.60" departPosLat="0.00" departSpeed="13.90" departDelay="0.00" arrival="311.00" arrivalLane="c2w_1" arrivalPos="990.00" arrivalPosLat="0.00" arrivalSpeed="13.89" duration="179.00" routeLength="1997.01" waitingTime="19.00" waitingCount="1" stopTime="0.00" timeLoss="34.73" rerouteNo="1" devices="tripinfo_car_e2w_132 routing_car_e2w_132" vType="Car" speedFactor="1.00" vaporized=""/>
    <tripinfo id="car_w2s_178" depart="178.00" departLane="w2sep_1" departPos="3.60" departPosLat="0.00" departSpeed="13.90" departDelay="0.00" arrival="312.00" arrivalLane="c2s_1" arrivalPos="990.00" arrivalPosLat="0.00" arrivalSpeed="15.59" duration="134.00" routeLength="1986.69" waitingTime="0.00" waitingCount="0" stopTime="0.00" timeLoss="10.58" rerouteNo="1" devices="tripinfo_car_w2s_178 routing_car_w2s_178" vType="Car" speedFactor="1.17" vaporized=""/>
    <tripinfo id="car_e2w_143" depart="143.00" departLane="e2sep_1" departPos="3.60" departPosLat="0.00" departSpeed="13.90" departDelay="0.00" arrival="313.00" arrivalLane="c2w_1" arrivalPos="990.00" arrivalPosLat="0.00" arrivalSpeed="15.17" duration="170.00" routeLength="1997.01" waitingTime="17.00" waitingCount="1" stopTime="0.00" timeLoss="42.44" rerouteNo="1" devices="tripinfo_car_e2w_143 routing_car_e2w_143" vType="Car" speedFactor="1.13" vaporized=""/>
    <tripinfo id="car_e2s_145" depart="145.00" departLane="e2sep_1" departPos="3.60" departPosLat="0.00" departSpeed="13.90" departDelay="0.00" arrival="316.00" arrivalLane="c2s_1" arrivalPos="990.00" arrivalPosLat="0.00" arrivalSpeed="15.03" duration="171.00" routeLength="1996.47" waitingTime="11.00" waitingCount="3" stopTime="0.00" timeLoss="36.87" rerouteNo="1" devices="tripinfo_car_e2s_145 routing_car_e2s_145" vType="Car" speedFactor="1.08" vaporized=""/>
    <tripinfo id="bus_w2n_117" depart="117.00" departLane="w2sep_1" departPos="12.10" departPosLat="0.00" departSpeed="13.90" departDelay="0.00" arrival="320.00" arrivalLane="c2n_1" arrivalPos="990.00" arrivalPosLat="0.00" arrivalSpeed="13.90" duration="203.00" routeLength="1987.97" waitingTime="39.00" waitingCount="2" stopTime="0.00" timeLoss="58.79" rerouteNo="1" devices="tripinfo_bus_w2n_117 routing_bus_w2n_117" vType="Bus" speedFactor="1.00" vaporized=""/>
    <tripinfo id="car_w2n_147" depart="147.00" departLane="w2sep_1" departPos="3.60" departPosLat="0.00" departSpeed="13.90" departDelay="0.00" arrival="323.00" arrivalLane="c2n_1" arrivalPos="990.00" arrivalPosLat="0.00" arrivalSpeed="15.34" duration="176.00" routeLength="1996.47" waitingTime="16.00" waitingCount="2" stopTime="0.00" timeLoss="46.10" rerouteNo="1" devices="tripinfo_car_w2n_147 routing_car_w2n_147" vType="Car" speedFactor="1.12" vaporized=""/>
    <tripinfo id="car_w2n_151" depart="151.00" departLane="w2sep_1" departPos="3.60" departPosLat="0.00" departSpeed="13.90" departDelay="0.00" arrival="326.00" arrivalLane="c2n_1" arrivalPos="990.00" arrivalPosLat="0.00" arrivalSpeed="14.09" duration="175.00" routeLength="1996.47" waitingTime="8.00" waitingCount="1" stopTime="0.00" timeLoss="32.81" rerouteNo="1" devices="tripinfo_car_w2n_151 routing_car_w2n_151" vType="Car" speedFactor="1.02" vaporized=""/>
    <tripinfo id="car_e2s_187" depart="187.00" departLane="e2sep_1" departPos="3.60" departPosLat="0.00" departSpeed="13.90" departDelay="0.00" arrival="333.00" arrivalLane="c2s_1" arrivalPos="990.00" arrivalPosLat="0.00" arrivalSpeed="14.21" duration="146.00" routeLength="1996.47" waitingTime="0.00" waitingCount="0" stopTime="0.00" timeLoss="4.21" rerouteNo="1" devices="tripinfo_car_e2s_187 routing_car_e2s_187" vType="Car" speedFactor="1.02" vaporized=""/>
    <tripinfo id="car_s2n_186" depart="186.00" departLane="s2sep_1" departPos="3.60" departPosLat="0.00" departSpeed="13.90" departDelay="0.00" arrival="342.00" arrivalLane="c2n_1" arrivalPos="990.00" arrivalPosLat="0.00" arrivalSpeed="14.46" duration="156.00" routeLength="1997.01" waitingTime="7.00" waitingCount="1" stopTime="0.00" timeLoss="17.49" rerouteNo="1" devices="tripinfo_car_s2n_186 routing_car_s2n_186" vType="Car" speedFactor="1.04" vaporized=""/>
    <tripinfo id="car_n2w_156" depart="156.00" departLane="n2sep_1" departPos="3.60" departPosLat="0.00" departSpeed="13.90" departDelay="0.00" arrival="344.00" arrivalLane="c2w_1" arrivalPos="990.00" arrivalPosLat="0.00" arrivalSpeed="13.90" duration="188.00" routeLength="1986.69" waitingTime="35.00" waitingCount="1" stopTime="0.00" timeLoss="44.52" rerouteNo="1" devices="tripinfo_car_n2w_156 routing_car_n2w_156" vType="Car" speedFactor="1.00" vaporized=""/>
    <tripinfo id="car_s2n_199" depart="199.00" departLane="s2sep_1" departPos="3.60" departPosLat="0.00" departSpeed="13.90" departDelay="0.00" arrival="348.00" arrivalLane="c2n_1" arrivalPos="990.00" arrivalPosLat="0.00" arrivalSpeed="13.90" duration="149.00" routeLength="1997.01" waitingTime="0.00" waitingCount="0" stopTime="0.00" timeLoss="5.03" rerouteNo="1" devices="tripinfo_car_s2n_199 routing_car_s2n_199" vType="Car" speedFactor="1.00" vaporized=""/>
    <tripinfo id="car_n2e_169" depart="169.00" departLane="n2sep_1" departPos="3.60" departPosLat="0.00" departSpeed="13.90" departDelay="0.00" arrival="349.00" arrivalLane="c2e_1" arrivalPos="990.00" arrivalPosLat="0.00" arrivalSpeed="13.97" duration="180.00" routeLength="1996.47" waitingTime="22.00" waitingCount="1" stopTime="0.00" timeLoss="35.50" rerouteNo="1" devices="tripinfo_car_n2e_169 routing_car_n2e_169" vType="Car" speedFactor="1.01" vaporized=""/>
    <tripinfo id="car_n2w_189" depart="189.00" departLane="n2sep_1" departPos="3.60" departPosLat="0.00" departSpeed="13.90" departDelay="0.00" arrival="349.00" arrivalLane="c2w_1" arrivalPos="990.00" arrivalPosLat="0.00" arrivalSpeed="13.90" duration="160.00" routeLength="1986.69" waitingTime="3.00" waitingCount="1" stopTime="0.00" timeLoss="15.94" rerouteNo="1" devices="tripinfo_car_n2w_189 routing_car_n2w_189" vType="Car" speedFactor="1.00" vaporized=""/>
    <tripinfo id="car_n2e_203" depart="203.00" departLane="n2sep_1" departPos="3.60" departPosLat="0.00" departSpeed="13.90" departDelay="0.00" arrival="351.00" arrivalLane="c2e_1" arrivalPos="990.00" arrivalPosLat="0.00" arrivalSpeed="14.98" duration="148.00" routeLength="1996.47" waitingTime="0.00" waitingCount="0" stopTime="0.00" timeLoss="16.38" rerouteNo="1" devices="tripinfo_car_n2e_203 routing_car_n2e_203" vType="Car" speedFactor="1.10" vaporized=""/>
    <tripinfo id="car_n2w_197" depart="197.00" departLane="n2sep_1" departPos="3.60" departPosLat="0.00" departSpeed="13.90" departDelay="0.00" arrival="352.00" arrivalLane="c2w_1" arrivalPos="990.00" arrivalPosLat="0.00" arrivalSpeed="14.57" duration="155.00" routeLength="1986.69" waitingTime="0.00" waitingCount="0" stopTime="0.00" timeLoss="18.12" rerouteNo="1" devices="tripinfo_car_n2w_197 routing_car_n2w_197" vType="Car" speedFactor="1.06" vaporized=""/>
    <tripinfo id="car_n2w_201" depart="201.00" departLane="n2sep_1" departPos="3.60" departPosLat="0.00" departSpeed="13.90" departDelay="0.00" arrival="353.00" arrivalLane="c2w_1" arrivalPos="990.00" arrivalPosLat="0.00" arrivalSpeed="15.03" duration="152.00" routeLength="1986.69" waitingTime="0.00" waitingCount="0" stopTime="0.00" timeLoss="30.31" rerouteNo="1" devices="tripinfo_car_n2w_201 routing_car_n2w_201" vType="Car" speedFactor="1.18" vaporized=""/>
    <tripinfo id="car_n2w_212" depart="212.00" departLane="n2sep_1" departPos="3.60" departPosLat="0.00" departSpeed="13.90" departDelay="0.00" arrival="358.00" arrivalLane="c2w_1" arrivalPos="990.00" arrivalPosLat="0.00" arrivalSpeed="14.37" duration="146.00" routeLength="1986.69" waitingTime="0.00" waitingCount="0" stopTime="0.00" timeLoss="6.44" rerouteNo="1" devices="tripinfo_car_n2w_212 routing_car_n2w_212" vType="Car" speedFactor="1.03" vaporized=""/>
    <tripinfo id="car_n2s_220" depart="221.00" departLane="n2sep_1" departPos="3.60" departPosLat="0.00" departSpeed="13.90" departDelay="1.00" arrival="361.00" arrivalLane="c2s_1" arrivalPos="990.00" arrivalPosLat="0.00" arrivalSpeed="15.95" duration="140.00" routeLength="1997.01" waitingTime="0.00" waitingCount="0" stopTime="0.00" timeLoss="13.87" rerouteNo="1" devices="tripinfo_car_n2s_220 routing_car_n2s_220" vType="Car" speedFactor="1.15" vaporized=""/>
    <tripinfo id="car_s2e_215" depart="215.00" departLane="s2sep_1" departPos="3.60" departPosLat="0.00" departSpeed="13.90" departDelay="0.00" arrival="364.00" arrivalLane="c2e_1" arrivalPos="990.00" arrivalPosLat="0.00" arrivalSpeed="13.90" duration="149.00" routeLength="1986.69" waitingTime="0.00" waitingCount="0" stopTime="0.00" timeLoss="5.37" rerouteNo="1" devices="tripinfo_car_s2e_215 routing_car_s2e_215" vType="Car" speedFactor="1.00" vaporized=""/>
    <tripinfo id="car_n2w_219" depart="219.00" departLane="n2sep_1" departPos="3.60" departPosLat="0.00" departSpeed="13.90" departDelay="0.00" arrival="366.00" arrivalLane="c2w_1" arrivalPos="990.00" arrivalPosLat="0.00" arrivalSpeed="14.32" duration="147.00" routeLength="1986.69" waitingTime="0.00" waitingCount="0" stopTime="0.00" timeLoss="6.61" rerouteNo="1" devices="tripinfo_car_n2w_219 routing_car_n2w_219" vType="Car" speedFactor="1.03" vaporized=""/>
    <tripinfo id="bus_n2e_217" depart="217.00" departLane="n2sep_1" departPos="12.10" departPosLat="0.00" departSpeed="13.90" departDelay="0.00" arrival="370.00" arrivalLane="c2e_1" arrivalPos="990.00" arrivalPosLat="0.00" arrivalSpeed="13.88" duration="153.00" routeLength="1987.97" waitingTime="0.00" waitingCount="0" stopTime="0.00" timeLoss="8.70" rerouteNo="1" devices="tripinfo_bus_n2e_217 routing_bus_n2e_217" vType="Bus" speedFactor="1.00" vaporized=""/>
    <tripinfo id="car_n2s_228" depart="228.00" departLane="n2sep_1" departPos="3.60" departPosLat="0.00" departSpeed="13.90" departDelay="0.00" arrival="373.00" arrivalLane="c2s_1" arrivalPos="990.00" arrivalPosLat="0.00" arrivalSpeed="13.92" duration="145.00" routeLength="1997.01" waitingTime="0.00" waitingCount="0" stopTime="0.00" timeLoss="1.25" rerouteNo="1" devices="tripinfo_car_n2s_228 routing_car_n2s_228" vType="Car" speedFactor="1.00" vaporized=""/>
    <tripinfo id="bus_s2w_177" depart="177.00" departLane="s2sep_1" departPos="12.10" departPosLat="0.00" departSpeed="13.90" departDelay="0.00" arrival="380.00" arrivalLane="c2w_1" arrivalPos="990.00" arrivalPosLat="0.00" arrivalSpeed="13.90" duration="203.00" routeLength="1987.97" waitingTime="40.00" waitingCount="2" stopTime="0.00" timeLoss="58.44" rerouteNo="1" devices="tripinfo_bus_s2w_177 routing_bus_s2w_177" vType="Bus" speedFactor="1.00" vaporized=""/>
    <tripinfo id="car_w2s_188" depart="188.00" departLane="w2sep_1" departPos="3.60" departPosLat="0.00" departSpeed="13.90" departDelay="0.00" arrival="388.00" arrivalLane="c2s_1" arrivalPos="990.00" arrivalPosLat="0.00" arrivalSpeed="14.22" duration="200.00" routeLength="1986.69" waitingTime="49.00" waitingCount="1" stopTime="0.00" timeLoss="59.25" rerouteNo="1" devices="tripinfo_car_w2s_188 routing_car_w2s_188" vType="Car" speedFactor="1.02" vaporized=""/>
    <tripinfo id="car_e2w_216" depart="216.00" departLane="e2sep_1" departPos="3.60" departPosLat="0.00" departSpeed="13.90" departDelay="0.00" arrival="389.00" arrivalLane="c2w_1" arrivalPos="990.00" arrivalPosLat="0.00" arrivalSpeed="14.13" duration="173.00" routeLength="1997.01" waitingTime="21.00" waitingCount="1" stopTime="0.00" timeLoss="31.08" rerouteNo="1" devices="tripinfo_car_e2w_216 routing_car_e2w_216" vType="Car" speedFactor="1.02" vaporized=""/>
    <tripinfo id="car_w2e_196" depart="196.00" departLane="w2sep_1" departPos="3.60" departPosLat="0.00" departSpeed="13.90" departDelay="0.00" arrival="390.00" arrivalLane="c2e_1" arrivalPos="990.00" arrivalPosLat="0.00" arrivalSpeed="14.17" duration="194.00" routeLength="1997.01" waitingTime="42.00" waitingCount="1" stopTime="0.00" timeLoss="53.10" rerouteNo="1" devices="tripinfo_car_w2e_196 routing_car_w2e_196" vType="Car" speedFactor="1.02" vaporized=""/>
    <tripinfo id="car_w2e_212" depart="212.00" departLane="w2sep_1" departPos="3.60" departPosLat="0.00" departSpeed="13.90" departDelay="0.00" arrival="393.00" arrivalLane="c2e_1" arrivalPos="990.00" arrivalPosLat="0.00" arrivalSpeed="15.00" duration="181.00" routeLength="1997.01" waitingTime="32.00" waitingCount="1" stopTime="0.00" timeLoss="48.40" rerouteNo="1" devices="tripinfo_car_w2e_212 routing_car_w2e_212" vType="Car" speedFactor="1.09" vaporized=""/>
    <tripinfo id="car_e2w_227" depart="227.00" departLane="e2sep_1" departPos="3.60" departPosLat="0.00" departSpeed="13.90" departDelay="0.00" arrival="394.00" arrivalLane="c2w_1" arrivalPos="990.00" arrivalPosLat="0.00" arrivalSpeed="13.90" duration="167.00" routeLength="1997.01" waitingTime="10.00" waitingCount="1" stopTime="0.00" timeLoss="22.67" rerouteNo="1" devices="tripinfo_car_e2w_227 routing_car_e2w_227" vType="Car" speedFactor="1.00" vaporized=""/>
    <tripinfo id="car_e2n_250" depart="250.00" departLane="e2sep_1" departPos="3.60" departPosLat="0.00" departSpeed="13.90" departDelay="0.00" arrival="396.00" arrivalLane="c2n_1" arrivalPos="990.00" arrivalPosLat="0.00" arrivalSpeed="14.50" duration="146.00" routeLength="1986.69" waitingTime="0.00" waitingCount="0" stopTime="0.00" timeLoss="8.26" rerouteNo="1" devices="tripinfo_car_e2n_250 routing_car_e2n_250" vType="Car" speedFactor="1.04" vaporized=""/>
    <tripinfo id="car_e2w_228" depart="229.00" departLane="e2sep_1" departPos="3.60" departPosLat="0.00" departSpeed="13.90" departDelay="1.00" arrival="397.00" arrivalLane="c2w_1" arrivalPos="990.00" arrivalPosLat="0.00" arrivalSpeed="14.41" duration="168.00" routeLength="1997.01" waitingTime="9.00" waitingCount="1" stopTime="0.00" timeLoss="29.31" rerouteNo="1" devices="tripinfo_car_e2w_228 routing_car_e2w_228" vType="Car" speedFactor="1.04" vaporized=""/>
    <tripinfo id="car_e2s_259" depart="259.00" departLane="e2sep_1" departPos="3.60" departPosLat="0.00" departSpeed="13.90" departDelay="0.00" arrival="397.00" arrivalLane="c2s_1" arrivalPos="990.00" arrivalPosLat="0.00" arrivalSpeed="15.25" duration="138.00" routeLength="1996.47" waitingTime="0.00" waitingCount="0" stopTime="0.00" timeLoss="5.57" rerouteNo="1" devices="tripinfo_car_e2s_259 routing_car_e2s_259" vType="Car" speedFactor="1.10" vaporized=""/>
    <tripinfo id="car_w2e_255" depart="255.00" departLane="w2sep_1" departPos="3.60" departPosLat="0.00" departSpeed="13.90" departDelay="0.00" arrival="399.00" arrivalLane="c2e_1" arrivalPos="990.00" arrivalPosLat="0.00" arrivalSpeed="14.04" duration="144.00" routeLength="1997.01" waitingTime="0.00" waitingCount="0" stopTime="0.00" timeLoss="1.45" rerouteNo="1" devices="tripinfo_car_w2e_255 routing_car_w2e_255" vType="Car" speedFactor="1.01" vaporized=""/>
    <tripinfo id="car_e2w_236" depart="236.00" departLane="e2sep_1" departPos="3.60" departPosLat="0.00" departSpeed="13.90" departDelay="0.00" arrival="400.00" arrivalLane="c2w_1" arrivalPos="990.00" arrivalPosLat="0.00" arrivalSpeed="14.15" duration="164.00" routeLength="1997.01" waitingTime="5.00" waitingCount="1" stopTime="0.00" timeLoss="22.54" rerouteNo="1" devices="tripinfo_car_e2w_236 routing_car_e2w_236" vType="Car" speedFactor="1.02" vaporized=""/>
    <tripinfo id="car_e2w_253" depart="253.00" departLane="e2sep_1" departPos="3.60" departPosLat="0.00" departSpeed="13.90" departDelay="0.00" arrival="402.00" arrivalLane="c2w_1" arrivalPos="990.00" arrivalPosLat="0.00" arrivalSpeed="14.79" duration="149.00" routeLength="1997.01" waitingTime="0.00" waitingCount="0" stopTime="0.00" timeLoss="16.61" rerouteNo="1" devices="tripinfo_car_e2w_253 routing_car_e2w_253" vType="Car" speedFactor="1.09" vaporized=""/>
    <tripinfo id="car_w2n_203" depart="203.00" departLane="w2sep_1" departPos="3.60" departPosLat="0.00" departSpeed="13.90" departDelay="0.00" arrival="403.00" arrivalLane="c2n_1" arrivalPos="990.00" arrivalPosLat="0.00" arrivalSpeed="14.35" duration="200.00" routeLength="1996.47" waitingTime="43.00" waitingCount="2" stopTime="0.00" timeLoss="59.34" rerouteNo="1" devices="tripinfo_car_w2n_203 routing_car_w2n_203" vType="Car" speedFactor="1.03" vaporized=""/>
    <tripinfo id="car_w2s_266" depart="266.00" departLane="w2sep_1" departPos="3.60" departPosLat="0.00" departSpeed="13.90" departDelay="0.00" arrival="407.00" arrivalLane="c2s_1" arrivalPos="990.00" arrivalPosLat="0.00" arrivalSpeed="14.91" duration="141.00" routeLength="1986.69" waitingTime="0.00" waitingCount="0" stopTime="0.00" timeLoss="6.27" rerouteNo="1" devices="tripinfo_car_w2s_266 routing_car_w2s_266" vType="Car" speedFactor="1.07" vaporized=""/>
    <tripinfo id="car_e2w_263" depart="263.00" departLane="e2sep_1" departPos="3.60" departPosLat="0.00" departSpeed="13.90" departDelay="0.00" arrival="408.00" arrivalLane="c2w_1" arrivalPos="990.00" arrivalPosLat="0.00" arrivalSpeed="13.90" duration="145.00" routeLength="1997.01" waitingTime="0.00" waitingCount="0" stopTime="0.00" timeLoss="1.17" rerouteNo="1" devices="tripinfo_car_e2w_263 routing_car_e2w_263" vType="Car" speedFactor="1.00" vaporized=""/>
    <tripinfo id="car_w2n_205" depart="205.00" departLane="w2sep_1" departPos="3.60" departPosLat="0.00" departSpeed="13.90" departDelay="0.00" arrival="411.00" arrivalLane="c2n_1" arrivalPos="990.00" arrivalPosLat="0.00" arrivalSpeed="14.00" duration="206.00" routeLength="1996.47" waitingTime="38.00" waitingCount="2" stopTime="0.00" timeLoss="62.09" rerouteNo="1" devices="tripinfo_car_w2n_205 routing_car_w2n_205" vType="Car" speedFactor="1.01" vaporized=""/>
    <tripinfo id="car_e2w_273" depart="273.00" departLane="e2sep_1" departPos="3.60" departPosLat="0.00" departSpeed="13.90" departDelay="0.00" arrival="411.00" arrivalLane="c2w_1" arrivalPos="990.00" arrivalPosLat="0.00" arrivalSpeed="14.73" duration="138.00" routeLength="1997.01" waitingTime="0.00" waitingCount="0" stopTime="0.00" timeLoss="2.96" rerouteNo="1" devices="tripinfo_car_e2w_273 routing_car_e2w_273" vType="Car" speedFactor="1.06" vaporized=""/>
    <tripinfo id="car_w2n_247" depart="247.00" departLane="w2sep_1" departPos="3.60" departPosLat="0.00" departSpeed="13.90" departDelay="0.00" arrival="413.00" arrivalLane="c2n_1" arrivalPos="990.00" arrivalPosLat="0.00" arrivalSpeed="14.91" duration="166.00" routeLength="1996.47" waitingTime="7.00" waitingCount="1" stopTime="0.00" timeLoss="33.71" rerouteNo="1" devices="tripinfo_car_w2n_247 routing_car_w2n_247" vType="Car" speedFactor="1.09" vaporized=""/>
    <tripinfo id="car_w2n_249" depart="249.00" departLane="w2sep_1" departPos="3.60" departPosLat="0.00" departSpeed="13.90" departDelay="0.00" arrival="418.00" arrivalLane="c2n_1" arrivalPos="990.00" arrivalPosLat="0.00" arrivalSpeed="14.42" duration="169.00" routeLength="1996.47" waitingTime="6.00" waitingCount="1" stopTime="0.00" timeLoss="29.14" rerouteNo="1" devices="tripinfo_car_w2n_249 routing_car_w2n_249" vType="Car" speedFactor="1.04" vaporized=""/>
    <tripinfo id="bus_w2n_263" depart="263.00" departLane="w2sep_1" departPos="12.10" departPosLat="0.00" departSpeed="13.90" departDelay="0.00" arrival="424.00" arrivalLane="c2n_1" arrivalPos="990.00" arrivalPosLat="0.00" arrivalSpeed="13.89" duration="161.00" routeLength="1987.97" waitingTime="0.00" waitingCount="0" stopTime="0.00" timeLoss="17.28" rerouteNo="1" devices="tripinfo_bus_w2n_263 routing_bus_w2n_263" vType="Bus" speedFactor="1.00" vaporized=""/>
    <tripinfo id="car_w2n_282" depart="282.00" departLane="w2sep_1" departPos="3.60" departPosLat="0.00" departSpeed="13.90" departDelay="0.00" arrival="427.00" arrivalLane="c2n_1" arrivalPos="990.00" arrivalPosLat="0.00" arrivalSpeed="15.87" duration="145.00" routeLength="1996.47" waitingTime="0.00" waitingCount="0" stopTime="0.00" timeLoss="20.86" rerouteNo="1" devices="tripinfo_car_w2n_282 routing_car_w2n_282" vType="Car" speedFactor="1.17" vaporized=""/>
    <tripinfo id="car_n2w_254" depart="254.00" departLane="n2sep_1" departPos="3.60" departPosLat="0.00" departSpeed="13.90" departDelay="0.00" arrival="431.00" arrivalLane="c2w_1" arrivalPos="990.00" arrivalPosLat="0.00" arrivalSpeed="14.69" duration="177.00" routeLength="1986.69" waitingTime="30.00" waitingCount="1" stopTime="0.00" timeLoss="40.52" rerouteNo="1" devices="tripinfo_car_n2w_254 routing_car_n2w_254" vType="Car" speedFactor="1.06" vaporized=""/>
    <tripinfo id="car_s2e_229" depart="229.00" departLane="s2sep_1" departPos="3.60" departPosLat="0.00" departSpeed="13.90" departDelay="0.00" arrival="434.00" arrivalLane="c2e_1" arrivalPos="990.00" arrivalPosLat="0.00" arrivalSpeed="14.00" duration="205.00" routeLength="1986.69" waitingTime="54.00" waitingCount="1" stopTime="0.00" timeLoss="62.03" rerouteNo="1" devices="tripinfo_car_s2e_229 routing_car_s2e_229" vType="Car" speedFactor="1.01" vaporized=""/>
    <tripinfo id="car_s2e_259" depart="259.00" departLane="s2sep_1" departPos="3.60" departPosLat="0.00" departSpeed="13.90" departDelay="0.00" arrival="437.00" arrivalLane="c2e_1" arrivalPos="990.00" arrivalPosLat="0.00" arrivalSpeed="14.72" duration="178.00" routeLength="1986.69" waitingTime="27.00" waitingCount="1" stopTime="0.00" timeLoss="42.40" rerouteNo="1" devices="tripinfo_car_s2e_259 routing_car_s2e_259" vType="Car" speedFactor="1.07" vaporized=""/>
    <tripinfo id="car_n2w_264" depart="264.00" departLane="n2sep_1" departPos="3.60" departPosLat="0.00" departSpeed="13.90" departDelay="0.00" arrival="438.00" arrivalLane="c2w_1" arrivalPos="990.00" arrivalPosLat="0.00" arrivalSpeed="13.90" duration="174.00" routeLength="1986.69" waitingTime="18.00" waitingCount="1" stopTime="0.00" timeLoss="30.01" rerouteNo="1" devices="tripinfo_car_n2w_264 routing_car_n2w_264" vType="Car" speedFactor="1.00" vaporized=""/>
    <tripinfo id="car_s2n_268" depart="268.00" departLane="s2sep_1" departPos="3.60" departPosLat="0.00" departSpeed="13.90" departDelay="0.00" arrival="441.00" arrivalLane="c2n_1" arrivalPos="990.00" arrivalPosLat="0.00" arrivalSpeed="14.09" duration="173.00" routeLength="1997.01" waitingTime="18.00" waitingCount="1" stopTime="0.00" timeLoss="31.25" rerouteNo="1" devices="tripinfo_car_s2n_268 routing_car_s2n_268" vType="Car" speedFactor="1.01" vaporized=""/>
    <tripinfo id="car_n2w_269" depart="269.00" departLane="n2sep_1" departPos="3.60" departPosLat="0.00" departSpeed="13.90" departDelay="0.00" arrival="441.00" arrivalLane="c2w_1" arrivalPos="990.00" arrivalPosLat="0.00" arrivalSpeed="14.32" duration="172.00" routeLength="1986.69" waitingTime="16.00" waitingCount="1" stopTime="0.00" timeLoss="32.99" rerouteNo="1" devices="tripinfo_car_n2w_269 routing_car_n2w_269" vType="Car" speedFactor="1.03" vaporized=""/>
    <tripinfo id="car_s2e_262" depart="262.00" departLane="s2sep_1" departPos="3.60" departPosLat="0.00" departSpeed="13.90" departDelay="0.00" arrival="442.00" arrivalLane="c2e_1" arrivalPos="990.00" arrivalPosLat="0.00" arrivalSpeed="13.90" duration="180.00" routeLength="1986.69" waitingTime="21.00" waitingCount="1" stopTime="0.00" timeLoss="35.75" rerouteNo="1" devices="tripinfo_car_s2e_262 routing_car_s2e_262" vType="Car" speedFactor="1.00" vaporized=""/>
    <tripinfo id="car_n2s_288" depart="288.00" departLane="n2sep_1" departPos="3.60" departPosLat="0.00" departSpeed="13.90" departDelay="0.00" arrival="442.00" arrivalLane="c2s_1" arrivalPos="990.00" arrivalPosLat="0.00" arrivalSpeed="14.03" duration="154.00" routeLength="1997.01" waitingTime="0.00" waitingCount="0" stopTime="0.00" timeLoss="10.82" rerouteNo="1" devices="tripinfo_car_n2s_288 routing_car_n2s_288" vType="Car" speedFactor="1.01" vaporized=""/>
    <tripinfo id="car_s2n_295" depart="295.00" departLane="s2sep_1" departPos="3.60" departPosLat="0.00" departSpeed="13.90" departDelay="0.00" arrival="443.00" arrivalLane="c2n_1" arrivalPos="990.00" arrivalPosLat="0.00" arrivalSpeed="15.68" duration="148.00" routeLength="1997.01" waitingTime="1.00" waitingCount="1" stopTime="0.00" timeLoss="25.74" rerouteNo="1" devices="tripinfo_car_s2n_295 routing_car_s2n_295" vType="Car" speedFactor="1.18" vaporized=""/>
    <tripinfo id="car_n2s_297" depart="297.00" departLane="n2sep_1" departPos="3.60" departPosLat="0.00" departSpeed="13.90" departDelay="0.00" arrival="446.00" arrivalLane="c2s_1" arrivalPos="990.00" arrivalPosLat="0.00" arrivalSpeed="13.95" duration="149.00" routeLength="1997.01" waitingTime="0.00" waitingCount="0" stopTime="0.00" timeLoss="5.71" rerouteNo="1" devices="tripinfo_car_n2s_297 routing_car_n2s_297" vType="Car" speedFactor="1.00" vaporized=""/>
    <tripinfo id="car_n2e_241" depart="241.00" departLane="n2sep_1" departPos="3.60" departPosLat="0.00" departSpeed="13.90" departDelay="0.00" arrival="447.00" arrivalLane="c2e_1" arrivalPos="990.00" arrivalPosLat="0.00" arrivalSpeed="14.13" duration="206.00" routeLength="1996.47" waitingTime="47.00" waitingCount="2" stopTime="0.00" timeLoss="63.37" rerouteNo="1" devices="tripinfo_car_n2e_241 routing_car_n2e_241" vType="Car" speedFactor="1.02" vaporized=""/>
    <tripinfo id="car_s2w_274" depart="274.00" departLane="s2sep_1" departPos="3.60" departPosLat="0.00" departSpeed="13.90" departDelay="0.00" arrival="448.00" arrivalLane="c2w_1" arrivalPos="990.00" arrivalPosLat="0.00" arrivalSpeed="13.90" duration="174.00" routeLength="1996.47" waitingTime="13.00" waitingCount="2" stopTime="0.00" timeLoss="28.86" rerouteNo="1" devices="tripinfo_car_s2w_274 routing_car_s2w_274" vType="Car" speedFactor="1.00" vaporized=""/>
    <tripinfo id="car_n2e_256" depart="256.00" departLane="n2sep_1" departPos="3.60" departPosLat="0.00" departSpeed="13.90" departDelay="0.00" arrival="449.00" arrivalLane="c2e_1" arrivalPos="990.00" arrivalPosLat="0.00" arrivalSpeed="14.84" duration="193.00" routeLength="1996.47" waitingTime="36.00" waitingCount="2" stopTime="0.00" timeLoss="60.15" rerouteNo="1" devices="tripinfo_car_n2e_256 routing_car_n2e_256" vType="Car" speedFactor="1.09" vaporized=""/>
    <tripinfo id="car_s2w_286" depart="286.00" departLane="s2sep_1" departPos="3.60" departPosLat="0.00" departSpeed="13.90" departDelay="0.00" arrival="450.00" arrivalLane="c2w_1" arrivalPos="990.00" arrivalPosLat="0.00" arrivalSpeed="14.90" duration="164.00" routeLength="1996.47" waitingTime="7.00" waitingCount="2" stopTime="0.00" timeLoss="32.09" rerouteNo="1" devices="tripinfo_car_s2w_286 routing_car_s2w_286" vType="Car" speedFactor="1.10" vaporized=""/>
    <tripinfo id="car_n2e_258" depart="258.00" departLane="n2sep_1" departPos="3.60" departPosLat="0.00" departSpeed="13.90" departDelay="0.00" arrival="451.00" arrivalLane="c2e_1" arrivalPos="990.00" arrivalPosLat="0.00" arrivalSpeed="15.21" duration="193.00" routeLength="1996.47" waitingTime="35.00" waitingCount="2" stopTime="0.00" timeLoss="64.25" rerouteNo="1" devices="tripinfo_car_n2e_258 routing_car_n2e_258" vType="Car" speedFactor="1.12" vaporized=""/>
    <tripinfo id="car_s2n_310" depart="310.00" departLane="s2sep_1" departPos="3.60" departPosLat="0.00" departSpeed="13.90" departDelay="0.00" arrival="451.00" arrivalLane="c2n_1" arrivalPos="990.00" arrivalPosLat="0.00" arrivalSpeed="14.34" duration="141.00" routeLength="1997.01" waitingTime="0.00" waitingCount="0" stopTime="0.00" timeLoss="0.99" rerouteNo="1" devices="tripinfo_car_s2n_310 routing_car_s2n_310" vType="Car" speedFactor="1.03" vaporized=""/>
    <tripinfo id="car_s2n_312" depart="316.00" departLane="s2sep_1" departPos="3.60" departPosLat="0.00" departSpeed="13.90" departDelay="4.00" arrival="458.00" arrivalLane="c2n_1" arrivalPos="990.00" arrivalPosLat="0.00" arrivalSpeed="14.35" duration="142.00" routeLength="1997.01" waitingTime="0.00" waitingCount="0" stopTime="0.00" timeLoss="1.88" rerouteNo="1" devices="tripinfo_car_s2n_312 routing_car_s2n_312" vType="Car" speedFactor="1.03" vaporized=""/>
    <tripinfo id="car_s2w_311" depart="312.00" departLane="s2sep_1" departPos="3.60" departPosLat="0.00" departSpeed="13.90" departDelay="1.00" arrival="459.00" arrivalLane="c2w_1" arrivalPos="990.00" arrivalPosLat="0.00" arrivalSpeed="14.23" duration="147.00" routeLength="1996.47" waitingTime="0.00" waitingCount="0" stopTime="0.00" timeLoss="5.72" rerouteNo="1" devices="tripinfo_car_s2w_311 routing_car_s2w_311" vType="Car" speedFactor="1.02" vaporized=""/>
    <tripinfo id="car_s2w_312" depart="314.00" departLane="s2sep_1" departPos="3.60" departPosLat="0.00" departSpeed="13.90" departDelay="2.00" arrival="461.00" arrivalLane="c2w_1" arrivalPos="990.00" arrivalPosLat="0.00" arrivalSpeed="15.51" duration="147.00" routeLength="1996.47" waitingTime="0.00" waitingCount="0" stopTime="0.00" timeLoss="21.52" rerouteNo="1" devices="tripinfo_car_s2w_312 routing_car_s2w_312" vType="Car" speedFactor="1.15" vaporized=""/>
    <tripinfo id="car_n2e_265" depart="266.00" departLane="n2sep_1" departPos="3.60" departPosLat="0.00" departSpeed="13.90" departDelay="1.00" arrival="462.00" arrivalLane="c2e_1" arrivalPos="990.00" arrivalPosLat="0.00" arrivalSpeed="13.90" duration="196.00" routeLength="1996.47" waitingTime="23.00" waitingCount="2" stopTime="0.00" timeLoss="51.40" rerouteNo="1" devices="tripinfo_car_n2e_265 routing_car_n2e_265" vType="Car" speedFactor="1.00" vaporized=""/>
    <tripinfo id="car_n2e_284" depart="284.00" departLane="n2sep_1" departPos="3.60" departPosLat="0.00" departSpeed="13.90" departDelay="0.00" arrival="466.00" arrivalLane="c2e_1" arrivalPos="990.00" arrivalPosLat="0.00" arrivalSpeed="14.12" duration="182.00" routeLength="1996.47" waitingTime="7.00" waitingCount="2" stopTime="0.00" timeLoss="39.59" rerouteNo="1" devices="tripinfo_car_n2e_284 routing_car_n2e_284" vType="Car" speedFactor="1.02" vaporized=""/>
    <tripinfo id="car_n2e_308" depart="308.00" departLane="n2sep_1" departPos="3.60" departPosLat="0.00" departSpeed="13.90" departDelay="0.00" arrival="470.00" arrivalLane="c2e_1" arrivalPos="990.00" arrivalPosLat="0.00" arrivalSpeed="13.89" duration="162.00" routeLength="1996.47" waitingTime="0.00" waitingCount="0" stopTime="0.00" timeLoss="16.91" rerouteNo="1" devices="tripinfo_car_n2e_308 routing_car_n2e_308" vType="Car" speedFactor="1.00" vaporized=""/>
    <tripinfo id="car_n2e_320" depart="320.00" departLane="n2sep_1" departPos="3.60" departPosLat="0.00" departSpeed="13.90" departDelay="0.00" arrival="473.00" arrivalLane="c2e_1" arrivalPos="990.00" arrivalPosLat="0.00" arrivalSpeed="13.97" duration="153.00" routeLength="1996.47" waitingTime="0.00" waitingCount="0" stopTime="0.00" timeLoss="9.15" rerouteNo="1" devices="tripinfo_car_n2e_320 routing_car_n2e_320" vType="Car" speedFactor="1.01" vaporized=""/>
    <tripinfo id="car_w2s_308" depart="308.00" departLane="w2sep_1" departPos="3.60" departPosLat="0.00" departSpeed="13.90" departDelay="0.00" arrival="475.00" arrivalLane="c2s_1" arrivalPos="990.00" arrivalPosLat="0.00" arrivalSpeed="14.89" duration="167.00" routeLength="1986.69" waitingTime="22.00" waitingCount="1" stopTime="0.00" timeLoss="32.42" rerouteNo="1" devices="tripinfo_car_w2s_308 routing_car_w2s_308" vType="Car" speedFactor="1.07" vaporized=""/>
    <tripinfo id="car_n2e_332" depart="332.00" departLane="n2sep_1" departPos="3.60" departPosLat="0.00" departSpeed="13.90" departDelay="0.00" arrival="475.00" arrivalLane="c2e_1" arrivalPos="990.00" arrivalPosLat="0.00" arrivalSpeed="14.54" duration="143.00" routeLength="1996.47" waitingTime="0.00" waitingCount="0" stopTime="0.00" timeLoss="7.57" rerouteNo="1" devices="tripinfo_car_n2e_332 routing_car_n2e_332" vType="Car" speedFactor="1.07" vaporized=""/>
    <tripinfo id="car_w2s_312" depart="312.00" departLane="w2sep_1" departPos="3.60" departPosLat="0.00" departSpeed="13.90" departDelay="0.00" arrival="480.00" arrivalLane="c2s_1" arrivalPos="990.00" arrivalPosLat="0.00" arrivalSpeed="14.74" duration="168.00" routeLength="1986.69" waitingTime="18.00" waitingCount="1" stopTime="0.00" timeLoss="31.87" rerouteNo="1" devices="tripinfo_car_w2s_312 routing_car_w2s_312" vType="Car" speedFactor="1.06" vaporized=""/>
    <tripinfo id="car_w2n_291" depart="291.00" departLane="w2sep_1" departPos="3.60" departPosLat="0.00" departSpeed="13.90" departDelay="0.00" arrival="481.00" arrivalLane="c2n_1" arrivalPos="990.00" arrivalPosLat="0.00" arrivalSpeed="15.24" duration="190.00" routeLength="1996.47" waitingTime="42.00" waitingCount="2" stopTime="0.00" timeLoss="57.89" rerouteNo="1" devices="tripinfo_car_w2n_291 routing_car_w2n_291" vType="Car" speedFactor="1.10" vaporized=""/>
    <tripinfo id="car_w2e_336" depart="336.00" departLane="w2sep_1" departPos="3.60" departPosLat="0.00" departSpeed="13.90" departDelay="0.00" arrival="482.00" arrivalLane="c2e_1" arrivalPos="990.00" arrivalPosLat="0.00" arrivalSpeed="15.88" duration="146.00" routeLength="1997.01" waitingTime="4.00" waitingCount="1" stopTime="0.00" timeLoss="19.80" rerouteNo="1" devices="tripinfo_car_w2e_336 routing_car_w2e_336" vType="Car" speedFactor="1.14" vaporized=""/>
    <tripinfo id="bus_e2w_337" depart="337.00" departLane="e2sep_1" departPos="12.10" departPosLat="0.00" departSpeed="13.90" departDelay="0.00" arrival="482.00" arrivalLane="c2w_1" arrivalPos="990.00" arrivalPosLat="0.00" arrivalSpeed="13.90" duration="145.00" routeLength="1988.51" waitingTime="0.00" waitingCount="0" stopTime="0.00" timeLoss="1.03" rerouteNo="1" devices="tripinfo_bus_e2w_337 routing_bus_e2w_337" vType="Bus" speedFactor="1.00" vaporized=""/>
    <tripinfo id="car_e2w_346" depart="346.00" departLane="e2sep_1" departPos="3.60" departPosLat="0.00" departSpeed="13.90" departDelay="0.00" arrival="484.00" arrivalLane="c2w_1" arrivalPos="990.00" arrivalPosLat="0.00" arrivalSpeed="15.11" duration="138.00" routeLength="1997.01" waitingTime="0.00" waitingCount="0" stopTime="0.00" timeLoss="9.46" rerouteNo="1" devices="tripinfo_car_e2w_346 routing_car_e2w_346" vType="Car" speedFactor="1.12" vaporized=""/>
    <tripinfo id="car_w2s_317" depart="317.00" departLane="w2sep_1" departPos="3.60" departPosLat="0.00" departSpeed="13.90" departDelay="0.00" arrival="486.00" arrivalLane="c2s_1" arrivalPos="990.00" arrivalPosLat="0.00" arrivalSpeed="13.90" duration="169.00" routeLength="1986.69" waitingTime="11.00" waitingCount="1" stopTime="0.00" timeLoss="25.29" rerouteNo="1" devices="tripinfo_car_w2s_317 routing_car_w2s_317" vType="Car" speedFactor="1.00" vaporized=""/>
    <tripinfo id="car_w2s_325" depart="325.00" departLane="w2sep_1" departPos="3.60" departPosLat="0.00" departSpeed="13.90" departDelay="0.00" arrival="489.00" arrivalLane="c2s_1" arrivalPos="990.00" arrivalPosLat="0.00" arrivalSpeed="14.29" duration="164.00" routeLength="1986.69" waitingTime="7.00" waitingCount="1" stopTime="0.00" timeLoss="24.93" rerouteNo="1" devices="tripinfo_car_w2s_325 routing_car_w2s_325" vType="Car" speedFactor="1.03" vaporized=""/>
    <tripinfo id="car_w2n_300" depart="300.00" departLane="w2sep_1" departPos="3.60" departPosLat="0.00" departSpeed="13.90" departDelay="0.00" arrival="490.00" arrivalLane="c2n_1" arrivalPos="990.00" arrivalPosLat="0.00" arrivalSpeed="13.94" duration="190.00" routeLength="1996.47" waitingTime="27.00" waitingCount="1" stopTime="0.00" timeLoss="45.50" rerouteNo="1" devices="tripinfo_car_w2n_300 routing_car_w2n_300" vType="Car" speedFactor="1.00" vaporized=""/>
    <tripinfo id="car_w2s_337" depart="338.00" departLane="w2sep_1" departPos="3.60" departPosLat="0.00" departSpeed="13.90" departDelay="1.00" arrival="493.00" arrivalLane="c2s_1" arrivalPos="990.00" arrivalPosLat="0.00" arrivalSpeed="14.40" duration="155.00" routeLength="1986.69" waitingTime="0.00" waitingCount="0" stopTime="0.00" timeLoss="15.87" rerouteNo="1" devices="tripinfo_car_w2s_337 routing_car_w2s_337" vType="Car" speedFactor="1.04" vaporized=""/>
    <tripinfo id="bus_w2s_339" depart="341.00" departLane="w2sep_1" departPos="12.10" departPosLat="0.00" departSpeed="13.90" departDelay="2.00" arrival="499.00" arrivalLane="c2s_1" arrivalPos="990.00" arrivalPosLat="0.00" arrivalSpeed="13.89" duration="158.00" routeLength="1978.19" waitingTime="0.00" waitingCount="0" stopTime="0.00" timeLoss="14.65" rerouteNo="1" devices="tripinfo_bus_w2s_339 routing_bus_w2s_339" vType="Bus" speedFactor="1.00" vaporized=""/>
    <tripinfo id="car_w2s_342" depart="343.00" departLane="w2sep_1" departPos="3.60" departPosLat="0.00" departSpeed="13.90" departDelay="1.00" arrival="501.00" arrivalLane="c2s_1" arrivalPos="990.00" arrivalPosLat="0.00" arrivalSpeed="15.96" duration="158.00" routeLength="1986.69" waitingTime="0.00" waitingCount="0" stopTime="0.00" timeLoss="40.48" rerouteNo="1" devices="tripinfo_car_w2s_342 routing_car_w2s_342" vType="Car" speedFactor="1.23" vaporized=""/>
    <tripinfo id="car_w2s_346" depart="346.00" departLane="w2sep_1" departPos="3.60" departPosLat="0.00" departSpeed="13.90" departDelay="0.00" arrival="505.00" arrivalLane="c2s_1" arrivalPos="990.00" arrivalPosLat="0.00" arrivalSpeed="14.05" duration="159.00" routeLength="1986.69" waitingTime="0.00" waitingCount="0" stopTime="0.00" timeLoss="16.79" rerouteNo="1" devices="tripinfo_car_w2s_346 routing_car_w2s_346" vType="Car" speedFactor="1.01" vaporized=""/>
    <tripinfo id="car_w2s_350" depart="350.00" departLane="w2sep_1" departPos="3.60" departPosLat="0.00" departSpeed="13.90" departDelay="0.00" arrival="509.00" arrivalLane="c2s_1" arrivalPos="990.00" arrivalPosLat="0.00" arrivalSpeed="14.09" duration="159.00" routeLength="1986.69" waitingTime="0.00" waitingCount="0" stopTime="0.00" timeLoss="16.80" rerouteNo="1" devices="tripinfo_car_w2s_350 routing_car_w2s_350" vType="Car" speedFactor="1.02" vaporized=""/>
    <tripinfo id="car_w2e_351" depart="352.00" departLane="w2sep_1" departPos="3.60" departPosLat="0.00" departSpeed="13.90" departDelay="1.00" arrival="509.00" arrivalLane="c2e_1" arrivalPos="990.00" arrivalPosLat="0.00" arrivalSpeed="13.95" duration="157.00" routeLength="1997.01" waitingTime="0.00" waitingCount="0" stopTime="0.00" timeLoss="13.58" rerouteNo="1" devices="tripinfo_car_w2e_351 routing_car_w2e_351" vType="Car" speedFactor="1.00" vaporized=""/>
    <tripinfo id="car_e2s_292" depart="292.00" departLane="e2sep_1" departPos="3.60" departPosLat="0.00" departSpeed="13.90" departDelay="0.00" arrival="511.00" arrivalLane="c2s_1" arrivalPos="990.00" arrivalPosLat="0.00" arrivalSpeed="14.86" duration="219.00" routeLength="1996.47" waitingTime="64.00" waitingCount="2" stopTime="0.00" timeLoss="86.95" rerouteNo="1" devices="tripinfo_car_e2s_292 routing_car_e2s_292" vType="Car" speedFactor="1.10" vaporized=""/>
    <tripinfo id="car_w2e_352" depart="354.00" departLane="w2sep_1" departPos="3.60" departPosLat="0.00" departSpeed="13.90" departDelay="2.00" arrival="513.00" arrivalLane="c2e_1" arrivalPos="990.00" arrivalPosLat="1.00" arrivalSpeed="14.21" duration="159.00" routeLength="1997.01" waitingTime="0.00" waitingCount="0" stopTime="0.00" timeLoss="18.13" rerouteNo="1" devices="tripinfo_car_w2e_352 routing_car_w2e_352" vType="Car" speedFactor="1.02" vaporized=""/>
    <tripinfo id="car_w2e_356" depart="359.00" departLane="w2sep_1" departPos="3.60" departPosLat="0.00" departSpeed="13.90" departDelay="3.00" arrival="515.00" arrivalLane="c2e_1" arrivalPos="990.00" arrivalPosLat="1.00" arrivalSpeed="15.17" duration="156.00" routeLength="1997.01" waitingTime="0.00" waitingCount="0" stopTime="0.00" timeLoss="26.91" rerouteNo="1" devices="tripinfo_car_w2e_356 routing_car_w2e_356" vType="Car" speedFactor="1.11" vaporized=""/>
    <tripinfo id="bus_w2s_352" depart="357.00" departLane="w2sep_1" departPos="12.10" departPosLat="0.00" departSpeed="13.90" departDelay="5.00" arrival="517.00" arrivalLane="c2s_1" arrivalPos="990.00" arrivalPosLat="0.00" arrivalSpeed="13.88" duration="160.00" routeLength="1978.19" waitingTime="0.00" waitingCount="0" stopTime="0.00" timeLoss="15.93" rerouteNo="1" devices="tripinfo_bus_w2s_352 routing_bus_w2s_352" vType="Bus" speedFactor="1.00" vaporized=""/>
    <tripinfo id="amb_w2e_390" depart="390.00" departLane="w2sep_1" departPos="6.60" departPosLat="0.00" departSpeed="13.90" departDelay="0.00" arrival="517.00" arrivalLane="c2e_1" arrivalPos="990.00" arrivalPosLat="0.00" arrivalSpeed="17.85" duration="127.00" routeLength="1994.01" waitingTime="0.00" waitingCount="0" stopTime="0.00" timeLoss="30.79" rerouteNo="1" devices="tripinfo_amb_w2e_390 routing_amb_w2e_390 bluelight_amb_w2e_390" vType="Ambulance" speedFactor="1.50" vaporized="">
        <bluelight/>
    </tripinfo>
    <tripinfo id="car_e2s_308" depart="308.00" departLane="e2sep_1" departPos="3.60" departPosLat="0.00" departSpeed="13.90" departDelay="0.00" arrival="519.00" arrivalLane="c2s_1" arrivalPos="990.00" arrivalPosLat="0.00" arrivalSpeed="14.93" duration="211.00" routeLength="1996.47" waitingTime="50.00" waitingCount="3" stopTime="0.00" timeLoss="79.94" rerouteNo="1" devices="tripinfo_car_e2s_308 routing_car_e2s_308" vType="Car" speedFactor="1.10" vaporized=""/>
    <tripinfo id="car_w2s_359" depart="361.00" departLane="w2sep_1" departPos="3.60" departPosLat="0.00" departSpeed="13.90" departDelay="2.00" arrival="521.00" arrivalLane="c2s_1" arrivalPos="990.00" arrivalPosLat="0.00" arrivalSpeed="15.53" duration="160.00" routeLength="1986.69" waitingTime="0.00" waitingCount="0" stopTime="0.00" timeLoss="36.55" rerouteNo="1" devices="tripinfo_car_w2s_359 routing_car_w2s_359" vType="Car" speedFactor="1.16" vaporized=""/>
    <tripinfo id="car_w2s_365" depart="365.00" departLane="w2sep_1" departPos="3.60" departPosLat="0.00" departSpeed="13.90" departDelay="0.00" arrival="524.00" arrivalLane="c2s_1" arrivalPos="990.00" arrivalPosLat="0.00" arrivalSpeed="14.92" duration="159.00" routeLength="1986.69" waitingTime="0.00" waitingCount="0" stopTime="0.00" timeLoss="25.62" rerouteNo="1" devices="tripinfo_car_w2s_365 routing_car_w2s_365" vType="Car" speedFactor="1.08" vaporized=""/>
    <tripinfo id="car_e2s_318" depart="318.00" departLane="e2sep_1" departPos="3.60" departPosLat="0.00" departSpeed="13.90" departDelay="0.00" arrival="527.00" arrivalLane="c2s_1" arrivalPos="990.00" arrivalPosLat="0.00" arrivalSpeed="15.49" duration="209.00" routeLength="1996.47" waitingTime="57.00" waitingCount="3" stopTime="0.00" timeLoss="79.73" rerouteNo="1" devices="tripinfo_car_e2s_318 routing_car_e2s_318" vType="Car" speedFactor="1.12" vaporized=""/>
    <tripinfo id="car_e2w_361" depart="361.00" departLane="e2sep_1" departPos="3.60" departPosLat="0.00" departSpeed="13.90" departDelay="0.00" arrival="532.00" arrivalLane="c2w_1" arrivalPos="990.00" arrivalPosLat="0.00" arrivalSpeed="13.90" duration="171.00" routeLength="1997.01" waitingTime="18.00" waitingCount="1" stopTime="0.00" timeLoss="26.57" rerouteNo="1" devices="tripinfo_car_e2w_361 routing_car_e2w_361" vType="Car" speedFactor="1.00" vaporized=""/>
    <tripinfo id="car_e2w_370" depart="370.00" departLane="e2sep_1" departPos="3.60" departPosLat="0.00" departSpeed="13.90" departDelay="0.00" arrival="534.00" arrivalLane="c2w_1" arrivalPos="990.00" arrivalPosLat="0.00" arrivalSpeed="15.30" duration="164.00" routeLength="1997.01" waitingTime="16.00" waitingCount="1" stopTime="0.00" timeLoss="37.33" rerouteNo="1" devices="tripinfo_car_e2w_370 routing_car_e2w_370" vType="Car" speedFactor="1.14" vaporized=""/>
    <tripinfo id="car_w2n_387" depart="387.00" departLane="w2sep_1" departPos="3.60" departPosLat="0.00" departSpeed="13.90" departDelay="0.00" arrival="537.00" arrivalLane="c2n_1" arrivalPos="990.00" arrivalPosLat="0.00" arrivalSpeed="13.90" duration="150.00" routeLength="1996.47" waitingTime="0.00" waitingCount="0" stopTime="0.00" timeLoss="4.77" rerouteNo="1" devices="tripinfo_car_w2n_387 routing_car_w2n_387" vType="Car" speedFactor="1.00" vaporized=""/>
    <tripinfo id="bus_e2s_371" depart="372.00" departLane="e2sep_1" departPos="12.10" departPosLat="0.00" departSpeed="13.90" departDelay="1.00" arrival="540.00" arrivalLane="c2s_1" arrivalPos="990.00" arrivalPosLat="0.00" arrivalSpeed="13.90" duration="168.00" routeLength="1987.97" waitingTime="8.00" waitingCount="1" stopTime="0.00" timeLoss="23.94" rerouteNo="1" devices="tripinfo_bus_e2s_371 routing_bus_e2s_371" vType="Bus" speedFactor="1.00" vaporized=""/>
    <tripinfo id="car_s2n_371" depart="371.00" departLane="s2sep_1" departPos="3.60" departPosLat="0.00" departSpeed="13.90" departDelay="0.00" arrival="542.00" arrivalLane="c2n_1" arrivalPos="990.00" arrivalPosLat="0.00" arrivalSpeed="15.55" duration="171.00" routeLength="1997.01" waitingTime="31.00" waitingCount="1" stopTime="0.00" timeLoss="42.02" rerouteNo="1" devices="tripinfo_car_s2n_371 routing_car_s2n_371" vType="Car" speedFactor="1.12" vaporized=""/>
    <tripinfo id="car_e2s_385" depart="385.00" departLane="e2sep_1" departPos="3.60" departPosLat="0.00" departSpeed="13.90" departDelay="0.00" arrival="545.00" arrivalLane="c2s_1" arrivalPos="990.00" arrivalPosLat="0.00" arrivalSpeed="13.96" duration="160.00" routeLength="1996.47" waitingTime="0.00" waitingCount="0" stopTime="0.00" timeLoss="15.44" rerouteNo="1" devices="tripinfo_car_e2s_385 routing_car_e2s_385" vType="Car" speedFactor="1.00" vaporized=""/>
    <tripinfo id="car_e2s_396" depart="396.00" departLane="e2sep_1" departPos="3.60" departPosLat="0.00" departSpeed="13.90" departDelay="0.00" arrival="547.00" arrivalLane="c2s_1" arrivalPos="990.00" arrivalPosLat="0.00" arrivalSpeed="14.68" duration="151.00" routeLength="1996.47" waitingTime="0.00" waitingCount="0" stopTime="0.00" timeLoss="16.75" rerouteNo="1" devices="tripinfo_car_e2s_396 routing_car_e2s_396" vType="Car" speedFactor="1.08" vaporized=""/>
    <tripinfo id="car_s2e_385" depart="385.00" departLane="s2sep_1" departPos="3.60" departPosLat="0.00" departSpeed="13.90" departDelay="0.00" arrival="550.00" arrivalLane="c2e_1" arrivalPos="990.00" arrivalPosLat="0.00" arrivalSpeed="14.89" duration="165.00" routeLength="1986.69" waitingTime="17.00" waitingCount="1" stopTime="0.00" timeLoss="29.93" rerouteNo="1" devices="tripinfo_car_s2e_385 routing_car_s2e_385" vType="Car" speedFactor="1.07" vaporized=""/>
    <tripinfo id="car_s2n_372" depart="373.00" departLane="s2sep_1" departPos="3.60" departPosLat="0.00" departSpeed="13.90" departDelay="1.00" arrival="551.00" arrivalLane="c2n_1" arrivalPos="990.00" arrivalPosLat="0.00" arrivalSpeed="13.93" duration="178.00" routeLength="1997.01" waitingTime="23.00" waitingCount="1" stopTime="0.00" timeLoss="34.57" rerouteNo="1" devices="tripinfo_car_s2n_372 routing_car_s2n_372" vType="Car" speedFactor="1.00" vaporized=""/>
    <tripinfo id="bus_n2s_326" depart="326.00" departLane="n2sep_1" departPos="12.10" departPosLat="0.00" departSpeed="13.90" departDelay="0.00" arrival="553.00" arrivalLane="c2s_1" arrivalPos="990.00" arrivalPosLat="0.00" arrivalSpeed="13.88" duration="227.00" routeLength="1988.51" waitingTime="70.00" waitingCount="1" stopTime="0.00" timeLoss="83.38" rerouteNo="1" devices="tripinfo_bus_n2s_326 routing_bus_n2s_326" vType="Bus" speedFactor="1.00" vaporized=""/>
    <tripinfo id="car_s2e_400" depart="400.00" departLane="s2sep_1" departPos="3.60" departPosLat="0.00" departSpeed="13.90" departDelay="0.00" arrival="553.00" arrivalLane="c2e_1" arrivalPos="990.00" arrivalPosLat="0.00" arrivalSpeed="15.78" duration="153.00" routeLength="1986.69" waitingTime="1.00" waitingCount="1" stopTime="0.00" timeLoss="26.43" rerouteNo="1" devices="tripinfo_car_s2e_400 routing_car_s2e_400" vType="Car" speedFactor="1.14" vaporized=""/>
    <tripinfo id="car_n2s_362" depart="362.00" departLane="n2sep_1" departPos="3.60" departPosLat="0.00" departSpeed="13.90" departDelay="0.00" arrival="555.00" arrivalLane="c2s_1" arrivalPos="990.00" arrivalPosLat="0.00" arrivalSpeed="15.17" duration="193.00" routeLength="1997.01" waitingTime="42.00" waitingCount="1" stopTime="0.00" timeLoss="65.75" rerouteNo="1" devices="tripinfo_car_n2s_362 routing_car_n2s_362" vType="Car" speedFactor="1.13" vaporized=""/>
    <tripinfo id="car_n2w_380" depart="380.00" departLane="n2sep_1" departPos="3.60" departPosLat="0.00" departSpeed="13.90" departDelay="0.00" arrival="556.00" arrivalLane="c2w_1" arrivalPos="990.00" arrivalPosLat="0.00" arrivalSpeed="14.45" duration="176.00" routeLength="1986.69" waitingTime="22.00" waitingCount="1" stopTime="0.00" timeLoss="37.03" rerouteNo="1" devices="tripinfo_car_n2w_380 routing_car_n2w_380" vType="Car" speedFactor="1.04" vaporized=""/>
    <tripinfo id="car_s2n_398" depart="398.00" departLane="s2sep_1" departPos="3.60" departPosLat="0.00" departSpeed="13.90" departDelay="0.00" arrival="557.00" arrivalLane="c2n_1" arrivalPos="990.00" arrivalPosLat="0.00" arrivalSpeed="13.90" duration="159.00" routeLength="1997.01" waitingTime="1.00" waitingCount="1" stopTime="0.00" timeLoss="15.04" rerouteNo="1" devices="tripinfo_car_s2n_398 routing_car_s2n_398" vType="Car" speedFactor="1.00" vaporized=""/>
    <tripinfo id="car_n2s_374" depart="374.00" departLane="n2sep_1" departPos="3.60" departPosLat="0.00" departSpeed="13.90" departDelay="0.00" arrival="559.00" arrivalLane="c2s_1" arrivalPos="990.00" arrivalPosLat="0.00" arrivalSpeed="14.10" duration="185.00" routeLength="1997.01" waitingTime="25.00" waitingCount="1" stopTime="0.00" timeLoss="43.08" rerouteNo="1" devices="tripinfo_car_n2s_374 routing_car_n2s_374" vType="Car" speedFactor="1.02" vaporized=""/>
    <tripinfo id="car_n2w_382" depart="382.00" departLane="n2sep_1" departPos="3.60" departPosLat="0.00" departSpeed="13.90" departDelay="0.00" arrival="562.00" arrivalLane="c2w_1" arrivalPos="990.00" arrivalPosLat="0.00" arrivalSpeed="13.90" duration="180.00" routeLength="1986.69" waitingTime="18.00" waitingCount="1" stopTime="0.00" timeLoss="36.23" rerouteNo="1" devices="tripinfo_car_n2w_382 routing_car_n2w_382" vType="Car" speedFactor="1.00" vaporized=""/>
    <tripinfo id="car_n2s_391" depart="391.00" departLane="n2sep_1" departPos="3.60" departPosLat="0.00" departSpeed="13.90" departDelay="0.00" arrival="562.00" arrivalLane="c2s_1" arrivalPos="990.00" arrivalPosLat="0.00" arrivalSpeed="14.70" duration="171.00" routeLength="1997.01" waitingTime="15.00" waitingCount="1" stopTime="0.00" timeLoss="35.27" rerouteNo="1" devices="tripinfo_car_n2s_391 routing_car_n2s_391" vType="Car" speedFactor="1.06" vaporized=""/>
    <tripinfo id="bus_n2e_366" depart="366.00" departLane="n2sep_1" departPos="12.10" departPosLat="0.00" departSpeed="13.90" departDelay="0.00" arrival="566.00" arrivalLane="c2e_1" arrivalPos="990.00" arrivalPosLat="0.00" arrivalSpeed="13.90" duration="200.00" routeLength="1987.97" waitingTime="37.00" waitingCount="2" stopTime="0.00" timeLoss="55.52" rerouteNo="1" devices="tripinfo_bus_n2e_366 routing_bus_n2e_366" vType="Bus" speedFactor="1.00" vaporized=""/>
    <tripinfo id="car_n2e_416" depart="416.00" departLane="n2sep_1" departPos="3.60" departPosLat="0.00" departSpeed="13.90" departDelay="0.00" arrival="569.00" arrivalLane="c2e_1" arrivalPos="990.00" arrivalPosLat="0.00" arrivalSpeed="14.39" duration="153.00" routeLength="1996.47" waitingTime="0.00" waitingCount="0" stopTime="0.00" timeLoss="14.06" rerouteNo="1" devices="tripinfo_car_n2e_416 routing_car_n2e_416" vType="Car" speedFactor="1.04" vaporized=""/>
    <tripinfo id="car_n2e_418" depart="418.00" departLane="n2sep_1" departPos="3.60" departPosLat="0.00" departSpeed="13.90" departDelay="0.00" arrival="571.00" arrivalLane="c2e_1" arrivalPos="990.00" arrivalPosLat="0.00" arrivalSpeed="15.20" duration="153.00" routeLength="1996.47" waitingTime="0.00" waitingCount="0" stopTime="0.00" timeLoss="24.79" rerouteNo="1" devices="tripinfo_car_n2e_418 routing_car_n2e_418" vType="Car" speedFactor="1.13" vaporized=""/>
</tripinfos>
