<?xml version="1.0" encoding="UTF-8"?>

<!-- generated on Sat Apr 24 18:04:57 2021 by Eclipse SUMO Version 1.4.0
<configuration xmlns:xsi="http://www.w3.org/2001/XMLSchema-instance" xsi:noNamespaceSchemaLocation="http://sumo.dlr.de/xsd/sumoConfiguration.xsd">

    <input>
        <net-file value="sumofiles/junction.net.xml"/>
        <route-files value="sumofiles/junction_preemption_107.rou.xml"/>
        <additional-files value="sumofiles/junction.det.xml"/>
    </input>

    <output>
        <tripinfo-output value="sumofiles/output/tripinfo_preemption_107.xml"/>
    </output>

    <time>
        <begin value="0"/>
        <end value="10000"/>
        <step-length value="0.05"/>
    </time>

    <processing>
        <lateral-resolution value="0.1"/>
    </processing>

    <report>
        <no-warnings value="true"/>
        <error-log value="sumofiles/output/errorlog_preemption_107.log"/>
        <no-step-log value="true"/>
    </report>

    <traci_server>
        <remote-port value="57485"/>
    </traci_server>

    <gui_only>
        <gui-settings-file value="sumofiles/junction-gui.settings.xml"/>
        <tracker-interval value="0.05"/>
    </gui_only>

</configuration>
-->

<tripinfos xmlns:xsi="http://www.w3.org/2001/XMLSchema-instance" xsi:noNamespaceSchemaLocation="http://sumo.dlr.de/xsd/tripinfo_file.xsd">
    <tripinfo id="car_e2s_2" depart="2.00" departLane="e2sep_1" departPos="3.60" departPosLat="0.00" departSpeed="13.90" departDelay="0.00" arrival="141.70" arrivalLane="c2s_1" arrivalPos="990.00" arrivalPosLat="0.00" arrivalSpeed="14.73" duration="139.70" routeLength="1996.47" waitingTime="0.00" waitingCount="0" stopTime="0.00" timeLoss="3.53" rerouteNo="1" devices="tripinfo_car_e2s_2 routing_car_e2s_2" vType="Car" speedFactor="1.06" vaporized=""/>
    <tripinfo id="car_s2e_10" depart="10.00" departLane="s2sep_1" departPos="3.60" departPosLat="0.00" departSpeed="13.90" departDelay="0.00" arrival="160.30" arrivalLane="c2e_1" arrivalPos="990.00" arrivalPosLat="0.00" arrivalSpeed="15.05" duration="150.30" routeLength="1986.69" waitingTime="8.95" waitingCount="1" stopTime="0.00" timeLoss="17.61" rerouteNo="1" devices="tripinfo_car_s2e_10 routing_car_s2e_10" vType="Car" speedFactor="1.08" vaporized=""/>
    <tripinfo id="car_n2w_5" depart="5.00" departLane="n2sep_1" departPos="3.60" departPosLat="0.00" departSpeed="13.90" departDelay="0.00" arrival="161.70" arrivalLane="c2w_1" arrivalPos="990.00" arrivalPosLat="0.00" arrivalSpeed="14.73" duration="156.70" routeLength="1986.69" waitingTime="13.75" waitingCount="1" stopTime="0.00" timeLoss="21.14" rerouteNo="1" devices="tripinfo_car_n2w_5 routing_car_n2w_5" vType="Car" speedFactor="1.06" vaporized=""/>
    <tripinfo id="car_s2e_21" depart="21.00" departLane="s2sep_1" departPos="3.60" departPosLat="0.00" departSpeed="13.90" departDelay="0.00" arrival="164.65" arrivalLane="c2e_1" arrivalPos="990.00" arrivalPosLat="0.00" arrivalSpeed="15.04" duration="143.65" routeLength="1986.69" waitingTime="0.00" waitingCount="0" stopTime="0.00" timeLoss="10.96" rerouteNo="1" devices="tripinfo_car_s2e_21 routing_car_s2e_21" vType="Car" speedFactor="1.08" vaporized=""/>
    <tripinfo id="car_n2w_9" depart="9.00" departLane="n2sep_1" departPos="3.60" departPosLat="0.00" departSpeed="13.90" departDelay="0.00" arrival="168.50" arrivalLane="c2w_1" arrivalPos="990.00" arrivalPosLat="0.00" arrivalSpeed="14.04" duration="159.50" routeLength="1986.69" waitingTime="7.15" waitingCount="1" stopTime="0.00" timeLoss="17.31" rerouteNo="1" devices="tripinfo_car_n2w_9 routing_car_n2w_9" vType="Car" speedFactor="1.01" vaporized=""/>
    <tripinfo id="car_n2e_11" depart="11.00" departLane="n2sep_1" departPos="3.60" departPosLat="0.00" departSpeed="13.90" departDelay="0.00" arrival="170.15" arrivalLane="c2e_1" arrivalPos="990.00" arrivalPosLat="0.00" arrivalSpeed="14.32" duration="159.15" routeLength="1996.47" waitingTime="3.05" waitingCount="2" stopTime="0.00" timeLoss="19.08" rerouteNo="1" devices="tripinfo_car_n2e_11 routing_car_n2e_11" vType="Car" speedFactor="1.03" vaporized=""/>
    <tripinfo id="car_n2e_28" depart="28.00" departLane="n2sep_1" departPos="3.60" departPosLat="0.00" departSpeed="13.90" departDelay="0.00" arrival="172.70" arrivalLane="c2e_1" arrivalPos="990.00" arrivalPosLat="0.00" arrivalSpeed="14.98" duration="144.70" routeLength="1996.47" waitingTime="0.00" waitingCount="0" stopTime="0.00" timeLoss="12.38" rerouteNo="1" devices="tripinfo_car_n2e_28 routing_car_n2e_28" vType="Car" speedFactor="1.09" vaporized=""/>
    <tripinfo id="bus_s2w_3" depart="3.00" departLane="s2sep_1" departPos="12.10" departPosLat="0.00" departSpeed="13.90" departDelay="0.00" arrival="174.00" arrivalLane="c2w_1" arrivalPos="990.00" arrivalPosLat="0.00" arrivalSpeed="13.88" duration="171.00" routeLength="1987.97" waitingTime="12.30" waitingCount="1" stopTime="0.00" timeLoss="27.26" rerouteNo="1" devices="tripinfo_bus_s2w_3 routing_bus_s2w_3" vType="Bus" speedFactor="1.00" vaporized=""/>
    <tripinfo id="car_s2w_34" depart="34.00" departLane="s2sep_1" departPos="3.60" departPosLat="0.00" departSpeed="13.90" departDelay="0.00" arrival="176.55" arrivalLane="c2w_1" arrivalPos="990.00" arrivalPosLat="0.00" arrivalSpeed="15.23" duration="142.55" routeLength="1996.47" waitingTime="0.00" waitingCount="0" stopTime="0.00" timeLoss="14.03" rerouteNo="1" devices="tripinfo_car_s2w_34 routing_car_s2w_34" vType="Car" speedFactor="1.12" vaporized=""/>
    <tripinfo id="bus_s2e_44" depart="44.00" departLane="s2sep_1" departPos="12.10" departPosLat="0.00" departSpeed="13.90" departDelay="0.00" arrival="192.65" arrivalLane="c2e_1" arrivalPos="990.00" arrivalPosLat="0.00" arrivalSpeed="13.90" duration="148.65" routeLength="1978.19" waitingTime="0.00" waitingCount="0" stopTime="0.00" timeLoss="5.59" rerouteNo="1" devices="tripinfo_bus_s2e_44 routing_bus_s2e_44" vType="Bus" speedFactor="1.00" vaporized=""/>
    <tripinfo id="bus_n2s_48" depart="48.90" departLane="n2sep_1" departPos="12.10" departPosLat="0.00" departSpeed="13.90" departDelay="0.90" arrival="193.70" arrivalLane="c2s_1" arrivalPos="990.00" arrivalPosLat="0.00" arrivalSpeed="13.90" duration="144.80" routeLength="1988.51" waitingTime="0.00" waitingCount="0" stopTime="0.00" timeLoss="1.70" rerouteNo="1" devices="tripinfo_bus_n2s_48 routing_bus_n2s_48" vType="Bus" speedFactor="1.00" vaporized=""/>
    <tripinfo id="car_s2n_49" depart="49.00" departLane="s2sep_1" departPos="3.60" departPosLat="0.00" departSpeed="13.90" departDelay="0.00" arrival="194.30" arrivalLane="c2n_1" arrivalPos="990.00" arrivalPosLat="0.00" arrivalSpeed="13.90" duration="145.30" routeLength="1997.01" waitingTime="0.00" waitingCount="0" stopTime="0.00" timeLoss="1.62" rerouteNo="1" devices="tripinfo_car_s2n_49 routing_car_s2n_49" vType="Car" speedFactor="1.00" vaporized=""/>
    <tripinfo id="car_s2n_58" depart="58.00" departLane="s2sep_1" departPos="3.60" departPosLat="0.00" departSpeed="13.90" departDelay="0.00" arrival="196.20" arrivalLane="c2n_1" arrivalPos="990.00" arrivalPosLat="0.00" arrivalSpeed="15.36" duration="138.20" routeLength="1997.01" waitingTime="0.00" waitingCount="0" stopTime="0.00" timeLoss="14.15" rerouteNo="1" devices="tripinfo_car_s2n_58 routing_car_s2n_58" vType="Car" speedFactor="1.16" vaporized=""/>
    <tripinfo id="car_n2e_47" depart="47.00" departLane="n2sep_1" departPos="3.60" departPosLat="0.00" departSpeed="13.90" departDelay="0.00" arrival="197.50" arrivalLane="c2e_1" arrivalPos="990.00" arrivalPosLat="0.00" arrivalSpeed="14.53" duration="150.50" routeLength="1996.47" waitingTime="4.50" waitingCount="1" stopTime="0.00" timeLoss="12.51" rerouteNo="1" devices="tripinfo_car_n2e_47 routing_car_n2e_47" vType="Car" speedFactor="1.05" vaporized=""/>
    <tripinfo id="car_w2s_30" depart="30.00" departLane="w2sep_1" departPos="3.60" departPosLat="0.00" departSpeed="13.90" departDelay="0.00" arrival="208.90" arrivalLane="c2s_1" arrivalPos="990.00" arrivalPosLat="0.00" arrivalSpeed="14.27" duration="178.90" routeLength="1986.69" waitingTime="30.40" waitingCount="1" stopTime="0.00" timeLoss="38.93" rerouteNo="1" devices="tripinfo_car_w2s_30 routing_car_w2s_30" vType="Car" speedFactor="1.03" vaporized=""/>
    <tripinfo id="car_e2n_15" depart="15.00" departLane="e2sep_1" departPos="3.60" departPosLat="0.00" departSpeed="13.90" departDelay="0.00" arrival="210.70" arrivalLane="c2n_1" arrivalPos="990.00" arrivalPosLat="0.00" arrivalSpeed="13.90" duration="195.70" routeLength="1986.69" waitingTime="45.15" waitingCount="1" stopTime="0.00" timeLoss="52.04" rerouteNo="1" devices="tripinfo_car_e2n_15 routing_car_e2n_15" vType="Car" speedFactor="1.00" vaporized=""/>
    <tripinfo id="car_w2s_61" depart="61.00" departLane="w2sep_1" departPos="3.60" departPosLat="0.00" departSpeed="13.90" departDelay="0.00" arrival="213.70" arrivalLane="c2s_1" arrivalPos="990.00" arrivalPosLat="0.00" arrivalSpeed="14.15" duration="152.70" routeLength="1986.69" waitingTime="1.05" waitingCount="1" stopTime="0.00" timeLoss="11.59" rerouteNo="1" devices="tripinfo_car_w2s_61 routing_car_w2s_61" vType="Car" speedFactor="1.02" vaporized=""/>
    <tripinfo id="car_e2n_21" depart="21.00" departLane="e2sep_1" departPos="3.60" departPosLat="0.00" departSpeed="13.90" departDelay="0.00" arrival="214.75" arrivalLane="c2n_1" arrivalPos="990.00" arrivalPosLat="0.00" arrivalSpeed="14.03" duration="193.75" routeLength="1986.69" waitingTime="39.10" waitingCount="1" stopTime="0.00" timeLoss="51.58" rerouteNo="1" devices="tripinfo_car_e2n_21 routing_car_e2n_21" vType="Car" speedFactor="1.01" vaporized=""/>
    <tripinfo id="car_e2s_15" depart="16.45" departLane="e2sep_1" departPos="3.60" departPosLat="0.00" departSpeed="13.90" departDelay="1.45" arrival="216.70" arrivalLane="c2s_1" arrivalPos="990.00" arrivalPosLat="0.00" arrivalSpeed="14.46" duration="200.25" routeLength="1996.47" waitingTime="42.70" waitingCount="2" stopTime="0.00" timeLoss="62.24" rerouteNo="1" devices="tripinfo_car_e2s_15 routing_car_e2s_15" vType="Car" speedFactor="1.05" vaporized=""/>
    <tripinfo id="car_e2w_48" depart="48.00" departLane="e2sep_1" departPos="3.60" departPosLat="0.00" departSpeed="13.90" departDelay="0.00" arrival="217.45" arrivalLane="c2w_1" arrivalPos="990.00" arrivalPosLat="0.00" arrivalSpeed="13.90" duration="169.45" routeLength="1997.01" waitingTime="14.95" waitingCount="1" stopTime="0.00" timeLoss="25.79" rerouteNo="1" devices="tripinfo_car_e2w_48 routing_car_e2w_48" vType="Car" speedFactor="1.00" vaporized=""/>
    <tripinfo id="car_e2n_42" depart="42.00" departLane="e2sep_1" departPos="3.60" departPosLat="0.00" departSpeed="13.90" departDelay="0.00" arrival="218.60" arrivalLane="c2n_1" arrivalPos="990.00" arrivalPosLat="0.00" arrivalSpeed="13.88" duration="176.60" routeLength="1986.69" waitingTime="19.95" waitingCount="1" stopTime="0.00" timeLoss="32.92" rerouteNo="1" devices="tripinfo_car_e2n_42 routing_car_e2n_42" vType="Car" speedFactor="1.00" vaporized=""/>
    <tripinfo id="car_e2s_31" depart="31.00" departLane="e2sep_1" departPos="3.60" departPosLat="0.00" departSpeed="13.90" departDelay="0.00" arrival="219.55" arrivalLane="c2s_1" arrivalPos="990.00" arrivalPosLat="0.00" arrivalSpeed="14.46" duration="188.55" routeLength="1996.47" waitingTime="32.60" waitingCount="1" stopTime="0.00" timeLoss="50.72" rerouteNo="1" devices="tripinfo_car_e2s_31 routing_car_e2s_31" vType="Car" speedFactor="1.05" vaporized=""/>
    <tripinfo id="car_e2n_54" depart="54.00" departLane="e2sep_1" departPos="3.60" departPosLat="0.00" departSpeed="13.90" departDelay="0.00" arrival="222.25" arrivalLane="c2n_1" arrivalPos="990.00" arrivalPosLat="0.00" arrivalSpeed="13.87" duration="168.25" routeLength="1986.69" waitingTime="10.20" waitingCount="1" stopTime="0.00" timeLoss="24.57" rerouteNo="1" devices="tripinfo_car_e2n_54 routing_car_e2n_54" vType="Car" speedFactor="1.00" vaporized=""/>
    <tripinfo id="car_e2w_66" depart="66.30" departLane="e2sep_1" departPos="3.60" departPosLat="0.00" departSpeed="13.90" departDelay="0.30" arrival="223.00" arrivalLane="c2w_1" arrivalPos="990.00" arrivalPosLat="0.00" arrivalSpeed="14.26" duration="156.70" routeLength="1997.01" waitingTime="1.15" waitingCount="1" stopTime="0.00" timeLoss="16.70" rerouteNo="1" devices="tripinfo_car_e2w_66 routing_car_e2w_66" vType="Car" speedFactor="1.03" vaporized=""/>
    <tripinfo id="car_e2n_65" depart="65.00" departLane="e2sep_1" departPos="3.60" departPosLat="0.00" departSpeed="13.90" departDelay="0.00" arrival="224.35" arrivalLane="c2n_1" arrivalPos="990.00" arrivalPosLat="0.00" arrivalSpeed="14.75" duration="159.35" routeLength="1986.69" waitingTime="6.15" waitingCount="1" stopTime="0.00" timeLoss="27.62" rerouteNo="1" devices="tripinfo_car_e2n_65 routing_car_e2n_65" vType="Car" speedFactor="1.09" vaporized=""/>
    <tripinfo id="car_e2n_81" depart="81.00" departLane="e2sep_1" departPos="3.60" departPosLat="0.00" departSpeed="13.90" departDelay="0.00" arrival="226.35" arrivalLane="c2n_1" arrivalPos="990.00" arrivalPosLat="0.00" arrivalSpeed="15.08" duration="145.35" routeLength="1986.69" waitingTime="0.00" waitingCount="0" stopTime="0.00" timeLoss="17.39" rerouteNo="1" devices="tripinfo_car_e2n_81 routing_car_e2n_81" vType="Car" speedFactor="1.12" vaporized=""/>
    <tripinfo id="car_e2w_102" depart="102.00" departLane="e2sep_1" departPos="3.60" departPosLat="0.00" departSpeed="13.90" departDelay="0.00" arrival="227.55" arrivalLane="c2w_1" arrivalPos="990.00" arrivalPosLat="0.00" arrivalSpeed="16.03" duration="125.55" routeLength="1997.01" waitingTime="0.00" waitingCount="0" stopTime="0.00" timeLoss="1.08" rerouteNo="1" devices="tripinfo_car_e2w_102 routing_car_e2w_102" vType="Car" speedFactor="1.15" vaporized=""/>
    <tripinfo id="car_w2n_27" depart="27.00" departLane="w2sep_1" departPos="3.60" departPosLat="0.00" departSpeed="13.90" departDelay="0.00" arrival="229.65" arrivalLane="c2n_1" arrivalPos="990.00" arrivalPosLat="0.00" arrivalSpeed="14.28" duration="202.65" routeLength="1996.47" waitingTime="49.65" waitingCount="2" stopTime="0.00" timeLoss="62.56" rerouteNo="1" devices="tripinfo_car_w2n_27 routing_car_w2n_27" vType="Car" speedFactor="1.03" vaporized=""/>
    <tripinfo id="car_n2s_91" depart="91.30" departLane="n2sep_1" departPos="3.60" departPosLat="0.00" departSpeed="13.90" departDelay="0.30" arrival="249.70" arrivalLane="c2s_1" arrivalPos="990.00" arrivalPosLat="0.00" arrivalSpeed="15.73" duration="158.40" routeLength="1997.01" waitingTime="12.25" waitingCount="1" stopTime="0.00" timeLoss="31.44" rerouteNo="1" devices="tripinfo_car_n2s_91 routing_car_n2s_91" vType="Car" speedFactor="1.13" vaporized=""/>
    <tripinfo id="car_n2w_80" depart="80.00" departLane="n2sep_1" departPos="3.60" departPosLat="0.00" departSpeed="13.90" departDelay="0.00" arrival="252.50" arrivalLane="c2w_1" arrivalPos="990.00" arrivalPosLat="0.00" arrivalSpeed="14.55" duration="172.50" routeLength="1986.69" waitingTime="28.00" waitingCount="1" stopTime="0.00" timeLoss="35.30" rerouteNo="1" devices="tripinfo_car_n2w_80 routing_car_n2w_80" vType="Car" speedFactor="1.05" vaporized=""/>
    <tripinfo id="car_n2s_102" depart="102.00" departLane="n2sep_1" departPos="3.60" departPosLat="0.00" departSpeed="13.90" departDelay="0.00" arrival="252.65" arrivalLane="c2s_1" arrivalPos="990.00" arrivalPosLat="0.00" arrivalSpeed="16.27" duration="150.65" routeLength="1997.01" waitingTime="11.45" waitingCount="1" stopTime="0.00" timeLoss="28.74" rerouteNo="1" devices="tripinfo_car_n2s_102 routing_car_n2s_102" vType="Car" speedFactor="1.18" vaporized=""/>
    <tripinfo id="bus_s2n_79" depart="79.00" departLane="s2sep_1" departPos="12.10" departPosLat="0.00" departSpeed="13.90" departDelay="0.00" arrival="259.20" arrivalLane="c2n_1" arrivalPos="990.00" arrivalPosLat="0.00" arrivalSpeed="13.90" duration="180.20" routeLength="1988.51" waitingTime="26.30" waitingCount="1" stopTime="0.00" timeLoss="37.13" rerouteNo="1" devices="tripinfo_bus_s2n_79 routing_bus_s2n_79" vType="Bus" speedFactor="1.00" vaporized=""/>
    <tripinfo id="car_n2w_124" depart="124.00" departLane="n2sep_1" departPos="3.60" departPosLat="0.00" departSpeed="13.90" departDelay="0.00" arrival="260.40" arrivalLane="c2w_1" arrivalPos="990.00" arrivalPosLat="0.00" arrivalSpeed="15.18" duration="136.40" routeLength="1986.69" waitingTime="0.00" waitingCount="0" stopTime="0.00" timeLoss="4.83" rerouteNo="1" devices="tripinfo_car_n2w_124 routing_car_n2w_124" vType="Car" speedFactor="1.09" vaporized=""/>
    <tripinfo id="car_n2s_113" depart="113.00" departLane="n2sep_1" departPos="3.60" departPosLat="0.00" departSpeed="13.90" departDelay="0.00" arrival="261.25" arrivalLane="c2s_1" arrivalPos="990.00" arrivalPosLat="0.00" arrivalSpeed="14.17" duration="148.25" routeLength="1997.01" waitingTime="0.00" waitingCount="0" stopTime="0.00" timeLoss="7.36" rerouteNo="1" devices="tripinfo_car_n2s_113 routing_car_n2s_113" vType="Car" speedFactor="1.02" vaporized=""/>
    <tripinfo id="bus_s2e_93" depart="93.00" departLane="s2sep_1" departPos="12.10" departPosLat="0.00" departSpeed="13.90" departDelay="0.00" arrival="263.40" arrivalLane="c2e_1" arrivalPos="990.00" arrivalPosLat="0.00" arrivalSpeed="13.90" duration="170.40" routeLength="1978.19" waitingTime="14.85" waitingCount="1" stopTime="0.00" timeLoss="27.34" rerouteNo="1" devices="tripinfo_bus_s2e_93 routing_bus_s2e_93" vType="Bus" speedFactor="1.00" vaporized=""/>
    <tripinfo id="car_s2e_105" depart="105.00" departLane="s2sep_1" departPos="3.60" departPosLat="0.00" departSpeed="13.90" departDelay="0.00" arrival="268.10" arrivalLane="c2e_1" arrivalPos="990.00" arrivalPosLat="0.00" arrivalSpeed="13.96" duration="163.10" routeLength="1986.69" waitingTime="4.05" waitingCount="1" stopTime="0.00" timeLoss="20.18" rerouteNo="1" devices="tripinfo_car_s2e_105 routing_car_s2e_105" vType="Car" speedFactor="1.01" vaporized=""/>
    <tripinfo id="car_s2w_63" depart="63.00" departLane="s2sep_1" departPos="3.60" departPosLat="0.00" departSpeed="13.90" departDelay="0.00" arrival="269.05" arrivalLane="c2w_1" arrivalPos="990.00" arrivalPosLat="0.00" arrivalSpeed="14.04" duration="206.05" routeLength="1996.47" waitingTime="51.80" waitingCount="2" stopTime="0.00" timeLoss="63.16" rerouteNo="1" devices="tripinfo_car_s2w_63 routing_car_s2w_63" vType="Car" speedFactor="1.01" vaporized=""/>
    <tripinfo id="car_s2e_114" depart="114.00" departLane="s2sep_1" departPos="3.60" departPosLat="0.00" departSpeed="13.90" departDelay="0.00" arrival="271.70" arrivalLane="c2e_1" arrivalPos="990.00" arrivalPosLat="0.00" arrivalSpeed="13.87" duration="157.70" routeLength="1986.69" waitingTime="0.00" waitingCount="0" stopTime="0.00" timeLoss="14.02" rerouteNo="1" devices="tripinfo_car_s2e_114 routing_car_s2e_114" vType="Car" speedFactor="1.00" vaporized=""/>
    <tripinfo id="car_n2s_135" depart="135.00" departLane="n2sep_1" departPos="3.60" departPosLat="0.00" departSpeed="13.90" departDelay="0.00" arrival="273.15" arrivalLane="c2s_1" arrivalPos="990.00" arrivalPosLat="0.00" arrivalSpeed="14.50" duration="138.15" routeLength="1997.01" waitingTime="0.00" waitingCount="0" stopTime="0.00" timeLoss="0.46" rerouteNo="1" devices="tripinfo_car_n2s_135 routing_car_n2s_135" vType="Car" speedFactor="1.04" vaporized=""/>
    <tripinfo id="car_s2e_115" depart="115.65" departLane="s2sep_1" departPos="3.60" departPosLat="0.00" departSpeed="13.90" departDelay="0.65" arrival="273.45" arrivalLane="c2e_1" arrivalPos="990.00" arrivalPosLat="0.00" arrivalSpeed="15.34" duration="157.80" routeLength="1986.69" waitingTime="0.00" waitingCount="0" stopTime="0.00" timeLoss="36.01" rerouteNo="1" devices="tripinfo_car_s2e_115 routing_car_s2e_115" vType="Car" speedFactor="1.18" vaporized=""/>
    <tripinfo id="car_s2w_112" depart="112.00" departLane="s2sep_1" departPos="3.60" departPosLat="0.00" departSpeed="13.90" departDelay="0.00" arrival="273.60" arrivalLane="c2w_1" arrivalPos="990.00" arrivalPosLat="0.00" arrivalSpeed="13.89" duration="161.60" routeLength="1996.47" waitingTime="6.70" waitingCount="1" stopTime="0.00" timeLoss="17.28" rerouteNo="1" devices="tripinfo_car_s2w_112 routing_car_s2w_112" vType="Car" speedFactor="1.00" vaporized=""/>
    <tripinfo id="car_s2e_136" depart="136.00" departLane="s2sep_1" departPos="3.60" departPosLat="0.00" departSpeed="13.90" departDelay="0.00" arrival="275.75" arrivalLane="c2e_1" arrivalPos="990.00" arrivalPosLat="0.00" arrivalSpeed="14.85" duration="139.75" routeLength="1986.69" waitingTime="0.00" waitingCount="0" stopTime="0.00" timeLoss="7.67" rerouteNo="1" devices="tripinfo_car_s2e_136 routing_car_s2e_136" vType="Car" speedFactor="1.09" vaporized=""/>
    <tripinfo id="car_n2e_88" depart="88.00" departLane="n2sep_1" departPos="3.60" departPosLat="0.00" departSpeed="13.90" departDelay="0.00" arrival="281.40" arrivalLane="c2e_1" arrivalPos="990.00" arrivalPosLat="0.00" arrivalSpeed="13.90" duration="193.40" routeLength="1996.47" waitingTime="36.15" waitingCount="4" stopTime="0.00" timeLoss="49.07" rerouteNo="1" devices="tripinfo_car_n2e_88 routing_car_n2e_88" vType="Car" speedFactor="1.00" vaporized=""/>
    <tripinfo id="car_n2w_137" depart="137.00" departLane="n2sep_1" departPos="3.60" departPosLat="0.00" departSpeed="13.90" departDelay="0.00" arrival="284.50" arrivalLane="c2w_1" arrivalPos="990.00" arrivalPosLat="0.00" arrivalSpeed="14.04" duration="147.50" routeLength="1986.69" waitingTime="0.00" waitingCount="0" stopTime="0.00" timeLoss="5.24" rerouteNo="1" devices="tripinfo_car_n2w_137 routing_car_n2w_137" vType="Car" speedFactor="1.01" vaporized=""/>
    <tripinfo id="car_n2e_89" depart="89.45" departLane="n2sep_1" departPos="3.60" departPosLat="0.00" departSpeed="13.90" departDelay="0.45" arrival="285.35" arrivalLane="c2e_1" arrivalPos="990.00" arrivalPosLat="0.00" arrivalSpeed="13.88" duration="195.90" routeLength="1996.47" waitingTime="32.15" waitingCount="2" stopTime="0.00" timeLoss="51.57" rerouteNo="1" devices="tripinfo_car_n2e_89 routing_car_n2e_89" vType="Car" speedFactor="1.00" vaporized=""/>
    <tripinfo id="car_n2e_111" depart="111.00" departLane="n2sep_1" departPos="3.60" departPosLat="0.00" departSpeed="13.90" departDelay="0.00" arrival="287.15" arrivalLane="c2e_1" arrivalPos="990.00" arrivalPosLat="0.00" arrivalSpeed="15.34" duration="176.15" routeLength="1996.47" waitingTime="22.15" waitingCount="2" stopTime="0.00" timeLoss="52.98" rerouteNo="1" devices="tripinfo_car_n2e_111 routing_car_n2e_111" vType="Car" speedFactor="1.17" vaporized=""/>
    <tripinfo id="car_n2e_143" depart="144.50" departLane="n2sep_1" departPos="3.60" departPosLat="0.00" departSpeed="13.90" departDelay="1.50" arrival="295.45" arrivalLane="c2e_1" arrivalPos="990.00" arrivalPosLat="0.00" arrivalSpeed="13.90" duration="150.95" routeLength="1996.47" waitingTime="0.00" waitingCount="0" stopTime="0.00" timeLoss="6.61" rerouteNo="1" devices="tripinfo_car_n2e_143 routing_car_n2e_143" vType="Car" speedFactor="1.00" vaporized=""/>
    <tripinfo id="car_w2e_118" depart="118.00" departLane="w2sep_1" departPos="3.60" departPosLat="0.00" departSpeed="13.90" departDelay="0.00" arrival="298.15" arrivalLane="c2e_1" arrivalPos="990.00" arrivalPosLat="0.00" arrivalSpeed="15.16" duration="180.15" routeLength="1997.01" waitingTime="39.10" waitingCount="1" stopTime="0.00" timeLoss="49.81" rerouteNo="1" devices="tripinfo_car_w2e_118 routing_car_w2e_118" vType="Car" speedFactor="1.10" vaporized=""/>
    <tripinfo id="car_e2n_119" depart="119.00" departLane="e2sep_1" departPos="3.60" departPosLat="0.00" departSpeed="13.90" departDelay="0.00" arrival="298.55" arrivalLane="c2n_1" arrivalPos="990.00" arrivalPosLat="0.00" arrivalSpeed="14.32" duration="179.55" routeLength="1986.69" waitingTime="32.95" waitingCount="1" stopTime="0.00" timeLoss="40.14" rerouteNo="1" devices="tripinfo_car_e2n_119 routing_car_e2n_119" vType="Car" speedFactor="1.03" vaporized=""/>
    <tripinfo id="car_w2s_96" depart="96.00" departLane="w2sep_1" departPos="3.60" departPosLat="0.00" departSpeed="13.90" departDelay="0.00" arrival="300.65" arrivalLane="c2s_1" arrivalPos="990.00" arrivalPosLat="0.00" arrivalSpeed="13.90" duration="204.65" routeLength="1986.69" waitingTime="54.55" waitingCount="1" stopTime="0.00" timeLoss="60.96" rerouteNo="1" devices="tripinfo_car_w2s_96 routing_car_w2s_96" vType="Car" speedFactor="1.00" vaporized=""/>
    <tripinfo id="car_w2e_171" depart="171.00" departLane="w2sep_1" departPos="3.60" departPosLat="0.00" departSpeed="13.90" departDelay="0.00" arrival="303.55" arrivalLane="c2e_1" arrivalPos="990.00" arrivalPosLat="0.00" arrivalSpeed="15.23" duration="132.55" routeLength="1997.01" waitingTime="0.00" waitingCount="0" stopTime="0.00" timeLoss="1.42" rerouteNo="1" devices="tripinfo_car_w2e_171 routing_car_w2e_171" vType="Car" speedFactor="1.10" vaporized=""/>
    <tripinfo id="car_e2n_121" depart="121.00" departLane="e2sep_1" departPos="3.60" departPosLat="0.00" departSpeed="13.90" departDelay="0.00" arrival="303.60" arrivalLane="c2n_1" arrivalPos="990.00" arrivalPosLat="0.00" arrivalSpeed="14.15" duration="182.60" routeLength="1986.69" waitingTime="29.45" waitingCount="1" stopTime="0.00" timeLoss="41.47" rerouteNo="1" devices="tripinfo_car_e2n_121 routing_car_e2n_121" vType="Car" speedFactor="1.02" vaporized=""/>
    <tripinfo id="car_e2w_142" depart="142.00" departLane="e2sep_1" departPos="3.60" departPosLat="0.00" departSpeed="13.90" departDelay="0.00" arrival="305.15" arrivalLane="c2w_1" arrivalPos="990.00" arrivalPosLat="0.00" arrivalSpeed="13.90" duration="163.15" routeLength="1997.01" waitingTime="9.40" waitingCount="1" stopTime="0.00" timeLoss="19.45" rerouteNo="1" devices="tripinfo_car_e2w_142 routing_car_e2w_142" vType="Car" speedFactor="1.00" vaporized=""/>
    <tripinfo id="car_w2n_119" depart="119.30" departLane="w2sep_1" departPos="3.60" departPosLat="0.00" departSpeed="13.90" departDelay="0.30" arrival="305.50" arrivalLane="c2n_1" arrivalPos="990.00" arrivalPosLat="0.00" arrivalSpeed="15.42" duration="186.20" routeLength="1996.47" waitingTime="38.55" waitingCount="2" stopTime="0.00" timeLoss="61.61" rerouteNo="1" devices="tripinfo_car_w2n_119 routing_car_w2n_119" vType="Car" speedFactor="1.16" vaporized=""/>
    <tripinfo id="car_e2s_137" depart="137.00" departLane="e2sep_1" departPos="3.60" departPosLat="0.00" departSpeed="13.90" departDelay="0.00" arrival="306.45" arrivalLane="c2s_1" arrivalPos="990.00" arrivalPosLat="0.00" arrivalSpeed="13.90" duration="169.45" routeLength="1996.47" waitingTime="13.40" waitingCount="2" stopTime="0.00" timeLoss="25.12" rerouteNo="1" devices="tripinfo_car_e2s_137 routing_car_e2s_137" vType="Car" speedFactor="1.00" vaporized=""/>
    <tripinfo id="car_w2n_133" depart="133.00" departLane="w2sep_1" departPos="3.60" departPosLat="0.00" departSpeed="13.90" departDelay="0.00" arrival="309.45" arrivalLane="c2n_1" arrivalPos="990.00" arrivalPosLat="0.00" arrivalSpeed="14.41" duration="176.45" routeLength="1996.47" waitingTime="22.15" waitingCount="2" stopTime="0.00" timeLoss="37.36" rerouteNo="1" devices="tripinfo_car_w2n_133 routing_car_w2n_133" vType="Car" speedFactor="1.04" vaporized=""/>
    <tripinfo id="bus_w2e_178" depart="178.00" departLane="w2sep_1" departPos="12.10" departPosLat="0.00" departSpeed="13.90" departDelay="0.00" arrival="321.35" arrivalLane="c2e_1" arrivalPos="990.00" arrivalPosLat="0.00" arrivalSpeed="13.90" duration="143.35" routeLength="1988.51" waitingTime="0.00" waitingCount="0" stopTime="0.00" timeLoss="0.29" rerouteNo="1" devices="tripinfo_bus_w2e_178 routing_bus_w2e_178" vType="Bus" speedFactor="1.00" vaporized=""/>
    <tripinfo id="bus_e2s_186" depart="186.00" departLane="e2sep_1" departPos="12.10" departPosLat="0.00" departSpeed="13.90" departDelay="0.00" arrival="334.95" arrivalLane="c2s_1" arrivalPos="990.00" arrivalPosLat="0.00" arrivalSpeed="13.90" duration="148.95" routeLength="1987.97" waitingTime="0.00" waitingCount="0" stopTime="0.00" timeLoss="5.22" rerouteNo="1" devices="tripinfo_bus_e2s_186 routing_bus_e2s_186" vType="Bus" speedFactor="1.00" vaporized=""/>
    <tripinfo id="car_n2s_143" depart="146.30" departLane="n2sep_1" departPos="3.60" departPosLat="0.00" departSpeed="13.90" departDelay="3.30" arrival="338.75" arrivalLane="c2s_1" arrivalPos="990.00" arrivalPosLat="0.00" arrivalSpeed="16.18" duration="192.45" routeLength="1997.01" waitingTime="47.35" waitingCount="1" stopTime="0.00" timeLoss="69.53" rerouteNo="1" devices="tripinfo_car_n2s_143 routing_car_n2s_143" vType="Car" speedFactor="1.17" vaporized=""/>
    <tripinfo id="car_n2w_143" depart="143.00" departLane="n2sep_1" departPos="3.60" departPosLat="0.00" departSpeed="13.90" departDelay="0.00" arrival="345.65" arrivalLane="c2w_1" arrivalPos="990.00" arrivalPosLat="0.00" arrivalSpeed="13.90" duration="202.65" routeLength="1986.69" waitingTime="51.50" waitingCount="1" stopTime="0.00" timeLoss="58.95" rerouteNo="1" devices="tripinfo_car_n2w_143 routing_car_n2w_143" vType="Car" speedFactor="1.00" vaporized=""/>
    <tripinfo id="car_s2e_182" depart="182.00" departLane="s2sep_1" departPos="3.60" departPosLat="0.00" departSpeed="13.90" departDelay="0.00" arrival="345.65" arrivalLane="c2e_1" arrivalPos="990.00" arrivalPosLat="0.00" arrivalSpeed="13.90" duration="163.65" routeLength="1986.69" waitingTime="12.95" waitingCount="1" stopTime="0.00" timeLoss="19.97" rerouteNo="1" devices="tripinfo_car_s2e_182 routing_car_s2e_182" vType="Car" speedFactor="1.00" vaporized=""/>
    <tripinfo id="car_s2n_183" depart="183.45" departLane="s2sep_1" departPos="3.60" departPosLat="0.00" departSpeed="13.90" departDelay="0.45" arrival="347.80" arrivalLane="c2n_1" arrivalPos="990.00" arrivalPosLat="0.00" arrivalSpeed="13.90" duration="164.35" routeLength="1997.01" waitingTime="10.00" waitingCount="1" stopTime="0.00" timeLoss="20.66" rerouteNo="1" devices="tripinfo_car_s2n_183 routing_car_s2n_183" vType="Car" speedFactor="1.00" vaporized=""/>
    <tripinfo id="car_s2n_196" depart="196.00" departLane="s2sep_1" departPos="3.60" departPosLat="0.00" departSpeed="13.90" departDelay="0.00" arrival="350.10" arrivalLane="c2n_1" arrivalPos="990.00" arrivalPosLat="0.00" arrivalSpeed="15.24" duration="154.10" routeLength="1997.01" waitingTime="6.35" waitingCount="1" stopTime="0.00" timeLoss="25.75" rerouteNo="1" devices="tripinfo_car_s2n_196 routing_car_s2n_196" vType="Car" speedFactor="1.12" vaporized=""/>
    <tripinfo id="car_n2w_158" depart="158.00" departLane="n2sep_1" departPos="3.60" departPosLat="0.00" departSpeed="13.90" departDelay="0.00" arrival="350.35" arrivalLane="c2w_1" arrivalPos="990.00" arrivalPosLat="0.00" arrivalSpeed="14.13" duration="192.35" routeLength="1986.69" waitingTime="40.00" waitingCount="1" stopTime="0.00" timeLoss="51.06" rerouteNo="1" devices="tripinfo_car_n2w_158 routing_car_n2w_158" vType="Car" speedFactor="1.02" vaporized=""/>
    <tripinfo id="car_n2w_185" depart="185.00" departLane="n2sep_1" departPos="3.60" departPosLat="0.00" departSpeed="13.90" departDelay="0.00" arrival="352.55" arrivalLane="c2w_1" arrivalPos="990.00" arrivalPosLat="0.00" arrivalSpeed="15.48" duration="167.55" routeLength="1986.69" waitingTime="24.80" waitingCount="1" stopTime="0.00" timeLoss="41.80" rerouteNo="1" devices="tripinfo_car_n2w_185 routing_car_n2w_185" vType="Car" speedFactor="1.14" vaporized=""/>
    <tripinfo id="bus_s2e_190" depart="190.00" departLane="s2sep_1" departPos="12.10" departPosLat="0.00" departSpeed="13.90" departDelay="0.00" arrival="353.90" arrivalLane="c2e_1" arrivalPos="990.00" arrivalPosLat="0.00" arrivalSpeed="13.90" duration="163.90" routeLength="1978.19" waitingTime="7.70" waitingCount="1" stopTime="0.00" timeLoss="20.81" rerouteNo="1" devices="tripinfo_bus_s2e_190 routing_bus_s2e_190" vType="Bus" speedFactor="1.00" vaporized=""/>
    <tripinfo id="bus_n2s_163" depart="163.00" departLane="n2sep_1" departPos="12.10" departPosLat="0.00" departSpeed="13.90" departDelay="0.00" arrival="354.45" arrivalLane="c2s_1" arrivalPos="990.00" arrivalPosLat="0.00" arrivalSpeed="13.90" duration="191.45" routeLength="1988.51" waitingTime="36.30" waitingCount="1" stopTime="0.00" timeLoss="48.36" rerouteNo="1" devices="tripinfo_bus_n2s_163 routing_bus_n2s_163" vType="Bus" speedFactor="1.00" vaporized=""/>
    <tripinfo id="car_n2s_172" depart="172.00" departLane="n2sep_1" departPos="3.60" departPosLat="0.00" departSpeed="13.90" departDelay="0.00" arrival="359.20" arrivalLane="c2s_1" arrivalPos="990.00" arrivalPosLat="0.00" arrivalSpeed="13.94" duration="187.20" routeLength="1997.01" waitingTime="28.60" waitingCount="1" stopTime="0.00" timeLoss="43.94" rerouteNo="1" devices="tripinfo_car_n2s_172 routing_car_n2s_172" vType="Car" speedFactor="1.00" vaporized=""/>
    <tripinfo id="car_n2s_185" depart="186.25" departLane="n2sep_1" departPos="3.60" departPosLat="0.00" departSpeed="13.90" departDelay="1.25" arrival="362.25" arrivalLane="c2s_1" arrivalPos="990.00" arrivalPosLat="0.00" arrivalSpeed="14.16" duration="176.00" routeLength="1997.01" waitingTime="17.45" waitingCount="1" stopTime="0.00" timeLoss="35.60" rerouteNo="1" devices="tripinfo_car_n2s_185 routing_car_n2s_185" vType="Car" speedFactor="1.02" vaporized=""/>
    <tripinfo id="car_n2s_188" depart="188.00" departLane="n2sep_1" departPos="3.60" departPosLat="0.00" departSpeed="13.90" departDelay="0.00" arrival="364.20" arrivalLane="c2s_1" arrivalPos="990.00" arrivalPosLat="0.00" arrivalSpeed="15.12" duration="176.20" routeLength="1997.01" waitingTime="16.80" waitingCount="1" stopTime="0.00" timeLoss="49.23" rerouteNo="1" devices="tripinfo_car_n2s_188 routing_car_n2s_188" vType="Car" speedFactor="1.13" vaporized=""/>
    <tripinfo id="car_n2w_198" depart="198.45" departLane="n2sep_1" departPos="3.60" departPosLat="0.00" departSpeed="13.90" departDelay="0.45" arrival="366.65" arrivalLane="c2w_1" arrivalPos="990.00" arrivalPosLat="0.00" arrivalSpeed="13.90" duration="168.20" routeLength="1986.69" waitingTime="6.70" waitingCount="1" stopTime="0.00" timeLoss="24.54" rerouteNo="1" devices="tripinfo_car_n2w_198 routing_car_n2w_198" vType="Car" speedFactor="1.00" vaporized=""/>
    <tripinfo id="car_n2s_197" depart="197.00" departLane="n2sep_1" departPos="3.60" departPosLat="0.00" departSpeed="13.90" departDelay="0.00" arrival="367.30" arrivalLane="c2s_1" arrivalPos="990.00" arrivalPosLat="0.00" arrivalSpeed="14.07" duration="170.30" routeLength="1997.01" waitingTime="9.70" waitingCount="1" stopTime="0.00" timeLoss="28.85" rerouteNo="1" devices="tripinfo_car_n2s_197 routing_car_n2s_197" vType="Car" speedFactor="1.02" vaporized=""/>
    <tripinfo id="car_s2e_217" depart="218.35" departLane="s2sep_1" departPos="3.60" departPosLat="0.00" departSpeed="13.90" departDelay="1.35" arrival="367.35" arrivalLane="c2e_1" arrivalPos="990.00" arrivalPosLat="0.00" arrivalSpeed="13.90" duration="149.00" routeLength="1986.69" waitingTime="0.00" waitingCount="0" stopTime="0.00" timeLoss="5.31" rerouteNo="1" devices="tripinfo_car_s2e_217 routing_car_s2e_217" vType="Car" speedFactor="1.00" vaporized=""/>
    <tripinfo id="car_n2w_229" depart="229.00" departLane="n2sep_1" departPos="3.60" departPosLat="0.00" departSpeed="13.90" departDelay="0.00" arrival="368.50" arrivalLane="c2w_1" arrivalPos="990.00" arrivalPosLat="0.00" arrivalSpeed="15.50" duration="139.50" routeLength="1986.69" waitingTime="0.00" waitingCount="0" stopTime="0.00" timeLoss="17.71" rerouteNo="1" devices="tripinfo_car_n2w_229 routing_car_n2w_229" vType="Car" speedFactor="1.18" vaporized=""/>
    <tripinfo id="car_n2s_212" depart="212.00" departLane="n2sep_1" departPos="3.60" departPosLat="0.00" departSpeed="13.90" departDelay="0.00" arrival="370.25" arrivalLane="c2s_1" arrivalPos="990.00" arrivalPosLat="0.00" arrivalSpeed="14.10" duration="158.25" routeLength="1997.01" waitingTime="0.00" waitingCount="0" stopTime="0.00" timeLoss="17.35" rerouteNo="1" devices="tripinfo_car_n2s_212 routing_car_n2s_212" vType="Car" speedFactor="1.02" vaporized=""/>
    <tripinfo id="car_s2w_202" depart="202.00" departLane="s2sep_1" departPos="3.60" departPosLat="0.00" departSpeed="13.90" departDelay="0.00" arrival="374.30" arrivalLane="c2w_1" arrivalPos="990.00" arrivalPosLat="0.00" arrivalSpeed="13.97" duration="172.30" routeLength="1996.47" waitingTime="20.70" waitingCount="1" stopTime="0.00" timeLoss="28.69" rerouteNo="1" devices="tripinfo_car_s2w_202 routing_car_s2w_202" vType="Car" speedFactor="1.01" vaporized=""/>
    <tripinfo id="car_s2w_207" depart="207.00" departLane="s2sep_1" departPos="3.60" departPosLat="0.00" departSpeed="13.90" departDelay="0.00" arrival="377.70" arrivalLane="c2w_1" arrivalPos="990.00" arrivalPosLat="0.00" arrivalSpeed="14.18" duration="170.70" routeLength="1996.47" waitingTime="17.40" waitingCount="1" stopTime="0.00" timeLoss="29.62" rerouteNo="1" devices="tripinfo_car_s2w_207 routing_car_s2w_207" vType="Car" speedFactor="1.02" vaporized=""/>
    <tripinfo id="car_e2n_200" depart="200.00" departLane="e2sep_1" departPos="3.60" departPosLat="0.00" departSpeed="13.90" departDelay="0.00" arrival="380.15" arrivalLane="c2n_1" arrivalPos="990.00" arrivalPosLat="0.00" arrivalSpeed="16.38" duration="180.15" routeLength="1986.69" waitingTime="50.05" waitingCount="1" stopTime="0.00" timeLoss="58.25" rerouteNo="1" devices="tripinfo_car_e2n_200 routing_car_e2n_200" vType="Car" speedFactor="1.18" vaporized=""/>
    <tripinfo id="car_s2w_217" depart="217.00" departLane="s2sep_1" departPos="3.60" departPosLat="0.00" departSpeed="13.90" departDelay="0.00" arrival="380.30" arrivalLane="c2w_1" arrivalPos="990.00" arrivalPosLat="0.00" arrivalSpeed="14.52" duration="163.30" routeLength="1996.47" waitingTime="9.80" waitingCount="1" stopTime="0.00" timeLoss="26.60" rerouteNo="1" devices="tripinfo_car_s2w_217 routing_car_s2w_217" vType="Car" speedFactor="1.06" vaporized=""/>
    <tripinfo id="car_w2e_203" depart="203.25" departLane="w2sep_1" departPos="3.60" departPosLat="0.00" departSpeed="13.90" departDelay="0.25" arrival="384.90" arrivalLane="c2e_1" arrivalPos="990.00" arrivalPosLat="0.00" arrivalSpeed="16.29" duration="181.65" routeLength="1997.01" waitingTime="45.55" waitingCount="1" stopTime="0.00" timeLoss="59.04" rerouteNo="1" devices="tripinfo_car_w2e_203 routing_car_w2e_203" vType="Car" speedFactor="1.17" vaporized=""/>
    <tripinfo id="car_w2s_195" depart="195.00" departLane="w2sep_1" departPos="3.60" departPosLat="0.00" departSpeed="13.90" departDelay="0.00" arrival="385.40" arrivalLane="c2s_1" arrivalPos="990.00" arrivalPosLat="0.00" arrivalSpeed="15.05" duration="190.40" routeLength="1986.69" waitingTime="50.35" waitingCount="1" stopTime="0.00" timeLoss="57.68" rerouteNo="1" devices="tripinfo_car_w2s_195 routing_car_w2s_195" vType="Car" speedFactor="1.08" vaporized=""/>
    <tripinfo id="car_w2s_202" depart="202.00" departLane="w2sep_1" departPos="3.60" departPosLat="0.00" departSpeed="13.90" departDelay="0.00" arrival="387.95" arrivalLane="c2s_1" arrivalPos="990.00" arrivalPosLat="0.00" arrivalSpeed="15.84" duration="185.95" routeLength="1986.69" waitingTime="47.35" waitingCount="1" stopTime="0.00" timeLoss="61.52" rerouteNo="1" devices="tripinfo_car_w2s_202 routing_car_w2s_202" vType="Car" speedFactor="1.15" vaporized=""/>
    <tripinfo id="car_e2n_204" depart="204.00" departLane="e2sep_1" departPos="3.60" departPosLat="0.00" departSpeed="13.90" departDelay="0.00" arrival="390.95" arrivalLane="c2n_1" arrivalPos="990.00" arrivalPosLat="0.00" arrivalSpeed="14.46" duration="186.95" routeLength="1986.69" waitingTime="39.35" waitingCount="1" stopTime="0.00" timeLoss="48.78" rerouteNo="1" devices="tripinfo_car_e2n_204 routing_car_e2n_204" vType="Car" speedFactor="1.04" vaporized=""/>
    <tripinfo id="car_e2n_230" depart="230.00" departLane="e2sep_1" departPos="3.60" departPosLat="0.00" departSpeed="13.90" departDelay="0.00" arrival="395.50" arrivalLane="c2n_1" arrivalPos="990.00" arrivalPosLat="0.00" arrivalSpeed="14.34" duration="165.50" routeLength="1986.69" waitingTime="14.10" waitingCount="1" stopTime="0.00" timeLoss="26.33" rerouteNo="1" devices="tripinfo_car_e2n_230 routing_car_e2n_230" vType="Car" speedFactor="1.03" vaporized=""/>
    <tripinfo id="car_w2s_210" depart="210.00" departLane="w2sep_1" departPos="3.60" departPosLat="0.00" departSpeed="13.90" departDelay="0.00" arrival="398.00" arrivalLane="c2s_1" arrivalPos="990.00" arrivalPosLat="0.00" arrivalSpeed="13.90" duration="188.00" routeLength="1986.69" waitingTime="33.15" waitingCount="1" stopTime="0.00" timeLoss="44.35" rerouteNo="1" devices="tripinfo_car_w2s_210 routing_car_w2s_210" vType="Car" speedFactor="1.00" vaporized=""/>
    <tripinfo id="car_e2n_236" depart="236.00" departLane="e2sep_1" departPos="3.60" departPosLat="0.00" departSpeed="13.90" departDelay="0.00" arrival="398.00" arrivalLane="c2n_1" arrivalPos="990.00" arrivalPosLat="0.00" arrivalSpeed="14.92" duration="162.00" routeLength="1986.69" waitingTime="10.25" waitingCount="1" stopTime="0.00" timeLoss="29.84" rerouteNo="1" devices="tripinfo_car_e2n_236 routing_car_e2n_236" vType="Car" speedFactor="1.09" vaporized=""/>
    <tripinfo id="bus_w2s_219" depart="219.00" departLane="w2sep_1" departPos="12.10" departPosLat="0.00" departSpeed="13.90" departDelay="0.00" arrival="403.55" arrivalLane="c2s_1" arrivalPos="990.00" arrivalPosLat="0.00" arrivalSpeed="13.88" duration="184.55" routeLength="1978.19" waitingTime="26.90" waitingCount="1" stopTime="0.00" timeLoss="41.51" rerouteNo="1" devices="tripinfo_bus_w2s_219 routing_bus_w2s_219" vType="Bus" speedFactor="1.00" vaporized=""/>
    <tripinfo id="bus_w2e_234" depart="234.00" departLane="w2sep_1" departPos="12.10" departPosLat="0.00" departSpeed="13.90" departDelay="0.00" arrival="405.50" arrivalLane="c2e_1" arrivalPos="990.00" arrivalPosLat="0.00" arrivalSpeed="13.90" duration="171.50" routeLength="1988.51" waitingTime="14.25" waitingCount="1" stopTime="0.00" timeLoss="28.41" rerouteNo="1" devices="tripinfo_bus_w2e_234 routing_bus_w2e_234" vType="Bus" speedFactor="1.00" vaporized=""/>
    <tripinfo id="car_e2w_267" depart="267.00" departLane="e2sep_1" departPos="3.60" departPosLat="0.00" departSpeed="13.90" departDelay="0.00" arrival="407.80" arrivalLane="c2w_1" arrivalPos="990.00" arrivalPosLat="0.00" arrivalSpeed="14.21" duration="140.80" routeLength="1997.01" waitingTime="0.00" waitingCount="0" stopTime="0.00" timeLoss="0.23" rerouteNo="1" devices="tripinfo_car_e2w_267 routing_car_e2w_267" vType="Car" speedFactor="1.02" vaporized=""/>
    <tripinfo id="car_e2s_204" depart="205.40" departLane="e2sep_1" departPos="3.60" departPosLat="0.00" departSpeed="13.90" departDelay="1.40" arrival="408.25" arrivalLane="c2s_1" arrivalPos="990.00" arrivalPosLat="0.00" arrivalSpeed="14.20" duration="202.85" routeLength="1996.47" waitingTime="46.95" waitingCount="2" stopTime="0.00" timeLoss="61.62" rerouteNo="1" devices="tripinfo_car_e2s_204 routing_car_e2s_204" vType="Car" speedFactor="1.02" vaporized=""/>
    <tripinfo id="amb_w2e_300" depart="300.00" departLane="w2sep_1" departPos="6.60" departPosLat="0.00" departSpeed="13.90" departDelay="0.00" arrival="409.30" arrivalLane="c2e_1" arrivalPos="990.00" arrivalPosLat="-0.95" arrivalSpeed="20.61" duration="109.30" routeLength="1994.01" waitingTime="0.00" waitingCount="0" stopTime="0.00" timeLoss="13.63" rerouteNo="1" devices="tripinfo_amb_w2e_300 routing_amb_w2e_300 bluelight_amb_w2e_300 fcd_amb_w2e_300" vType="Ambulance" speedFactor="1.50" vaporized="">
        <example_device customValue1="0.00" customValue2="-1.00"/>
    </tripinfo>
    <tripinfo id="car_e2s_232" depart="232.00" departLane="e2sep_1" departPos="3.60" departPosLat="0.00" departSpeed="13.90" departDelay="0.00" arrival="410.50" arrivalLane="c2s_1" arrivalPos="990.00" arrivalPosLat="0.00" arrivalSpeed="15.01" duration="178.50" routeLength="1996.47" waitingTime="22.90" waitingCount="2" stopTime="0.00" timeLoss="47.55" rerouteNo="1" devices="tripinfo_car_e2s_232 routing_car_e2s_232" vType="Car" speedFactor="1.10" vaporized=""/>
    <tripinfo id="car_w2e_277" depart="278.45" departLane="w2sep_1" departPos="3.60" departPosLat="0.00" departSpeed="13.90" departDelay="1.45" arrival="415.75" arrivalLane="c2e_1" arrivalPos="990.00" arrivalPosLat="1.10" arrivalSpeed="15.18" duration="137.30" routeLength="1997.01" waitingTime="0.00" waitingCount="0" stopTime="0.00" timeLoss="5.72" rerouteNo="1" devices="tripinfo_car_w2e_277 routing_car_w2e_277" vType="Car@car_w2e_277" speedFactor="1.09" vaporized=""/>
    <tripinfo id="car_w2n_277" depart="277.00" departLane="w2sep_1" departPos="3.60" departPosLat="0.00" departSpeed="13.90" departDelay="0.00" arrival="422.30" arrivalLane="c2n_1" arrivalPos="990.00" arrivalPosLat="0.00" arrivalSpeed="14.13" duration="145.30" routeLength="1996.47" waitingTime="0.00" waitingCount="0" stopTime="0.00" timeLoss="3.33" rerouteNo="1" devices="tripinfo_car_w2n_277 routing_car_w2n_277" vType="Car" speedFactor="1.02" vaporized=""/>
    <tripinfo id="car_e2n_291" depart="291.00" departLane="e2sep_1" departPos="3.60" departPosLat="0.00" departSpeed="13.90" departDelay="0.00" arrival="429.25" arrivalLane="c2n_1" arrivalPos="990.00" arrivalPosLat="0.00" arrivalSpeed="15.16" duration="138.25" routeLength="1986.69" waitingTime="0.00" waitingCount="0" stopTime="0.00" timeLoss="6.52" rerouteNo="1" devices="tripinfo_car_e2n_291 routing_car_e2n_291" vType="Car" speedFactor="1.09" vaporized=""/>
    <tripinfo id="car_e2s_287" depart="287.00" departLane="e2sep_1" departPos="3.60" departPosLat="0.00" departSpeed="13.90" departDelay="0.00" arrival="432.35" arrivalLane="c2s_1" arrivalPos="990.00" arrivalPosLat="0.00" arrivalSpeed="14.42" duration="145.35" routeLength="1996.47" waitingTime="0.00" waitingCount="0" stopTime="0.00" timeLoss="6.25" rerouteNo="1" devices="tripinfo_car_e2s_287 routing_car_e2s_287" vType="Car" speedFactor="1.04" vaporized=""/>
    <tripinfo id="car_e2s_291" depart="292.35" departLane="e2sep_1" departPos="3.60" departPosLat="0.00" departSpeed="13.90" departDelay="1.35" arrival="436.70" arrivalLane="c2s_1" arrivalPos="990.00" arrivalPosLat="0.00" arrivalSpeed="14.68" duration="144.35" routeLength="1996.47" waitingTime="0.00" waitingCount="0" stopTime="0.00" timeLoss="7.78" rerouteNo="1" devices="tripinfo_car_e2s_291 routing_car_e2s_291" vType="Car" speedFactor="1.06" vaporized=""/>
    <tripinfo id="car_s2e_238" depart="238.00" departLane="s2sep_1" departPos="3.60" departPosLat="0.00" departSpeed="13.90" departDelay="0.00" arrival="448.70" arrivalLane="c2e_1" arrivalPos="990.00" arrivalPosLat="0.00" arrivalSpeed="14.38" duration="210.70" routeLength="1986.69" waitingTime="64.85" waitingCount="1" stopTime="0.00" timeLoss="71.83" rerouteNo="1" devices="tripinfo_car_s2e_238 routing_car_s2e_238" vType="Car" speedFactor="1.03" vaporized=""/>
    <tripinfo id="car_n2w_236" depart="236.00" departLane="n2sep_1" departPos="3.60" departPosLat="0.00" departSpeed="13.90" departDelay="0.00" arrival="450.50" arrivalLane="c2w_1" arrivalPos="990.00" arrivalPosLat="0.00" arrivalSpeed="14.00" duration="214.50" routeLength="1986.69" waitingTime="65.00" waitingCount="1" stopTime="0.00" timeLoss="71.88" rerouteNo="1" devices="tripinfo_car_n2w_236 routing_car_n2w_236" vType="Car" speedFactor="1.01" vaporized=""/>
    <tripinfo id="car_n2s_247" depart="247.00" departLane="n2sep_1" departPos="3.60" departPosLat="0.00" departSpeed="13.90" departDelay="0.00" arrival="452.10" arrivalLane="c2s_1" arrivalPos="990.00" arrivalPosLat="0.00" arrivalSpeed="14.13" duration="205.10" routeLength="1997.01" waitingTime="55.35" waitingCount="1" stopTime="0.00" timeLoss="63.81" rerouteNo="1" devices="tripinfo_car_n2s_247 routing_car_n2s_247" vType="Car" speedFactor="1.02" vaporized=""/>
    <tripinfo id="car_s2n_246" depart="246.00" departLane="s2sep_1" departPos="3.60" departPosLat="0.00" departSpeed="13.90" departDelay="0.00" arrival="453.20" arrivalLane="c2n_1" arrivalPos="990.00" arrivalPosLat="0.00" arrivalSpeed="13.90" duration="207.20" routeLength="1997.01" waitingTime="55.20" waitingCount="1" stopTime="0.00" timeLoss="63.53" rerouteNo="1" devices="tripinfo_car_s2n_246 routing_car_s2n_246" vType="Car" speedFactor="1.00" vaporized=""/>
    <tripinfo id="car_n2s_248" depart="250.20" departLane="n2sep_1" departPos="3.60" departPosLat="0.00" departSpeed="13.90" departDelay="2.20" arrival="454.15" arrivalLane="c2s_1" arrivalPos="990.00" arrivalPosLat="0.00" arrivalSpeed="15.42" duration="203.95" routeLength="1997.01" waitingTime="51.45" waitingCount="1" stopTime="0.00" timeLoss="78.76" rerouteNo="1" devices="tripinfo_car_n2s_248 routing_car_n2s_248" vType="Car" speedFactor="1.15" vaporized=""/>
    <tripinfo id="car_s2e_264" depart="264.00" departLane="s2sep_1" departPos="3.60" departPosLat="0.00" departSpeed="13.90" departDelay="0.00" arrival="455.85" arrivalLane="c2e_1" arrivalPos="990.00" arrivalPosLat="0.00" arrivalSpeed="14.00" duration="191.85" routeLength="1986.69" waitingTime="38.85" waitingCount="1" stopTime="0.00" timeLoss="49.20" rerouteNo="1" devices="tripinfo_car_s2e_264 routing_car_s2e_264" vType="Car" speedFactor="1.01" vaporized=""/>
    <tripinfo id="car_n2w_301" depart="301.00" departLane="n2sep_1" departPos="3.60" departPosLat="0.00" departSpeed="13.90" departDelay="0.00" arrival="456.55" arrivalLane="c2w_1" arrivalPos="990.00" arrivalPosLat="0.00" arrivalSpeed="15.12" duration="155.55" routeLength="1986.69" waitingTime="10.45" waitingCount="1" stopTime="0.00" timeLoss="23.49" rerouteNo="1" devices="tripinfo_car_n2w_301 routing_car_n2w_301" vType="Car" speedFactor="1.09" vaporized=""/>
    <tripinfo id="car_s2n_308" depart="308.00" departLane="s2sep_1" departPos="3.60" departPosLat="0.00" departSpeed="13.90" departDelay="0.00" arrival="458.55" arrivalLane="c2n_1" arrivalPos="990.00" arrivalPosLat="0.00" arrivalSpeed="13.90" duration="150.55" routeLength="1997.01" waitingTime="0.00" waitingCount="0" stopTime="0.00" timeLoss="6.88" rerouteNo="1" devices="tripinfo_car_s2n_308 routing_car_s2n_308" vType="Car" speedFactor="1.00" vaporized=""/>
    <tripinfo id="car_n2s_251" depart="251.95" departLane="n2sep_1" departPos="3.60" departPosLat="0.00" departSpeed="13.90" departDelay="0.95" arrival="459.15" arrivalLane="c2s_1" arrivalPos="990.00" arrivalPosLat="0.00" arrivalSpeed="13.92" duration="207.20" routeLength="1997.01" waitingTime="48.45" waitingCount="1" stopTime="0.00" timeLoss="63.75" rerouteNo="1" devices="tripinfo_car_n2s_251 routing_car_n2s_251" vType="Car" speedFactor="1.00" vaporized=""/>
    <tripinfo id="car_s2e_309" depart="309.60" departLane="s2sep_1" departPos="3.60" departPosLat="0.00" departSpeed="13.90" departDelay="0.60" arrival="461.35" arrivalLane="c2e_1" arrivalPos="990.00" arrivalPosLat="0.00" arrivalSpeed="13.90" duration="151.75" routeLength="1986.69" waitingTime="0.00" waitingCount="0" stopTime="0.00" timeLoss="8.09" rerouteNo="1" devices="tripinfo_car_s2e_309 routing_car_s2e_309" vType="Car" speedFactor="1.00" vaporized=""/>
    <tripinfo id="car_n2s_288" depart="288.00" departLane="n2sep_1" departPos="3.60" departPosLat="0.00" departSpeed="13.90" departDelay="0.00" arrival="461.90" arrivalLane="c2s_1" arrivalPos="990.00" arrivalPosLat="0.00" arrivalSpeed="14.39" duration="173.90" routeLength="1997.01" waitingTime="19.65" waitingCount="1" stopTime="0.00" timeLoss="36.17" rerouteNo="1" devices="tripinfo_car_n2s_288 routing_car_n2s_288" vType="Car" speedFactor="1.04" vaporized=""/>
    <tripinfo id="car_n2s_314" depart="314.00" departLane="n2sep_1" departPos="3.60" departPosLat="0.00" departSpeed="13.90" departDelay="0.00" arrival="464.25" arrivalLane="c2s_1" arrivalPos="990.00" arrivalPosLat="0.00" arrivalSpeed="14.68" duration="150.25" routeLength="1997.01" waitingTime="0.00" waitingCount="0" stopTime="0.00" timeLoss="16.30" rerouteNo="1" devices="tripinfo_car_n2s_314 routing_car_n2s_314" vType="Car" speedFactor="1.07" vaporized=""/>
    <tripinfo id="car_n2e_248" depart="248.45" departLane="n2sep_1" departPos="3.60" departPosLat="0.00" departSpeed="13.90" departDelay="0.45" arrival="464.55" arrivalLane="c2e_1" arrivalPos="990.00" arrivalPosLat="0.00" arrivalSpeed="14.27" duration="216.10" routeLength="1996.47" waitingTime="59.00" waitingCount="2" stopTime="0.00" timeLoss="76.01" rerouteNo="1" devices="tripinfo_car_n2e_248 routing_car_n2e_248" vType="Car" speedFactor="1.03" vaporized=""/>
</tripinfos>
