<?xml version="1.0" encoding="UTF-8"?>

<!-- generated on Sat Apr 24 18:25:19 2021 by Eclipse SUMO Version 1.4.0
<configuration xmlns:xsi="http://www.w3.org/2001/XMLSchema-instance" xsi:noNamespaceSchemaLocation="http://sumo.dlr.de/xsd/sumoConfiguration.xsd">

    <input>
        <net-file value="sumofiles/junction.net.xml"/>
        <route-files value="sumofiles/junction_preemption_174.rou.xml"/>
        <additional-files value="sumofiles/junction.det.xml"/>
    </input>

    <output>
        <tripinfo-output value="sumofiles/output/tripinfo_preemption_174.xml"/>
    </output>

    <time>
        <begin value="0"/>
        <end value="10000"/>
        <step-length value="0.05"/>
    </time>

    <processing>
        <lateral-resolution value="0.1"/>
    </processing>

    <report>
        <no-warnings value="true"/>
        <error-log value="sumofiles/output/errorlog_preemption_174.log"/>
        <no-step-log value="true"/>
    </report>

    <traci_server>
        <remote-port value="46499"/>
    </traci_server>

    <gui_only>
        <gui-settings-file value="sumofiles/junction-gui.settings.xml"/>
        <tracker-interval value="0.05"/>
    </gui_only>

</configuration>
-->

<tripinfos xmlns:xsi="http://www.w3.org/2001/XMLSchema-instance" xsi:noNamespaceSchemaLocation="http://sumo.dlr.de/xsd/tripinfo_file.xsd">
    <tripinfo id="car_w2e_0" depart="0.00" departLane="w2sep_1" departPos="3.60" departPosLat="0.00" departSpeed="13.90" departDelay="0.00" arrival="135.70" arrivalLane="c2e_1" arrivalPos="990.00" arrivalPosLat="0.00" arrivalSpeed="14.73" duration="135.70" routeLength="1997.01" waitingTime="0.00" waitingCount="0" stopTime="0.00" timeLoss="0.13" rerouteNo="1" devices="tripinfo_car_w2e_0 routing_car_w2e_0" vType="Car" speedFactor="1.06" vaporized=""/>
    <tripinfo id="car_e2s_0" depart="0.00" departLane="e2sep_1" departPos="3.60" departPosLat="0.00" departSpeed="13.90" departDelay="0.00" arrival="139.70" arrivalLane="c2s_1" arrivalPos="990.00" arrivalPosLat="0.00" arrivalSpeed="14.73" duration="139.70" routeLength="1996.47" waitingTime="0.00" waitingCount="0" stopTime="0.00" timeLoss="3.52" rerouteNo="1" devices="tripinfo_car_e2s_0 routing_car_e2s_0" vType="Car" speedFactor="1.06" vaporized=""/>
    <tripinfo id="car_e2s_3" depart="3.00" departLane="e2sep_1" departPos="3.60" departPosLat="0.00" departSpeed="13.90" departDelay="0.00" arrival="150.20" arrivalLane="c2s_1" arrivalPos="990.00" arrivalPosLat="0.00" arrivalSpeed="14.04" duration="147.20" routeLength="1996.47" waitingTime="0.00" waitingCount="0" stopTime="0.00" timeLoss="4.38" rerouteNo="1" devices="tripinfo_car_e2s_3 routing_car_e2s_3" vType="Car" speedFactor="1.01" vaporized=""/>
    <tripinfo id="car_n2w_4" depart="4.00" departLane="n2sep_1" departPos="3.60" departPosLat="0.00" departSpeed="13.90" departDelay="0.00" arrival="160.30" arrivalLane="c2w_1" arrivalPos="990.00" arrivalPosLat="0.00" arrivalSpeed="15.05" duration="156.30" routeLength="1986.69" waitingTime="16.05" waitingCount="1" stopTime="0.00" timeLoss="23.61" rerouteNo="1" devices="tripinfo_car_n2w_4 routing_car_n2w_4" vType="Car" speedFactor="1.08" vaporized=""/>
    <tripinfo id="car_s2n_15" depart="15.00" departLane="s2sep_1" departPos="3.60" departPosLat="0.00" departSpeed="13.90" departDelay="0.00" arrival="163.85" arrivalLane="c2n_1" arrivalPos="990.00" arrivalPosLat="0.00" arrivalSpeed="14.04" duration="148.85" routeLength="1997.01" waitingTime="0.00" waitingCount="0" stopTime="0.00" timeLoss="6.62" rerouteNo="1" devices="tripinfo_car_s2n_15 routing_car_s2n_15" vType="Car" speedFactor="1.01" vaporized=""/>
    <tripinfo id="car_s2e_18" depart="19.60" departLane="s2sep_1" departPos="3.60" departPosLat="0.00" departSpeed="13.90" departDelay="1.60" arrival="165.35" arrivalLane="c2e_1" arrivalPos="990.00" arrivalPosLat="0.00" arrivalSpeed="15.16" duration="145.75" routeLength="1986.69" waitingTime="0.00" waitingCount="0" stopTime="0.00" timeLoss="14.02" rerouteNo="1" devices="tripinfo_car_s2e_18 routing_car_s2e_18" vType="Car" speedFactor="1.09" vaporized=""/>
    <tripinfo id="car_n2s_7" depart="7.00" departLane="n2sep_1" departPos="3.60" departPosLat="0.00" departSpeed="13.90" departDelay="0.00" arrival="165.80" arrivalLane="c2s_1" arrivalPos="990.00" arrivalPosLat="0.00" arrivalSpeed="14.32" duration="158.80" routeLength="1997.01" waitingTime="10.25" waitingCount="1" stopTime="0.00" timeLoss="19.34" rerouteNo="1" devices="tripinfo_car_n2s_7 routing_car_n2s_7" vType="Car" speedFactor="1.03" vaporized=""/>
    <tripinfo id="car_n2w_17" depart="17.00" departLane="n2sep_1" departPos="3.60" departPosLat="0.00" departSpeed="13.90" departDelay="0.00" arrival="165.85" arrivalLane="c2w_1" arrivalPos="990.00" arrivalPosLat="0.00" arrivalSpeed="15.05" duration="148.85" routeLength="1986.69" waitingTime="4.95" waitingCount="1" stopTime="0.00" timeLoss="16.13" rerouteNo="1" devices="tripinfo_car_n2w_17 routing_car_n2w_17" vType="Car" speedFactor="1.08" vaporized=""/>
    <tripinfo id="car_n2s_22" depart="22.00" departLane="n2sep_1" departPos="3.60" departPosLat="0.00" departSpeed="13.90" departDelay="0.00" arrival="168.20" arrivalLane="c2s_1" arrivalPos="990.00" arrivalPosLat="0.00" arrivalSpeed="15.34" duration="146.20" routeLength="1997.01" waitingTime="0.00" waitingCount="0" stopTime="0.00" timeLoss="18.22" rerouteNo="1" devices="tripinfo_car_n2s_22 routing_car_n2s_22" vType="Car" speedFactor="1.12" vaporized=""/>
    <tripinfo id="bus_s2n_18" depart="18.00" departLane="s2sep_1" departPos="12.10" departPosLat="0.00" departSpeed="13.90" departDelay="0.00" arrival="168.70" arrivalLane="c2n_1" arrivalPos="990.00" arrivalPosLat="0.00" arrivalSpeed="13.86" duration="150.70" routeLength="1988.51" waitingTime="0.00" waitingCount="0" stopTime="0.00" timeLoss="7.60" rerouteNo="1" devices="tripinfo_bus_s2n_18 routing_bus_s2n_18" vType="Bus" speedFactor="1.00" vaporized=""/>
    <tripinfo id="car_s2w_11" depart="11.00" departLane="s2sep_1" departPos="3.60" departPosLat="0.00" departSpeed="13.90" departDelay="0.00" arrival="175.40" arrivalLane="c2w_1" arrivalPos="990.00" arrivalPosLat="0.00" arrivalSpeed="13.90" duration="164.40" routeLength="1996.47" waitingTime="8.85" waitingCount="2" stopTime="0.00" timeLoss="20.07" rerouteNo="1" devices="tripinfo_car_s2w_11 routing_car_s2w_11" vType="Car" speedFactor="1.00" vaporized=""/>
    <tripinfo id="car_s2e_29" depart="29.00" departLane="s2sep_1" departPos="3.60" departPosLat="0.00" departSpeed="13.90" departDelay="0.00" arrival="177.00" arrivalLane="c2e_1" arrivalPos="990.00" arrivalPosLat="0.00" arrivalSpeed="13.90" duration="148.00" routeLength="1986.69" waitingTime="0.00" waitingCount="0" stopTime="0.00" timeLoss="4.35" rerouteNo="1" devices="tripinfo_car_s2e_29 routing_car_s2e_29" vType="Car" speedFactor="1.00" vaporized=""/>
    <tripinfo id="car_n2s_36" depart="36.00" departLane="n2sep_1" departPos="3.60" departPosLat="0.00" departSpeed="13.90" departDelay="0.00" arrival="177.95" arrivalLane="c2s_1" arrivalPos="990.00" arrivalPosLat="0.00" arrivalSpeed="14.15" duration="141.95" routeLength="1997.01" waitingTime="0.00" waitingCount="0" stopTime="0.00" timeLoss="0.80" rerouteNo="1" devices="tripinfo_car_n2s_36 routing_car_n2s_36" vType="Car" speedFactor="1.02" vaporized=""/>
    <tripinfo id="car_s2w_13" depart="13.00" departLane="s2sep_1" departPos="3.60" departPosLat="0.00" departSpeed="13.90" departDelay="0.00" arrival="180.10" arrivalLane="c2w_1" arrivalPos="990.00" arrivalPosLat="0.00" arrivalSpeed="14.53" duration="167.10" routeLength="1996.47" waitingTime="8.30" waitingCount="3" stopTime="0.00" timeLoss="29.10" rerouteNo="1" devices="tripinfo_car_s2w_13 routing_car_s2w_13" vType="Car" speedFactor="1.05" vaporized=""/>
    <tripinfo id="car_n2e_17" depart="18.35" departLane="n2sep_1" departPos="3.60" departPosLat="0.00" departSpeed="13.90" departDelay="1.35" arrival="180.50" arrivalLane="c2e_1" arrivalPos="990.00" arrivalPosLat="0.00" arrivalSpeed="14.28" duration="162.15" routeLength="1996.47" waitingTime="10.25" waitingCount="1" stopTime="0.00" timeLoss="22.05" rerouteNo="1" devices="tripinfo_car_n2e_17 routing_car_n2e_17" vType="Car" speedFactor="1.03" vaporized=""/>
    <tripinfo id="car_s2w_32" depart="32.00" departLane="s2sep_1" departPos="3.60" departPosLat="0.00" departSpeed="13.90" departDelay="0.00" arrival="182.20" arrivalLane="c2w_1" arrivalPos="990.00" arrivalPosLat="0.00" arrivalSpeed="15.61" duration="150.20" routeLength="1996.47" waitingTime="1.15" waitingCount="1" stopTime="0.00" timeLoss="25.57" rerouteNo="1" devices="tripinfo_car_s2w_32 routing_car_s2w_32" vType="Car" speedFactor="1.16" vaporized=""/>
    <tripinfo id="car_s2n_45" depart="45.00" departLane="s2sep_1" departPos="3.60" departPosLat="0.00" departSpeed="13.90" departDelay="0.00" arrival="182.85" arrivalLane="c2n_1" arrivalPos="990.00" arrivalPosLat="0.00" arrivalSpeed="14.55" duration="137.85" routeLength="1997.01" waitingTime="0.00" waitingCount="0" stopTime="0.00" timeLoss="0.61" rerouteNo="1" devices="tripinfo_car_s2n_45 routing_car_s2n_45" vType="Car" speedFactor="1.05" vaporized=""/>
    <tripinfo id="car_s2w_39" depart="39.00" departLane="s2sep_1" departPos="3.60" departPosLat="0.00" departSpeed="13.90" departDelay="0.00" arrival="185.00" arrivalLane="c2w_1" arrivalPos="990.00" arrivalPosLat="0.00" arrivalSpeed="15.05" duration="146.00" routeLength="1996.47" waitingTime="0.00" waitingCount="0" stopTime="0.00" timeLoss="13.68" rerouteNo="1" devices="tripinfo_car_s2w_39 routing_car_s2w_39" vType="Car" speedFactor="1.09" vaporized=""/>
    <tripinfo id="car_s2n_56" depart="56.00" departLane="s2sep_1" departPos="3.60" departPosLat="0.00" departSpeed="13.90" departDelay="0.00" arrival="185.10" arrivalLane="c2n_1" arrivalPos="990.00" arrivalPosLat="0.00" arrivalSpeed="15.69" duration="129.10" routeLength="1997.01" waitingTime="0.00" waitingCount="0" stopTime="0.00" timeLoss="4.63" rerouteNo="1" devices="tripinfo_car_s2n_56 routing_car_s2n_56" vType="Car" speedFactor="1.15" vaporized=""/>
    <tripinfo id="car_n2s_48" depart="48.00" departLane="n2sep_1" departPos="3.60" departPosLat="0.00" departSpeed="13.90" departDelay="0.00" arrival="192.00" arrivalLane="c2s_1" arrivalPos="990.00" arrivalPosLat="0.00" arrivalSpeed="13.90" duration="144.00" routeLength="1997.01" waitingTime="0.00" waitingCount="0" stopTime="0.00" timeLoss="0.31" rerouteNo="1" devices="tripinfo_car_n2s_48 routing_car_n2s_48" vType="Car" speedFactor="1.00" vaporized=""/>
    <tripinfo id="car_e2n_56" depart="56.00" departLane="e2sep_1" departPos="3.60" departPosLat="0.00" departSpeed="13.90" departDelay="0.00" arrival="206.75" arrivalLane="c2n_1" arrivalPos="990.00" arrivalPosLat="0.00" arrivalSpeed="16.38" duration="150.75" routeLength="1986.69" waitingTime="13.65" waitingCount="1" stopTime="0.00" timeLoss="28.86" rerouteNo="1" devices="tripinfo_car_e2n_56 routing_car_e2n_56" vType="Car" speedFactor="1.18" vaporized=""/>
    <tripinfo id="car_e2w_19" depart="19.00" departLane="e2sep_1" departPos="3.60" departPosLat="0.00" departSpeed="13.90" departDelay="0.00" arrival="208.95" arrivalLane="c2w_1" arrivalPos="990.00" arrivalPosLat="0.00" arrivalSpeed="14.27" duration="189.95" routeLength="1997.01" waitingTime="42.80" waitingCount="1" stopTime="0.00" timeLoss="49.93" rerouteNo="1" devices="tripinfo_car_e2w_19 routing_car_e2w_19" vType="Car" speedFactor="1.03" vaporized=""/>
    <tripinfo id="car_w2s_23" depart="24.50" departLane="w2sep_1" departPos="3.60" departPosLat="0.00" departSpeed="13.90" departDelay="1.50" arrival="209.90" arrivalLane="c2s_1" arrivalPos="990.00" arrivalPosLat="0.00" arrivalSpeed="14.54" duration="185.40" routeLength="1986.69" waitingTime="34.65" waitingCount="1" stopTime="0.00" timeLoss="48.05" rerouteNo="1" devices="tripinfo_car_w2s_23 routing_car_w2s_23" vType="Car" speedFactor="1.05" vaporized=""/>
    <tripinfo id="car_w2e_23" depart="23.00" departLane="w2sep_1" departPos="3.60" departPosLat="0.00" departSpeed="13.90" departDelay="0.00" arrival="210.70" arrivalLane="c2e_1" arrivalPos="990.00" arrivalPosLat="0.00" arrivalSpeed="13.90" duration="187.70" routeLength="1997.01" waitingTime="36.20" waitingCount="1" stopTime="0.00" timeLoss="44.02" rerouteNo="1" devices="tripinfo_car_w2e_23 routing_car_w2e_23" vType="Car" speedFactor="1.00" vaporized=""/>
    <tripinfo id="car_e2w_26" depart="26.00" departLane="e2sep_1" departPos="3.60" departPosLat="0.00" departSpeed="13.90" departDelay="0.00" arrival="214.45" arrivalLane="c2w_1" arrivalPos="990.00" arrivalPosLat="0.00" arrivalSpeed="13.90" duration="188.45" routeLength="1997.01" waitingTime="34.65" waitingCount="1" stopTime="0.00" timeLoss="44.77" rerouteNo="1" devices="tripinfo_car_e2w_26 routing_car_e2w_26" vType="Car" speedFactor="1.00" vaporized=""/>
    <tripinfo id="car_w2s_29" depart="29.00" departLane="w2sep_1" departPos="3.60" departPosLat="0.00" departSpeed="13.90" departDelay="0.00" arrival="216.55" arrivalLane="c2s_1" arrivalPos="990.00" arrivalPosLat="0.00" arrivalSpeed="13.90" duration="187.55" routeLength="1986.69" waitingTime="31.60" waitingCount="1" stopTime="0.00" timeLoss="43.88" rerouteNo="1" devices="tripinfo_car_w2s_29 routing_car_w2s_29" vType="Car" speedFactor="1.00" vaporized=""/>
    <tripinfo id="car_w2e_72" depart="73.25" departLane="w2sep_1" departPos="3.60" departPosLat="0.00" departSpeed="13.90" departDelay="1.25" arrival="217.70" arrivalLane="c2e_1" arrivalPos="990.00" arrivalPosLat="0.00" arrivalSpeed="14.32" duration="144.45" routeLength="1997.01" waitingTime="0.00" waitingCount="0" stopTime="0.00" timeLoss="5.02" rerouteNo="1" devices="tripinfo_car_w2e_72 routing_car_w2e_72" vType="Car" speedFactor="1.03" vaporized=""/>
    <tripinfo id="car_e2w_47" depart="47.00" departLane="e2sep_1" departPos="3.60" departPosLat="0.00" departSpeed="13.90" departDelay="0.00" arrival="218.25" arrivalLane="c2w_1" arrivalPos="990.00" arrivalPosLat="0.00" arrivalSpeed="13.88" duration="171.25" routeLength="1997.01" waitingTime="14.30" waitingCount="1" stopTime="0.00" timeLoss="27.56" rerouteNo="1" devices="tripinfo_car_e2w_47 routing_car_e2w_47" vType="Car" speedFactor="1.00" vaporized=""/>
    <tripinfo id="car_e2n_80" depart="80.00" departLane="e2sep_1" departPos="3.60" departPosLat="0.00" departSpeed="13.90" departDelay="0.00" arrival="218.75" arrivalLane="c2n_1" arrivalPos="990.00" arrivalPosLat="0.00" arrivalSpeed="15.12" duration="138.75" routeLength="1986.69" waitingTime="0.00" waitingCount="0" stopTime="0.00" timeLoss="6.69" rerouteNo="1" devices="tripinfo_car_e2n_80 routing_car_e2n_80" vType="Car" speedFactor="1.09" vaporized=""/>
    <tripinfo id="car_w2s_56" depart="56.00" departLane="w2sep_1" departPos="3.60" departPosLat="0.00" departSpeed="13.90" departDelay="0.00" arrival="220.60" arrivalLane="c2s_1" arrivalPos="990.00" arrivalPosLat="0.00" arrivalSpeed="13.88" duration="164.60" routeLength="1986.69" waitingTime="6.30" waitingCount="1" stopTime="0.00" timeLoss="20.91" rerouteNo="1" devices="tripinfo_car_w2s_56 routing_car_w2s_56" vType="Car" speedFactor="1.00" vaporized=""/>
    <tripinfo id="car_e2w_69" depart="69.00" departLane="e2sep_1" departPos="3.60" departPosLat="0.00" departSpeed="13.90" departDelay="0.00" arrival="221.70" arrivalLane="c2w_1" arrivalPos="990.00" arrivalPosLat="0.00" arrivalSpeed="13.87" duration="152.70" routeLength="1997.01" waitingTime="0.00" waitingCount="0" stopTime="0.00" timeLoss="9.02" rerouteNo="1" devices="tripinfo_car_e2w_69 routing_car_e2w_69" vType="Car" speedFactor="1.00" vaporized=""/>
    <tripinfo id="car_e2s_36" depart="36.00" departLane="e2sep_1" departPos="3.60" departPosLat="0.00" departSpeed="13.90" departDelay="0.00" arrival="224.05" arrivalLane="c2s_1" arrivalPos="990.00" arrivalPosLat="0.00" arrivalSpeed="14.01" duration="188.05" routeLength="1996.47" waitingTime="31.75" waitingCount="2" stopTime="0.00" timeLoss="45.15" rerouteNo="1" devices="tripinfo_car_e2s_36 routing_car_e2s_36" vType="Car" speedFactor="1.01" vaporized=""/>
    <tripinfo id="car_e2s_43" depart="43.00" departLane="e2sep_1" departPos="3.60" departPosLat="0.00" departSpeed="13.90" departDelay="0.00" arrival="226.95" arrivalLane="c2s_1" arrivalPos="990.00" arrivalPosLat="0.00" arrivalSpeed="14.18" duration="183.95" routeLength="1996.47" waitingTime="25.50" waitingCount="2" stopTime="0.00" timeLoss="43.32" rerouteNo="1" devices="tripinfo_car_e2s_43 routing_car_e2s_43" vType="Car" speedFactor="1.03" vaporized=""/>
    <tripinfo id="car_e2s_70" depart="70.45" departLane="e2sep_1" departPos="3.60" departPosLat="0.00" departSpeed="13.90" departDelay="0.45" arrival="228.75" arrivalLane="c2s_1" arrivalPos="990.00" arrivalPosLat="0.00" arrivalSpeed="15.44" duration="158.30" routeLength="1996.47" waitingTime="3.60" waitingCount="2" stopTime="0.00" timeLoss="35.93" rerouteNo="1" devices="tripinfo_car_e2s_70 routing_car_e2s_70" vType="Car" speedFactor="1.18" vaporized=""/>
    <tripinfo id="car_e2w_84" depart="84.00" departLane="e2sep_1" departPos="3.60" departPosLat="0.00" departSpeed="13.90" departDelay="0.00" arrival="228.90" arrivalLane="c2w_1" arrivalPos="990.00" arrivalPosLat="0.00" arrivalSpeed="13.90" duration="144.90" routeLength="1997.01" waitingTime="0.00" waitingCount="0" stopTime="0.00" timeLoss="1.22" rerouteNo="1" devices="tripinfo_car_e2w_84 routing_car_e2w_84" vType="Car" speedFactor="1.00" vaporized=""/>
    <tripinfo id="car_w2e_85" depart="85.00" departLane="w2sep_1" departPos="3.60" departPosLat="0.00" departSpeed="13.90" departDelay="0.00" arrival="229.20" arrivalLane="c2e_1" arrivalPos="990.00" arrivalPosLat="0.00" arrivalSpeed="13.90" duration="144.20" routeLength="1997.01" waitingTime="0.00" waitingCount="0" stopTime="0.00" timeLoss="0.49" rerouteNo="1" devices="tripinfo_car_w2e_85 routing_car_w2e_85" vType="Car" speedFactor="1.00" vaporized=""/>
    <tripinfo id="car_e2w_85" depart="85.50" departLane="e2sep_1" departPos="3.60" departPosLat="0.00" departSpeed="13.90" departDelay="0.50" arrival="233.80" arrivalLane="c2w_1" arrivalPos="990.00" arrivalPosLat="0.00" arrivalSpeed="13.89" duration="148.30" routeLength="1997.01" waitingTime="0.00" waitingCount="0" stopTime="0.00" timeLoss="4.60" rerouteNo="1" devices="tripinfo_car_e2w_85 routing_car_e2w_85" vType="Car" speedFactor="1.00" vaporized=""/>
    <tripinfo id="car_e2s_74" depart="74.00" departLane="e2sep_1" departPos="3.60" departPosLat="0.00" departSpeed="13.90" departDelay="0.00" arrival="234.20" arrivalLane="c2s_1" arrivalPos="990.00" arrivalPosLat="0.00" arrivalSpeed="14.15" duration="160.20" routeLength="1996.47" waitingTime="2.15" waitingCount="2" stopTime="0.00" timeLoss="18.42" rerouteNo="1" devices="tripinfo_car_e2s_74 routing_car_e2s_74" vType="Car" speedFactor="1.02" vaporized=""/>
    <tripinfo id="car_e2w_87" depart="87.35" departLane="e2sep_1" departPos="3.60" departPosLat="0.00" departSpeed="13.90" departDelay="0.35" arrival="235.60" arrivalLane="c2w_1" arrivalPos="990.00" arrivalPosLat="0.00" arrivalSpeed="15.36" duration="148.25" routeLength="1997.01" waitingTime="0.00" waitingCount="0" stopTime="0.00" timeLoss="25.34" rerouteNo="1" devices="tripinfo_car_e2w_87 routing_car_e2w_87" vType="Car" speedFactor="1.17" vaporized=""/>
    <tripinfo id="car_e2n_92" depart="92.00" departLane="e2sep_1" departPos="3.60" departPosLat="0.00" departSpeed="13.90" departDelay="0.00" arrival="240.95" arrivalLane="c2n_1" arrivalPos="990.00" arrivalPosLat="0.00" arrivalSpeed="13.94" duration="148.95" routeLength="1986.69" waitingTime="0.00" waitingCount="0" stopTime="0.00" timeLoss="5.75" rerouteNo="1" devices="tripinfo_car_e2n_92 routing_car_e2n_92" vType="Car" speedFactor="1.00" vaporized=""/>
    <tripinfo id="car_e2s_110" depart="110.00" departLane="e2sep_1" departPos="3.60" departPosLat="0.00" departSpeed="13.90" departDelay="0.00" arrival="241.85" arrivalLane="c2s_1" arrivalPos="990.00" arrivalPosLat="0.00" arrivalSpeed="15.73" duration="131.85" routeLength="1996.47" waitingTime="0.00" waitingCount="0" stopTime="0.00" timeLoss="4.33" rerouteNo="1" devices="tripinfo_car_e2s_110 routing_car_e2s_110" vType="Car" speedFactor="1.13" vaporized=""/>
    <tripinfo id="car_w2n_20" depart="20.00" departLane="w2sep_1" departPos="3.60" departPosLat="0.00" departSpeed="13.90" departDelay="0.00" arrival="244.00" arrivalLane="c2n_1" arrivalPos="990.00" arrivalPosLat="0.00" arrivalSpeed="14.48" duration="224.00" routeLength="1996.47" waitingTime="71.30" waitingCount="4" stopTime="0.00" timeLoss="86.17" rerouteNo="1" devices="tripinfo_car_w2n_20 routing_car_w2n_20" vType="Car" speedFactor="1.05" vaporized=""/>
    <tripinfo id="car_s2e_59" depart="59.00" departLane="s2sep_1" departPos="3.60" departPosLat="0.00" departSpeed="13.90" departDelay="0.00" arrival="245.55" arrivalLane="c2e_1" arrivalPos="990.00" arrivalPosLat="0.00" arrivalSpeed="16.29" duration="186.55" routeLength="1986.69" waitingTime="54.85" waitingCount="1" stopTime="0.00" timeLoss="63.93" rerouteNo="1" devices="tripinfo_car_s2e_59 routing_car_s2e_59" vType="Car" speedFactor="1.17" vaporized=""/>
    <tripinfo id="car_w2n_47" depart="47.00" departLane="w2sep_1" departPos="3.60" departPosLat="0.00" departSpeed="13.90" departDelay="0.00" arrival="246.15" arrivalLane="c2n_1" arrivalPos="990.00" arrivalPosLat="0.00" arrivalSpeed="15.20" duration="199.15" routeLength="1996.47" waitingTime="48.25" waitingCount="2" stopTime="0.00" timeLoss="70.60" rerouteNo="1" devices="tripinfo_car_w2n_47 routing_car_w2n_47" vType="Car" speedFactor="1.12" vaporized=""/>
    <tripinfo id="bus_w2n_49" depart="49.00" departLane="w2sep_1" departPos="12.10" departPosLat="0.00" departSpeed="13.90" departDelay="0.00" arrival="252.20" arrivalLane="c2n_1" arrivalPos="990.00" arrivalPosLat="0.00" arrivalSpeed="13.89" duration="203.20" routeLength="1987.97" waitingTime="39.60" waitingCount="2" stopTime="0.00" timeLoss="59.49" rerouteNo="1" devices="tripinfo_bus_w2n_49 routing_bus_w2n_49" vType="Bus" speedFactor="1.00" vaporized=""/>
    <tripinfo id="car_n2e_71" depart="71.00" departLane="n2sep_1" departPos="3.60" departPosLat="0.00" departSpeed="13.90" departDelay="0.00" arrival="254.50" arrivalLane="c2e_1" arrivalPos="990.00" arrivalPosLat="0.00" arrivalSpeed="15.32" duration="183.50" routeLength="1996.47" waitingTime="39.95" waitingCount="2" stopTime="0.00" timeLoss="52.57" rerouteNo="1" devices="tripinfo_car_n2e_71 routing_car_n2e_71" vType="Car" speedFactor="1.10" vaporized=""/>
    <tripinfo id="car_s2n_106" depart="106.00" departLane="s2sep_1" departPos="3.60" departPosLat="0.00" departSpeed="13.90" departDelay="0.00" arrival="254.70" arrivalLane="c2n_1" arrivalPos="990.00" arrivalPosLat="0.00" arrivalSpeed="15.43" duration="148.70" routeLength="1997.01" waitingTime="8.15" waitingCount="1" stopTime="0.00" timeLoss="22.94" rerouteNo="1" devices="tripinfo_car_s2n_106 routing_car_s2n_106" vType="Car" speedFactor="1.14" vaporized=""/>
    <tripinfo id="car_n2w_57" depart="57.00" departLane="n2sep_1" departPos="3.60" departPosLat="0.00" departSpeed="13.90" departDelay="0.00" arrival="255.30" arrivalLane="c2w_1" arrivalPos="990.00" arrivalPosLat="0.00" arrivalSpeed="13.97" duration="198.30" routeLength="1986.69" waitingTime="48.35" waitingCount="1" stopTime="0.00" timeLoss="55.37" rerouteNo="1" devices="tripinfo_car_n2w_57 routing_car_n2w_57" vType="Car" speedFactor="1.01" vaporized=""/>
    <tripinfo id="car_n2s_62" depart="62.00" departLane="n2sep_1" departPos="3.60" departPosLat="0.00" departSpeed="13.90" departDelay="0.00" arrival="257.90" arrivalLane="c2s_1" arrivalPos="990.00" arrivalPosLat="0.00" arrivalSpeed="13.90" duration="195.90" routeLength="1997.01" waitingTime="43.35" waitingCount="1" stopTime="0.00" timeLoss="52.19" rerouteNo="1" devices="tripinfo_car_n2s_62 routing_car_n2s_62" vType="Car" speedFactor="1.00" vaporized=""/>
    <tripinfo id="car_n2w_79" depart="79.00" departLane="n2sep_1" departPos="3.60" departPosLat="0.00" departSpeed="13.90" departDelay="0.00" arrival="259.30" arrivalLane="c2w_1" arrivalPos="990.00" arrivalPosLat="0.00" arrivalSpeed="14.40" duration="180.30" routeLength="1986.69" waitingTime="30.35" waitingCount="1" stopTime="0.00" timeLoss="41.84" rerouteNo="1" devices="tripinfo_car_n2w_79 routing_car_n2w_79" vType="Car" speedFactor="1.04" vaporized=""/>
    <tripinfo id="car_s2n_123" depart="124.50" departLane="s2sep_1" departPos="3.60" departPosLat="0.00" departSpeed="13.90" departDelay="1.50" arrival="259.40" arrivalLane="c2n_1" arrivalPos="990.00" arrivalPosLat="0.00" arrivalSpeed="16.36" duration="134.90" routeLength="1997.01" waitingTime="0.00" waitingCount="0" stopTime="0.00" timeLoss="12.96" rerouteNo="1" devices="tripinfo_car_s2n_123 routing_car_s2n_123" vType="Car" speedFactor="1.18" vaporized=""/>
    <tripinfo id="car_n2s_82" depart="82.15" departLane="n2sep_1" departPos="3.60" departPosLat="0.00" departSpeed="13.90" departDelay="0.15" arrival="262.65" arrivalLane="c2s_1" arrivalPos="990.00" arrivalPosLat="0.00" arrivalSpeed="14.03" duration="180.50" routeLength="1997.01" waitingTime="23.70" waitingCount="1" stopTime="0.00" timeLoss="38.27" rerouteNo="1" devices="tripinfo_car_n2s_82 routing_car_n2s_82" vType="Car" speedFactor="1.01" vaporized=""/>
    <tripinfo id="car_n2w_86" depart="86.00" departLane="n2sep_1" departPos="3.60" departPosLat="0.00" departSpeed="13.90" departDelay="0.00" arrival="265.55" arrivalLane="c2w_1" arrivalPos="990.00" arrivalPosLat="0.00" arrivalSpeed="13.90" duration="179.55" routeLength="1986.69" waitingTime="21.45" waitingCount="1" stopTime="0.00" timeLoss="35.88" rerouteNo="1" devices="tripinfo_car_n2w_86 routing_car_n2w_86" vType="Car" speedFactor="1.00" vaporized=""/>
    <tripinfo id="bus_s2e_119" depart="119.00" departLane="s2sep_1" departPos="12.10" departPosLat="0.00" departSpeed="13.90" departDelay="0.00" arrival="268.20" arrivalLane="c2e_1" arrivalPos="990.00" arrivalPosLat="0.00" arrivalSpeed="13.90" duration="149.20" routeLength="1978.19" waitingTime="0.00" waitingCount="0" stopTime="0.00" timeLoss="6.16" rerouteNo="1" devices="tripinfo_bus_s2e_119 routing_bus_s2e_119" vType="Bus" speedFactor="1.00" vaporized=""/>
    <tripinfo id="car_n2w_106" depart="106.00" departLane="n2sep_1" departPos="3.60" departPosLat="0.00" departSpeed="13.90" departDelay="0.00" arrival="269.65" arrivalLane="c2w_1" arrivalPos="990.00" arrivalPosLat="0.00" arrivalSpeed="13.89" duration="163.65" routeLength="1986.69" waitingTime="4.60" waitingCount="1" stopTime="0.00" timeLoss="19.96" rerouteNo="1" devices="tripinfo_car_n2w_106 routing_car_n2w_106" vType="Car" speedFactor="1.00" vaporized=""/>
    <tripinfo id="car_n2w_109" depart="109.00" departLane="n2sep_1" departPos="3.60" departPosLat="0.00" departSpeed="13.90" departDelay="0.00" arrival="272.55" arrivalLane="c2w_1" arrivalPos="990.00" arrivalPosLat="0.00" arrivalSpeed="14.14" duration="163.55" routeLength="1986.69" waitingTime="2.80" waitingCount="1" stopTime="0.00" timeLoss="23.19" rerouteNo="1" devices="tripinfo_car_n2w_109 routing_car_n2w_109" vType="Car" speedFactor="1.02" vaporized=""/>
    <tripinfo id="car_s2w_76" depart="76.00" departLane="s2sep_1" departPos="3.60" departPosLat="0.00" departSpeed="13.90" departDelay="0.00" arrival="274.70" arrivalLane="c2w_1" arrivalPos="990.00" arrivalPosLat="0.00" arrivalSpeed="14.80" duration="198.70" routeLength="1996.47" waitingTime="47.30" waitingCount="2" stopTime="0.00" timeLoss="66.50" rerouteNo="1" devices="tripinfo_car_s2w_76 routing_car_s2w_76" vType="Car" speedFactor="1.09" vaporized=""/>
    <tripinfo id="car_s2n_133" depart="133.00" departLane="s2sep_1" departPos="3.60" departPosLat="0.00" departSpeed="13.90" departDelay="0.00" arrival="276.10" arrivalLane="c2n_1" arrivalPos="990.00" arrivalPosLat="0.00" arrivalSpeed="14.46" duration="143.10" routeLength="1997.01" waitingTime="0.00" waitingCount="0" stopTime="0.00" timeLoss="4.91" rerouteNo="1" devices="tripinfo_car_s2n_133 routing_car_s2n_133" vType="Car" speedFactor="1.04" vaporized=""/>
    <tripinfo id="car_s2e_129" depart="129.00" departLane="s2sep_1" departPos="3.60" departPosLat="0.00" departSpeed="13.90" departDelay="0.00" arrival="277.25" arrivalLane="c2e_1" arrivalPos="990.00" arrivalPosLat="0.00" arrivalSpeed="13.97" duration="148.25" routeLength="1986.69" waitingTime="0.00" waitingCount="0" stopTime="0.00" timeLoss="5.32" rerouteNo="1" devices="tripinfo_car_s2e_129 routing_car_s2e_129" vType="Car" speedFactor="1.01" vaporized=""/>
    <tripinfo id="car_s2w_87" depart="87.00" departLane="s2sep_1" departPos="3.60" departPosLat="0.00" departSpeed="13.90" departDelay="0.00" arrival="277.70" arrivalLane="c2w_1" arrivalPos="990.00" arrivalPosLat="0.00" arrivalSpeed="14.07" duration="190.70" routeLength="1996.47" waitingTime="31.50" waitingCount="2" stopTime="0.00" timeLoss="48.74" rerouteNo="1" devices="tripinfo_car_s2w_87 routing_car_s2w_87" vType="Car" speedFactor="1.02" vaporized=""/>
    <tripinfo id="car_n2e_80" depart="80.40" departLane="n2sep_1" departPos="3.60" departPosLat="0.00" departSpeed="13.90" departDelay="0.40" arrival="280.80" arrivalLane="c2e_1" arrivalPos="990.00" arrivalPosLat="0.00" arrivalSpeed="14.47" duration="200.40" routeLength="1996.47" waitingTime="41.60" waitingCount="3" stopTime="0.00" timeLoss="62.09" rerouteNo="1" devices="tripinfo_car_n2e_80 routing_car_n2e_80" vType="Car" speedFactor="1.04" vaporized=""/>
    <tripinfo id="car_s2w_123" depart="123.00" departLane="s2sep_1" departPos="3.60" departPosLat="0.00" departSpeed="13.90" departDelay="0.00" arrival="280.95" arrivalLane="c2w_1" arrivalPos="990.00" arrivalPosLat="0.00" arrivalSpeed="13.86" duration="157.95" routeLength="1996.47" waitingTime="0.00" waitingCount="0" stopTime="0.00" timeLoss="13.62" rerouteNo="1" devices="tripinfo_car_s2w_123 routing_car_s2w_123" vType="Car" speedFactor="1.00" vaporized=""/>
    <tripinfo id="car_n2e_88" depart="88.00" departLane="n2sep_1" departPos="3.60" departPosLat="0.00" departSpeed="13.90" departDelay="0.00" arrival="283.25" arrivalLane="c2e_1" arrivalPos="990.00" arrivalPosLat="0.00" arrivalSpeed="15.02" duration="195.25" routeLength="1996.47" waitingTime="32.15" waitingCount="2" stopTime="0.00" timeLoss="63.54" rerouteNo="1" devices="tripinfo_car_n2e_88 routing_car_n2e_88" vType="Car" speedFactor="1.10" vaporized=""/>
    <tripinfo id="car_n2w_137" depart="137.00" departLane="n2sep_1" departPos="3.60" departPosLat="0.00" departSpeed="13.90" departDelay="0.00" arrival="283.90" arrivalLane="c2w_1" arrivalPos="990.00" arrivalPosLat="0.00" arrivalSpeed="14.13" duration="146.90" routeLength="1986.69" waitingTime="0.00" waitingCount="0" stopTime="0.00" timeLoss="6.32" rerouteNo="1" devices="tripinfo_car_n2w_137 routing_car_n2w_137" vType="Car" speedFactor="1.02" vaporized=""/>
    <tripinfo id="car_n2e_98" depart="98.00" departLane="n2sep_1" departPos="3.60" departPosLat="0.00" departSpeed="13.90" departDelay="0.00" arrival="288.35" arrivalLane="c2e_1" arrivalPos="990.00" arrivalPosLat="0.00" arrivalSpeed="13.90" duration="190.35" routeLength="1996.47" waitingTime="23.10" waitingCount="2" stopTime="0.00" timeLoss="46.01" rerouteNo="1" devices="tripinfo_car_n2e_98 routing_car_n2e_98" vType="Car" speedFactor="1.00" vaporized=""/>
    <tripinfo id="car_n2e_129" depart="129.00" departLane="n2sep_1" departPos="3.60" departPosLat="0.00" departSpeed="13.90" departDelay="0.00" arrival="290.20" arrivalLane="c2e_1" arrivalPos="990.00" arrivalPosLat="0.00" arrivalSpeed="15.27" duration="161.20" routeLength="1996.47" waitingTime="12.30" waitingCount="1" stopTime="0.00" timeLoss="36.19" rerouteNo="1" devices="tripinfo_car_n2e_129 routing_car_n2e_129" vType="Car" speedFactor="1.15" vaporized=""/>
    <tripinfo id="car_n2e_132" depart="132.00" departLane="n2sep_1" departPos="3.60" departPosLat="0.00" departSpeed="13.90" departDelay="0.00" arrival="292.10" arrivalLane="c2e_1" arrivalPos="990.00" arrivalPosLat="0.00" arrivalSpeed="15.55" duration="160.10" routeLength="1996.47" waitingTime="12.10" waitingCount="1" stopTime="0.00" timeLoss="36.91" rerouteNo="1" devices="tripinfo_car_n2e_132 routing_car_n2e_132" vType="Car" speedFactor="1.17" vaporized=""/>
    <tripinfo id="car_n2e_155" depart="155.00" departLane="n2sep_1" departPos="3.60" departPosLat="0.00" departSpeed="13.90" departDelay="0.00" arrival="293.95" arrivalLane="c2e_1" arrivalPos="990.00" arrivalPosLat="0.00" arrivalSpeed="15.64" duration="138.95" routeLength="1996.47" waitingTime="0.00" waitingCount="0" stopTime="0.00" timeLoss="16.61" rerouteNo="1" devices="tripinfo_car_n2e_155 routing_car_n2e_155" vType="Car" speedFactor="1.18" vaporized=""/>
    <tripinfo id="car_e2w_111" depart="111.25" departLane="e2sep_1" departPos="3.60" departPosLat="0.00" departSpeed="13.90" departDelay="0.25" arrival="295.55" arrivalLane="c2w_1" arrivalPos="990.00" arrivalPosLat="0.00" arrivalSpeed="15.05" duration="184.30" routeLength="1997.01" waitingTime="42.15" waitingCount="1" stopTime="0.00" timeLoss="51.54" rerouteNo="1" devices="tripinfo_car_e2w_111 routing_car_e2w_111" vType="Car" speedFactor="1.08" vaporized=""/>
    <tripinfo id="car_w2e_140" depart="140.40" departLane="w2sep_1" departPos="3.60" departPosLat="0.00" departSpeed="13.90" departDelay="0.40" arrival="301.15" arrivalLane="c2e_1" arrivalPos="990.00" arrivalPosLat="0.00" arrivalSpeed="13.90" duration="160.75" routeLength="1997.01" waitingTime="7.50" waitingCount="1" stopTime="0.00" timeLoss="17.06" rerouteNo="1" devices="tripinfo_car_w2e_140 routing_car_w2e_140" vType="Car" speedFactor="1.00" vaporized=""/>
    <tripinfo id="car_e2w_147" depart="147.00" departLane="e2sep_1" departPos="3.60" departPosLat="0.00" departSpeed="13.90" departDelay="0.00" arrival="302.55" arrivalLane="c2w_1" arrivalPos="990.00" arrivalPosLat="0.00" arrivalSpeed="14.17" duration="155.55" routeLength="1997.01" waitingTime="5.10" waitingCount="1" stopTime="0.00" timeLoss="14.63" rerouteNo="1" devices="tripinfo_car_e2w_147 routing_car_e2w_147" vType="Car" speedFactor="1.02" vaporized=""/>
    <tripinfo id="car_e2n_154" depart="154.00" departLane="e2sep_1" departPos="3.60" departPosLat="0.00" departSpeed="13.90" departDelay="0.00" arrival="305.00" arrivalLane="c2n_1" arrivalPos="990.00" arrivalPosLat="0.00" arrivalSpeed="13.90" duration="151.00" routeLength="1986.69" waitingTime="0.00" waitingCount="0" stopTime="0.00" timeLoss="7.36" rerouteNo="1" devices="tripinfo_car_e2n_154 routing_car_e2n_154" vType="Car" speedFactor="1.00" vaporized=""/>
    <tripinfo id="car_w2e_148" depart="148.00" departLane="w2sep_1" departPos="3.60" departPosLat="0.00" departSpeed="13.90" departDelay="0.00" arrival="305.05" arrivalLane="c2e_1" arrivalPos="990.00" arrivalPosLat="0.00" arrivalSpeed="14.65" duration="157.05" routeLength="1997.01" waitingTime="3.40" waitingCount="1" stopTime="0.00" timeLoss="20.95" rerouteNo="1" devices="tripinfo_car_w2e_148 routing_car_w2e_148" vType="Car" speedFactor="1.06" vaporized=""/>
    <tripinfo id="bus_w2s_146" depart="146.00" departLane="w2sep_1" departPos="12.10" departPosLat="0.00" departSpeed="13.90" departDelay="0.00" arrival="306.30" arrivalLane="c2s_1" arrivalPos="990.00" arrivalPosLat="0.00" arrivalSpeed="13.90" duration="160.30" routeLength="1978.19" waitingTime="5.05" waitingCount="1" stopTime="0.00" timeLoss="17.24" rerouteNo="1" devices="tripinfo_bus_w2s_146 routing_bus_w2s_146" vType="Bus" speedFactor="1.00" vaporized=""/>
    <tripinfo id="car_e2w_155" depart="155.45" departLane="e2sep_1" departPos="3.60" departPosLat="0.00" departSpeed="13.90" departDelay="0.45" arrival="306.50" arrivalLane="c2w_1" arrivalPos="990.00" arrivalPosLat="0.00" arrivalSpeed="14.33" duration="151.05" routeLength="1997.01" waitingTime="0.00" waitingCount="0" stopTime="0.00" timeLoss="11.89" rerouteNo="1" devices="tripinfo_car_e2w_155 routing_car_e2w_155" vType="Car" speedFactor="1.03" vaporized=""/>
    <tripinfo id="car_w2n_53" depart="53.00" departLane="w2sep_1" departPos="3.60" departPosLat="0.00" departSpeed="13.90" departDelay="0.00" arrival="307.10" arrivalLane="c2n_1" arrivalPos="990.00" arrivalPosLat="0.00" arrivalSpeed="15.26" duration="254.10" routeLength="1996.47" waitingTime="89.55" waitingCount="4" stopTime="0.00" timeLoss="126.59" rerouteNo="1" devices="tripinfo_car_w2n_53 routing_car_w2n_53" vType="Car" speedFactor="1.13" vaporized=""/>
    <tripinfo id="car_e2s_112" depart="112.90" departLane="e2sep_1" departPos="3.60" departPosLat="0.00" departSpeed="13.90" departDelay="0.90" arrival="309.00" arrivalLane="c2s_1" arrivalPos="990.00" arrivalPosLat="0.00" arrivalSpeed="15.27" duration="196.10" routeLength="1996.47" waitingTime="46.80" waitingCount="2" stopTime="0.00" timeLoss="67.16" rerouteNo="1" devices="tripinfo_car_e2s_112 routing_car_e2s_112" vType="Car" speedFactor="1.12" vaporized=""/>
    <tripinfo id="car_e2w_164" depart="164.00" departLane="e2sep_1" departPos="3.60" departPosLat="0.00" departSpeed="13.90" departDelay="0.00" arrival="309.90" arrivalLane="c2w_1" arrivalPos="990.00" arrivalPosLat="0.00" arrivalSpeed="14.34" duration="145.90" routeLength="1997.01" waitingTime="0.00" waitingCount="0" stopTime="0.00" timeLoss="7.01" rerouteNo="1" devices="tripinfo_car_e2w_164 routing_car_e2w_164" vType="Car" speedFactor="1.03" vaporized=""/>
    <tripinfo id="car_w2e_160" depart="160.00" departLane="w2sep_1" departPos="3.60" departPosLat="0.00" departSpeed="13.90" departDelay="0.00" arrival="310.60" arrivalLane="c2e_1" arrivalPos="990.00" arrivalPosLat="0.00" arrivalSpeed="14.00" duration="150.60" routeLength="1997.01" waitingTime="0.00" waitingCount="0" stopTime="0.00" timeLoss="7.97" rerouteNo="1" devices="tripinfo_car_w2e_160 routing_car_w2e_160" vType="Car" speedFactor="1.01" vaporized=""/>
    <tripinfo id="car_w2n_64" depart="64.00" departLane="w2sep_1" departPos="3.60" departPosLat="0.00" departSpeed="13.90" departDelay="0.00" arrival="313.30" arrivalLane="c2n_1" arrivalPos="990.00" arrivalPosLat="0.00" arrivalSpeed="14.17" duration="249.30" routeLength="1996.47" waitingTime="77.10" waitingCount="4" stopTime="0.00" timeLoss="107.73" rerouteNo="1" devices="tripinfo_car_w2n_64 routing_car_w2n_64" vType="Car" speedFactor="1.02" vaporized=""/>
    <tripinfo id="car_e2s_117" depart="117.00" departLane="e2sep_1" departPos="3.60" departPosLat="0.00" departSpeed="13.90" departDelay="0.00" arrival="314.60" arrivalLane="c2s_1" arrivalPos="990.00" arrivalPosLat="0.00" arrivalSpeed="14.12" duration="197.60" routeLength="1996.47" waitingTime="40.25" waitingCount="2" stopTime="0.00" timeLoss="55.51" rerouteNo="1" devices="tripinfo_car_e2s_117 routing_car_e2s_117" vType="Car" speedFactor="1.02" vaporized=""/>
    <tripinfo id="car_w2n_72" depart="72.00" departLane="w2sep_1" departPos="3.60" departPosLat="0.00" departSpeed="13.90" departDelay="0.00" arrival="315.25" arrivalLane="c2n_1" arrivalPos="990.00" arrivalPosLat="0.00" arrivalSpeed="15.46" duration="243.25" routeLength="1996.47" waitingTime="73.25" waitingCount="4" stopTime="0.00" timeLoss="118.64" rerouteNo="1" devices="tripinfo_car_w2n_72 routing_car_w2n_72" vType="Car" speedFactor="1.16" vaporized=""/>
    <tripinfo id="car_e2s_171" depart="171.00" departLane="e2sep_1" departPos="3.60" departPosLat="0.00" departSpeed="13.90" departDelay="0.00" arrival="318.10" arrivalLane="c2s_1" arrivalPos="990.00" arrivalPosLat="0.00" arrivalSpeed="14.29" duration="147.10" routeLength="1996.47" waitingTime="0.00" waitingCount="0" stopTime="0.00" timeLoss="7.01" rerouteNo="1" devices="tripinfo_car_e2s_171 routing_car_e2s_171" vType="Car" speedFactor="1.03" vaporized=""/>
    <tripinfo id="car_e2w_185" depart="185.00" departLane="e2sep_1" departPos="3.60" departPosLat="0.00" departSpeed="13.90" departDelay="0.00" arrival="318.15" arrivalLane="c2w_1" arrivalPos="990.00" arrivalPosLat="0.00" arrivalSpeed="15.18" duration="133.15" routeLength="1997.01" waitingTime="0.00" waitingCount="0" stopTime="0.00" timeLoss="1.57" rerouteNo="1" devices="tripinfo_car_e2w_185 routing_car_e2w_185" vType="Car" speedFactor="1.09" vaporized=""/>
    <tripinfo id="car_e2n_172" depart="172.40" departLane="e2sep_1" departPos="3.60" departPosLat="0.00" departSpeed="13.90" departDelay="0.40" arrival="322.25" arrivalLane="c2n_1" arrivalPos="990.00" arrivalPosLat="0.00" arrivalSpeed="13.90" duration="149.85" routeLength="1986.69" waitingTime="0.00" waitingCount="0" stopTime="0.00" timeLoss="6.20" rerouteNo="1" devices="tripinfo_car_e2n_172 routing_car_e2n_172" vType="Car" speedFactor="1.00" vaporized=""/>
    <tripinfo id="car_w2s_177" depart="178.45" departLane="w2sep_1" departPos="3.60" departPosLat="0.00" departSpeed="13.90" departDelay="1.45" arrival="324.55" arrivalLane="c2s_1" arrivalPos="990.00" arrivalPosLat="0.00" arrivalSpeed="14.49" duration="146.10" routeLength="1986.69" waitingTime="0.00" waitingCount="0" stopTime="0.00" timeLoss="8.31" rerouteNo="1" devices="tripinfo_car_w2s_177 routing_car_w2s_177" vType="Car" speedFactor="1.04" vaporized=""/>
    <tripinfo id="car_w2n_139" depart="139.00" departLane="w2sep_1" departPos="3.60" departPosLat="0.00" departSpeed="13.90" departDelay="0.00" arrival="326.80" arrivalLane="c2n_1" arrivalPos="990.00" arrivalPosLat="0.00" arrivalSpeed="14.21" duration="187.80" routeLength="1996.47" waitingTime="23.30" waitingCount="3" stopTime="0.00" timeLoss="46.74" rerouteNo="1" devices="tripinfo_car_w2n_139 routing_car_w2n_139" vType="Car" speedFactor="1.02" vaporized=""/>
    <tripinfo id="car_w2n_177" depart="177.00" departLane="w2sep_1" departPos="3.60" departPosLat="0.00" departSpeed="13.90" departDelay="0.00" arrival="333.45" arrivalLane="c2n_1" arrivalPos="990.00" arrivalPosLat="0.00" arrivalSpeed="13.92" duration="156.45" routeLength="1996.47" waitingTime="0.55" waitingCount="1" stopTime="0.00" timeLoss="12.38" rerouteNo="1" devices="tripinfo_car_w2n_177 routing_car_w2n_177" vType="Car" speedFactor="1.00" vaporized=""/>
    <tripinfo id="car_w2n_190" depart="190.00" departLane="w2sep_1" departPos="3.60" departPosLat="0.00" departSpeed="13.90" departDelay="0.00" arrival="336.40" arrivalLane="c2n_1" arrivalPos="990.00" arrivalPosLat="0.00" arrivalSpeed="14.42" duration="146.40" routeLength="1996.47" waitingTime="0.00" waitingCount="0" stopTime="0.00" timeLoss="8.06" rerouteNo="1" devices="tripinfo_car_w2n_190 routing_car_w2n_190" vType="Car" speedFactor="1.04" vaporized=""/>
    <tripinfo id="car_w2n_191" depart="191.40" departLane="w2sep_1" departPos="3.60" departPosLat="0.00" departSpeed="13.90" departDelay="0.40" arrival="338.70" arrivalLane="c2n_1" arrivalPos="990.00" arrivalPosLat="0.00" arrivalSpeed="14.89" duration="147.30" routeLength="1996.47" waitingTime="0.00" waitingCount="0" stopTime="0.00" timeLoss="14.99" rerouteNo="1" devices="tripinfo_car_w2n_191 routing_car_w2n_191" vType="Car" speedFactor="1.09" vaporized=""/>
    <tripinfo id="car_s2e_158" depart="158.00" departLane="s2sep_1" departPos="3.60" departPosLat="0.00" departSpeed="13.90" departDelay="0.00" arrival="339.20" arrivalLane="c2e_1" arrivalPos="990.00" arrivalPosLat="0.00" arrivalSpeed="15.32" duration="181.20" routeLength="1986.69" waitingTime="43.35" waitingCount="1" stopTime="0.00" timeLoss="50.85" rerouteNo="1" devices="tripinfo_car_s2e_158 routing_car_s2e_158" vType="Car" speedFactor="1.10" vaporized=""/>
    <tripinfo id="car_s2n_171" depart="171.00" departLane="s2sep_1" departPos="3.60" departPosLat="0.00" departSpeed="13.90" departDelay="0.00" arrival="342.15" arrivalLane="c2n_1" arrivalPos="990.00" arrivalPosLat="0.00" arrivalSpeed="15.89" duration="171.15" routeLength="1997.01" waitingTime="31.05" waitingCount="1" stopTime="0.00" timeLoss="45.94" rerouteNo="1" devices="tripinfo_car_s2n_171 routing_car_s2n_171" vType="Car" speedFactor="1.15" vaporized=""/>
    <tripinfo id="car_n2s_166" depart="166.00" departLane="n2sep_1" departPos="3.60" departPosLat="0.00" departSpeed="13.90" departDelay="0.00" arrival="344.60" arrivalLane="c2s_1" arrivalPos="990.00" arrivalPosLat="0.00" arrivalSpeed="14.13" duration="178.60" routeLength="1997.01" waitingTime="29.70" waitingCount="1" stopTime="0.00" timeLoss="37.28" rerouteNo="1" devices="tripinfo_car_n2s_166 routing_car_n2s_166" vType="Car" speedFactor="1.02" vaporized=""/>
    <tripinfo id="car_n2w_182" depart="182.00" departLane="n2sep_1" departPos="3.60" departPosLat="0.00" departSpeed="13.90" departDelay="0.00" arrival="347.50" arrivalLane="c2w_1" arrivalPos="990.00" arrivalPosLat="0.00" arrivalSpeed="14.00" duration="165.50" routeLength="1986.69" waitingTime="14.25" waitingCount="1" stopTime="0.00" timeLoss="22.83" rerouteNo="1" devices="tripinfo_car_n2w_182 routing_car_n2w_182" vType="Car" speedFactor="1.01" vaporized=""/>
    <tripinfo id="car_s2e_164" depart="164.00" departLane="s2sep_1" departPos="3.60" departPosLat="0.00" departSpeed="13.90" departDelay="0.00" arrival="348.80" arrivalLane="c2e_1" arrivalPos="990.00" arrivalPosLat="0.00" arrivalSpeed="13.90" duration="184.80" routeLength="1986.69" waitingTime="31.80" waitingCount="1" stopTime="0.00" timeLoss="41.11" rerouteNo="1" devices="tripinfo_car_s2e_164 routing_car_s2e_164" vType="Car" speedFactor="1.00" vaporized=""/>
    <tripinfo id="bus_s2e_178" depart="178.00" departLane="s2sep_1" departPos="12.10" departPosLat="0.00" departSpeed="13.90" departDelay="0.00" arrival="356.15" arrivalLane="c2e_1" arrivalPos="990.00" arrivalPosLat="0.00" arrivalSpeed="13.89" duration="178.15" routeLength="1978.19" waitingTime="21.65" waitingCount="1" stopTime="0.00" timeLoss="35.07" rerouteNo="1" devices="tripinfo_bus_s2e_178 routing_bus_s2e_178" vType="Bus" speedFactor="1.00" vaporized=""/>
    <tripinfo id="car_n2w_204" depart="205.15" departLane="n2sep_1" departPos="3.60" departPosLat="0.00" departSpeed="13.90" departDelay="1.15" arrival="356.25" arrivalLane="c2w_1" arrivalPos="990.00" arrivalPosLat="0.00" arrivalSpeed="13.90" duration="151.10" routeLength="1986.69" waitingTime="0.00" waitingCount="0" stopTime="0.00" timeLoss="7.44" rerouteNo="1" devices="tripinfo_car_n2w_204 routing_car_n2w_204" vType="Car" speedFactor="1.00" vaporized=""/>
    <tripinfo id="car_s2n_211" depart="211.00" departLane="s2sep_1" departPos="3.60" departPosLat="0.00" departSpeed="13.90" departDelay="0.00" arrival="356.90" arrivalLane="c2n_1" arrivalPos="990.00" arrivalPosLat="0.00" arrivalSpeed="13.90" duration="145.90" routeLength="1997.01" waitingTime="0.00" waitingCount="0" stopTime="0.00" timeLoss="2.24" rerouteNo="1" devices="tripinfo_car_s2n_211 routing_car_s2n_211" vType="Car" speedFactor="1.00" vaporized=""/>
    <tripinfo id="car_n2s_226" depart="226.00" departLane="n2sep_1" departPos="3.60" departPosLat="0.00" departSpeed="13.90" departDelay="0.00" arrival="358.60" arrivalLane="c2s_1" arrivalPos="990.00" arrivalPosLat="0.00" arrivalSpeed="16.25" duration="132.60" routeLength="1997.01" waitingTime="0.00" waitingCount="0" stopTime="0.00" timeLoss="9.68" rerouteNo="1" devices="tripinfo_car_n2s_226 routing_car_n2s_226" vType="Car" speedFactor="1.17" vaporized=""/>
    <tripinfo id="car_n2e_162" depart="162.00" departLane="n2sep_1" departPos="3.60" departPosLat="0.00" departSpeed="13.90" departDelay="0.00" arrival="359.05" arrivalLane="c2e_1" arrivalPos="990.00" arrivalPosLat="0.00" arrivalSpeed="14.93" duration="197.05" routeLength="1996.47" waitingTime="48.35" waitingCount="2" stopTime="0.00" timeLoss="64.25" rerouteNo="1" devices="tripinfo_car_n2e_162 routing_car_n2e_162" vType="Car" speedFactor="1.09" vaporized=""/>
    <tripinfo id="car_s2w_184" depart="184.00" departLane="s2sep_1" departPos="3.60" departPosLat="0.00" departSpeed="13.90" departDelay="0.00" arrival="360.15" arrivalLane="c2w_1" arrivalPos="990.00" arrivalPosLat="0.00" arrivalSpeed="14.11" duration="176.15" routeLength="1996.47" waitingTime="20.55" waitingCount="2" stopTime="0.00" timeLoss="34.19" rerouteNo="1" devices="tripinfo_car_s2w_184 routing_car_s2w_184" vType="Car" speedFactor="1.02" vaporized=""/>
    <tripinfo id="car_n2e_182" depart="183.45" departLane="n2sep_1" departPos="3.60" departPosLat="0.00" departSpeed="13.90" departDelay="1.45" arrival="363.15" arrivalLane="c2e_1" arrivalPos="990.00" arrivalPosLat="0.00" arrivalSpeed="14.19" duration="179.70" routeLength="1996.47" waitingTime="19.70" waitingCount="2" stopTime="0.00" timeLoss="38.48" rerouteNo="1" devices="tripinfo_car_n2e_182 routing_car_n2e_182" vType="Car" speedFactor="1.02" vaporized=""/>
    <tripinfo id="car_n2w_224" depart="224.00" departLane="n2sep_1" departPos="3.60" departPosLat="0.00" departSpeed="13.90" departDelay="0.00" arrival="364.00" arrivalLane="c2w_1" arrivalPos="990.00" arrivalPosLat="0.00" arrivalSpeed="14.77" duration="140.00" routeLength="1986.69" waitingTime="0.00" waitingCount="0" stopTime="0.00" timeLoss="5.07" rerouteNo="1" devices="tripinfo_car_n2w_224 routing_car_n2w_224" vType="Car" speedFactor="1.06" vaporized=""/>
    <tripinfo id="car_s2n_219" depart="220.35" departLane="s2sep_1" departPos="3.60" departPosLat="0.00" departSpeed="13.90" departDelay="1.35" arrival="364.65" arrivalLane="c2n_1" arrivalPos="990.00" arrivalPosLat="0.00" arrivalSpeed="14.09" duration="144.30" routeLength="1997.01" waitingTime="0.00" waitingCount="0" stopTime="0.00" timeLoss="2.57" rerouteNo="1" devices="tripinfo_car_s2n_219 routing_car_s2n_219" vType="Car" speedFactor="1.01" vaporized=""/>
    <tripinfo id="car_s2w_219" depart="219.00" departLane="s2sep_1" departPos="3.60" departPosLat="0.00" departSpeed="13.90" departDelay="0.00" arrival="368.20" arrivalLane="c2w_1" arrivalPos="990.00" arrivalPosLat="0.00" arrivalSpeed="14.89" duration="149.20" routeLength="1996.47" waitingTime="5.55" waitingCount="1" stopTime="0.00" timeLoss="14.66" rerouteNo="1" devices="tripinfo_car_s2w_219 routing_car_s2w_219" vType="Car" speedFactor="1.07" vaporized=""/>
    <tripinfo id="car_s2e_222" depart="222.10" departLane="s2sep_1" departPos="3.60" departPosLat="0.00" departSpeed="13.90" departDelay="0.10" arrival="369.60" arrivalLane="c2e_1" arrivalPos="990.00" arrivalPosLat="0.00" arrivalSpeed="14.38" duration="147.50" routeLength="1986.69" waitingTime="0.00" waitingCount="0" stopTime="0.00" timeLoss="8.61" rerouteNo="1" devices="tripinfo_car_s2e_222 routing_car_s2e_222" vType="Car" speedFactor="1.03" vaporized=""/>
    <tripinfo id="car_n2e_202" depart="202.00" departLane="n2sep_1" departPos="3.60" departPosLat="0.00" departSpeed="13.90" departDelay="0.00" arrival="372.80" arrivalLane="c2e_1" arrivalPos="990.00" arrivalPosLat="0.00" arrivalSpeed="14.74" duration="170.80" routeLength="1996.47" waitingTime="11.20" waitingCount="2" stopTime="0.00" timeLoss="35.27" rerouteNo="1" devices="tripinfo_car_n2e_202 routing_car_n2e_202" vType="Car" speedFactor="1.07" vaporized=""/>
    <tripinfo id="car_n2e_203" depart="203.35" departLane="n2sep_1" departPos="3.60" departPosLat="0.00" departSpeed="13.90" departDelay="0.35" arrival="377.95" arrivalLane="c2e_1" arrivalPos="990.00" arrivalPosLat="0.00" arrivalSpeed="13.90" duration="174.60" routeLength="1996.47" waitingTime="9.65" waitingCount="2" stopTime="0.00" timeLoss="30.28" rerouteNo="1" devices="tripinfo_car_n2e_203 routing_car_n2e_203" vType="Car" speedFactor="1.00" vaporized=""/>
    <tripinfo id="car_s2w_246" depart="246.00" departLane="s2sep_1" departPos="3.60" departPosLat="0.00" departSpeed="13.90" departDelay="0.00" arrival="381.55" arrivalLane="c2w_1" arrivalPos="990.00" arrivalPosLat="0.00" arrivalSpeed="15.23" duration="135.55" routeLength="1996.47" waitingTime="0.00" waitingCount="0" stopTime="0.00" timeLoss="3.84" rerouteNo="1" devices="tripinfo_car_s2w_246 routing_car_s2w_246" vType="Car" speedFactor="1.10" vaporized=""/>
    <tripinfo id="car_w2e_193" depart="193.10" departLane="w2sep_1" departPos="3.60" departPosLat="0.00" departSpeed="13.90" departDelay="0.10" arrival="387.15" arrivalLane="c2e_1" arrivalPos="990.00" arrivalPosLat="0.00" arrivalSpeed="14.69" duration="194.05" routeLength="1997.01" waitingTime="46.60" waitingCount="1" stopTime="0.00" timeLoss="58.11" rerouteNo="1" devices="tripinfo_car_w2e_193 routing_car_w2e_193" vType="Car" speedFactor="1.06" vaporized=""/>
    <tripinfo id="car_e2n_187" depart="187.00" departLane="e2sep_1" departPos="3.60" departPosLat="0.00" departSpeed="13.90" departDelay="0.00" arrival="388.10" arrivalLane="c2n_1" arrivalPos="990.00" arrivalPosLat="0.00" arrivalSpeed="14.42" duration="201.10" routeLength="1986.69" waitingTime="54.95" waitingCount="1" stopTime="0.00" timeLoss="62.67" rerouteNo="1" devices="tripinfo_car_e2n_187 routing_car_e2n_187" vType="Car" speedFactor="1.04" vaporized=""/>
    <tripinfo id="car_e2w_248" depart="248.00" departLane="e2sep_1" departPos="3.60" departPosLat="0.00" departSpeed="13.90" departDelay="0.00" arrival="389.55" arrivalLane="c2w_1" arrivalPos="990.00" arrivalPosLat="0.00" arrivalSpeed="16.36" duration="141.55" routeLength="1997.01" waitingTime="6.30" waitingCount="1" stopTime="0.00" timeLoss="19.47" rerouteNo="1" devices="tripinfo_car_e2w_248 routing_car_e2w_248" vType="Car" speedFactor="1.18" vaporized=""/>
    <tripinfo id="car_w2e_196" depart="196.00" departLane="w2sep_1" departPos="3.60" departPosLat="0.00" departSpeed="13.90" departDelay="0.00" arrival="390.40" arrivalLane="c2e_1" arrivalPos="990.00" arrivalPosLat="0.00" arrivalSpeed="15.06" duration="194.40" routeLength="1997.01" waitingTime="45.15" waitingCount="1" stopTime="0.00" timeLoss="62.35" rerouteNo="1" devices="tripinfo_car_w2e_196 routing_car_w2e_196" vType="Car" speedFactor="1.09" vaporized=""/>
    <tripinfo id="car_e2n_193" depart="193.00" departLane="e2sep_1" departPos="3.60" departPosLat="0.00" departSpeed="13.90" departDelay="0.00" arrival="393.85" arrivalLane="c2n_1" arrivalPos="990.00" arrivalPosLat="0.00" arrivalSpeed="14.04" duration="200.85" routeLength="1986.69" waitingTime="48.30" waitingCount="1" stopTime="0.00" timeLoss="58.59" rerouteNo="1" devices="tripinfo_car_e2n_193 routing_car_e2n_193" vType="Car" speedFactor="1.01" vaporized=""/>
    <tripinfo id="car_e2n_201" depart="201.00" departLane="e2sep_1" departPos="3.60" departPosLat="0.00" departSpeed="13.90" departDelay="0.00" arrival="396.15" arrivalLane="c2n_1" arrivalPos="990.00" arrivalPosLat="0.00" arrivalSpeed="14.95" duration="195.15" routeLength="1986.69" waitingTime="46.30" waitingCount="1" stopTime="0.00" timeLoss="64.18" rerouteNo="1" devices="tripinfo_car_e2n_201 routing_car_e2n_201" vType="Car" speedFactor="1.10" vaporized=""/>
    <tripinfo id="car_w2e_212" depart="212.00" departLane="w2sep_1" departPos="3.60" departPosLat="0.00" departSpeed="13.90" departDelay="0.00" arrival="396.50" arrivalLane="c2e_1" arrivalPos="990.00" arrivalPosLat="0.00" arrivalSpeed="13.90" duration="184.50" routeLength="1997.01" waitingTime="29.95" waitingCount="1" stopTime="0.00" timeLoss="40.80" rerouteNo="1" devices="tripinfo_car_w2e_212 routing_car_w2e_212" vType="Car" speedFactor="1.00" vaporized=""/>
    <tripinfo id="car_w2s_225" depart="225.00" departLane="w2sep_1" departPos="3.60" departPosLat="0.00" departSpeed="13.90" departDelay="0.00" arrival="397.30" arrivalLane="c2s_1" arrivalPos="990.00" arrivalPosLat="0.00" arrivalSpeed="13.90" duration="172.30" routeLength="1986.69" waitingTime="18.15" waitingCount="1" stopTime="0.00" timeLoss="28.61" rerouteNo="1" devices="tripinfo_car_w2s_225 routing_car_w2s_225" vType="Car" speedFactor="1.00" vaporized=""/>
    <tripinfo id="car_e2w_252" depart="252.50" departLane="e2sep_1" departPos="3.60" departPosLat="0.00" departSpeed="13.90" departDelay="0.50" arrival="397.75" arrivalLane="c2w_1" arrivalPos="990.00" arrivalPosLat="0.00" arrivalSpeed="14.89" duration="145.25" routeLength="1997.01" waitingTime="0.00" waitingCount="0" stopTime="0.00" timeLoss="11.07" rerouteNo="1" devices="tripinfo_car_e2w_252 routing_car_e2w_252" vType="Car" speedFactor="1.07" vaporized=""/>
    <tripinfo id="car_e2n_233" depart="233.00" departLane="e2sep_1" departPos="3.60" departPosLat="0.00" departSpeed="13.90" departDelay="0.00" arrival="398.45" arrivalLane="c2n_1" arrivalPos="990.00" arrivalPosLat="0.00" arrivalSpeed="15.00" duration="165.45" routeLength="1986.69" waitingTime="16.15" waitingCount="1" stopTime="0.00" timeLoss="34.65" rerouteNo="1" devices="tripinfo_car_e2n_233 routing_car_e2n_233" vType="Car" speedFactor="1.10" vaporized=""/>
    <tripinfo id="car_w2e_232" depart="232.00" departLane="w2sep_1" departPos="3.60" departPosLat="0.00" departSpeed="13.90" departDelay="0.00" arrival="400.10" arrivalLane="c2e_1" arrivalPos="990.00" arrivalPosLat="0.00" arrivalSpeed="14.10" duration="168.10" routeLength="1997.01" waitingTime="13.35" waitingCount="1" stopTime="0.00" timeLoss="26.81" rerouteNo="1" devices="tripinfo_car_w2e_232 routing_car_w2e_232" vType="Car" speedFactor="1.02" vaporized=""/>
    <tripinfo id="car_w2s_249" depart="249.00" departLane="w2sep_1" departPos="3.60" departPosLat="0.00" departSpeed="13.90" departDelay="0.00" arrival="402.40" arrivalLane="c2s_1" arrivalPos="990.00" arrivalPosLat="0.00" arrivalSpeed="13.96" duration="153.40" routeLength="1986.69" waitingTime="0.00" waitingCount="0" stopTime="0.00" timeLoss="10.34" rerouteNo="1" devices="tripinfo_car_w2s_249 routing_car_w2s_249" vType="Car" speedFactor="1.00" vaporized=""/>
    <tripinfo id="car_w2e_258" depart="258.00" departLane="w2sep_1" departPos="3.60" departPosLat="0.00" departSpeed="13.90" departDelay="0.00" arrival="403.35" arrivalLane="c2e_1" arrivalPos="990.00" arrivalPosLat="0.00" arrivalSpeed="14.29" duration="145.35" routeLength="1997.01" waitingTime="0.00" waitingCount="0" stopTime="0.00" timeLoss="6.06" rerouteNo="1" devices="tripinfo_car_w2e_258 routing_car_w2e_258" vType="Car" speedFactor="1.03" vaporized=""/>
    <tripinfo id="car_e2w_263" depart="263.00" departLane="e2sep_1" departPos="3.60" departPosLat="0.00" departSpeed="13.90" departDelay="0.00" arrival="404.90" arrivalLane="c2w_1" arrivalPos="990.00" arrivalPosLat="0.00" arrivalSpeed="14.22" duration="141.90" routeLength="1997.01" waitingTime="0.00" waitingCount="0" stopTime="0.00" timeLoss="1.48" rerouteNo="1" devices="tripinfo_car_e2w_263 routing_car_e2w_263" vType="Car" speedFactor="1.02" vaporized=""/>
    <tripinfo id="car_e2s_251" depart="251.00" departLane="e2sep_1" departPos="3.60" departPosLat="0.00" departSpeed="13.90" departDelay="0.00" arrival="407.20" arrivalLane="c2s_1" arrivalPos="990.00" arrivalPosLat="0.00" arrivalSpeed="13.94" duration="156.20" routeLength="1996.47" waitingTime="4.00" waitingCount="1" stopTime="0.00" timeLoss="12.31" rerouteNo="1" devices="tripinfo_car_e2s_251 routing_car_e2s_251" vType="Car" speedFactor="1.00" vaporized=""/>
    <tripinfo id="car_e2w_265" depart="265.00" departLane="e2sep_1" departPos="3.60" departPosLat="0.00" departSpeed="13.90" departDelay="0.00" arrival="407.95" arrivalLane="c2w_1" arrivalPos="990.00" arrivalPosLat="0.00" arrivalSpeed="14.67" duration="142.95" routeLength="1997.01" waitingTime="0.00" waitingCount="0" stopTime="0.00" timeLoss="7.51" rerouteNo="1" devices="tripinfo_car_e2w_265 routing_car_e2w_265" vType="Car" speedFactor="1.06" vaporized=""/>
    <tripinfo id="car_w2n_198" depart="198.00" departLane="w2sep_1" departPos="3.60" departPosLat="0.00" departSpeed="13.90" departDelay="0.00" arrival="408.65" arrivalLane="c2n_1" arrivalPos="990.00" arrivalPosLat="0.00" arrivalSpeed="15.59" duration="210.65" routeLength="1996.47" waitingTime="62.80" waitingCount="2" stopTime="0.00" timeLoss="81.95" rerouteNo="1" devices="tripinfo_car_w2n_198 routing_car_w2n_198" vType="Car" speedFactor="1.12" vaporized=""/>
    <tripinfo id="car_e2w_269" depart="269.00" departLane="e2sep_1" departPos="3.60" departPosLat="0.00" departSpeed="13.90" departDelay="0.00" arrival="412.10" arrivalLane="c2w_1" arrivalPos="990.00" arrivalPosLat="0.00" arrivalSpeed="14.33" duration="143.10" routeLength="1997.01" waitingTime="0.00" waitingCount="0" stopTime="0.00" timeLoss="3.89" rerouteNo="1" devices="tripinfo_car_e2w_269 routing_car_e2w_269" vType="Car" speedFactor="1.03" vaporized=""/>
    <tripinfo id="car_w2n_293" depart="293.00" departLane="w2sep_1" departPos="3.60" departPosLat="0.00" departSpeed="13.90" departDelay="0.00" arrival="415.50" arrivalLane="c2n_1" arrivalPos="990.00" arrivalPosLat="0.00" arrivalSpeed="17.04" duration="122.50" routeLength="1996.47" waitingTime="0.00" waitingCount="0" stopTime="0.00" timeLoss="4.77" rerouteNo="1" devices="tripinfo_car_w2n_293 routing_car_w2n_293" vType="Car" speedFactor="1.23" vaporized=""/>
    <tripinfo id="amb_w2e_300" depart="300.00" departLane="w2sep_1" departPos="6.60" departPosLat="0.00" departSpeed="13.90" departDelay="0.00" arrival="419.50" arrivalLane="c2e_1" arrivalPos="990.00" arrivalPosLat="0.00" arrivalSpeed="20.85" duration="119.50" routeLength="1994.01" waitingTime="0.00" waitingCount="0" stopTime="0.00" timeLoss="23.86" rerouteNo="1" devices="tripinfo_amb_w2e_300 routing_amb_w2e_300 bluelight_amb_w2e_300 fcd_amb_w2e_300" vType="Ambulance" speedFactor="1.50" vaporized="">
        <example_device customValue1="0.00" customValue2="-1.00"/>
    </tripinfo>
    <tripinfo id="bus_w2s_271" depart="271.00" departLane="w2sep_1" departPos="12.10" departPosLat="0.00" departSpeed="13.90" departDelay="0.00" arrival="419.85" arrivalLane="c2s_1" arrivalPos="990.00" arrivalPosLat="0.00" arrivalSpeed="13.90" duration="148.85" routeLength="1978.19" waitingTime="0.00" waitingCount="0" stopTime="0.00" timeLoss="5.80" rerouteNo="1" devices="tripinfo_bus_w2s_271 routing_bus_w2s_271" vType="Bus" speedFactor="1.00" vaporized=""/>
    <tripinfo id="car_e2s_274" depart="274.00" departLane="e2sep_1" departPos="3.60" departPosLat="0.00" departSpeed="13.90" departDelay="0.00" arrival="424.40" arrivalLane="c2s_1" arrivalPos="990.00" arrivalPosLat="0.00" arrivalSpeed="14.00" duration="150.40" routeLength="1996.47" waitingTime="0.00" waitingCount="0" stopTime="0.00" timeLoss="7.26" rerouteNo="1" devices="tripinfo_car_e2s_274 routing_car_e2s_274" vType="Car" speedFactor="1.01" vaporized=""/>
    <tripinfo id="car_e2s_283" depart="283.00" departLane="e2sep_1" departPos="3.60" departPosLat="0.00" departSpeed="13.90" departDelay="0.00" arrival="426.85" arrivalLane="c2s_1" arrivalPos="990.00" arrivalPosLat="0.00" arrivalSpeed="14.64" duration="143.85" routeLength="1996.47" waitingTime="0.00" waitingCount="0" stopTime="0.00" timeLoss="8.73" rerouteNo="1" devices="tripinfo_car_e2s_283 routing_car_e2s_283" vType="Car" speedFactor="1.07" vaporized=""/>
    <tripinfo id="car_w2s_294" depart="294.20" departLane="w2sep_1" departPos="3.60" departPosLat="0.00" departSpeed="13.90" departDelay="0.20" arrival="440.60" arrivalLane="c2s_1" arrivalPos="990.00" arrivalPosLat="0.00" arrivalSpeed="14.06" duration="146.40" routeLength="1986.69" waitingTime="0.00" waitingCount="0" stopTime="0.00" timeLoss="4.38" rerouteNo="1" devices="tripinfo_car_w2s_294 routing_car_w2s_294" vType="Car" speedFactor="1.01" vaporized=""/>
    <tripinfo id="bus_w2n_295" depart="296.60" departLane="w2sep_1" departPos="12.10" departPosLat="0.00" departSpeed="13.90" departDelay="1.60" arrival="448.00" arrivalLane="c2n_1" arrivalPos="990.00" arrivalPosLat="0.00" arrivalSpeed="13.90" duration="151.40" routeLength="1987.97" waitingTime="0.00" waitingCount="0" stopTime="0.00" timeLoss="7.66" rerouteNo="1" devices="tripinfo_bus_w2n_295 routing_bus_w2n_295" vType="Bus" speedFactor="1.00" vaporized=""/>
    <tripinfo id="car_s2e_277" depart="277.00" departLane="s2sep_1" departPos="3.60" departPosLat="0.00" departSpeed="13.90" departDelay="0.00" arrival="450.25" arrivalLane="c2e_1" arrivalPos="990.00" arrivalPosLat="0.00" arrivalSpeed="14.35" duration="173.25" routeLength="1986.69" waitingTime="26.85" waitingCount="1" stopTime="0.00" timeLoss="34.06" rerouteNo="1" devices="tripinfo_car_s2e_277 routing_car_s2e_277" vType="Car" speedFactor="1.03" vaporized=""/>
    <tripinfo id="car_s2n_295" depart="295.00" departLane="s2sep_1" departPos="3.60" departPosLat="0.00" departSpeed="13.90" departDelay="0.00" arrival="450.75" arrivalLane="c2n_1" arrivalPos="990.00" arrivalPosLat="0.00" arrivalSpeed="15.29" duration="155.75" routeLength="1997.01" waitingTime="14.75" waitingCount="1" stopTime="0.00" timeLoss="27.37" rerouteNo="1" devices="tripinfo_car_s2n_295 routing_car_s2n_295" vType="Car" speedFactor="1.12" vaporized=""/>
    <tripinfo id="car_n2s_236" depart="236.00" departLane="n2sep_1" departPos="3.60" departPosLat="0.00" departSpeed="13.90" departDelay="0.00" arrival="452.05" arrivalLane="c2s_1" arrivalPos="990.00" arrivalPosLat="0.00" arrivalSpeed="14.03" duration="216.05" routeLength="1997.01" waitingTime="66.80" waitingCount="1" stopTime="0.00" timeLoss="73.63" rerouteNo="1" devices="tripinfo_car_n2s_236 routing_car_n2s_236" vType="Car" speedFactor="1.01" vaporized=""/>
    <tripinfo id="car_n2e_256" depart="256.00" departLane="n2sep_1" departPos="3.60" departPosLat="0.00" departSpeed="13.90" departDelay="0.00" arrival="454.10" arrivalLane="c2e_1" arrivalPos="990.00" arrivalPosLat="0.00" arrivalSpeed="15.30" duration="198.10" routeLength="1996.47" waitingTime="54.65" waitingCount="2" stopTime="0.00" timeLoss="67.25" rerouteNo="1" devices="tripinfo_car_n2e_256 routing_car_n2e_256" vType="Car" speedFactor="1.10" vaporized=""/>
    <tripinfo id="car_n2s_238" depart="238.00" departLane="n2sep_1" departPos="3.60" departPosLat="0.00" departSpeed="13.90" departDelay="0.00" arrival="454.40" arrivalLane="c2s_1" arrivalPos="990.00" arrivalPosLat="0.00" arrivalSpeed="14.97" duration="216.40" routeLength="1997.01" waitingTime="65.40" waitingCount="1" stopTime="0.00" timeLoss="85.33" rerouteNo="1" devices="tripinfo_car_n2s_238 routing_car_n2s_238" vType="Car" speedFactor="1.10" vaporized=""/>
    <tripinfo id="car_s2n_303" depart="303.00" departLane="s2sep_1" departPos="3.60" departPosLat="0.00" departSpeed="13.90" departDelay="0.00" arrival="456.25" arrivalLane="c2n_1" arrivalPos="990.00" arrivalPosLat="0.00" arrivalSpeed="14.22" duration="153.25" routeLength="1997.01" waitingTime="2.30" waitingCount="1" stopTime="0.00" timeLoss="12.86" rerouteNo="1" devices="tripinfo_car_s2n_303 routing_car_s2n_303" vType="Car" speedFactor="1.02" vaporized=""/>
    <tripinfo id="car_n2s_274" depart="274.00" departLane="n2sep_1" departPos="3.60" departPosLat="0.00" departSpeed="13.90" departDelay="0.00" arrival="456.60" arrivalLane="c2s_1" arrivalPos="990.00" arrivalPosLat="0.00" arrivalSpeed="15.21" duration="182.60" routeLength="1997.01" waitingTime="32.90" waitingCount="1" stopTime="0.00" timeLoss="54.14" rerouteNo="1" devices="tripinfo_car_n2s_274 routing_car_n2s_274" vType="Car" speedFactor="1.12" vaporized=""/>
    <tripinfo id="car_n2w_270" depart="270.00" departLane="n2sep_1" departPos="3.60" departPosLat="0.00" departSpeed="13.90" departDelay="0.00" arrival="456.95" arrivalLane="c2w_1" arrivalPos="990.00" arrivalPosLat="0.00" arrivalSpeed="13.90" duration="186.95" routeLength="1986.69" waitingTime="33.65" waitingCount="1" stopTime="0.00" timeLoss="43.29" rerouteNo="1" devices="tripinfo_car_n2w_270 routing_car_n2w_270" vType="Car" speedFactor="1.00" vaporized=""/>
    <tripinfo id="car_n2w_311" depart="311.00" departLane="n2sep_1" departPos="3.60" departPosLat="0.00" departSpeed="13.90" departDelay="0.00" arrival="458.85" arrivalLane="c2w_1" arrivalPos="990.00" arrivalPosLat="0.00" arrivalSpeed="15.42" duration="147.85" routeLength="1986.69" waitingTime="4.65" waitingCount="1" stopTime="0.00" timeLoss="24.47" rerouteNo="1" devices="tripinfo_car_n2w_311 routing_car_n2w_311" vType="Car" speedFactor="1.16" vaporized=""/>
    <tripinfo id="car_n2s_290" depart="290.00" departLane="n2sep_1" departPos="3.60" departPosLat="0.00" departSpeed="13.90" departDelay="0.00" arrival="460.45" arrivalLane="c2s_1" arrivalPos="990.00" arrivalPosLat="0.00" arrivalSpeed="14.40" duration="170.45" routeLength="1997.01" waitingTime="18.65" waitingCount="1" stopTime="0.00" timeLoss="31.92" rerouteNo="1" devices="tripinfo_car_n2s_290 routing_car_n2s_290" vType="Car" speedFactor="1.04" vaporized=""/>
    <tripinfo id="car_n2w_318" depart="318.00" departLane="n2sep_1" departPos="3.60" departPosLat="0.00" departSpeed="13.90" departDelay="0.00" arrival="461.30" arrivalLane="c2w_1" arrivalPos="990.00" arrivalPosLat="0.00" arrivalSpeed="15.33" duration="143.30" routeLength="1986.69" waitingTime="0.00" waitingCount="0" stopTime="0.00" timeLoss="14.92" rerouteNo="1" devices="tripinfo_car_n2w_318 routing_car_n2w_318" vType="Car" speedFactor="1.12" vaporized=""/>
    <tripinfo id="car_s2e_319" depart="319.00" departLane="s2sep_1" departPos="3.60" departPosLat="0.00" departSpeed="13.90" departDelay="0.00" arrival="466.30" arrivalLane="c2e_1" arrivalPos="990.00" arrivalPosLat="0.00" arrivalSpeed="13.93" duration="147.30" routeLength="1986.69" waitingTime="0.00" waitingCount="0" stopTime="0.00" timeLoss="3.91" rerouteNo="1" devices="tripinfo_car_s2e_319 routing_car_s2e_319" vType="Car" speedFactor="1.00" vaporized=""/>
    <tripinfo id="car_n2s_322" depart="322.00" departLane="n2sep_1" departPos="3.60" departPosLat="0.00" departSpeed="13.90" departDelay="0.00" arrival="466.55" arrivalLane="c2s_1" arrivalPos="990.00" arrivalPosLat="0.00" arrivalSpeed="14.12" duration="144.55" routeLength="1997.01" waitingTime="0.00" waitingCount="0" stopTime="0.00" timeLoss="3.09" rerouteNo="1" devices="tripinfo_car_n2s_322 routing_car_n2s_322" vType="Car" speedFactor="1.02" vaporized=""/>
    <tripinfo id="car_n2e_266" depart="266.00" departLane="n2sep_1" departPos="3.60" departPosLat="0.00" departSpeed="13.90" departDelay="0.00" arrival="468.20" arrivalLane="c2e_1" arrivalPos="990.00" arrivalPosLat="0.00" arrivalSpeed="15.33" duration="202.20" routeLength="1996.47" waitingTime="51.70" waitingCount="3" stopTime="0.00" timeLoss="77.02" rerouteNo="1" devices="tripinfo_car_n2e_266 routing_car_n2e_266" vType="Car" speedFactor="1.15" vaporized=""/>
    <tripinfo id="car_n2w_329" depart="329.00" departLane="n2sep_1" departPos="3.60" departPosLat="0.00" departSpeed="13.90" departDelay="0.00" arrival="471.70" arrivalLane="c2w_1" arrivalPos="990.00" arrivalPosLat="0.00" arrivalSpeed="14.45" duration="142.70" routeLength="1986.69" waitingTime="0.00" waitingCount="0" stopTime="0.00" timeLoss="4.55" rerouteNo="1" devices="tripinfo_car_n2w_329 routing_car_n2w_329" vType="Car" speedFactor="1.04" vaporized=""/>
    <tripinfo id="car_n2e_296" depart="296.00" departLane="n2sep_1" departPos="3.60" departPosLat="0.00" departSpeed="13.90" departDelay="0.00" arrival="472.50" arrivalLane="c2e_1" arrivalPos="990.00" arrivalPosLat="0.00" arrivalSpeed="14.10" duration="176.50" routeLength="1996.47" waitingTime="12.35" waitingCount="2" stopTime="0.00" timeLoss="34.35" rerouteNo="1" devices="tripinfo_car_n2e_296 routing_car_n2e_296" vType="Car" speedFactor="1.02" vaporized=""/>
</tripinfos>
