<?xml version="1.0" encoding="UTF-8"?>

<!-- generated on Sat Apr 24 18:21:40 2021 by Eclipse SUMO Version 1.4.0
<configuration xmlns:xsi="http://www.w3.org/2001/XMLSchema-instance" xsi:noNamespaceSchemaLocation="http://sumo.dlr.de/xsd/sumoConfiguration.xsd">

    <input>
        <net-file value="sumofiles/junction.net.xml"/>
        <route-files value="sumofiles/junction_preemption_191.rou.xml"/>
        <additional-files value="sumofiles/junction.det.xml"/>
    </input>

    <output>
        <tripinfo-output value="sumofiles/output/tripinfo_preemption_191.xml"/>
    </output>

    <time>
        <begin value="0"/>
        <end value="10000"/>
        <step-length value="0.05"/>
    </time>

    <processing>
        <lateral-resolution value="0.1"/>
    </processing>

    <report>
        <no-warnings value="true"/>
        <error-log value="sumofiles/output/errorlog_preemption_191.log"/>
        <no-step-log value="true"/>
    </report>

    <traci_server>
        <remote-port value="54489"/>
    </traci_server>

    <gui_only>
        <gui-settings-file value="sumofiles/junction-gui.settings.xml"/>
        <tracker-interval value="0.05"/>
    </gui_only>

</configuration>
-->

<tripinfos xmlns:xsi="http://www.w3.org/2001/XMLSchema-instance" xsi:noNamespaceSchemaLocation="http://sumo.dlr.de/xsd/tripinfo_file.xsd">
    <tripinfo id="car_w2e_4" depart="4.00" departLane="w2sep_1" departPos="3.60" departPosLat="0.00" departSpeed="13.90" departDelay="0.00" arrival="139.70" arrivalLane="c2e_1" arrivalPos="990.00" arrivalPosLat="0.00" arrivalSpeed="14.73" duration="135.70" routeLength="1997.01" waitingTime="0.00" waitingCount="0" stopTime="0.00" timeLoss="0.12" rerouteNo="1" devices="tripinfo_car_w2e_4 routing_car_w2e_4" vType="Car" speedFactor="1.06" vaporized=""/>
    <tripinfo id="car_e2s_0" depart="0.00" departLane="e2sep_1" departPos="3.60" departPosLat="0.00" departSpeed="13.90" departDelay="0.00" arrival="143.10" arrivalLane="c2s_1" arrivalPos="990.00" arrivalPosLat="0.00" arrivalSpeed="14.73" duration="143.10" routeLength="1996.47" waitingTime="0.00" waitingCount="0" stopTime="0.00" timeLoss="6.93" rerouteNo="1" devices="tripinfo_car_e2s_0 routing_car_e2s_0" vType="Car" speedFactor="1.06" vaporized=""/>
    <tripinfo id="car_e2s_8" depart="8.00" departLane="e2sep_1" departPos="3.60" departPosLat="0.00" departSpeed="13.90" departDelay="0.00" arrival="154.45" arrivalLane="c2s_1" arrivalPos="990.00" arrivalPosLat="0.00" arrivalSpeed="14.04" duration="146.45" routeLength="1996.47" waitingTime="0.00" waitingCount="0" stopTime="0.00" timeLoss="3.64" rerouteNo="1" devices="tripinfo_car_e2s_8 routing_car_e2s_8" vType="Car" speedFactor="1.01" vaporized=""/>
    <tripinfo id="car_s2e_9" depart="9.00" departLane="s2sep_1" departPos="3.60" departPosLat="0.00" departSpeed="13.90" departDelay="0.00" arrival="160.35" arrivalLane="c2e_1" arrivalPos="990.00" arrivalPosLat="0.00" arrivalSpeed="15.05" duration="151.35" routeLength="1986.69" waitingTime="11.05" waitingCount="1" stopTime="0.00" timeLoss="18.65" rerouteNo="1" devices="tripinfo_car_s2e_9 routing_car_s2e_9" vType="Car" speedFactor="1.08" vaporized=""/>
    <tripinfo id="bus_w2n_13" depart="13.00" departLane="w2sep_1" departPos="12.10" departPosLat="0.00" departSpeed="13.90" departDelay="0.00" arrival="162.00" arrivalLane="c2n_1" arrivalPos="990.00" arrivalPosLat="0.00" arrivalSpeed="13.90" duration="149.00" routeLength="1987.97" waitingTime="0.00" waitingCount="0" stopTime="0.00" timeLoss="5.26" rerouteNo="1" devices="tripinfo_bus_w2n_13 routing_bus_w2n_13" vType="Bus" speedFactor="1.00" vaporized=""/>
    <tripinfo id="bus_s2n_14" depart="14.00" departLane="s2sep_1" departPos="12.10" departPosLat="0.00" departSpeed="13.90" departDelay="0.00" arrival="171.25" arrivalLane="c2n_1" arrivalPos="990.00" arrivalPosLat="0.00" arrivalSpeed="13.90" duration="157.25" routeLength="1988.51" waitingTime="2.95" waitingCount="1" stopTime="0.00" timeLoss="14.19" rerouteNo="1" devices="tripinfo_bus_s2n_14 routing_bus_s2n_14" vType="Bus" speedFactor="1.00" vaporized=""/>
    <tripinfo id="car_s2e_20" depart="20.00" departLane="s2sep_1" departPos="3.60" departPosLat="0.00" departSpeed="13.90" departDelay="0.00" arrival="172.85" arrivalLane="c2e_1" arrivalPos="990.00" arrivalPosLat="0.00" arrivalSpeed="13.90" duration="152.85" routeLength="1986.69" waitingTime="0.00" waitingCount="0" stopTime="0.00" timeLoss="9.17" rerouteNo="1" devices="tripinfo_car_s2e_20 routing_car_s2e_20" vType="Car" speedFactor="1.00" vaporized=""/>
    <tripinfo id="car_n2w_28" depart="28.00" departLane="n2sep_1" departPos="3.60" departPosLat="0.00" departSpeed="13.90" departDelay="0.00" arrival="174.05" arrivalLane="c2w_1" arrivalPos="990.00" arrivalPosLat="0.00" arrivalSpeed="14.04" duration="146.05" routeLength="1986.69" waitingTime="0.00" waitingCount="0" stopTime="0.00" timeLoss="3.89" rerouteNo="1" devices="tripinfo_car_n2w_28 routing_car_n2w_28" vType="Car" speedFactor="1.01" vaporized=""/>
    <tripinfo id="car_n2e_21" depart="21.00" departLane="n2sep_1" departPos="3.60" departPosLat="0.00" departSpeed="13.90" departDelay="0.00" arrival="175.80" arrivalLane="c2e_1" arrivalPos="990.00" arrivalPosLat="0.00" arrivalSpeed="14.45" duration="154.80" routeLength="1996.47" waitingTime="4.45" waitingCount="2" stopTime="0.00" timeLoss="16.81" rerouteNo="1" devices="tripinfo_car_n2e_21 routing_car_n2e_21" vType="Car" speedFactor="1.05" vaporized=""/>
    <tripinfo id="car_n2w_35" depart="35.00" departLane="n2sep_1" departPos="3.60" departPosLat="0.00" departSpeed="13.90" departDelay="0.00" arrival="179.45" arrivalLane="c2w_1" arrivalPos="990.00" arrivalPosLat="0.00" arrivalSpeed="14.32" duration="144.45" routeLength="1986.69" waitingTime="0.00" waitingCount="0" stopTime="0.00" timeLoss="4.98" rerouteNo="1" devices="tripinfo_car_n2w_35 routing_car_n2w_35" vType="Car" speedFactor="1.03" vaporized=""/>
    <tripinfo id="car_s2w_43" depart="43.00" departLane="s2sep_1" departPos="3.60" departPosLat="0.00" departSpeed="13.90" departDelay="0.00" arrival="181.65" arrivalLane="c2w_1" arrivalPos="990.00" arrivalPosLat="0.00" arrivalSpeed="15.26" duration="138.65" routeLength="1996.47" waitingTime="0.00" waitingCount="0" stopTime="0.00" timeLoss="10.13" rerouteNo="1" devices="tripinfo_car_s2w_43 routing_car_s2w_43" vType="Car" speedFactor="1.12" vaporized=""/>
    <tripinfo id="car_e2w_32" depart="32.00" departLane="e2sep_1" departPos="3.60" departPosLat="0.00" departSpeed="13.90" departDelay="0.00" arrival="205.45" arrivalLane="c2w_1" arrivalPos="990.00" arrivalPosLat="0.00" arrivalSpeed="15.05" duration="173.45" routeLength="1997.01" waitingTime="33.00" waitingCount="1" stopTime="0.00" timeLoss="40.72" rerouteNo="1" devices="tripinfo_car_e2w_32 routing_car_e2w_32" vType="Car" speedFactor="1.08" vaporized=""/>
    <tripinfo id="bus_n2e_59" depart="59.00" departLane="n2sep_1" departPos="12.10" departPosLat="0.00" departSpeed="13.90" departDelay="0.00" arrival="208.15" arrivalLane="c2e_1" arrivalPos="990.00" arrivalPosLat="0.00" arrivalSpeed="13.90" duration="149.15" routeLength="1987.97" waitingTime="0.00" waitingCount="0" stopTime="0.00" timeLoss="5.44" rerouteNo="1" devices="tripinfo_bus_n2e_59 routing_bus_n2e_59" vType="Bus" speedFactor="1.00" vaporized=""/>
    <tripinfo id="car_e2w_36" depart="36.00" departLane="e2sep_1" departPos="3.60" departPosLat="0.00" departSpeed="13.90" departDelay="0.00" arrival="209.40" arrivalLane="c2w_1" arrivalPos="990.00" arrivalPosLat="0.00" arrivalSpeed="15.14" duration="173.40" routeLength="1997.01" waitingTime="29.60" waitingCount="1" stopTime="0.00" timeLoss="41.64" rerouteNo="1" devices="tripinfo_car_e2w_36 routing_car_e2w_36" vType="Car" speedFactor="1.09" vaporized=""/>
    <tripinfo id="car_e2n_37" depart="37.35" departLane="e2sep_1" departPos="3.60" departPosLat="0.00" departSpeed="13.90" departDelay="0.35" arrival="213.40" arrivalLane="c2n_1" arrivalPos="990.00" arrivalPosLat="0.00" arrivalSpeed="14.27" duration="176.05" routeLength="1986.69" waitingTime="24.80" waitingCount="1" stopTime="0.00" timeLoss="36.07" rerouteNo="1" devices="tripinfo_car_e2n_37 routing_car_e2n_37" vType="Car" speedFactor="1.03" vaporized=""/>
    <tripinfo id="bus_w2e_17" depart="17.00" departLane="w2sep_1" departPos="12.10" departPosLat="0.00" departSpeed="13.90" departDelay="0.00" arrival="215.00" arrivalLane="c2e_1" arrivalPos="990.00" arrivalPosLat="0.00" arrivalSpeed="13.89" duration="198.00" routeLength="1988.51" waitingTime="42.30" waitingCount="1" stopTime="0.00" timeLoss="54.91" rerouteNo="1" devices="tripinfo_bus_w2e_17 routing_bus_w2e_17" vType="Bus" speedFactor="1.00" vaporized=""/>
    <tripinfo id="car_w2s_45" depart="45.00" departLane="w2sep_1" departPos="3.60" departPosLat="0.00" departSpeed="13.90" departDelay="0.00" arrival="215.55" arrivalLane="c2s_1" arrivalPos="990.00" arrivalPosLat="0.00" arrivalSpeed="13.90" duration="170.55" routeLength="1986.69" waitingTime="16.70" waitingCount="1" stopTime="0.00" timeLoss="26.88" rerouteNo="1" devices="tripinfo_car_w2s_45 routing_car_w2s_45" vType="Car" speedFactor="1.00" vaporized=""/>
    <tripinfo id="car_e2n_42" depart="42.00" departLane="e2sep_1" departPos="3.60" departPosLat="0.00" departSpeed="13.90" departDelay="0.00" arrival="217.10" arrivalLane="c2n_1" arrivalPos="990.00" arrivalPosLat="0.00" arrivalSpeed="14.52" duration="175.10" routeLength="1986.69" waitingTime="22.70" waitingCount="1" stopTime="0.00" timeLoss="37.87" rerouteNo="1" devices="tripinfo_car_e2n_42 routing_car_e2n_42" vType="Car" speedFactor="1.05" vaporized=""/>
    <tripinfo id="car_w2e_61" depart="61.00" departLane="w2sep_1" departPos="3.60" departPosLat="0.00" departSpeed="13.90" departDelay="0.00" arrival="217.45" arrivalLane="c2e_1" arrivalPos="990.00" arrivalPosLat="0.00" arrivalSpeed="15.56" duration="156.45" routeLength="1997.01" waitingTime="12.05" waitingCount="1" stopTime="0.00" timeLoss="32.37" rerouteNo="1" devices="tripinfo_car_w2e_61 routing_car_w2e_61" vType="Car" speedFactor="1.16" vaporized=""/>
    <tripinfo id="car_w2s_46" depart="46.45" departLane="w2sep_1" departPos="3.60" departPosLat="0.00" departSpeed="13.90" departDelay="0.45" arrival="218.55" arrivalLane="c2s_1" arrivalPos="990.00" arrivalPosLat="0.00" arrivalSpeed="14.46" duration="172.10" routeLength="1986.69" waitingTime="15.45" waitingCount="1" stopTime="0.00" timeLoss="34.72" rerouteNo="1" devices="tripinfo_car_w2s_46 routing_car_w2s_46" vType="Car" speedFactor="1.05" vaporized=""/>
    <tripinfo id="car_w2s_85" depart="85.00" departLane="w2sep_1" departPos="3.60" departPosLat="0.00" departSpeed="13.90" departDelay="0.00" arrival="221.10" arrivalLane="c2s_1" arrivalPos="990.00" arrivalPosLat="0.00" arrivalSpeed="15.52" duration="136.10" routeLength="1986.69" waitingTime="0.00" waitingCount="0" stopTime="0.00" timeLoss="9.16" rerouteNo="1" devices="tripinfo_car_w2s_85 routing_car_w2s_85" vType="Car" speedFactor="1.13" vaporized=""/>
    <tripinfo id="car_e2w_53" depart="53.00" departLane="e2sep_1" departPos="3.60" departPosLat="0.00" departSpeed="13.90" departDelay="0.00" arrival="221.90" arrivalLane="c2w_1" arrivalPos="990.00" arrivalPosLat="0.00" arrivalSpeed="13.90" duration="168.90" routeLength="1997.01" waitingTime="11.55" waitingCount="1" stopTime="0.00" timeLoss="25.22" rerouteNo="1" devices="tripinfo_car_e2w_53 routing_car_e2w_53" vType="Car" speedFactor="1.00" vaporized=""/>
    <tripinfo id="car_e2n_50" depart="50.00" departLane="e2sep_1" departPos="3.60" departPosLat="0.00" departSpeed="13.90" departDelay="0.00" arrival="222.05" arrivalLane="c2n_1" arrivalPos="990.00" arrivalPosLat="0.00" arrivalSpeed="13.90" duration="172.05" routeLength="1986.69" waitingTime="14.35" waitingCount="1" stopTime="0.00" timeLoss="28.36" rerouteNo="1" devices="tripinfo_car_e2n_50 routing_car_e2n_50" vType="Car" speedFactor="1.00" vaporized=""/>
    <tripinfo id="car_w2e_78" depart="78.00" departLane="w2sep_1" departPos="3.60" departPosLat="0.00" departSpeed="13.90" departDelay="0.00" arrival="223.45" arrivalLane="c2e_1" arrivalPos="990.00" arrivalPosLat="0.00" arrivalSpeed="13.90" duration="145.45" routeLength="1997.01" waitingTime="0.00" waitingCount="0" stopTime="0.00" timeLoss="1.78" rerouteNo="1" devices="tripinfo_car_w2e_78 routing_car_w2e_78" vType="Car" speedFactor="1.00" vaporized=""/>
    <tripinfo id="car_w2e_90" depart="90.00" departLane="w2sep_1" departPos="3.60" departPosLat="0.00" departSpeed="13.90" departDelay="0.00" arrival="225.35" arrivalLane="c2e_1" arrivalPos="990.00" arrivalPosLat="0.00" arrivalSpeed="15.32" duration="135.35" routeLength="1997.01" waitingTime="0.00" waitingCount="0" stopTime="0.00" timeLoss="10.90" rerouteNo="1" devices="tripinfo_car_w2e_90 routing_car_w2e_90" vType="Car" speedFactor="1.15" vaporized=""/>
    <tripinfo id="car_e2w_61" depart="61.00" departLane="e2sep_1" departPos="3.60" departPosLat="0.00" departSpeed="13.90" departDelay="0.00" arrival="225.55" arrivalLane="c2w_1" arrivalPos="990.00" arrivalPosLat="0.00" arrivalSpeed="14.12" duration="164.55" routeLength="1997.01" waitingTime="7.00" waitingCount="1" stopTime="0.00" timeLoss="23.42" rerouteNo="1" devices="tripinfo_car_e2w_61 routing_car_e2w_61" vType="Car" speedFactor="1.02" vaporized=""/>
    <tripinfo id="car_e2n_87" depart="88.45" departLane="e2sep_1" departPos="3.60" departPosLat="0.00" departSpeed="13.90" departDelay="1.45" arrival="226.00" arrivalLane="c2n_1" arrivalPos="990.00" arrivalPosLat="0.00" arrivalSpeed="16.34" duration="137.55" routeLength="1986.69" waitingTime="0.00" waitingCount="0" stopTime="0.00" timeLoss="15.65" rerouteNo="1" devices="tripinfo_car_e2n_87 routing_car_e2n_87" vType="Car" speedFactor="1.18" vaporized=""/>
    <tripinfo id="car_e2w_65" depart="65.00" departLane="e2sep_1" departPos="3.60" departPosLat="0.00" departSpeed="13.90" departDelay="0.00" arrival="227.80" arrivalLane="c2w_1" arrivalPos="990.00" arrivalPosLat="0.00" arrivalSpeed="14.85" duration="162.80" routeLength="1997.01" waitingTime="6.00" waitingCount="1" stopTime="0.00" timeLoss="31.05" rerouteNo="1" devices="tripinfo_car_e2w_65 routing_car_e2w_65" vType="Car" speedFactor="1.09" vaporized=""/>
    <tripinfo id="car_e2s_18" depart="18.00" departLane="e2sep_1" departPos="3.60" departPosLat="0.00" departSpeed="13.90" departDelay="0.00" arrival="230.10" arrivalLane="c2s_1" arrivalPos="990.00" arrivalPosLat="0.00" arrivalSpeed="14.32" duration="212.10" routeLength="1996.47" waitingTime="60.55" waitingCount="2" stopTime="0.00" timeLoss="72.01" rerouteNo="1" devices="tripinfo_car_e2s_18 routing_car_e2s_18" vType="Car" speedFactor="1.03" vaporized=""/>
    <tripinfo id="car_e2s_95" depart="95.00" departLane="e2sep_1" departPos="3.60" departPosLat="0.00" departSpeed="13.90" departDelay="0.00" arrival="232.30" arrivalLane="c2s_1" arrivalPos="990.00" arrivalPosLat="0.00" arrivalSpeed="15.87" duration="137.30" routeLength="1996.47" waitingTime="0.00" waitingCount="0" stopTime="0.00" timeLoss="14.15" rerouteNo="1" devices="tripinfo_car_e2s_95 routing_car_e2s_95" vType="Car" speedFactor="1.17" vaporized=""/>
    <tripinfo id="car_e2w_87" depart="87.00" departLane="e2sep_1" departPos="3.60" departPosLat="0.00" departSpeed="13.90" departDelay="0.00" arrival="232.45" arrivalLane="c2w_1" arrivalPos="990.00" arrivalPosLat="0.00" arrivalSpeed="13.89" duration="145.45" routeLength="1997.01" waitingTime="0.00" waitingCount="0" stopTime="0.00" timeLoss="1.77" rerouteNo="1" devices="tripinfo_car_e2w_87 routing_car_e2w_87" vType="Car" speedFactor="1.00" vaporized=""/>
    <tripinfo id="car_w2n_107" depart="107.00" departLane="w2sep_1" departPos="3.60" departPosLat="0.00" departSpeed="13.90" departDelay="0.00" arrival="236.15" arrivalLane="c2n_1" arrivalPos="990.00" arrivalPosLat="0.00" arrivalSpeed="16.10" duration="129.15" routeLength="1996.47" waitingTime="0.00" waitingCount="0" stopTime="0.00" timeLoss="4.52" rerouteNo="1" devices="tripinfo_car_w2n_107 routing_car_w2n_107" vType="Car" speedFactor="1.16" vaporized=""/>
    <tripinfo id="car_w2e_93" depart="93.00" departLane="w2sep_1" departPos="3.60" departPosLat="0.00" departSpeed="13.90" departDelay="0.00" arrival="236.65" arrivalLane="c2e_1" arrivalPos="990.00" arrivalPosLat="0.00" arrivalSpeed="13.97" duration="143.65" routeLength="1997.01" waitingTime="0.00" waitingCount="0" stopTime="0.00" timeLoss="0.70" rerouteNo="1" devices="tripinfo_car_w2e_93 routing_car_w2e_93" vType="Car" speedFactor="1.01" vaporized=""/>
    <tripinfo id="car_n2w_51" depart="51.00" departLane="n2sep_1" departPos="3.60" departPosLat="0.00" departSpeed="13.90" departDelay="0.00" arrival="255.65" arrivalLane="c2w_1" arrivalPos="990.00" arrivalPosLat="0.00" arrivalSpeed="13.90" duration="204.65" routeLength="1986.69" waitingTime="54.50" waitingCount="1" stopTime="0.00" timeLoss="60.98" rerouteNo="1" devices="tripinfo_car_n2w_51 routing_car_n2w_51" vType="Car" speedFactor="1.00" vaporized=""/>
    <tripinfo id="car_s2e_95" depart="95.00" departLane="s2sep_1" departPos="3.60" departPosLat="0.00" departSpeed="13.90" departDelay="0.00" arrival="255.65" arrivalLane="c2e_1" arrivalPos="990.00" arrivalPosLat="0.00" arrivalSpeed="13.90" duration="160.65" routeLength="1986.69" waitingTime="9.95" waitingCount="1" stopTime="0.00" timeLoss="16.99" rerouteNo="1" devices="tripinfo_car_s2e_95 routing_car_s2e_95" vType="Car" speedFactor="1.00" vaporized=""/>
    <tripinfo id="car_s2e_103" depart="103.00" departLane="s2sep_1" departPos="3.60" departPosLat="0.00" departSpeed="13.90" departDelay="0.00" arrival="257.50" arrivalLane="c2e_1" arrivalPos="990.00" arrivalPosLat="0.00" arrivalSpeed="15.50" duration="154.50" routeLength="1986.69" waitingTime="9.05" waitingCount="1" stopTime="0.00" timeLoss="32.71" rerouteNo="1" devices="tripinfo_car_s2e_103 routing_car_s2e_103" vType="Car" speedFactor="1.18" vaporized=""/>
    <tripinfo id="car_n2s_70" depart="70.00" departLane="n2sep_1" departPos="3.60" departPosLat="0.00" departSpeed="13.90" departDelay="0.00" arrival="258.35" arrivalLane="c2s_1" arrivalPos="990.00" arrivalPosLat="0.00" arrivalSpeed="14.27" duration="188.35" routeLength="1997.01" waitingTime="38.00" waitingCount="1" stopTime="0.00" timeLoss="48.34" rerouteNo="1" devices="tripinfo_car_n2s_70 routing_car_n2s_70" vType="Car" speedFactor="1.03" vaporized=""/>
    <tripinfo id="car_n2w_65" depart="65.00" departLane="n2sep_1" departPos="3.60" departPosLat="0.00" departSpeed="13.90" departDelay="0.00" arrival="259.75" arrivalLane="c2w_1" arrivalPos="990.00" arrivalPosLat="0.00" arrivalSpeed="14.03" duration="194.75" routeLength="1986.69" waitingTime="41.05" waitingCount="1" stopTime="0.00" timeLoss="52.52" rerouteNo="1" devices="tripinfo_car_n2w_65 routing_car_n2w_65" vType="Car" speedFactor="1.01" vaporized=""/>
    <tripinfo id="car_n2s_77" depart="77.00" departLane="n2sep_1" departPos="3.60" departPosLat="0.00" departSpeed="13.90" departDelay="0.00" arrival="260.70" arrivalLane="c2s_1" arrivalPos="990.00" arrivalPosLat="0.00" arrivalSpeed="15.32" duration="183.70" routeLength="1997.01" waitingTime="35.00" waitingCount="1" stopTime="0.00" timeLoss="55.72" rerouteNo="1" devices="tripinfo_car_n2s_77 routing_car_n2s_77" vType="Car" speedFactor="1.12" vaporized=""/>
    <tripinfo id="car_n2e_78" depart="78.35" departLane="n2sep_1" departPos="3.60" departPosLat="0.00" departSpeed="13.90" departDelay="0.35" arrival="262.30" arrivalLane="c2e_1" arrivalPos="990.00" arrivalPosLat="0.00" arrivalSpeed="13.89" duration="183.95" routeLength="1996.47" waitingTime="24.95" waitingCount="2" stopTime="0.00" timeLoss="39.61" rerouteNo="1" devices="tripinfo_car_n2e_78 routing_car_n2e_78" vType="Car" speedFactor="1.00" vaporized=""/>
    <tripinfo id="car_n2w_74" depart="74.00" departLane="n2sep_1" departPos="3.60" departPosLat="0.00" departSpeed="13.90" departDelay="0.00" arrival="262.60" arrivalLane="c2w_1" arrivalPos="990.00" arrivalPosLat="0.00" arrivalSpeed="14.45" duration="188.60" routeLength="1986.69" waitingTime="35.90" waitingCount="1" stopTime="0.00" timeLoss="51.37" rerouteNo="1" devices="tripinfo_car_n2w_74 routing_car_n2w_74" vType="Car" speedFactor="1.05" vaporized=""/>
    <tripinfo id="car_n2w_97" depart="97.00" departLane="n2sep_1" departPos="3.60" departPosLat="0.00" departSpeed="13.90" departDelay="0.00" arrival="266.95" arrivalLane="c2w_1" arrivalPos="990.00" arrivalPosLat="0.00" arrivalSpeed="14.16" duration="169.95" routeLength="1986.69" waitingTime="15.05" waitingCount="1" stopTime="0.00" timeLoss="29.07" rerouteNo="1" devices="tripinfo_car_n2w_97 routing_car_n2w_97" vType="Car" speedFactor="1.02" vaporized=""/>
    <tripinfo id="car_n2s_113" depart="113.00" departLane="n2sep_1" departPos="3.60" departPosLat="0.00" departSpeed="13.90" departDelay="0.00" arrival="267.85" arrivalLane="c2s_1" arrivalPos="990.00" arrivalPosLat="0.00" arrivalSpeed="15.18" duration="154.85" routeLength="1997.01" waitingTime="2.65" waitingCount="1" stopTime="0.00" timeLoss="23.23" rerouteNo="1" devices="tripinfo_car_n2s_113 routing_car_n2s_113" vType="Car" speedFactor="1.09" vaporized=""/>
    <tripinfo id="car_s2n_133" depart="133.00" departLane="s2sep_1" departPos="3.60" departPosLat="0.00" departSpeed="13.90" departDelay="0.00" arrival="268.05" arrivalLane="c2n_1" arrivalPos="990.00" arrivalPosLat="0.00" arrivalSpeed="16.25" duration="135.05" routeLength="1997.01" waitingTime="0.00" waitingCount="0" stopTime="0.00" timeLoss="12.12" rerouteNo="1" devices="tripinfo_car_s2n_133 routing_car_s2n_133" vType="Car" speedFactor="1.17" vaporized=""/>
    <tripinfo id="car_n2w_105" depart="105.00" departLane="n2sep_1" departPos="3.60" departPosLat="0.00" departSpeed="13.90" departDelay="0.00" arrival="269.20" arrivalLane="c2w_1" arrivalPos="990.00" arrivalPosLat="0.00" arrivalSpeed="15.01" duration="164.20" routeLength="1986.69" waitingTime="12.80" waitingCount="1" stopTime="0.00" timeLoss="33.89" rerouteNo="1" devices="tripinfo_car_n2w_105 routing_car_n2w_105" vType="Car" speedFactor="1.10" vaporized=""/>
    <tripinfo id="car_s2e_125" depart="125.00" departLane="s2sep_1" departPos="3.60" departPosLat="0.00" departSpeed="13.90" departDelay="0.00" arrival="272.45" arrivalLane="c2e_1" arrivalPos="990.00" arrivalPosLat="0.00" arrivalSpeed="13.90" duration="147.45" routeLength="1986.69" waitingTime="0.00" waitingCount="0" stopTime="0.00" timeLoss="3.79" rerouteNo="1" devices="tripinfo_car_s2e_125 routing_car_s2e_125" vType="Car" speedFactor="1.00" vaporized=""/>
    <tripinfo id="car_n2w_111" depart="111.00" departLane="n2sep_1" departPos="3.60" departPosLat="0.00" departSpeed="13.90" departDelay="0.00" arrival="273.05" arrivalLane="c2w_1" arrivalPos="990.00" arrivalPosLat="0.00" arrivalSpeed="14.13" duration="162.05" routeLength="1986.69" waitingTime="3.50" waitingCount="1" stopTime="0.00" timeLoss="20.96" rerouteNo="1" devices="tripinfo_car_n2w_111 routing_car_n2w_111" vType="Car" speedFactor="1.02" vaporized=""/>
    <tripinfo id="car_n2s_121" depart="121.00" departLane="n2sep_1" departPos="3.60" departPosLat="0.00" departSpeed="13.90" departDelay="0.00" arrival="273.75" arrivalLane="c2s_1" arrivalPos="990.00" arrivalPosLat="0.00" arrivalSpeed="14.50" duration="152.75" routeLength="1997.01" waitingTime="0.00" waitingCount="0" stopTime="0.00" timeLoss="15.06" rerouteNo="1" devices="tripinfo_car_n2s_121 routing_car_n2s_121" vType="Car" speedFactor="1.04" vaporized=""/>
    <tripinfo id="car_s2e_127" depart="127.00" departLane="s2sep_1" departPos="3.60" departPosLat="0.00" departSpeed="13.90" departDelay="0.00" arrival="277.65" arrivalLane="c2e_1" arrivalPos="990.00" arrivalPosLat="0.00" arrivalSpeed="13.90" duration="150.65" routeLength="1986.69" waitingTime="0.00" waitingCount="0" stopTime="0.00" timeLoss="6.94" rerouteNo="1" devices="tripinfo_car_s2e_127 routing_car_s2e_127" vType="Car" speedFactor="1.00" vaporized=""/>
    <tripinfo id="car_n2e_137" depart="137.00" departLane="n2sep_1" departPos="3.60" departPosLat="0.00" departSpeed="13.90" departDelay="0.00" arrival="279.85" arrivalLane="c2e_1" arrivalPos="990.00" arrivalPosLat="0.00" arrivalSpeed="14.88" duration="142.85" routeLength="1996.47" waitingTime="0.00" waitingCount="0" stopTime="0.00" timeLoss="11.12" rerouteNo="1" devices="tripinfo_car_n2e_137 routing_car_n2e_137" vType="Car" speedFactor="1.10" vaporized=""/>
    <tripinfo id="car_s2w_134" depart="134.25" departLane="s2sep_1" departPos="3.60" departPosLat="0.00" departSpeed="13.90" departDelay="0.25" arrival="281.70" arrivalLane="c2w_1" arrivalPos="990.00" arrivalPosLat="0.00" arrivalSpeed="14.13" duration="147.45" routeLength="1996.47" waitingTime="0.00" waitingCount="0" stopTime="0.00" timeLoss="5.49" rerouteNo="1" devices="tripinfo_car_s2w_134 routing_car_s2w_134" vType="Car" speedFactor="1.02" vaporized=""/>
    <tripinfo id="car_n2e_141" depart="142.50" departLane="n2sep_1" departPos="3.60" departPosLat="0.00" departSpeed="13.90" departDelay="1.50" arrival="293.00" arrivalLane="c2e_1" arrivalPos="990.00" arrivalPosLat="0.00" arrivalSpeed="13.90" duration="150.50" routeLength="1996.47" waitingTime="0.00" waitingCount="0" stopTime="0.00" timeLoss="6.20" rerouteNo="1" devices="tripinfo_car_n2e_141 routing_car_n2e_141" vType="Car" speedFactor="1.00" vaporized=""/>
    <tripinfo id="car_w2s_123" depart="123.00" departLane="w2sep_1" departPos="3.60" departPosLat="0.00" departSpeed="13.90" departDelay="0.00" arrival="299.95" arrivalLane="c2s_1" arrivalPos="990.00" arrivalPosLat="0.00" arrivalSpeed="14.04" duration="176.95" routeLength="1986.69" waitingTime="27.60" waitingCount="1" stopTime="0.00" timeLoss="34.71" rerouteNo="1" devices="tripinfo_car_w2s_123 routing_car_w2s_123" vType="Car" speedFactor="1.01" vaporized=""/>
    <tripinfo id="car_e2n_116" depart="116.00" departLane="e2sep_1" departPos="3.60" departPosLat="0.00" departSpeed="13.90" departDelay="0.00" arrival="300.40" arrivalLane="c2n_1" arrivalPos="990.00" arrivalPosLat="0.00" arrivalSpeed="14.42" duration="184.40" routeLength="1986.69" waitingTime="37.25" waitingCount="1" stopTime="0.00" timeLoss="45.96" rerouteNo="1" devices="tripinfo_car_e2n_116 routing_car_e2n_116" vType="Car" speedFactor="1.04" vaporized=""/>
    <tripinfo id="car_e2w_100" depart="100.00" departLane="e2sep_1" departPos="3.60" departPosLat="0.00" departSpeed="13.90" departDelay="0.00" arrival="300.75" arrivalLane="c2w_1" arrivalPos="990.00" arrivalPosLat="0.00" arrivalSpeed="13.90" duration="200.75" routeLength="1997.01" waitingTime="50.25" waitingCount="1" stopTime="0.00" timeLoss="57.06" rerouteNo="1" devices="tripinfo_car_e2w_100 routing_car_e2w_100" vType="Car" speedFactor="1.00" vaporized=""/>
    <tripinfo id="car_w2s_147" depart="147.00" departLane="w2sep_1" departPos="3.60" departPosLat="0.00" departSpeed="13.90" departDelay="0.00" arrival="302.10" arrivalLane="c2s_1" arrivalPos="990.00" arrivalPosLat="0.00" arrivalSpeed="15.16" duration="155.10" routeLength="1986.69" waitingTime="10.85" waitingCount="1" stopTime="0.00" timeLoss="26.76" rerouteNo="1" devices="tripinfo_car_w2s_147 routing_car_w2s_147" vType="Car" speedFactor="1.12" vaporized=""/>
    <tripinfo id="car_e2w_141" depart="141.45" departLane="e2sep_1" departPos="3.60" departPosLat="0.00" departSpeed="13.90" departDelay="0.45" arrival="303.05" arrivalLane="c2w_1" arrivalPos="990.00" arrivalPosLat="0.00" arrivalSpeed="15.54" duration="161.60" routeLength="1997.01" waitingTime="12.70" waitingCount="1" stopTime="0.00" timeLoss="35.85" rerouteNo="1" devices="tripinfo_car_e2w_141 routing_car_e2w_141" vType="Car" speedFactor="1.14" vaporized=""/>
    <tripinfo id="car_e2n_122" depart="122.00" departLane="e2sep_1" departPos="3.60" departPosLat="0.00" departSpeed="13.90" departDelay="0.00" arrival="303.30" arrivalLane="c2n_1" arrivalPos="990.00" arrivalPosLat="0.00" arrivalSpeed="15.02" duration="181.30" routeLength="1986.69" waitingTime="34.80" waitingCount="1" stopTime="0.00" timeLoss="49.27" rerouteNo="1" devices="tripinfo_car_e2n_122 routing_car_e2n_122" vType="Car" speedFactor="1.09" vaporized=""/>
    <tripinfo id="car_w2s_150" depart="150.00" departLane="w2sep_1" departPos="3.60" departPosLat="0.00" departSpeed="13.90" departDelay="0.00" arrival="304.05" arrivalLane="c2s_1" arrivalPos="990.00" arrivalPosLat="0.00" arrivalSpeed="15.71" duration="154.05" routeLength="1986.69" waitingTime="9.60" waitingCount="1" stopTime="0.00" timeLoss="32.12" rerouteNo="1" devices="tripinfo_car_w2s_150 routing_car_w2s_150" vType="Car" speedFactor="1.18" vaporized=""/>
    <tripinfo id="car_e2n_140" depart="140.00" departLane="e2sep_1" departPos="3.60" departPosLat="0.00" departSpeed="13.90" departDelay="0.00" arrival="309.10" arrivalLane="c2n_1" arrivalPos="990.00" arrivalPosLat="0.00" arrivalSpeed="13.94" duration="169.10" routeLength="1986.69" waitingTime="13.30" waitingCount="1" stopTime="0.00" timeLoss="25.90" rerouteNo="1" devices="tripinfo_car_e2n_140 routing_car_e2n_140" vType="Car" speedFactor="1.00" vaporized=""/>
    <tripinfo id="car_e2w_144" depart="144.00" departLane="e2sep_1" departPos="3.60" departPosLat="0.00" departSpeed="13.90" departDelay="0.00" arrival="310.65" arrivalLane="c2w_1" arrivalPos="990.00" arrivalPosLat="0.00" arrivalSpeed="14.23" duration="166.65" routeLength="1997.01" waitingTime="10.75" waitingCount="1" stopTime="0.00" timeLoss="26.27" rerouteNo="1" devices="tripinfo_car_e2w_144 routing_car_e2w_144" vType="Car" speedFactor="1.02" vaporized=""/>
    <tripinfo id="car_w2s_163" depart="163.00" departLane="w2sep_1" departPos="3.60" departPosLat="0.00" departSpeed="13.90" departDelay="0.00" arrival="311.10" arrivalLane="c2s_1" arrivalPos="990.00" arrivalPosLat="0.00" arrivalSpeed="13.90" duration="148.10" routeLength="1986.69" waitingTime="0.00" waitingCount="0" stopTime="0.00" timeLoss="4.44" rerouteNo="1" devices="tripinfo_car_w2s_163 routing_car_w2s_163" vType="Car" speedFactor="1.00" vaporized=""/>
    <tripinfo id="car_e2n_149" depart="149.00" departLane="e2sep_1" departPos="3.60" departPosLat="0.00" departSpeed="13.90" departDelay="0.00" arrival="314.75" arrivalLane="c2n_1" arrivalPos="990.00" arrivalPosLat="0.00" arrivalSpeed="13.90" duration="165.75" routeLength="1986.69" waitingTime="5.75" waitingCount="1" stopTime="0.00" timeLoss="22.10" rerouteNo="1" devices="tripinfo_car_e2n_149 routing_car_e2n_149" vType="Car" speedFactor="1.00" vaporized=""/>
    <tripinfo id="car_e2s_130" depart="130.00" departLane="e2sep_1" departPos="3.60" departPosLat="0.00" departSpeed="13.90" departDelay="0.00" arrival="315.55" arrivalLane="c2s_1" arrivalPos="990.00" arrivalPosLat="0.00" arrivalSpeed="13.89" duration="185.55" routeLength="1996.47" waitingTime="28.50" waitingCount="2" stopTime="0.00" timeLoss="41.23" rerouteNo="1" devices="tripinfo_car_e2s_130 routing_car_e2s_130" vType="Car" speedFactor="1.00" vaporized=""/>
    <tripinfo id="car_e2s_146" depart="146.00" departLane="e2sep_1" departPos="3.60" departPosLat="0.00" departSpeed="13.90" departDelay="0.00" arrival="317.80" arrivalLane="c2s_1" arrivalPos="990.00" arrivalPosLat="0.00" arrivalSpeed="14.74" duration="171.80" routeLength="1996.47" waitingTime="11.15" waitingCount="2" stopTime="0.00" timeLoss="38.48" rerouteNo="1" devices="tripinfo_car_e2s_146 routing_car_e2s_146" vType="Car" speedFactor="1.08" vaporized=""/>
    <tripinfo id="car_w2n_110" depart="110.00" departLane="w2sep_1" departPos="3.60" departPosLat="0.00" departSpeed="13.90" departDelay="0.00" arrival="318.00" arrivalLane="c2n_1" arrivalPos="990.00" arrivalPosLat="0.00" arrivalSpeed="14.27" duration="208.00" routeLength="1996.47" waitingTime="53.95" waitingCount="2" stopTime="0.00" timeLoss="67.91" rerouteNo="1" devices="tripinfo_car_w2n_110 routing_car_w2n_110" vType="Car" speedFactor="1.03" vaporized=""/>
    <tripinfo id="car_e2s_158" depart="158.00" departLane="e2sep_1" departPos="3.60" departPosLat="0.00" departSpeed="13.90" departDelay="0.00" arrival="320.55" arrivalLane="c2s_1" arrivalPos="990.00" arrivalPosLat="0.00" arrivalSpeed="14.35" duration="162.55" routeLength="1996.47" waitingTime="5.50" waitingCount="1" stopTime="0.00" timeLoss="23.80" rerouteNo="1" devices="tripinfo_car_e2s_158 routing_car_e2s_158" vType="Car" speedFactor="1.04" vaporized=""/>
    <tripinfo id="bus_e2w_177" depart="177.00" departLane="e2sep_1" departPos="12.10" departPosLat="0.00" departSpeed="13.90" departDelay="0.00" arrival="321.20" arrivalLane="c2w_1" arrivalPos="990.00" arrivalPosLat="0.00" arrivalSpeed="13.90" duration="144.20" routeLength="1988.51" waitingTime="0.00" waitingCount="0" stopTime="0.00" timeLoss="1.10" rerouteNo="1" devices="tripinfo_bus_e2w_177 routing_bus_e2w_177" vType="Bus" speedFactor="1.00" vaporized=""/>
    <tripinfo id="car_e2n_183" depart="183.00" departLane="e2sep_1" departPos="3.60" departPosLat="0.00" departSpeed="13.90" departDelay="0.00" arrival="322.20" arrivalLane="c2n_1" arrivalPos="990.00" arrivalPosLat="0.00" arrivalSpeed="15.09" duration="139.20" routeLength="1986.69" waitingTime="0.00" waitingCount="0" stopTime="0.00" timeLoss="7.00" rerouteNo="1" devices="tripinfo_car_e2n_183 routing_car_e2n_183" vType="Car" speedFactor="1.09" vaporized=""/>
    <tripinfo id="bus_e2s_165" depart="165.00" departLane="e2sep_1" departPos="12.10" departPosLat="0.00" departSpeed="13.90" departDelay="0.00" arrival="325.20" arrivalLane="c2s_1" arrivalPos="990.00" arrivalPosLat="0.00" arrivalSpeed="13.85" duration="160.20" routeLength="1987.97" waitingTime="3.55" waitingCount="1" stopTime="0.00" timeLoss="16.49" rerouteNo="1" devices="tripinfo_bus_e2s_165 routing_bus_e2s_165" vType="Bus" speedFactor="1.00" vaporized=""/>
    <tripinfo id="car_w2s_186" depart="186.00" departLane="w2sep_1" departPos="3.60" departPosLat="0.00" departSpeed="13.90" departDelay="0.00" arrival="329.75" arrivalLane="c2s_1" arrivalPos="990.00" arrivalPosLat="0.00" arrivalSpeed="14.37" duration="143.75" routeLength="1986.69" waitingTime="0.00" waitingCount="0" stopTime="0.00" timeLoss="4.86" rerouteNo="1" devices="tripinfo_car_w2s_186 routing_car_w2s_186" vType="Car" speedFactor="1.03" vaporized=""/>
    <tripinfo id="car_e2w_186" depart="186.00" departLane="e2sep_1" departPos="3.60" departPosLat="0.00" departSpeed="13.90" departDelay="0.00" arrival="331.00" arrivalLane="c2w_1" arrivalPos="990.00" arrivalPosLat="0.00" arrivalSpeed="13.90" duration="145.00" routeLength="1997.01" waitingTime="0.00" waitingCount="0" stopTime="0.00" timeLoss="1.32" rerouteNo="1" devices="tripinfo_car_e2w_186 routing_car_e2w_186" vType="Car" speedFactor="1.00" vaporized=""/>
    <tripinfo id="car_w2n_133" depart="133.00" departLane="w2sep_1" departPos="3.60" departPosLat="0.00" departSpeed="13.90" departDelay="0.00" arrival="334.25" arrivalLane="c2n_1" arrivalPos="990.00" arrivalPosLat="0.00" arrivalSpeed="13.90" duration="201.25" routeLength="1996.47" waitingTime="40.55" waitingCount="3" stopTime="0.00" timeLoss="56.92" rerouteNo="1" devices="tripinfo_car_w2n_133 routing_car_w2n_133" vType="Car" speedFactor="1.00" vaporized=""/>
    <tripinfo id="car_w2n_155" depart="155.00" departLane="w2sep_1" departPos="3.60" departPosLat="0.00" departSpeed="13.90" departDelay="0.00" arrival="336.15" arrivalLane="c2n_1" arrivalPos="990.00" arrivalPosLat="0.00" arrivalSpeed="15.33" duration="181.15" routeLength="1996.47" waitingTime="24.40" waitingCount="3" stopTime="0.00" timeLoss="56.14" rerouteNo="1" devices="tripinfo_car_w2n_155 routing_car_w2n_155" vType="Car" speedFactor="1.15" vaporized=""/>
    <tripinfo id="car_e2s_189" depart="189.35" departLane="e2sep_1" departPos="3.60" departPosLat="0.00" departSpeed="13.90" departDelay="0.35" arrival="341.15" arrivalLane="c2s_1" arrivalPos="990.00" arrivalPosLat="0.00" arrivalSpeed="13.92" duration="151.80" routeLength="1996.47" waitingTime="0.00" waitingCount="0" stopTime="0.00" timeLoss="7.73" rerouteNo="1" devices="tripinfo_car_e2s_189 routing_car_e2s_189" vType="Car" speedFactor="1.00" vaporized=""/>
    <tripinfo id="car_n2s_146" depart="146.00" departLane="n2sep_1" departPos="3.60" departPosLat="0.00" departSpeed="13.90" departDelay="0.00" arrival="343.30" arrivalLane="c2s_1" arrivalPos="990.00" arrivalPosLat="0.00" arrivalSpeed="15.28" duration="197.30" routeLength="1997.01" waitingTime="49.35" waitingCount="1" stopTime="0.00" timeLoss="70.32" rerouteNo="1" devices="tripinfo_car_n2s_146 routing_car_n2s_146" vType="Car" speedFactor="1.13" vaporized=""/>
    <tripinfo id="car_s2e_147" depart="147.00" departLane="s2sep_1" departPos="3.60" departPosLat="0.00" departSpeed="13.90" departDelay="0.00" arrival="344.55" arrivalLane="c2e_1" arrivalPos="990.00" arrivalPosLat="0.00" arrivalSpeed="14.12" duration="197.55" routeLength="1986.69" waitingTime="49.20" waitingCount="1" stopTime="0.00" timeLoss="56.10" rerouteNo="1" devices="tripinfo_car_s2e_147 routing_car_s2e_147" vType="Car" speedFactor="1.02" vaporized=""/>
    <tripinfo id="car_n2w_141" depart="141.00" departLane="n2sep_1" departPos="3.60" departPosLat="0.00" departSpeed="13.90" departDelay="0.00" arrival="345.70" arrivalLane="c2w_1" arrivalPos="990.00" arrivalPosLat="0.00" arrivalSpeed="13.90" duration="204.70" routeLength="1986.69" waitingTime="53.95" waitingCount="1" stopTime="0.00" timeLoss="61.04" rerouteNo="1" devices="tripinfo_car_n2w_141 routing_car_n2w_141" vType="Car" speedFactor="1.00" vaporized=""/>
    <tripinfo id="car_n2s_168" depart="168.40" departLane="n2sep_1" departPos="3.60" departPosLat="0.00" departSpeed="13.90" departDelay="0.40" arrival="347.70" arrivalLane="c2s_1" arrivalPos="990.00" arrivalPosLat="0.00" arrivalSpeed="14.66" duration="179.30" routeLength="1997.01" waitingTime="28.45" waitingCount="1" stopTime="0.00" timeLoss="43.18" rerouteNo="1" devices="tripinfo_car_n2s_168 routing_car_n2s_168" vType="Car" speedFactor="1.06" vaporized=""/>
    <tripinfo id="car_s2n_161" depart="161.50" departLane="s2sep_1" departPos="3.60" departPosLat="0.00" departSpeed="13.90" departDelay="0.50" arrival="348.65" arrivalLane="c2n_1" arrivalPos="990.00" arrivalPosLat="0.00" arrivalSpeed="14.22" duration="187.15" routeLength="1997.01" waitingTime="33.55" waitingCount="1" stopTime="0.00" timeLoss="46.70" rerouteNo="1" devices="tripinfo_car_s2n_161 routing_car_s2n_161" vType="Car" speedFactor="1.02" vaporized=""/>
    <tripinfo id="car_s2e_160" depart="160.00" departLane="s2sep_1" departPos="3.60" departPosLat="0.00" departSpeed="13.90" departDelay="0.00" arrival="348.75" arrivalLane="c2e_1" arrivalPos="990.00" arrivalPosLat="0.00" arrivalSpeed="14.19" duration="188.75" routeLength="1986.69" waitingTime="35.45" waitingCount="1" stopTime="0.00" timeLoss="48.21" rerouteNo="1" devices="tripinfo_car_s2e_160 routing_car_s2e_160" vType="Car" speedFactor="1.02" vaporized=""/>
    <tripinfo id="car_n2w_175" depart="175.00" departLane="n2sep_1" departPos="3.60" departPosLat="0.00" departSpeed="13.90" departDelay="0.00" arrival="350.95" arrivalLane="c2w_1" arrivalPos="990.00" arrivalPosLat="0.00" arrivalSpeed="14.35" duration="175.95" routeLength="1986.69" waitingTime="24.80" waitingCount="1" stopTime="0.00" timeLoss="36.81" rerouteNo="1" devices="tripinfo_car_n2w_175 routing_car_n2w_175" vType="Car" speedFactor="1.03" vaporized=""/>
    <tripinfo id="car_s2n_169" depart="169.00" departLane="s2sep_1" departPos="3.60" departPosLat="0.00" departSpeed="13.90" departDelay="0.00" arrival="353.90" arrivalLane="c2n_1" arrivalPos="990.00" arrivalPosLat="0.00" arrivalSpeed="13.90" duration="184.90" routeLength="1997.01" waitingTime="28.90" waitingCount="1" stopTime="0.00" timeLoss="41.23" rerouteNo="1" devices="tripinfo_car_s2n_169 routing_car_s2n_169" vType="Car" speedFactor="1.00" vaporized=""/>
    <tripinfo id="car_n2s_183" depart="183.00" departLane="n2sep_1" departPos="3.60" departPosLat="0.00" departSpeed="13.90" departDelay="0.00" arrival="354.40" arrivalLane="c2s_1" arrivalPos="990.00" arrivalPosLat="0.00" arrivalSpeed="14.00" duration="171.40" routeLength="1997.01" waitingTime="16.90" waitingCount="1" stopTime="0.00" timeLoss="28.74" rerouteNo="1" devices="tripinfo_car_n2s_183 routing_car_n2s_183" vType="Car" speedFactor="1.01" vaporized=""/>
    <tripinfo id="car_s2n_171" depart="171.00" departLane="s2sep_1" departPos="3.60" departPosLat="0.00" departSpeed="13.90" departDelay="0.00" arrival="355.70" arrivalLane="c2n_1" arrivalPos="990.00" arrivalPosLat="0.00" arrivalSpeed="15.44" duration="184.70" routeLength="1997.01" waitingTime="28.30" waitingCount="1" stopTime="0.00" timeLoss="62.91" rerouteNo="1" devices="tripinfo_car_s2n_171 routing_car_s2n_171" vType="Car" speedFactor="1.18" vaporized=""/>
    <tripinfo id="car_s2e_197" depart="197.00" departLane="s2sep_1" departPos="3.60" departPosLat="0.00" departSpeed="13.90" departDelay="0.00" arrival="355.90" arrivalLane="c2e_1" arrivalPos="990.00" arrivalPosLat="0.00" arrivalSpeed="14.13" duration="158.90" routeLength="1986.69" waitingTime="4.90" waitingCount="1" stopTime="0.00" timeLoss="17.58" rerouteNo="1" devices="tripinfo_car_s2e_197 routing_car_s2e_197" vType="Car" speedFactor="1.02" vaporized=""/>
    <tripinfo id="car_n2w_192" depart="192.00" departLane="n2sep_1" departPos="3.60" departPosLat="0.00" departSpeed="13.90" departDelay="0.00" arrival="357.10" arrivalLane="c2w_1" arrivalPos="990.00" arrivalPosLat="0.00" arrivalSpeed="14.00" duration="165.10" routeLength="1986.69" waitingTime="4.80" waitingCount="1" stopTime="0.00" timeLoss="22.42" rerouteNo="1" devices="tripinfo_car_n2w_192 routing_car_n2w_192" vType="Car" speedFactor="1.01" vaporized=""/>
    <tripinfo id="car_s2n_202" depart="202.00" departLane="s2sep_1" departPos="3.60" departPosLat="0.00" departSpeed="13.90" departDelay="0.00" arrival="358.00" arrivalLane="c2n_1" arrivalPos="990.00" arrivalPosLat="0.00" arrivalSpeed="14.90" duration="156.00" routeLength="1997.01" waitingTime="0.00" waitingCount="0" stopTime="0.00" timeLoss="24.31" rerouteNo="1" devices="tripinfo_car_s2n_202 routing_car_s2n_202" vType="Car" speedFactor="1.09" vaporized=""/>
    <tripinfo id="car_n2s_202" depart="202.00" departLane="n2sep_1" departPos="3.60" departPosLat="0.00" departSpeed="13.90" departDelay="0.00" arrival="358.85" arrivalLane="c2s_1" arrivalPos="990.00" arrivalPosLat="0.00" arrivalSpeed="14.49" duration="156.85" routeLength="1997.01" waitingTime="2.40" waitingCount="1" stopTime="0.00" timeLoss="19.16" rerouteNo="1" devices="tripinfo_car_n2s_202 routing_car_n2s_202" vType="Car" speedFactor="1.04" vaporized=""/>
    <tripinfo id="car_s2n_210" depart="210.00" departLane="s2sep_1" departPos="3.60" departPosLat="0.00" departSpeed="13.90" departDelay="0.00" arrival="360.25" arrivalLane="c2n_1" arrivalPos="990.00" arrivalPosLat="0.00" arrivalSpeed="14.96" duration="150.25" routeLength="1997.01" waitingTime="0.00" waitingCount="0" stopTime="0.00" timeLoss="19.31" rerouteNo="1" devices="tripinfo_car_s2n_210 routing_car_s2n_210" vType="Car" speedFactor="1.10" vaporized=""/>
    <tripinfo id="car_n2w_194" depart="194.00" departLane="n2sep_1" departPos="3.60" departPosLat="0.00" departSpeed="13.90" departDelay="0.00" arrival="360.65" arrivalLane="c2w_1" arrivalPos="990.00" arrivalPosLat="0.00" arrivalSpeed="14.17" duration="166.65" routeLength="1986.69" waitingTime="3.65" waitingCount="1" stopTime="0.00" timeLoss="26.05" rerouteNo="1" devices="tripinfo_car_n2w_194 routing_car_n2w_194" vType="Car" speedFactor="1.02" vaporized=""/>
    <tripinfo id="car_n2s_203" depart="203.40" departLane="n2sep_1" departPos="3.60" departPosLat="0.00" departSpeed="13.90" departDelay="0.40" arrival="362.20" arrivalLane="c2s_1" arrivalPos="990.00" arrivalPosLat="0.00" arrivalSpeed="14.64" duration="158.80" routeLength="1997.01" waitingTime="1.00" waitingCount="1" stopTime="0.00" timeLoss="22.86" rerouteNo="1" devices="tripinfo_car_n2s_203 routing_car_n2s_203" vType="Car" speedFactor="1.06" vaporized=""/>
    <tripinfo id="car_n2w_208" depart="208.00" departLane="n2sep_1" departPos="3.60" departPosLat="0.00" departSpeed="13.90" departDelay="0.00" arrival="363.00" arrivalLane="c2w_1" arrivalPos="990.00" arrivalPosLat="0.00" arrivalSpeed="14.87" duration="155.00" routeLength="1986.69" waitingTime="0.00" waitingCount="0" stopTime="0.00" timeLoss="22.93" rerouteNo="1" devices="tripinfo_car_n2w_208 routing_car_n2w_208" vType="Car" speedFactor="1.09" vaporized=""/>
    <tripinfo id="car_n2e_167" depart="167.00" departLane="n2sep_1" departPos="3.60" departPosLat="0.00" departSpeed="13.90" departDelay="0.00" arrival="364.40" arrivalLane="c2e_1" arrivalPos="990.00" arrivalPosLat="0.00" arrivalSpeed="14.17" duration="197.40" routeLength="1996.47" waitingTime="44.60" waitingCount="2" stopTime="0.00" timeLoss="55.85" rerouteNo="1" devices="tripinfo_car_n2e_167 routing_car_n2e_167" vType="Car" speedFactor="1.02" vaporized=""/>
    <tripinfo id="car_s2n_217" depart="217.00" departLane="s2sep_1" departPos="3.60" departPosLat="0.00" departSpeed="13.90" departDelay="0.00" arrival="364.55" arrivalLane="c2n_1" arrivalPos="990.00" arrivalPosLat="0.00" arrivalSpeed="13.89" duration="147.55" routeLength="1997.01" waitingTime="0.00" waitingCount="0" stopTime="0.00" timeLoss="3.88" rerouteNo="1" devices="tripinfo_car_s2n_217 routing_car_s2n_217" vType="Car" speedFactor="1.00" vaporized=""/>
    <tripinfo id="car_s2e_222" depart="222.00" departLane="s2sep_1" departPos="3.60" departPosLat="0.00" departSpeed="13.90" departDelay="0.00" arrival="367.65" arrivalLane="c2e_1" arrivalPos="990.00" arrivalPosLat="0.00" arrivalSpeed="14.85" duration="145.65" routeLength="1986.69" waitingTime="0.00" waitingCount="0" stopTime="0.00" timeLoss="11.71" rerouteNo="1" devices="tripinfo_car_s2e_222 routing_car_s2e_222" vType="Car" speedFactor="1.07" vaporized=""/>
    <tripinfo id="car_n2w_223" depart="223.00" departLane="n2sep_1" departPos="3.60" departPosLat="0.00" departSpeed="13.90" departDelay="0.00" arrival="369.30" arrivalLane="c2w_1" arrivalPos="990.00" arrivalPosLat="0.00" arrivalSpeed="14.09" duration="146.30" routeLength="1986.69" waitingTime="0.00" waitingCount="0" stopTime="0.00" timeLoss="4.62" rerouteNo="1" devices="tripinfo_car_n2w_223 routing_car_n2w_223" vType="Car" speedFactor="1.01" vaporized=""/>
    <tripinfo id="car_n2e_187" depart="187.00" departLane="n2sep_1" departPos="3.60" departPosLat="0.00" departSpeed="13.90" departDelay="0.00" arrival="372.85" arrivalLane="c2e_1" arrivalPos="990.00" arrivalPosLat="0.00" arrivalSpeed="14.32" duration="185.85" routeLength="1996.47" waitingTime="26.70" waitingCount="3" stopTime="0.00" timeLoss="45.77" rerouteNo="1" devices="tripinfo_car_n2e_187 routing_car_n2e_187" vType="Car" speedFactor="1.03" vaporized=""/>
    <tripinfo id="car_s2w_155" depart="155.00" departLane="s2sep_1" departPos="3.60" departPosLat="0.00" departSpeed="13.90" departDelay="0.00" arrival="374.05" arrivalLane="c2w_1" arrivalPos="990.00" arrivalPosLat="0.00" arrivalSpeed="13.97" duration="219.05" routeLength="1996.47" waitingTime="63.05" waitingCount="2" stopTime="0.00" timeLoss="75.47" rerouteNo="1" devices="tripinfo_car_s2w_155 routing_car_s2w_155" vType="Car" speedFactor="1.01" vaporized=""/>
    <tripinfo id="car_n2e_188" depart="188.45" departLane="n2sep_1" departPos="3.60" departPosLat="0.00" departSpeed="13.90" departDelay="0.45" arrival="374.90" arrivalLane="c2e_1" arrivalPos="990.00" arrivalPosLat="0.00" arrivalSpeed="15.45" duration="186.45" routeLength="1996.47" waitingTime="22.55" waitingCount="3" stopTime="0.00" timeLoss="60.71" rerouteNo="1" devices="tripinfo_car_n2e_188 routing_car_n2e_188" vType="Car" speedFactor="1.15" vaporized=""/>
    <tripinfo id="car_s2w_157" depart="157.00" departLane="s2sep_1" departPos="3.60" departPosLat="0.00" departSpeed="13.90" departDelay="0.00" arrival="375.90" arrivalLane="c2w_1" arrivalPos="990.00" arrivalPosLat="0.00" arrivalSpeed="15.43" duration="218.90" routeLength="1996.47" waitingTime="61.15" waitingCount="2" stopTime="0.00" timeLoss="95.73" rerouteNo="1" devices="tripinfo_car_s2w_157 routing_car_s2w_157" vType="Car" speedFactor="1.17" vaporized=""/>
    <tripinfo id="car_s2w_182" depart="182.00" departLane="s2sep_1" departPos="3.60" departPosLat="0.00" departSpeed="13.90" departDelay="0.00" arrival="378.10" arrivalLane="c2w_1" arrivalPos="990.00" arrivalPosLat="0.00" arrivalSpeed="15.01" duration="196.10" routeLength="1996.47" waitingTime="40.20" waitingCount="2" stopTime="0.00" timeLoss="65.19" rerouteNo="1" devices="tripinfo_car_s2w_182 routing_car_s2w_182" vType="Car" speedFactor="1.10" vaporized=""/>
    <tripinfo id="car_n2e_189" depart="190.10" departLane="n2sep_1" departPos="3.60" departPosLat="0.00" departSpeed="13.90" departDelay="1.10" arrival="380.05" arrivalLane="c2e_1" arrivalPos="990.00" arrivalPosLat="0.00" arrivalSpeed="13.90" duration="189.95" routeLength="1996.47" waitingTime="16.90" waitingCount="2" stopTime="0.00" timeLoss="45.60" rerouteNo="1" devices="tripinfo_car_n2e_189 routing_car_n2e_189" vType="Car" speedFactor="1.00" vaporized=""/>
    <tripinfo id="car_s2w_200" depart="200.00" departLane="s2sep_1" departPos="3.60" departPosLat="0.00" departSpeed="13.90" departDelay="0.00" arrival="381.20" arrivalLane="c2w_1" arrivalPos="990.00" arrivalPosLat="0.00" arrivalSpeed="14.36" duration="181.20" routeLength="1996.47" waitingTime="18.75" waitingCount="1" stopTime="0.00" timeLoss="42.13" rerouteNo="1" devices="tripinfo_car_s2w_200 routing_car_s2w_200" vType="Car" speedFactor="1.04" vaporized=""/>
    <tripinfo id="car_s2w_208" depart="208.00" departLane="s2sep_1" departPos="3.60" departPosLat="0.00" departSpeed="13.90" departDelay="0.00" arrival="383.25" arrivalLane="c2w_1" arrivalPos="990.00" arrivalPosLat="0.00" arrivalSpeed="15.13" duration="175.25" routeLength="1996.47" waitingTime="18.30" waitingCount="1" stopTime="0.00" timeLoss="46.59" rerouteNo="1" devices="tripinfo_car_s2w_208 routing_car_s2w_208" vType="Car" speedFactor="1.12" vaporized=""/>
    <tripinfo id="car_s2w_218" depart="218.45" departLane="s2sep_1" departPos="3.60" departPosLat="0.00" departSpeed="13.90" departDelay="0.45" arrival="387.40" arrivalLane="c2w_1" arrivalPos="990.00" arrivalPosLat="0.00" arrivalSpeed="13.89" duration="168.95" routeLength="1996.47" waitingTime="7.85" waitingCount="1" stopTime="0.00" timeLoss="24.64" rerouteNo="1" devices="tripinfo_car_s2w_218 routing_car_s2w_218" vType="Car" speedFactor="1.00" vaporized=""/>
    <tripinfo id="car_w2s_190" depart="190.00" departLane="w2sep_1" departPos="3.60" departPosLat="0.00" departSpeed="13.90" departDelay="0.00" arrival="387.80" arrivalLane="c2s_1" arrivalPos="990.00" arrivalPosLat="0.00" arrivalSpeed="14.49" duration="197.80" routeLength="1986.69" waitingTime="51.85" waitingCount="1" stopTime="0.00" timeLoss="60.01" rerouteNo="1" devices="tripinfo_car_w2s_190 routing_car_w2s_190" vType="Car" speedFactor="1.04" vaporized=""/>
    <tripinfo id="car_e2n_186" depart="187.50" departLane="e2sep_1" departPos="3.60" departPosLat="0.00" departSpeed="13.90" departDelay="1.50" arrival="389.45" arrivalLane="c2n_1" arrivalPos="990.00" arrivalPosLat="0.00" arrivalSpeed="14.13" duration="201.95" routeLength="1986.69" waitingTime="50.05" waitingCount="1" stopTime="0.00" timeLoss="60.70" rerouteNo="1" devices="tripinfo_car_e2n_186 routing_car_e2n_186" vType="Car" speedFactor="1.02" vaporized=""/>
    <tripinfo id="car_w2s_200" depart="200.00" departLane="w2sep_1" departPos="3.60" departPosLat="0.00" departSpeed="13.90" departDelay="0.00" arrival="390.75" arrivalLane="c2s_1" arrivalPos="990.00" arrivalPosLat="0.00" arrivalSpeed="15.08" duration="190.75" routeLength="1986.69" waitingTime="46.40" waitingCount="1" stopTime="0.00" timeLoss="59.16" rerouteNo="1" devices="tripinfo_car_w2s_200 routing_car_w2s_200" vType="Car" speedFactor="1.09" vaporized=""/>
    <tripinfo id="car_e2n_229" depart="229.00" departLane="e2sep_1" departPos="3.60" departPosLat="0.00" departSpeed="13.90" departDelay="0.00" arrival="393.30" arrivalLane="c2n_1" arrivalPos="990.00" arrivalPosLat="0.00" arrivalSpeed="14.36" duration="164.30" routeLength="1986.69" waitingTime="14.10" waitingCount="1" stopTime="0.00" timeLoss="25.40" rerouteNo="1" devices="tripinfo_car_e2n_229 routing_car_e2n_229" vType="Car" speedFactor="1.03" vaporized=""/>
    <tripinfo id="car_w2e_208" depart="208.00" departLane="w2sep_1" departPos="3.60" departPosLat="0.00" departSpeed="13.90" departDelay="0.00" arrival="394.50" arrivalLane="c2e_1" arrivalPos="990.00" arrivalPosLat="0.00" arrivalSpeed="14.04" duration="186.50" routeLength="1997.01" waitingTime="34.60" waitingCount="1" stopTime="0.00" timeLoss="44.21" rerouteNo="1" devices="tripinfo_car_w2e_208 routing_car_w2e_208" vType="Car" speedFactor="1.01" vaporized=""/>
    <tripinfo id="car_e2w_244" depart="244.00" departLane="e2sep_1" departPos="3.60" departPosLat="0.00" departSpeed="13.90" departDelay="0.00" arrival="394.85" arrivalLane="c2w_1" arrivalPos="990.00" arrivalPosLat="0.00" arrivalSpeed="14.02" duration="150.85" routeLength="1997.01" waitingTime="0.00" waitingCount="0" stopTime="0.00" timeLoss="8.46" rerouteNo="1" devices="tripinfo_car_e2w_244 routing_car_e2w_244" vType="Car" speedFactor="1.01" vaporized=""/>
    <tripinfo id="car_w2e_213" depart="213.00" departLane="w2sep_1" departPos="3.60" departPosLat="0.00" departSpeed="13.90" departDelay="0.00" arrival="397.30" arrivalLane="c2e_1" arrivalPos="990.00" arrivalPosLat="0.00" arrivalSpeed="14.69" duration="184.30" routeLength="1997.01" waitingTime="33.05" waitingCount="1" stopTime="0.00" timeLoss="49.36" rerouteNo="1" devices="tripinfo_car_w2e_213 routing_car_w2e_213" vType="Car" speedFactor="1.07" vaporized=""/>
    <tripinfo id="car_w2n_218" depart="218.00" departLane="w2sep_1" departPos="3.60" departPosLat="0.00" departSpeed="13.90" departDelay="0.00" arrival="398.95" arrivalLane="c2n_1" arrivalPos="990.00" arrivalPosLat="0.00" arrivalSpeed="13.90" duration="180.95" routeLength="1996.47" waitingTime="24.45" waitingCount="2" stopTime="0.00" timeLoss="36.61" rerouteNo="1" devices="tripinfo_car_w2n_218 routing_car_w2n_218" vType="Car" speedFactor="1.00" vaporized=""/>
    <tripinfo id="car_e2s_262" depart="262.00" departLane="e2sep_1" departPos="3.60" departPosLat="0.00" departSpeed="13.90" departDelay="0.00" arrival="401.25" arrivalLane="c2s_1" arrivalPos="990.00" arrivalPosLat="0.00" arrivalSpeed="15.23" duration="139.25" routeLength="1996.47" waitingTime="0.05" waitingCount="1" stopTime="0.00" timeLoss="7.55" rerouteNo="1" devices="tripinfo_car_e2s_262 routing_car_e2s_262" vType="Car" speedFactor="1.10" vaporized=""/>
    <tripinfo id="car_w2e_219" depart="219.50" departLane="w2sep_1" departPos="3.60" departPosLat="0.00" departSpeed="13.90" departDelay="0.50" arrival="401.75" arrivalLane="c2e_1" arrivalPos="990.00" arrivalPosLat="0.00" arrivalSpeed="13.89" duration="182.25" routeLength="1997.01" waitingTime="22.30" waitingCount="1" stopTime="0.00" timeLoss="38.55" rerouteNo="1" devices="tripinfo_car_w2e_219 routing_car_w2e_219" vType="Car" speedFactor="1.00" vaporized=""/>
    <tripinfo id="car_w2e_234" depart="234.00" departLane="w2sep_1" departPos="3.60" departPosLat="0.00" departSpeed="13.90" departDelay="0.00" arrival="404.15" arrivalLane="c2e_1" arrivalPos="990.00" arrivalPosLat="0.00" arrivalSpeed="14.58" duration="170.15" routeLength="1997.01" waitingTime="15.75" waitingCount="1" stopTime="0.00" timeLoss="35.19" rerouteNo="1" devices="tripinfo_car_w2e_234 routing_car_w2e_234" vType="Car" speedFactor="1.06" vaporized=""/>
    <tripinfo id="car_w2e_240" depart="240.00" departLane="w2sep_1" departPos="3.60" departPosLat="0.00" departSpeed="13.90" departDelay="0.00" arrival="405.95" arrivalLane="c2e_1" arrivalPos="990.00" arrivalPosLat="0.00" arrivalSpeed="15.41" duration="165.95" routeLength="1997.01" waitingTime="14.85" waitingCount="1" stopTime="0.00" timeLoss="43.04" rerouteNo="1" devices="tripinfo_car_w2e_240 routing_car_w2e_240" vType="Car" speedFactor="1.17" vaporized=""/>
    <tripinfo id="car_w2e_242" depart="242.00" departLane="w2sep_1" departPos="3.60" departPosLat="0.00" departSpeed="13.90" departDelay="0.00" arrival="408.15" arrivalLane="c2e_1" arrivalPos="990.00" arrivalPosLat="0.00" arrivalSpeed="14.94" duration="166.15" routeLength="1997.01" waitingTime="11.30" waitingCount="1" stopTime="0.00" timeLoss="35.35" rerouteNo="1" devices="tripinfo_car_w2e_242 routing_car_w2e_242" vType="Car" speedFactor="1.10" vaporized=""/>
    <tripinfo id="amb_w2e_300" depart="300.00" departLane="w2sep_1" departPos="6.60" departPosLat="0.00" departSpeed="13.90" departDelay="0.00" arrival="413.60" arrivalLane="c2e_1" arrivalPos="990.00" arrivalPosLat="-0.95" arrivalSpeed="20.81" duration="113.60" routeLength="1994.01" waitingTime="0.00" waitingCount="0" stopTime="0.00" timeLoss="17.97" rerouteNo="1" devices="tripinfo_amb_w2e_300 routing_amb_w2e_300 bluelight_amb_w2e_300 fcd_amb_w2e_300" vType="Ambulance" speedFactor="1.50" vaporized="">
        <example_device customValue1="0.00" customValue2="-1.00"/>
    </tripinfo>
    <tripinfo id="car_w2n_271" depart="271.00" departLane="w2sep_1" departPos="3.60" departPosLat="0.00" departSpeed="13.90" departDelay="0.00" arrival="418.00" arrivalLane="c2n_1" arrivalPos="990.00" arrivalPosLat="0.00" arrivalSpeed="13.96" duration="147.00" routeLength="1996.47" waitingTime="0.00" waitingCount="0" stopTime="0.00" timeLoss="3.31" rerouteNo="1" devices="tripinfo_car_w2n_271 routing_car_w2n_271" vType="Car" speedFactor="1.00" vaporized=""/>
    <tripinfo id="car_w2e_294" depart="294.00" departLane="w2sep_1" departPos="3.60" departPosLat="0.00" departSpeed="13.90" departDelay="0.00" arrival="422.90" arrivalLane="c2e_1" arrivalPos="990.00" arrivalPosLat="1.10" arrivalSpeed="15.55" duration="128.90" routeLength="1997.01" waitingTime="0.00" waitingCount="0" stopTime="0.00" timeLoss="0.44" rerouteNo="1" devices="tripinfo_car_w2e_294 routing_car_w2e_294" vType="Car@car_w2e_294" speedFactor="1.12" vaporized=""/>
    <tripinfo id="car_w2n_272" depart="272.45" departLane="w2sep_1" departPos="3.60" departPosLat="0.00" departSpeed="13.90" departDelay="0.45" arrival="423.35" arrivalLane="c2n_1" arrivalPos="990.00" arrivalPosLat="0.00" arrivalSpeed="13.94" duration="150.90" routeLength="1996.47" waitingTime="0.00" waitingCount="0" stopTime="0.00" timeLoss="7.06" rerouteNo="1" devices="tripinfo_car_w2n_272 routing_car_w2n_272" vType="Car" speedFactor="1.00" vaporized=""/>
    <tripinfo id="car_w2n_280" depart="280.00" departLane="w2sep_1" departPos="3.60" departPosLat="0.00" departSpeed="13.90" departDelay="0.00" arrival="425.85" arrivalLane="c2n_1" arrivalPos="990.00" arrivalPosLat="0.00" arrivalSpeed="14.69" duration="145.85" routeLength="1996.47" waitingTime="0.00" waitingCount="0" stopTime="0.00" timeLoss="11.07" rerouteNo="1" devices="tripinfo_car_w2n_280 routing_car_w2n_280" vType="Car" speedFactor="1.07" vaporized=""/>
    <tripinfo id="car_w2e_303" depart="303.00" departLane="w2sep_1" departPos="3.60" departPosLat="0.00" departSpeed="13.90" departDelay="0.00" arrival="429.95" arrivalLane="c2e_1" arrivalPos="990.00" arrivalPosLat="0.00" arrivalSpeed="15.88" duration="126.95" routeLength="1997.01" waitingTime="0.00" waitingCount="0" stopTime="0.00" timeLoss="1.16" rerouteNo="1" devices="tripinfo_car_w2e_303 routing_car_w2e_303" vType="Car" speedFactor="1.14" vaporized=""/>
</tripinfos>
