<?xml version="1.0" encoding="UTF-8"?>

<!-- generated on 2021-05-18 05:44:48 by Eclipse SUMO sumo Version 1.9.1
<configuration xmlns:xsi="http://www.w3.org/2001/XMLSchema-instance" xsi:noNamespaceSchemaLocation="http://sumo.dlr.de/xsd/sumoConfiguration.xsd">

    <input>
        <net-file value="sumofiles/junction.net.xml"/>
        <route-files value="sumofiles/junction_none_14.rou.xml"/>
        <additional-files value="sumofiles/junction.det.xml"/>
    </input>

    <output>
        <tripinfo-output value="sumofiles/output/tripinfo_none_14.xml"/>
    </output>

    <time>
        <begin value="0"/>
        <end value="10000"/>
        <step-length value="1.0"/>
    </time>

    <processing>
        <lateral-resolution value="0.5"/>
    </processing>

    <report>
        <no-warnings value="true"/>
        <error-log value="sumofiles/output/errorlog_none_14.log"/>
        <no-step-log value="true"/>
    </report>

    <traci_server>
        <remote-port value="49453"/>
    </traci_server>

    <gui_only>
        <gui-settings-file value="sumofiles/junction-gui.settings.xml"/>
        <tracker-interval value="1"/>
    </gui_only>

</configuration>
-->

<tripinfos xmlns:xsi="http://www.w3.org/2001/XMLSchema-instance" xsi:noNamespaceSchemaLocation="http://sumo.dlr.de/xsd/tripinfo_file.xsd">
    <tripinfo id="car_w2e_8" depart="8.00" departLane="w2sep_1" departPos="3.60" departPosLat="0.00" departSpeed="13.90" departDelay="0.00" arrival="144.00" arrivalLane="c2e_1" arrivalPos="990.00" arrivalPosLat="0.00" arrivalSpeed="14.73" duration="136.00" routeLength="1997.01" waitingTime="0.00" waitingCount="0" stopTime="0.00" timeLoss="0.11" rerouteNo="1" devices="tripinfo_car_w2e_8 routing_car_w2e_8" vType="Car" speedFactor="1.06" vaporized=""/>
    <tripinfo id="car_w2n_3" depart="3.00" departLane="w2sep_1" departPos="3.60" departPosLat="0.00" departSpeed="13.90" departDelay="0.00" arrival="145.00" arrivalLane="c2n_1" arrivalPos="990.00" arrivalPosLat="0.00" arrivalSpeed="14.73" duration="142.00" routeLength="1996.47" waitingTime="0.00" waitingCount="0" stopTime="0.00" timeLoss="4.92" rerouteNo="1" devices="tripinfo_car_w2n_3 routing_car_w2n_3" vType="Car" speedFactor="1.06" vaporized=""/>
    <tripinfo id="car_w2n_11" depart="11.00" departLane="w2sep_1" departPos="3.60" departPosLat="0.00" departSpeed="13.90" departDelay="0.00" arrival="157.00" arrivalLane="c2n_1" arrivalPos="990.00" arrivalPosLat="0.00" arrivalSpeed="14.04" duration="146.00" routeLength="1996.47" waitingTime="0.00" waitingCount="0" stopTime="0.00" timeLoss="2.85" rerouteNo="1" devices="tripinfo_car_w2n_11 routing_car_w2n_11" vType="Car" speedFactor="1.01" vaporized=""/>
    <tripinfo id="car_n2s_15" depart="15.00" departLane="n2sep_1" departPos="3.60" departPosLat="0.00" departSpeed="13.90" departDelay="0.00" arrival="162.00" arrivalLane="c2s_1" arrivalPos="990.00" arrivalPosLat="0.00" arrivalSpeed="14.32" duration="147.00" routeLength="1997.01" waitingTime="0.00" waitingCount="0" stopTime="0.00" timeLoss="7.54" rerouteNo="1" devices="tripinfo_car_n2s_15 routing_car_n2s_15" vType="Car" speedFactor="1.03" vaporized=""/>
    <tripinfo id="car_n2w_18" depart="18.00" departLane="n2sep_1" departPos="3.60" departPosLat="0.00" departSpeed="13.90" departDelay="0.00" arrival="168.00" arrivalLane="c2w_1" arrivalPos="990.00" arrivalPosLat="0.00" arrivalSpeed="13.90" duration="150.00" routeLength="1986.69" waitingTime="0.00" waitingCount="0" stopTime="0.00" timeLoss="6.20" rerouteNo="1" devices="tripinfo_car_n2w_18 routing_car_n2w_18" vType="Car" speedFactor="1.00" vaporized=""/>
    <tripinfo id="car_n2s_19" depart="20.00" departLane="n2sep_1" departPos="3.60" departPosLat="0.00" departSpeed="13.90" departDelay="1.00" arrival="168.00" arrivalLane="c2s_1" arrivalPos="990.00" arrivalPosLat="0.00" arrivalSpeed="14.54" duration="148.00" routeLength="1997.01" waitingTime="0.00" waitingCount="0" stopTime="0.00" timeLoss="10.07" rerouteNo="1" devices="tripinfo_car_n2s_19 routing_car_n2s_19" vType="Car" speedFactor="1.05" vaporized=""/>
    <tripinfo id="car_n2w_25" depart="25.00" departLane="n2sep_1" departPos="3.60" departPosLat="0.00" departSpeed="13.90" departDelay="0.00" arrival="173.00" arrivalLane="c2w_1" arrivalPos="990.00" arrivalPosLat="0.00" arrivalSpeed="14.32" duration="148.00" routeLength="1986.69" waitingTime="0.00" waitingCount="0" stopTime="0.00" timeLoss="8.06" rerouteNo="1" devices="tripinfo_car_n2w_25 routing_car_n2w_25" vType="Car" speedFactor="1.03" vaporized=""/>
    <tripinfo id="car_s2w_11" depart="11.00" departLane="s2sep_1" departPos="3.60" departPosLat="0.00" departSpeed="13.90" departDelay="0.00" arrival="176.00" arrivalLane="c2w_1" arrivalPos="990.00" arrivalPosLat="0.00" arrivalSpeed="14.95" duration="165.00" routeLength="1996.47" waitingTime="9.00" waitingCount="2" stopTime="0.00" timeLoss="31.08" rerouteNo="1" devices="tripinfo_car_s2w_11 routing_car_s2w_11" vType="Car" speedFactor="1.08" vaporized=""/>
    <tripinfo id="car_s2w_21" depart="21.00" departLane="s2sep_1" departPos="3.60" departPosLat="0.00" departSpeed="13.90" departDelay="0.00" arrival="178.00" arrivalLane="c2w_1" arrivalPos="990.00" arrivalPosLat="0.00" arrivalSpeed="14.85" duration="157.00" routeLength="1996.47" waitingTime="4.00" waitingCount="1" stopTime="0.00" timeLoss="23.59" rerouteNo="1" devices="tripinfo_car_s2w_21 routing_car_s2w_21" vType="Car" speedFactor="1.08" vaporized=""/>
    <tripinfo id="car_s2w_35" depart="35.00" departLane="s2sep_1" departPos="3.60" departPosLat="0.00" departSpeed="13.90" departDelay="0.00" arrival="181.00" arrivalLane="c2w_1" arrivalPos="990.00" arrivalPosLat="0.00" arrivalSpeed="15.42" duration="146.00" routeLength="1996.47" waitingTime="0.00" waitingCount="0" stopTime="0.00" timeLoss="16.67" rerouteNo="1" devices="tripinfo_car_s2w_35 routing_car_s2w_35" vType="Car" speedFactor="1.12" vaporized=""/>
    <tripinfo id="bus_e2n_7" depart="7.00" departLane="e2sep_1" departPos="12.10" departPosLat="0.00" departSpeed="13.90" departDelay="0.00" arrival="213.00" arrivalLane="c2n_1" arrivalPos="990.00" arrivalPosLat="0.00" arrivalSpeed="13.90" duration="206.00" routeLength="1978.19" waitingTime="50.00" waitingCount="1" stopTime="0.00" timeLoss="62.58" rerouteNo="1" devices="tripinfo_bus_e2n_7 routing_bus_e2n_7" vType="Bus" speedFactor="1.00" vaporized=""/>
    <tripinfo id="bus_w2e_24" depart="24.00" departLane="w2sep_1" departPos="12.10" departPosLat="0.00" departSpeed="13.90" departDelay="0.00" arrival="213.00" arrivalLane="c2e_1" arrivalPos="990.00" arrivalPosLat="0.00" arrivalSpeed="13.90" duration="189.00" routeLength="1988.51" waitingTime="33.00" waitingCount="1" stopTime="0.00" timeLoss="45.70" rerouteNo="1" devices="tripinfo_bus_w2e_24 routing_bus_w2e_24" vType="Bus" speedFactor="1.00" vaporized=""/>
    <tripinfo id="car_e2w_21" depart="21.00" departLane="e2sep_1" departPos="3.60" departPosLat="0.00" departSpeed="13.90" departDelay="0.00" arrival="214.00" arrivalLane="c2w_1" arrivalPos="990.00" arrivalPosLat="0.00" arrivalSpeed="14.04" duration="193.00" routeLength="1997.01" waitingTime="37.00" waitingCount="1" stopTime="0.00" timeLoss="49.97" rerouteNo="1" devices="tripinfo_car_e2w_21 routing_car_e2w_21" vType="Car" speedFactor="1.01" vaporized=""/>
    <tripinfo id="car_e2w_26" depart="26.00" departLane="e2sep_1" departPos="3.60" departPosLat="0.00" departSpeed="13.90" departDelay="0.00" arrival="216.00" arrivalLane="c2w_1" arrivalPos="990.00" arrivalPosLat="0.00" arrivalSpeed="14.88" duration="190.00" routeLength="1997.01" waitingTime="37.00" waitingCount="1" stopTime="0.00" timeLoss="57.91" rerouteNo="1" devices="tripinfo_car_e2w_26 routing_car_e2w_26" vType="Car" speedFactor="1.09" vaporized=""/>
    <tripinfo id="car_w2e_35" depart="35.00" departLane="w2sep_1" departPos="3.60" departPosLat="0.00" departSpeed="13.90" departDelay="0.00" arrival="217.00" arrivalLane="c2e_1" arrivalPos="990.00" arrivalPosLat="0.00" arrivalSpeed="14.52" duration="182.00" routeLength="1997.01" waitingTime="26.00" waitingCount="1" stopTime="0.00" timeLoss="44.05" rerouteNo="1" devices="tripinfo_car_w2e_35 routing_car_w2e_35" vType="Car" speedFactor="1.05" vaporized=""/>
    <tripinfo id="car_e2w_46" depart="46.00" departLane="e2sep_1" departPos="3.60" departPosLat="0.00" departSpeed="13.90" departDelay="0.00" arrival="219.00" arrivalLane="c2w_1" arrivalPos="990.00" arrivalPosLat="0.00" arrivalSpeed="14.48" duration="173.00" routeLength="1997.01" waitingTime="17.00" waitingCount="1" stopTime="0.00" timeLoss="35.45" rerouteNo="1" devices="tripinfo_car_e2w_46 routing_car_e2w_46" vType="Car" speedFactor="1.05" vaporized=""/>
    <tripinfo id="car_w2s_47" depart="48.00" departLane="w2sep_1" departPos="3.60" departPosLat="0.00" departSpeed="13.90" departDelay="1.00" arrival="219.00" arrivalLane="c2s_1" arrivalPos="990.00" arrivalPosLat="0.00" arrivalSpeed="13.90" duration="171.00" routeLength="1986.69" waitingTime="11.00" waitingCount="1" stopTime="0.00" timeLoss="27.18" rerouteNo="1" devices="tripinfo_car_w2s_47 routing_car_w2s_47" vType="Car" speedFactor="1.00" vaporized=""/>
    <tripinfo id="car_w2e_46" depart="46.00" departLane="w2sep_1" departPos="3.60" departPosLat="0.00" departSpeed="13.90" departDelay="0.00" arrival="221.00" arrivalLane="c2e_1" arrivalPos="990.00" arrivalPosLat="0.00" arrivalSpeed="13.89" duration="175.00" routeLength="1997.01" waitingTime="13.00" waitingCount="1" stopTime="0.00" timeLoss="30.61" rerouteNo="1" devices="tripinfo_car_w2e_46 routing_car_w2e_46" vType="Car" speedFactor="1.00" vaporized=""/>
    <tripinfo id="car_w2s_55" depart="55.00" departLane="w2sep_1" departPos="3.60" departPosLat="0.00" departSpeed="13.90" departDelay="0.00" arrival="221.00" arrivalLane="c2s_1" arrivalPos="990.00" arrivalPosLat="0.00" arrivalSpeed="15.45" duration="166.00" routeLength="1986.69" waitingTime="10.00" waitingCount="1" stopTime="0.00" timeLoss="41.74" rerouteNo="1" devices="tripinfo_car_w2s_55 routing_car_w2s_55" vType="Car" speedFactor="1.16" vaporized=""/>
    <tripinfo id="car_e2n_60" depart="60.00" departLane="e2sep_1" departPos="3.60" departPosLat="0.00" departSpeed="13.90" departDelay="0.00" arrival="223.00" arrivalLane="c2n_1" arrivalPos="990.00" arrivalPosLat="0.00" arrivalSpeed="14.15" duration="163.00" routeLength="1986.69" waitingTime="5.00" waitingCount="1" stopTime="0.00" timeLoss="21.54" rerouteNo="1" devices="tripinfo_car_e2n_60 routing_car_e2n_60" vType="Car" speedFactor="1.02" vaporized=""/>
    <tripinfo id="car_e2w_48" depart="48.00" departLane="e2sep_1" departPos="3.60" departPosLat="0.00" departSpeed="13.90" departDelay="0.00" arrival="224.00" arrivalLane="c2w_1" arrivalPos="990.00" arrivalPosLat="0.00" arrivalSpeed="13.90" duration="176.00" routeLength="1997.01" waitingTime="13.00" waitingCount="1" stopTime="0.00" timeLoss="31.36" rerouteNo="1" devices="tripinfo_car_e2w_48 routing_car_e2w_48" vType="Car" speedFactor="1.00" vaporized=""/>
    <tripinfo id="car_w2s_76" depart="76.00" departLane="w2sep_1" departPos="3.60" departPosLat="0.00" departSpeed="13.90" departDelay="0.00" arrival="225.00" arrivalLane="c2s_1" arrivalPos="990.00" arrivalPosLat="0.00" arrivalSpeed="14.25" duration="149.00" routeLength="1986.69" waitingTime="0.00" waitingCount="0" stopTime="0.00" timeLoss="8.88" rerouteNo="1" devices="tripinfo_car_w2s_76 routing_car_w2s_76" vType="Car" speedFactor="1.03" vaporized=""/>
    <tripinfo id="car_e2n_81" depart="81.00" departLane="e2sep_1" departPos="3.60" departPosLat="0.00" departSpeed="13.90" departDelay="0.00" arrival="225.00" arrivalLane="c2n_1" arrivalPos="990.00" arrivalPosLat="0.00" arrivalSpeed="15.22" duration="144.00" routeLength="1986.69" waitingTime="0.00" waitingCount="0" stopTime="0.00" timeLoss="15.93" rerouteNo="1" devices="tripinfo_car_e2n_81 routing_car_e2n_81" vType="Car" speedFactor="1.12" vaporized=""/>
    <tripinfo id="car_e2s_63" depart="63.00" departLane="e2sep_1" departPos="3.60" departPosLat="0.00" departSpeed="13.90" departDelay="0.00" arrival="229.00" arrivalLane="c2s_1" arrivalPos="990.00" arrivalPosLat="0.00" arrivalSpeed="14.03" duration="166.00" routeLength="1996.47" waitingTime="9.00" waitingCount="1" stopTime="0.00" timeLoss="22.91" rerouteNo="1" devices="tripinfo_car_e2s_63 routing_car_e2s_63" vType="Car" speedFactor="1.01" vaporized=""/>
    <tripinfo id="car_e2n_83" depart="83.00" departLane="e2sep_1" departPos="3.60" departPosLat="0.00" departSpeed="13.90" departDelay="0.00" arrival="233.00" arrivalLane="c2n_1" arrivalPos="990.00" arrivalPosLat="0.00" arrivalSpeed="13.90" duration="150.00" routeLength="1986.69" waitingTime="0.00" waitingCount="0" stopTime="0.00" timeLoss="5.65" rerouteNo="1" devices="tripinfo_car_e2n_83 routing_car_e2n_83" vType="Car" speedFactor="1.00" vaporized=""/>
    <tripinfo id="car_w2n_30" depart="30.00" departLane="w2sep_1" departPos="3.60" departPosLat="0.00" departSpeed="13.90" departDelay="0.00" arrival="236.00" arrivalLane="c2n_1" arrivalPos="990.00" arrivalPosLat="0.00" arrivalSpeed="14.22" duration="206.00" routeLength="1996.47" waitingTime="45.00" waitingCount="2" stopTime="0.00" timeLoss="65.15" rerouteNo="1" devices="tripinfo_car_w2n_30 routing_car_w2n_30" vType="Car" speedFactor="1.03" vaporized=""/>
    <tripinfo id="car_w2n_66" depart="66.00" departLane="w2sep_1" departPos="3.60" departPosLat="0.00" departSpeed="13.90" departDelay="0.00" arrival="238.00" arrivalLane="c2n_1" arrivalPos="990.00" arrivalPosLat="0.00" arrivalSpeed="14.83" duration="172.00" routeLength="1996.47" waitingTime="18.00" waitingCount="1" stopTime="0.00" timeLoss="39.55" rerouteNo="1" devices="tripinfo_car_w2n_66 routing_car_w2n_66" vType="Car" speedFactor="1.09" vaporized=""/>
    <tripinfo id="car_w2n_94" depart="94.00" departLane="w2sep_1" departPos="3.60" departPosLat="0.00" departSpeed="13.90" departDelay="0.00" arrival="244.00" arrivalLane="c2n_1" arrivalPos="990.00" arrivalPosLat="0.00" arrivalSpeed="13.97" duration="150.00" routeLength="1996.47" waitingTime="0.00" waitingCount="0" stopTime="0.00" timeLoss="5.74" rerouteNo="1" devices="tripinfo_car_w2n_94 routing_car_w2n_94" vType="Car" speedFactor="1.01" vaporized=""/>
    <tripinfo id="car_n2s_91" depart="91.00" departLane="n2sep_1" departPos="3.60" departPosLat="0.00" departSpeed="13.90" departDelay="0.00" arrival="246.00" arrivalLane="c2s_1" arrivalPos="990.00" arrivalPosLat="0.00" arrivalSpeed="16.38" duration="155.00" routeLength="1997.01" waitingTime="21.00" waitingCount="1" stopTime="0.00" timeLoss="32.93" rerouteNo="1" devices="tripinfo_car_n2s_91 routing_car_n2s_91" vType="Car" speedFactor="1.18" vaporized=""/>
    <tripinfo id="car_s2n_79" depart="79.00" departLane="s2sep_1" departPos="3.60" departPosLat="0.00" departSpeed="13.90" departDelay="0.00" arrival="252.00" arrivalLane="c2n_1" arrivalPos="990.00" arrivalPosLat="0.00" arrivalSpeed="14.55" duration="173.00" routeLength="1997.01" waitingTime="25.00" waitingCount="1" stopTime="0.00" timeLoss="35.20" rerouteNo="1" devices="tripinfo_car_s2n_79 routing_car_s2n_79" vType="Car" speedFactor="1.05" vaporized=""/>
    <tripinfo id="car_n2w_54" depart="54.00" departLane="n2sep_1" departPos="3.60" departPosLat="0.00" departSpeed="13.90" departDelay="0.00" arrival="254.00" arrivalLane="c2w_1" arrivalPos="990.00" arrivalPosLat="0.00" arrivalSpeed="13.90" duration="200.00" routeLength="1986.69" waitingTime="47.00" waitingCount="1" stopTime="0.00" timeLoss="56.52" rerouteNo="1" devices="tripinfo_car_n2w_54 routing_car_n2w_54" vType="Car" speedFactor="1.00" vaporized=""/>
    <tripinfo id="car_s2n_88" depart="88.00" departLane="s2sep_1" departPos="3.60" departPosLat="0.00" departSpeed="13.90" departDelay="0.00" arrival="254.00" arrivalLane="c2n_1" arrivalPos="990.00" arrivalPosLat="0.00" arrivalSpeed="15.44" duration="166.00" routeLength="1997.01" waitingTime="17.00" waitingCount="1" stopTime="0.00" timeLoss="38.96" rerouteNo="1" devices="tripinfo_car_s2n_88 routing_car_s2n_88" vType="Car" speedFactor="1.13" vaporized=""/>
    <tripinfo id="car_n2w_93" depart="93.00" departLane="n2sep_1" departPos="3.60" departPosLat="0.00" departSpeed="13.90" departDelay="0.00" arrival="256.00" arrivalLane="c2w_1" arrivalPos="990.00" arrivalPosLat="0.00" arrivalSpeed="15.43" duration="163.00" routeLength="1986.69" waitingTime="18.00" waitingCount="1" stopTime="0.00" timeLoss="38.54" rerouteNo="1" devices="tripinfo_car_n2w_93 routing_car_n2w_93" vType="Car" speedFactor="1.15" vaporized=""/>
    <tripinfo id="car_s2e_85" depart="85.00" departLane="s2sep_1" departPos="3.60" departPosLat="0.00" departSpeed="13.90" departDelay="0.00" arrival="257.00" arrivalLane="c2e_1" arrivalPos="990.00" arrivalPosLat="0.00" arrivalSpeed="13.90" duration="172.00" routeLength="1986.69" waitingTime="17.00" waitingCount="1" stopTime="0.00" timeLoss="28.15" rerouteNo="1" devices="tripinfo_car_s2e_85 routing_car_s2e_85" vType="Car" speedFactor="1.00" vaporized=""/>
    <tripinfo id="car_n2w_95" depart="95.00" departLane="n2sep_1" departPos="3.60" departPosLat="0.00" departSpeed="13.90" departDelay="0.00" arrival="258.00" arrivalLane="c2w_1" arrivalPos="990.00" arrivalPosLat="0.00" arrivalSpeed="15.69" duration="163.00" routeLength="1986.69" waitingTime="17.00" waitingCount="1" stopTime="0.00" timeLoss="40.36" rerouteNo="1" devices="tripinfo_car_n2w_95 routing_car_n2w_95" vType="Car" speedFactor="1.17" vaporized=""/>
    <tripinfo id="car_n2s_115" depart="115.00" departLane="n2sep_1" departPos="3.60" departPosLat="0.00" departSpeed="13.90" departDelay="0.00" arrival="258.00" arrivalLane="c2s_1" arrivalPos="990.00" arrivalPosLat="0.00" arrivalSpeed="16.40" duration="143.00" routeLength="1997.01" waitingTime="0.00" waitingCount="0" stopTime="0.00" timeLoss="20.70" rerouteNo="1" devices="tripinfo_car_n2s_115 routing_car_n2s_115" vType="Car" speedFactor="1.18" vaporized=""/>
    <tripinfo id="car_s2e_116" depart="116.00" departLane="s2sep_1" departPos="3.60" departPosLat="0.00" departSpeed="13.90" departDelay="0.00" arrival="260.00" arrivalLane="c2e_1" arrivalPos="990.00" arrivalPosLat="0.00" arrivalSpeed="15.16" duration="144.00" routeLength="1986.69" waitingTime="0.00" waitingCount="0" stopTime="0.00" timeLoss="12.77" rerouteNo="1" devices="tripinfo_car_s2e_116 routing_car_s2e_116" vType="Car" speedFactor="1.10" vaporized=""/>
    <tripinfo id="car_n2w_108" depart="108.00" departLane="n2sep_1" departPos="3.60" departPosLat="0.00" departSpeed="13.90" departDelay="0.00" arrival="267.00" arrivalLane="c2w_1" arrivalPos="990.00" arrivalPosLat="0.00" arrivalSpeed="13.90" duration="159.00" routeLength="1986.69" waitingTime="0.00" waitingCount="0" stopTime="0.00" timeLoss="14.50" rerouteNo="1" devices="tripinfo_car_n2w_108 routing_car_n2w_108" vType="Car" speedFactor="1.00" vaporized=""/>
    <tripinfo id="car_s2n_128" depart="128.00" departLane="s2sep_1" departPos="3.60" departPosLat="0.00" departSpeed="13.90" departDelay="0.00" arrival="268.00" arrivalLane="c2n_1" arrivalPos="990.00" arrivalPosLat="0.00" arrivalSpeed="14.32" duration="140.00" routeLength="1997.01" waitingTime="0.00" waitingCount="0" stopTime="0.00" timeLoss="0.42" rerouteNo="1" devices="tripinfo_car_s2n_128 routing_car_s2n_128" vType="Car" speedFactor="1.03" vaporized=""/>
    <tripinfo id="car_n2e_130" depart="130.00" departLane="n2sep_1" departPos="3.60" departPosLat="0.00" departSpeed="13.90" departDelay="0.00" arrival="268.00" arrivalLane="c2e_1" arrivalPos="990.00" arrivalPosLat="0.00" arrivalSpeed="15.18" duration="138.00" routeLength="1996.47" waitingTime="0.00" waitingCount="0" stopTime="0.00" timeLoss="5.22" rerouteNo="1" devices="tripinfo_car_n2e_130 routing_car_n2e_130" vType="Car" speedFactor="1.09" vaporized=""/>
    <tripinfo id="car_s2w_90" depart="90.00" departLane="s2sep_1" departPos="3.60" departPosLat="0.00" departSpeed="13.90" departDelay="0.00" arrival="272.00" arrivalLane="c2w_1" arrivalPos="990.00" arrivalPosLat="0.00" arrivalSpeed="13.90" duration="182.00" routeLength="1996.47" waitingTime="20.00" waitingCount="2" stopTime="0.00" timeLoss="37.29" rerouteNo="1" devices="tripinfo_car_s2w_90 routing_car_s2w_90" vType="Car" speedFactor="1.00" vaporized=""/>
    <tripinfo id="car_s2n_137" depart="137.00" departLane="s2sep_1" departPos="3.60" departPosLat="0.00" departSpeed="13.90" departDelay="0.00" arrival="272.00" arrivalLane="c2n_1" arrivalPos="990.00" arrivalPosLat="0.00" arrivalSpeed="15.10" duration="135.00" routeLength="1997.01" waitingTime="0.00" waitingCount="0" stopTime="0.00" timeLoss="2.36" rerouteNo="1" devices="tripinfo_car_s2n_137 routing_car_s2n_137" vType="Car" speedFactor="1.09" vaporized=""/>
    <tripinfo id="car_n2e_135" depart="135.00" departLane="n2sep_1" departPos="3.60" departPosLat="0.00" departSpeed="13.90" departDelay="0.00" arrival="284.00" arrivalLane="c2e_1" arrivalPos="990.00" arrivalPosLat="0.00" arrivalSpeed="14.50" duration="149.00" routeLength="1996.47" waitingTime="0.00" waitingCount="0" stopTime="0.00" timeLoss="10.29" rerouteNo="1" devices="tripinfo_car_n2e_135 routing_car_n2e_135" vType="Car" speedFactor="1.04" vaporized=""/>
    <tripinfo id="car_s2n_139" depart="139.00" departLane="s2sep_1" departPos="3.60" departPosLat="0.00" departSpeed="13.90" departDelay="0.00" arrival="284.00" arrivalLane="c2n_1" arrivalPos="990.00" arrivalPosLat="0.00" arrivalSpeed="13.90" duration="145.00" routeLength="1997.01" waitingTime="0.00" waitingCount="0" stopTime="0.00" timeLoss="1.17" rerouteNo="1" devices="tripinfo_car_s2n_139 routing_car_s2n_139" vType="Car" speedFactor="1.00" vaporized=""/>
    <tripinfo id="car_n2w_138" depart="138.00" departLane="n2sep_1" departPos="3.60" departPosLat="0.00" departSpeed="13.90" departDelay="0.00" arrival="286.00" arrivalLane="c2w_1" arrivalPos="990.00" arrivalPosLat="0.00" arrivalSpeed="14.04" duration="148.00" routeLength="1986.69" waitingTime="0.00" waitingCount="0" stopTime="0.00" timeLoss="4.98" rerouteNo="1" devices="tripinfo_car_n2w_138 routing_car_n2w_138" vType="Car" speedFactor="1.01" vaporized=""/>
    <tripinfo id="car_e2w_124" depart="124.00" departLane="e2sep_1" departPos="3.60" departPosLat="0.00" departSpeed="13.90" departDelay="0.00" arrival="291.00" arrivalLane="c2w_1" arrivalPos="990.00" arrivalPosLat="0.00" arrivalSpeed="16.09" duration="167.00" routeLength="1997.01" waitingTime="31.00" waitingCount="1" stopTime="0.00" timeLoss="42.26" rerouteNo="1" devices="tripinfo_car_e2w_124 routing_car_e2w_124" vType="Car" speedFactor="1.16" vaporized=""/>
    <tripinfo id="car_w2s_113" depart="113.00" departLane="w2sep_1" departPos="3.60" departPosLat="0.00" departSpeed="13.90" departDelay="0.00" arrival="299.00" arrivalLane="c2s_1" arrivalPos="990.00" arrivalPosLat="0.00" arrivalSpeed="13.90" duration="186.00" routeLength="1986.69" waitingTime="33.00" waitingCount="1" stopTime="0.00" timeLoss="42.50" rerouteNo="1" devices="tripinfo_car_w2s_113 routing_car_w2s_113" vType="Car" speedFactor="1.00" vaporized=""/>
    <tripinfo id="car_w2e_134" depart="134.00" departLane="w2sep_1" departPos="3.60" departPosLat="0.00" departSpeed="13.90" departDelay="0.00" arrival="302.00" arrivalLane="c2e_1" arrivalPos="990.00" arrivalPosLat="0.00" arrivalSpeed="14.42" duration="168.00" routeLength="1997.01" waitingTime="16.00" waitingCount="1" stopTime="0.00" timeLoss="28.85" rerouteNo="1" devices="tripinfo_car_w2e_134 routing_car_w2e_134" vType="Car" speedFactor="1.04" vaporized=""/>
    <tripinfo id="car_w2s_130" depart="130.00" departLane="w2sep_1" departPos="3.60" departPosLat="0.00" departSpeed="13.90" departDelay="0.00" arrival="303.00" arrivalLane="c2s_1" arrivalPos="990.00" arrivalPosLat="0.00" arrivalSpeed="14.14" duration="173.00" routeLength="1986.69" waitingTime="18.00" waitingCount="1" stopTime="0.00" timeLoss="31.73" rerouteNo="1" devices="tripinfo_car_w2s_130 routing_car_w2s_130" vType="Car" speedFactor="1.02" vaporized=""/>
    <tripinfo id="car_w2e_139" depart="139.00" departLane="w2sep_1" departPos="3.60" departPosLat="0.00" departSpeed="13.90" departDelay="0.00" arrival="308.00" arrivalLane="c2e_1" arrivalPos="990.00" arrivalPosLat="0.00" arrivalSpeed="13.90" duration="169.00" routeLength="1997.01" waitingTime="11.00" waitingCount="1" stopTime="0.00" timeLoss="24.65" rerouteNo="1" devices="tripinfo_car_w2e_139 routing_car_w2e_139" vType="Car" speedFactor="1.00" vaporized=""/>
    <tripinfo id="car_e2w_165" depart="165.00" departLane="e2sep_1" departPos="3.60" departPosLat="0.00" departSpeed="13.90" departDelay="0.00" arrival="309.00" arrivalLane="c2w_1" arrivalPos="990.00" arrivalPosLat="0.00" arrivalSpeed="13.90" duration="144.00" routeLength="1997.01" waitingTime="0.00" waitingCount="0" stopTime="0.00" timeLoss="0.32" rerouteNo="1" devices="tripinfo_car_e2w_165 routing_car_e2w_165" vType="Car" speedFactor="1.00" vaporized=""/>
    <tripinfo id="car_w2s_154" depart="154.00" departLane="w2sep_1" departPos="3.60" departPosLat="0.00" departSpeed="13.90" departDelay="0.00" arrival="311.00" arrivalLane="c2s_1" arrivalPos="990.00" arrivalPosLat="0.00" arrivalSpeed="13.90" duration="157.00" routeLength="1986.69" waitingTime="0.00" waitingCount="0" stopTime="0.00" timeLoss="12.50" rerouteNo="1" devices="tripinfo_car_w2s_154 routing_car_w2s_154" vType="Car" speedFactor="1.00" vaporized=""/>
    <tripinfo id="car_e2w_171" depart="171.00" departLane="e2sep_1" departPos="3.60" departPosLat="0.00" departSpeed="13.90" departDelay="0.00" arrival="311.00" arrivalLane="c2w_1" arrivalPos="990.00" arrivalPosLat="0.00" arrivalSpeed="15.23" duration="140.00" routeLength="1997.01" waitingTime="0.00" waitingCount="0" stopTime="0.00" timeLoss="13.04" rerouteNo="1" devices="tripinfo_car_e2w_171 routing_car_e2w_171" vType="Car" speedFactor="1.13" vaporized=""/>
    <tripinfo id="car_w2e_162" depart="162.00" departLane="w2sep_1" departPos="3.60" departPosLat="0.00" departSpeed="13.90" departDelay="0.00" arrival="313.00" arrivalLane="c2e_1" arrivalPos="990.00" arrivalPosLat="0.00" arrivalSpeed="13.94" duration="151.00" routeLength="1997.01" waitingTime="0.00" waitingCount="0" stopTime="0.00" timeLoss="7.40" rerouteNo="1" devices="tripinfo_car_w2e_162 routing_car_w2e_162" vType="Car" speedFactor="1.00" vaporized=""/>
    <tripinfo id="car_w2e_175" depart="175.00" departLane="w2sep_1" departPos="3.60" departPosLat="0.00" departSpeed="13.90" departDelay="0.00" arrival="315.00" arrivalLane="c2e_1" arrivalPos="990.00" arrivalPosLat="0.00" arrivalSpeed="15.20" duration="140.00" routeLength="1997.01" waitingTime="0.00" waitingCount="0" stopTime="0.00" timeLoss="11.56" rerouteNo="1" devices="tripinfo_car_w2e_175 routing_car_w2e_175" vType="Car" speedFactor="1.12" vaporized=""/>
    <tripinfo id="car_w2s_162" depart="164.00" departLane="w2sep_1" departPos="3.60" departPosLat="0.00" departSpeed="13.90" departDelay="2.00" arrival="316.00" arrivalLane="c2s_1" arrivalPos="990.00" arrivalPosLat="0.00" arrivalSpeed="13.90" duration="152.00" routeLength="1986.69" waitingTime="0.00" waitingCount="0" stopTime="0.00" timeLoss="8.04" rerouteNo="1" devices="tripinfo_car_w2s_162 routing_car_w2s_162" vType="Car" speedFactor="1.00" vaporized=""/>
    <tripinfo id="car_w2s_173" depart="173.00" departLane="w2sep_1" departPos="3.60" departPosLat="0.00" departSpeed="13.90" departDelay="0.00" arrival="318.00" arrivalLane="c2s_1" arrivalPos="990.00" arrivalPosLat="0.00" arrivalSpeed="14.74" duration="145.00" routeLength="1986.69" waitingTime="0.00" waitingCount="0" stopTime="0.00" timeLoss="12.33" rerouteNo="1" devices="tripinfo_car_w2s_173 routing_car_w2s_173" vType="Car" speedFactor="1.08" vaporized=""/>
    <tripinfo id="car_e2s_110" depart="110.00" departLane="e2sep_1" departPos="3.60" departPosLat="0.00" departSpeed="13.90" departDelay="0.00" arrival="323.00" arrivalLane="c2s_1" arrivalPos="990.00" arrivalPosLat="0.00" arrivalSpeed="14.17" duration="213.00" routeLength="1996.47" waitingTime="54.00" waitingCount="2" stopTime="0.00" timeLoss="70.92" rerouteNo="1" devices="tripinfo_car_e2s_110 routing_car_e2s_110" vType="Car" speedFactor="1.02" vaporized=""/>
    <tripinfo id="car_n2s_156" depart="156.00" departLane="n2sep_1" departPos="3.60" departPosLat="0.00" departSpeed="13.90" departDelay="0.00" arrival="335.00" arrivalLane="c2s_1" arrivalPos="990.00" arrivalPosLat="0.00" arrivalSpeed="16.25" duration="179.00" routeLength="1997.01" waitingTime="44.00" waitingCount="1" stopTime="0.00" timeLoss="55.44" rerouteNo="1" devices="tripinfo_car_n2s_156 routing_car_n2s_156" vType="Car" speedFactor="1.17" vaporized=""/>
    <tripinfo id="car_s2e_160" depart="160.00" departLane="s2sep_1" departPos="3.60" departPosLat="0.00" departSpeed="13.90" departDelay="0.00" arrival="338.00" arrivalLane="c2e_1" arrivalPos="990.00" arrivalPosLat="0.00" arrivalSpeed="15.23" duration="178.00" routeLength="1986.69" waitingTime="36.00" waitingCount="1" stopTime="0.00" timeLoss="47.00" rerouteNo="1" devices="tripinfo_car_s2e_160 routing_car_s2e_160" vType="Car" speedFactor="1.10" vaporized=""/>
    <tripinfo id="car_n2w_184" depart="184.00" departLane="n2sep_1" departPos="3.60" departPosLat="0.00" departSpeed="13.90" departDelay="0.00" arrival="340.00" arrivalLane="c2w_1" arrivalPos="990.00" arrivalPosLat="0.00" arrivalSpeed="16.38" duration="156.00" routeLength="1986.69" waitingTime="10.00" waitingCount="1" stopTime="0.00" timeLoss="33.30" rerouteNo="1" devices="tripinfo_car_n2w_184 routing_car_n2w_184" vType="Car" speedFactor="1.18" vaporized=""/>
    <tripinfo id="car_s2e_165" depart="165.00" departLane="s2sep_1" departPos="3.60" departPosLat="0.00" departSpeed="13.90" departDelay="0.00" arrival="341.00" arrivalLane="c2e_1" arrivalPos="990.00" arrivalPosLat="0.00" arrivalSpeed="15.79" duration="176.00" routeLength="1986.69" waitingTime="34.00" waitingCount="1" stopTime="0.00" timeLoss="50.22" rerouteNo="1" devices="tripinfo_car_s2e_165 routing_car_s2e_165" vType="Car" speedFactor="1.14" vaporized=""/>
    <tripinfo id="car_s2n_186" depart="186.00" departLane="s2sep_1" departPos="3.60" departPosLat="0.00" departSpeed="13.90" departDelay="0.00" arrival="343.00" arrivalLane="c2n_1" arrivalPos="990.00" arrivalPosLat="0.00" arrivalSpeed="16.05" duration="157.00" routeLength="1997.01" waitingTime="18.00" waitingCount="1" stopTime="0.00" timeLoss="32.04" rerouteNo="1" devices="tripinfo_car_s2n_186 routing_car_s2n_186" vType="Car" speedFactor="1.15" vaporized=""/>
    <tripinfo id="car_n2s_179" depart="181.00" departLane="n2sep_1" departPos="3.60" departPosLat="0.00" departSpeed="13.90" departDelay="2.00" arrival="347.00" arrivalLane="c2s_1" arrivalPos="990.00" arrivalPosLat="0.00" arrivalSpeed="13.90" duration="166.00" routeLength="1997.01" waitingTime="11.00" waitingCount="1" stopTime="0.00" timeLoss="22.14" rerouteNo="1" devices="tripinfo_car_n2s_179 routing_car_n2s_179" vType="Car" speedFactor="1.00" vaporized=""/>
    <tripinfo id="car_s2n_193" depart="193.00" departLane="s2sep_1" departPos="3.60" departPosLat="0.00" departSpeed="13.90" departDelay="0.00" arrival="347.00" arrivalLane="c2n_1" arrivalPos="990.00" arrivalPosLat="0.00" arrivalSpeed="16.26" duration="154.00" routeLength="1997.01" waitingTime="13.00" waitingCount="1" stopTime="0.00" timeLoss="30.49" rerouteNo="1" devices="tripinfo_car_s2n_193 routing_car_s2n_193" vType="Car" speedFactor="1.17" vaporized=""/>
    <tripinfo id="car_s2e_168" depart="168.00" departLane="s2sep_1" departPos="3.60" departPosLat="0.00" departSpeed="13.90" departDelay="0.00" arrival="349.00" arrivalLane="c2e_1" arrivalPos="990.00" arrivalPosLat="0.00" arrivalSpeed="14.23" duration="181.00" routeLength="1986.69" waitingTime="27.00" waitingCount="1" stopTime="0.00" timeLoss="40.62" rerouteNo="1" devices="tripinfo_car_s2e_168 routing_car_s2e_168" vType="Car" speedFactor="1.02" vaporized=""/>
    <tripinfo id="car_n2w_204" depart="205.00" departLane="n2sep_1" departPos="3.60" departPosLat="0.00" departSpeed="13.90" departDelay="1.00" arrival="350.00" arrivalLane="c2w_1" arrivalPos="990.00" arrivalPosLat="0.00" arrivalSpeed="14.67" duration="145.00" routeLength="1986.69" waitingTime="0.00" waitingCount="0" stopTime="0.00" timeLoss="8.56" rerouteNo="1" devices="tripinfo_car_n2w_204 routing_car_n2w_204" vType="Car" speedFactor="1.06" vaporized=""/>
    <tripinfo id="car_s2e_199" depart="199.00" departLane="s2sep_1" departPos="3.60" departPosLat="0.00" departSpeed="13.90" departDelay="0.00" arrival="356.00" arrivalLane="c2e_1" arrivalPos="990.00" arrivalPosLat="0.00" arrivalSpeed="14.22" duration="157.00" routeLength="1986.69" waitingTime="0.00" waitingCount="0" stopTime="0.00" timeLoss="16.33" rerouteNo="1" devices="tripinfo_car_s2e_199 routing_car_s2e_199" vType="Car" speedFactor="1.02" vaporized=""/>
    <tripinfo id="car_n2w_210" depart="210.00" departLane="n2sep_1" departPos="3.60" departPosLat="0.00" departSpeed="13.90" departDelay="0.00" arrival="356.00" arrivalLane="c2w_1" arrivalPos="990.00" arrivalPosLat="0.00" arrivalSpeed="14.35" duration="146.00" routeLength="1986.69" waitingTime="0.00" waitingCount="0" stopTime="0.00" timeLoss="6.38" rerouteNo="1" devices="tripinfo_car_n2w_210 routing_car_n2w_210" vType="Car" speedFactor="1.03" vaporized=""/>
    <tripinfo id="car_n2w_217" depart="217.00" departLane="n2sep_1" departPos="3.60" departPosLat="0.00" departSpeed="13.90" departDelay="0.00" arrival="359.00" arrivalLane="c2w_1" arrivalPos="990.00" arrivalPosLat="0.00" arrivalSpeed="15.02" duration="142.00" routeLength="1986.69" waitingTime="0.00" waitingCount="0" stopTime="0.00" timeLoss="9.17" rerouteNo="1" devices="tripinfo_car_n2w_217 routing_car_n2w_217" vType="Car" speedFactor="1.09" vaporized=""/>
    <tripinfo id="car_n2e_179" depart="179.00" departLane="n2sep_1" departPos="3.60" departPosLat="0.00" departSpeed="13.90" departDelay="0.00" arrival="361.00" arrivalLane="c2e_1" arrivalPos="990.00" arrivalPosLat="0.00" arrivalSpeed="14.11" duration="182.00" routeLength="1996.47" waitingTime="20.00" waitingCount="2" stopTime="0.00" timeLoss="39.17" rerouteNo="1" devices="tripinfo_car_n2e_179 routing_car_n2e_179" vType="Car" speedFactor="1.02" vaporized=""/>
    <tripinfo id="car_n2e_203" depart="203.00" departLane="n2sep_1" departPos="3.60" departPosLat="0.00" departSpeed="13.90" departDelay="0.00" arrival="364.00" arrivalLane="c2e_1" arrivalPos="990.00" arrivalPosLat="0.00" arrivalSpeed="14.13" duration="161.00" routeLength="1996.47" waitingTime="3.00" waitingCount="1" stopTime="0.00" timeLoss="19.03" rerouteNo="1" devices="tripinfo_car_n2e_203 routing_car_n2e_203" vType="Car" speedFactor="1.02" vaporized=""/>
    <tripinfo id="car_s2w_153" depart="153.00" departLane="s2sep_1" departPos="3.60" departPosLat="0.00" departSpeed="13.90" departDelay="0.00" arrival="365.00" arrivalLane="c2w_1" arrivalPos="990.00" arrivalPosLat="0.00" arrivalSpeed="13.90" duration="212.00" routeLength="1996.47" waitingTime="49.00" waitingCount="2" stopTime="0.00" timeLoss="67.12" rerouteNo="1" devices="tripinfo_car_s2w_153 routing_car_s2w_153" vType="Car" speedFactor="1.00" vaporized=""/>
    <tripinfo id="car_n2e_211" depart="212.00" departLane="n2sep_1" departPos="3.60" departPosLat="0.00" departSpeed="13.90" departDelay="1.00" arrival="366.00" arrivalLane="c2e_1" arrivalPos="990.00" arrivalPosLat="0.00" arrivalSpeed="14.92" duration="154.00" routeLength="1996.47" waitingTime="0.00" waitingCount="0" stopTime="0.00" timeLoss="22.79" rerouteNo="1" devices="tripinfo_car_n2e_211 routing_car_n2e_211" vType="Car" speedFactor="1.10" vaporized=""/>
    <tripinfo id="car_s2w_158" depart="158.00" departLane="s2sep_1" departPos="3.60" departPosLat="0.00" departSpeed="13.90" departDelay="0.00" arrival="368.00" arrivalLane="c2w_1" arrivalPos="990.00" arrivalPosLat="0.00" arrivalSpeed="14.09" duration="210.00" routeLength="1996.47" waitingTime="45.00" waitingCount="2" stopTime="0.00" timeLoss="67.78" rerouteNo="1" devices="tripinfo_car_s2w_158 routing_car_s2w_158" vType="Car" speedFactor="1.02" vaporized=""/>
    <tripinfo id="car_n2e_231" depart="231.00" departLane="n2sep_1" departPos="3.60" departPosLat="0.00" departSpeed="13.90" departDelay="0.00" arrival="368.00" arrivalLane="c2e_1" arrivalPos="990.00" arrivalPosLat="0.00" arrivalSpeed="15.38" duration="137.00" routeLength="1996.47" waitingTime="0.00" waitingCount="0" stopTime="0.00" timeLoss="11.11" rerouteNo="1" devices="tripinfo_car_n2e_231 routing_car_n2e_231" vType="Car" speedFactor="1.15" vaporized=""/>
    <tripinfo id="car_s2w_188" depart="188.00" departLane="s2sep_1" departPos="3.60" departPosLat="0.00" departSpeed="13.90" departDelay="0.00" arrival="372.00" arrivalLane="c2w_1" arrivalPos="990.00" arrivalPosLat="0.00" arrivalSpeed="13.95" duration="184.00" routeLength="1996.47" waitingTime="16.00" waitingCount="2" stopTime="0.00" timeLoss="39.60" rerouteNo="1" devices="tripinfo_car_s2w_188 routing_car_s2w_188" vType="Car" speedFactor="1.01" vaporized=""/>
    <tripinfo id="car_e2n_197" depart="197.00" departLane="e2sep_1" departPos="3.60" departPosLat="0.00" departSpeed="13.90" departDelay="0.00" arrival="387.00" arrivalLane="c2n_1" arrivalPos="990.00" arrivalPosLat="0.00" arrivalSpeed="14.46" duration="190.00" routeLength="1986.69" waitingTime="41.00" waitingCount="1" stopTime="0.00" timeLoss="51.34" rerouteNo="1" devices="tripinfo_car_e2n_197 routing_car_e2n_197" vType="Car" speedFactor="1.04" vaporized=""/>
    <tripinfo id="car_w2e_199" depart="199.00" departLane="w2sep_1" departPos="3.60" departPosLat="0.00" departSpeed="13.90" departDelay="0.00" arrival="388.00" arrivalLane="c2e_1" arrivalPos="990.00" arrivalPosLat="0.00" arrivalSpeed="14.21" duration="189.00" routeLength="1997.01" waitingTime="38.00" waitingCount="1" stopTime="0.00" timeLoss="48.21" rerouteNo="1" devices="tripinfo_car_w2e_199 routing_car_w2e_199" vType="Car" speedFactor="1.02" vaporized=""/>
    <tripinfo id="car_e2w_201" depart="201.00" departLane="e2sep_1" departPos="3.60" departPosLat="0.00" departSpeed="13.90" departDelay="0.00" arrival="392.00" arrivalLane="c2w_1" arrivalPos="990.00" arrivalPosLat="0.00" arrivalSpeed="13.90" duration="191.00" routeLength="1997.01" waitingTime="36.00" waitingCount="1" stopTime="0.00" timeLoss="46.68" rerouteNo="1" devices="tripinfo_car_e2w_201 routing_car_e2w_201" vType="Car" speedFactor="1.00" vaporized=""/>
    <tripinfo id="car_e2n_229" depart="230.00" departLane="e2sep_1" departPos="3.60" departPosLat="0.00" departSpeed="13.90" departDelay="1.00" arrival="395.00" arrivalLane="c2n_1" arrivalPos="990.00" arrivalPosLat="0.00" arrivalSpeed="14.32" duration="165.00" routeLength="1986.69" waitingTime="11.00" waitingCount="1" stopTime="0.00" timeLoss="25.66" rerouteNo="1" devices="tripinfo_car_e2n_229 routing_car_e2n_229" vType="Car" speedFactor="1.03" vaporized=""/>
    <tripinfo id="bus_w2e_204" depart="204.00" departLane="w2sep_1" departPos="12.10" departPosLat="0.00" departSpeed="13.90" departDelay="0.00" arrival="396.00" arrivalLane="c2e_1" arrivalPos="990.00" arrivalPosLat="0.00" arrivalSpeed="13.90" duration="192.00" routeLength="1988.51" waitingTime="34.00" waitingCount="1" stopTime="0.00" timeLoss="47.99" rerouteNo="1" devices="tripinfo_bus_w2e_204 routing_bus_w2e_204" vType="Bus" speedFactor="1.00" vaporized=""/>
    <tripinfo id="car_e2w_214" depart="214.00" departLane="e2sep_1" departPos="3.60" departPosLat="0.00" departSpeed="13.90" departDelay="0.00" arrival="396.00" arrivalLane="c2w_1" arrivalPos="990.00" arrivalPosLat="0.00" arrivalSpeed="13.99" duration="182.00" routeLength="1997.01" waitingTime="25.00" waitingCount="1" stopTime="0.00" timeLoss="38.83" rerouteNo="1" devices="tripinfo_car_e2w_214 routing_car_e2w_214" vType="Car" speedFactor="1.01" vaporized=""/>
    <tripinfo id="car_w2s_236" depart="236.00" departLane="w2sep_1" departPos="3.60" departPosLat="0.00" departSpeed="13.90" departDelay="0.00" arrival="398.00" arrivalLane="c2s_1" arrivalPos="990.00" arrivalPosLat="0.00" arrivalSpeed="14.49" duration="162.00" routeLength="1986.69" waitingTime="9.00" waitingCount="1" stopTime="0.00" timeLoss="24.15" rerouteNo="1" devices="tripinfo_car_w2s_236 routing_car_w2s_236" vType="Car" speedFactor="1.04" vaporized=""/>
    <tripinfo id="car_w2e_223" depart="223.00" departLane="w2sep_1" departPos="3.60" departPosLat="0.00" departSpeed="13.90" departDelay="0.00" arrival="399.00" arrivalLane="c2e_1" arrivalPos="990.00" arrivalPosLat="0.00" arrivalSpeed="14.32" duration="176.00" routeLength="1997.01" waitingTime="18.00" waitingCount="1" stopTime="0.00" timeLoss="36.84" rerouteNo="1" devices="tripinfo_car_w2e_223 routing_car_w2e_223" vType="Car" speedFactor="1.03" vaporized=""/>
    <tripinfo id="car_e2w_241" depart="241.00" departLane="e2sep_1" departPos="3.60" departPosLat="0.00" departSpeed="13.90" departDelay="0.00" arrival="400.00" arrivalLane="c2w_1" arrivalPos="990.00" arrivalPosLat="0.00" arrivalSpeed="14.12" duration="159.00" routeLength="1997.01" waitingTime="1.00" waitingCount="1" stopTime="0.00" timeLoss="16.99" rerouteNo="1" devices="tripinfo_car_e2w_241 routing_car_e2w_241" vType="Car" speedFactor="1.02" vaporized=""/>
    <tripinfo id="car_e2n_250" depart="250.00" departLane="e2sep_1" departPos="3.60" departPosLat="0.00" departSpeed="13.90" departDelay="0.00" arrival="400.00" arrivalLane="c2n_1" arrivalPos="990.00" arrivalPosLat="0.00" arrivalSpeed="14.68" duration="150.00" routeLength="1986.69" waitingTime="0.00" waitingCount="0" stopTime="0.00" timeLoss="13.38" rerouteNo="1" devices="tripinfo_car_e2n_250 routing_car_e2n_250" vType="Car" speedFactor="1.06" vaporized=""/>
    <tripinfo id="car_w2n_205" depart="206.00" departLane="w2sep_1" departPos="3.60" departPosLat="0.00" departSpeed="13.90" departDelay="1.00" arrival="402.00" arrivalLane="c2n_1" arrivalPos="990.00" arrivalPosLat="0.00" arrivalSpeed="15.85" duration="196.00" routeLength="1996.47" waitingTime="46.00" waitingCount="2" stopTime="0.00" timeLoss="73.05" rerouteNo="1" devices="tripinfo_car_w2n_205 routing_car_w2n_205" vType="Car" speedFactor="1.18" vaporized=""/>
    <tripinfo id="car_w2e_224" depart="225.00" departLane="w2sep_1" departPos="3.60" departPosLat="0.00" departSpeed="13.90" departDelay="1.00" arrival="403.00" arrivalLane="c2e_1" arrivalPos="990.00" arrivalPosLat="0.00" arrivalSpeed="13.89" duration="178.00" routeLength="1997.01" waitingTime="15.00" waitingCount="1" stopTime="0.00" timeLoss="33.80" rerouteNo="1" devices="tripinfo_car_w2e_224 routing_car_w2e_224" vType="Car" speedFactor="1.00" vaporized=""/>
    <tripinfo id="car_w2e_248" depart="248.00" departLane="w2sep_1" departPos="3.60" departPosLat="0.00" departSpeed="13.90" departDelay="0.00" arrival="406.00" arrivalLane="c2e_1" arrivalPos="990.00" arrivalPosLat="0.00" arrivalSpeed="14.40" duration="158.00" routeLength="1997.01" waitingTime="0.00" waitingCount="0" stopTime="0.00" timeLoss="19.32" rerouteNo="1" devices="tripinfo_car_w2e_248 routing_car_w2e_248" vType="Car" speedFactor="1.04" vaporized=""/>
    <tripinfo id="car_e2s_204" depart="204.00" departLane="e2sep_1" departPos="3.60" departPosLat="0.00" departSpeed="13.90" departDelay="0.00" arrival="407.00" arrivalLane="c2s_1" arrivalPos="990.00" arrivalPosLat="0.00" arrivalSpeed="13.90" duration="203.00" routeLength="1996.47" waitingTime="41.00" waitingCount="2" stopTime="0.00" timeLoss="57.74" rerouteNo="1" devices="tripinfo_car_e2s_204 routing_car_e2s_204" vType="Car" speedFactor="1.00" vaporized=""/>
    <tripinfo id="car_w2n_239" depart="239.00" departLane="w2sep_1" departPos="3.60" departPosLat="0.00" departSpeed="13.90" departDelay="0.00" arrival="408.00" arrivalLane="c2n_1" arrivalPos="990.00" arrivalPosLat="0.00" arrivalSpeed="14.00" duration="169.00" routeLength="1996.47" waitingTime="6.00" waitingCount="1" stopTime="0.00" timeLoss="24.89" rerouteNo="1" devices="tripinfo_car_w2n_239 routing_car_w2n_239" vType="Car" speedFactor="1.01" vaporized=""/>
    <tripinfo id="car_e2s_228" depart="228.00" departLane="e2sep_1" departPos="3.60" departPosLat="0.00" departSpeed="13.90" departDelay="0.00" arrival="410.00" arrivalLane="c2s_1" arrivalPos="990.00" arrivalPosLat="0.00" arrivalSpeed="14.10" duration="182.00" routeLength="1996.47" waitingTime="19.00" waitingCount="2" stopTime="0.00" timeLoss="39.82" rerouteNo="1" devices="tripinfo_car_e2s_228 routing_car_e2s_228" vType="Car" speedFactor="1.02" vaporized=""/>
    <tripinfo id="bus_e2s_278" depart="278.00" departLane="e2sep_1" departPos="12.10" departPosLat="0.00" departSpeed="13.90" departDelay="0.00" arrival="426.00" arrivalLane="c2s_1" arrivalPos="990.00" arrivalPosLat="0.00" arrivalSpeed="13.90" duration="148.00" routeLength="1987.97" waitingTime="0.00" waitingCount="0" stopTime="0.00" timeLoss="3.55" rerouteNo="1" devices="tripinfo_bus_e2s_278 routing_bus_e2s_278" vType="Bus" speedFactor="1.00" vaporized=""/>
    <tripinfo id="car_s2e_233" depart="233.00" departLane="s2sep_1" departPos="3.60" departPosLat="0.00" departSpeed="13.90" departDelay="0.00" arrival="434.00" arrivalLane="c2e_1" arrivalPos="990.00" arrivalPosLat="0.00" arrivalSpeed="13.90" duration="201.00" routeLength="1986.69" waitingTime="48.00" waitingCount="1" stopTime="0.00" timeLoss="57.52" rerouteNo="1" devices="tripinfo_car_s2e_233 routing_car_s2e_233" vType="Car" speedFactor="1.00" vaporized=""/>
    <tripinfo id="car_n2s_239" depart="239.00" departLane="n2sep_1" departPos="3.60" departPosLat="0.00" departSpeed="13.90" departDelay="0.00" arrival="434.00" arrivalLane="c2s_1" arrivalPos="990.00" arrivalPosLat="0.00" arrivalSpeed="14.21" duration="195.00" routeLength="1997.01" waitingTime="43.00" waitingCount="1" stopTime="0.00" timeLoss="53.56" rerouteNo="1" devices="tripinfo_car_n2s_239 routing_car_n2s_239" vType="Car" speedFactor="1.02" vaporized=""/>
    <tripinfo id="car_n2s_248" depart="248.00" departLane="n2sep_1" departPos="3.60" departPosLat="0.00" departSpeed="13.90" departDelay="0.00" arrival="436.00" arrivalLane="c2s_1" arrivalPos="990.00" arrivalPosLat="0.00" arrivalSpeed="14.91" duration="188.00" routeLength="1997.01" waitingTime="40.00" waitingCount="1" stopTime="0.00" timeLoss="55.99" rerouteNo="1" devices="tripinfo_car_n2s_248 routing_car_n2s_248" vType="Car" speedFactor="1.09" vaporized=""/>
    <tripinfo id="car_s2e_235" depart="235.00" departLane="s2sep_1" departPos="3.60" departPosLat="0.00" departSpeed="13.90" departDelay="0.00" arrival="439.00" arrivalLane="c2e_1" arrivalPos="990.00" arrivalPosLat="0.00" arrivalSpeed="13.92" duration="204.00" routeLength="1986.69" waitingTime="45.00" waitingCount="1" stopTime="0.00" timeLoss="60.11" rerouteNo="1" devices="tripinfo_car_s2e_235 routing_car_s2e_235" vType="Car" speedFactor="1.00" vaporized=""/>
    <tripinfo id="car_s2n_242" depart="242.00" departLane="s2sep_1" departPos="3.60" departPosLat="0.00" departSpeed="13.90" departDelay="0.00" arrival="439.00" arrivalLane="c2n_1" arrivalPos="990.00" arrivalPosLat="0.00" arrivalSpeed="15.18" duration="197.00" routeLength="1997.01" waitingTime="44.00" waitingCount="1" stopTime="0.00" timeLoss="64.58" rerouteNo="1" devices="tripinfo_car_s2n_242 routing_car_s2n_242" vType="Car" speedFactor="1.09" vaporized=""/>
    <tripinfo id="car_n2s_264" depart="264.00" departLane="n2sep_1" departPos="3.60" departPosLat="0.00" departSpeed="13.90" departDelay="0.00" arrival="439.00" arrivalLane="c2s_1" arrivalPos="990.00" arrivalPosLat="0.00" arrivalSpeed="15.01" duration="175.00" routeLength="1997.01" waitingTime="25.00" waitingCount="1" stopTime="0.00" timeLoss="42.21" rerouteNo="1" devices="tripinfo_car_n2s_264 routing_car_n2s_264" vType="Car" speedFactor="1.09" vaporized=""/>
    <tripinfo id="car_n2w_278" depart="279.00" departLane="n2sep_1" departPos="3.60" departPosLat="0.00" departSpeed="13.90" departDelay="1.00" arrival="440.00" arrivalLane="c2w_1" arrivalPos="990.00" arrivalPosLat="0.00" arrivalSpeed="14.80" duration="161.00" routeLength="1986.69" waitingTime="10.00" waitingCount="1" stopTime="0.00" timeLoss="25.67" rerouteNo="1" devices="tripinfo_car_n2w_278 routing_car_n2w_278" vType="Car" speedFactor="1.07" vaporized=""/>
    <tripinfo id="car_n2s_277" depart="277.00" departLane="n2sep_1" departPos="3.60" departPosLat="0.00" departSpeed="13.90" departDelay="0.00" arrival="441.00" arrivalLane="c2s_1" arrivalPos="990.00" arrivalPosLat="0.00" arrivalSpeed="15.00" duration="164.00" routeLength="1997.01" waitingTime="14.00" waitingCount="1" stopTime="0.00" timeLoss="32.78" rerouteNo="1" devices="tripinfo_car_n2s_277 routing_car_n2s_277" vType="Car" speedFactor="1.10" vaporized=""/>
    <tripinfo id="bus_s2e_237" depart="238.00" departLane="s2sep_1" departPos="12.10" departPosLat="0.00" departSpeed="13.90" departDelay="1.00" arrival="444.00" arrivalLane="c2e_1" arrivalPos="990.00" arrivalPosLat="0.00" arrivalSpeed="13.87" duration="206.00" routeLength="1978.19" waitingTime="44.00" waitingCount="1" stopTime="0.00" timeLoss="62.82" rerouteNo="1" devices="tripinfo_bus_s2e_237 routing_bus_s2e_237" vType="Bus" speedFactor="1.00" vaporized=""/>
    <tripinfo id="car_n2s_290" depart="290.00" departLane="n2sep_1" departPos="3.60" departPosLat="0.00" departSpeed="13.90" departDelay="0.00" arrival="446.00" arrivalLane="c2s_1" arrivalPos="990.00" arrivalPosLat="0.00" arrivalSpeed="14.09" duration="156.00" routeLength="1997.01" waitingTime="0.00" waitingCount="0" stopTime="0.00" timeLoss="14.18" rerouteNo="1" devices="tripinfo_car_n2s_290 routing_car_n2s_290" vType="Car" speedFactor="1.01" vaporized=""/>
    <tripinfo id="car_s2e_245" depart="245.00" departLane="s2sep_1" departPos="3.60" departPosLat="0.00" departSpeed="13.90" departDelay="0.00" arrival="448.00" arrivalLane="c2e_1" arrivalPos="990.00" arrivalPosLat="0.00" arrivalSpeed="14.40" duration="203.00" routeLength="1986.69" waitingTime="42.00" waitingCount="1" stopTime="0.00" timeLoss="63.89" rerouteNo="1" devices="tripinfo_car_s2e_245 routing_car_s2e_245" vType="Car" speedFactor="1.04" vaporized=""/>
    <tripinfo id="car_s2w_256" depart="256.00" departLane="s2sep_1" departPos="3.60" departPosLat="0.00" departSpeed="13.90" departDelay="0.00" arrival="449.00" arrivalLane="c2w_1" arrivalPos="990.00" arrivalPosLat="0.00" arrivalSpeed="14.04" duration="193.00" routeLength="1996.47" waitingTime="33.00" waitingCount="2" stopTime="0.00" timeLoss="49.41" rerouteNo="1" devices="tripinfo_car_s2w_256 routing_car_s2w_256" vType="Car" speedFactor="1.01" vaporized=""/>
    <tripinfo id="car_s2w_269" depart="269.00" departLane="s2sep_1" departPos="3.60" departPosLat="0.00" departSpeed="13.90" departDelay="0.00" arrival="451.00" arrivalLane="c2w_1" arrivalPos="990.00" arrivalPosLat="0.00" arrivalSpeed="15.17" duration="182.00" routeLength="1996.47" waitingTime="27.00" waitingCount="2" stopTime="0.00" timeLoss="52.85" rerouteNo="1" devices="tripinfo_car_s2w_269 routing_car_s2w_269" vType="Car" speedFactor="1.12" vaporized=""/>
    <tripinfo id="car_s2n_279" depart="279.00" departLane="s2sep_1" departPos="3.60" departPosLat="0.00" departSpeed="13.90" departDelay="0.00" arrival="451.00" arrivalLane="c2n_1" arrivalPos="990.00" arrivalPosLat="0.00" arrivalSpeed="13.90" duration="172.00" routeLength="1997.01" waitingTime="9.00" waitingCount="1" stopTime="0.00" timeLoss="27.47" rerouteNo="1" devices="tripinfo_car_s2n_279 routing_car_s2n_279" vType="Car" speedFactor="1.00" vaporized=""/>
    <tripinfo id="car_s2e_294" depart="294.00" departLane="s2sep_1" departPos="3.60" departPosLat="0.00" departSpeed="13.90" departDelay="0.00" arrival="452.00" arrivalLane="c2e_1" arrivalPos="990.00" arrivalPosLat="0.00" arrivalSpeed="14.37" duration="158.00" routeLength="1986.69" waitingTime="0.00" waitingCount="0" stopTime="0.00" timeLoss="18.89" rerouteNo="1" devices="tripinfo_car_s2e_294 routing_car_s2e_294" vType="Car" speedFactor="1.03" vaporized=""/>
    <tripinfo id="car_s2n_300" depart="300.00" departLane="s2sep_1" departPos="3.60" departPosLat="0.00" departSpeed="13.90" departDelay="0.00" arrival="453.00" arrivalLane="c2n_1" arrivalPos="990.00" arrivalPosLat="0.00" arrivalSpeed="15.54" duration="153.00" routeLength="1997.01" waitingTime="0.00" waitingCount="0" stopTime="0.00" timeLoss="29.17" rerouteNo="1" devices="tripinfo_car_s2n_300 routing_car_s2n_300" vType="Car" speedFactor="1.17" vaporized=""/>
    <tripinfo id="car_n2e_281" depart="281.00" departLane="n2sep_1" departPos="3.60" departPosLat="0.00" departSpeed="13.90" departDelay="0.00" arrival="459.00" arrivalLane="c2e_1" arrivalPos="990.00" arrivalPosLat="0.00" arrivalSpeed="13.90" duration="178.00" routeLength="1996.47" waitingTime="17.00" waitingCount="1" stopTime="0.00" timeLoss="32.95" rerouteNo="1" devices="tripinfo_car_n2e_281 routing_car_n2e_281" vType="Car" speedFactor="1.00" vaporized=""/>
    <tripinfo id="car_n2e_298" depart="298.00" departLane="n2sep_1" departPos="3.60" departPosLat="0.00" departSpeed="13.90" departDelay="0.00" arrival="461.00" arrivalLane="c2e_1" arrivalPos="990.00" arrivalPosLat="0.00" arrivalSpeed="14.57" duration="163.00" routeLength="1996.47" waitingTime="11.00" waitingCount="1" stopTime="0.00" timeLoss="27.41" rerouteNo="1" devices="tripinfo_car_n2e_298 routing_car_n2e_298" vType="Car" speedFactor="1.06" vaporized=""/>
    <tripinfo id="car_n2e_319" depart="319.00" departLane="n2sep_1" departPos="3.60" departPosLat="0.00" departSpeed="13.90" departDelay="0.00" arrival="464.00" arrivalLane="c2e_1" arrivalPos="990.00" arrivalPosLat="0.00" arrivalSpeed="15.07" duration="145.00" routeLength="1996.47" waitingTime="0.00" waitingCount="0" stopTime="0.00" timeLoss="12.33" rerouteNo="1" devices="tripinfo_car_n2e_319 routing_car_n2e_319" vType="Car" speedFactor="1.10" vaporized=""/>
    <tripinfo id="bus_s2w_319" depart="319.00" departLane="s2sep_1" departPos="12.10" departPosLat="0.00" departSpeed="13.90" departDelay="0.00" arrival="471.00" arrivalLane="c2w_1" arrivalPos="990.00" arrivalPosLat="0.00" arrivalSpeed="13.90" duration="152.00" routeLength="1987.97" waitingTime="0.00" waitingCount="0" stopTime="0.00" timeLoss="7.56" rerouteNo="1" devices="tripinfo_bus_s2w_319 routing_bus_s2w_319" vType="Bus" speedFactor="1.00" vaporized=""/>
    <tripinfo id="car_s2w_336" depart="336.00" departLane="s2sep_1" departPos="3.60" departPosLat="0.00" departSpeed="13.90" departDelay="0.00" arrival="473.00" arrivalLane="c2w_1" arrivalPos="990.00" arrivalPosLat="0.00" arrivalSpeed="15.41" duration="137.00" routeLength="1996.47" waitingTime="0.00" waitingCount="0" stopTime="0.00" timeLoss="11.63" rerouteNo="1" devices="tripinfo_car_s2w_336 routing_car_s2w_336" vType="Car" speedFactor="1.15" vaporized=""/>
    <tripinfo id="car_e2n_286" depart="286.00" departLane="e2sep_1" departPos="3.60" departPosLat="0.00" departSpeed="13.90" departDelay="0.00" arrival="475.00" arrivalLane="c2n_1" arrivalPos="990.00" arrivalPosLat="0.00" arrivalSpeed="14.91" duration="189.00" routeLength="1986.69" waitingTime="44.00" waitingCount="1" stopTime="0.00" timeLoss="54.55" rerouteNo="1" devices="tripinfo_car_e2n_286 routing_car_e2n_286" vType="Car" speedFactor="1.07" vaporized=""/>
    <tripinfo id="car_w2e_284" depart="284.00" departLane="w2sep_1" departPos="3.60" departPosLat="0.00" departSpeed="13.90" departDelay="0.00" arrival="480.00" arrivalLane="c2e_1" arrivalPos="990.00" arrivalPosLat="0.00" arrivalSpeed="13.90" duration="196.00" routeLength="1997.01" waitingTime="42.00" waitingCount="1" stopTime="0.00" timeLoss="51.64" rerouteNo="1" devices="tripinfo_car_w2e_284 routing_car_w2e_284" vType="Car" speedFactor="1.00" vaporized=""/>
    <tripinfo id="car_w2s_300" depart="300.00" departLane="w2sep_1" departPos="3.60" departPosLat="0.00" departSpeed="13.90" departDelay="0.00" arrival="482.00" arrivalLane="c2s_1" arrivalPos="990.00" arrivalPosLat="0.00" arrivalSpeed="13.90" duration="182.00" routeLength="1986.69" waitingTime="27.00" waitingCount="1" stopTime="0.00" timeLoss="38.15" rerouteNo="1" devices="tripinfo_car_w2s_300 routing_car_w2s_300" vType="Car" speedFactor="1.00" vaporized=""/>
    <tripinfo id="car_e2n_314" depart="314.00" departLane="e2sep_1" departPos="3.60" departPosLat="0.00" departSpeed="13.90" departDelay="0.00" arrival="482.00" arrivalLane="c2n_1" arrivalPos="990.00" arrivalPosLat="0.00" arrivalSpeed="15.24" duration="168.00" routeLength="1986.69" waitingTime="17.00" waitingCount="1" stopTime="0.00" timeLoss="36.06" rerouteNo="1" devices="tripinfo_car_e2n_314 routing_car_e2n_314" vType="Car" speedFactor="1.10" vaporized=""/>
    <tripinfo id="bus_e2w_311" depart="311.00" departLane="e2sep_1" departPos="12.10" departPosLat="0.00" departSpeed="13.90" departDelay="0.00" arrival="485.00" arrivalLane="c2w_1" arrivalPos="990.00" arrivalPosLat="0.00" arrivalSpeed="13.90" duration="174.00" routeLength="1988.51" waitingTime="17.00" waitingCount="1" stopTime="0.00" timeLoss="30.70" rerouteNo="1" devices="tripinfo_bus_e2w_311 routing_bus_e2w_311" vType="Bus" speedFactor="1.00" vaporized=""/>
    <tripinfo id="car_w2e_314" depart="314.00" departLane="w2sep_1" departPos="3.60" departPosLat="0.00" departSpeed="13.90" departDelay="0.00" arrival="485.00" arrivalLane="c2e_1" arrivalPos="990.00" arrivalPosLat="0.00" arrivalSpeed="14.02" duration="171.00" routeLength="1997.01" waitingTime="15.00" waitingCount="1" stopTime="0.00" timeLoss="27.88" rerouteNo="1" devices="tripinfo_car_w2e_314 routing_car_w2e_314" vType="Car" speedFactor="1.01" vaporized=""/>
    <tripinfo id="car_w2e_326" depart="326.00" departLane="w2sep_1" departPos="3.60" departPosLat="0.00" departSpeed="13.90" departDelay="0.00" arrival="489.00" arrivalLane="c2e_1" arrivalPos="990.00" arrivalPosLat="0.00" arrivalSpeed="13.93" duration="163.00" routeLength="1997.01" waitingTime="4.00" waitingCount="1" stopTime="0.00" timeLoss="19.09" rerouteNo="1" devices="tripinfo_car_w2e_326 routing_car_w2e_326" vType="Car" speedFactor="1.00" vaporized=""/>
    <tripinfo id="car_e2n_329" depart="330.00" departLane="e2sep_1" departPos="3.60" departPosLat="0.00" departSpeed="13.90" departDelay="1.00" arrival="489.00" arrivalLane="c2n_1" arrivalPos="990.00" arrivalPosLat="0.00" arrivalSpeed="14.34" duration="159.00" routeLength="1986.69" waitingTime="2.00" waitingCount="1" stopTime="0.00" timeLoss="19.25" rerouteNo="1" devices="tripinfo_car_e2n_329 routing_car_e2n_329" vType="Car" speedFactor="1.03" vaporized=""/>
    <tripinfo id="car_e2w_335" depart="335.00" departLane="e2sep_1" departPos="3.60" departPosLat="0.00" departSpeed="13.90" departDelay="0.00" arrival="490.00" arrivalLane="c2w_1" arrivalPos="990.00" arrivalPosLat="0.00" arrivalSpeed="14.74" duration="155.00" routeLength="1997.01" waitingTime="0.00" waitingCount="0" stopTime="0.00" timeLoss="18.68" rerouteNo="1" devices="tripinfo_car_e2w_335 routing_car_e2w_335" vType="Car" speedFactor="1.06" vaporized=""/>
    <tripinfo id="car_w2e_333" depart="333.00" departLane="w2sep_1" departPos="3.60" departPosLat="0.00" departSpeed="13.90" departDelay="0.00" arrival="492.00" arrivalLane="c2e_1" arrivalPos="990.00" arrivalPosLat="0.00" arrivalSpeed="14.16" duration="159.00" routeLength="1997.01" waitingTime="0.00" waitingCount="0" stopTime="0.00" timeLoss="17.89" rerouteNo="1" devices="tripinfo_car_w2e_333 routing_car_w2e_333" vType="Car" speedFactor="1.02" vaporized=""/>
    <tripinfo id="bus_e2s_295" depart="295.00" departLane="e2sep_1" departPos="12.10" departPosLat="0.00" departSpeed="13.90" departDelay="0.00" arrival="495.00" arrivalLane="c2s_1" arrivalPos="990.00" arrivalPosLat="0.00" arrivalSpeed="13.90" duration="200.00" routeLength="1987.97" waitingTime="37.00" waitingCount="2" stopTime="0.00" timeLoss="55.47" rerouteNo="1" devices="tripinfo_bus_e2s_295 routing_bus_e2s_295" vType="Bus" speedFactor="1.00" vaporized=""/>
    <tripinfo id="bus_e2n_338" depart="338.00" departLane="e2sep_1" departPos="12.10" departPosLat="0.00" departSpeed="13.90" departDelay="0.00" arrival="497.00" arrivalLane="c2n_1" arrivalPos="990.00" arrivalPosLat="0.00" arrivalSpeed="13.90" duration="159.00" routeLength="1978.19" waitingTime="0.00" waitingCount="0" stopTime="0.00" timeLoss="16.06" rerouteNo="1" devices="tripinfo_bus_e2n_338 routing_bus_e2n_338" vType="Bus" speedFactor="1.00" vaporized=""/>
    <tripinfo id="car_e2s_302" depart="302.00" departLane="e2sep_1" departPos="3.60" departPosLat="0.00" departSpeed="13.90" departDelay="0.00" arrival="499.00" arrivalLane="c2s_1" arrivalPos="990.00" arrivalPosLat="0.00" arrivalSpeed="14.12" duration="197.00" routeLength="1996.47" waitingTime="31.00" waitingCount="2" stopTime="0.00" timeLoss="54.44" rerouteNo="1" devices="tripinfo_car_e2s_302 routing_car_e2s_302" vType="Car" speedFactor="1.02" vaporized=""/>
    <tripinfo id="car_e2w_341" depart="341.00" departLane="e2sep_1" departPos="3.60" departPosLat="0.00" departSpeed="13.90" departDelay="0.00" arrival="499.00" arrivalLane="c2w_1" arrivalPos="990.00" arrivalPosLat="0.00" arrivalSpeed="13.90" duration="158.00" routeLength="1997.01" waitingTime="0.00" waitingCount="0" stopTime="0.00" timeLoss="13.65" rerouteNo="1" devices="tripinfo_car_e2w_341 routing_car_e2w_341" vType="Car" speedFactor="1.00" vaporized=""/>
    <tripinfo id="car_e2s_304" depart="304.00" departLane="e2sep_1" departPos="3.60" departPosLat="0.00" departSpeed="13.90" departDelay="0.00" arrival="501.00" arrivalLane="c2s_1" arrivalPos="990.00" arrivalPosLat="0.00" arrivalSpeed="14.90" duration="197.00" routeLength="1996.47" waitingTime="30.00" waitingCount="2" stopTime="0.00" timeLoss="65.16" rerouteNo="1" devices="tripinfo_car_e2s_304 routing_car_e2s_304" vType="Car" speedFactor="1.10" vaporized=""/>
    <tripinfo id="car_e2w_344" depart="344.00" departLane="e2sep_1" departPos="3.60" departPosLat="0.00" departSpeed="13.90" departDelay="0.00" arrival="501.00" arrivalLane="c2w_1" arrivalPos="990.00" arrivalPosLat="0.00" arrivalSpeed="15.10" duration="157.00" routeLength="1997.01" waitingTime="0.00" waitingCount="0" stopTime="0.00" timeLoss="27.98" rerouteNo="1" devices="tripinfo_car_e2w_344 routing_car_e2w_344" vType="Car" speedFactor="1.12" vaporized=""/>
    <tripinfo id="car_e2s_319" depart="319.00" departLane="e2sep_1" departPos="3.60" departPosLat="0.00" departSpeed="13.90" departDelay="0.00" arrival="503.00" arrivalLane="c2s_1" arrivalPos="990.00" arrivalPosLat="0.00" arrivalSpeed="15.63" duration="184.00" routeLength="1996.47" waitingTime="25.00" waitingCount="2" stopTime="0.00" timeLoss="60.83" rerouteNo="1" devices="tripinfo_car_e2s_319 routing_car_e2s_319" vType="Car" speedFactor="1.18" vaporized=""/>
    <tripinfo id="car_e2n_354" depart="354.00" departLane="e2sep_1" departPos="3.60" departPosLat="0.00" departSpeed="13.90" departDelay="0.00" arrival="503.00" arrivalLane="c2n_1" arrivalPos="990.00" arrivalPosLat="0.00" arrivalSpeed="14.35" duration="149.00" routeLength="1986.69" waitingTime="0.00" waitingCount="0" stopTime="0.00" timeLoss="9.14" rerouteNo="1" devices="tripinfo_car_e2n_354 routing_car_e2n_354" vType="Car" speedFactor="1.03" vaporized=""/>
    <tripinfo id="car_e2w_374" depart="374.00" departLane="e2sep_1" departPos="3.60" departPosLat="0.00" departSpeed="13.90" departDelay="0.00" arrival="503.00" arrivalLane="c2w_1" arrivalPos="990.00" arrivalPosLat="0.00" arrivalSpeed="16.08" duration="129.00" routeLength="1997.01" waitingTime="0.00" waitingCount="0" stopTime="0.00" timeLoss="11.05" rerouteNo="1" devices="tripinfo_car_e2w_374 routing_car_e2w_374" vType="Car" speedFactor="1.23" vaporized=""/>
    <tripinfo id="car_e2s_328" depart="328.00" departLane="e2sep_1" departPos="3.60" departPosLat="0.00" departSpeed="13.90" departDelay="0.00" arrival="505.00" arrivalLane="c2s_1" arrivalPos="990.00" arrivalPosLat="0.00" arrivalSpeed="14.98" duration="177.00" routeLength="1996.47" waitingTime="14.00" waitingCount="2" stopTime="0.00" timeLoss="45.75" rerouteNo="1" devices="tripinfo_car_e2s_328 routing_car_e2s_328" vType="Car" speedFactor="1.10" vaporized=""/>
    <tripinfo id="car_e2s_356" depart="356.00" departLane="e2sep_1" departPos="3.60" departPosLat="0.00" departSpeed="13.90" departDelay="0.00" arrival="508.00" arrivalLane="c2s_1" arrivalPos="990.00" arrivalPosLat="0.00" arrivalSpeed="14.74" duration="152.00" routeLength="1996.47" waitingTime="0.00" waitingCount="0" stopTime="0.00" timeLoss="15.98" rerouteNo="1" devices="tripinfo_car_e2s_356 routing_car_e2s_356" vType="Car" speedFactor="1.07" vaporized=""/>
    <tripinfo id="car_w2n_285" depart="286.00" departLane="w2sep_1" departPos="3.60" departPosLat="0.00" departSpeed="13.90" departDelay="1.00" arrival="510.00" arrivalLane="c2n_1" arrivalPos="990.00" arrivalPosLat="0.00" arrivalSpeed="13.90" duration="224.00" routeLength="1996.47" waitingTime="62.00" waitingCount="2" stopTime="0.00" timeLoss="78.93" rerouteNo="1" devices="tripinfo_car_w2n_285 routing_car_w2n_285" vType="Car" speedFactor="1.00" vaporized=""/>
    <tripinfo id="car_w2n_328" depart="328.00" departLane="w2sep_1" departPos="3.60" departPosLat="0.00" departSpeed="13.90" departDelay="0.00" arrival="514.00" arrivalLane="c2n_1" arrivalPos="990.00" arrivalPosLat="0.00" arrivalSpeed="13.89" duration="186.00" routeLength="1996.47" waitingTime="22.00" waitingCount="1" stopTime="0.00" timeLoss="41.10" rerouteNo="1" devices="tripinfo_car_w2n_328 routing_car_w2n_328" vType="Car" speedFactor="1.00" vaporized=""/>
    <tripinfo id="car_n2w_326" depart="326.00" departLane="n2sep_1" departPos="3.60" departPosLat="0.00" departSpeed="13.90" departDelay="0.00" arrival="520.00" arrivalLane="c2w_1" arrivalPos="990.00" arrivalPosLat="0.00" arrivalSpeed="14.89" duration="194.00" routeLength="1986.69" waitingTime="49.00" waitingCount="1" stopTime="0.00" timeLoss="59.46" rerouteNo="1" devices="tripinfo_car_n2w_326 routing_car_n2w_326" vType="Car" speedFactor="1.07" vaporized=""/>
    <tripinfo id="car_n2w_367" depart="367.00" departLane="n2sep_1" departPos="3.60" departPosLat="0.00" departSpeed="13.90" departDelay="0.00" arrival="523.00" arrivalLane="c2w_1" arrivalPos="990.00" arrivalPosLat="0.00" arrivalSpeed="15.80" duration="156.00" routeLength="1986.69" waitingTime="15.00" waitingCount="1" stopTime="0.00" timeLoss="30.06" rerouteNo="1" devices="tripinfo_car_n2w_367 routing_car_n2w_367" vType="Car" speedFactor="1.14" vaporized=""/>
    <tripinfo id="car_s2e_319" depart="321.00" departLane="s2sep_1" departPos="3.60" departPosLat="0.00" departSpeed="13.90" departDelay="2.00" arrival="524.00" arrivalLane="c2e_1" arrivalPos="990.00" arrivalPosLat="1.00" arrivalSpeed="13.96" duration="203.00" routeLength="1986.69" waitingTime="50.00" waitingCount="1" stopTime="0.00" timeLoss="59.83" rerouteNo="1" devices="tripinfo_car_s2e_319 routing_car_s2e_319" vType="Car" speedFactor="1.00" vaporized=""/>
    <tripinfo id="car_s2n_373" depart="373.00" departLane="s2sep_1" departPos="3.60" departPosLat="0.00" departSpeed="13.90" departDelay="0.00" arrival="524.00" arrivalLane="c2n_1" arrivalPos="990.00" arrivalPosLat="0.00" arrivalSpeed="14.42" duration="151.00" routeLength="1997.01" waitingTime="2.00" waitingCount="1" stopTime="0.00" timeLoss="12.46" rerouteNo="1" devices="tripinfo_car_s2n_373 routing_car_s2n_373" vType="Car" speedFactor="1.04" vaporized=""/>
    <tripinfo id="car_n2s_348" depart="348.00" departLane="n2sep_1" departPos="3.60" departPosLat="0.00" departSpeed="13.90" departDelay="0.00" arrival="526.00" arrivalLane="c2s_1" arrivalPos="990.00" arrivalPosLat="0.00" arrivalSpeed="14.02" duration="178.00" routeLength="1997.01" waitingTime="25.00" waitingCount="1" stopTime="0.00" timeLoss="35.29" rerouteNo="1" devices="tripinfo_car_n2s_348 routing_car_n2s_348" vType="Car" speedFactor="1.01" vaporized=""/>
    <tripinfo id="amb_w2e_390" depart="390.00" departLane="w2sep_1" departPos="6.60" departPosLat="0.00" departSpeed="13.90" departDelay="0.00" arrival="526.00" arrivalLane="c2e_1" arrivalPos="990.00" arrivalPosLat="1.00" arrivalSpeed="17.48" duration="136.00" routeLength="1994.01" waitingTime="3.00" waitingCount="1" stopTime="0.00" timeLoss="39.58" rerouteNo="1" devices="tripinfo_amb_w2e_390 routing_amb_w2e_390 bluelight_amb_w2e_390" vType="Ambulance" speedFactor="1.50" vaporized="">
        <bluelight/>
    </tripinfo>
    <tripinfo id="car_n2w_381" depart="381.00" departLane="n2sep_1" departPos="3.60" departPosLat="0.00" departSpeed="13.90" departDelay="0.00" arrival="527.00" arrivalLane="c2w_1" arrivalPos="990.00" arrivalPosLat="0.00" arrivalSpeed="15.54" duration="146.00" routeLength="1986.69" waitingTime="1.00" waitingCount="1" stopTime="0.00" timeLoss="17.71" rerouteNo="1" devices="tripinfo_car_n2w_381 routing_car_n2w_381" vType="Car" speedFactor="1.12" vaporized=""/>
    <tripinfo id="car_s2w_339" depart="339.00" departLane="s2sep_1" departPos="3.60" departPosLat="0.00" departSpeed="13.90" departDelay="0.00" arrival="534.00" arrivalLane="c2w_1" arrivalPos="990.00" arrivalPosLat="0.00" arrivalSpeed="14.35" duration="195.00" routeLength="1996.47" waitingTime="36.00" waitingCount="2" stopTime="0.00" timeLoss="55.25" rerouteNo="1" devices="tripinfo_car_s2w_339 routing_car_s2w_339" vType="Car" speedFactor="1.03" vaporized=""/>
    <tripinfo id="car_n2s_421" depart="421.00" departLane="n2sep_1" departPos="3.60" departPosLat="0.00" departSpeed="13.90" departDelay="0.00" arrival="547.00" arrivalLane="c2s_1" arrivalPos="990.00" arrivalPosLat="0.00" arrivalSpeed="15.96" duration="126.00" routeLength="1997.01" waitingTime="0.00" waitingCount="0" stopTime="0.00" timeLoss="0.31" rerouteNo="1" devices="tripinfo_car_n2s_421 routing_car_n2s_421" vType="Car" speedFactor="1.15" vaporized=""/>
    <tripinfo id="bus_s2n_405" depart="405.00" departLane="s2sep_1" departPos="12.10" departPosLat="0.00" departSpeed="13.90" departDelay="0.00" arrival="549.00" arrivalLane="c2n_1" arrivalPos="990.00" arrivalPosLat="0.00" arrivalSpeed="13.90" duration="144.00" routeLength="1988.51" waitingTime="0.00" waitingCount="0" stopTime="0.00" timeLoss="0.27" rerouteNo="1" devices="tripinfo_bus_s2n_405 routing_bus_s2n_405" vType="Bus" speedFactor="1.00" vaporized=""/>
    <tripinfo id="car_s2w_406" depart="407.00" departLane="s2sep_1" departPos="3.60" departPosLat="0.00" departSpeed="13.90" departDelay="1.00" arrival="559.00" arrivalLane="c2w_1" arrivalPos="990.00" arrivalPosLat="0.00" arrivalSpeed="13.90" duration="152.00" routeLength="1996.47" waitingTime="0.00" waitingCount="0" stopTime="0.00" timeLoss="6.89" rerouteNo="1" devices="tripinfo_car_s2w_406 routing_car_s2w_406" vType="Car" speedFactor="1.00" vaporized=""/>
    <tripinfo id="car_s2w_416" depart="416.00" departLane="s2sep_1" departPos="3.60" departPosLat="0.00" departSpeed="13.90" departDelay="0.00" arrival="564.00" arrivalLane="c2w_1" arrivalPos="990.00" arrivalPosLat="0.00" arrivalSpeed="13.93" duration="148.00" routeLength="1996.47" waitingTime="0.00" waitingCount="0" stopTime="0.00" timeLoss="3.55" rerouteNo="1" devices="tripinfo_car_s2w_416 routing_car_s2w_416" vType="Car" speedFactor="1.00" vaporized=""/>
    <tripinfo id="car_w2s_410" depart="410.00" departLane="w2sep_1" departPos="3.60" departPosLat="0.00" departSpeed="13.90" departDelay="0.00" arrival="567.00" arrivalLane="c2s_1" arrivalPos="990.00" arrivalPosLat="0.00" arrivalSpeed="15.69" duration="157.00" routeLength="1986.69" waitingTime="16.00" waitingCount="1" stopTime="0.00" timeLoss="29.51" rerouteNo="1" devices="tripinfo_car_w2s_410 routing_car_w2s_410" vType="Car" speedFactor="1.13" vaporized=""/>
    <tripinfo id="car_w2e_382" depart="382.00" departLane="w2sep_1" departPos="3.60" departPosLat="0.00" departSpeed="13.90" departDelay="0.00" arrival="569.00" arrivalLane="c2e_1" arrivalPos="990.00" arrivalPosLat="0.00" arrivalSpeed="14.11" duration="187.00" routeLength="1997.01" waitingTime="35.00" waitingCount="1" stopTime="0.00" timeLoss="44.67" rerouteNo="1" devices="tripinfo_car_w2e_382 routing_car_w2e_382" vType="Car" speedFactor="1.02" vaporized=""/>
    <tripinfo id="car_e2n_402" depart="402.00" departLane="e2sep_1" departPos="3.60" departPosLat="0.00" departSpeed="13.90" departDelay="0.00" arrival="569.00" arrivalLane="c2n_1" arrivalPos="990.00" arrivalPosLat="0.00" arrivalSpeed="13.95" duration="167.00" routeLength="1986.69" waitingTime="14.00" waitingCount="1" stopTime="0.00" timeLoss="23.83" rerouteNo="1" devices="tripinfo_car_e2n_402 routing_car_e2n_402" vType="Car" speedFactor="1.00" vaporized=""/>
    <tripinfo id="car_e2w_403" depart="404.00" departLane="e2sep_1" departPos="3.60" departPosLat="0.00" departSpeed="13.90" departDelay="1.00" arrival="571.00" arrivalLane="c2w_1" arrivalPos="990.00" arrivalPosLat="0.00" arrivalSpeed="14.23" duration="167.00" routeLength="1997.01" waitingTime="12.00" waitingCount="1" stopTime="0.00" timeLoss="25.80" rerouteNo="1" devices="tripinfo_car_e2w_403 routing_car_e2w_403" vType="Car" speedFactor="1.02" vaporized=""/>
    <tripinfo id="car_w2e_405" depart="405.00" departLane="w2sep_1" departPos="3.60" departPosLat="0.00" departSpeed="13.90" departDelay="0.00" arrival="571.00" arrivalLane="c2e_1" arrivalPos="990.00" arrivalPosLat="0.00" arrivalSpeed="15.12" duration="166.00" routeLength="1997.01" waitingTime="19.00" waitingCount="1" stopTime="0.00" timeLoss="36.49" rerouteNo="1" devices="tripinfo_car_w2e_405 routing_car_w2e_405" vType="Car" speedFactor="1.11" vaporized=""/>
    <tripinfo id="car_e2n_405" depart="406.00" departLane="e2sep_1" departPos="3.60" departPosLat="0.00" departSpeed="13.90" departDelay="1.00" arrival="571.00" arrivalLane="c2n_1" arrivalPos="990.00" arrivalPosLat="0.00" arrivalSpeed="15.53" duration="165.00" routeLength="1986.69" waitingTime="12.00" waitingCount="1" stopTime="0.00" timeLoss="41.36" rerouteNo="1" devices="tripinfo_car_e2n_405 routing_car_e2n_405" vType="Car" speedFactor="1.16" vaporized=""/>
    <tripinfo id="car_w2e_442" depart="442.00" departLane="w2sep_1" departPos="3.60" departPosLat="0.00" departSpeed="13.90" departDelay="0.00" arrival="574.00" arrivalLane="c2e_1" arrivalPos="990.00" arrivalPosLat="0.00" arrivalSpeed="15.52" duration="132.00" routeLength="1997.01" waitingTime="0.00" waitingCount="0" stopTime="0.00" timeLoss="3.62" rerouteNo="1" devices="tripinfo_car_w2e_442 routing_car_w2e_442" vType="Car" speedFactor="1.12" vaporized=""/>
    <tripinfo id="car_w2s_412" depart="412.00" departLane="w2sep_1" departPos="3.60" departPosLat="0.00" departSpeed="13.90" departDelay="0.00" arrival="577.00" arrivalLane="c2s_1" arrivalPos="990.00" arrivalPosLat="0.00" arrivalSpeed="14.37" duration="165.00" routeLength="1986.69" waitingTime="9.00" waitingCount="1" stopTime="0.00" timeLoss="24.92" rerouteNo="1" devices="tripinfo_car_w2s_412 routing_car_w2s_412" vType="Car" speedFactor="1.03" vaporized=""/>
    <tripinfo id="car_e2w_416" depart="416.00" departLane="e2sep_1" departPos="3.60" departPosLat="0.00" departSpeed="13.90" departDelay="0.00" arrival="578.00" arrivalLane="c2w_1" arrivalPos="990.00" arrivalPosLat="0.00" arrivalSpeed="13.90" duration="162.00" routeLength="1997.01" waitingTime="4.00" waitingCount="1" stopTime="0.00" timeLoss="17.72" rerouteNo="1" devices="tripinfo_car_e2w_416 routing_car_e2w_416" vType="Car" speedFactor="1.00" vaporized=""/>
    <tripinfo id="car_e2n_432" depart="432.00" departLane="e2sep_1" departPos="3.60" departPosLat="0.00" departSpeed="13.90" departDelay="0.00" arrival="581.00" arrivalLane="c2n_1" arrivalPos="990.00" arrivalPosLat="0.00" arrivalSpeed="13.96" duration="149.00" routeLength="1986.69" waitingTime="0.00" waitingCount="0" stopTime="0.00" timeLoss="5.74" rerouteNo="1" devices="tripinfo_car_e2n_432 routing_car_e2n_432" vType="Car" speedFactor="1.00" vaporized=""/>
    <tripinfo id="car_e2s_441" depart="441.00" departLane="e2sep_1" departPos="3.60" departPosLat="0.00" departSpeed="13.90" departDelay="0.00" arrival="584.00" arrivalLane="c2s_1" arrivalPos="990.00" arrivalPosLat="0.00" arrivalSpeed="14.80" duration="143.00" routeLength="1996.47" waitingTime="0.00" waitingCount="0" stopTime="0.00" timeLoss="6.60" rerouteNo="1" devices="tripinfo_car_e2s_441 routing_car_e2s_441" vType="Car" speedFactor="1.06" vaporized=""/>
</tripinfos>
