<?xml version="1.0" encoding="UTF-8"?>

<!-- generated on Sat Apr 24 17:14:08 2021 by Eclipse SUMO Version 1.4.0
<configuration xmlns:xsi="http://www.w3.org/2001/XMLSchema-instance" xsi:noNamespaceSchemaLocation="http://sumo.dlr.de/xsd/sumoConfiguration.xsd">

    <input>
        <net-file value="sumofiles/junction.net.xml"/>
        <route-files value="sumofiles/junction_0_126.rou.xml"/>
        <additional-files value="sumofiles/junction.det.xml"/>
    </input>

    <output>
        <tripinfo-output value="sumofiles/output/tripinfo_0_126.xml"/>
    </output>

    <time>
        <begin value="0"/>
        <end value="10000"/>
        <step-length value="0.05"/>
    </time>

    <processing>
        <lateral-resolution value="0.1"/>
    </processing>

    <report>
        <no-warnings value="true"/>
        <error-log value="sumofiles/output/errorlog_0_126.log"/>
        <no-step-log value="true"/>
    </report>

    <traci_server>
        <remote-port value="38231"/>
    </traci_server>

    <gui_only>
        <gui-settings-file value="sumofiles/junction-gui.settings.xml"/>
        <tracker-interval value="0.05"/>
    </gui_only>

</configuration>
-->

<tripinfos xmlns:xsi="http://www.w3.org/2001/XMLSchema-instance" xsi:noNamespaceSchemaLocation="http://sumo.dlr.de/xsd/tripinfo_file.xsd">
    <tripinfo id="car_e2w_1" depart="1.00" departLane="e2sep_1" departPos="3.60" departPosLat="0.00" departSpeed="13.90" departDelay="0.00" arrival="136.70" arrivalLane="c2w_1" arrivalPos="990.00" arrivalPosLat="0.00" arrivalSpeed="14.73" duration="135.70" routeLength="1997.01" waitingTime="0.00" waitingCount="0" stopTime="0.00" timeLoss="0.16" rerouteNo="1" devices="tripinfo_car_e2w_1 routing_car_e2w_1" vType="Car" speedFactor="1.06" vaporized=""/>
    <tripinfo id="car_e2w_7" depart="7.00" departLane="e2sep_1" departPos="3.60" departPosLat="0.00" departSpeed="13.90" departDelay="0.00" arrival="141.60" arrivalLane="c2w_1" arrivalPos="990.00" arrivalPosLat="0.00" arrivalSpeed="15.04" duration="134.60" routeLength="1997.01" waitingTime="0.00" waitingCount="0" stopTime="0.00" timeLoss="1.89" rerouteNo="1" devices="tripinfo_car_e2w_7 routing_car_e2w_7" vType="Car" speedFactor="1.08" vaporized=""/>
    <tripinfo id="car_w2n_12" depart="12.00" departLane="w2sep_1" departPos="3.60" departPosLat="0.00" departSpeed="13.90" departDelay="0.00" arrival="153.45" arrivalLane="c2n_1" arrivalPos="990.00" arrivalPosLat="0.00" arrivalSpeed="14.54" duration="141.45" routeLength="1996.47" waitingTime="0.00" waitingCount="0" stopTime="0.00" timeLoss="3.44" rerouteNo="1" devices="tripinfo_car_w2n_12 routing_car_w2n_12" vType="Car" speedFactor="1.05" vaporized=""/>
    <tripinfo id="car_n2w_1" depart="1.00" departLane="n2sep_1" departPos="3.60" departPosLat="0.00" departSpeed="13.90" departDelay="0.00" arrival="161.70" arrivalLane="c2w_1" arrivalPos="990.00" arrivalPosLat="0.00" arrivalSpeed="14.73" duration="160.70" routeLength="1986.69" waitingTime="17.75" waitingCount="1" stopTime="0.00" timeLoss="25.18" rerouteNo="1" devices="tripinfo_car_n2w_1 routing_car_n2w_1" vType="Car" speedFactor="1.06" vaporized=""/>
    <tripinfo id="car_n2e_8" depart="8.00" departLane="n2sep_1" departPos="3.60" departPosLat="0.00" departSpeed="13.90" departDelay="0.00" arrival="164.70" arrivalLane="c2e_1" arrivalPos="990.00" arrivalPosLat="0.00" arrivalSpeed="14.32" duration="156.70" routeLength="1996.47" waitingTime="8.75" waitingCount="1" stopTime="0.00" timeLoss="16.62" rerouteNo="1" devices="tripinfo_car_n2e_8 routing_car_n2e_8" vType="Car" speedFactor="1.03" vaporized=""/>
    <tripinfo id="car_s2w_5" depart="5.00" departLane="s2sep_1" departPos="3.60" departPosLat="0.00" departSpeed="13.90" departDelay="0.00" arrival="168.15" arrivalLane="c2w_1" arrivalPos="990.00" arrivalPosLat="0.00" arrivalSpeed="14.04" duration="163.15" routeLength="1996.47" waitingTime="10.65" waitingCount="1" stopTime="0.00" timeLoss="20.30" rerouteNo="1" devices="tripinfo_car_s2w_5 routing_car_s2w_5" vType="Car" speedFactor="1.01" vaporized=""/>
    <tripinfo id="car_n2e_21" depart="21.00" departLane="n2sep_1" departPos="3.60" departPosLat="0.00" departSpeed="13.90" departDelay="0.00" arrival="169.10" arrivalLane="c2e_1" arrivalPos="990.00" arrivalPosLat="0.00" arrivalSpeed="14.31" duration="148.10" routeLength="1996.47" waitingTime="0.00" waitingCount="0" stopTime="0.00" timeLoss="8.02" rerouteNo="1" devices="tripinfo_car_n2e_21 routing_car_n2e_21" vType="Car" speedFactor="1.03" vaporized=""/>
    <tripinfo id="car_s2w_9" depart="9.00" departLane="s2sep_1" departPos="3.60" departPosLat="0.00" departSpeed="13.90" departDelay="0.00" arrival="172.45" arrivalLane="c2w_1" arrivalPos="990.00" arrivalPosLat="0.00" arrivalSpeed="13.89" duration="163.45" routeLength="1996.47" waitingTime="6.15" waitingCount="1" stopTime="0.00" timeLoss="19.10" rerouteNo="1" devices="tripinfo_car_s2w_9 routing_car_s2w_9" vType="Car" speedFactor="1.00" vaporized=""/>
    <tripinfo id="car_s2e_38" depart="38.00" departLane="s2sep_1" departPos="3.60" departPosLat="0.00" departSpeed="13.90" departDelay="0.00" arrival="185.25" arrivalLane="c2e_1" arrivalPos="990.00" arrivalPosLat="0.00" arrivalSpeed="13.90" duration="147.25" routeLength="1986.69" waitingTime="0.00" waitingCount="0" stopTime="0.00" timeLoss="3.55" rerouteNo="1" devices="tripinfo_car_s2e_38 routing_car_s2e_38" vType="Car" speedFactor="1.00" vaporized=""/>
    <tripinfo id="bus_s2n_45" depart="45.00" departLane="s2sep_1" departPos="12.10" departPosLat="0.00" departSpeed="13.90" departDelay="0.00" arrival="189.00" arrivalLane="c2n_1" arrivalPos="990.00" arrivalPosLat="0.00" arrivalSpeed="13.90" duration="144.00" routeLength="1988.51" waitingTime="0.00" waitingCount="0" stopTime="0.00" timeLoss="0.94" rerouteNo="1" devices="tripinfo_bus_s2n_45 routing_bus_s2n_45" vType="Bus" speedFactor="1.00" vaporized=""/>
    <tripinfo id="car_s2e_51" depart="51.00" departLane="s2sep_1" departPos="3.60" departPosLat="0.00" departSpeed="13.90" departDelay="0.00" arrival="193.60" arrivalLane="c2e_1" arrivalPos="990.00" arrivalPosLat="0.00" arrivalSpeed="14.54" duration="142.60" routeLength="1986.69" waitingTime="0.00" waitingCount="0" stopTime="0.00" timeLoss="5.23" rerouteNo="1" devices="tripinfo_car_s2e_51 routing_car_s2e_51" vType="Car" speedFactor="1.05" vaporized=""/>
    <tripinfo id="car_e2n_16" depart="16.00" departLane="e2sep_1" departPos="3.60" departPosLat="0.00" departSpeed="13.90" departDelay="0.00" arrival="205.40" arrivalLane="c2n_1" arrivalPos="990.00" arrivalPosLat="0.00" arrivalSpeed="15.05" duration="189.40" routeLength="1986.69" waitingTime="49.20" waitingCount="1" stopTime="0.00" timeLoss="56.68" rerouteNo="1" devices="tripinfo_car_e2n_16 routing_car_e2n_16" vType="Car" speedFactor="1.08" vaporized=""/>
    <tripinfo id="car_e2n_22" depart="22.00" departLane="e2sep_1" departPos="3.60" departPosLat="0.00" departSpeed="13.90" departDelay="0.00" arrival="209.45" arrivalLane="c2n_1" arrivalPos="990.00" arrivalPosLat="0.00" arrivalSpeed="15.14" duration="187.45" routeLength="1986.69" waitingTime="44.15" waitingCount="1" stopTime="0.00" timeLoss="55.71" rerouteNo="1" devices="tripinfo_car_e2n_22 routing_car_e2n_22" vType="Car" speedFactor="1.09" vaporized=""/>
    <tripinfo id="car_w2e_15" depart="15.00" departLane="w2sep_1" departPos="3.60" departPosLat="0.00" departSpeed="13.90" departDelay="0.00" arrival="210.05" arrivalLane="c2e_1" arrivalPos="990.00" arrivalPosLat="0.00" arrivalSpeed="14.04" duration="195.05" routeLength="1997.01" waitingTime="44.90" waitingCount="1" stopTime="0.00" timeLoss="52.84" rerouteNo="1" devices="tripinfo_car_w2e_15 routing_car_w2e_15" vType="Car" speedFactor="1.01" vaporized=""/>
    <tripinfo id="car_e2n_34" depart="34.00" departLane="e2sep_1" departPos="3.60" departPosLat="0.00" departSpeed="13.90" departDelay="0.00" arrival="212.20" arrivalLane="c2n_1" arrivalPos="990.00" arrivalPosLat="0.00" arrivalSpeed="15.48" duration="178.20" routeLength="1986.69" waitingTime="34.75" waitingCount="1" stopTime="0.00" timeLoss="50.26" rerouteNo="1" devices="tripinfo_car_e2n_34 routing_car_e2n_34" vType="Car" speedFactor="1.12" vaporized=""/>
    <tripinfo id="car_w2e_33" depart="33.00" departLane="w2sep_1" departPos="3.60" departPosLat="0.00" departSpeed="13.90" departDelay="0.00" arrival="213.20" arrivalLane="c2e_1" arrivalPos="990.00" arrivalPosLat="0.00" arrivalSpeed="14.49" duration="180.20" routeLength="1997.01" waitingTime="30.85" waitingCount="1" stopTime="0.00" timeLoss="42.99" rerouteNo="1" devices="tripinfo_car_w2e_33 routing_car_w2e_33" vType="Car" speedFactor="1.05" vaporized=""/>
    <tripinfo id="car_w2s_60" depart="60.00" departLane="w2sep_1" departPos="3.60" departPosLat="0.00" departSpeed="13.90" departDelay="0.00" arrival="215.15" arrivalLane="c2s_1" arrivalPos="990.00" arrivalPosLat="0.00" arrivalSpeed="13.90" duration="155.15" routeLength="1986.69" waitingTime="1.95" waitingCount="1" stopTime="0.00" timeLoss="11.49" rerouteNo="1" devices="tripinfo_car_w2s_60 routing_car_w2s_60" vType="Car" speedFactor="1.00" vaporized=""/>
    <tripinfo id="car_w2s_62" depart="62.00" departLane="w2sep_1" departPos="3.60" departPosLat="0.00" departSpeed="13.90" departDelay="0.00" arrival="217.05" arrivalLane="c2s_1" arrivalPos="990.00" arrivalPosLat="0.00" arrivalSpeed="15.36" duration="155.05" routeLength="1986.69" waitingTime="1.35" waitingCount="1" stopTime="0.00" timeLoss="31.02" rerouteNo="1" devices="tripinfo_car_w2s_62 routing_car_w2s_62" vType="Car" speedFactor="1.16" vaporized=""/>
    <tripinfo id="car_e2w_56" depart="56.00" departLane="e2sep_1" departPos="3.60" departPosLat="0.00" departSpeed="13.90" departDelay="0.00" arrival="217.40" arrivalLane="c2w_1" arrivalPos="990.00" arrivalPosLat="0.00" arrivalSpeed="13.90" duration="161.40" routeLength="1997.01" waitingTime="7.25" waitingCount="1" stopTime="0.00" timeLoss="17.73" rerouteNo="1" devices="tripinfo_car_e2w_56 routing_car_e2w_56" vType="Car" speedFactor="1.00" vaporized=""/>
    <tripinfo id="car_e2n_68" depart="68.45" departLane="e2sep_1" departPos="3.60" departPosLat="0.00" departSpeed="13.90" departDelay="0.45" arrival="218.45" arrivalLane="c2n_1" arrivalPos="990.00" arrivalPosLat="0.00" arrivalSpeed="15.16" duration="150.00" routeLength="1986.69" waitingTime="0.00" waitingCount="0" stopTime="0.00" timeLoss="18.26" rerouteNo="1" devices="tripinfo_car_e2n_68 routing_car_e2n_68" vType="Car" speedFactor="1.09" vaporized=""/>
    <tripinfo id="car_e2s_24" depart="24.00" departLane="e2sep_1" departPos="3.60" departPosLat="0.00" departSpeed="13.90" departDelay="0.00" arrival="220.75" arrivalLane="c2s_1" arrivalPos="990.00" arrivalPosLat="0.00" arrivalSpeed="14.24" duration="196.75" routeLength="1996.47" waitingTime="40.70" waitingCount="3" stopTime="0.00" timeLoss="56.13" rerouteNo="1" devices="tripinfo_car_e2s_24 routing_car_e2s_24" vType="Car" speedFactor="1.03" vaporized=""/>
    <tripinfo id="car_e2w_57" depart="57.45" departLane="e2sep_1" departPos="3.60" departPosLat="0.00" departSpeed="13.90" departDelay="0.45" arrival="221.80" arrivalLane="c2w_1" arrivalPos="990.00" arrivalPosLat="0.00" arrivalSpeed="13.89" duration="164.35" routeLength="1997.01" waitingTime="4.75" waitingCount="1" stopTime="0.00" timeLoss="20.64" rerouteNo="1" devices="tripinfo_car_e2w_57 routing_car_e2w_57" vType="Car" speedFactor="1.00" vaporized=""/>
    <tripinfo id="car_e2w_67" depart="67.00" departLane="e2sep_1" departPos="3.60" departPosLat="0.00" departSpeed="13.90" departDelay="0.00" arrival="225.05" arrivalLane="c2w_1" arrivalPos="990.00" arrivalPosLat="0.00" arrivalSpeed="13.99" duration="158.05" routeLength="1997.01" waitingTime="0.00" waitingCount="0" stopTime="0.00" timeLoss="15.80" rerouteNo="1" devices="tripinfo_car_e2w_67 routing_car_e2w_67" vType="Car" speedFactor="1.01" vaporized=""/>
    <tripinfo id="car_e2w_76" depart="76.00" departLane="e2sep_1" departPos="3.60" departPosLat="0.00" departSpeed="13.90" departDelay="0.00" arrival="228.40" arrivalLane="c2w_1" arrivalPos="990.00" arrivalPosLat="0.00" arrivalSpeed="13.86" duration="152.40" routeLength="1997.01" waitingTime="0.00" waitingCount="0" stopTime="0.00" timeLoss="8.71" rerouteNo="1" devices="tripinfo_car_e2w_76 routing_car_e2w_76" vType="Car" speedFactor="1.00" vaporized=""/>
    <tripinfo id="car_e2s_76" depart="77.45" departLane="e2sep_1" departPos="3.60" departPosLat="0.00" departSpeed="13.90" departDelay="1.45" arrival="228.40" arrivalLane="c2s_1" arrivalPos="990.00" arrivalPosLat="0.00" arrivalSpeed="13.90" duration="150.95" routeLength="1996.47" waitingTime="0.00" waitingCount="0" stopTime="0.00" timeLoss="6.59" rerouteNo="1" devices="tripinfo_car_e2s_76 routing_car_e2s_76" vType="Car" speedFactor="1.00" vaporized=""/>
    <tripinfo id="car_e2n_94" depart="94.00" departLane="e2sep_1" departPos="3.60" departPosLat="0.00" departSpeed="13.90" departDelay="0.00" arrival="229.80" arrivalLane="c2n_1" arrivalPos="990.00" arrivalPosLat="0.00" arrivalSpeed="16.40" duration="135.80" routeLength="1986.69" waitingTime="0.00" waitingCount="0" stopTime="0.00" timeLoss="14.03" rerouteNo="1" devices="tripinfo_car_e2n_94 routing_car_e2n_94" vType="Car" speedFactor="1.18" vaporized=""/>
    <tripinfo id="car_e2w_83" depart="83.00" departLane="e2sep_1" departPos="3.60" departPosLat="0.00" departSpeed="13.90" departDelay="0.00" arrival="231.50" arrivalLane="c2w_1" arrivalPos="990.00" arrivalPosLat="0.00" arrivalSpeed="13.91" duration="148.50" routeLength="1997.01" waitingTime="0.00" waitingCount="0" stopTime="0.00" timeLoss="5.56" rerouteNo="1" devices="tripinfo_car_e2w_83 routing_car_e2w_83" vType="Car" speedFactor="1.01" vaporized=""/>
    <tripinfo id="car_e2w_84" depart="84.50" departLane="e2sep_1" departPos="3.60" departPosLat="0.00" departSpeed="13.90" departDelay="0.50" arrival="234.80" arrivalLane="c2w_1" arrivalPos="990.00" arrivalPosLat="0.00" arrivalSpeed="13.86" duration="150.30" routeLength="1997.01" waitingTime="0.00" waitingCount="0" stopTime="0.00" timeLoss="6.60" rerouteNo="1" devices="tripinfo_car_e2w_84 routing_car_e2w_84" vType="Car" speedFactor="1.00" vaporized=""/>
    <tripinfo id="car_e2w_90" depart="90.00" departLane="e2sep_1" departPos="3.60" departPosLat="0.00" departSpeed="13.90" departDelay="0.00" arrival="238.20" arrivalLane="c2w_1" arrivalPos="990.00" arrivalPosLat="0.00" arrivalSpeed="13.86" duration="148.20" routeLength="1997.01" waitingTime="0.00" waitingCount="0" stopTime="0.00" timeLoss="4.49" rerouteNo="1" devices="tripinfo_car_e2w_90 routing_car_e2w_90" vType="Car" speedFactor="1.00" vaporized=""/>
    <tripinfo id="car_w2n_72" depart="72.00" departLane="w2sep_1" departPos="3.60" departPosLat="0.00" departSpeed="13.90" departDelay="0.00" arrival="240.35" arrivalLane="c2n_1" arrivalPos="990.00" arrivalPosLat="0.00" arrivalSpeed="14.55" duration="168.35" routeLength="1996.47" waitingTime="22.60" waitingCount="1" stopTime="0.00" timeLoss="30.49" rerouteNo="1" devices="tripinfo_car_w2n_72 routing_car_w2n_72" vType="Car" speedFactor="1.05" vaporized=""/>
    <tripinfo id="car_e2s_109" depart="109.00" departLane="e2sep_1" departPos="3.60" departPosLat="0.00" departSpeed="13.90" departDelay="0.00" arrival="245.05" arrivalLane="c2s_1" arrivalPos="990.00" arrivalPosLat="0.00" arrivalSpeed="15.18" duration="136.05" routeLength="1996.47" waitingTime="0.00" waitingCount="0" stopTime="0.00" timeLoss="3.86" rerouteNo="1" devices="tripinfo_car_e2s_109 routing_car_e2s_109" vType="Car" speedFactor="1.09" vaporized=""/>
    <tripinfo id="car_w2n_90" depart="90.00" departLane="w2sep_1" departPos="3.60" departPosLat="0.00" departSpeed="13.90" departDelay="0.00" arrival="245.65" arrivalLane="c2n_1" arrivalPos="990.00" arrivalPosLat="0.00" arrivalSpeed="14.17" duration="155.65" routeLength="1996.47" waitingTime="4.50" waitingCount="1" stopTime="0.00" timeLoss="14.09" rerouteNo="1" devices="tripinfo_car_w2n_90 routing_car_w2n_90" vType="Car" speedFactor="1.02" vaporized=""/>
    <tripinfo id="bus_w2n_97" depart="97.00" departLane="w2sep_1" departPos="12.10" departPosLat="0.00" departSpeed="13.90" departDelay="0.00" arrival="250.75" arrivalLane="c2n_1" arrivalPos="990.00" arrivalPosLat="0.00" arrivalSpeed="13.87" duration="153.75" routeLength="1987.97" waitingTime="0.00" waitingCount="0" stopTime="0.00" timeLoss="10.02" rerouteNo="1" devices="tripinfo_bus_w2n_97 routing_bus_w2n_97" vType="Bus" speedFactor="1.00" vaporized=""/>
    <tripinfo id="car_s2n_80" depart="80.00" departLane="s2sep_1" departPos="3.60" departPosLat="0.00" departSpeed="13.90" departDelay="0.00" arrival="253.10" arrivalLane="c2n_1" arrivalPos="990.00" arrivalPosLat="0.00" arrivalSpeed="15.70" duration="173.10" routeLength="1997.01" waitingTime="26.10" waitingCount="1" stopTime="0.00" timeLoss="51.17" rerouteNo="1" devices="tripinfo_car_s2n_80 routing_car_s2n_80" vType="Car" speedFactor="1.18" vaporized=""/>
    <tripinfo id="car_n2w_66" depart="66.00" departLane="n2sep_1" departPos="3.60" departPosLat="0.00" departSpeed="13.90" departDelay="0.00" arrival="254.45" arrivalLane="c2w_1" arrivalPos="990.00" arrivalPosLat="0.00" arrivalSpeed="14.15" duration="188.45" routeLength="1986.69" waitingTime="40.25" waitingCount="1" stopTime="0.00" timeLoss="47.34" rerouteNo="1" devices="tripinfo_car_n2w_66 routing_car_n2w_66" vType="Car" speedFactor="1.02" vaporized=""/>
    <tripinfo id="car_s2e_78" depart="78.00" departLane="s2sep_1" departPos="3.60" departPosLat="0.00" departSpeed="13.90" departDelay="0.00" arrival="255.65" arrivalLane="c2e_1" arrivalPos="990.00" arrivalPosLat="0.00" arrivalSpeed="13.90" duration="177.65" routeLength="1986.69" waitingTime="26.95" waitingCount="1" stopTime="0.00" timeLoss="33.95" rerouteNo="1" devices="tripinfo_car_s2e_78 routing_car_s2e_78" vType="Car" speedFactor="1.00" vaporized=""/>
    <tripinfo id="car_n2s_71" depart="71.00" departLane="n2sep_1" departPos="3.60" departPosLat="0.00" departSpeed="13.90" departDelay="0.00" arrival="256.20" arrivalLane="c2s_1" arrivalPos="990.00" arrivalPosLat="0.00" arrivalSpeed="14.27" duration="185.20" routeLength="1997.01" waitingTime="36.05" waitingCount="1" stopTime="0.00" timeLoss="45.19" rerouteNo="1" devices="tripinfo_car_n2s_71 routing_car_n2s_71" vType="Car" speedFactor="1.03" vaporized=""/>
    <tripinfo id="car_s2e_101" depart="101.45" departLane="s2sep_1" departPos="3.60" departPosLat="0.00" departSpeed="13.90" departDelay="0.45" arrival="257.90" arrivalLane="c2e_1" arrivalPos="990.00" arrivalPosLat="0.00" arrivalSpeed="15.00" duration="156.45" routeLength="1986.69" waitingTime="5.00" waitingCount="1" stopTime="0.00" timeLoss="26.11" rerouteNo="1" devices="tripinfo_car_s2e_101 routing_car_s2e_101" vType="Car" speedFactor="1.10" vaporized=""/>
    <tripinfo id="car_s2w_82" depart="82.00" departLane="s2sep_1" departPos="3.60" departPosLat="0.00" departSpeed="13.90" departDelay="0.00" arrival="258.15" arrivalLane="c2w_1" arrivalPos="990.00" arrivalPosLat="0.00" arrivalSpeed="15.99" duration="176.15" routeLength="1996.47" waitingTime="30.00" waitingCount="2" stopTime="0.00" timeLoss="51.11" rerouteNo="1" devices="tripinfo_car_s2w_82 routing_car_s2w_82" vType="Car" speedFactor="1.15" vaporized=""/>
    <tripinfo id="car_n2s_73" depart="73.00" departLane="n2sep_1" departPos="3.60" departPosLat="0.00" departSpeed="13.90" departDelay="0.00" arrival="258.45" arrivalLane="c2s_1" arrivalPos="990.00" arrivalPosLat="0.00" arrivalSpeed="15.28" duration="185.45" routeLength="1997.01" waitingTime="35.15" waitingCount="1" stopTime="0.00" timeLoss="57.51" rerouteNo="1" devices="tripinfo_car_n2s_73 routing_car_n2s_73" vType="Car" speedFactor="1.12" vaporized=""/>
    <tripinfo id="car_n2s_78" depart="78.00" departLane="n2sep_1" departPos="3.60" departPosLat="0.00" departSpeed="13.90" departDelay="0.00" arrival="260.70" arrivalLane="c2s_1" arrivalPos="990.00" arrivalPosLat="0.00" arrivalSpeed="15.41" duration="182.70" routeLength="1997.01" waitingTime="34.25" waitingCount="1" stopTime="0.00" timeLoss="55.76" rerouteNo="1" devices="tripinfo_car_n2s_78 routing_car_n2s_78" vType="Car" speedFactor="1.13" vaporized=""/>
    <tripinfo id="car_s2e_103" depart="103.15" departLane="s2sep_1" departPos="3.60" departPosLat="0.00" departSpeed="13.90" departDelay="0.15" arrival="262.35" arrivalLane="c2e_1" arrivalPos="990.00" arrivalPosLat="0.00" arrivalSpeed="14.31" duration="159.20" routeLength="1986.69" waitingTime="3.20" waitingCount="1" stopTime="0.00" timeLoss="19.73" rerouteNo="1" devices="tripinfo_car_s2e_103 routing_car_s2e_103" vType="Car" speedFactor="1.03" vaporized=""/>
    <tripinfo id="car_n2e_103" depart="103.00" departLane="n2sep_1" departPos="3.60" departPosLat="0.00" departSpeed="13.90" departDelay="0.00" arrival="264.40" arrivalLane="c2e_1" arrivalPos="990.00" arrivalPosLat="0.00" arrivalSpeed="15.59" duration="161.40" routeLength="1996.47" waitingTime="21.50" waitingCount="2" stopTime="0.00" timeLoss="36.80" rerouteNo="1" devices="tripinfo_car_n2e_103 routing_car_n2e_103" vType="Car" speedFactor="1.16" vaporized=""/>
    <tripinfo id="car_n2s_111" depart="111.00" departLane="n2sep_1" departPos="3.60" departPosLat="0.00" departSpeed="13.90" departDelay="0.00" arrival="264.50" arrivalLane="c2s_1" arrivalPos="990.00" arrivalPosLat="0.00" arrivalSpeed="14.40" duration="153.50" routeLength="1997.01" waitingTime="0.00" waitingCount="0" stopTime="0.00" timeLoss="15.02" rerouteNo="1" devices="tripinfo_car_n2s_111 routing_car_n2s_111" vType="Car" speedFactor="1.04" vaporized=""/>
    <tripinfo id="car_n2w_130" depart="130.00" departLane="n2sep_1" departPos="3.60" departPosLat="0.00" departSpeed="13.90" departDelay="0.00" arrival="265.85" arrivalLane="c2w_1" arrivalPos="990.00" arrivalPosLat="0.00" arrivalSpeed="15.23" duration="135.85" routeLength="1986.69" waitingTime="0.00" waitingCount="0" stopTime="0.00" timeLoss="4.72" rerouteNo="1" devices="tripinfo_car_n2w_130 routing_car_n2w_130" vType="Car" speedFactor="1.10" vaporized=""/>
    <tripinfo id="bus_s2n_114" depart="114.00" departLane="s2sep_1" departPos="12.10" departPosLat="0.00" departSpeed="13.90" departDelay="0.00" arrival="266.35" arrivalLane="c2n_1" arrivalPos="990.00" arrivalPosLat="0.00" arrivalSpeed="13.90" duration="152.35" routeLength="1988.51" waitingTime="0.00" waitingCount="0" stopTime="0.00" timeLoss="9.27" rerouteNo="1" devices="tripinfo_bus_s2n_114 routing_bus_s2n_114" vType="Bus" speedFactor="1.00" vaporized=""/>
    <tripinfo id="car_s2w_83" depart="83.45" departLane="s2sep_1" departPos="3.60" departPosLat="0.00" departSpeed="13.90" departDelay="0.45" arrival="268.35" arrivalLane="c2w_1" arrivalPos="990.00" arrivalPosLat="0.00" arrivalSpeed="16.06" duration="184.90" routeLength="1996.47" waitingTime="30.95" waitingCount="3" stopTime="0.00" timeLoss="61.74" rerouteNo="1" devices="tripinfo_car_s2w_83 routing_car_s2w_83" vType="Car" speedFactor="1.17" vaporized=""/>
    <tripinfo id="car_s2n_115" depart="115.50" departLane="s2sep_1" departPos="3.60" departPosLat="0.00" departSpeed="13.90" departDelay="0.50" arrival="271.15" arrivalLane="c2n_1" arrivalPos="990.00" arrivalPosLat="0.00" arrivalSpeed="13.89" duration="155.65" routeLength="1997.01" waitingTime="0.00" waitingCount="0" stopTime="0.00" timeLoss="11.99" rerouteNo="1" devices="tripinfo_car_s2n_115 routing_car_s2n_115" vType="Car" speedFactor="1.00" vaporized=""/>
    <tripinfo id="car_n2e_109" depart="109.00" departLane="n2sep_1" departPos="3.60" departPosLat="0.00" departSpeed="13.90" departDelay="0.00" arrival="272.20" arrivalLane="c2e_1" arrivalPos="990.00" arrivalPosLat="0.00" arrivalSpeed="14.15" duration="163.20" routeLength="1996.47" waitingTime="9.60" waitingCount="1" stopTime="0.00" timeLoss="21.42" rerouteNo="1" devices="tripinfo_car_n2e_109 routing_car_n2e_109" vType="Car" speedFactor="1.02" vaporized=""/>
    <tripinfo id="car_n2e_114" depart="114.00" departLane="n2sep_1" departPos="3.60" departPosLat="0.00" departSpeed="13.90" departDelay="0.00" arrival="274.70" arrivalLane="c2e_1" arrivalPos="990.00" arrivalPosLat="0.00" arrivalSpeed="14.93" duration="160.70" routeLength="1996.47" waitingTime="6.55" waitingCount="1" stopTime="0.00" timeLoss="28.05" rerouteNo="1" devices="tripinfo_car_n2e_114 routing_car_n2e_114" vType="Car" speedFactor="1.09" vaporized=""/>
    <tripinfo id="bus_s2w_100" depart="100.00" departLane="s2sep_1" departPos="12.10" departPosLat="0.00" departSpeed="13.90" departDelay="0.00" arrival="280.15" arrivalLane="c2w_1" arrivalPos="990.00" arrivalPosLat="0.00" arrivalSpeed="13.90" duration="180.15" routeLength="1987.97" waitingTime="14.15" waitingCount="3" stopTime="0.00" timeLoss="36.42" rerouteNo="1" devices="tripinfo_bus_s2w_100 routing_bus_s2w_100" vType="Bus" speedFactor="1.00" vaporized=""/>
    <tripinfo id="car_s2w_111" depart="111.00" departLane="s2sep_1" departPos="3.60" departPosLat="0.00" departSpeed="13.90" departDelay="0.00" arrival="283.70" arrivalLane="c2w_1" arrivalPos="990.00" arrivalPosLat="0.00" arrivalSpeed="14.45" duration="172.70" routeLength="1996.47" waitingTime="4.00" waitingCount="2" stopTime="0.00" timeLoss="34.37" rerouteNo="1" devices="tripinfo_car_s2w_111 routing_car_s2w_111" vType="Car" speedFactor="1.04" vaporized=""/>
    <tripinfo id="car_n2e_155" depart="155.00" departLane="n2sep_1" departPos="3.60" departPosLat="0.00" departSpeed="13.90" departDelay="0.00" arrival="285.00" arrivalLane="c2e_1" arrivalPos="990.00" arrivalPosLat="0.00" arrivalSpeed="16.38" duration="130.00" routeLength="1996.47" waitingTime="0.00" waitingCount="0" stopTime="0.00" timeLoss="7.54" rerouteNo="1" devices="tripinfo_car_n2e_155 routing_car_n2e_155" vType="Car" speedFactor="1.18" vaporized=""/>
    <tripinfo id="car_s2w_141" depart="141.00" departLane="s2sep_1" departPos="3.60" departPosLat="0.00" departSpeed="13.90" departDelay="0.00" arrival="289.60" arrivalLane="c2w_1" arrivalPos="990.00" arrivalPosLat="0.00" arrivalSpeed="13.90" duration="148.60" routeLength="1996.47" waitingTime="0.00" waitingCount="0" stopTime="0.00" timeLoss="4.29" rerouteNo="1" devices="tripinfo_car_s2w_141 routing_car_s2w_141" vType="Car" speedFactor="1.00" vaporized=""/>
    <tripinfo id="car_e2w_115" depart="115.00" departLane="e2sep_1" departPos="3.60" departPosLat="0.00" departSpeed="13.90" departDelay="0.00" arrival="300.20" arrivalLane="c2w_1" arrivalPos="990.00" arrivalPosLat="0.00" arrivalSpeed="14.04" duration="185.20" routeLength="1997.01" waitingTime="35.50" waitingCount="1" stopTime="0.00" timeLoss="42.94" rerouteNo="1" devices="tripinfo_car_e2w_115 routing_car_e2w_115" vType="Car" speedFactor="1.01" vaporized=""/>
    <tripinfo id="car_w2s_116" depart="116.00" departLane="w2sep_1" departPos="3.60" departPosLat="0.00" departSpeed="13.90" departDelay="0.00" arrival="300.65" arrivalLane="c2s_1" arrivalPos="990.00" arrivalPosLat="0.00" arrivalSpeed="13.90" duration="184.65" routeLength="1986.69" waitingTime="34.00" waitingCount="1" stopTime="0.00" timeLoss="40.95" rerouteNo="1" devices="tripinfo_car_w2s_116 routing_car_w2s_116" vType="Car" speedFactor="1.00" vaporized=""/>
    <tripinfo id="car_e2n_163" depart="163.00" departLane="e2sep_1" departPos="3.60" departPosLat="0.00" departSpeed="13.90" departDelay="0.00" arrival="301.00" arrivalLane="c2n_1" arrivalPos="990.00" arrivalPosLat="0.00" arrivalSpeed="16.29" duration="138.00" routeLength="1986.69" waitingTime="2.10" waitingCount="1" stopTime="0.00" timeLoss="15.40" rerouteNo="1" devices="tripinfo_car_e2n_163 routing_car_e2n_163" vType="Car" speedFactor="1.17" vaporized=""/>
    <tripinfo id="car_w2e_119" depart="119.00" departLane="w2sep_1" departPos="3.60" departPosLat="0.00" departSpeed="13.90" departDelay="0.00" arrival="302.85" arrivalLane="c2e_1" arrivalPos="990.00" arrivalPosLat="0.00" arrivalSpeed="13.90" duration="183.85" routeLength="1997.01" waitingTime="30.60" waitingCount="1" stopTime="0.00" timeLoss="40.17" rerouteNo="1" devices="tripinfo_car_w2e_119 routing_car_w2e_119" vType="Car" speedFactor="1.00" vaporized=""/>
    <tripinfo id="car_e2w_116" depart="116.45" departLane="e2sep_1" departPos="3.60" departPosLat="0.00" departSpeed="13.90" departDelay="0.45" arrival="304.90" arrivalLane="c2w_1" arrivalPos="990.00" arrivalPosLat="0.00" arrivalSpeed="13.89" duration="188.45" routeLength="1997.01" waitingTime="32.15" waitingCount="1" stopTime="0.00" timeLoss="44.76" rerouteNo="1" devices="tripinfo_car_e2w_116 routing_car_e2w_116" vType="Car" speedFactor="1.00" vaporized=""/>
    <tripinfo id="car_w2e_123" depart="123.00" departLane="w2sep_1" departPos="3.60" departPosLat="0.00" departSpeed="13.90" departDelay="0.00" arrival="306.60" arrivalLane="c2e_1" arrivalPos="990.00" arrivalPosLat="0.00" arrivalSpeed="14.11" duration="183.60" routeLength="1997.01" waitingTime="28.45" waitingCount="1" stopTime="0.00" timeLoss="42.28" rerouteNo="1" devices="tripinfo_car_w2e_123 routing_car_w2e_123" vType="Car" speedFactor="1.02" vaporized=""/>
    <tripinfo id="car_e2w_120" depart="120.00" departLane="e2sep_1" departPos="3.60" departPosLat="0.00" departSpeed="13.90" departDelay="0.00" arrival="306.70" arrivalLane="c2w_1" arrivalPos="990.00" arrivalPosLat="0.00" arrivalSpeed="15.35" duration="186.70" routeLength="1997.01" waitingTime="31.40" waitingCount="1" stopTime="0.00" timeLoss="63.79" rerouteNo="1" devices="tripinfo_car_e2w_120 routing_car_e2w_120" vType="Car" speedFactor="1.17" vaporized=""/>
    <tripinfo id="car_w2s_136" depart="136.00" departLane="w2sep_1" departPos="3.60" departPosLat="0.00" departSpeed="13.90" departDelay="0.00" arrival="307.90" arrivalLane="c2s_1" arrivalPos="990.00" arrivalPosLat="0.00" arrivalSpeed="13.90" duration="171.90" routeLength="1986.69" waitingTime="16.65" waitingCount="1" stopTime="0.00" timeLoss="28.22" rerouteNo="1" devices="tripinfo_car_w2s_136 routing_car_w2s_136" vType="Car" speedFactor="1.00" vaporized=""/>
    <tripinfo id="car_w2e_151" depart="151.00" departLane="w2sep_1" departPos="3.60" departPosLat="0.00" departSpeed="13.90" departDelay="0.00" arrival="308.65" arrivalLane="c2e_1" arrivalPos="990.00" arrivalPosLat="0.00" arrivalSpeed="15.08" duration="157.65" routeLength="1997.01" waitingTime="10.50" waitingCount="1" stopTime="0.00" timeLoss="29.29" rerouteNo="1" devices="tripinfo_car_w2e_151 routing_car_w2e_151" vType="Car" speedFactor="1.12" vaporized=""/>
    <tripinfo id="car_e2w_147" depart="147.00" departLane="e2sep_1" departPos="3.60" departPosLat="0.00" departSpeed="13.90" departDelay="0.00" arrival="308.75" arrivalLane="c2w_1" arrivalPos="990.00" arrivalPosLat="0.00" arrivalSpeed="15.24" duration="161.75" routeLength="1997.01" waitingTime="13.45" waitingCount="1" stopTime="0.00" timeLoss="34.79" rerouteNo="1" devices="tripinfo_car_e2w_147 routing_car_e2w_147" vType="Car" speedFactor="1.13" vaporized=""/>
    <tripinfo id="car_w2s_156" depart="156.00" departLane="w2sep_1" departPos="3.60" departPosLat="0.00" departSpeed="13.90" departDelay="0.00" arrival="309.80" arrivalLane="c2s_1" arrivalPos="990.00" arrivalPosLat="0.00" arrivalSpeed="15.32" duration="153.80" routeLength="1986.69" waitingTime="8.00" waitingCount="1" stopTime="0.00" timeLoss="29.36" rerouteNo="1" devices="tripinfo_car_w2s_156 routing_car_w2s_156" vType="Car" speedFactor="1.15" vaporized=""/>
    <tripinfo id="car_e2s_142" depart="142.00" departLane="e2sep_1" departPos="3.60" departPosLat="0.00" departSpeed="13.90" departDelay="0.00" arrival="311.85" arrivalLane="c2s_1" arrivalPos="990.00" arrivalPosLat="0.00" arrivalSpeed="15.38" duration="169.85" routeLength="1996.47" waitingTime="24.30" waitingCount="2" stopTime="0.00" timeLoss="43.50" rerouteNo="1" devices="tripinfo_car_e2s_142 routing_car_e2s_142" vType="Car" speedFactor="1.14" vaporized=""/>
    <tripinfo id="car_e2w_151" depart="151.00" departLane="e2sep_1" departPos="3.60" departPosLat="0.00" departSpeed="13.90" departDelay="0.00" arrival="312.00" arrivalLane="c2w_1" arrivalPos="990.00" arrivalPosLat="0.00" arrivalSpeed="14.08" duration="161.00" routeLength="1997.01" waitingTime="4.30" waitingCount="1" stopTime="0.00" timeLoss="19.55" rerouteNo="1" devices="tripinfo_car_e2w_151 routing_car_e2w_151" vType="Car" speedFactor="1.02" vaporized=""/>
    <tripinfo id="car_e2w_179" depart="179.00" departLane="e2sep_1" departPos="3.60" departPosLat="0.00" departSpeed="13.90" departDelay="0.00" arrival="313.95" arrivalLane="c2w_1" arrivalPos="990.00" arrivalPosLat="0.00" arrivalSpeed="15.66" duration="134.95" routeLength="1997.01" waitingTime="0.00" waitingCount="0" stopTime="0.00" timeLoss="13.13" rerouteNo="1" devices="tripinfo_car_e2w_179 routing_car_e2w_179" vType="Car" speedFactor="1.18" vaporized=""/>
    <tripinfo id="car_w2n_131" depart="131.00" departLane="w2sep_1" departPos="3.60" departPosLat="0.00" departSpeed="13.90" departDelay="0.00" arrival="314.35" arrivalLane="c2n_1" arrivalPos="990.00" arrivalPosLat="0.00" arrivalSpeed="13.94" duration="183.35" routeLength="1996.47" waitingTime="28.05" waitingCount="2" stopTime="0.00" timeLoss="39.45" rerouteNo="1" devices="tripinfo_car_w2n_131 routing_car_w2n_131" vType="Car" speedFactor="1.00" vaporized=""/>
    <tripinfo id="car_e2s_168" depart="168.00" departLane="e2sep_1" departPos="3.60" departPosLat="0.00" departSpeed="13.90" departDelay="0.00" arrival="315.60" arrivalLane="c2s_1" arrivalPos="990.00" arrivalPosLat="0.00" arrivalSpeed="14.43" duration="147.60" routeLength="1996.47" waitingTime="0.00" waitingCount="0" stopTime="0.00" timeLoss="8.83" rerouteNo="1" devices="tripinfo_car_e2s_168 routing_car_e2s_168" vType="Car" speedFactor="1.04" vaporized=""/>
    <tripinfo id="car_e2n_172" depart="172.00" departLane="e2sep_1" departPos="3.60" departPosLat="0.00" departSpeed="13.90" departDelay="0.00" arrival="317.90" arrivalLane="c2n_1" arrivalPos="990.00" arrivalPosLat="0.00" arrivalSpeed="14.64" duration="145.90" routeLength="1986.69" waitingTime="0.00" waitingCount="0" stopTime="0.00" timeLoss="9.81" rerouteNo="1" devices="tripinfo_car_e2n_172 routing_car_e2n_172" vType="Car" speedFactor="1.06" vaporized=""/>
    <tripinfo id="car_e2s_169" depart="169.40" departLane="e2sep_1" departPos="3.60" departPosLat="0.00" departSpeed="13.90" departDelay="0.40" arrival="319.55" arrivalLane="c2s_1" arrivalPos="990.00" arrivalPosLat="0.00" arrivalSpeed="14.20" duration="150.15" routeLength="1996.47" waitingTime="0.00" waitingCount="0" stopTime="0.00" timeLoss="9.08" rerouteNo="1" devices="tripinfo_car_e2s_169 routing_car_e2s_169" vType="Car" speedFactor="1.02" vaporized=""/>
</tripinfos>
