<?xml version="1.0" encoding="UTF-8"?>

<!-- generated on 2021-05-18 05:03:00 by Eclipse SUMO sumo Version 1.9.1
<configuration xmlns:xsi="http://www.w3.org/2001/XMLSchema-instance" xsi:noNamespaceSchemaLocation="http://sumo.dlr.de/xsd/sumoConfiguration.xsd">

    <input>
        <net-file value="sumofiles/junction.net.xml"/>
        <route-files value="sumofiles/junction_preemption_28.rou.xml"/>
        <additional-files value="sumofiles/junction.det.xml"/>
    </input>

    <output>
        <tripinfo-output value="sumofiles/output/tripinfo_preemption_28.xml"/>
    </output>

    <time>
        <begin value="0"/>
        <end value="10000"/>
        <step-length value="1.0"/>
    </time>

    <processing>
        <lateral-resolution value="0.5"/>
    </processing>

    <report>
        <no-warnings value="true"/>
        <error-log value="sumofiles/output/errorlog_preemption_28.log"/>
        <no-step-log value="true"/>
    </report>

    <traci_server>
        <remote-port value="53687"/>
    </traci_server>

    <gui_only>
        <gui-settings-file value="sumofiles/junction-gui.settings.xml"/>
        <tracker-interval value="1"/>
    </gui_only>

</configuration>
-->

<tripinfos xmlns:xsi="http://www.w3.org/2001/XMLSchema-instance" xsi:noNamespaceSchemaLocation="http://sumo.dlr.de/xsd/tripinfo_file.xsd">
    <tripinfo id="car_e2w_0" depart="0.00" departLane="e2sep_1" departPos="3.60" departPosLat="0.00" departSpeed="13.90" departDelay="0.00" arrival="136.00" arrivalLane="c2w_1" arrivalPos="990.00" arrivalPosLat="0.00" arrivalSpeed="14.73" duration="136.00" routeLength="1997.01" waitingTime="0.00" waitingCount="0" stopTime="0.00" timeLoss="0.13" rerouteNo="1" devices="tripinfo_car_e2w_0 routing_car_e2w_0" vType="Car" speedFactor="1.06" vaporized=""/>
    <tripinfo id="car_e2n_1" depart="2.00" departLane="e2sep_1" departPos="3.60" departPosLat="0.00" departSpeed="13.90" departDelay="1.00" arrival="145.00" arrivalLane="c2n_1" arrivalPos="990.00" arrivalPosLat="0.00" arrivalSpeed="14.73" duration="143.00" routeLength="1986.69" waitingTime="0.00" waitingCount="0" stopTime="0.00" timeLoss="7.42" rerouteNo="1" devices="tripinfo_car_e2n_1 routing_car_e2n_1" vType="Car" speedFactor="1.06" vaporized=""/>
    <tripinfo id="car_e2w_5" depart="5.00" departLane="e2sep_1" departPos="3.60" departPosLat="0.00" departSpeed="13.90" departDelay="0.00" arrival="146.00" arrivalLane="c2w_1" arrivalPos="990.00" arrivalPosLat="0.00" arrivalSpeed="15.05" duration="141.00" routeLength="1997.01" waitingTime="0.00" waitingCount="0" stopTime="0.00" timeLoss="7.82" rerouteNo="1" devices="tripinfo_car_e2w_5 routing_car_e2w_5" vType="Car" speedFactor="1.08" vaporized=""/>
    <tripinfo id="car_n2s_15" depart="15.00" departLane="n2sep_1" departPos="3.60" departPosLat="0.00" departSpeed="13.90" departDelay="0.00" arrival="162.00" arrivalLane="c2s_1" arrivalPos="990.00" arrivalPosLat="0.00" arrivalSpeed="14.32" duration="147.00" routeLength="1997.01" waitingTime="0.00" waitingCount="0" stopTime="0.00" timeLoss="7.54" rerouteNo="1" devices="tripinfo_car_n2s_15 routing_car_n2s_15" vType="Car" speedFactor="1.03" vaporized=""/>
    <tripinfo id="car_n2w_16" depart="17.00" departLane="n2sep_1" departPos="3.60" departPosLat="0.00" departSpeed="13.90" departDelay="1.00" arrival="162.00" arrivalLane="c2w_1" arrivalPos="990.00" arrivalPosLat="0.00" arrivalSpeed="15.16" duration="145.00" routeLength="1986.69" waitingTime="0.00" waitingCount="0" stopTime="0.00" timeLoss="12.37" rerouteNo="1" devices="tripinfo_car_n2w_16 routing_car_n2w_16" vType="Car" speedFactor="1.09" vaporized=""/>
    <tripinfo id="car_n2e_3" depart="3.00" departLane="n2sep_1" departPos="3.60" departPosLat="0.00" departSpeed="13.90" departDelay="0.00" arrival="166.00" arrivalLane="c2e_1" arrivalPos="990.00" arrivalPosLat="0.00" arrivalSpeed="14.04" duration="163.00" routeLength="1996.47" waitingTime="8.00" waitingCount="1" stopTime="0.00" timeLoss="19.58" rerouteNo="1" devices="tripinfo_car_n2e_3 routing_car_n2e_3" vType="Car" speedFactor="1.01" vaporized=""/>
    <tripinfo id="car_n2s_24" depart="24.00" departLane="n2sep_1" departPos="3.60" departPosLat="0.00" departSpeed="13.90" departDelay="0.00" arrival="167.00" arrivalLane="c2s_1" arrivalPos="990.00" arrivalPosLat="0.00" arrivalSpeed="14.55" duration="143.00" routeLength="1997.01" waitingTime="0.00" waitingCount="0" stopTime="0.00" timeLoss="5.35" rerouteNo="1" devices="tripinfo_car_n2s_24 routing_car_n2s_24" vType="Car" speedFactor="1.05" vaporized=""/>
    <tripinfo id="bus_s2w_27" depart="27.00" departLane="s2sep_1" departPos="12.10" departPosLat="0.00" departSpeed="13.90" departDelay="0.00" arrival="179.00" arrivalLane="c2w_1" arrivalPos="990.00" arrivalPosLat="0.00" arrivalSpeed="13.90" duration="152.00" routeLength="1987.97" waitingTime="0.00" waitingCount="0" stopTime="0.00" timeLoss="7.56" rerouteNo="1" devices="tripinfo_bus_s2w_27 routing_bus_s2w_27" vType="Bus" speedFactor="1.00" vaporized=""/>
    <tripinfo id="bus_s2n_39" depart="39.00" departLane="s2sep_1" departPos="12.10" departPosLat="0.00" departSpeed="13.90" departDelay="0.00" arrival="183.00" arrivalLane="c2n_1" arrivalPos="990.00" arrivalPosLat="0.00" arrivalSpeed="13.90" duration="144.00" routeLength="1988.51" waitingTime="0.00" waitingCount="0" stopTime="0.00" timeLoss="0.18" rerouteNo="1" devices="tripinfo_bus_s2n_39 routing_bus_s2n_39" vType="Bus" speedFactor="1.00" vaporized=""/>
    <tripinfo id="car_n2e_36" depart="36.00" departLane="n2sep_1" departPos="3.60" departPosLat="0.00" departSpeed="13.90" departDelay="0.00" arrival="186.00" arrivalLane="c2e_1" arrivalPos="990.00" arrivalPosLat="0.00" arrivalSpeed="13.90" duration="150.00" routeLength="1996.47" waitingTime="0.00" waitingCount="0" stopTime="0.00" timeLoss="4.81" rerouteNo="1" devices="tripinfo_car_n2e_36 routing_car_n2e_36" vType="Car" speedFactor="1.00" vaporized=""/>
    <tripinfo id="car_n2e_45" depart="45.00" departLane="n2sep_1" departPos="3.60" departPosLat="0.00" departSpeed="13.90" departDelay="0.00" arrival="197.00" arrivalLane="c2e_1" arrivalPos="990.00" arrivalPosLat="0.00" arrivalSpeed="13.90" duration="152.00" routeLength="1996.47" waitingTime="0.00" waitingCount="0" stopTime="0.00" timeLoss="7.15" rerouteNo="1" devices="tripinfo_car_n2e_45 routing_car_n2e_45" vType="Car" speedFactor="1.00" vaporized=""/>
    <tripinfo id="car_n2e_48" depart="48.00" departLane="n2sep_1" departPos="3.60" departPosLat="0.00" departSpeed="13.90" departDelay="0.00" arrival="199.00" arrivalLane="c2e_1" arrivalPos="990.00" arrivalPosLat="0.00" arrivalSpeed="15.45" duration="151.00" routeLength="1996.47" waitingTime="0.00" waitingCount="0" stopTime="0.00" timeLoss="25.84" rerouteNo="1" devices="tripinfo_car_n2e_48 routing_car_n2e_48" vType="Car" speedFactor="1.16" vaporized=""/>
    <tripinfo id="car_n2e_60" depart="60.00" departLane="n2sep_1" departPos="3.60" departPosLat="0.00" departSpeed="13.90" departDelay="0.00" arrival="201.00" arrivalLane="c2e_1" arrivalPos="990.00" arrivalPosLat="0.00" arrivalSpeed="15.20" duration="141.00" routeLength="1996.47" waitingTime="0.00" waitingCount="0" stopTime="0.00" timeLoss="12.01" rerouteNo="1" devices="tripinfo_car_n2e_60 routing_car_n2e_60" vType="Car" speedFactor="1.12" vaporized=""/>
    <tripinfo id="car_e2w_27" depart="27.00" departLane="e2sep_1" departPos="3.60" departPosLat="0.00" departSpeed="13.90" departDelay="0.00" arrival="202.00" arrivalLane="c2w_1" arrivalPos="990.00" arrivalPosLat="0.00" arrivalSpeed="15.61" duration="175.00" routeLength="1997.01" waitingTime="36.00" waitingCount="1" stopTime="0.00" timeLoss="46.73" rerouteNo="1" devices="tripinfo_car_e2w_27 routing_car_e2w_27" vType="Car" speedFactor="1.12" vaporized=""/>
    <tripinfo id="car_w2s_6" depart="6.00" departLane="w2sep_1" departPos="3.60" departPosLat="0.00" departSpeed="13.90" departDelay="0.00" arrival="207.00" arrivalLane="c2s_1" arrivalPos="990.00" arrivalPosLat="0.00" arrivalSpeed="14.32" duration="201.00" routeLength="1986.69" waitingTime="53.00" waitingCount="1" stopTime="0.00" timeLoss="61.68" rerouteNo="1" devices="tripinfo_car_w2s_6 routing_car_w2s_6" vType="Car" speedFactor="1.03" vaporized=""/>
    <tripinfo id="car_w2e_10" depart="10.00" departLane="w2sep_1" departPos="3.60" departPosLat="0.00" departSpeed="13.90" departDelay="0.00" arrival="212.00" arrivalLane="c2e_1" arrivalPos="990.00" arrivalPosLat="0.00" arrivalSpeed="13.90" duration="202.00" routeLength="1997.01" waitingTime="47.00" waitingCount="1" stopTime="0.00" timeLoss="57.82" rerouteNo="1" devices="tripinfo_car_w2e_10 routing_car_w2e_10" vType="Car" speedFactor="1.00" vaporized=""/>
    <tripinfo id="car_e2n_52" depart="52.00" departLane="e2sep_1" departPos="3.60" departPosLat="0.00" departSpeed="13.90" departDelay="0.00" arrival="212.00" arrivalLane="c2n_1" arrivalPos="990.00" arrivalPosLat="0.00" arrivalSpeed="14.04" duration="160.00" routeLength="1986.69" waitingTime="6.00" waitingCount="1" stopTime="0.00" timeLoss="16.90" rerouteNo="1" devices="tripinfo_car_e2n_52 routing_car_e2n_52" vType="Car" speedFactor="1.01" vaporized=""/>
    <tripinfo id="car_e2w_54" depart="56.00" departLane="e2sep_1" departPos="3.60" departPosLat="0.00" departSpeed="13.90" departDelay="2.00" arrival="213.00" arrivalLane="c2w_1" arrivalPos="990.00" arrivalPosLat="0.00" arrivalSpeed="14.27" duration="157.00" routeLength="1997.01" waitingTime="3.00" waitingCount="1" stopTime="0.00" timeLoss="16.26" rerouteNo="1" devices="tripinfo_car_e2w_54 routing_car_e2w_54" vType="Car" speedFactor="1.03" vaporized=""/>
    <tripinfo id="car_w2s_12" depart="16.00" departLane="w2sep_1" departPos="3.60" departPosLat="0.00" departSpeed="13.90" departDelay="4.00" arrival="214.00" arrivalLane="c2s_1" arrivalPos="990.00" arrivalPosLat="0.00" arrivalSpeed="15.05" duration="198.00" routeLength="1986.69" waitingTime="43.00" waitingCount="1" stopTime="0.00" timeLoss="65.15" rerouteNo="1" devices="tripinfo_car_w2s_12 routing_car_w2s_12" vType="Car" speedFactor="1.08" vaporized=""/>
    <tripinfo id="car_w2e_11" depart="12.00" departLane="w2sep_1" departPos="3.60" departPosLat="0.00" departSpeed="13.90" departDelay="1.00" arrival="215.00" arrivalLane="c2e_1" arrivalPos="990.00" arrivalPosLat="0.00" arrivalSpeed="14.47" duration="203.00" routeLength="1997.01" waitingTime="46.00" waitingCount="1" stopTime="0.00" timeLoss="65.06" rerouteNo="1" devices="tripinfo_car_w2e_11 routing_car_w2e_11" vType="Car" speedFactor="1.05" vaporized=""/>
    <tripinfo id="car_e2w_70" depart="70.00" departLane="e2sep_1" departPos="3.60" departPosLat="0.00" departSpeed="13.90" departDelay="0.00" arrival="215.00" arrivalLane="c2w_1" arrivalPos="990.00" arrivalPosLat="0.00" arrivalSpeed="15.81" duration="145.00" routeLength="1997.01" waitingTime="0.00" waitingCount="0" stopTime="0.00" timeLoss="21.85" rerouteNo="1" devices="tripinfo_car_e2w_70 routing_car_e2w_70" vType="Car" speedFactor="1.17" vaporized=""/>
    <tripinfo id="car_e2n_56" depart="58.00" departLane="e2sep_1" departPos="3.60" departPosLat="0.00" departSpeed="13.90" departDelay="2.00" arrival="216.00" arrivalLane="c2n_1" arrivalPos="990.00" arrivalPosLat="0.00" arrivalSpeed="14.54" duration="158.00" routeLength="1986.69" waitingTime="2.00" waitingCount="1" stopTime="0.00" timeLoss="19.87" rerouteNo="1" devices="tripinfo_car_e2n_56 routing_car_e2n_56" vType="Car" speedFactor="1.05" vaporized=""/>
    <tripinfo id="car_e2n_66" depart="66.00" departLane="e2sep_1" departPos="3.60" departPosLat="0.00" departSpeed="13.90" departDelay="0.00" arrival="217.00" arrivalLane="c2n_1" arrivalPos="990.00" arrivalPosLat="0.00" arrivalSpeed="15.24" duration="151.00" routeLength="1986.69" waitingTime="1.00" waitingCount="1" stopTime="0.00" timeLoss="29.23" rerouteNo="1" devices="tripinfo_car_e2n_66 routing_car_e2n_66" vType="Car" speedFactor="1.18" vaporized=""/>
    <tripinfo id="car_w2e_12" depart="14.00" departLane="w2sep_1" departPos="3.60" departPosLat="0.00" departSpeed="13.90" departDelay="2.00" arrival="219.00" arrivalLane="c2e_1" arrivalPos="990.00" arrivalPosLat="0.00" arrivalSpeed="14.03" duration="205.00" routeLength="1997.01" waitingTime="44.00" waitingCount="1" stopTime="0.00" timeLoss="61.98" rerouteNo="1" devices="tripinfo_car_w2e_12 routing_car_w2e_12" vType="Car" speedFactor="1.01" vaporized=""/>
    <tripinfo id="car_w2s_19" depart="19.00" departLane="w2sep_1" departPos="3.60" departPosLat="0.00" departSpeed="13.90" departDelay="0.00" arrival="221.00" arrivalLane="c2s_1" arrivalPos="990.00" arrivalPosLat="0.00" arrivalSpeed="14.27" duration="202.00" routeLength="1986.69" waitingTime="42.00" waitingCount="1" stopTime="0.00" timeLoss="61.95" rerouteNo="1" devices="tripinfo_car_w2s_19 routing_car_w2s_19" vType="Car" speedFactor="1.03" vaporized=""/>
    <tripinfo id="car_w2s_39" depart="39.00" departLane="w2sep_1" departPos="3.60" departPosLat="0.00" departSpeed="13.90" departDelay="0.00" arrival="225.00" arrivalLane="c2s_1" arrivalPos="990.00" arrivalPosLat="0.00" arrivalSpeed="14.52" duration="186.00" routeLength="1986.69" waitingTime="28.00" waitingCount="1" stopTime="0.00" timeLoss="48.12" rerouteNo="1" devices="tripinfo_car_w2s_39 routing_car_w2s_39" vType="Car" speedFactor="1.05" vaporized=""/>
    <tripinfo id="car_e2n_75" depart="75.00" departLane="e2sep_1" departPos="3.60" departPosLat="0.00" departSpeed="13.90" departDelay="0.00" arrival="226.00" arrivalLane="c2n_1" arrivalPos="990.00" arrivalPosLat="0.00" arrivalSpeed="13.90" duration="151.00" routeLength="1986.69" waitingTime="0.00" waitingCount="0" stopTime="0.00" timeLoss="6.56" rerouteNo="1" devices="tripinfo_car_e2n_75 routing_car_e2n_75" vType="Car" speedFactor="1.00" vaporized=""/>
    <tripinfo id="car_e2s_52" depart="54.00" departLane="e2sep_1" departPos="3.60" departPosLat="0.00" departSpeed="13.90" departDelay="2.00" arrival="227.00" arrivalLane="c2s_1" arrivalPos="990.00" arrivalPosLat="0.00" arrivalSpeed="14.94" duration="173.00" routeLength="1996.47" waitingTime="21.00" waitingCount="2" stopTime="0.00" timeLoss="40.69" rerouteNo="1" devices="tripinfo_car_e2s_52 routing_car_e2s_52" vType="Car" speedFactor="1.09" vaporized=""/>
    <tripinfo id="car_w2e_73" depart="73.00" departLane="w2sep_1" departPos="3.60" departPosLat="0.00" departSpeed="13.90" departDelay="0.00" arrival="228.00" arrivalLane="c2e_1" arrivalPos="990.00" arrivalPosLat="0.00" arrivalSpeed="13.90" duration="155.00" routeLength="1997.01" waitingTime="0.00" waitingCount="0" stopTime="0.00" timeLoss="10.52" rerouteNo="1" devices="tripinfo_car_w2e_73 routing_car_w2e_73" vType="Car" speedFactor="1.00" vaporized=""/>
    <tripinfo id="car_w2n_40" depart="41.00" departLane="w2sep_1" departPos="3.60" departPosLat="0.00" departSpeed="13.90" departDelay="1.00" arrival="230.00" arrivalLane="c2n_1" arrivalPos="990.00" arrivalPosLat="0.00" arrivalSpeed="13.89" duration="189.00" routeLength="1996.47" waitingTime="25.00" waitingCount="2" stopTime="0.00" timeLoss="44.26" rerouteNo="1" devices="tripinfo_car_w2n_40 routing_car_w2n_40" vType="Car" speedFactor="1.00" vaporized=""/>
    <tripinfo id="car_w2n_41" depart="43.00" departLane="w2sep_1" departPos="3.60" departPosLat="0.00" departSpeed="13.90" departDelay="2.00" arrival="233.00" arrivalLane="c2n_1" arrivalPos="990.00" arrivalPosLat="0.00" arrivalSpeed="13.86" duration="190.00" routeLength="1996.47" waitingTime="22.00" waitingCount="2" stopTime="0.00" timeLoss="45.64" rerouteNo="1" devices="tripinfo_car_w2n_41 routing_car_w2n_41" vType="Car" speedFactor="1.00" vaporized=""/>
    <tripinfo id="car_e2s_60" depart="60.00" departLane="e2sep_1" departPos="3.60" departPosLat="0.00" departSpeed="13.90" departDelay="0.00" arrival="233.00" arrivalLane="c2s_1" arrivalPos="990.00" arrivalPosLat="0.00" arrivalSpeed="13.90" duration="173.00" routeLength="1996.47" waitingTime="14.00" waitingCount="1" stopTime="0.00" timeLoss="28.78" rerouteNo="1" devices="tripinfo_car_e2s_60 routing_car_e2s_60" vType="Car" speedFactor="1.00" vaporized=""/>
    <tripinfo id="car_w2n_62" depart="62.00" departLane="w2sep_1" departPos="3.60" departPosLat="0.00" departSpeed="13.90" departDelay="0.00" arrival="237.00" arrivalLane="c2n_1" arrivalPos="990.00" arrivalPosLat="0.00" arrivalSpeed="13.88" duration="175.00" routeLength="1996.47" waitingTime="10.00" waitingCount="1" stopTime="0.00" timeLoss="29.81" rerouteNo="1" devices="tripinfo_car_w2n_62 routing_car_w2n_62" vType="Car" speedFactor="1.00" vaporized=""/>
    <tripinfo id="car_e2s_63" depart="63.00" departLane="e2sep_1" departPos="3.60" departPosLat="0.00" departSpeed="13.90" departDelay="0.00" arrival="237.00" arrivalLane="c2s_1" arrivalPos="990.00" arrivalPosLat="0.00" arrivalSpeed="13.89" duration="174.00" routeLength="1996.47" waitingTime="13.00" waitingCount="1" stopTime="0.00" timeLoss="29.64" rerouteNo="1" devices="tripinfo_car_e2s_63 routing_car_e2s_63" vType="Car" speedFactor="1.00" vaporized=""/>
    <tripinfo id="car_w2n_78" depart="78.00" departLane="w2sep_1" departPos="3.60" departPosLat="0.00" departSpeed="13.90" departDelay="0.00" arrival="238.00" arrivalLane="c2n_1" arrivalPos="990.00" arrivalPosLat="0.00" arrivalSpeed="14.80" duration="160.00" routeLength="1996.47" waitingTime="9.00" waitingCount="1" stopTime="0.00" timeLoss="37.54" rerouteNo="1" devices="tripinfo_car_w2n_78 routing_car_w2n_78" vType="Car" speedFactor="1.18" vaporized=""/>
    <tripinfo id="car_w2n_86" depart="86.00" departLane="w2sep_1" departPos="3.60" departPosLat="0.00" departSpeed="13.90" departDelay="0.00" arrival="240.00" arrivalLane="c2n_1" arrivalPos="990.00" arrivalPosLat="0.00" arrivalSpeed="15.30" duration="154.00" routeLength="1996.47" waitingTime="2.00" waitingCount="1" stopTime="0.00" timeLoss="29.12" rerouteNo="1" devices="tripinfo_car_w2n_86 routing_car_w2n_86" vType="Car" speedFactor="1.16" vaporized=""/>
    <tripinfo id="car_e2s_92" depart="92.00" departLane="e2sep_1" departPos="3.60" departPosLat="0.00" departSpeed="13.90" departDelay="0.00" arrival="240.00" arrivalLane="c2s_1" arrivalPos="990.00" arrivalPosLat="0.00" arrivalSpeed="14.99" duration="148.00" routeLength="1996.47" waitingTime="0.00" waitingCount="0" stopTime="0.00" timeLoss="14.85" rerouteNo="1" devices="tripinfo_car_e2s_92 routing_car_e2s_92" vType="Car" speedFactor="1.09" vaporized=""/>
    <tripinfo id="car_w2n_95" depart="95.00" departLane="w2sep_1" departPos="3.60" departPosLat="0.00" departSpeed="13.90" departDelay="0.00" arrival="243.00" arrivalLane="c2n_1" arrivalPos="990.00" arrivalPosLat="0.00" arrivalSpeed="14.34" duration="148.00" routeLength="1996.47" waitingTime="0.00" waitingCount="0" stopTime="0.00" timeLoss="8.41" rerouteNo="1" devices="tripinfo_car_w2n_95 routing_car_w2n_95" vType="Car" speedFactor="1.04" vaporized=""/>
    <tripinfo id="car_s2n_62" depart="62.00" departLane="s2sep_1" departPos="3.60" departPosLat="0.00" departSpeed="13.90" departDelay="0.00" arrival="249.00" arrivalLane="c2n_1" arrivalPos="990.00" arrivalPosLat="0.00" arrivalSpeed="15.73" duration="187.00" routeLength="1997.01" waitingTime="48.00" waitingCount="1" stopTime="0.00" timeLoss="59.65" rerouteNo="1" devices="tripinfo_car_s2n_62 routing_car_s2n_62" vType="Car" speedFactor="1.13" vaporized=""/>
    <tripinfo id="car_s2w_81" depart="81.00" departLane="s2sep_1" departPos="3.60" departPosLat="0.00" departSpeed="13.90" departDelay="0.00" arrival="250.00" arrivalLane="c2w_1" arrivalPos="990.00" arrivalPosLat="0.00" arrivalSpeed="15.32" duration="169.00" routeLength="1996.47" waitingTime="26.00" waitingCount="1" stopTime="0.00" timeLoss="37.76" rerouteNo="1" devices="tripinfo_car_s2w_81 routing_car_s2w_81" vType="Car" speedFactor="1.10" vaporized=""/>
    <tripinfo id="car_s2e_50" depart="50.00" departLane="s2sep_1" departPos="3.60" departPosLat="0.00" departSpeed="13.90" departDelay="0.00" arrival="253.00" arrivalLane="c2e_1" arrivalPos="990.00" arrivalPosLat="0.00" arrivalSpeed="14.15" duration="203.00" routeLength="1986.69" waitingTime="53.00" waitingCount="1" stopTime="0.00" timeLoss="61.84" rerouteNo="1" devices="tripinfo_car_s2e_50 routing_car_s2e_50" vType="Car" speedFactor="1.02" vaporized=""/>
    <tripinfo id="car_s2e_66" depart="66.00" departLane="s2sep_1" departPos="3.60" departPosLat="0.00" departSpeed="13.90" departDelay="0.00" arrival="255.00" arrivalLane="c2e_1" arrivalPos="990.00" arrivalPosLat="0.00" arrivalSpeed="15.53" duration="189.00" routeLength="1986.69" waitingTime="46.00" waitingCount="1" stopTime="0.00" timeLoss="64.45" rerouteNo="1" devices="tripinfo_car_s2e_66 routing_car_s2e_66" vType="Car" speedFactor="1.15" vaporized=""/>
    <tripinfo id="car_n2s_115" depart="115.00" departLane="n2sep_1" departPos="3.60" departPosLat="0.00" departSpeed="13.90" departDelay="0.00" arrival="260.00" arrivalLane="c2s_1" arrivalPos="990.00" arrivalPosLat="0.00" arrivalSpeed="13.90" duration="145.00" routeLength="1997.01" waitingTime="0.00" waitingCount="0" stopTime="0.00" timeLoss="0.52" rerouteNo="1" devices="tripinfo_car_n2s_115 routing_car_n2s_115" vType="Car" speedFactor="1.00" vaporized=""/>
    <tripinfo id="car_s2e_68" depart="68.00" departLane="s2sep_1" departPos="3.60" departPosLat="0.00" departSpeed="13.90" departDelay="0.00" arrival="263.00" arrivalLane="c2e_1" arrivalPos="990.00" arrivalPosLat="0.00" arrivalSpeed="13.97" duration="195.00" routeLength="1986.69" waitingTime="37.00" waitingCount="1" stopTime="0.00" timeLoss="52.16" rerouteNo="1" devices="tripinfo_car_s2e_68 routing_car_s2e_68" vType="Car" speedFactor="1.01" vaporized=""/>
    <tripinfo id="car_s2e_73" depart="73.00" departLane="s2sep_1" departPos="3.60" departPosLat="0.00" departSpeed="13.90" departDelay="0.00" arrival="267.00" arrivalLane="c2e_1" arrivalPos="990.00" arrivalPosLat="0.00" arrivalSpeed="14.16" duration="194.00" routeLength="1986.69" waitingTime="34.00" waitingCount="1" stopTime="0.00" timeLoss="52.74" rerouteNo="1" devices="tripinfo_car_s2e_73 routing_car_s2e_73" vType="Car" speedFactor="1.02" vaporized=""/>
    <tripinfo id="car_s2n_101" depart="101.00" departLane="s2sep_1" departPos="3.60" departPosLat="0.00" departSpeed="13.90" departDelay="0.00" arrival="269.00" arrivalLane="c2n_1" arrivalPos="990.00" arrivalPosLat="0.00" arrivalSpeed="15.12" duration="168.00" routeLength="1997.01" waitingTime="15.00" waitingCount="1" stopTime="0.00" timeLoss="35.30" rerouteNo="1" devices="tripinfo_car_s2n_101 routing_car_s2n_101" vType="Car" speedFactor="1.09" vaporized=""/>
    <tripinfo id="car_s2e_89" depart="89.00" departLane="s2sep_1" departPos="3.60" departPosLat="0.00" departSpeed="13.90" departDelay="0.00" arrival="270.00" arrivalLane="c2e_1" arrivalPos="990.00" arrivalPosLat="0.00" arrivalSpeed="14.27" duration="181.00" routeLength="1986.69" waitingTime="21.00" waitingCount="1" stopTime="0.00" timeLoss="41.42" rerouteNo="1" devices="tripinfo_car_s2e_89 routing_car_s2e_89" vType="Car" speedFactor="1.03" vaporized=""/>
    <tripinfo id="car_n2s_127" depart="127.00" departLane="n2sep_1" departPos="3.60" departPosLat="0.00" departSpeed="13.90" departDelay="0.00" arrival="271.00" arrivalLane="c2s_1" arrivalPos="990.00" arrivalPosLat="0.00" arrivalSpeed="13.94" duration="144.00" routeLength="1997.01" waitingTime="0.00" waitingCount="0" stopTime="0.00" timeLoss="0.39" rerouteNo="1" devices="tripinfo_car_n2s_127 routing_car_n2s_127" vType="Car" speedFactor="1.00" vaporized=""/>
    <tripinfo id="car_s2e_90" depart="91.00" departLane="s2sep_1" departPos="3.60" departPosLat="0.00" departSpeed="13.90" departDelay="1.00" arrival="274.00" arrivalLane="c2e_1" arrivalPos="990.00" arrivalPosLat="0.00" arrivalSpeed="14.13" duration="183.00" routeLength="1986.69" waitingTime="18.00" waitingCount="1" stopTime="0.00" timeLoss="41.18" rerouteNo="1" devices="tripinfo_car_s2e_90 routing_car_s2e_90" vType="Car" speedFactor="1.02" vaporized=""/>
    <tripinfo id="car_s2n_110" depart="110.00" departLane="s2sep_1" departPos="3.60" departPosLat="0.00" departSpeed="13.90" departDelay="0.00" arrival="277.00" arrivalLane="c2n_1" arrivalPos="990.00" arrivalPosLat="0.00" arrivalSpeed="13.90" duration="167.00" routeLength="1997.01" waitingTime="2.00" waitingCount="1" stopTime="0.00" timeLoss="23.19" rerouteNo="1" devices="tripinfo_car_s2n_110 routing_car_s2n_110" vType="Car" speedFactor="1.00" vaporized=""/>
    <tripinfo id="car_s2n_118" depart="118.00" departLane="s2sep_1" departPos="3.60" departPosLat="0.00" departSpeed="13.90" departDelay="0.00" arrival="279.00" arrivalLane="c2n_1" arrivalPos="990.00" arrivalPosLat="0.00" arrivalSpeed="15.54" duration="161.00" routeLength="1997.01" waitingTime="2.00" waitingCount="1" stopTime="0.00" timeLoss="37.78" rerouteNo="1" devices="tripinfo_car_s2n_118 routing_car_s2n_118" vType="Car" speedFactor="1.17" vaporized=""/>
    <tripinfo id="car_n2w_129" depart="129.00" departLane="n2sep_1" departPos="3.60" departPosLat="0.00" departSpeed="13.90" departDelay="0.00" arrival="280.00" arrivalLane="c2w_1" arrivalPos="990.00" arrivalPosLat="0.00" arrivalSpeed="13.90" duration="151.00" routeLength="1986.69" waitingTime="0.00" waitingCount="0" stopTime="0.00" timeLoss="7.26" rerouteNo="1" devices="tripinfo_car_n2w_129 routing_car_n2w_129" vType="Car" speedFactor="1.00" vaporized=""/>
    <tripinfo id="car_s2e_118" depart="120.00" departLane="s2sep_1" departPos="3.60" departPosLat="0.00" departSpeed="13.90" departDelay="2.00" arrival="281.00" arrivalLane="c2e_1" arrivalPos="990.00" arrivalPosLat="0.00" arrivalSpeed="14.13" duration="161.00" routeLength="1986.69" waitingTime="0.00" waitingCount="0" stopTime="0.00" timeLoss="18.79" rerouteNo="1" devices="tripinfo_car_s2e_118 routing_car_s2e_118" vType="Car" speedFactor="1.02" vaporized=""/>
    <tripinfo id="car_s2n_123" depart="123.00" departLane="s2sep_1" departPos="3.60" departPosLat="0.00" departSpeed="13.90" departDelay="0.00" arrival="282.00" arrivalLane="c2n_1" arrivalPos="990.00" arrivalPosLat="0.00" arrivalSpeed="15.09" duration="159.00" routeLength="1997.01" waitingTime="0.00" waitingCount="0" stopTime="0.00" timeLoss="26.97" rerouteNo="1" devices="tripinfo_car_s2n_123 routing_car_s2n_123" vType="Car" speedFactor="1.10" vaporized=""/>
    <tripinfo id="car_n2s_142" depart="142.00" departLane="n2sep_1" departPos="3.60" departPosLat="0.00" departSpeed="13.90" departDelay="0.00" arrival="284.00" arrivalLane="c2s_1" arrivalPos="990.00" arrivalPosLat="0.00" arrivalSpeed="14.23" duration="142.00" routeLength="1997.01" waitingTime="0.00" waitingCount="0" stopTime="0.00" timeLoss="0.65" rerouteNo="1" devices="tripinfo_car_n2s_142 routing_car_n2s_142" vType="Car" speedFactor="1.02" vaporized=""/>
    <tripinfo id="car_n2e_101" depart="101.00" departLane="n2sep_1" departPos="3.60" departPosLat="0.00" departSpeed="13.90" departDelay="0.00" arrival="285.00" arrivalLane="c2e_1" arrivalPos="990.00" arrivalPosLat="0.00" arrivalSpeed="14.49" duration="184.00" routeLength="1996.47" waitingTime="27.00" waitingCount="2" stopTime="0.00" timeLoss="44.82" rerouteNo="1" devices="tripinfo_car_n2e_101 routing_car_n2e_101" vType="Car" speedFactor="1.04" vaporized=""/>
    <tripinfo id="car_e2w_104" depart="104.00" departLane="e2sep_1" departPos="3.60" departPosLat="0.00" departSpeed="13.90" departDelay="0.00" arrival="299.00" arrivalLane="c2w_1" arrivalPos="990.00" arrivalPosLat="0.00" arrivalSpeed="14.04" duration="195.00" routeLength="1997.01" waitingTime="43.00" waitingCount="1" stopTime="0.00" timeLoss="52.36" rerouteNo="1" devices="tripinfo_car_e2w_104 routing_car_e2w_104" vType="Car" speedFactor="1.01" vaporized=""/>
    <tripinfo id="car_w2s_108" depart="108.00" departLane="w2sep_1" departPos="3.60" departPosLat="0.00" departSpeed="13.90" departDelay="0.00" arrival="299.00" arrivalLane="c2s_1" arrivalPos="990.00" arrivalPosLat="0.00" arrivalSpeed="13.90" duration="191.00" routeLength="1986.69" waitingTime="38.00" waitingCount="1" stopTime="0.00" timeLoss="47.58" rerouteNo="1" devices="tripinfo_car_w2s_108 routing_car_w2s_108" vType="Car" speedFactor="1.00" vaporized=""/>
    <tripinfo id="car_e2w_135" depart="135.00" departLane="e2sep_1" departPos="3.60" departPosLat="0.00" departSpeed="13.90" departDelay="0.00" arrival="301.00" arrivalLane="c2w_1" arrivalPos="990.00" arrivalPosLat="0.00" arrivalSpeed="15.37" duration="166.00" routeLength="1997.01" waitingTime="14.00" waitingCount="1" stopTime="0.00" timeLoss="39.88" rerouteNo="1" devices="tripinfo_car_e2w_135 routing_car_e2w_135" vType="Car" speedFactor="1.14" vaporized=""/>
    <tripinfo id="car_e2n_133" depart="133.00" departLane="e2sep_1" departPos="3.60" departPosLat="0.00" departSpeed="13.90" departDelay="0.00" arrival="302.00" arrivalLane="c2n_1" arrivalPos="990.00" arrivalPosLat="0.00" arrivalSpeed="13.90" duration="169.00" routeLength="1986.69" waitingTime="14.00" waitingCount="1" stopTime="0.00" timeLoss="25.18" rerouteNo="1" devices="tripinfo_car_e2n_133 routing_car_e2n_133" vType="Car" speedFactor="1.00" vaporized=""/>
    <tripinfo id="car_e2s_110" depart="110.00" departLane="e2sep_1" departPos="3.60" departPosLat="0.00" departSpeed="13.90" departDelay="0.00" arrival="304.00" arrivalLane="c2s_1" arrivalPos="990.00" arrivalPosLat="0.00" arrivalSpeed="13.90" duration="194.00" routeLength="1996.47" waitingTime="36.00" waitingCount="1" stopTime="0.00" timeLoss="49.13" rerouteNo="1" devices="tripinfo_car_e2s_110 routing_car_e2s_110" vType="Car" speedFactor="1.00" vaporized=""/>
    <tripinfo id="car_e2n_165" depart="165.00" departLane="e2sep_1" departPos="3.60" departPosLat="0.00" departSpeed="13.90" departDelay="0.00" arrival="304.00" arrivalLane="c2n_1" arrivalPos="990.00" arrivalPosLat="0.00" arrivalSpeed="15.58" duration="139.00" routeLength="1986.69" waitingTime="0.00" waitingCount="0" stopTime="0.00" timeLoss="14.55" rerouteNo="1" devices="tripinfo_car_e2n_165 routing_car_e2n_165" vType="Car" speedFactor="1.15" vaporized=""/>
    <tripinfo id="car_e2w_156" depart="156.00" departLane="e2sep_1" departPos="3.60" departPosLat="0.00" departSpeed="13.90" departDelay="0.00" arrival="306.00" arrivalLane="c2w_1" arrivalPos="990.00" arrivalPosLat="0.00" arrivalSpeed="14.12" duration="150.00" routeLength="1997.01" waitingTime="0.00" waitingCount="0" stopTime="0.00" timeLoss="8.51" rerouteNo="1" devices="tripinfo_car_e2w_156 routing_car_e2w_156" vType="Car" speedFactor="1.02" vaporized=""/>
    <tripinfo id="car_e2s_157" depart="160.00" departLane="e2sep_1" departPos="3.60" departPosLat="0.00" departSpeed="13.90" departDelay="3.00" arrival="306.00" arrivalLane="c2s_1" arrivalPos="990.00" arrivalPosLat="0.00" arrivalSpeed="15.58" duration="146.00" routeLength="1996.47" waitingTime="0.00" waitingCount="0" stopTime="0.00" timeLoss="22.78" rerouteNo="1" devices="tripinfo_car_e2s_157 routing_car_e2s_157" vType="Car" speedFactor="1.18" vaporized=""/>
    <tripinfo id="car_w2n_153" depart="153.00" departLane="w2sep_1" departPos="3.60" departPosLat="0.00" departSpeed="13.90" departDelay="0.00" arrival="309.00" arrivalLane="c2n_1" arrivalPos="990.00" arrivalPosLat="0.00" arrivalSpeed="15.04" duration="156.00" routeLength="1996.47" waitingTime="7.00" waitingCount="1" stopTime="0.00" timeLoss="22.77" rerouteNo="1" devices="tripinfo_car_w2n_153 routing_car_w2n_153" vType="Car" speedFactor="1.08" vaporized=""/>
    <tripinfo id="car_w2e_166" depart="166.00" departLane="w2sep_1" departPos="3.60" departPosLat="0.00" departSpeed="13.90" departDelay="0.00" arrival="310.00" arrivalLane="c2e_1" arrivalPos="990.00" arrivalPosLat="0.00" arrivalSpeed="13.97" duration="144.00" routeLength="1997.01" waitingTime="0.00" waitingCount="0" stopTime="0.00" timeLoss="0.34" rerouteNo="1" devices="tripinfo_car_w2e_166 routing_car_w2e_166" vType="Car" speedFactor="1.01" vaporized=""/>
    <tripinfo id="car_e2w_157" depart="158.00" departLane="e2sep_1" departPos="3.60" departPosLat="0.00" departSpeed="13.90" departDelay="1.00" arrival="311.00" arrivalLane="c2w_1" arrivalPos="990.00" arrivalPosLat="0.00" arrivalSpeed="13.90" duration="153.00" routeLength="1997.01" waitingTime="0.00" waitingCount="0" stopTime="0.00" timeLoss="8.66" rerouteNo="1" devices="tripinfo_car_e2w_157 routing_car_e2w_157" vType="Car" speedFactor="1.00" vaporized=""/>
    <tripinfo id="car_w2n_156" depart="156.00" departLane="w2sep_1" departPos="3.60" departPosLat="0.00" departSpeed="13.90" departDelay="0.00" arrival="312.00" arrivalLane="c2n_1" arrivalPos="990.00" arrivalPosLat="0.00" arrivalSpeed="15.47" duration="156.00" routeLength="1996.47" waitingTime="7.00" waitingCount="1" stopTime="0.00" timeLoss="26.93" rerouteNo="1" devices="tripinfo_car_w2n_156 routing_car_w2n_156" vType="Car" speedFactor="1.12" vaporized=""/>
    <tripinfo id="car_w2n_169" depart="169.00" departLane="w2sep_1" departPos="3.60" departPosLat="0.00" departSpeed="13.90" departDelay="0.00" arrival="315.00" arrivalLane="c2n_1" arrivalPos="990.00" arrivalPosLat="0.00" arrivalSpeed="16.11" duration="146.00" routeLength="1996.47" waitingTime="2.00" waitingCount="1" stopTime="0.00" timeLoss="22.01" rerouteNo="1" devices="tripinfo_car_w2n_169 routing_car_w2n_169" vType="Car" speedFactor="1.17" vaporized=""/>
    <tripinfo id="car_e2w_174" depart="174.00" departLane="e2sep_1" departPos="3.60" departPosLat="0.00" departSpeed="13.90" departDelay="0.00" arrival="319.00" arrivalLane="c2w_1" arrivalPos="990.00" arrivalPosLat="0.00" arrivalSpeed="13.90" duration="145.00" routeLength="1997.01" waitingTime="0.00" waitingCount="0" stopTime="0.00" timeLoss="1.04" rerouteNo="1" devices="tripinfo_car_e2w_174 routing_car_e2w_174" vType="Car" speedFactor="1.00" vaporized=""/>
    <tripinfo id="car_e2s_190" depart="190.00" departLane="e2sep_1" departPos="3.60" departPosLat="0.00" departSpeed="13.90" departDelay="0.00" arrival="319.00" arrivalLane="c2s_1" arrivalPos="990.00" arrivalPosLat="0.00" arrivalSpeed="16.40" duration="129.00" routeLength="1996.47" waitingTime="0.00" waitingCount="0" stopTime="0.00" timeLoss="6.15" rerouteNo="1" devices="tripinfo_car_e2s_190 routing_car_e2s_190" vType="Car" speedFactor="1.18" vaporized=""/>
    <tripinfo id="car_n2s_146" depart="146.00" departLane="n2sep_1" departPos="3.60" departPosLat="0.00" departSpeed="13.90" departDelay="0.00" arrival="337.00" arrivalLane="c2s_1" arrivalPos="990.00" arrivalPosLat="0.00" arrivalSpeed="15.73" duration="191.00" routeLength="1997.01" waitingTime="49.00" waitingCount="1" stopTime="0.00" timeLoss="63.27" rerouteNo="1" devices="tripinfo_car_n2s_146 routing_car_n2s_146" vType="Car" speedFactor="1.13" vaporized=""/>
    <tripinfo id="car_s2e_173" depart="173.00" departLane="s2sep_1" departPos="3.60" departPosLat="0.00" departSpeed="13.90" departDelay="0.00" arrival="343.00" arrivalLane="c2e_1" arrivalPos="990.00" arrivalPosLat="0.00" arrivalSpeed="14.22" duration="170.00" routeLength="1986.69" waitingTime="19.00" waitingCount="1" stopTime="0.00" timeLoss="29.17" rerouteNo="1" devices="tripinfo_car_s2e_173 routing_car_s2e_173" vType="Car" speedFactor="1.02" vaporized=""/>
    <tripinfo id="car_n2s_169" depart="169.00" departLane="n2sep_1" departPos="3.60" departPosLat="0.00" departSpeed="13.90" departDelay="0.00" arrival="345.00" arrivalLane="c2s_1" arrivalPos="990.00" arrivalPosLat="0.00" arrivalSpeed="14.46" duration="176.00" routeLength="1997.01" waitingTime="26.00" waitingCount="1" stopTime="0.00" timeLoss="37.38" rerouteNo="1" devices="tripinfo_car_n2s_169 routing_car_n2s_169" vType="Car" speedFactor="1.04" vaporized=""/>
    <tripinfo id="car_s2n_185" depart="185.00" departLane="s2sep_1" departPos="3.60" departPosLat="0.00" departSpeed="13.90" departDelay="0.00" arrival="345.00" arrivalLane="c2n_1" arrivalPos="990.00" arrivalPosLat="0.00" arrivalSpeed="14.17" duration="160.00" routeLength="1997.01" waitingTime="8.00" waitingCount="1" stopTime="0.00" timeLoss="19.07" rerouteNo="1" devices="tripinfo_car_s2n_185 routing_car_s2n_185" vType="Car" speedFactor="1.02" vaporized=""/>
    <tripinfo id="car_s2n_195" depart="195.00" departLane="s2sep_1" departPos="3.60" departPosLat="0.00" departSpeed="13.90" departDelay="0.00" arrival="348.00" arrivalLane="c2n_1" arrivalPos="990.00" arrivalPosLat="0.00" arrivalSpeed="15.18" duration="153.00" routeLength="1997.01" waitingTime="5.00" waitingCount="1" stopTime="0.00" timeLoss="22.02" rerouteNo="1" devices="tripinfo_car_s2n_195 routing_car_s2n_195" vType="Car" speedFactor="1.10" vaporized=""/>
    <tripinfo id="car_n2s_221" depart="221.00" departLane="n2sep_1" departPos="3.60" departPosLat="0.00" departSpeed="13.90" departDelay="0.00" arrival="350.00" arrivalLane="c2s_1" arrivalPos="990.00" arrivalPosLat="0.00" arrivalSpeed="15.95" duration="129.00" routeLength="1997.01" waitingTime="0.00" waitingCount="0" stopTime="0.00" timeLoss="3.76" rerouteNo="1" devices="tripinfo_car_n2s_221 routing_car_n2s_221" vType="Car" speedFactor="1.15" vaporized=""/>
    <tripinfo id="car_n2e_170" depart="171.00" departLane="n2sep_1" departPos="3.60" departPosLat="0.00" departSpeed="13.90" departDelay="1.00" arrival="351.00" arrivalLane="c2e_1" arrivalPos="990.00" arrivalPosLat="0.00" arrivalSpeed="14.21" duration="180.00" routeLength="1996.47" waitingTime="22.00" waitingCount="2" stopTime="0.00" timeLoss="38.23" rerouteNo="1" devices="tripinfo_car_n2e_170 routing_car_n2e_170" vType="Car" speedFactor="1.02" vaporized=""/>
    <tripinfo id="car_n2e_188" depart="188.00" departLane="n2sep_1" departPos="3.60" departPosLat="0.00" departSpeed="13.90" departDelay="0.00" arrival="354.00" arrivalLane="c2e_1" arrivalPos="990.00" arrivalPosLat="0.00" arrivalSpeed="14.61" duration="166.00" routeLength="1996.47" waitingTime="8.00" waitingCount="1" stopTime="0.00" timeLoss="28.93" rerouteNo="1" devices="tripinfo_car_n2e_188 routing_car_n2e_188" vType="Car" speedFactor="1.06" vaporized=""/>
    <tripinfo id="car_n2e_201" depart="201.00" departLane="n2sep_1" departPos="3.60" departPosLat="0.00" departSpeed="13.90" departDelay="0.00" arrival="357.00" arrivalLane="c2e_1" arrivalPos="990.00" arrivalPosLat="0.00" arrivalSpeed="15.00" duration="156.00" routeLength="1996.47" waitingTime="0.00" waitingCount="0" stopTime="0.00" timeLoss="22.31" rerouteNo="1" devices="tripinfo_car_n2e_201 routing_car_n2e_201" vType="Car" speedFactor="1.09" vaporized=""/>
    <tripinfo id="car_n2w_208" depart="208.00" departLane="n2sep_1" departPos="3.60" departPosLat="0.00" departSpeed="13.90" departDelay="0.00" arrival="357.00" arrivalLane="c2w_1" arrivalPos="990.00" arrivalPosLat="0.00" arrivalSpeed="13.90" duration="149.00" routeLength="1986.69" waitingTime="0.00" waitingCount="0" stopTime="0.00" timeLoss="5.26" rerouteNo="1" devices="tripinfo_car_n2w_208 routing_car_n2w_208" vType="Car" speedFactor="1.00" vaporized=""/>
    <tripinfo id="car_s2w_206" depart="206.00" departLane="s2sep_1" departPos="3.60" departPosLat="0.00" departSpeed="13.90" departDelay="0.00" arrival="361.00" arrivalLane="c2w_1" arrivalPos="990.00" arrivalPosLat="0.00" arrivalSpeed="14.36" duration="155.00" routeLength="1996.47" waitingTime="4.00" waitingCount="1" stopTime="0.00" timeLoss="15.27" rerouteNo="1" devices="tripinfo_car_s2w_206 routing_car_s2w_206" vType="Car" speedFactor="1.03" vaporized=""/>
    <tripinfo id="car_s2w_221" depart="221.00" departLane="s2sep_1" departPos="3.60" departPosLat="0.00" departSpeed="13.90" departDelay="0.00" arrival="371.00" arrivalLane="c2w_1" arrivalPos="990.00" arrivalPosLat="0.00" arrivalSpeed="13.92" duration="150.00" routeLength="1996.47" waitingTime="0.00" waitingCount="0" stopTime="0.00" timeLoss="5.18" rerouteNo="1" devices="tripinfo_car_s2w_221 routing_car_s2w_221" vType="Car" speedFactor="1.00" vaporized=""/>
    <tripinfo id="car_n2s_231" depart="231.00" departLane="n2sep_1" departPos="3.60" departPosLat="0.00" departSpeed="13.90" departDelay="0.00" arrival="373.00" arrivalLane="c2s_1" arrivalPos="990.00" arrivalPosLat="0.00" arrivalSpeed="14.13" duration="142.00" routeLength="1997.01" waitingTime="0.00" waitingCount="0" stopTime="0.00" timeLoss="0.36" rerouteNo="1" devices="tripinfo_car_n2s_231 routing_car_n2s_231" vType="Car" speedFactor="1.02" vaporized=""/>
    <tripinfo id="car_n2e_227" depart="227.00" departLane="n2sep_1" departPos="3.60" departPosLat="0.00" departSpeed="13.90" departDelay="0.00" arrival="376.00" arrivalLane="c2e_1" arrivalPos="990.00" arrivalPosLat="0.00" arrivalSpeed="14.00" duration="149.00" routeLength="1996.47" waitingTime="0.00" waitingCount="0" stopTime="0.00" timeLoss="5.24" rerouteNo="1" devices="tripinfo_car_n2e_227 routing_car_n2e_227" vType="Car" speedFactor="1.01" vaporized=""/>
    <tripinfo id="car_e2w_195" depart="195.00" departLane="e2sep_1" departPos="3.60" departPosLat="0.00" departSpeed="13.90" departDelay="0.00" arrival="388.00" arrivalLane="c2w_1" arrivalPos="990.00" arrivalPosLat="0.00" arrivalSpeed="14.35" duration="193.00" routeLength="1997.01" waitingTime="43.00" waitingCount="1" stopTime="0.00" timeLoss="52.96" rerouteNo="1" devices="tripinfo_car_e2w_195 routing_car_e2w_195" vType="Car" speedFactor="1.03" vaporized=""/>
    <tripinfo id="car_w2e_189" depart="189.00" departLane="w2sep_1" departPos="3.60" departPosLat="0.00" departSpeed="13.90" departDelay="0.00" arrival="390.00" arrivalLane="c2e_1" arrivalPos="990.00" arrivalPosLat="0.00" arrivalSpeed="13.90" duration="201.00" routeLength="1997.01" waitingTime="47.00" waitingCount="1" stopTime="0.00" timeLoss="56.67" rerouteNo="1" devices="tripinfo_car_w2e_189 routing_car_w2e_189" vType="Car" speedFactor="1.00" vaporized=""/>
    <tripinfo id="car_w2s_228" depart="228.00" departLane="w2sep_1" departPos="3.60" departPosLat="0.00" departSpeed="13.90" departDelay="0.00" arrival="391.00" arrivalLane="c2s_1" arrivalPos="990.00" arrivalPosLat="0.00" arrivalSpeed="14.21" duration="163.00" routeLength="1986.69" waitingTime="11.00" waitingCount="1" stopTime="0.00" timeLoss="21.78" rerouteNo="1" devices="tripinfo_car_w2s_228 routing_car_w2s_228" vType="Car" speedFactor="1.02" vaporized=""/>
    <tripinfo id="car_e2n_221" depart="221.00" departLane="e2sep_1" departPos="3.60" departPosLat="0.00" departSpeed="13.90" departDelay="0.00" arrival="392.00" arrivalLane="c2n_1" arrivalPos="990.00" arrivalPosLat="0.00" arrivalSpeed="13.90" duration="171.00" routeLength="1986.69" waitingTime="16.00" waitingCount="1" stopTime="0.00" timeLoss="27.14" rerouteNo="1" devices="tripinfo_car_e2n_221 routing_car_e2n_221" vType="Car" speedFactor="1.00" vaporized=""/>
    <tripinfo id="car_w2e_236" depart="237.00" departLane="w2sep_1" departPos="3.60" departPosLat="0.00" departSpeed="13.90" departDelay="1.00" arrival="393.00" arrivalLane="c2e_1" arrivalPos="990.00" arrivalPosLat="0.00" arrivalSpeed="14.45" duration="156.00" routeLength="1997.01" waitingTime="4.00" waitingCount="1" stopTime="0.00" timeLoss="18.10" rerouteNo="1" devices="tripinfo_car_w2e_236 routing_car_w2e_236" vType="Car" speedFactor="1.04" vaporized=""/>
    <tripinfo id="car_e2n_223" depart="223.00" departLane="e2sep_1" departPos="3.60" departPosLat="0.00" departSpeed="13.90" departDelay="0.00" arrival="395.00" arrivalLane="c2n_1" arrivalPos="990.00" arrivalPosLat="0.00" arrivalSpeed="14.43" duration="172.00" routeLength="1986.69" waitingTime="15.00" waitingCount="1" stopTime="0.00" timeLoss="34.22" rerouteNo="1" devices="tripinfo_car_e2n_223 routing_car_e2n_223" vType="Car" speedFactor="1.04" vaporized=""/>
    <tripinfo id="car_e2s_199" depart="199.00" departLane="e2sep_1" departPos="3.60" departPosLat="0.00" departSpeed="13.90" departDelay="0.00" arrival="397.00" arrivalLane="c2s_1" arrivalPos="990.00" arrivalPosLat="0.00" arrivalSpeed="14.00" duration="198.00" routeLength="1996.47" waitingTime="38.00" waitingCount="2" stopTime="0.00" timeLoss="54.50" rerouteNo="1" devices="tripinfo_car_e2s_199 routing_car_e2s_199" vType="Car" speedFactor="1.01" vaporized=""/>
    <tripinfo id="car_e2s_219" depart="219.00" departLane="e2sep_1" departPos="3.60" departPosLat="0.00" departSpeed="13.90" departDelay="0.00" arrival="401.00" arrivalLane="c2s_1" arrivalPos="990.00" arrivalPosLat="0.00" arrivalSpeed="14.30" duration="182.00" routeLength="1996.47" waitingTime="20.00" waitingCount="1" stopTime="0.00" timeLoss="41.08" rerouteNo="1" devices="tripinfo_car_e2s_219 routing_car_e2s_219" vType="Car" speedFactor="1.03" vaporized=""/>
    <tripinfo id="bus_e2n_227" depart="227.00" departLane="e2sep_1" departPos="12.10" departPosLat="0.00" departSpeed="13.90" departDelay="0.00" arrival="401.00" arrivalLane="c2n_1" arrivalPos="990.00" arrivalPosLat="0.00" arrivalSpeed="13.88" duration="174.00" routeLength="1978.19" waitingTime="13.00" waitingCount="1" stopTime="0.00" timeLoss="30.50" rerouteNo="1" devices="tripinfo_bus_e2n_227 routing_bus_e2n_227" vType="Bus" speedFactor="1.00" vaporized=""/>
    <tripinfo id="car_e2w_241" depart="241.00" departLane="e2sep_1" departPos="3.60" departPosLat="0.00" departSpeed="13.90" departDelay="0.00" arrival="401.00" arrivalLane="c2w_1" arrivalPos="990.00" arrivalPosLat="0.00" arrivalSpeed="14.04" duration="160.00" routeLength="1997.01" waitingTime="2.00" waitingCount="1" stopTime="0.00" timeLoss="17.12" rerouteNo="1" devices="tripinfo_car_e2w_241 routing_car_e2w_241" vType="Car" speedFactor="1.01" vaporized=""/>
    <tripinfo id="car_e2s_238" depart="238.00" departLane="e2sep_1" departPos="3.60" departPosLat="0.00" departSpeed="13.90" departDelay="0.00" arrival="403.00" arrivalLane="c2s_1" arrivalPos="990.00" arrivalPosLat="0.00" arrivalSpeed="14.50" duration="165.00" routeLength="1996.47" waitingTime="4.00" waitingCount="1" stopTime="0.00" timeLoss="28.18" rerouteNo="1" devices="tripinfo_car_e2s_238 routing_car_e2s_238" vType="Car" speedFactor="1.06" vaporized=""/>
    <tripinfo id="car_e2w_243" depart="243.00" departLane="e2sep_1" departPos="3.60" departPosLat="0.00" departSpeed="13.90" departDelay="0.00" arrival="403.00" arrivalLane="c2w_1" arrivalPos="990.00" arrivalPosLat="0.00" arrivalSpeed="14.85" duration="160.00" routeLength="1997.01" waitingTime="1.00" waitingCount="1" stopTime="0.00" timeLoss="27.80" rerouteNo="1" devices="tripinfo_car_e2w_243 routing_car_e2w_243" vType="Car" speedFactor="1.09" vaporized=""/>
    <tripinfo id="car_e2n_251" depart="251.00" departLane="e2sep_1" departPos="3.60" departPosLat="0.00" departSpeed="13.90" departDelay="0.00" arrival="405.00" arrivalLane="c2n_1" arrivalPos="990.00" arrivalPosLat="0.00" arrivalSpeed="14.77" duration="154.00" routeLength="1986.69" waitingTime="0.00" waitingCount="0" stopTime="0.00" timeLoss="18.19" rerouteNo="1" devices="tripinfo_car_e2n_251 routing_car_e2n_251" vType="Car" speedFactor="1.07" vaporized=""/>
    <tripinfo id="bus_e2w_255" depart="255.00" departLane="e2sep_1" departPos="12.10" departPosLat="0.00" departSpeed="13.90" departDelay="0.00" arrival="412.00" arrivalLane="c2w_1" arrivalPos="990.00" arrivalPosLat="0.00" arrivalSpeed="13.90" duration="157.00" routeLength="1988.51" waitingTime="0.00" waitingCount="0" stopTime="0.00" timeLoss="13.43" rerouteNo="1" devices="tripinfo_bus_e2w_255 routing_bus_e2w_255" vType="Bus" speedFactor="1.00" vaporized=""/>
    <tripinfo id="car_w2n_213" depart="213.00" departLane="w2sep_1" departPos="3.60" departPosLat="0.00" departSpeed="13.90" departDelay="0.00" arrival="415.00" arrivalLane="c2n_1" arrivalPos="990.00" arrivalPosLat="0.00" arrivalSpeed="14.13" duration="202.00" routeLength="1996.47" waitingTime="44.00" waitingCount="2" stopTime="0.00" timeLoss="59.71" rerouteNo="1" devices="tripinfo_car_w2n_213 routing_car_w2n_213" vType="Car" speedFactor="1.02" vaporized=""/>
    <tripinfo id="car_e2w_258" depart="258.00" departLane="e2sep_1" departPos="3.60" departPosLat="0.00" departSpeed="13.90" departDelay="0.00" arrival="417.00" arrivalLane="c2w_1" arrivalPos="990.00" arrivalPosLat="0.00" arrivalSpeed="13.89" duration="159.00" routeLength="1997.01" waitingTime="0.00" waitingCount="0" stopTime="0.00" timeLoss="14.55" rerouteNo="1" devices="tripinfo_car_e2w_258 routing_car_e2w_258" vType="Car" speedFactor="1.00" vaporized=""/>
    <tripinfo id="car_w2s_268" depart="268.00" departLane="w2sep_1" departPos="3.60" departPosLat="0.00" departSpeed="13.90" departDelay="0.00" arrival="417.00" arrivalLane="c2s_1" arrivalPos="990.00" arrivalPosLat="0.00" arrivalSpeed="13.90" duration="149.00" routeLength="1986.69" waitingTime="0.00" waitingCount="0" stopTime="0.00" timeLoss="5.09" rerouteNo="1" devices="tripinfo_car_w2s_268 routing_car_w2s_268" vType="Car" speedFactor="1.00" vaporized=""/>
    <tripinfo id="car_w2n_235" depart="235.00" departLane="w2sep_1" departPos="3.60" departPosLat="0.00" departSpeed="13.90" departDelay="0.00" arrival="418.00" arrivalLane="c2n_1" arrivalPos="990.00" arrivalPosLat="0.00" arrivalSpeed="15.05" duration="183.00" routeLength="1996.47" waitingTime="27.00" waitingCount="2" stopTime="0.00" timeLoss="49.99" rerouteNo="1" devices="tripinfo_car_w2n_235 routing_car_w2n_235" vType="Car" speedFactor="1.09" vaporized=""/>
    <tripinfo id="car_e2s_294" depart="294.00" departLane="e2sep_1" departPos="3.60" departPosLat="0.00" departSpeed="13.90" departDelay="0.00" arrival="421.00" arrivalLane="c2s_1" arrivalPos="990.00" arrivalPosLat="0.00" arrivalSpeed="16.32" duration="127.00" routeLength="1996.47" waitingTime="0.00" waitingCount="0" stopTime="0.00" timeLoss="3.81" rerouteNo="1" devices="tripinfo_car_e2s_294 routing_car_e2s_294" vType="Car" speedFactor="1.18" vaporized=""/>
    <tripinfo id="car_s2e_235" depart="235.00" departLane="s2sep_1" departPos="3.60" departPosLat="0.00" departSpeed="13.90" departDelay="0.00" arrival="432.00" arrivalLane="c2e_1" arrivalPos="990.00" arrivalPosLat="0.00" arrivalSpeed="14.42" duration="197.00" routeLength="1986.69" waitingTime="48.00" waitingCount="1" stopTime="0.00" timeLoss="58.19" rerouteNo="1" devices="tripinfo_car_s2e_235 routing_car_s2e_235" vType="Car" speedFactor="1.04" vaporized=""/>
    <tripinfo id="car_s2n_245" depart="245.00" departLane="s2sep_1" departPos="3.60" departPosLat="0.00" departSpeed="13.90" departDelay="0.00" arrival="432.00" arrivalLane="c2n_1" arrivalPos="990.00" arrivalPosLat="0.00" arrivalSpeed="15.59" duration="187.00" routeLength="1997.01" waitingTime="45.00" waitingCount="1" stopTime="0.00" timeLoss="58.19" rerouteNo="1" devices="tripinfo_car_s2n_245 routing_car_s2n_245" vType="Car" speedFactor="1.12" vaporized=""/>
    <tripinfo id="car_s2e_237" depart="237.00" departLane="s2sep_1" departPos="3.60" departPosLat="0.00" departSpeed="13.90" departDelay="0.00" arrival="435.00" arrivalLane="c2e_1" arrivalPos="990.00" arrivalPosLat="0.00" arrivalSpeed="15.08" duration="198.00" routeLength="1986.69" waitingTime="47.00" waitingCount="1" stopTime="0.00" timeLoss="65.67" rerouteNo="1" devices="tripinfo_car_s2e_237 routing_car_s2e_237" vType="Car" speedFactor="1.09" vaporized=""/>
    <tripinfo id="bus_n2s_232" depart="234.00" departLane="n2sep_1" departPos="12.10" departPosLat="0.00" departSpeed="13.90" departDelay="2.00" arrival="438.00" arrivalLane="c2s_1" arrivalPos="990.00" arrivalPosLat="0.00" arrivalSpeed="13.90" duration="204.00" routeLength="1988.51" waitingTime="47.00" waitingCount="1" stopTime="0.00" timeLoss="60.75" rerouteNo="1" devices="tripinfo_bus_n2s_232 routing_bus_n2s_232" vType="Bus" speedFactor="1.00" vaporized=""/>
    <tripinfo id="car_n2e_276" depart="276.00" departLane="n2sep_1" departPos="3.60" departPosLat="0.00" departSpeed="13.90" departDelay="0.00" arrival="439.00" arrivalLane="c2e_1" arrivalPos="990.00" arrivalPosLat="0.00" arrivalSpeed="14.89" duration="163.00" routeLength="1996.47" waitingTime="10.00" waitingCount="2" stopTime="0.00" timeLoss="27.79" rerouteNo="1" devices="tripinfo_car_n2e_276 routing_car_n2e_276" vType="Car" speedFactor="1.07" vaporized=""/>
    <tripinfo id="car_n2w_286" depart="286.00" departLane="n2sep_1" departPos="3.60" departPosLat="0.00" departSpeed="13.90" departDelay="0.00" arrival="440.00" arrivalLane="c2w_1" arrivalPos="990.00" arrivalPosLat="0.00" arrivalSpeed="13.90" duration="154.00" routeLength="1986.69" waitingTime="0.00" waitingCount="0" stopTime="0.00" timeLoss="9.99" rerouteNo="1" devices="tripinfo_car_n2w_286 routing_car_n2w_286" vType="Car" speedFactor="1.00" vaporized=""/>
    <tripinfo id="car_n2e_289" depart="290.00" departLane="n2sep_1" departPos="3.60" departPosLat="0.00" departSpeed="13.90" departDelay="1.00" arrival="442.00" arrivalLane="c2e_1" arrivalPos="990.00" arrivalPosLat="0.00" arrivalSpeed="15.19" duration="152.00" routeLength="1996.47" waitingTime="1.00" waitingCount="1" stopTime="0.00" timeLoss="19.93" rerouteNo="1" devices="tripinfo_car_n2e_289 routing_car_n2e_289" vType="Car" speedFactor="1.10" vaporized=""/>
    <tripinfo id="car_n2s_292" depart="294.00" departLane="n2sep_1" departPos="3.60" departPosLat="0.00" departSpeed="13.90" departDelay="2.00" arrival="443.00" arrivalLane="c2s_1" arrivalPos="990.00" arrivalPosLat="0.00" arrivalSpeed="15.22" duration="149.00" routeLength="1997.01" waitingTime="0.00" waitingCount="0" stopTime="0.00" timeLoss="17.53" rerouteNo="1" devices="tripinfo_car_n2s_292 routing_car_n2s_292" vType="Car" speedFactor="1.10" vaporized=""/>
    <tripinfo id="car_n2w_287" depart="288.00" departLane="n2sep_1" departPos="3.60" departPosLat="0.00" departSpeed="13.90" departDelay="1.00" arrival="444.00" arrivalLane="c2w_1" arrivalPos="990.00" arrivalPosLat="0.00" arrivalSpeed="14.12" duration="156.00" routeLength="1986.69" waitingTime="0.00" waitingCount="0" stopTime="0.00" timeLoss="14.35" rerouteNo="1" devices="tripinfo_car_n2w_287 routing_car_n2w_287" vType="Car" speedFactor="1.02" vaporized=""/>
    <tripinfo id="car_n2w_292" depart="292.00" departLane="n2sep_1" departPos="3.60" departPosLat="0.00" departSpeed="13.90" departDelay="0.00" arrival="446.00" arrivalLane="c2w_1" arrivalPos="990.00" arrivalPosLat="0.00" arrivalSpeed="14.89" duration="154.00" routeLength="1986.69" waitingTime="0.00" waitingCount="0" stopTime="0.00" timeLoss="22.85" rerouteNo="1" devices="tripinfo_car_n2w_292 routing_car_n2w_292" vType="Car" speedFactor="1.10" vaporized=""/>
    <tripinfo id="car_s2w_248" depart="248.00" departLane="s2sep_1" departPos="3.60" departPosLat="0.00" departSpeed="13.90" departDelay="0.00" arrival="449.00" arrivalLane="c2w_1" arrivalPos="990.00" arrivalPosLat="0.00" arrivalSpeed="15.10" duration="201.00" routeLength="1996.47" waitingTime="49.00" waitingCount="2" stopTime="0.00" timeLoss="68.80" rerouteNo="1" devices="tripinfo_car_s2w_248 routing_car_s2w_248" vType="Car" speedFactor="1.10" vaporized=""/>
    <tripinfo id="car_s2n_306" depart="306.00" departLane="s2sep_1" departPos="3.60" departPosLat="0.00" departSpeed="13.90" departDelay="0.00" arrival="451.00" arrivalLane="c2n_1" arrivalPos="990.00" arrivalPosLat="0.00" arrivalSpeed="14.75" duration="145.00" routeLength="1997.01" waitingTime="0.00" waitingCount="0" stopTime="0.00" timeLoss="9.39" rerouteNo="1" devices="tripinfo_car_s2n_306 routing_car_s2n_306" vType="Car" speedFactor="1.06" vaporized=""/>
    <tripinfo id="car_s2e_304" depart="304.00" departLane="s2sep_1" departPos="3.60" departPosLat="0.00" departSpeed="13.90" departDelay="0.00" arrival="453.00" arrivalLane="c2e_1" arrivalPos="990.00" arrivalPosLat="0.00" arrivalSpeed="13.90" duration="149.00" routeLength="1986.69" waitingTime="0.00" waitingCount="0" stopTime="0.00" timeLoss="5.43" rerouteNo="1" devices="tripinfo_car_s2e_304 routing_car_s2e_304" vType="Car" speedFactor="1.00" vaporized=""/>
    <tripinfo id="car_s2w_254" depart="254.00" departLane="s2sep_1" departPos="3.60" departPosLat="0.00" departSpeed="13.90" departDelay="0.00" arrival="454.00" arrivalLane="c2w_1" arrivalPos="990.00" arrivalPosLat="0.00" arrivalSpeed="13.90" duration="200.00" routeLength="1996.47" waitingTime="37.00" waitingCount="2" stopTime="0.00" timeLoss="55.76" rerouteNo="1" devices="tripinfo_car_s2w_254 routing_car_s2w_254" vType="Car" speedFactor="1.00" vaporized=""/>
    <tripinfo id="car_n2s_321" depart="321.00" departLane="n2sep_1" departPos="3.60" departPosLat="0.00" departSpeed="13.90" departDelay="0.00" arrival="457.00" arrivalLane="c2s_1" arrivalPos="990.00" arrivalPosLat="0.00" arrivalSpeed="14.85" duration="136.00" routeLength="1997.01" waitingTime="0.00" waitingCount="0" stopTime="0.00" timeLoss="0.68" rerouteNo="1" devices="tripinfo_car_n2s_321 routing_car_n2s_321" vType="Car" speedFactor="1.07" vaporized=""/>
    <tripinfo id="car_s2e_323" depart="323.00" departLane="s2sep_1" departPos="3.60" departPosLat="0.00" departSpeed="13.90" departDelay="0.00" arrival="457.00" arrivalLane="c2e_1" arrivalPos="990.00" arrivalPosLat="0.00" arrivalSpeed="15.85" duration="134.00" routeLength="1986.69" waitingTime="0.00" waitingCount="0" stopTime="0.00" timeLoss="8.22" rerouteNo="1" devices="tripinfo_car_s2e_323 routing_car_s2e_323" vType="Car" speedFactor="1.14" vaporized=""/>
    <tripinfo id="car_s2w_258" depart="258.00" departLane="s2sep_1" departPos="3.60" departPosLat="0.00" departSpeed="13.90" departDelay="0.00" arrival="458.00" arrivalLane="c2w_1" arrivalPos="990.00" arrivalPosLat="0.00" arrivalSpeed="13.89" duration="200.00" routeLength="1996.47" waitingTime="34.00" waitingCount="2" stopTime="0.00" timeLoss="55.61" rerouteNo="1" devices="tripinfo_car_s2w_258 routing_car_s2w_258" vType="Car" speedFactor="1.00" vaporized=""/>
    <tripinfo id="car_s2n_316" depart="316.00" departLane="s2sep_1" departPos="3.60" departPosLat="0.00" departSpeed="13.90" departDelay="0.00" arrival="458.00" arrivalLane="c2n_1" arrivalPos="990.00" arrivalPosLat="0.00" arrivalSpeed="14.35" duration="142.00" routeLength="1997.01" waitingTime="0.00" waitingCount="0" stopTime="0.00" timeLoss="1.88" rerouteNo="1" devices="tripinfo_car_s2n_316 routing_car_s2n_316" vType="Car" speedFactor="1.03" vaporized=""/>
    <tripinfo id="car_s2w_286" depart="286.00" departLane="s2sep_1" departPos="3.60" departPosLat="0.00" departSpeed="13.90" departDelay="0.00" arrival="460.00" arrivalLane="c2w_1" arrivalPos="990.00" arrivalPosLat="0.00" arrivalSpeed="15.48" duration="174.00" routeLength="1996.47" waitingTime="17.00" waitingCount="2" stopTime="0.00" timeLoss="50.20" rerouteNo="1" devices="tripinfo_car_s2w_286 routing_car_s2w_286" vType="Car" speedFactor="1.17" vaporized=""/>
    <tripinfo id="car_w2s_279" depart="279.00" departLane="w2sep_1" departPos="3.60" departPosLat="0.00" departSpeed="13.90" departDelay="0.00" arrival="477.00" arrivalLane="c2s_1" arrivalPos="990.00" arrivalPosLat="0.00" arrivalSpeed="14.38" duration="198.00" routeLength="1986.69" waitingTime="49.00" waitingCount="1" stopTime="0.00" timeLoss="59.00" rerouteNo="1" devices="tripinfo_car_w2s_279 routing_car_w2s_279" vType="Car" speedFactor="1.03" vaporized=""/>
    <tripinfo id="car_w2e_280" depart="281.00" departLane="w2sep_1" departPos="3.60" departPosLat="0.00" departSpeed="13.90" departDelay="1.00" arrival="478.00" arrivalLane="c2e_1" arrivalPos="990.00" arrivalPosLat="0.00" arrivalSpeed="14.80" duration="197.00" routeLength="1997.01" waitingTime="47.00" waitingCount="1" stopTime="0.00" timeLoss="61.16" rerouteNo="1" devices="tripinfo_car_w2e_280 routing_car_w2e_280" vType="Car" speedFactor="1.06" vaporized=""/>
    <tripinfo id="car_e2w_278" depart="278.00" departLane="e2sep_1" departPos="3.60" departPosLat="0.00" departSpeed="13.90" departDelay="0.00" arrival="479.00" arrivalLane="c2w_1" arrivalPos="990.00" arrivalPosLat="0.00" arrivalSpeed="14.09" duration="201.00" routeLength="1997.01" waitingTime="49.00" waitingCount="1" stopTime="0.00" timeLoss="58.64" rerouteNo="1" devices="tripinfo_car_e2w_278 routing_car_e2w_278" vType="Car" speedFactor="1.01" vaporized=""/>
    <tripinfo id="car_e2w_290" depart="290.00" departLane="e2sep_1" departPos="3.60" departPosLat="0.00" departSpeed="13.90" departDelay="0.00" arrival="483.00" arrivalLane="c2w_1" arrivalPos="990.00" arrivalPosLat="0.00" arrivalSpeed="14.02" duration="193.00" routeLength="1997.01" waitingTime="38.00" waitingCount="1" stopTime="0.00" timeLoss="50.53" rerouteNo="1" devices="tripinfo_car_e2w_290 routing_car_e2w_290" vType="Car" speedFactor="1.01" vaporized=""/>
    <tripinfo id="car_w2s_298" depart="298.00" departLane="w2sep_1" departPos="3.60" departPosLat="0.00" departSpeed="13.90" departDelay="0.00" arrival="485.00" arrivalLane="c2s_1" arrivalPos="990.00" arrivalPosLat="0.00" arrivalSpeed="13.96" duration="187.00" routeLength="1986.69" waitingTime="31.00" waitingCount="1" stopTime="0.00" timeLoss="43.99" rerouteNo="1" devices="tripinfo_car_w2s_298 routing_car_w2s_298" vType="Car" speedFactor="1.00" vaporized=""/>
    <tripinfo id="car_e2n_306" depart="306.00" departLane="e2sep_1" departPos="3.60" departPosLat="0.00" departSpeed="13.90" departDelay="0.00" arrival="485.00" arrivalLane="c2n_1" arrivalPos="990.00" arrivalPosLat="0.00" arrivalSpeed="14.34" duration="179.00" routeLength="1986.69" waitingTime="25.00" waitingCount="1" stopTime="0.00" timeLoss="39.47" rerouteNo="1" devices="tripinfo_car_e2n_306 routing_car_e2n_306" vType="Car" speedFactor="1.03" vaporized=""/>
    <tripinfo id="car_e2w_303" depart="303.00" departLane="e2sep_1" departPos="3.60" departPosLat="0.00" departSpeed="13.90" departDelay="0.00" arrival="486.00" arrivalLane="c2w_1" arrivalPos="990.00" arrivalPosLat="0.00" arrivalSpeed="14.76" duration="183.00" routeLength="1997.01" waitingTime="30.00" waitingCount="1" stopTime="0.00" timeLoss="48.19" rerouteNo="1" devices="tripinfo_car_e2w_303 routing_car_e2w_303" vType="Car" speedFactor="1.07" vaporized=""/>
    <tripinfo id="car_w2s_318" depart="320.00" departLane="w2sep_1" departPos="3.60" departPosLat="0.00" departSpeed="13.90" departDelay="2.00" arrival="490.00" arrivalLane="c2s_1" arrivalPos="990.00" arrivalPosLat="0.00" arrivalSpeed="14.01" duration="170.00" routeLength="1986.69" waitingTime="10.00" waitingCount="1" stopTime="0.00" timeLoss="26.82" rerouteNo="1" devices="tripinfo_car_w2s_318 routing_car_w2s_318" vType="Car" speedFactor="1.01" vaporized=""/>
    <tripinfo id="car_e2n_317" depart="318.00" departLane="e2sep_1" departPos="3.60" departPosLat="0.00" departSpeed="13.90" departDelay="1.00" arrival="491.00" arrivalLane="c2n_1" arrivalPos="990.00" arrivalPosLat="0.00" arrivalSpeed="13.90" duration="173.00" routeLength="1986.69" waitingTime="13.00" waitingCount="1" stopTime="0.00" timeLoss="29.34" rerouteNo="1" devices="tripinfo_car_e2n_317 routing_car_e2n_317" vType="Car" speedFactor="1.00" vaporized=""/>
    <tripinfo id="car_w2s_327" depart="327.00" departLane="w2sep_1" departPos="3.60" departPosLat="0.00" departSpeed="13.90" departDelay="0.00" arrival="493.00" arrivalLane="c2s_1" arrivalPos="990.00" arrivalPosLat="0.00" arrivalSpeed="14.35" duration="166.00" routeLength="1986.69" waitingTime="7.00" waitingCount="1" stopTime="0.00" timeLoss="26.49" rerouteNo="1" devices="tripinfo_car_w2s_327 routing_car_w2s_327" vType="Car" speedFactor="1.04" vaporized=""/>
    <tripinfo id="car_w2n_301" depart="301.00" departLane="w2sep_1" departPos="3.60" departPosLat="0.00" departSpeed="13.90" departDelay="0.00" arrival="495.00" arrivalLane="c2n_1" arrivalPos="990.00" arrivalPosLat="0.00" arrivalSpeed="13.93" duration="194.00" routeLength="1996.47" waitingTime="30.00" waitingCount="2" stopTime="0.00" timeLoss="49.98" rerouteNo="1" devices="tripinfo_car_w2n_301 routing_car_w2n_301" vType="Car" speedFactor="1.00" vaporized=""/>
    <tripinfo id="car_w2s_332" depart="332.00" departLane="w2sep_1" departPos="3.60" departPosLat="0.00" departSpeed="13.90" departDelay="0.00" arrival="495.00" arrivalLane="c2s_1" arrivalPos="990.00" arrivalPosLat="0.00" arrivalSpeed="15.11" duration="163.00" routeLength="1986.69" waitingTime="6.00" waitingCount="1" stopTime="0.00" timeLoss="33.76" rerouteNo="1" devices="tripinfo_car_w2s_332 routing_car_w2s_332" vType="Car" speedFactor="1.12" vaporized=""/>
    <tripinfo id="car_w2e_333" depart="334.00" departLane="w2sep_1" departPos="3.60" departPosLat="0.00" departSpeed="13.90" departDelay="1.00" arrival="495.00" arrivalLane="c2e_1" arrivalPos="990.00" arrivalPosLat="0.00" arrivalSpeed="14.11" duration="161.00" routeLength="1997.01" waitingTime="1.00" waitingCount="1" stopTime="0.00" timeLoss="19.43" rerouteNo="1" devices="tripinfo_car_w2e_333 routing_car_w2e_333" vType="Car" speedFactor="1.02" vaporized=""/>
    <tripinfo id="car_w2n_306" depart="306.00" departLane="w2sep_1" departPos="3.60" departPosLat="0.00" departSpeed="13.90" departDelay="0.00" arrival="497.00" arrivalLane="c2n_1" arrivalPos="990.00" arrivalPosLat="0.00" arrivalSpeed="14.90" duration="191.00" routeLength="1996.47" waitingTime="28.00" waitingCount="2" stopTime="0.00" timeLoss="59.92" rerouteNo="1" devices="tripinfo_car_w2n_306 routing_car_w2n_306" vType="Car" speedFactor="1.10" vaporized=""/>
    <tripinfo id="car_w2s_350" depart="350.00" departLane="w2sep_1" departPos="3.60" departPosLat="0.00" departSpeed="13.90" departDelay="0.00" arrival="497.00" arrivalLane="c2s_1" arrivalPos="990.00" arrivalPosLat="0.00" arrivalSpeed="15.33" duration="147.00" routeLength="1986.69" waitingTime="0.00" waitingCount="0" stopTime="0.00" timeLoss="20.34" rerouteNo="1" devices="tripinfo_car_w2s_350 routing_car_w2s_350" vType="Car" speedFactor="1.14" vaporized=""/>
    <tripinfo id="car_e2w_362" depart="362.00" departLane="e2sep_1" departPos="3.60" departPosLat="0.00" departSpeed="13.90" departDelay="0.00" arrival="497.00" arrivalLane="c2w_1" arrivalPos="990.00" arrivalPosLat="0.00" arrivalSpeed="14.89" duration="135.00" routeLength="1997.01" waitingTime="0.00" waitingCount="0" stopTime="0.00" timeLoss="0.63" rerouteNo="1" devices="tripinfo_car_e2w_362 routing_car_e2w_362" vType="Car" speedFactor="1.07" vaporized=""/>
    <tripinfo id="car_w2n_318" depart="318.00" departLane="w2sep_1" departPos="3.60" departPosLat="0.00" departSpeed="13.90" departDelay="0.00" arrival="499.00" arrivalLane="c2n_1" arrivalPos="990.00" arrivalPosLat="0.00" arrivalSpeed="15.07" duration="181.00" routeLength="1996.47" waitingTime="22.00" waitingCount="2" stopTime="0.00" timeLoss="51.85" rerouteNo="1" devices="tripinfo_car_w2n_318 routing_car_w2n_318" vType="Car" speedFactor="1.12" vaporized=""/>
    <tripinfo id="car_e2s_306" depart="308.00" departLane="e2sep_1" departPos="3.60" departPosLat="0.00" departSpeed="13.90" departDelay="2.00" arrival="501.00" arrivalLane="c2s_1" arrivalPos="990.00" arrivalPosLat="0.00" arrivalSpeed="14.22" duration="193.00" routeLength="1996.47" waitingTime="33.00" waitingCount="2" stopTime="0.00" timeLoss="51.84" rerouteNo="1" devices="tripinfo_car_e2s_306 routing_car_e2s_306" vType="Car" speedFactor="1.02" vaporized=""/>
    <tripinfo id="car_e2n_371" depart="371.00" departLane="e2sep_1" departPos="3.60" departPosLat="0.00" departSpeed="13.90" departDelay="0.00" arrival="502.00" arrivalLane="c2n_1" arrivalPos="990.00" arrivalPosLat="0.00" arrivalSpeed="16.16" duration="131.00" routeLength="1986.69" waitingTime="0.00" waitingCount="0" stopTime="0.00" timeLoss="8.41" rerouteNo="1" devices="tripinfo_car_e2n_371 routing_car_e2n_371" vType="Car" speedFactor="1.18" vaporized=""/>
    <tripinfo id="car_e2s_316" depart="316.00" departLane="e2sep_1" departPos="3.60" departPosLat="0.00" departSpeed="13.90" departDelay="0.00" arrival="503.00" arrivalLane="c2s_1" arrivalPos="990.00" arrivalPosLat="0.00" arrivalSpeed="15.46" duration="187.00" routeLength="1996.47" waitingTime="31.00" waitingCount="2" stopTime="0.00" timeLoss="61.65" rerouteNo="1" devices="tripinfo_car_e2s_316 routing_car_e2s_316" vType="Car" speedFactor="1.15" vaporized=""/>
    <tripinfo id="car_e2s_319" depart="320.00" departLane="e2sep_1" departPos="3.60" departPosLat="0.00" departSpeed="13.90" departDelay="1.00" arrival="507.00" arrivalLane="c2s_1" arrivalPos="990.00" arrivalPosLat="0.00" arrivalSpeed="14.33" duration="187.00" routeLength="1996.47" waitingTime="23.00" waitingCount="2" stopTime="0.00" timeLoss="46.60" rerouteNo="1" devices="tripinfo_car_e2s_319 routing_car_e2s_319" vType="Car" speedFactor="1.03" vaporized=""/>
    <tripinfo id="car_e2s_328" depart="328.00" departLane="e2sep_1" departPos="3.60" departPosLat="0.00" departSpeed="13.90" departDelay="0.00" arrival="509.00" arrivalLane="c2s_1" arrivalPos="990.00" arrivalPosLat="0.00" arrivalSpeed="16.08" duration="181.00" routeLength="1996.47" waitingTime="23.00" waitingCount="2" stopTime="0.00" timeLoss="62.47" rerouteNo="1" devices="tripinfo_car_e2s_328 routing_car_e2s_328" vType="Car" speedFactor="1.23" vaporized=""/>
    <tripinfo id="car_e2s_350" depart="350.00" departLane="e2sep_1" departPos="3.60" departPosLat="0.00" departSpeed="13.90" departDelay="0.00" arrival="511.00" arrivalLane="c2s_1" arrivalPos="990.00" arrivalPosLat="0.00" arrivalSpeed="15.21" duration="161.00" routeLength="1996.47" waitingTime="9.00" waitingCount="1" stopTime="0.00" timeLoss="31.45" rerouteNo="1" devices="tripinfo_car_e2s_350 routing_car_e2s_350" vType="Car" speedFactor="1.12" vaporized=""/>
    <tripinfo id="car_e2s_352" depart="352.00" departLane="e2sep_1" departPos="3.60" departPosLat="0.00" departSpeed="13.90" departDelay="0.00" arrival="515.00" arrivalLane="c2s_1" arrivalPos="990.00" arrivalPosLat="0.00" arrivalSpeed="14.11" duration="163.00" routeLength="1996.47" waitingTime="2.00" waitingCount="1" stopTime="0.00" timeLoss="20.88" rerouteNo="1" devices="tripinfo_car_e2s_352 routing_car_e2s_352" vType="Car" speedFactor="1.02" vaporized=""/>
    <tripinfo id="car_e2s_372" depart="373.00" departLane="e2sep_1" departPos="3.60" departPosLat="0.00" departSpeed="13.90" departDelay="1.00" arrival="518.00" arrivalLane="c2s_1" arrivalPos="990.00" arrivalPosLat="0.00" arrivalSpeed="14.87" duration="145.00" routeLength="1996.47" waitingTime="0.00" waitingCount="0" stopTime="0.00" timeLoss="10.46" rerouteNo="1" devices="tripinfo_car_e2s_372 routing_car_e2s_372" vType="Car" speedFactor="1.08" vaporized=""/>
    <tripinfo id="car_w2e_385" depart="385.00" departLane="w2sep_1" departPos="3.60" departPosLat="0.00" departSpeed="13.90" departDelay="0.00" arrival="521.00" arrivalLane="c2e_1" arrivalPos="990.00" arrivalPosLat="1.00" arrivalSpeed="14.98" duration="136.00" routeLength="1997.01" waitingTime="0.00" waitingCount="0" stopTime="0.00" timeLoss="1.75" rerouteNo="1" devices="tripinfo_car_w2e_385 routing_car_w2e_385" vType="Car" speedFactor="1.08" vaporized=""/>
    <tripinfo id="amb_w2e_390" depart="392.00" departLane="w2sep_1" departPos="6.60" departPosLat="0.00" departSpeed="13.90" departDelay="2.00" arrival="522.00" arrivalLane="c2e_1" arrivalPos="990.00" arrivalPosLat="0.00" arrivalSpeed="16.74" duration="130.00" routeLength="1994.01" waitingTime="0.00" waitingCount="0" stopTime="0.00" timeLoss="34.03" rerouteNo="1" devices="tripinfo_amb_w2e_390 routing_amb_w2e_390 bluelight_amb_w2e_390" vType="Ambulance" speedFactor="1.50" vaporized="">
        <bluelight/>
    </tripinfo>
    <tripinfo id="car_w2s_367" depart="367.00" departLane="w2sep_1" departPos="3.60" departPosLat="0.00" departSpeed="13.90" departDelay="0.00" arrival="524.00" arrivalLane="c2s_1" arrivalPos="990.00" arrivalPosLat="0.00" arrivalSpeed="13.90" duration="157.00" routeLength="1986.69" waitingTime="3.00" waitingCount="1" stopTime="0.00" timeLoss="13.02" rerouteNo="1" devices="tripinfo_car_w2s_367 routing_car_w2s_367" vType="Car" speedFactor="1.00" vaporized=""/>
    <tripinfo id="car_w2n_382" depart="382.00" departLane="w2sep_1" departPos="3.60" departPosLat="0.00" departSpeed="13.90" departDelay="0.00" arrival="529.00" arrivalLane="c2n_1" arrivalPos="990.00" arrivalPosLat="0.00" arrivalSpeed="13.90" duration="147.00" routeLength="1996.47" waitingTime="0.00" waitingCount="0" stopTime="0.00" timeLoss="2.28" rerouteNo="1" devices="tripinfo_car_w2n_382 routing_car_w2n_382" vType="Car" speedFactor="1.00" vaporized=""/>
    <tripinfo id="car_s2n_337" depart="337.00" departLane="s2sep_1" departPos="3.60" departPosLat="0.00" departSpeed="13.90" departDelay="0.00" arrival="533.00" arrivalLane="c2n_1" arrivalPos="990.00" arrivalPosLat="0.00" arrivalSpeed="15.46" duration="196.00" routeLength="1997.01" waitingTime="55.00" waitingCount="1" stopTime="0.00" timeLoss="66.92" rerouteNo="1" devices="tripinfo_car_s2n_337 routing_car_s2n_337" vType="Car" speedFactor="1.11" vaporized=""/>
    <tripinfo id="car_s2e_328" depart="328.00" departLane="s2sep_1" departPos="3.60" departPosLat="0.00" departSpeed="13.90" departDelay="0.00" arrival="537.00" arrivalLane="c2e_1" arrivalPos="990.00" arrivalPosLat="0.00" arrivalSpeed="14.06" duration="209.00" routeLength="1986.69" waitingTime="56.00" waitingCount="1" stopTime="0.00" timeLoss="66.45" rerouteNo="1" devices="tripinfo_car_s2e_328 routing_car_s2e_328" vType="Car" speedFactor="1.01" vaporized=""/>
    <tripinfo id="car_n2s_335" depart="335.00" departLane="n2sep_1" departPos="3.60" departPosLat="0.00" departSpeed="13.90" departDelay="0.00" arrival="538.00" arrivalLane="c2s_1" arrivalPos="990.00" arrivalPosLat="0.00" arrivalSpeed="13.95" duration="203.00" routeLength="1997.01" waitingTime="49.00" waitingCount="1" stopTime="0.00" timeLoss="58.96" rerouteNo="1" devices="tripinfo_car_n2s_335 routing_car_n2s_335" vType="Car" speedFactor="1.00" vaporized=""/>
    <tripinfo id="car_s2n_349" depart="349.00" departLane="s2sep_1" departPos="3.60" departPosLat="0.00" departSpeed="13.90" departDelay="0.00" arrival="540.00" arrivalLane="c2n_1" arrivalPos="990.00" arrivalPosLat="0.00" arrivalSpeed="15.05" duration="191.00" routeLength="1997.01" waitingTime="43.00" waitingCount="1" stopTime="0.00" timeLoss="58.28" rerouteNo="1" devices="tripinfo_car_s2n_349 routing_car_s2n_349" vType="Car" speedFactor="1.08" vaporized=""/>
    <tripinfo id="car_n2s_337" depart="337.00" departLane="n2sep_1" departPos="3.60" departPosLat="0.00" departSpeed="13.90" departDelay="0.00" arrival="541.00" arrivalLane="c2s_1" arrivalPos="990.00" arrivalPosLat="0.00" arrivalSpeed="14.19" duration="204.00" routeLength="1997.01" waitingTime="47.00" waitingCount="1" stopTime="0.00" timeLoss="63.37" rerouteNo="1" devices="tripinfo_car_n2s_337 routing_car_n2s_337" vType="Car" speedFactor="1.02" vaporized=""/>
    <tripinfo id="car_n2w_352" depart="352.00" departLane="n2sep_1" departPos="3.60" departPosLat="0.00" departSpeed="13.90" departDelay="0.00" arrival="543.00" arrivalLane="c2w_1" arrivalPos="990.00" arrivalPosLat="0.00" arrivalSpeed="13.93" duration="191.00" routeLength="1986.69" waitingTime="35.00" waitingCount="1" stopTime="0.00" timeLoss="47.14" rerouteNo="1" devices="tripinfo_car_n2w_352 routing_car_n2w_352" vType="Car" speedFactor="1.00" vaporized=""/>
    <tripinfo id="car_s2e_340" depart="342.00" departLane="s2sep_1" departPos="3.60" departPosLat="0.00" departSpeed="13.90" departDelay="2.00" arrival="544.00" arrivalLane="c2e_1" arrivalPos="990.00" arrivalPosLat="0.00" arrivalSpeed="13.90" duration="202.00" routeLength="1986.69" waitingTime="44.00" waitingCount="1" stopTime="0.00" timeLoss="57.80" rerouteNo="1" devices="tripinfo_car_s2e_340 routing_car_s2e_340" vType="Car" speedFactor="1.00" vaporized=""/>
    <tripinfo id="car_n2w_353" depart="354.00" departLane="n2sep_1" departPos="3.60" departPosLat="0.00" departSpeed="13.90" departDelay="1.00" arrival="546.00" arrivalLane="c2w_1" arrivalPos="990.00" arrivalPosLat="0.00" arrivalSpeed="14.40" duration="192.00" routeLength="1986.69" waitingTime="33.00" waitingCount="1" stopTime="0.00" timeLoss="53.62" rerouteNo="1" devices="tripinfo_car_n2w_353 routing_car_n2w_353" vType="Car" speedFactor="1.04" vaporized=""/>
    <tripinfo id="car_s2n_357" depart="357.00" departLane="s2sep_1" departPos="3.60" departPosLat="0.00" departSpeed="13.90" departDelay="0.00" arrival="548.00" arrivalLane="c2n_1" arrivalPos="990.00" arrivalPosLat="0.00" arrivalSpeed="13.90" duration="191.00" routeLength="1997.01" waitingTime="32.00" waitingCount="1" stopTime="0.00" timeLoss="47.20" rerouteNo="1" devices="tripinfo_car_s2n_357 routing_car_s2n_357" vType="Car" speedFactor="1.00" vaporized=""/>
    <tripinfo id="car_n2w_369" depart="369.00" departLane="n2sep_1" departPos="3.60" departPosLat="0.00" departSpeed="13.90" departDelay="0.00" arrival="549.00" arrivalLane="c2w_1" arrivalPos="990.00" arrivalPosLat="0.00" arrivalSpeed="14.71" duration="180.00" routeLength="1986.69" waitingTime="24.00" waitingCount="1" stopTime="0.00" timeLoss="44.55" rerouteNo="1" devices="tripinfo_car_n2w_369 routing_car_n2w_369" vType="Car" speedFactor="1.06" vaporized=""/>
    <tripinfo id="car_s2e_357" depart="359.00" departLane="s2sep_1" departPos="3.60" departPosLat="0.00" departSpeed="13.90" departDelay="2.00" arrival="550.00" arrivalLane="c2e_1" arrivalPos="990.00" arrivalPosLat="0.00" arrivalSpeed="13.96" duration="191.00" routeLength="1986.69" waitingTime="30.00" waitingCount="1" stopTime="0.00" timeLoss="48.03" rerouteNo="1" devices="tripinfo_car_s2e_357 routing_car_s2e_357" vType="Car" speedFactor="1.00" vaporized=""/>
    <tripinfo id="car_s2n_369" depart="369.00" departLane="s2sep_1" departPos="3.60" departPosLat="0.00" departSpeed="13.90" departDelay="0.00" arrival="550.00" arrivalLane="c2n_1" arrivalPos="990.00" arrivalPosLat="0.00" arrivalSpeed="15.15" duration="181.00" routeLength="1997.01" waitingTime="29.00" waitingCount="1" stopTime="0.00" timeLoss="53.03" rerouteNo="1" devices="tripinfo_car_s2n_369 routing_car_s2n_369" vType="Car" speedFactor="1.12" vaporized=""/>
    <tripinfo id="car_n2w_388" depart="388.00" departLane="n2sep_1" departPos="3.60" departPosLat="0.00" departSpeed="13.90" departDelay="0.00" arrival="552.00" arrivalLane="c2w_1" arrivalPos="990.00" arrivalPosLat="0.00" arrivalSpeed="14.56" duration="164.00" routeLength="1986.69" waitingTime="6.00" waitingCount="1" stopTime="0.00" timeLoss="26.95" rerouteNo="1" devices="tripinfo_car_n2w_388 routing_car_n2w_388" vType="Car" speedFactor="1.05" vaporized=""/>
    <tripinfo id="car_s2n_386" depart="387.00" departLane="s2sep_1" departPos="3.60" departPosLat="0.00" departSpeed="13.90" departDelay="1.00" arrival="553.00" arrivalLane="c2n_1" arrivalPos="990.00" arrivalPosLat="0.00" arrivalSpeed="15.48" duration="166.00" routeLength="1997.01" waitingTime="8.00" waitingCount="1" stopTime="0.00" timeLoss="37.68" rerouteNo="1" devices="tripinfo_car_s2n_386 routing_car_s2n_386" vType="Car" speedFactor="1.13" vaporized=""/>
    <tripinfo id="car_n2w_394" depart="394.00" departLane="n2sep_1" departPos="3.60" departPosLat="0.00" departSpeed="13.90" departDelay="0.00" arrival="555.00" arrivalLane="c2w_1" arrivalPos="990.00" arrivalPosLat="0.00" arrivalSpeed="14.60" duration="161.00" routeLength="1986.69" waitingTime="2.00" waitingCount="1" stopTime="0.00" timeLoss="24.38" rerouteNo="1" devices="tripinfo_car_n2w_394 routing_car_n2w_394" vType="Car" speedFactor="1.06" vaporized=""/>
    <tripinfo id="car_s2e_385" depart="385.00" departLane="s2sep_1" departPos="3.60" departPosLat="0.00" departSpeed="13.90" departDelay="0.00" arrival="556.00" arrivalLane="c2e_1" arrivalPos="990.00" arrivalPosLat="0.00" arrivalSpeed="13.90" duration="171.00" routeLength="1986.69" waitingTime="9.00" waitingCount="1" stopTime="0.00" timeLoss="27.03" rerouteNo="1" devices="tripinfo_car_s2e_385 routing_car_s2e_385" vType="Car" speedFactor="1.00" vaporized=""/>
    <tripinfo id="car_s2w_340" depart="340.00" departLane="s2sep_1" departPos="3.60" departPosLat="0.00" departSpeed="13.90" departDelay="0.00" arrival="557.00" arrivalLane="c2w_1" arrivalPos="990.00" arrivalPosLat="0.00" arrivalSpeed="15.59" duration="217.00" routeLength="1996.47" waitingTime="65.00" waitingCount="2" stopTime="0.00" timeLoss="92.65" rerouteNo="1" devices="tripinfo_car_s2w_340 routing_car_s2w_340" vType="Car" speedFactor="1.16" vaporized=""/>
    <tripinfo id="car_s2n_390" depart="390.00" departLane="s2sep_1" departPos="3.60" departPosLat="0.00" departSpeed="13.90" departDelay="0.00" arrival="558.00" arrivalLane="c2n_1" arrivalPos="990.00" arrivalPosLat="0.00" arrivalSpeed="14.31" duration="168.00" routeLength="1997.01" waitingTime="7.00" waitingCount="1" stopTime="0.00" timeLoss="28.44" rerouteNo="1" devices="tripinfo_car_s2n_390 routing_car_s2n_390" vType="Car" speedFactor="1.03" vaporized=""/>
    <tripinfo id="car_s2w_380" depart="380.00" departLane="s2sep_1" departPos="3.60" departPosLat="0.00" departSpeed="13.90" departDelay="0.00" arrival="559.00" arrivalLane="c2w_1" arrivalPos="990.00" arrivalPosLat="0.00" arrivalSpeed="15.42" duration="179.00" routeLength="1996.47" waitingTime="24.00" waitingCount="2" stopTime="0.00" timeLoss="52.16" rerouteNo="1" devices="tripinfo_car_s2w_380 routing_car_s2w_380" vType="Car" speedFactor="1.14" vaporized=""/>
    <tripinfo id="car_s2e_406" depart="406.00" departLane="s2sep_1" departPos="3.60" departPosLat="0.00" departSpeed="13.90" departDelay="0.00" arrival="561.00" arrivalLane="c2e_1" arrivalPos="990.00" arrivalPosLat="0.00" arrivalSpeed="15.28" duration="155.00" routeLength="1986.69" waitingTime="0.00" waitingCount="0" stopTime="0.00" timeLoss="23.55" rerouteNo="1" devices="tripinfo_car_s2e_406 routing_car_s2e_406" vType="Car" speedFactor="1.10" vaporized=""/>
    <tripinfo id="car_s2w_402" depart="402.00" departLane="s2sep_1" departPos="3.60" departPosLat="0.00" departSpeed="13.90" departDelay="0.00" arrival="562.00" arrivalLane="c2w_1" arrivalPos="990.00" arrivalPosLat="0.00" arrivalSpeed="15.03" duration="160.00" routeLength="1996.47" waitingTime="8.00" waitingCount="1" stopTime="0.00" timeLoss="26.69" rerouteNo="1" devices="tripinfo_car_s2w_402 routing_car_s2w_402" vType="Car" speedFactor="1.09" vaporized=""/>
    <tripinfo id="car_s2n_391" depart="392.00" departLane="s2sep_1" departPos="3.60" departPosLat="0.00" departSpeed="13.90" departDelay="1.00" arrival="563.00" arrivalLane="c2n_1" arrivalPos="990.00" arrivalPosLat="0.00" arrivalSpeed="14.21" duration="171.00" routeLength="1997.01" waitingTime="5.00" waitingCount="1" stopTime="0.00" timeLoss="29.64" rerouteNo="1" devices="tripinfo_car_s2n_391 routing_car_s2n_391" vType="Car" speedFactor="1.02" vaporized=""/>
    <tripinfo id="car_n2e_347" depart="347.00" departLane="n2sep_1" departPos="3.60" departPosLat="0.00" departSpeed="13.90" departDelay="0.00" arrival="565.00" arrivalLane="c2e_1" arrivalPos="990.00" arrivalPosLat="0.00" arrivalSpeed="15.68" duration="218.00" routeLength="1996.47" waitingTime="72.00" waitingCount="2" stopTime="0.00" timeLoss="89.80" rerouteNo="1" devices="tripinfo_car_n2e_347 routing_car_n2e_347" vType="Car" speedFactor="1.13" vaporized=""/>
    <tripinfo id="car_s2n_400" depart="400.00" departLane="s2sep_1" departPos="3.60" departPosLat="0.00" departSpeed="13.90" departDelay="0.00" arrival="566.00" arrivalLane="c2n_1" arrivalPos="990.00" arrivalPosLat="0.00" arrivalSpeed="14.30" duration="166.00" routeLength="1997.01" waitingTime="1.00" waitingCount="1" stopTime="0.00" timeLoss="26.12" rerouteNo="1" devices="tripinfo_car_s2n_400 routing_car_s2n_400" vType="Car" speedFactor="1.03" vaporized=""/>
    <tripinfo id="car_s2n_425" depart="425.00" departLane="s2sep_1" departPos="3.60" departPosLat="0.00" departSpeed="13.90" departDelay="0.00" arrival="570.00" arrivalLane="c2n_1" arrivalPos="990.00" arrivalPosLat="0.00" arrivalSpeed="14.12" duration="145.00" routeLength="1997.01" waitingTime="0.00" waitingCount="0" stopTime="0.00" timeLoss="2.83" rerouteNo="1" devices="tripinfo_car_s2n_425 routing_car_s2n_425" vType="Car" speedFactor="1.02" vaporized=""/>
    <tripinfo id="car_n2e_428" depart="428.00" departLane="n2sep_1" departPos="3.60" departPosLat="0.00" departSpeed="13.90" departDelay="0.00" arrival="571.00" arrivalLane="c2e_1" arrivalPos="990.00" arrivalPosLat="0.00" arrivalSpeed="15.00" duration="143.00" routeLength="1996.47" waitingTime="0.00" waitingCount="0" stopTime="0.00" timeLoss="8.37" rerouteNo="1" devices="tripinfo_car_n2e_428 routing_car_n2e_428" vType="Car" speedFactor="1.08" vaporized=""/>
    <tripinfo id="car_w2e_406" depart="406.00" departLane="w2sep_1" departPos="3.60" departPosLat="0.00" departSpeed="13.90" departDelay="0.00" arrival="579.00" arrivalLane="c2e_1" arrivalPos="990.00" arrivalPosLat="0.00" arrivalSpeed="14.80" duration="173.00" routeLength="1997.01" waitingTime="27.00" waitingCount="1" stopTime="0.00" timeLoss="37.38" rerouteNo="1" devices="tripinfo_car_w2e_406 routing_car_w2e_406" vType="Car" speedFactor="1.06" vaporized=""/>
    <tripinfo id="car_e2w_388" depart="388.00" departLane="e2sep_1" departPos="3.60" departPosLat="0.00" departSpeed="13.90" departDelay="0.00" arrival="580.00" arrivalLane="c2w_1" arrivalPos="990.00" arrivalPosLat="0.00" arrivalSpeed="14.46" duration="192.00" routeLength="1997.01" waitingTime="43.00" waitingCount="1" stopTime="0.00" timeLoss="53.46" rerouteNo="1" devices="tripinfo_car_e2w_388 routing_car_e2w_388" vType="Car" speedFactor="1.04" vaporized=""/>
    <tripinfo id="car_w2s_425" depart="425.00" departLane="w2sep_1" departPos="3.60" departPosLat="0.00" departSpeed="13.90" departDelay="0.00" arrival="580.00" arrivalLane="c2s_1" arrivalPos="990.00" arrivalPosLat="0.00" arrivalSpeed="15.04" duration="155.00" routeLength="1986.69" waitingTime="10.00" waitingCount="1" stopTime="0.00" timeLoss="21.73" rerouteNo="1" devices="tripinfo_car_w2s_425 routing_car_w2s_425" vType="Car" speedFactor="1.08" vaporized=""/>
    <tripinfo id="car_w2s_429" depart="429.00" departLane="w2sep_1" departPos="3.60" departPosLat="0.00" departSpeed="13.90" departDelay="0.00" arrival="583.00" arrivalLane="c2s_1" arrivalPos="990.00" arrivalPosLat="0.00" arrivalSpeed="15.84" duration="154.00" routeLength="1986.69" waitingTime="9.00" waitingCount="1" stopTime="0.00" timeLoss="28.12" rerouteNo="1" devices="tripinfo_car_w2s_429 routing_car_w2s_429" vType="Car" speedFactor="1.15" vaporized=""/>
    <tripinfo id="car_e2n_391" depart="391.00" departLane="e2sep_1" departPos="3.60" departPosLat="0.00" departSpeed="13.90" departDelay="0.00" arrival="584.00" arrivalLane="c2n_1" arrivalPos="990.00" arrivalPosLat="0.00" arrivalSpeed="14.21" duration="193.00" routeLength="1986.69" waitingTime="40.00" waitingCount="1" stopTime="0.00" timeLoss="51.83" rerouteNo="1" devices="tripinfo_car_e2n_391 routing_car_e2n_391" vType="Car" speedFactor="1.02" vaporized=""/>
    <tripinfo id="car_e2w_392" depart="393.00" departLane="e2sep_1" departPos="3.60" departPosLat="0.00" departSpeed="13.90" departDelay="1.00" arrival="584.00" arrivalLane="c2w_1" arrivalPos="990.00" arrivalPosLat="0.00" arrivalSpeed="15.08" duration="191.00" routeLength="1997.01" waitingTime="39.00" waitingCount="1" stopTime="0.00" timeLoss="57.83" rerouteNo="1" devices="tripinfo_car_e2w_392 routing_car_e2w_392" vType="Car" speedFactor="1.09" vaporized=""/>
    <tripinfo id="car_e2w_397" depart="397.00" departLane="e2sep_1" departPos="3.60" departPosLat="0.00" departSpeed="13.90" departDelay="0.00" arrival="586.00" arrivalLane="c2w_1" arrivalPos="990.00" arrivalPosLat="0.00" arrivalSpeed="15.57" duration="189.00" routeLength="1997.01" waitingTime="38.00" waitingCount="1" stopTime="0.00" timeLoss="62.65" rerouteNo="1" devices="tripinfo_car_e2w_397 routing_car_e2w_397" vType="Car" speedFactor="1.14" vaporized=""/>
</tripinfos>
