<?xml version="1.0" encoding="UTF-8" standalone="no"?>
<!-- Created with Inkscape (http://www.inkscape.org/) -->

<svg
   xmlns:dc="http://purl.org/dc/elements/1.1/"
   xmlns:cc="http://creativecommons.org/ns#"
   xmlns:rdf="http://www.w3.org/1999/02/22-rdf-syntax-ns#"
   xmlns:svg="http://www.w3.org/2000/svg"
   xmlns="http://www.w3.org/2000/svg"
   xmlns:sodipodi="http://sodipodi.sourceforge.net/DTD/sodipodi-0.dtd"
   xmlns:inkscape="http://www.inkscape.org/namespaces/inkscape"
   width="146.08987mm"
   height="92.316635mm"
   viewBox="0 0 146.08987 92.316635"
   version="1.1"
   id="svg6772"
   inkscape:version="0.92.5 (2060ec1f9f, 2020-04-08)"
   sodipodi:docname="distance_based2.svg">
  <defs
     id="defs6766" />
  <sodipodi:namedview
     id="base"
     pagecolor="#ffffff"
     bordercolor="#666666"
     borderopacity="1.0"
     inkscape:pageopacity="0.0"
     inkscape:pageshadow="2"
     inkscape:zoom="1.4"
     inkscape:cx="148.34219"
     inkscape:cy="131.34431"
     inkscape:document-units="mm"
     inkscape:current-layer="layer1"
     showgrid="false"
     inkscape:window-width="1920"
     inkscape:window-height="1016"
     inkscape:window-x="0"
     inkscape:window-y="27"
     inkscape:window-maximized="1" />
  <metadata
     id="metadata6769">
    <rdf:RDF>
      <cc:Work
         rdf:about="">
        <dc:format>image/svg+xml</dc:format>
        <dc:type
           rdf:resource="http://purl.org/dc/dcmitype/StillImage" />
        <dc:title />
      </cc:Work>
    </rdf:RDF>
  </metadata>
  <g
     inkscape:label="Layer 1"
     inkscape:groupmode="layer"
     id="layer1"
     transform="translate(-25.042978,-85.401845)">
    <path
       style="fill:#010101;stroke-width:0.0729618"
       inkscape:connector-curvature="0"
       d="m 157.4223,128.39374 c 0.53473,-0.13865 1.03468,-0.56136 1.23663,-1.04555 0.15569,-0.37326 0.1434,-1.1153 -0.0245,-1.47982 -0.29931,-0.64979 -0.89436,-1.01241 -1.65222,-1.0068 -0.46418,0.003 -1.04254,0.2315 -1.28426,0.50645 -0.21404,0.24346 -0.43529,0.75866 -0.47552,1.10729 -0.0763,0.66131 0.43518,1.55598 1.0322,1.80542 0.3042,0.12711 0.89341,0.18415 1.1676,0.11305 z m -16.68417,-0.0706 c 0.43183,-0.15317 0.89203,-0.55674 1.07531,-0.94288 0.0882,-0.18584 0.11243,-0.40464 0.0936,-0.84483 -0.0231,-0.54051 -0.048,-0.62539 -0.27565,-0.94164 -0.76318,-1.06014 -2.46231,-0.96099 -3.03916,0.17731 -0.26788,0.52865 -0.29779,0.95398 -0.10336,1.46988 0.36072,0.95704 1.31186,1.41473 2.24928,1.08225 z m 19.93097,-1.8123 c 0.2598,-0.0928 0.29185,-0.25155 0.29185,-1.44508 0,-0.82593 -0.0272,-1.21291 -0.0912,-1.30011 -0.0713,-0.0971 -0.83738,-0.25035 -3.5145,-0.70322 l -3.42328,-0.57909 -1.65121,-1.6455 -1.6512,-1.64551 h -9.51348 l -2.17084,1.72095 c -1.19395,0.94653 -2.24467,1.80202 -2.335,1.9011 -0.15993,0.1755 -0.16416,0.22205 -0.16416,1.80375 0,1.95333 -0.017,1.90686 0.69733,1.90686 h 0.49022 l 0.12237,-0.43777 c 0.17338,-0.62025 0.30904,-0.84519 0.74822,-1.24086 0.56163,-0.50592 0.9129,-0.64143 1.66294,-0.64143 0.74218,0 1.13645,0.14816 1.6504,0.62013 0.35757,0.32834 0.75633,1.04948 0.75837,1.37161 0.002,0.3847 -0.30409,0.36701 6.0154,0.34699 l 5.89787,-0.0187 0.12167,-0.43777 c 0.17216,-0.61948 0.30794,-0.8449 0.74749,-1.24087 0.54994,-0.49539 0.91538,-0.63945 1.62647,-0.64113 0.72167,-0.002 1.09691,0.1312 1.61136,0.57074 0.41118,0.35127 0.83286,1.06911 0.83286,1.41771 0,0.10596 0.0394,0.23205 0.0875,0.2802 0.0874,0.0874 0.93566,0.11453 1.15281,0.0369 z m -14.30051,-3.59577 c -0.0892,-0.0563 -0.11366,-0.3118 -0.13225,-1.38146 -0.0149,-0.85613 0.005,-1.36439 0.0573,-1.46201 0.0779,-0.14562 0.13719,-0.14965 2.19506,-0.14965 h 2.11494 l 1.27515,1.22094 c 1.0373,0.99323 1.27523,1.25787 1.27523,1.4186 0,0.42326 -0.0137,0.42491 -3.50013,0.42369 -1.86971,-6.7e-4 -3.22082,-0.0295 -3.28532,-0.0702 z m -6.37839,-0.14209 c -0.12223,-0.11487 -0.1882,-0.25463 -0.1882,-0.39869 0,-0.18878 0.16604,-0.38784 1.1153,-1.33709 l 1.11528,-1.11529 h 1.72424 c 0.94837,0 1.77618,0.02 1.83966,0.0442 0.0997,0.0383 0.11541,0.23501 0.11541,1.44464 0,1.01366 -0.0249,1.42524 -0.0901,1.49046 -0.0689,0.0689 -0.71761,0.0852 -2.76679,0.0693 l -2.67667,-0.0208 -0.1882,-0.17688 z"
       id="path972-0-5" />
    <path
       style="fill:#010101;stroke-width:0.09978583"
       inkscape:connector-curvature="0"
       d="m 129.64432,128.34523 c 0.98702,-0.33656 1.41655,-0.95485 1.41655,-2.03903 0,-0.55801 -0.0417,-0.70215 -0.32429,-1.1188 -0.42471,-0.6264 -0.93488,-0.88909 -1.72909,-0.89036 -1.21062,-0.002 -2.03783,0.83786 -2.03783,2.06896 0,1.18066 0.58055,1.82568 1.89593,2.10648 0.13721,0.0293 0.48763,-0.028 0.77873,-0.12722 z m -14.81621,0.0464 c 0.58686,-0.15483 1.32157,-0.83105 1.46536,-1.3488 0.21013,-0.75638 0.0552,-1.51474 -0.42028,-2.05618 -0.37917,-0.43186 -0.69454,-0.60108 -1.28534,-0.68969 -0.62855,-0.0943 -1.22248,0.0893 -1.70884,0.52826 -0.50709,0.45757 -0.67757,0.85187 -0.67757,1.56703 0,0.90811 0.53442,1.68867 1.31966,1.92746 0.61525,0.18712 0.82628,0.19871 1.30709,0.0719 z m 18.27378,-2.30874 c 0.15038,-0.15037 0.16456,-0.39377 0.1296,-2.22522 l -0.0392,-2.05638 -0.81599,-2.2356 c -0.44881,-1.22957 -0.81601,-2.36184 -0.81601,-2.5161 0,-0.17839 0.0727,-0.3194 0.19957,-0.38732 0.15382,-0.0823 0.19958,-0.20893 0.19958,-0.55233 v -0.44553 h -9.98557 c -6.65761,0 -10.04943,0.0342 -10.17716,0.1027 -0.31088,0.16639 -0.47915,0.60207 -1.15122,2.98071 l -0.63718,2.25516 -10e-4,2.26852 -0.001,2.26853 0.27574,0.3086 c 0.19562,0.21894 0.37486,0.31362 0.61696,0.32588 0.3201,0.0163 0.34638,-0.007 0.42395,-0.37011 0.32344,-1.51486 1.69457,-2.55452 3.20852,-2.43299 0.69037,0.0554 1.12069,0.2415 1.69846,0.73438 0.51992,0.44358 0.65211,0.64984 0.91318,1.42505 l 0.22261,0.66095 h 8.65074 l 0.0709,-0.41474 c 0.27991,-1.63969 1.99611,-2.73254 3.66313,-2.3326 0.46721,0.11203 1.27776,0.62104 1.5875,0.99675 0.26812,0.3253 0.561,0.9689 0.61498,1.35149 0.0557,0.39449 0.0616,0.39949 0.51821,0.42906 0.33105,0.0215 0.5097,-0.0179 0.63073,-0.13893 z m -5.57194,-4.8835 c -0.23568,-0.23569 -0.2768,-0.66045 -0.24242,-2.50363 0.0236,-1.25961 0.0676,-1.74695 0.16875,-1.86869 0.1167,-0.14032 0.36766,-0.16447 1.69636,-0.16316 0.85768,7.9e-4 1.61384,0.0361 1.68029,0.0784 0.14948,0.095 0.28277,0.41211 0.97643,2.32291 0.30205,0.83207 0.54918,1.59728 0.54918,1.70046 0,0.10316 -0.0898,0.27738 -0.19957,0.38715 -0.18716,0.18714 -0.33262,0.19956 -2.33789,0.19956 -1.78756,0 -2.16335,-0.0251 -2.29118,-0.15289 z m -5.16711,-0.0123 c -0.10236,-0.0926 -0.18217,-0.30075 -0.18176,-0.47399 0.001,-0.43264 1.04955,-3.8596 1.2125,-3.96288 0.0736,-0.0466 0.76516,-0.0855 1.5367,-0.0863 1.05603,-0.001 1.45079,0.0334 1.59657,0.1401 0.18055,0.13202 0.1937,0.27695 0.1937,2.13493 0,1.82009 -0.0165,2.01148 -0.19009,2.20336 -0.18055,0.19952 -0.28527,0.21005 -2.08762,0.21005 -1.62572,0 -1.92367,-0.0237 -2.08003,-0.16514 z m -5.41408,0.008 c -0.0862,-0.0862 -0.1568,-0.29959 -0.1568,-0.47411 0,-0.38396 0.94137,-3.72101 1.10543,-3.91878 0.0927,-0.11169 0.51037,-0.14026 2.0477,-0.14026 h 1.93136 l 0.16188,0.24706 c 0.15423,0.23538 0.1355,0.34034 -0.39632,2.22024 -0.34742,1.22807 -0.62213,2.02026 -0.72748,2.0979 -0.12083,0.0891 -0.69004,0.12473 -1.98913,0.12473 -1.52133,0 -1.84554,-0.0257 -1.97666,-0.15682 z m -5.06343,-0.008 c -0.27245,-0.24657 -0.22866,-0.62691 0.27361,-2.3767 0.4645,-1.61823 0.58649,-1.94173 0.78123,-2.07175 0.0604,-0.0403 0.93697,-0.074 1.94801,-0.0748 1.57183,-10e-4 1.8646,0.0224 2.02066,0.16361 0.10043,0.0909 0.18175,0.25921 0.18084,0.3742 -0.003,0.43251 -1.08946,3.89903 -1.26089,4.02436 -0.12405,0.0906 -0.67761,0.12623 -1.96678,0.12623 -1.52942,0 -1.8211,-0.0243 -1.97666,-0.16514 z"
       id="path984-7-4" />
    <rect
       style="opacity:0.98000004;fill:#000000;fill-opacity:1;stroke:none;stroke-width:0.26458332;stroke-opacity:1"
       id="rect1038-3-58-4"
       width="2.0579758"
       height="144.15182"
       x="-130.23723"
       y="25.042978"
       ry="1.0289841"
       transform="rotate(-90)" />
    <g
       id="g1129-7-9"
       transform="translate(8.0332774,30.308246)">
      <rect
         transform="rotate(90)"
         rx="0.36832884"
         ry="0"
         y="-151.4763"
         x="81.201714"
         height="97.18087"
         width="0.77173615"
         id="rect1038-6-0-9"
         style="opacity:0.98000004;fill:#000000;fill-opacity:1;stroke:none;stroke-width:0.26458332;stroke-opacity:1" />
      <rect
         rx="0.38587189"
         ry="0"
         y="81.201714"
         x="54.295437"
         height="3.2046795"
         width="0.77174377"
         id="rect1038-35-4-3"
         style="opacity:0.98000004;fill:#000000;fill-opacity:1;stroke:none;stroke-width:0.26458332;stroke-opacity:1" />
      <rect
         rx="0.38587189"
         ry="0"
         y="78.768768"
         x="54.295437"
         height="3.2046795"
         width="0.77174377"
         id="rect1038-62-8-6"
         style="opacity:0.98000004;fill:#000000;fill-opacity:1;stroke:none;stroke-width:0.26458332;stroke-opacity:1" />
    </g>
    <text
       xml:space="preserve"
       style="font-style:normal;font-weight:normal;font-size:10.58333302px;line-height:1.25;font-family:sans-serif;letter-spacing:0px;word-spacing:0px;fill:#000000;fill-opacity:1;stroke:none;stroke-width:0.26458332"
       x="64.030449"
       y="109.68845"
       id="text1139-0-0"><tspan
         sodipodi:role="line"
         id="tspan1137-4-5"
         x="64.030449"
         y="109.68845"
         style="font-size:7.05555534px;stroke-width:0.26458332">preemption distance</tspan></text>
    <path
       inkscape:connector-curvature="0"
       d="m 164.87627,111.42718 h 1.94202 a 0.45395717,1.300989 0 0 1 0.45395,1.30098 v 14.92332 a 0.45395717,1.300989 0 0 1 -0.45395,1.30099 h -1.94202 a 0.45395717,1.300989 0 0 1 -0.45396,-1.30099 v -14.92332 a 0.45395717,1.300989 0 0 1 0.45396,-1.30098"
       id="path899-6-6-9-2"
       style="stroke-width:0.06183126" />
    <path
       inkscape:connector-curvature="0"
       d="m 164.94702,99.778865 h 1.7975 a 1.6723294,1.6723294 0 0 1 1.67233,1.672325 v 7.90925 a 1.6723294,1.6723294 0 0 1 -1.67233,1.67233 h -1.7975 a 1.6723294,1.6723294 0 0 1 -1.67233,-1.67233 v -7.90925 a 1.6723294,1.6723294 0 0 1 1.67233,-1.672325"
       id="path5180-1-4"
       style="stroke-width:0.03655764" />
    <path
       style="fill:#ffffff;fill-opacity:0;stroke-width:0.02012371"
       inkscape:connector-curvature="0"
       d="m 167.43598,108.78446 a 1.59026,1.5902792 0 1 1 -3.18052,0 1.59026,1.5902792 0 1 1 3.18052,0 z"
       id="path5182-0-3" />
    <path
       style="fill:#ffffff;fill-opacity:0;stroke-width:0.02012371"
       inkscape:connector-curvature="0"
       d="m 167.43598,105.4058 a 1.59026,1.5902792 0 1 1 -3.18052,0 1.59026,1.5902792 0 1 1 3.18052,0 z"
       id="path5184-4-5" />
    <path
       style="fill:#ff0000;fill-opacity:1;stroke-width:0.02012371"
       inkscape:connector-curvature="0"
       d="m 167.43598,102.02714 a 1.59026,1.5902792 0 1 1 -3.18052,0 1.59026,1.5902792 0 1 1 3.18052,0 z"
       id="path5186-2-1" />
    <path
       inkscape:connector-curvature="0"
       d="m 162.41723,110.1956 c -0.0547,-0.022 -0.50972,-0.59695 -1.01144,-1.27667 -0.84236,-1.14122 -0.90546,-1.25107 -0.82379,-1.43412 0.0874,-0.19591 0.10015,-0.13573 1.09377,-0.13573 h 1.19353 v 1.43192 c 0,1.20556 -0.0149,1.30215 -0.15166,1.38513 -0.12371,0.0751 -0.17755,0.079 -0.30038,0.0294 z"
       id="path5188-2-7"
       style="stroke-width:0.03655764" />
    <path
       inkscape:connector-curvature="0"
       d="m 162.41723,106.81694 c -0.0547,-0.022 -0.50972,-0.59695 -1.01144,-1.27667 -0.84236,-1.14122 -0.90546,-1.25107 -0.82379,-1.43412 0.0874,-0.19591 0.10015,-0.13573 1.09377,-0.13573 h 1.19353 v 1.43193 c 0,1.20556 -0.0149,1.30214 -0.15166,1.38513 -0.12371,0.0751 -0.17755,0.0789 -0.30038,0.0294 z"
       id="path5190-2-4"
       style="stroke-width:0.03655764" />
    <path
       inkscape:connector-curvature="0"
       d="m 162.41723,103.43828 c -0.0547,-0.022 -0.50972,-0.59695 -1.01144,-1.27666 -0.84236,-1.14122 -0.90546,-1.25108 -0.82379,-1.43412 0.0874,-0.19592 0.10015,-0.13574 1.09377,-0.13574 h 1.19353 v 1.43193 c 0,1.20556 -0.0149,1.30215 -0.15166,1.38513 -0.12371,0.0751 -0.17755,0.0789 -0.30038,0.0294 z"
       id="path5192-0-3"
       style="stroke-width:0.03655764" />
    <g
       transform="matrix(0.03655764,0,0,0.03655764,201.77154,78.898597)"
       id="g5200-5-1">
      <path
         inkscape:connector-curvature="0"
         d="m -889.02,856.09 c 1.4967,-0.60315 13.943,-16.329 27.667,-34.922 23.042,-31.217 24.768,-34.222 22.534,-39.229 -2.3912,-5.359 -2.7394,-3.7129 -29.919,-3.7129 h -32.648 v 39.169 c 0,32.977 0.408,35.619 4.1487,37.889 3.384,2.0532 4.8567,2.1596 8.2167,0.80559 z"
         id="path5194-5-4" />
      <path
         inkscape:connector-curvature="0"
         d="m -889.02,763.67 c 1.4967,-0.60315 13.943,-16.329 27.667,-34.922 23.042,-31.217 24.768,-34.222 22.534,-39.229 -2.3912,-5.359 -2.7394,-3.7129 -29.919,-3.7129 h -32.648 v 39.169 c 0,32.977 0.408,35.619 4.1487,37.889 3.384,2.0532 4.8567,2.1596 8.2167,0.80559 z"
         id="path5196-2-6" />
      <path
         inkscape:connector-curvature="0"
         d="m -889.02,671.26 c 1.4967,-0.60315 13.943,-16.329 27.667,-34.922 23.042,-31.217 24.768,-34.222 22.534,-39.229 -2.3912,-5.359 -2.7394,-3.7129 -29.919,-3.7129 h -32.648 v 39.169 c 0,32.977 0.408,35.619 4.1487,37.889 3.384,2.0532 4.8567,2.1596 8.2167,0.80559 z"
         id="path5198-9-9" />
    </g>
    <g
       id="g6299"
       transform="translate(-5.2899343,83.259098)">
      <path
         style="stroke-width:0.00763508"
         id="path6199"
         d="m 173.05023,11.381145 c -0.0223,0.276238 -0.0526,0.619816 -0.0762,0.963395 -0.008,0.122619 -0.0699,0.200192 -0.16881,0.261425 q -0.95126,0.588512 -1.90114,1.179391 c -0.17018,0.10567 -0.33907,0.213783 -0.50926,0.319147 -0.24653,0.152702 -0.53041,0.205002 -0.80168,0.288911 q -1.92015,0.594392 -3.8435,1.178017 c -0.41062,0.124681 -0.32068,0.154992 -0.71304,-0.07956 -0.64898,-0.387862 -1.30087,-0.771143 -1.95038,-1.1587 -0.049,-0.02909 -0.12904,-0.04581 -0.12499,-0.114526 0.004,-0.07589 0.0902,-0.06627 0.14285,-0.08254 q 2.19891,-0.676239 4.39781,-1.348966 2.31564,-0.709834 4.6303,-1.420508 c 0.23531,-0.07223 0.47123,-0.142699 0.70647,-0.215156 0.20943,-0.06452 0.22302,-0.05482 0.21157,0.229663 z"
         inkscape:connector-curvature="0" />
      <path
         style="stroke-width:0.00763508"
         id="path6201"
         d="m 173.62133,14.130462 c -0.003,0.09819 -0.0662,0.122162 -0.13201,0.142394 q -0.40351,0.123842 -0.80726,0.246843 -1.89174,0.579503 -3.78364,1.159158 -1.36668,0.418479 -2.73427,0.835813 -0.62051,0.189884 -1.2404,0.381754 c -0.1414,0.04367 -0.18149,0.02291 -0.22439,-0.117428 q -0.21279,-0.696166 -0.42581,-1.39241 c -0.0126,-0.04138 -0.0498,-0.09215 -0.004,-0.126437 0.046,-0.03428 0.0847,0.01527 0.12216,0.03726 0.26998,0.158505 0.54003,0.316857 0.80795,0.478874 0.0992,0.06009 0.19507,0.07696 0.31021,0.04123 q 1.71308,-0.531783 3.42861,-1.056465 c 0.39702,-0.122162 0.7926,-0.246919 1.19107,-0.361598 0.16965,-0.04879 0.31464,-0.139341 0.46063,-0.22974 q 1.18435,-0.733349 2.3658,-1.470898 c 0.19752,-0.123078 0.19424,-0.123383 0.26189,0.101164 0.12399,0.410844 0.25081,0.820696 0.37595,1.231081 0.0115,0.0368 0.0205,0.07437 0.0273,0.09941 z"
         inkscape:connector-curvature="0" />
      <path
         style="stroke-width:0.00763508"
         id="path6203"
         d="m 172.83293,15.37208 c -7.2e-4,0.06871 -0.0335,0.105516 -0.0897,0.122847 q -0.4581,0.141403 -0.91728,0.281735 c -0.0916,0.02802 -0.14354,-0.02596 -0.19347,-0.09101 -0.23287,-0.303188 -0.53858,-0.422067 -0.91163,-0.336707 -0.37305,0.08536 -0.62944,0.403514 -0.65074,0.786414 -0.009,0.164536 -0.0283,0.18767 -0.18538,0.235695 q -0.66562,0.203627 -1.33095,0.408324 c -0.15682,0.04795 -0.1856,0.0313 -0.23508,-0.127887 -0.048,-0.154382 -0.098,-0.308305 -0.14354,-0.463451 -0.0363,-0.123611 -0.0125,-0.165376 0.11094,-0.203245 q 2.07689,-0.637071 4.15417,-1.273379 c 0.15118,-0.04635 0.18546,-0.02596 0.22982,0.122161 0.0452,0.151557 0.093,0.302349 0.13934,0.453601 0.009,0.03039 0.017,0.061 0.0235,0.0849 z"
         inkscape:connector-curvature="0" />
      <path
         style="stroke-width:0.00763508"
         id="path6209"
         d="m 170.92699,16.890621 c -0.38779,0 -0.70945,-0.320673 -0.7077,-0.704413 0.002,-0.38893 0.31701,-0.700595 0.70922,-0.701053 0.38878,-4.12e-4 0.70755,0.315787 0.70678,0.701129 -7.2e-4,0.383969 -0.32319,0.704566 -0.7083,0.704337 z"
         inkscape:connector-curvature="0" />
      <path
         style="stroke-width:0.00763508"
         id="path6211"
         d="m 164.01548,15.425448 c 0.0916,-0.004 0.13117,0.02642 0.14866,0.08307 q 0.14025,0.453677 0.27814,0.907888 c 0.0238,0.07895 -0.0116,0.128651 -0.0877,0.152701 -0.14415,0.04581 -0.28808,0.09162 -0.43223,0.136898 -0.0812,0.02542 -0.13995,-7.21e-4 -0.16553,-0.08299 q -0.13788,-0.443217 -0.27249,-0.887578 c -0.027,-0.08903 0,-0.14919 0.0955,-0.176752 0.15522,-0.04474 0.30915,-0.09429 0.43566,-0.133233 z"
         inkscape:connector-curvature="0" />
    </g>
    <g
       id="g6394"
       transform="matrix(0.04109401,0,0,0.04109401,138.65143,73.303296)">
      <path
         id="path6377"
         d="m 404.83,299.84 c -14.598,0 -27.263,7.8701 -34.347,19.493 -6.5727,-4.6439 -14.54,-7.4517 -23.194,-7.4517 -22.272,0 -40.367,18.095 -40.367,40.367 0,1.6367 0.30376,3.201 0.49349,4.7868 -19.235,3.0691 -34.001,19.582 -34.001,39.677 0,19.911 14.483,36.389 33.459,39.677 -0.3845,2.2356 -0.69089,4.5148 -0.69089,6.8595 0,22.272 18.095,40.318 40.367,40.318 10.909,0 20.766,-4.3575 28.03,-11.4 7.4033,8.8062 18.348,14.558 30.744,14.558 17.687,0 32.556,-11.492 37.999,-27.339 4.3567,1.6111 9.0019,2.6648 13.916,2.6648 22.272,0 40.318,-18.095 40.318,-40.367 0,-11.2 -4.5658,-21.31 -11.942,-28.622 3.7241,-6.1098 6.0206,-13.201 6.0206,-20.875 0,-22.272 -18.095,-40.318 -40.367,-40.318 -2.3445,0 -4.6242,0.25712 -6.8595,0.64154 -3.5964,-18.594 -19.938,-32.669 -39.578,-32.669 z"
         inkscape:connector-curvature="0"
         style="fill:#ffffff;stroke:#000000;stroke-width:10.85700035;stroke-linejoin:round" />
      <path
         id="path6379"
         d="m 183.85,484.93 a 9.5392,9.5392 0 1 1 -19.078,0 9.5392,9.5392 0 1 1 19.078,0 z"
         transform="matrix(1.5792,0,0,1.5792,170.62,-261.43)"
         inkscape:connector-curvature="0"
         style="fill:#ffffff;stroke:#000000;stroke-width:4.79879999;stroke-linejoin:round" />
      <path
         id="path6381"
         d="m 183.85,484.93 a 9.5392,9.5392 0 1 1 -19.078,0 9.5392,9.5392 0 1 1 19.078,0 z"
         transform="matrix(1.0961,0,0,1.0961,274.91,5.6957)"
         inkscape:connector-curvature="0"
         style="fill:#ffffff;stroke:#000000;stroke-width:5.40280008;stroke-linejoin:round" />
    </g>
    <text
       xml:space="preserve"
       style="font-style:normal;font-weight:normal;font-size:10.58333302px;line-height:1.25;font-family:sans-serif;letter-spacing:0px;word-spacing:0px;fill:#000000;fill-opacity:1;stroke:none;stroke-width:0.26458332"
       x="153.47917"
       y="90.923882"
       id="text6398"><tspan
         sodipodi:role="line"
         id="tspan6396"
         x="153.47917"
         y="90.923882"
         style="font-style:normal;font-variant:normal;font-weight:normal;font-stretch:normal;font-size:4.23333311px;font-family:sans-serif;-inkscape-font-specification:'sans-serif, Normal';font-variant-ligatures:normal;font-variant-caps:normal;font-variant-numeric:normal;font-feature-settings:normal;text-align:start;writing-mode:lr-tb;text-anchor:start;stroke-width:0.26458332">2</tspan></text>
    <path
       style="fill:#010101;stroke-width:0.0729618"
       inkscape:connector-curvature="0"
       d="m 157.42229,175.87499 c 0.53473,-0.13865 1.03468,-0.56136 1.23663,-1.04555 0.15569,-0.37326 0.1434,-1.1153 -0.0245,-1.47982 -0.29931,-0.64979 -0.89436,-1.01241 -1.65222,-1.0068 -0.46418,0.003 -1.04254,0.2315 -1.28426,0.50645 -0.21404,0.24346 -0.43529,0.75866 -0.47552,1.10729 -0.0763,0.66131 0.43518,1.55598 1.0322,1.80542 0.3042,0.12711 0.89341,0.18415 1.1676,0.11305 z m -16.68417,-0.0706 c 0.43183,-0.15317 0.89203,-0.55674 1.07531,-0.94288 0.0882,-0.18584 0.11243,-0.40464 0.0936,-0.84483 -0.0231,-0.54051 -0.048,-0.62539 -0.27565,-0.94164 -0.76318,-1.06014 -2.46231,-0.96099 -3.03916,0.17731 -0.26788,0.52865 -0.29779,0.95398 -0.10336,1.46988 0.36072,0.95704 1.31186,1.41473 2.24928,1.08225 z m 19.93097,-1.8123 c 0.2598,-0.0928 0.29185,-0.25155 0.29185,-1.44508 0,-0.82593 -0.0272,-1.21291 -0.0912,-1.30011 -0.0713,-0.0971 -0.83738,-0.25035 -3.5145,-0.70322 l -3.42328,-0.57909 -1.65121,-1.6455 -1.6512,-1.64551 h -9.51348 l -2.17084,1.72095 c -1.19395,0.94653 -2.24467,1.80202 -2.335,1.9011 -0.15993,0.1755 -0.16416,0.22205 -0.16416,1.80375 0,1.95333 -0.017,1.90686 0.69733,1.90686 h 0.49022 l 0.12237,-0.43777 c 0.17338,-0.62025 0.30904,-0.84519 0.74822,-1.24086 0.56163,-0.50592 0.9129,-0.64143 1.66294,-0.64143 0.74218,0 1.13645,0.14816 1.6504,0.62013 0.35757,0.32834 0.75633,1.04948 0.75837,1.37161 0.002,0.3847 -0.30409,0.36701 6.0154,0.34699 l 5.89787,-0.0187 0.12167,-0.43777 c 0.17216,-0.61948 0.30794,-0.8449 0.74749,-1.24087 0.54994,-0.49539 0.91538,-0.63945 1.62647,-0.64113 0.72167,-0.002 1.09691,0.1312 1.61136,0.57074 0.41118,0.35127 0.83286,1.06911 0.83286,1.41771 0,0.10596 0.0394,0.23205 0.0875,0.2802 0.0874,0.0874 0.93566,0.11453 1.15281,0.0369 z m -14.30051,-3.59577 c -0.0892,-0.0563 -0.11366,-0.3118 -0.13225,-1.38146 -0.0149,-0.85613 0.005,-1.36439 0.0573,-1.46201 0.0779,-0.14562 0.13719,-0.14965 2.19506,-0.14965 h 2.11494 l 1.27515,1.22094 c 1.0373,0.99323 1.27523,1.25787 1.27523,1.4186 0,0.42326 -0.0137,0.42491 -3.50013,0.42369 -1.86971,-6.7e-4 -3.22082,-0.0295 -3.28532,-0.0702 z m -6.37839,-0.14209 c -0.12223,-0.11487 -0.1882,-0.25463 -0.1882,-0.39869 0,-0.18878 0.16604,-0.38784 1.1153,-1.33709 l 1.11528,-1.11529 h 1.72424 c 0.94837,0 1.77618,0.02 1.83966,0.0442 0.0997,0.0383 0.11541,0.23501 0.11541,1.44464 0,1.01366 -0.0249,1.42524 -0.0901,1.49046 -0.0689,0.0689 -0.71761,0.0852 -2.76679,0.0693 l -2.67667,-0.0208 -0.1882,-0.17688 z"
       id="path972-0-5-5" />
    <path
       style="fill:#010101;stroke-width:0.09978583"
       inkscape:connector-curvature="0"
       d="m 129.64431,175.82648 c 0.98702,-0.33656 1.41655,-0.95485 1.41655,-2.03903 0,-0.55801 -0.0417,-0.70215 -0.32429,-1.1188 -0.42471,-0.6264 -0.93488,-0.88909 -1.72909,-0.89036 -1.21062,-0.002 -2.03783,0.83786 -2.03783,2.06896 0,1.18066 0.58055,1.82568 1.89593,2.10648 0.13721,0.0293 0.48763,-0.028 0.77873,-0.12722 z m -14.81621,0.0464 c 0.58686,-0.15483 1.32157,-0.83105 1.46536,-1.3488 0.21013,-0.75638 0.0552,-1.51474 -0.42028,-2.05618 -0.37917,-0.43186 -0.69454,-0.60108 -1.28534,-0.68969 -0.62855,-0.0943 -1.22248,0.0893 -1.70884,0.52826 -0.50709,0.45757 -0.67757,0.85187 -0.67757,1.56703 0,0.90811 0.53442,1.68867 1.31966,1.92746 0.61525,0.18712 0.82628,0.19871 1.30709,0.0719 z m 18.27378,-2.30874 c 0.15038,-0.15037 0.16456,-0.39377 0.1296,-2.22522 l -0.0392,-2.05638 -0.81599,-2.2356 c -0.44881,-1.22957 -0.81601,-2.36184 -0.81601,-2.5161 0,-0.17839 0.0727,-0.3194 0.19957,-0.38732 0.15382,-0.0823 0.19958,-0.20893 0.19958,-0.55233 v -0.44553 h -9.98557 c -6.65761,0 -10.04943,0.0342 -10.17716,0.1027 -0.31088,0.16639 -0.47915,0.60207 -1.15122,2.98071 l -0.63718,2.25516 -0.001,2.26852 -0.001,2.26853 0.27574,0.3086 c 0.19562,0.21894 0.37486,0.31362 0.61696,0.32588 0.3201,0.0163 0.34638,-0.007 0.42395,-0.37011 0.32344,-1.51486 1.69457,-2.55452 3.20852,-2.43299 0.69037,0.0554 1.12069,0.2415 1.69846,0.73438 0.51992,0.44358 0.65211,0.64984 0.91318,1.42505 l 0.22261,0.66095 h 8.65074 l 0.0709,-0.41474 c 0.27991,-1.63969 1.99611,-2.73254 3.66313,-2.3326 0.46721,0.11203 1.27776,0.62104 1.5875,0.99675 0.26812,0.3253 0.561,0.9689 0.61498,1.35149 0.0557,0.39449 0.0616,0.39949 0.51821,0.42906 0.33105,0.0215 0.5097,-0.0179 0.63073,-0.13893 z m -5.57194,-4.8835 c -0.23568,-0.23569 -0.2768,-0.66045 -0.24242,-2.50363 0.0236,-1.25961 0.0676,-1.74695 0.16875,-1.86869 0.1167,-0.14032 0.36766,-0.16447 1.69636,-0.16316 0.85768,7.9e-4 1.61384,0.0361 1.68029,0.0784 0.14948,0.095 0.28277,0.41211 0.97643,2.32291 0.30205,0.83207 0.54918,1.59728 0.54918,1.70046 0,0.10316 -0.0898,0.27738 -0.19957,0.38715 -0.18716,0.18714 -0.33262,0.19956 -2.33789,0.19956 -1.78756,0 -2.16335,-0.0251 -2.29118,-0.15289 z m -5.16711,-0.0123 c -0.10236,-0.0926 -0.18217,-0.30075 -0.18176,-0.47399 10e-4,-0.43264 1.04955,-3.8596 1.2125,-3.96288 0.0736,-0.0466 0.76516,-0.0855 1.5367,-0.0863 1.05603,-0.001 1.45079,0.0334 1.59657,0.1401 0.18055,0.13202 0.1937,0.27695 0.1937,2.13493 0,1.82009 -0.0165,2.01148 -0.19009,2.20336 -0.18055,0.19952 -0.28527,0.21005 -2.08762,0.21005 -1.62572,0 -1.92367,-0.0237 -2.08003,-0.16514 z m -5.41408,0.008 c -0.0862,-0.0862 -0.1568,-0.29959 -0.1568,-0.47411 0,-0.38396 0.94137,-3.72101 1.10543,-3.91878 0.0927,-0.11169 0.51037,-0.14026 2.0477,-0.14026 h 1.93136 l 0.16188,0.24706 c 0.15423,0.23538 0.1355,0.34034 -0.39632,2.22024 -0.34742,1.22807 -0.62213,2.02026 -0.72748,2.0979 -0.12083,0.0891 -0.69004,0.12473 -1.98913,0.12473 -1.52133,0 -1.84554,-0.0257 -1.97666,-0.15682 z m -5.06343,-0.008 c -0.27245,-0.24657 -0.22866,-0.62691 0.27361,-2.3767 0.4645,-1.61823 0.58649,-1.94173 0.78123,-2.07175 0.0604,-0.0403 0.93697,-0.074 1.94801,-0.0748 1.57183,-0.001 1.8646,0.0224 2.02066,0.16361 0.10043,0.0909 0.18175,0.25921 0.18084,0.3742 -0.003,0.43251 -1.08946,3.89903 -1.26089,4.02436 -0.12405,0.0906 -0.67761,0.12623 -1.96678,0.12623 -1.52942,0 -1.8211,-0.0243 -1.97666,-0.16514 z"
       id="path984-7-4-2" />
    <rect
       style="opacity:0.98000004;fill:#000000;fill-opacity:1;stroke:none;stroke-width:0.26458332;stroke-opacity:1"
       id="rect1038-3-58-4-6"
       width="2.0579758"
       height="144.15182"
       x="-177.71848"
       y="25.042978"
       ry="1.0289841"
       transform="rotate(-90)" />
    <rect
       style="opacity:0.98000004;fill:#000000;fill-opacity:1;stroke:none;stroke-width:0.29817069;stroke-opacity:1"
       id="rect1038-6-0-9-8"
       width="0.77173615"
       height="123.42005"
       x="158.99121"
       y="-159.50958"
       ry="0"
       rx="0.36832884"
       transform="rotate(90)" />
    <rect
       style="opacity:0.98000004;fill:#000000;fill-opacity:1;stroke:none;stroke-width:0.26458332;stroke-opacity:1"
       id="rect1038-35-4-3-7"
       width="0.77174377"
       height="3.2046795"
       x="36.089531"
       y="158.99121"
       ry="0"
       rx="0.38587189" />
    <rect
       style="opacity:0.98000004;fill:#000000;fill-opacity:1;stroke:none;stroke-width:0.26458332;stroke-opacity:1"
       id="rect1038-62-8-6-9"
       width="0.77174377"
       height="3.2046795"
       x="36.089531"
       y="156.55826"
       ry="0"
       rx="0.38587189" />
    <text
       xml:space="preserve"
       style="font-style:normal;font-weight:normal;font-size:10.58333302px;line-height:1.25;font-family:sans-serif;letter-spacing:0px;word-spacing:0px;fill:#000000;fill-opacity:1;stroke:none;stroke-width:0.26458332"
       x="37.855595"
       y="157.16971"
       id="text1139-0-0-6"><tspan
         sodipodi:role="line"
         id="tspan1137-4-5-0"
         x="37.855595"
         y="157.16971"
         style="font-size:7.05555534px;stroke-width:0.26458332">preemption distance</tspan></text>
    <path
       inkscape:connector-curvature="0"
       d="m 164.87626,158.90842 h 1.94202 a 0.45395717,1.300989 0 0 1 0.45395,1.30099 v 14.92332 a 0.45395717,1.300989 0 0 1 -0.45395,1.30099 h -1.94202 a 0.45395717,1.300989 0 0 1 -0.45396,-1.30099 v -14.92332 a 0.45395717,1.300989 0 0 1 0.45396,-1.30099"
       id="path899-6-6-9-2-4"
       style="stroke-width:0.06183126" />
    <path
       inkscape:connector-curvature="0"
       d="m 164.94701,147.26011 h 1.7975 a 1.6723294,1.6723294 0 0 1 1.67233,1.67233 v 7.90925 a 1.6723294,1.6723294 0 0 1 -1.67233,1.67232 h -1.7975 a 1.6723294,1.6723294 0 0 1 -1.67233,-1.67232 v -7.90925 a 1.6723294,1.6723294 0 0 1 1.67233,-1.67233"
       id="path5180-1-4-1"
       style="stroke-width:0.03655764" />
    <path
       style="fill:#ffffff;fill-opacity:0;stroke-width:0.02012371"
       inkscape:connector-curvature="0"
       d="m 167.43597,156.2657 a 1.59026,1.5902792 0 1 1 -3.18052,0 1.59026,1.5902792 0 1 1 3.18052,0 z"
       id="path5182-0-3-0" />
    <path
       style="fill:#ffffff;fill-opacity:0;stroke-width:0.02012371"
       inkscape:connector-curvature="0"
       d="m 167.43597,152.88705 a 1.59026,1.5902792 0 1 1 -3.18052,0 1.59026,1.5902792 0 1 1 3.18052,0 z"
       id="path5184-4-5-4" />
    <path
       style="fill:#ff0000;fill-opacity:1;stroke-width:0.02012371"
       inkscape:connector-curvature="0"
       d="m 167.43597,149.50839 a 1.59026,1.5902792 0 1 1 -3.18052,0 1.59026,1.5902792 0 1 1 3.18052,0 z"
       id="path5186-2-1-8" />
    <path
       inkscape:connector-curvature="0"
       d="m 162.41722,157.67685 c -0.0547,-0.022 -0.50972,-0.59696 -1.01144,-1.27667 -0.84236,-1.14122 -0.90546,-1.25108 -0.82379,-1.43412 0.0874,-0.19591 0.10015,-0.13573 1.09377,-0.13573 h 1.19353 v 1.43192 c 0,1.20556 -0.0149,1.30215 -0.15166,1.38513 -0.12371,0.0751 -0.17755,0.0789 -0.30038,0.0294 z"
       id="path5188-2-7-7"
       style="stroke-width:0.03655764" />
    <path
       inkscape:connector-curvature="0"
       d="m 162.41722,154.29819 c -0.0547,-0.022 -0.50972,-0.59695 -1.01144,-1.27667 -0.84236,-1.14122 -0.90546,-1.25108 -0.82379,-1.43412 0.0874,-0.19591 0.10015,-0.13573 1.09377,-0.13573 h 1.19353 v 1.43192 c 0,1.20557 -0.0149,1.30215 -0.15166,1.38514 -0.12371,0.0751 -0.17755,0.0789 -0.30038,0.0294 z"
       id="path5190-2-4-0"
       style="stroke-width:0.03655764" />
    <path
       inkscape:connector-curvature="0"
       d="m 162.41722,150.91953 c -0.0547,-0.022 -0.50972,-0.59695 -1.01144,-1.27666 -0.84236,-1.14122 -0.90546,-1.25108 -0.82379,-1.43412 0.0874,-0.19592 0.10015,-0.13574 1.09377,-0.13574 h 1.19353 v 1.43192 c 0,1.20557 -0.0149,1.30215 -0.15166,1.38514 -0.12371,0.0751 -0.17755,0.0789 -0.30038,0.0294 z"
       id="path5192-0-3-8"
       style="stroke-width:0.03655764" />
    <g
       transform="matrix(0.03655764,0,0,0.03655764,201.77153,126.37985)"
       id="g5200-5-1-6">
      <path
         inkscape:connector-curvature="0"
         d="m -889.02,856.09 c 1.4967,-0.60315 13.943,-16.329 27.667,-34.922 23.042,-31.217 24.768,-34.222 22.534,-39.229 -2.3912,-5.359 -2.7394,-3.7129 -29.919,-3.7129 h -32.648 v 39.169 c 0,32.977 0.408,35.619 4.1487,37.889 3.384,2.0532 4.8567,2.1596 8.2167,0.80559 z"
         id="path5194-5-4-2" />
      <path
         inkscape:connector-curvature="0"
         d="m -889.02,763.67 c 1.4967,-0.60315 13.943,-16.329 27.667,-34.922 23.042,-31.217 24.768,-34.222 22.534,-39.229 -2.3912,-5.359 -2.7394,-3.7129 -29.919,-3.7129 h -32.648 v 39.169 c 0,32.977 0.408,35.619 4.1487,37.889 3.384,2.0532 4.8567,2.1596 8.2167,0.80559 z"
         id="path5196-2-6-4" />
      <path
         inkscape:connector-curvature="0"
         d="m -889.02,671.26 c 1.4967,-0.60315 13.943,-16.329 27.667,-34.922 23.042,-31.217 24.768,-34.222 22.534,-39.229 -2.3912,-5.359 -2.7394,-3.7129 -29.919,-3.7129 h -32.648 v 39.169 c 0,32.977 0.408,35.619 4.1487,37.889 3.384,2.0532 4.8567,2.1596 8.2167,0.80559 z"
         id="path5198-9-9-7" />
    </g>
    <g
       id="g6299-9"
       transform="translate(-5.2899343,130.74035)">
      <path
         style="stroke-width:0.00763508"
         id="path6199-3"
         d="m 173.05023,11.381145 c -0.0223,0.276238 -0.0526,0.619816 -0.0762,0.963395 -0.008,0.122619 -0.0699,0.200192 -0.16881,0.261425 q -0.95126,0.588512 -1.90114,1.179391 c -0.17018,0.10567 -0.33907,0.213783 -0.50926,0.319147 -0.24653,0.152702 -0.53041,0.205002 -0.80168,0.288911 q -1.92015,0.594392 -3.8435,1.178017 c -0.41062,0.124681 -0.32068,0.154992 -0.71304,-0.07956 -0.64898,-0.387862 -1.30087,-0.771143 -1.95038,-1.1587 -0.049,-0.02909 -0.12904,-0.04581 -0.12499,-0.114526 0.004,-0.07589 0.0902,-0.06627 0.14285,-0.08254 q 2.19891,-0.676239 4.39781,-1.348966 2.31564,-0.709834 4.6303,-1.420508 c 0.23531,-0.07223 0.47123,-0.142699 0.70647,-0.215156 0.20943,-0.06452 0.22302,-0.05482 0.21157,0.229663 z"
         inkscape:connector-curvature="0" />
      <path
         style="stroke-width:0.00763508"
         id="path6201-9"
         d="m 173.62133,14.130462 c -0.003,0.09819 -0.0662,0.122162 -0.13201,0.142394 q -0.40351,0.123842 -0.80726,0.246843 -1.89174,0.579503 -3.78364,1.159158 -1.36668,0.418479 -2.73427,0.835813 -0.62051,0.189884 -1.2404,0.381754 c -0.1414,0.04367 -0.18149,0.02291 -0.22439,-0.117428 q -0.21279,-0.696166 -0.42581,-1.39241 c -0.0126,-0.04138 -0.0498,-0.09215 -0.004,-0.126437 0.046,-0.03428 0.0847,0.01527 0.12216,0.03726 0.26998,0.158505 0.54003,0.316857 0.80795,0.478874 0.0992,0.06009 0.19507,0.07696 0.31021,0.04123 q 1.71308,-0.531783 3.42861,-1.056465 c 0.39702,-0.122162 0.7926,-0.246919 1.19107,-0.361598 0.16965,-0.04879 0.31464,-0.139341 0.46063,-0.22974 q 1.18435,-0.733349 2.3658,-1.470898 c 0.19752,-0.123078 0.19424,-0.123383 0.26189,0.101164 0.12399,0.410844 0.25081,0.820696 0.37595,1.231081 0.0115,0.0368 0.0205,0.07437 0.0273,0.09941 z"
         inkscape:connector-curvature="0" />
      <path
         style="stroke-width:0.00763508"
         id="path6203-2"
         d="m 172.83293,15.37208 c -7.2e-4,0.06871 -0.0335,0.105516 -0.0897,0.122847 q -0.4581,0.141403 -0.91728,0.281735 c -0.0916,0.02802 -0.14354,-0.02596 -0.19347,-0.09101 -0.23287,-0.303188 -0.53858,-0.422067 -0.91163,-0.336707 -0.37305,0.08536 -0.62944,0.403514 -0.65074,0.786414 -0.009,0.164536 -0.0283,0.18767 -0.18538,0.235695 q -0.66562,0.203627 -1.33095,0.408324 c -0.15682,0.04795 -0.1856,0.0313 -0.23508,-0.127887 -0.048,-0.154382 -0.098,-0.308305 -0.14354,-0.463451 -0.0363,-0.123611 -0.0125,-0.165376 0.11094,-0.203245 q 2.07689,-0.637071 4.15417,-1.273379 c 0.15118,-0.04635 0.18546,-0.02596 0.22982,0.122161 0.0452,0.151557 0.093,0.302349 0.13934,0.453601 0.009,0.03039 0.017,0.061 0.0235,0.0849 z"
         inkscape:connector-curvature="0" />
      <path
         style="stroke-width:0.00763508"
         id="path6209-8"
         d="m 170.92699,16.890621 c -0.38779,0 -0.70945,-0.320673 -0.7077,-0.704413 0.002,-0.38893 0.31701,-0.700595 0.70922,-0.701053 0.38878,-4.12e-4 0.70755,0.315787 0.70678,0.701129 -7.2e-4,0.383969 -0.32319,0.704566 -0.7083,0.704337 z"
         inkscape:connector-curvature="0" />
      <path
         style="stroke-width:0.00763508"
         id="path6211-3"
         d="m 164.01548,15.425448 c 0.0916,-0.004 0.13117,0.02642 0.14866,0.08307 q 0.14025,0.453677 0.27814,0.907888 c 0.0238,0.07895 -0.0116,0.128651 -0.0877,0.152701 -0.14415,0.04581 -0.28808,0.09162 -0.43223,0.136898 -0.0812,0.02542 -0.13995,-7.21e-4 -0.16553,-0.08299 q -0.13788,-0.443217 -0.27249,-0.887578 c -0.027,-0.08903 0,-0.14919 0.0955,-0.176752 0.15522,-0.04474 0.30915,-0.09429 0.43566,-0.133233 z"
         inkscape:connector-curvature="0" />
    </g>
    <g
       id="g6394-0"
       transform="matrix(0.04109401,0,0,0.04109401,138.65142,120.78454)">
      <path
         id="path6377-1"
         d="m 404.83,299.84 c -14.598,0 -27.263,7.8701 -34.347,19.493 -6.5727,-4.6439 -14.54,-7.4517 -23.194,-7.4517 -22.272,0 -40.367,18.095 -40.367,40.367 0,1.6367 0.30376,3.201 0.49349,4.7868 -19.235,3.0691 -34.001,19.582 -34.001,39.677 0,19.911 14.483,36.389 33.459,39.677 -0.3845,2.2356 -0.69089,4.5148 -0.69089,6.8595 0,22.272 18.095,40.318 40.367,40.318 10.909,0 20.766,-4.3575 28.03,-11.4 7.4033,8.8062 18.348,14.558 30.744,14.558 17.687,0 32.556,-11.492 37.999,-27.339 4.3567,1.6111 9.0019,2.6648 13.916,2.6648 22.272,0 40.318,-18.095 40.318,-40.367 0,-11.2 -4.5658,-21.31 -11.942,-28.622 3.7241,-6.1098 6.0206,-13.201 6.0206,-20.875 0,-22.272 -18.095,-40.318 -40.367,-40.318 -2.3445,0 -4.6242,0.25712 -6.8595,0.64154 -3.5964,-18.594 -19.938,-32.669 -39.578,-32.669 z"
         inkscape:connector-curvature="0"
         style="fill:#ffffff;stroke:#000000;stroke-width:10.85700035;stroke-linejoin:round" />
      <path
         id="path6379-7"
         d="m 183.85,484.93 a 9.5392,9.5392 0 1 1 -19.078,0 9.5392,9.5392 0 1 1 19.078,0 z"
         transform="matrix(1.5792,0,0,1.5792,170.62,-261.43)"
         inkscape:connector-curvature="0"
         style="fill:#ffffff;stroke:#000000;stroke-width:4.79879999;stroke-linejoin:round" />
      <path
         id="path6381-8"
         d="m 183.85,484.93 a 9.5392,9.5392 0 1 1 -19.078,0 9.5392,9.5392 0 1 1 19.078,0 z"
         transform="matrix(1.0961,0,0,1.0961,274.91,5.6957)"
         inkscape:connector-curvature="0"
         style="fill:#ffffff;stroke:#000000;stroke-width:5.40280008;stroke-linejoin:round" />
    </g>
    <text
       xml:space="preserve"
       style="font-style:normal;font-variant:normal;font-weight:normal;font-stretch:normal;font-size:4.23333311px;line-height:1.25;font-family:sans-serif;-inkscape-font-specification:'sans-serif, Normal';font-variant-ligatures:normal;font-variant-caps:normal;font-variant-numeric:normal;font-feature-settings:normal;text-align:start;letter-spacing:0px;word-spacing:0px;writing-mode:lr-tb;text-anchor:start;fill:#000000;fill-opacity:1;stroke:none;stroke-width:0.26458332"
       x="153.47919"
       y="138.40514"
       id="text6398-9"><tspan
         sodipodi:role="line"
         id="tspan6582"
         x="153.47919"
         y="138.40514">3</tspan></text>
    <path
       style="fill:#010101;stroke-width:0.0729618"
       inkscape:connector-curvature="0"
       d="m 103.54073,175.8749 c 0.53473,-0.13865 1.03468,-0.56136 1.23663,-1.04555 0.15569,-0.37326 0.1434,-1.1153 -0.0245,-1.47982 -0.29931,-0.64979 -0.89436,-1.01241 -1.65222,-1.0068 -0.46418,0.003 -1.04254,0.2315 -1.28426,0.50645 -0.21404,0.24346 -0.43529,0.75866 -0.47552,1.10729 -0.0763,0.66131 0.43518,1.55598 1.0322,1.80542 0.3042,0.12711 0.89341,0.18415 1.1676,0.11305 z m -16.684164,-0.0706 c 0.43183,-0.15317 0.89203,-0.55674 1.07531,-0.94288 0.0882,-0.18584 0.11243,-0.40464 0.0936,-0.84483 -0.0231,-0.54051 -0.048,-0.62539 -0.27565,-0.94164 -0.76318,-1.06014 -2.46231,-0.96099 -3.039159,0.17731 -0.267881,0.52865 -0.297791,0.95398 -0.10336,1.46988 0.36072,0.95704 1.31186,1.41473 2.24928,1.08225 z m 19.930964,-1.8123 c 0.2598,-0.0928 0.29185,-0.25155 0.29185,-1.44508 0,-0.82593 -0.0272,-1.21291 -0.0912,-1.30011 -0.0713,-0.0971 -0.83738,-0.25035 -3.5145,-0.70322 l -3.42328,-0.57909 -1.651208,-1.6455 -1.6512,-1.64551 h -9.513477 l -2.17084,1.72095 c -1.19395,0.94653 -2.24467,1.80202 -2.335,1.9011 -0.15993,0.1755 -0.16416,0.22205 -0.16416,1.80375 0,1.95333 -0.017,1.90686 0.69733,1.90686 h 0.49022 l 0.12237,-0.43777 c 0.17338,-0.62025 0.30904,-0.84519 0.74822,-1.24086 0.56163,-0.50592 0.9129,-0.64143 1.66294,-0.64143 0.742181,0 1.13645,0.14816 1.650401,0.62013 0.357569,0.32834 0.75633,1.04948 0.75837,1.37161 0.002,0.3847 -0.30409,0.36701 6.0154,0.34699 l 5.897864,-0.0187 0.12167,-0.43777 c 0.17216,-0.61948 0.30794,-0.8449 0.74749,-1.24087 0.54994,-0.49539 0.91538,-0.63945 1.62647,-0.64113 0.72167,-0.002 1.09691,0.1312 1.61136,0.57074 0.41118,0.35127 0.83286,1.06911 0.83286,1.41771 0,0.10596 0.0394,0.23205 0.0875,0.2802 0.0874,0.0874 0.93566,0.11453 1.15281,0.0369 z m -14.300504,-3.59577 c -0.0892,-0.0563 -0.11366,-0.3118 -0.13225,-1.38146 -0.0149,-0.85613 0.005,-1.36439 0.0573,-1.46201 0.0779,-0.14562 0.137191,-0.14965 2.19506,-0.14965 h 2.114937 l 1.27515,1.22094 c 1.0373,0.99323 1.27523,1.25787 1.27523,1.4186 0,0.42326 -0.0137,0.42491 -3.50013,0.42369 -1.869707,-6.7e-4 -3.220817,-0.0295 -3.285317,-0.0702 z m -6.37839,-0.14209 c -0.12223,-0.11487 -0.1882,-0.25463 -0.1882,-0.39869 0,-0.18878 0.16604,-0.38784 1.1153,-1.33709 l 1.11528,-1.11529 h 1.72424 c 0.94837,0 1.77618,0.02 1.83966,0.0442 0.0997,0.0383 0.115409,0.23501 0.115409,1.44464 0,1.01366 -0.0249,1.42524 -0.0901,1.49046 -0.0689,0.0689 -0.71761,0.0852 -2.76679,0.0693 l -2.67667,-0.0208 -0.1882,-0.17688 z"
       id="path972-0-5-5-5" />
  </g>
</svg>
