\relax 
\providecommand\babel@aux[2]{}
\@nameuse{bbl@beforestart}
\catcode `"\active 
\catcode `-\active 
\babel@aux{czech}{}
\@writefile{toc}{\contentsline {section}{\numberline {1}Hybridní systémy v Simulinku}{1}{}\protected@file@percent }
\@writefile{toc}{\contentsline {subsection}{\numberline {1.1}Úloha na cvičení}{1}{}\protected@file@percent }
\@writefile{toc}{\contentsline {subsubsection}{\numberline {1.1.1}Nádrž s vodou}{1}{}\protected@file@percent }
\@writefile{lof}{\contentsline {figure}{\numberline {1}{\ignorespaces Nádrž.\relax }}{1}{}\protected@file@percent }
\providecommand*\caption@xref[2]{\@setref\relax\@undefined{#1}}
\newlabel{fig:hydraulic_tank}{{1}{1}}
\newlabel{eq:tank1}{{1}{1}}
\newlabel{eq:tank2}{{2}{1}}
\@writefile{toc}{\contentsline {subsection}{\numberline {1.2}Kulečníková koule}{2}{}\protected@file@percent }
\@writefile{lof}{\contentsline {figure}{\numberline {2}{\ignorespaces Odraz kulečníkové koule.\relax }}{2}{}\protected@file@percent }
\newlabel{fig:ball_reflection}{{2}{2}}
\gdef \@abspage@last{2}
