\relax 
\providecommand\babel@aux[2]{}
\@nameuse{bbl@beforestart}
\catcode `"\active 
\catcode `-\active 
\babel@aux{czech}{}
\@writefile{toc}{\contentsline {section}{\numberline {1}Jakobiány}{1}{}\protected@file@percent }
\@writefile{toc}{\contentsline {subsection}{\numberline {1.1}Úloha na cvičení}{1}{}\protected@file@percent }
\@writefile{toc}{\contentsline {subsection}{\numberline {1.2}Několik řešených příkladů}{1}{}\protected@file@percent }
\@writefile{toc}{\contentsline {subsubsection}{\numberline {1.2.1}Two-link manipulator}{1}{}\protected@file@percent }
\@writefile{lof}{\contentsline {figure}{\numberline {1}{\ignorespaces 'Two-link cartesian manipulator'.\relax }}{2}{}\protected@file@percent }
\providecommand*\caption@xref[2]{\@setref\relax\@undefined{#1}}
\newlabel{fig:two_link_manipulator}{{1}{2}}
\newlabel{eq:jakobian_general}{{2}{2}}
\newlabel{eq:trans_jakobian_vypocet}{{4}{2}}
\@writefile{toc}{\contentsline {subsubsection}{\numberline {1.2.2}Dvojité kyvadlo}{3}{}\protected@file@percent }
\@writefile{lof}{\contentsline {figure}{\numberline {2}{\ignorespaces Dvojité kyvadlo.\relax }}{3}{}\protected@file@percent }
\newlabel{fig:double_pendulum}{{2}{3}}
\newlabel{eq:rot_jakobian_def}{{11}{4}}
\@writefile{toc}{\contentsline {section}{\numberline {2}Dynamika: Lagrangeova rovnice}{5}{}\protected@file@percent }
\@writefile{toc}{\contentsline {subsection}{\numberline {2.1}Úloha na cvičení}{5}{}\protected@file@percent }
\newlabel{eq:potential_energy}{{25}{6}}
\gdef \@abspage@last{6}
