w,mag,phase
0.01,2.798587740284049,0.02085993385900634
0.010392556829367126,2.798589974960364,0.021677939851957578
0.010800523745162528,2.7985923883761052,0.022527951385942407
0.011224505680853064,2.7985949948145348,0.023411211914998283
0.011665131316981962,2.7985978096981396,0.02432901212385735
0.012123054013376522,2.7986008496791133,0.025282691588992826
0.012598952777950272,2.7986041327369873,0.02627364048137926
0.013093533273536101,2.7986076782839366,0.02730330130975815
0.013607528864243332,2.7986115072783715,0.028373170702811194
0.014141701702890232,2.7986156423474076,0.0294848012281983
0.014696843861124468,2.798620107918968,0.030639803245908682
0.01527377850390714,2.7986249303641753,0.03183984679279646
0.015873361110102097,2.798630138150875,0.03308666349451388
0.016496480740980205,2.798635762009097,0.03438204850031088
0.017144061358519713,2.798641835109374,0.035727862435325344
0.017817063195457308,2.7986483932548762,0.0371260333640328
0.01851648417912155,2.798655475088394,0.0385785587574489
0.0192433614111598,2.7986631223152565,0.040087507455459595
0.01999877270535286,2.798671379943377,0.04165502161428757
0.020783838185797574,2.798680296541675,0.04328331862756184
0.021599721947827184,2.798689924518188,0.04497469300773009
0.02244763378413224,2.798700320419312,0.04673151821261026
0.023328830978641572,2.7987115452516527,0.04855624839970699
0.024244620170823284,2.798723664828107,0.050451420088481136
0.02519635929317015,2.798736750139818,0.05241965370804515
0.02618545958474233,2.7987508777558294,0.054463655004716685
0.027213387683753074,2.7987661302522717,0.05658621628048127
0.028281667802300323,2.7987825966730715,0.058790217429645596
0.02939188398646886,2.798800373024245,0.06107862673677325
0.03054568246515432,2.798819562803901,0.06345450139434841
0.031744774091091936,2.7988402775702363,0.06592098769345721
0.03299093687770941,2.798862637549801,0.06848132083508163
0.034286018635565865,2.798886772288454,0.07113882430330444
0.03563193971228586,2.7989128213474346,0.07389690873479308
0.03703069584005141,2.7989409350470704,0.07675907021130352
0.03848436109487431,2.7989712752606266,0.07972888789358579
0.039995090972036657,2.799004016260804,0.08281002090592167
0.0415651255822599,2.7990393456214138,0.08600620437054655
0.04319679297334174,2.7990774651766106,0.08932124448035698
0.04489251258218605,2.7991185920400374,0.09275901248654565
0.04665479882234473,2.7991629596860044,0.09632343746512238
0.04848626481239081,2.7992108190946583,0.10001849771264856
0.050389626250651506,2.799262439962749,0.10384821060695158
0.052367705442046525,2.7993181119812625,0.10781662075311338
0.054423435483002665,2.7993781461806706,0.11192778621871065
0.05655986461065005,2.7994428763439707,0.11618576264520754
0.05878016072274912,2.799512660486934,0.12059458500470797
0.061087616075050366,2.7995878824041385,0.12515824675315412
0.06348565216305217,2.7996689532782577,0.12988067611277665
0.06597782479539537,2.7997563133488446,0.13476570919848121
0.06856782936641742,2.799850433635409,0.13981705968535468
0.0712595063356841,2.799951817707835,0.14503828469810923
0.07405684692262439,2.8000610034952356,0.15043274658875622
0.07696399902471159,2.8001785651220756,0.15600357025690811
0.07998527336796712,2.80030511475781,0.1617535956588697
0.08312514989890632,2.80044130446339,0.1676853251482551
0.0863882844274045,2.800587828014707,0.1738008652936832
0.08977951553033323,2.8007454226794954,0.18010186282974558
0.09330387172620365,2.800914870920135,0.18658943441783096
0.0969665789314552,2.801097001990636,0.1932640899255958
0.10077306820944612,2.801292693391299,0.20012564898033633
0.10472898382363585,2.8015028721397677,0.20717315061479966
0.1088401916069006,2.8017285158120098,0.21440475590697197
0.11311278765939213,2.8019706533016198,0.22181764362105072
0.11755310738783693,2.8022303652406175,0.22940789898828265
0.12216773489967922,2.802508784020038,0.23717039592665914
0.12696351276599738,2.8028070933440388,0.2450986731905432
0.13194755216767062,2.8031265272475268,0.25318480516765185
0.13712724343984006,2.803468368504521,0.26141926830337575
0.14251026703029981,2.80383394635325,0.2697908044321571
0.1481046048880675,2.8042246334645586,0.2782862826322781
0.15391855229902057,2.804641842083297,0.2868905615919538
0.15996073018614873,2.8050870192783837,0.2955863548768975
0.16624009789266123,2.8055616412468667,0.3043541019157773
0.1727659664669036,2.8060672066311145,0.31317184796021036
0.17954801246878313,2.8066052288269203,0.3220151367166669
0.1865962923181746,2.807177227284181,0.33085691977136644
0.193921257206583,2.8077847178315705,0.3396674873142805
0.20153376859417332,2.808429202092334,0.34841442498888514
0.20944511431514698,2.809112156100074,0.3570626019207119
0.2176670253153459,2.809835018271008,0.3655741950772056
0.22621169304690253,2.8105991769418344,0.37390875504925813
0.23509178754572868,2.811405957739044,0.38202331808618056
0.2443204762186488,2.812256611104649,0.3898725687280124
0.25391144336803473,2.8131523003627423,0.3974090566341164
0.2638789104828934,2.8140940907683296,0.40458347018534124
0.274237657326495,2.8150829400315223,0.4113449681306882
0.28500304385181074,2.816119690852784,0.41764156896571364
0.2961910329772554,2.817205066034951,0.42342059589445047
0.30781821425650796,2.818339666751508,0.4286291731858609
0.3199018284775065,2.8195239745446408,0.4332147675579198
0.33245979322709407,2.8207583575984807,0.43712576599687014
0.3455107294592219,2.822043081780554,0.4403120792541118
0.35907398910610544,2.823378326867794,0.4427257582804541
0.3731696837732753,2.8247642082730673,0.44432160918582
0.3878187145610723,2.8262008044674105,0.4450577910782047
0.40304280305680523,2.8276881901561532,0.4448963804527994
0.41886452354352705,2.8292264751202594,0.4438038857614534
0.435307336473189,2.830815848485128,0.44175169645178225
0.45239562325380533,2.8324566280359975,0.4387164521409571
0.47015472240221323,2.83414931407119,0.43468031965196335
0.48861096711603264,2.8358946471797304,0.4296311683131565
0.5077917243205401,2.8376936692562853,0.42356263708422975
0.5277254352483538,2.8395477870295,0.41647409056561313
0.5484416576121018,2.8414588373834837,0.408370464590623
0.5699711094326076,2.8434291537977257,0.39926200569554304
0.5923457145875805,2.845461633316947,0.3891639121207917
0.6155986501483509,2.8475598035856735,0.37809588694312984
0.6397643955748428,2.849727889637171,0.3660816163320976
0.6648787838417265,2.8519708803056902,0.3531481876617327
0.6909790545715644,2.8542945943271074,0.33932546323523993
0.7181039092537351,2.856705746397839,0.3246454256871594
0.7462935686310136,2.8592120136682238,0.30914151075023183
0.7755898323389004,2.8618221033481834,0.2928479420857517
0.8060361408861344,2.864545822295197,0.27579908137852804
0.8376776400682919,2.8673941496348556,0.2580288050104178
0.8705612479099865,2.8703793136318803,0.23956991647709797
0.9047357242349298,2.8735148741855623,0.2204536014263727
0.9402517429670132,2.876815812471715,0.20070892988730998
0.9771619672696177,2.8802986293978727,0.18036240802581502
1.0155211276345681,2.8839814546863787,0.15943757968107555
1.0553861030365235,2.8878841685585344,0.13795467606372253
1.096816005273138,2.892028538170954,0.11593031036327904
1.1398722666160521,2.89643837116248,0.09337721263170858
1.1846187309026837,2.901139688917204,0.07030399917579387
1.2311217482038903,2.906160922448405,0.04671496978288806
1.2794502732078736,2.9115331341730504,0.022609925389868026
1.3296759674662122,2.9172902692925735,-0.0020160017571955913
1.3818733056536323,2.923469441040862,-0.02717251386210011
1.4361196859990784,2.9301112547265356,-0.052874318068625865
1.4924955450518296,2.937260176309686,-0.07914131089678665
1.5510844769528402,2.9449649522453285,-0.10599878629948116
1.6119733573881576,2.953279088536837,-0.13347767758874285
1.6752524724082152,2.9622613984224344,-0.16161484423487912
1.7410156523040161,2.9719766299295696,-0.19045341554479142
1.8093604107387162,2.982496186756129,-0.220043204556865
1.8803880893409155,2.9938989586765294,-0.25044120724216573
1.9542040079740532,3.006272281057427,-0.2817122043882555
2.0309176209047357,3.019713047273219,-0.31392948650360625
2.110642679101555,3.0343290030591863,-0.34717572589644874
2.193497398905059,3.050240258422799,-0.3815440249840114
2.2796046373189798,3.067581061037675,-0.41713917618044877
2.369092074182633,3.086501885583684,-0.45407917679753146
2.4620924014946257,3.107171906958395,-0.49249705281085454
2.558743520168588,3.1297819425977234,-0.5325430588243608
2.659188744512694,3.154547971570688,-0.574387339099724
2.763577014736159,3.1817153673896486,-0.6182231574685125
2.8720631177978286,3.211564020008653,-0.664270834206583
2.9848079169243267,3.2444145736365493,-0.7127825681737141
3.1019785901380974,3.280636075536097,-0.7640483764632516
3.2237488781490296,3.3206554237405754,-0.8184034568466743
3.3502993419772307,3.364969128487639,-0.8762373782377698
3.4818176306889654,3.4141580776715785,-0.9380056427008091
3.6184987596427476,3.4689062423802977,-1.004244356259951
3.760545399658171,3.5300246073150094,-1.0755890207575098
3.908168177536266,3.5984821128465656,-1.1527988549615136
4.061585988376979,3.675446129258605,-1.236788632178966
4.221026320156901,3.76233607473263,-1.3286708829408571
4.386725591048498,3.8608954410130343,-1.4298126164631775
4.558929499981062,3.973290044703556,-1.5419127330174824
4.737893390963144,4.102244359394892,-1.667109492048991
4.923882631706739,4.251234326774176,-1.808132579059085
5.117173007114605,4.424765948098071,-1.968522950965312
5.3180511282142,4.62878770469789,-2.1529585056657696
5.526814857144603,4.871318255574542,-2.367750140372559
5.743773748826586,5.163432828364221,-2.6216220433513264
5.969249509970735,5.520872215309491,-2.9269860765278213
6.203576476104273,5.966785797577163,-3.3021178249191063
6.447102107323871,6.536662634934402,-3.7750767728009555
6.700187503509588,7.287791502484773,-4.391249036621382
6.963207939763885,8.318953583738413,-5.229115474830846
7.2365534228696555,9.81599127831152,-6.4369775273290815
7.520629269592409,12.173447069082588,-8.332076175013347
7.815856707684089,16.392650737431165,-11.732076508732636
8.122673500479713,25.855767176848822,-19.519492807633604
8.441534596012986,56.86784316910792,-49.94933876814264
8.77291280161336,47.284036409284425,-138.48251238457314
9.117299484984922,21.07067659448509,-162.08713296226202
9.475205302806543,12.768439328369015,-168.81096182096445
9.847160957933774,8.916101489496585,-171.891127970925
10.233717986325198,6.716254652632082,-173.65048589979997
10.635449574860113,5.300533041934372,-174.7882704470962
11.052951411260215,4.316616780251221,-175.5850120676871
11.486842567375536,3.5953112634708884,-176.17470056286155
11.937766417144363,3.045445466445926,-176.62931510748865
12.406391590588319,2.6136028478324165,-176.99094574800282
12.89341296525715,2.26643129011251,-177.28583689778634
13.399552696593384,1.9820382619370598,-177.531197707111
13.925561288744627,1.7454611184661506,-177.73877981049938
14.472218707411344,1.5461271992458177,-177.91688056439938
15.040335536380251,1.376354135388096,-178.07152462811112
15.630754179458165,1.2304253625472488,-178.2071917824845
16.24435010958867,1.1039990324186872,-178.3272819988779
16.882033167003637,0.9937180601232447,-178.43442211374668
17.544748908334597,0.8969457723144227,-178.5306736511532
18.233480008684413,0.811582378400137,-178.61767706429848
18.949247718738217,0.7359348415841281,-178.69675398453595
19.693113379074227,0.6686228657365659,-178.76898107782554
20.466179993919898,0.6085098233217635,-178.83524429807048
21.269593866686908,0.5546512328887008,-178.896279349178
22.104546299710215,0.5062557957695701,-178.95270227865038
22.972275360711524,0.46265555967791766,-179.00503290017633
23.87406771860647,0.423282808363178,-179.0537129317272
24.81126055137769,0.38765197191875417,-179.09912018902492
25.785243528842738,0.3553453291201618,-179.14157979956818
26.79746087325691,0.32600160508895204,-179.18137314160967
27.849413500806442,0.2993068019366728,-179.21874502836874
28.942661247167504,0.2749867676911493,-179.25390952608075
30.07882518043099,0.2528011301942521,-179.28705469914917
31.259590004822794,0.23253831154595,-179.3183465058624
32.486706558783766,0.2140114044420865,-179.34793201648995
33.7619944111134,0.19705474090220176,-179.3759420869788
35.08734455902713,0.18152102094886385,-179.40249359236628
36.464722232127485,0.1672788969938703,-179.42769130188734
37.896169806447176,0.15421093130673702,-179.4516294607754
39.38380983288489,0.1422118606466954,-179.47439313063575
40.9298481845244,0.13118711514101428,-179.49605933005688
42.53657732750387,0.12105154868011056,-179.5166980091214
44.20637972028532,0.11172834613404102,-179.53637288516313
45.94173134636476,0.10314807906945389,-179.55514216210548
47.745205385661286,0.0952478867330347,-179.5730591517145
49.61947603002903,0.08797076314926597,-179.59017281188738
51.56732244854966,0.08126493447268957,-179.60652821450535
53.591632908485145,0.07508331340369369,-179.62216695327422
55.69540905800133,0.06938301965051578,-179.63712750026403
57.88177037701274,0.06412495719854996,-179.65144551845333
60.153958802748356,0.059273440609358685,-179.66515413642875
62.51534353689712,0.054795863777537764,-179.6782841904381
64.96942604146122,0.05066240557242364,-179.6908644382019
67.51984523072501,0.0468457676222328,-179.7029217482313
70.1703828670383,0.043320940191464874,-179.71448126784856
72.92496916841448,0.04006499268304774,-179.72556657264607
75.7876886362593,0.03705688578470654,-179.73619979972952
78.7627861118706,0.034277302690536825,-179.74640176676462
81.8546730706903,0.03170849717685889,-179.75619207856795
85.06793416364158,0.02933415660680781,-179.76558922274722
88.40733401525063,0.027139278189514934,-179.77461065569477
91.87782428863335,0.025110057034332143,-179.78327288006665
95.48455102782293,0.02323378472425566,-179.79159151473314
99.2328622883255,0.02149875729040431,-179.79958135805944
103.12831606721848,0.019894191605148902,-179.80725644526729
107.17668854455034,0.018410149328643696,-179.8146301005348
111.38398264826195,0.01703746764488417,-179.8217149844099
115.75643695533047,0.01576769611135914,-179.8285231370439
120.30053494233242,0.014593039022849256,-179.83506601768931
125.0230145991456,0.013506302756601293,-179.8413545408551
129.93087842004158,0.012500847624380737,-179.8473991094642
135.03140378698737,0.011570543807946957,-179.85320964531974
140.33215376054847,0.010709730999311825,-179.85879561715024
145.84098829439864,0.009913181406577197,-179.86416606647364
151.5660758900603,0.009176065820926725,-179.86932963149283
157.5159057091623,0.008493922471084017,-179.87429456921194
163.69930016117019,0.007862628418774715,-179.87906877594142
170.1254279852589,0.0072783732728900355,-179.883659806342
176.8038178457207,0.006737635021537324,-179.88807489114126
183.74437246107266,0.006237157800306721,-179.8923209536421
190.95738328780968,0.005773931432175475,-179.89640462513012
198.45354578058033,0.005345172589756087,-179.9003322592757
206.24397525140904,0.004948307444290606,-179.90410994561654
214.34022335148566,0.0045809556780843745,-179.9077435221973
222.75429519995586,0.004240915748123631,-179.9112385874367
231.4986671851161,0.0039261512985708045,-179.9146005112833
240.58630546440668,0.0036347786288055007,-179.91783444571686
250.0306851906324,0.0033650551317837524,-179.9209453346461
259.84581049292495,0.003115368624818448,-179.92393792324836
270.04623524206824,0.0028842275015234778,-179.9268167667933
280.6470846309839,0.00267025163968486,-179.92958623898775
291.66407760237036,0.0024721640052896014,-179.9322505398762
303.1135501567579,0.0022887828979129008,-179.93481370332813
315.0124795755328,0.0021190147871880715,-179.9372796041405
327.3785095948577,0.0019618476942043902,-179.93965196478095
340.2299765678068,0.0018163450754370583,-179.94193436179555
353.58593665351793,0.0016816401702443105,-179.94413023190282
367.4661940736688,0.001556930776102128,-179.94624287779348
381.8913304781854,0.0014414744186138663,-179.94827547365438
396.8827354637162,0.0013345838859564053,-179.950231070433
412.4626382901352,0.001235623099827768,-179.9521126008583
428.6541408420925,0.001144003297164381,-179.95392288423147
445.4812518844989,0.0010591794989167063,-179.95566463100064
462.9689226627263,0.0009806472440267175,-179.95734044713026
481.14308390032596,0.0009079395684537362,-179.95895283827795
500.03068424910947,0.0008406242106602467,-179.96050421378774
519.6597302486197,0.0007783010264079887,-179.96199689051062
540.0593278542374,0.0007205995970380129,-179.96343309646045
561.2597255954971,0.0006671770166262062,-179.96481497431415
583.2923594286206,0.0006177158445268038,-179.966144584764
606.1898993497572,0.0005719222108490218,-179.967423909729
629.9862978380693,0.0005295240633631196,-179.9686548554325
654.7168402004736,0.0004902695452090194,-179.96983925535238
680.4181968927101,0.00045392549358884405,-179.97097887305003
707.1284778942996,0.0004202760503702271,-179.9720754048833
734.8872892180387,0.00038912137621484696,-179.97313048260935
763.735791637802,0.0003602764604811971,-179.97414567588197
793.7167617217551,0.00033357001973618496,-179.9751224946485
824.8746552614581,0.0003088434782508247,-179.9760623914506
857.2556731909325,0.0002859500243544301,-179.97696676363287
890.9078300934134,0.000264753736982791,-179.97783695546406
925.8810253973954,0.0002451287771816162,-179.978674260174
962.2271173675134,0.00022695863972000004,-179.97947992190984
1000.0,0.00021013546033216618,-179.98025513761598
