timestamp,value1,value2,value3,value4
0.0,0.0,0.0,0.0,0.0
9.999999999999999e-5,2.1988522179944242e-7,0.004397671026007186,7.879409011211186e-8,0.001575872655093672
0.00034837744305283533,2.668576779475751e-6,0.015319626286244472,9.562710597661822e-7,0.005489742428546205
0.0009599957126445191,2.0261791051325475e-5,0.04220916945581716,7.260840616467788e-6,0.015125899348058964
0.0024150076498237346,0.00012819761892871007,0.10614789810433277,4.594091889288737e-5,0.0380395514931284
0.005563726005338827,0.0006800879256476284,0.24436768510001325,0.00024370820338897394,0.08756149079218091
0.011901365852586922,0.003108866007726208,0.5219553474540417,0.0011135799160201514,0.1868443777390227
0.023770864637667914,0.01237907385580705,1.0395659921159048,0.004424845253731452,0.3704932036504479
0.04369538707707751,0.041693541479486514,1.9015021232530194,0.014794615824218536,0.6675347772637511
0.06803670469641984,0.10067108820477184,2.9420192200663102,0.03517593208244042,1.000533809315645
0.09499589838293764,0.1953313429495252,4.077390818210033,0.06653548458538877,1.315049206015755
0.12598360501498201,0.3416036053803134,5.358998432516155,0.11176037115996623,1.5861999117573702
0.15855900207420687,0.5377397873534909,6.678099302989856,0.16644266164558516,1.749077580887577
0.19254760805534923,0.7876656811506008,8.02298771655229,0.22675361683059825,1.7750352472906719
0.2278165435562013,1.0947422006523206,9.384774432627301,0.28756397727262273,1.6480804610474866
0.2643812708005396,1.4631700269383745,10.761521983373338,0.3431166865209663,1.3673315064437603
0.30195621917841575,1.893565178878909,12.141459338857619,0.387035089977457,0.9522144440126811
0.3400530393092568,2.382241634035914,13.507803259845168,0.4138360192767228,0.44427762751239563
0.37808380308067907,2.9214238320714876,14.842761040132565,0.4204264296195606,-0.09938025058473827
0.41565922311706544,3.503537990177725,16.137301721996465,0.406768019676803,-0.6207621817390151
0.4542193443151721,4.151062685992957,17.44467510382013,0.3735248686979297,-1.087913430728313
0.4944591704738523,4.880166960811179,18.790439112854234,0.32192484338115723,-1.4519271742401374
0.5381528059586596,5.7327959677311755,20.234480088665077,0.2532022577814494,-1.6578524236226284
0.5782440639443629,6.5703577091721295,21.54631710638962,0.18625537000546652,-1.649715513636253
0.6188135103937177,7.471207598096882,22.861943447947493,0.12275732937112058,-1.449808535737547
0.6584186864483164,8.401892694407326,24.134052709187515,0.07195535265871321,-1.0918136468969835
0.6980169926223676,9.382512182270805,25.391684362260804,0.037853136992116974,-0.6151011888203884
0.7370666646022201,10.397991201425171,26.61479305800365,0.02412393425658549,-0.08266882727833778
0.7757291873294888,11.450073910837164,27.80542376048419,0.03124929095604978,0.44670203681442633
0.8147721783860307,12.55876338095622,28.983470541631263,0.05830015536041277,0.9249485675310474
0.8561599077731799,13.783649744956328,30.20182331989225,0.10511616994245404,1.3126870423203025
0.898574021163884,15.09048769576633,31.414760051179815,0.16621615972441559,1.5362882746916515
0.9393586851323771,16.394906095311057,32.54550276845665,0.23004782237067606,1.5624216274978062
0.9805881573706322,17.759695233303244,33.653207824659574,0.29177871557271456,1.4021934699366192
1.0216629503602195,19.164077097039442,34.72309969434005,0.34325161993648823,1.0801337031097353
1.062938643522188,20.618949638916945,35.76743114474355,0.37898859618784,0.6355325715692683
1.1037618019571724,22.09971410715154,36.773856479627305,0.3947337724396517,0.1296704006605037
1.143886661877274,23.594740212057626,37.741661793328575,0.3897355741104247,-0.37541116755579734
1.1836860923076102,25.115654821667178,38.68486032946888,0.3655114845932348,-0.8298907110762659
1.22507778395005,26.736949316172684,39.65230409372728,0.3230387121410525,-1.2011643092877617
1.2691764859081898,28.50808358345111,40.672018453732036,0.264229959234846,-1.4348981209170972
1.311338670832337,30.243317255071013,41.63919643492038,0.20225809753400015,-1.473462786276205
1.352549122811199,31.978660472183904,42.578396488829924,0.14387058171577707,-1.3313671644335336
1.393172189695653,33.72702397520732,43.497801364516434,0.09533625803271678,-1.0347534790465793
1.4333463351156397,35.49264360232808,44.398944630453414,0.061696241418237,-0.624333681901778
1.4730779096535707,37.27421536848661,45.279397082909114,0.04614155503682401,-0.15213833225962986
1.5123527992114367,39.06942803995969,46.13584192731275,0.049603010938039795,0.3256656240152734
1.5516784163469888,40.90033187838864,46.97605547342168,0.07119956350334733,0.7612765431708198
1.5933032320794567,42.87382892234984,47.842922909513725,0.11084415939628302,1.122502328909455
1.6366374846204317,44.96612671609848,48.717709892492984,0.16492104402891758,1.3441898633691554
1.6778456296983923,46.99035272302429,49.521670180208865,0.22174181125588407,1.3851853063471422
1.7195588990494595,49.072551555416304,50.30760605347189,0.27741860306947186,1.2569245444162787
1.7608437929344853,51.165096021351296,51.05916109178734,0.3240806085185142,0.9815629806368025
1.8023043161817867,53.297265524486406,51.79012735217526,0.3570340565708366,0.5931222996548532
1.8433004420286672,55.4349262639575,52.49284881168653,0.37230912994447274,0.14589421430991953
1.8837294065513623,57.57089370736045,53.17006702331579,0.3690269485897099,-0.3057338212183117
1.923790968776952,59.7142100125658,53.8294312300903,0.3483896718665012,-0.7141272628808856
1.9654993702859707,61.973510406396784,54.50730666043093,0.31120792190602864,-1.0500038195267214
2.0,63.863654668235256,55.063786244682994,0.2715850118464751,-1.2305071303288957
