<?xml version="1.0" encoding="UTF-8"?>
<!DOCTYPE X3D PUBLIC "ISO//Web3D//DTD X3D 3.1//EN" "http://www.web3d.org/specifications/x3d-3.1.dtd">
<X3D profile='Interchange' version='3.1' xmlns:xsd='http://www.w3.org/2001/XMLSchema-instance' xsd:noNamespaceSchemaLocation='http://www.web3d.org/specifications/x3d-3.1.xsd'>
  <head>
    <meta content='Cylinder.x3d' name='title'/>
    <meta content='Cylinder geometric primitive node.' name='description'/>
    <meta content='Leonard Daly and Don Brutzman' name='creator'/>
    <meta content='1 January 2007' name='created'/>
    <meta content='27 December 2007' name='modified'/>
    <meta content='http://X3dGraphics.com' name='reference'/>
    <meta content='http://www.web3d.org/x3d/content/examples/X3dResources.html' name='reference'/>
    <meta content='Copyright Don Brutzman and Leonard Daly 2007' name='rights'/>
    <meta content='X3D book, X3D graphics, X3D-Edit, http://www.x3dGraphics.com' name='subject'/>
    <meta content='http://X3dGraphics.com/examples/X3dForWebAuthors/Chapter02-GeometryPrimitives/Cylinder.x3d' name='identifier'/>
    <meta content='X3D-Edit 3.3, https://savage.nps.edu/X3D-Edit' name='generator'/>
    <meta content='../license.html' name='license'/>
  </head>
  <Scene>
    <Background skyColor='1 1 1'/>
    <Viewpoint description='Book View' orientation='-1 0. 0 0.68' position='0 2.9 4.83'/>
    <Shape>
      <Cylinder bottom='true' radius='2' side='true' solid='false' top='false'/>
      <Appearance>
        <Material/>
      </Appearance>
    </Shape>
  </Scene>
</X3D>