%!PS-Adobe-3.0 EPSF-3.0
%%Creator: (MATLAB, The Mathworks, Inc. Version 9.14.0.2206163 \(R2023a\). Operating System: Windows 10)
%%Title: C:/Users/radac/Desktop/Bachelor_thesis/thesis/Metody/fig/EKF_average/RMSE_300.eps
%%CreationDate: 2023-05-22T00:13:42
%%Pages: (atend)
%%BoundingBox:     0     0   420   315
%%LanguageLevel: 3
%%EndComments
%%BeginProlog
%%BeginResource: procset (Apache XML Graphics Std ProcSet) 1.2 0
%%Version: 1.2 0
%%Copyright: (Copyright 2001-2003,2010 The Apache Software Foundation. License terms: http://www.apache.org/licenses/LICENSE-2.0)
/bd{bind def}bind def
/ld{load def}bd
/GR/grestore ld
/GS/gsave ld
/RM/rmoveto ld
/C/curveto ld
/t/show ld
/L/lineto ld
/ML/setmiterlimit ld
/CT/concat ld
/f/fill ld
/N/newpath ld
/S/stroke ld
/CC/setcmykcolor ld
/A/ashow ld
/cp/closepath ld
/RC/setrgbcolor ld
/LJ/setlinejoin ld
/GC/setgray ld
/LW/setlinewidth ld
/M/moveto ld
/re {4 2 roll M
1 index 0 rlineto
0 exch rlineto
neg 0 rlineto
cp } bd
/_ctm matrix def
/_tm matrix def
/BT { _ctm currentmatrix pop matrix _tm copy pop 0 0 moveto } bd
/ET { _ctm setmatrix } bd
/iTm { _ctm setmatrix _tm concat } bd
/Tm { _tm astore pop iTm 0 0 moveto } bd
/ux 0.0 def
/uy 0.0 def
/F {
  /Tp exch def
  /Tf exch def
  Tf findfont Tp scalefont setfont
  /cf Tf def  /cs Tp def
} bd
/ULS {currentpoint /uy exch def /ux exch def} bd
/ULE {
  /Tcx currentpoint pop def
  gsave
  newpath
  cf findfont cs scalefont dup
  /FontMatrix get 0 get /Ts exch def /FontInfo get dup
  /UnderlinePosition get Ts mul /To exch def
  /UnderlineThickness get Ts mul /Tt exch def
  ux uy To add moveto  Tcx uy To add lineto
  Tt setlinewidth stroke
  grestore
} bd
/OLE {
  /Tcx currentpoint pop def
  gsave
  newpath
  cf findfont cs scalefont dup
  /FontMatrix get 0 get /Ts exch def /FontInfo get dup
  /UnderlinePosition get Ts mul /To exch def
  /UnderlineThickness get Ts mul /Tt exch def
  ux uy To add cs add moveto Tcx uy To add cs add lineto
  Tt setlinewidth stroke
  grestore
} bd
/SOE {
  /Tcx currentpoint pop def
  gsave
  newpath
  cf findfont cs scalefont dup
  /FontMatrix get 0 get /Ts exch def /FontInfo get dup
  /UnderlinePosition get Ts mul /To exch def
  /UnderlineThickness get Ts mul /Tt exch def
  ux uy To add cs 10 mul 26 idiv add moveto Tcx uy To add cs 10 mul 26 idiv add lineto
  Tt setlinewidth stroke
  grestore
} bd
/QT {
/Y22 exch store
/X22 exch store
/Y21 exch store
/X21 exch store
currentpoint
/Y21 load 2 mul add 3 div exch
/X21 load 2 mul add 3 div exch
/X21 load 2 mul /X22 load add 3 div
/Y21 load 2 mul /Y22 load add 3 div
/X22 load /Y22 load curveto
} bd
/SSPD {
dup length /d exch dict def
{
/v exch def
/k exch def
currentpagedevice k known {
/cpdv currentpagedevice k get def
v cpdv ne {
/upd false def
/nullv v type /nulltype eq def
/nullcpdv cpdv type /nulltype eq def
nullv nullcpdv or
{
/upd true def
} {
/sametype v type cpdv type eq def
sametype {
v type /arraytype eq {
/vlen v length def
/cpdvlen cpdv length def
vlen cpdvlen eq {
0 1 vlen 1 sub {
/i exch def
/obj v i get def
/cpdobj cpdv i get def
obj cpdobj ne {
/upd true def
exit
} if
} for
} {
/upd true def
} ifelse
} {
v type /dicttype eq {
v {
/dv exch def
/dk exch def
/cpddv cpdv dk get def
dv cpddv ne {
/upd true def
exit
} if
} forall
} {
/upd true def
} ifelse
} ifelse
} if
} ifelse
upd true eq {
d k v put
} if
} if
} if
} forall
d length 0 gt {
d setpagedevice
} if
} bd
/RE { % /NewFontName [NewEncodingArray] /FontName RE -
  findfont dup length dict begin
  {
    1 index /FID ne
    {def} {pop pop} ifelse
  } forall
  /Encoding exch def
  /FontName 1 index def
  currentdict definefont pop
  end
} bind def
%%EndResource
%%BeginResource: procset (Apache XML Graphics EPS ProcSet) 1.0 0
%%Version: 1.0 0
%%Copyright: (Copyright 2002-2003 The Apache Software Foundation. License terms: http://www.apache.org/licenses/LICENSE-2.0)
/BeginEPSF { %def
/b4_Inc_state save def         % Save state for cleanup
/dict_count countdictstack def % Count objects on dict stack
/op_count count 1 sub def      % Count objects on operand stack
userdict begin                 % Push userdict on dict stack
/showpage { } def              % Redefine showpage, { } = null proc
0 setgray 0 setlinecap         % Prepare graphics state
1 setlinewidth 0 setlinejoin
10 setmiterlimit [ ] 0 setdash newpath
/languagelevel where           % If level not equal to 1 then
{pop languagelevel             % set strokeadjust and
1 ne                           % overprint to their defaults.
{false setstrokeadjust false setoverprint
} if
} if
} bd
/EndEPSF { %def
count op_count sub {pop} repeat            % Clean up stacks
countdictstack dict_count sub {end} repeat
b4_Inc_state restore
} bd
%%EndResource
%FOPBeginFontDict
%%IncludeResource: font Courier-Oblique
%%IncludeResource: font Courier-BoldOblique
%%IncludeResource: font Courier-Bold
%%IncludeResource: font ZapfDingbats
%%IncludeResource: font Symbol
%%IncludeResource: font Helvetica
%%IncludeResource: font Helvetica-Oblique
%%IncludeResource: font Helvetica-Bold
%%IncludeResource: font Helvetica-BoldOblique
%%IncludeResource: font Times-Roman
%%IncludeResource: font Times-Italic
%%IncludeResource: font Times-Bold
%%IncludeResource: font Times-BoldItalic
%%IncludeResource: font Courier
%FOPEndFontDict
%%BeginResource: encoding WinAnsiEncoding
/WinAnsiEncoding [
/.notdef /.notdef /.notdef /.notdef /.notdef
/.notdef /.notdef /.notdef /.notdef /.notdef
/.notdef /.notdef /.notdef /.notdef /.notdef
/.notdef /.notdef /.notdef /.notdef /.notdef
/.notdef /.notdef /.notdef /.notdef /.notdef
/.notdef /.notdef /.notdef /.notdef /.notdef
/.notdef /.notdef /space /exclam /quotedbl
/numbersign /dollar /percent /ampersand /quotesingle
/parenleft /parenright /asterisk /plus /comma
/hyphen /period /slash /zero /one
/two /three /four /five /six
/seven /eight /nine /colon /semicolon
/less /equal /greater /question /at
/A /B /C /D /E
/F /G /H /I /J
/K /L /M /N /O
/P /Q /R /S /T
/U /V /W /X /Y
/Z /bracketleft /backslash /bracketright /asciicircum
/underscore /quoteleft /a /b /c
/d /e /f /g /h
/i /j /k /l /m
/n /o /p /q /r
/s /t /u /v /w
/x /y /z /braceleft /bar
/braceright /asciitilde /bullet /Euro /bullet
/quotesinglbase /florin /quotedblbase /ellipsis /dagger
/daggerdbl /circumflex /perthousand /Scaron /guilsinglleft
/OE /bullet /Zcaron /bullet /bullet
/quoteleft /quoteright /quotedblleft /quotedblright /bullet
/endash /emdash /asciitilde /trademark /scaron
/guilsinglright /oe /bullet /zcaron /Ydieresis
/space /exclamdown /cent /sterling /currency
/yen /brokenbar /section /dieresis /copyright
/ordfeminine /guillemotleft /logicalnot /sfthyphen /registered
/macron /degree /plusminus /twosuperior /threesuperior
/acute /mu /paragraph /middot /cedilla
/onesuperior /ordmasculine /guillemotright /onequarter /onehalf
/threequarters /questiondown /Agrave /Aacute /Acircumflex
/Atilde /Adieresis /Aring /AE /Ccedilla
/Egrave /Eacute /Ecircumflex /Edieresis /Igrave
/Iacute /Icircumflex /Idieresis /Eth /Ntilde
/Ograve /Oacute /Ocircumflex /Otilde /Odieresis
/multiply /Oslash /Ugrave /Uacute /Ucircumflex
/Udieresis /Yacute /Thorn /germandbls /agrave
/aacute /acircumflex /atilde /adieresis /aring
/ae /ccedilla /egrave /eacute /ecircumflex
/edieresis /igrave /iacute /icircumflex /idieresis
/eth /ntilde /ograve /oacute /ocircumflex
/otilde /odieresis /divide /oslash /ugrave
/uacute /ucircumflex /udieresis /yacute /thorn
/ydieresis
] def
%%EndResource
%FOPBeginFontReencode
/Courier-Oblique findfont
dup length dict begin
  {1 index /FID ne {def} {pop pop} ifelse} forall
  /Encoding WinAnsiEncoding def
  currentdict
end
/Courier-Oblique exch definefont pop
/Courier-BoldOblique findfont
dup length dict begin
  {1 index /FID ne {def} {pop pop} ifelse} forall
  /Encoding WinAnsiEncoding def
  currentdict
end
/Courier-BoldOblique exch definefont pop
/Courier-Bold findfont
dup length dict begin
  {1 index /FID ne {def} {pop pop} ifelse} forall
  /Encoding WinAnsiEncoding def
  currentdict
end
/Courier-Bold exch definefont pop
/Helvetica findfont
dup length dict begin
  {1 index /FID ne {def} {pop pop} ifelse} forall
  /Encoding WinAnsiEncoding def
  currentdict
end
/Helvetica exch definefont pop
/Helvetica-Oblique findfont
dup length dict begin
  {1 index /FID ne {def} {pop pop} ifelse} forall
  /Encoding WinAnsiEncoding def
  currentdict
end
/Helvetica-Oblique exch definefont pop
/Helvetica-Bold findfont
dup length dict begin
  {1 index /FID ne {def} {pop pop} ifelse} forall
  /Encoding WinAnsiEncoding def
  currentdict
end
/Helvetica-Bold exch definefont pop
/Helvetica-BoldOblique findfont
dup length dict begin
  {1 index /FID ne {def} {pop pop} ifelse} forall
  /Encoding WinAnsiEncoding def
  currentdict
end
/Helvetica-BoldOblique exch definefont pop
/Times-Roman findfont
dup length dict begin
  {1 index /FID ne {def} {pop pop} ifelse} forall
  /Encoding WinAnsiEncoding def
  currentdict
end
/Times-Roman exch definefont pop
/Times-Italic findfont
dup length dict begin
  {1 index /FID ne {def} {pop pop} ifelse} forall
  /Encoding WinAnsiEncoding def
  currentdict
end
/Times-Italic exch definefont pop
/Times-Bold findfont
dup length dict begin
  {1 index /FID ne {def} {pop pop} ifelse} forall
  /Encoding WinAnsiEncoding def
  currentdict
end
/Times-Bold exch definefont pop
/Times-BoldItalic findfont
dup length dict begin
  {1 index /FID ne {def} {pop pop} ifelse} forall
  /Encoding WinAnsiEncoding def
  currentdict
end
/Times-BoldItalic exch definefont pop
/Courier findfont
dup length dict begin
  {1 index /FID ne {def} {pop pop} ifelse} forall
  /Encoding WinAnsiEncoding def
  currentdict
end
/Courier exch definefont pop
%FOPEndFontReencode
%%EndProlog
%%Page: 1 1
%%PageBoundingBox: 0 0 420 315
%%BeginPageSetup
[1 0 0 -1 0 315] CT
%%EndPageSetup
GS
[0.6 0 0 0.6 0 0] CT
1 GC
N
0 0 700 525 re
f
GR
GS
[0.6 0 0 0.6 0 0] CT
1 GC
N
0 0 700 525 re
f
GR
GS
[0.6 0 0 0.6 0 0] CT
1 GC
N
104 454 M
634 454 L
634 39 L
104 39 L
cp
f
GR
GS
[0.6 0 0 0.6 0 0] CT
0.873 GC
1 LJ
0.833 LW
N
104 454 M
104 39 L
S
GR
GS
[0.6 0 0 0.6 0 0] CT
0.873 GC
1 LJ
0.833 LW
N
192.333 454 M
192.333 39 L
S
GR
GS
[0.6 0 0 0.6 0 0] CT
0.873 GC
1 LJ
0.833 LW
N
280.667 454 M
280.667 39 L
S
GR
GS
[0.6 0 0 0.6 0 0] CT
0.873 GC
1 LJ
0.833 LW
N
369 454 M
369 39 L
S
GR
GS
[0.6 0 0 0.6 0 0] CT
0.873 GC
1 LJ
0.833 LW
N
457.333 454 M
457.333 39 L
S
GR
GS
[0.6 0 0 0.6 0 0] CT
0.873 GC
1 LJ
0.833 LW
N
545.667 454 M
545.667 39 L
S
GR
GS
[0.6 0 0 0.6 0 0] CT
0.873 GC
1 LJ
0.833 LW
N
634 454 M
634 39 L
S
GR
GS
[0.6 0 0 0.6 0 0] CT
0.873 GC
1 LJ
0.833 LW
N
634 451.355 M
104 451.355 L
S
GR
GS
[0.6 0 0 0.6 0 0] CT
0.873 GC
1 LJ
0.833 LW
N
634 385.957 M
104 385.957 L
S
GR
GS
[0.6 0 0 0.6 0 0] CT
0.873 GC
1 LJ
0.833 LW
N
634 320.56 M
104 320.56 L
S
GR
GS
[0.6 0 0 0.6 0 0] CT
0.873 GC
1 LJ
0.833 LW
N
634 255.162 M
104 255.162 L
S
GR
GS
[0.6 0 0 0.6 0 0] CT
0.873 GC
1 LJ
0.833 LW
N
634 189.764 M
104 189.764 L
S
GR
GS
[0.6 0 0 0.6 0 0] CT
0.873 GC
1 LJ
0.833 LW
N
634 124.366 M
104 124.366 L
S
GR
GS
[0.6 0 0 0.6 0 0] CT
0.873 GC
1 LJ
0.833 LW
N
634 58.968 M
104 58.968 L
S
GR
GS
[0.6 0 0 0.6 0 0] CT
0.149 GC
2 setlinecap
1 LJ
0.833 LW
N
104 454 M
634 454 L
S
GR
GS
[0.6 0 0 0.6 0 0] CT
0.149 GC
2 setlinecap
1 LJ
0.833 LW
N
104 39 M
634 39 L
S
GR
GS
[0.6 0 0 0.6 0 0] CT
0.149 GC
2 setlinecap
1 LJ
0.833 LW
N
104 454 M
104 448.7 L
S
GR
GS
[0.6 0 0 0.6 0 0] CT
0.149 GC
2 setlinecap
1 LJ
0.833 LW
N
192.333 454 M
192.333 448.7 L
S
GR
GS
[0.6 0 0 0.6 0 0] CT
0.149 GC
2 setlinecap
1 LJ
0.833 LW
N
280.667 454 M
280.667 448.7 L
S
GR
GS
[0.6 0 0 0.6 0 0] CT
0.149 GC
2 setlinecap
1 LJ
0.833 LW
N
369 454 M
369 448.7 L
S
GR
GS
[0.6 0 0 0.6 0 0] CT
0.149 GC
2 setlinecap
1 LJ
0.833 LW
N
457.333 454 M
457.333 448.7 L
S
GR
GS
[0.6 0 0 0.6 0 0] CT
0.149 GC
2 setlinecap
1 LJ
0.833 LW
N
545.667 454 M
545.667 448.7 L
S
GR
GS
[0.6 0 0 0.6 0 0] CT
0.149 GC
2 setlinecap
1 LJ
0.833 LW
N
634 454 M
634 448.7 L
S
GR
GS
[0.6 0 0 0.6 0 0] CT
0.149 GC
2 setlinecap
1 LJ
0.833 LW
N
104 39 M
104 44.3 L
S
GR
GS
[0.6 0 0 0.6 0 0] CT
0.149 GC
2 setlinecap
1 LJ
0.833 LW
N
192.333 39 M
192.333 44.3 L
S
GR
GS
[0.6 0 0 0.6 0 0] CT
0.149 GC
2 setlinecap
1 LJ
0.833 LW
N
280.667 39 M
280.667 44.3 L
S
GR
GS
[0.6 0 0 0.6 0 0] CT
0.149 GC
2 setlinecap
1 LJ
0.833 LW
N
369 39 M
369 44.3 L
S
GR
GS
[0.6 0 0 0.6 0 0] CT
0.149 GC
2 setlinecap
1 LJ
0.833 LW
N
457.333 39 M
457.333 44.3 L
S
GR
GS
[0.6 0 0 0.6 0 0] CT
0.149 GC
2 setlinecap
1 LJ
0.833 LW
N
545.667 39 M
545.667 44.3 L
S
GR
GS
[0.6 0 0 0.6 0 0] CT
0.149 GC
2 setlinecap
1 LJ
0.833 LW
N
634 39 M
634 44.3 L
S
GR
GS
[0.6 0 0 0.6 62.4 277.2] CT
0.149 GC
/Helvetica 23.333 F
GS
[1 0 0 1 0 0] CT
-6.5 24 moveto 
1 -1 scale
(0) t 
GR
GR
GS
[0.6 0 0 0.6 115.4 277.2] CT
0.149 GC
/Helvetica 23.333 F
GS
[1 0 0 1 0 0] CT
-13 24 moveto 
1 -1 scale
(50) t 
GR
GR
GS
[0.6 0 0 0.6 168.39999 277.2] CT
0.149 GC
/Helvetica 23.333 F
GS
[1 0 0 1 0 0] CT
-19.5 24 moveto 
1 -1 scale
(100) t 
GR
GR
GS
[0.6 0 0 0.6 221.4 277.2] CT
0.149 GC
/Helvetica 23.333 F
GS
[1 0 0 1 0 0] CT
-19.5 24 moveto 
1 -1 scale
(150) t 
GR
GR
GS
[0.6 0 0 0.6 274.40001 277.2] CT
0.149 GC
/Helvetica 23.333 F
GS
[1 0 0 1 0 0] CT
-19.5 24 moveto 
1 -1 scale
(200) t 
GR
GR
GS
[0.6 0 0 0.6 327.40001 277.2] CT
0.149 GC
/Helvetica 23.333 F
GS
[1 0 0 1 0 0] CT
-19.5 24 moveto 
1 -1 scale
(250) t 
GR
GR
GS
[0.6 0 0 0.6 380.4 277.2] CT
0.149 GC
/Helvetica 23.333 F
GS
[1 0 0 1 0 0] CT
-19.5 24 moveto 
1 -1 scale
(300) t 
GR
GR
GS
[0.6 0 0 0.6 221.40015 295.59999] CT
0.149 GC
N
-178.781 31.172 M
-178.781 12.516 L
-176.703 12.516 L
-176.703 14.266 L
-175.969 13.234 -175.039 12.727 QT
-174.109 12.219 -172.797 12.219 QT
-171.063 12.219 -169.742 13.102 QT
-168.422 13.984 -167.75 15.609 QT
-167.078 17.234 -167.078 19.156 QT
-167.078 21.219 -167.82 22.883 QT
-168.563 24.547 -169.977 25.43 QT
-171.391 26.313 -172.953 26.313 QT
-174.094 26.313 -175.008 25.828 QT
-175.922 25.344 -176.5 24.609 QT
-176.5 31.172 L
-178.781 31.172 L
cp
-176.719 19.328 M
-176.719 21.938 -175.664 23.18 QT
-174.609 24.422 -173.109 24.422 QT
-171.594 24.422 -170.508 23.133 QT
-169.422 21.844 -169.422 19.141 QT
-169.422 16.563 -170.477 15.281 QT
-171.531 14 -173.016 14 QT
-174.469 14 -175.594 15.367 QT
-176.719 16.734 -176.719 19.328 QT
cp
-165.372 19.266 M
-165.372 15.516 -163.278 13.703 QT
-161.544 12.219 -159.044 12.219 QT
-156.262 12.219 -154.497 14.039 QT
-152.731 15.859 -152.731 19.063 QT
-152.731 21.672 -153.512 23.164 QT
-154.294 24.656 -155.786 25.484 QT
-157.278 26.313 -159.044 26.313 QT
-161.872 26.313 -163.622 24.492 QT
-165.372 22.672 -165.372 19.266 QT
cp
-163.012 19.266 M
-163.012 21.844 -161.887 23.133 QT
-160.762 24.422 -159.044 24.422 QT
-157.341 24.422 -156.216 23.125 QT
-155.091 21.828 -155.091 19.188 QT
-155.091 16.688 -156.223 15.398 QT
-157.356 14.109 -159.044 14.109 QT
-160.762 14.109 -161.887 15.391 QT
-163.012 16.672 -163.012 19.266 QT
cp
-141.447 21.063 M
-139.197 21.359 L
-139.572 23.672 -141.087 24.992 QT
-142.603 26.313 -144.822 26.313 QT
-147.587 26.313 -149.267 24.5 QT
-150.947 22.688 -150.947 19.313 QT
-150.947 17.125 -150.22 15.484 QT
-149.494 13.844 -148.017 13.031 QT
-146.541 12.219 -144.806 12.219 QT
-142.603 12.219 -141.205 13.328 QT
-139.806 14.438 -139.416 16.484 QT
-141.634 16.828 L
-141.962 15.469 -142.767 14.781 QT
-143.572 14.094 -144.712 14.094 QT
-146.447 14.094 -147.525 15.328 QT
-148.603 16.563 -148.603 19.25 QT
-148.603 21.969 -147.556 23.195 QT
-146.509 24.422 -144.837 24.422 QT
-143.494 24.422 -142.595 23.602 QT
-141.697 22.781 -141.447 21.063 QT
cp
-145.4 9.594 M
-144.009 7.438 L
-141.416 7.438 L
-144.275 11 L
-146.712 11 L
-149.447 7.438 L
-146.837 7.438 L
-145.4 9.594 L
cp
-128.197 21.656 M
-125.822 21.953 L
-126.384 24.016 -127.9 25.164 QT
-129.416 26.313 -131.759 26.313 QT
-134.712 26.313 -136.447 24.484 QT
-138.181 22.656 -138.181 19.375 QT
-138.181 15.969 -136.431 14.094 QT
-134.681 12.219 -131.884 12.219 QT
-129.181 12.219 -127.47 14.055 QT
-125.759 15.891 -125.759 19.234 QT
-125.759 19.438 -125.759 19.844 QT
-135.822 19.844 L
-135.697 22.063 -134.564 23.242 QT
-133.431 24.422 -131.744 24.422 QT
-130.494 24.422 -129.603 23.766 QT
-128.712 23.109 -128.197 21.656 QT
cp
-135.697 17.969 M
-128.166 17.969 L
-128.322 16.266 -129.025 15.406 QT
-130.119 14.094 -131.853 14.094 QT
-133.431 14.094 -134.501 15.148 QT
-135.572 16.203 -135.697 17.969 QT
cp
-118.162 23.953 M
-117.834 25.969 L
-118.803 26.172 -119.553 26.172 QT
-120.803 26.172 -121.491 25.781 QT
-122.178 25.391 -122.451 24.75 QT
-122.725 24.109 -122.725 22.047 QT
-122.725 14.297 L
-124.412 14.297 L
-124.412 12.516 L
-122.725 12.516 L
-122.725 9.172 L
-120.459 7.813 L
-120.459 12.516 L
-118.162 12.516 L
-118.162 14.297 L
-120.459 14.297 L
-120.459 22.172 L
-120.459 23.156 -120.342 23.438 QT
-120.225 23.719 -119.951 23.883 QT
-119.678 24.047 -119.162 24.047 QT
-118.787 24.047 -118.162 23.953 QT
cp
-108.891 31.172 M
-108.891 12.516 L
-106.812 12.516 L
-106.812 14.266 L
-106.078 13.234 -105.148 12.727 QT
-104.219 12.219 -102.906 12.219 QT
-101.172 12.219 -99.851 13.102 QT
-98.531 13.984 -97.859 15.609 QT
-97.187 17.234 -97.187 19.156 QT
-97.187 21.219 -97.93 22.883 QT
-98.672 24.547 -100.086 25.43 QT
-101.5 26.313 -103.062 26.313 QT
-104.203 26.313 -105.117 25.828 QT
-106.031 25.344 -106.609 24.609 QT
-106.609 31.172 L
-108.891 31.172 L
cp
-106.828 19.328 M
-106.828 21.938 -105.773 23.18 QT
-104.719 24.422 -103.219 24.422 QT
-101.703 24.422 -100.617 23.133 QT
-99.531 21.844 -99.531 19.141 QT
-99.531 16.563 -100.586 15.281 QT
-101.641 14 -103.125 14 QT
-104.578 14 -105.703 15.367 QT
-106.828 16.734 -106.828 19.328 QT
cp
-94.653 26 M
-94.653 12.516 L
-92.59 12.516 L
-92.59 14.563 L
-91.809 13.125 -91.145 12.672 QT
-90.481 12.219 -89.669 12.219 QT
-88.512 12.219 -87.325 12.953 QT
-88.106 15.063 L
-88.95 14.578 -89.794 14.578 QT
-90.544 14.578 -91.137 15.023 QT
-91.731 15.469 -91.981 16.281 QT
-92.372 17.5 -92.372 18.938 QT
-92.372 26 L
-94.653 26 L
cp
-77.25 26 M
-77.25 24.016 L
-78.828 26.313 -81.531 26.313 QT
-82.719 26.313 -83.75 25.852 QT
-84.781 25.391 -85.289 24.695 QT
-85.797 24 -86 23 QT
-86.141 22.328 -86.141 20.875 QT
-86.141 12.516 L
-83.844 12.516 L
-83.844 20 L
-83.844 21.781 -83.703 22.406 QT
-83.5 23.313 -82.797 23.828 QT
-82.094 24.344 -81.062 24.344 QT
-80.047 24.344 -79.141 23.813 QT
-78.234 23.281 -77.859 22.375 QT
-77.484 21.469 -77.484 19.734 QT
-77.484 12.516 L
-75.203 12.516 L
-75.203 26 L
-77.25 26 L
cp
-82.734 8.625 M
-82.734 7.703 -82.055 7.023 QT
-81.375 6.344 -80.453 6.344 QT
-79.516 6.344 -78.844 7.023 QT
-78.172 7.703 -78.172 8.672 QT
-78.172 9.656 -78.844 10.328 QT
-79.516 11 -80.437 11 QT
-81.391 11 -82.062 10.32 QT
-82.734 9.641 -82.734 8.625 QT
cp
-81.781 8.641 M
-81.781 9.234 -81.375 9.641 QT
-80.969 10.047 -80.422 10.047 QT
-79.891 10.047 -79.484 9.641 QT
-79.078 9.234 -79.078 8.656 QT
-79.078 8.094 -79.476 7.688 QT
-79.875 7.281 -80.422 7.281 QT
-80.969 7.281 -81.375 7.68 QT
-81.781 8.078 -81.781 8.641 QT
cp
-71.809 26 M
-71.809 12.516 L
-69.762 12.516 L
-69.762 14.406 L
-69.137 13.422 -68.083 12.82 QT
-67.028 12.219 -65.684 12.219 QT
-64.184 12.219 -63.223 12.836 QT
-62.262 13.453 -61.872 14.578 QT
-60.278 12.219 -57.715 12.219 QT
-55.7 12.219 -54.622 13.328 QT
-53.544 14.438 -53.544 16.75 QT
-53.544 26 L
-55.825 26 L
-55.825 17.5 L
-55.825 16.141 -56.044 15.531 QT
-56.262 14.922 -56.848 14.555 QT
-57.434 14.188 -58.215 14.188 QT
-59.637 14.188 -60.575 15.133 QT
-61.512 16.078 -61.512 18.172 QT
-61.512 26 L
-63.809 26 L
-63.809 17.234 L
-63.809 15.719 -64.364 14.953 QT
-64.919 14.188 -66.184 14.188 QT
-67.153 14.188 -67.973 14.695 QT
-68.794 15.203 -69.161 16.18 QT
-69.528 17.156 -69.528 19 QT
-69.528 26 L
-71.809 26 L
cp
-41.219 21.656 M
-38.844 21.953 L
-39.406 24.016 -40.922 25.164 QT
-42.437 26.313 -44.781 26.313 QT
-47.734 26.313 -49.469 24.484 QT
-51.203 22.656 -51.203 19.375 QT
-51.203 15.969 -49.453 14.094 QT
-47.703 12.219 -44.906 12.219 QT
-42.203 12.219 -40.492 14.055 QT
-38.781 15.891 -38.781 19.234 QT
-38.781 19.438 -38.781 19.844 QT
-48.844 19.844 L
-48.719 22.063 -47.586 23.242 QT
-46.453 24.422 -44.765 24.422 QT
-43.515 24.422 -42.625 23.766 QT
-41.734 23.109 -41.219 21.656 QT
cp
-48.719 17.969 M
-41.187 17.969 L
-41.344 16.266 -42.047 15.406 QT
-43.14 14.094 -44.875 14.094 QT
-46.453 14.094 -47.523 15.148 QT
-48.594 16.203 -48.719 17.969 QT
cp
-45.156 9.594 M
-43.765 7.438 L
-41.172 7.438 L
-44.031 11 L
-46.469 11 L
-49.203 7.438 L
-46.594 7.438 L
-45.156 9.594 L
cp
-36.2 26 M
-36.2 12.516 L
-34.137 12.516 L
-34.137 14.563 L
-33.356 13.125 -32.692 12.672 QT
-32.028 12.219 -31.215 12.219 QT
-30.059 12.219 -28.872 12.953 QT
-29.653 15.063 L
-30.497 14.578 -31.34 14.578 QT
-32.09 14.578 -32.684 15.023 QT
-33.278 15.469 -33.528 16.281 QT
-33.919 17.5 -33.919 18.938 QT
-33.919 26 L
-36.2 26 L
cp
-28.484 19.266 M
-28.484 15.516 -26.39 13.703 QT
-24.656 12.219 -22.156 12.219 QT
-19.375 12.219 -17.609 14.039 QT
-15.844 15.859 -15.844 19.063 QT
-15.844 21.672 -16.625 23.164 QT
-17.406 24.656 -18.898 25.484 QT
-20.39 26.313 -22.156 26.313 QT
-24.984 26.313 -26.734 24.492 QT
-28.484 22.672 -28.484 19.266 QT
cp
-26.125 19.266 M
-26.125 21.844 -25 23.133 QT
-23.875 24.422 -22.156 24.422 QT
-20.453 24.422 -19.328 23.125 QT
-18.203 21.828 -18.203 19.188 QT
-18.203 16.688 -19.336 15.398 QT
-20.469 14.109 -22.156 14.109 QT
-23.875 14.109 -25 15.391 QT
-26.125 16.672 -26.125 19.266 QT
cp
-9.622 26 M
-14.747 12.516 L
-12.325 12.516 L
-9.434 20.594 L
-8.965 21.906 -8.575 23.313 QT
-8.262 22.234 -7.731 20.75 QT
-4.731 12.516 L
-2.372 12.516 L
-7.481 26 L
-9.622 26 L
cp
8.269 24.344 M
7.003 25.422 5.824 25.867 QT
4.644 26.313 3.3 26.313 QT
1.081 26.313 -0.114 25.227 QT
-1.309 24.141 -1.309 22.438 QT
-1.309 21.453 -0.856 20.633 QT
-0.403 19.813 0.324 19.32 QT
1.05 18.828 1.972 18.578 QT
2.644 18.391 4.003 18.234 QT
6.769 17.906 8.081 17.438 QT
8.081 16.969 8.081 16.844 QT
8.081 15.453 7.441 14.875 QT
6.566 14.109 4.831 14.109 QT
3.222 14.109 2.456 14.672 QT
1.691 15.234 1.316 16.672 QT
-0.919 16.359 L
-0.606 14.922 0.089 14.047 QT
0.785 13.172 2.105 12.695 QT
3.425 12.219 5.175 12.219 QT
6.894 12.219 7.972 12.625 QT
9.05 13.031 9.558 13.641 QT
10.066 14.25 10.269 15.203 QT
10.378 15.781 10.378 17.297 QT
10.378 20.344 L
10.378 23.531 10.527 24.375 QT
10.675 25.219 11.113 26 QT
8.722 26 L
8.363 25.281 8.269 24.344 QT
cp
8.081 19.234 M
6.831 19.734 4.347 20.094 QT
2.941 20.297 2.355 20.555 QT
1.769 20.813 1.449 21.297 QT
1.128 21.781 1.128 22.375 QT
1.128 23.297 1.824 23.906 QT
2.519 24.516 3.847 24.516 QT
5.175 24.516 6.199 23.938 QT
7.222 23.359 7.706 22.359 QT
8.081 21.578 8.081 20.078 QT
8.081 19.234 L
cp
13.741 26 M
13.741 12.516 L
15.788 12.516 L
15.788 14.438 L
17.272 12.219 20.085 12.219 QT
21.303 12.219 22.327 12.656 QT
23.35 13.094 23.858 13.805 QT
24.366 14.516 24.569 15.484 QT
24.694 16.125 24.694 17.703 QT
24.694 26 L
22.413 26 L
22.413 17.797 L
22.413 16.406 22.147 15.711 QT
21.881 15.016 21.202 14.602 QT
20.522 14.188 19.6 14.188 QT
18.147 14.188 17.085 15.117 QT
16.022 16.047 16.022 18.641 QT
16.022 26 L
13.741 26 L
cp
27.9 31.188 M
27.65 29.047 L
28.4 29.25 28.963 29.25 QT
29.713 29.25 30.174 29 QT
30.635 28.75 30.932 28.281 QT
31.135 27.938 31.619 26.578 QT
31.682 26.391 31.822 26.031 QT
26.713 12.516 L
29.166 12.516 L
31.978 20.328 L
32.525 21.813 32.963 23.453 QT
33.353 21.875 33.9 20.375 QT
36.775 12.516 L
39.057 12.516 L
33.932 26.234 L
33.103 28.453 32.65 29.281 QT
32.041 30.422 31.252 30.945 QT
30.463 31.469 29.369 31.469 QT
28.713 31.469 27.9 31.188 QT
cp
31.4 11 M
33.088 7.438 L
36.088 7.438 L
33.291 11 L
31.4 11 L
cp
49.635 21.063 M
51.885 21.359 L
51.51 23.672 49.994 24.992 QT
48.478 26.313 46.26 26.313 QT
43.494 26.313 41.814 24.5 QT
40.135 22.688 40.135 19.313 QT
40.135 17.125 40.861 15.484 QT
41.588 13.844 43.064 13.031 QT
44.541 12.219 46.275 12.219 QT
48.478 12.219 49.877 13.328 QT
51.275 14.438 51.666 16.484 QT
49.447 16.828 L
49.119 15.469 48.314 14.781 QT
47.51 14.094 46.369 14.094 QT
44.635 14.094 43.557 15.328 QT
42.478 16.563 42.478 19.25 QT
42.478 21.969 43.525 23.195 QT
44.572 24.422 46.244 24.422 QT
47.588 24.422 48.486 23.602 QT
49.385 22.781 49.635 21.063 QT
cp
53.666 26 M
53.666 7.391 L
55.947 7.391 L
55.947 14.063 L
57.541 12.219 59.978 12.219 QT
61.478 12.219 62.588 12.805 QT
63.697 13.391 64.174 14.43 QT
64.65 15.469 64.65 17.453 QT
64.65 26 L
62.353 26 L
62.353 17.453 L
62.353 15.734 61.611 14.961 QT
60.869 14.188 59.51 14.188 QT
58.494 14.188 57.603 14.711 QT
56.713 15.234 56.33 16.133 QT
55.947 17.031 55.947 18.625 QT
55.947 26 L
53.666 26 L
cp
75.078 10.016 M
75.078 7.391 L
77.36 7.391 L
77.36 10.016 L
75.078 10.016 L
cp
75.078 26 M
75.078 12.516 L
77.36 12.516 L
77.36 26 L
75.078 26 L
cp
85.747 23.953 M
86.075 25.969 L
85.107 26.172 84.357 26.172 QT
83.107 26.172 82.419 25.781 QT
81.732 25.391 81.458 24.75 QT
81.185 24.109 81.185 22.047 QT
81.185 14.297 L
79.497 14.297 L
79.497 12.516 L
81.185 12.516 L
81.185 9.172 L
83.45 7.813 L
83.45 12.516 L
85.747 12.516 L
85.747 14.297 L
83.45 14.297 L
83.45 22.172 L
83.45 23.156 83.567 23.438 QT
83.685 23.719 83.958 23.883 QT
84.232 24.047 84.747 24.047 QT
85.122 24.047 85.747 23.953 QT
cp
97.11 21.656 M
99.485 21.953 L
98.922 24.016 97.407 25.164 QT
95.891 26.313 93.547 26.313 QT
90.594 26.313 88.86 24.484 QT
87.125 22.656 87.125 19.375 QT
87.125 15.969 88.875 14.094 QT
90.625 12.219 93.422 12.219 QT
96.125 12.219 97.836 14.055 QT
99.547 15.891 99.547 19.234 QT
99.547 19.438 99.547 19.844 QT
89.485 19.844 L
89.61 22.063 90.742 23.242 QT
91.875 24.422 93.563 24.422 QT
94.813 24.422 95.703 23.766 QT
96.594 23.109 97.11 21.656 QT
cp
89.61 17.969 M
97.141 17.969 L
96.985 16.266 96.282 15.406 QT
95.188 14.094 93.453 14.094 QT
91.875 14.094 90.805 15.148 QT
89.735 16.203 89.61 17.969 QT
cp
102.128 26 M
102.128 12.516 L
104.191 12.516 L
104.191 14.563 L
104.972 13.125 105.636 12.672 QT
106.3 12.219 107.113 12.219 QT
108.269 12.219 109.457 12.953 QT
108.675 15.063 L
107.832 14.578 106.988 14.578 QT
106.238 14.578 105.644 15.023 QT
105.05 15.469 104.8 16.281 QT
104.41 17.5 104.41 18.938 QT
104.41 26 L
102.128 26 L
cp
119.5 24.344 M
118.235 25.422 117.055 25.867 QT
115.875 26.313 114.532 26.313 QT
112.313 26.313 111.118 25.227 QT
109.922 24.141 109.922 22.438 QT
109.922 21.453 110.375 20.633 QT
110.828 19.813 111.555 19.32 QT
112.282 18.828 113.203 18.578 QT
113.875 18.391 115.235 18.234 QT
118 17.906 119.313 17.438 QT
119.313 16.969 119.313 16.844 QT
119.313 15.453 118.672 14.875 QT
117.797 14.109 116.063 14.109 QT
114.453 14.109 113.688 14.672 QT
112.922 15.234 112.547 16.672 QT
110.313 16.359 L
110.625 14.922 111.321 14.047 QT
112.016 13.172 113.336 12.695 QT
114.657 12.219 116.407 12.219 QT
118.125 12.219 119.203 12.625 QT
120.282 13.031 120.789 13.641 QT
121.297 14.25 121.5 15.203 QT
121.61 15.781 121.61 17.297 QT
121.61 20.344 L
121.61 23.531 121.758 24.375 QT
121.907 25.219 122.344 26 QT
119.953 26 L
119.594 25.281 119.5 24.344 QT
cp
119.313 19.234 M
118.063 19.734 115.578 20.094 QT
114.172 20.297 113.586 20.555 QT
113 20.813 112.68 21.297 QT
112.36 21.781 112.36 22.375 QT
112.36 23.297 113.055 23.906 QT
113.75 24.516 115.078 24.516 QT
116.407 24.516 117.43 23.938 QT
118.453 23.359 118.938 22.359 QT
119.313 21.578 119.313 20.078 QT
119.313 19.234 L
cp
133.769 21.063 M
136.019 21.359 L
135.644 23.672 134.128 24.992 QT
132.613 26.313 130.394 26.313 QT
127.628 26.313 125.949 24.5 QT
124.269 22.688 124.269 19.313 QT
124.269 17.125 124.996 15.484 QT
125.722 13.844 127.199 13.031 QT
128.675 12.219 130.41 12.219 QT
132.613 12.219 134.011 13.328 QT
135.41 14.438 135.8 16.484 QT
133.582 16.828 L
133.253 15.469 132.449 14.781 QT
131.644 14.094 130.503 14.094 QT
128.769 14.094 127.691 15.328 QT
126.613 16.563 126.613 19.25 QT
126.613 21.969 127.66 23.195 QT
128.707 24.422 130.378 24.422 QT
131.722 24.422 132.621 23.602 QT
133.519 22.781 133.769 21.063 QT
cp
138.597 26 M
138.597 12.516 L
140.878 12.516 L
140.878 26 L
138.597 26 L
cp
138.191 11 M
139.878 7.438 L
142.878 7.438 L
140.082 11 L
138.191 11 L
cp
152.103 31.172 M
152.103 7.391 L
157.15 7.391 L
157.15 9.281 L
154.385 9.281 L
154.385 29.281 L
157.15 29.281 L
157.15 31.172 L
152.103 31.172 L
cp
158.575 18.922 M
158.575 16.328 L
159.919 14.797 162.107 14.797 QT
162.857 14.797 163.7 15.023 QT
164.544 15.25 166.091 15.906 QT
166.966 16.281 167.403 16.391 QT
167.841 16.5 168.278 16.5 QT
169.107 16.5 169.989 16.008 QT
170.872 15.516 171.56 14.766 QT
171.56 17.453 L
170.747 18.219 169.911 18.563 QT
169.075 18.906 168.044 18.906 QT
167.278 18.906 166.591 18.727 QT
165.903 18.547 164.396 17.875 QT
162.888 17.203 161.888 17.203 QT
161.075 17.203 160.357 17.555 QT
159.638 17.906 158.575 18.922 QT
cp
177.98 31.172 M
172.949 31.172 L
172.949 29.281 L
175.699 29.281 L
175.699 9.281 L
172.949 9.281 L
172.949 7.391 L
177.98 7.391 L
177.98 31.172 L
cp
f
GR
GS
[0.6 0 0 0.6 0 0] CT
0.149 GC
2 setlinecap
1 LJ
0.833 LW
N
104 454 M
104 39 L
S
GR
GS
[0.6 0 0 0.6 0 0] CT
0.149 GC
2 setlinecap
1 LJ
0.833 LW
N
634 454 M
634 39 L
S
GR
GS
[0.6 0 0 0.6 0 0] CT
0.149 GC
2 setlinecap
1 LJ
0.833 LW
N
104 451.355 M
109.3 451.355 L
S
GR
GS
[0.6 0 0 0.6 0 0] CT
0.149 GC
2 setlinecap
1 LJ
0.833 LW
N
104 385.957 M
109.3 385.957 L
S
GR
GS
[0.6 0 0 0.6 0 0] CT
0.149 GC
2 setlinecap
1 LJ
0.833 LW
N
104 320.56 M
109.3 320.56 L
S
GR
GS
[0.6 0 0 0.6 0 0] CT
0.149 GC
2 setlinecap
1 LJ
0.833 LW
N
104 255.162 M
109.3 255.162 L
S
GR
GS
[0.6 0 0 0.6 0 0] CT
0.149 GC
2 setlinecap
1 LJ
0.833 LW
N
104 189.764 M
109.3 189.764 L
S
GR
GS
[0.6 0 0 0.6 0 0] CT
0.149 GC
2 setlinecap
1 LJ
0.833 LW
N
104 124.366 M
109.3 124.366 L
S
GR
GS
[0.6 0 0 0.6 0 0] CT
0.149 GC
2 setlinecap
1 LJ
0.833 LW
N
104 58.968 M
109.3 58.968 L
S
GR
GS
[0.6 0 0 0.6 0 0] CT
0.149 GC
2 setlinecap
1 LJ
0.833 LW
N
634 451.355 M
628.7 451.355 L
S
GR
GS
[0.6 0 0 0.6 0 0] CT
0.149 GC
2 setlinecap
1 LJ
0.833 LW
N
634 385.957 M
628.7 385.957 L
S
GR
GS
[0.6 0 0 0.6 0 0] CT
0.149 GC
2 setlinecap
1 LJ
0.833 LW
N
634 320.56 M
628.7 320.56 L
S
GR
GS
[0.6 0 0 0.6 0 0] CT
0.149 GC
2 setlinecap
1 LJ
0.833 LW
N
634 255.162 M
628.7 255.162 L
S
GR
GS
[0.6 0 0 0.6 0 0] CT
0.149 GC
2 setlinecap
1 LJ
0.833 LW
N
634 189.764 M
628.7 189.764 L
S
GR
GS
[0.6 0 0 0.6 0 0] CT
0.149 GC
2 setlinecap
1 LJ
0.833 LW
N
634 124.366 M
628.7 124.366 L
S
GR
GS
[0.6 0 0 0.6 0 0] CT
0.149 GC
2 setlinecap
1 LJ
0.833 LW
N
634 58.968 M
628.7 58.968 L
S
GR
GS
[0.6 0 0 0.6 57.6 270.81312] CT
0.149 GC
/Helvetica 23.333 F
GS
[1 0 0 1 0 0] CT
-59 9 moveto 
1 -1 scale
(0.004) t 
GR
GR
GS
[0.6 0 0 0.6 57.6 231.57444] CT
0.149 GC
/Helvetica 23.333 F
GS
[1 0 0 1 0 0] CT
-59 9 moveto 
1 -1 scale
(0.006) t 
GR
GR
GS
[0.6 0 0 0.6 57.6 192.33574] CT
0.149 GC
/Helvetica 23.333 F
GS
[1 0 0 1 0 0] CT
-59 9 moveto 
1 -1 scale
(0.008) t 
GR
GR
GS
[0.6 0 0 0.6 57.6 153.09706] CT
0.149 GC
/Helvetica 23.333 F
GS
[1 0 0 1 0 0] CT
-46 9 moveto 
1 -1 scale
(0.01) t 
GR
GR
GS
[0.6 0 0 0.6 57.6 113.85837] CT
0.149 GC
/Helvetica 23.333 F
GS
[1 0 0 1 0 0] CT
-59 9 moveto 
1 -1 scale
(0.012) t 
GR
GR
GS
[0.6 0 0 0.6 57.6 74.61967] CT
0.149 GC
/Helvetica 23.333 F
GS
[1 0 0 1 0 0] CT
-59 9 moveto 
1 -1 scale
(0.014) t 
GR
GR
GS
[0.6 0 0 0.6 57.6 35.38098] CT
0.149 GC
/Helvetica 23.333 F
GS
[1 0 0 1 0 0] CT
-59 9 moveto 
1 -1 scale
(0.016) t 
GR
GR
GS
[0 -0.6 0.6 0 19.2 147.89988] CT
0.149 GC
/Helvetica 25.667 F
GS
[1 0 0 1 0 0] CT
-55.5 -6 moveto 
1 -1 scale
(RMSE [~]) t 
GR
GR
GS
[0.6 0 0 0.6 0 0] CT
0 0 1 RC
1 LJ
3.333 LW
N
105.767 39 M
107.533 191.916 L
109.3 257.903 L
111.067 292.446 L
112.833 333.028 L
114.6 345.074 L
116.367 355.936 L
118.133 363.347 L
119.9 367.585 L
121.667 377.719 L
123.433 381.223 L
125.2 383.883 L
126.967 389.27 L
128.733 391.376 L
130.5 394.437 L
132.267 398.257 L
134.033 399.046 L
135.8 405.07 L
137.567 409.893 L
139.333 412.116 L
141.1 412.496 L
142.867 414.6 L
144.633 416.652 L
146.4 418.666 L
148.167 419.316 L
149.933 419.619 L
151.7 421.364 L
153.467 423.117 L
155.233 423.365 L
157 425.182 L
158.767 427.97 L
160.533 428.989 L
162.3 429.519 L
164.067 431.509 L
165.833 432.059 L
167.6 433.201 L
169.367 432.558 L
171.133 433.142 L
172.9 433.714 L
174.667 432.706 L
176.433 432.921 L
178.2 433.934 L
179.967 434.292 L
181.733 435.402 L
183.5 435.694 L
185.267 436.632 L
187.033 437.296 L
188.8 437.828 L
190.567 437.339 L
192.333 438.235 L
194.1 438.247 L
195.867 438.835 L
197.633 439.303 L
199.4 440.584 L
201.167 441.786 L
202.933 442.106 L
204.7 442.659 L
206.467 443.275 L
208.233 443.612 L
210 443.881 L
211.767 444.063 L
213.533 444.347 L
215.3 444.549 L
217.067 444.355 L
218.833 444.57 L
220.6 444.866 L
222.367 444.697 L
224.133 445.006 L
225.9 445.532 L
227.667 445.507 L
229.433 445.499 L
231.2 445.577 L
232.967 446.141 L
234.733 446.16 L
236.5 446.282 L
238.267 446.802 L
240.033 446.33 L
241.8 446.05 L
243.567 446.317 L
245.333 446.323 L
247.1 446.497 L
248.867 446.509 L
250.633 446.492 L
252.4 446.842 L
254.167 447.212 L
255.933 447.26 L
257.7 447.518 L
259.467 447.612 L
261.233 447.155 L
263 447.226 L
264.767 447.301 L
266.533 447.472 L
268.3 447.774 L
270.067 447.621 L
271.833 447.539 L
273.6 447.459 L
275.367 447.582 L
277.133 447.283 L
278.9 447.596 L
280.667 447.784 L
282.433 448.026 L
284.2 448.016 L
285.967 447.716 L
287.733 447.939 L
289.5 447.915 L
291.267 448.175 L
293.033 448.172 L
294.8 448.135 L
296.567 448.178 L
298.333 448.119 L
300.1 448.256 L
301.867 448.12 L
303.633 448.101 L
305.4 448.271 L
307.167 448.419 L
308.933 448.499 L
310.7 448.451 L
312.467 448.521 L
314.233 448.589 L
316 448.74 L
317.767 448.982 L
319.533 449.109 L
321.3 449.298 L
323.067 449.342 L
324.833 449.382 L
326.6 449.594 L
328.367 449.72 L
330.133 450.045 L
331.9 450.081 L
333.667 450.193 L
335.433 450.227 L
337.2 450.238 L
338.967 450.365 L
340.733 450.492 L
342.5 450.719 L
344.267 450.684 L
346.033 450.635 L
347.8 450.828 L
349.567 450.991 L
351.333 451.183 L
353.1 451.31 L
354.867 451.47 L
356.633 451.472 L
358.4 451.633 L
360.167 451.436 L
361.933 451.415 L
363.7 451.489 L
365.467 451.521 L
367.233 451.58 L
369 451.551 L
370.767 451.704 L
372.533 451.766 L
374.3 451.818 L
376.067 451.811 L
377.833 451.696 L
379.6 451.733 L
381.367 451.86 L
383.133 451.802 L
384.9 451.723 L
386.667 451.792 L
388.433 451.788 L
390.2 451.693 L
391.967 451.924 L
393.733 451.895 L
395.5 451.973 L
397.267 452.187 L
399.033 452.283 L
400.8 452.341 L
402.567 452.393 L
404.333 452.214 L
406.1 452.38 L
407.867 452.51 L
409.633 452.549 L
411.4 452.562 L
413.167 452.398 L
414.933 452.403 L
416.7 452.537 L
418.467 452.732 L
420.233 452.795 L
422 452.752 L
423.767 452.555 L
425.533 452.565 L
427.3 452.613 L
429.067 452.409 L
430.833 452.471 L
432.6 452.445 L
434.367 452.585 L
436.133 452.608 L
437.9 452.547 L
439.667 452.644 L
441.433 452.605 L
443.2 452.49 L
444.967 452.558 L
446.733 452.588 L
448.5 452.721 L
450.267 452.773 L
452.033 452.855 L
453.8 452.803 L
455.567 452.763 L
457.333 452.802 L
459.1 452.674 L
460.867 452.767 L
462.633 452.651 L
464.4 452.617 L
466.167 452.54 L
467.933 452.647 L
469.7 452.819 L
471.467 452.891 L
473.233 452.885 L
475 452.897 L
476.767 452.922 L
478.533 452.805 L
480.3 452.796 L
482.067 452.818 L
483.833 452.764 L
485.6 452.818 L
487.367 452.826 L
489.133 452.836 L
490.9 453.034 L
492.667 453.076 L
494.433 453.024 L
496.2 453.001 L
497.967 452.982 L
499.733 453.101 L
501.5 453.16 L
503.267 453.079 L
505.033 453.037 L
506.8 453.086 L
508.567 453.068 L
510.333 453.072 L
512.1 453.031 L
513.867 453.162 L
515.633 453.201 L
517.4 453.21 L
519.167 453.184 L
520.933 453.274 L
522.7 453.307 L
524.467 453.36 L
526.233 453.461 L
528 453.513 L
529.767 453.498 L
531.533 453.632 L
533.3 453.667 L
535.067 453.685 L
536.833 453.76 L
538.6 453.751 L
540.367 453.758 L
542.133 453.775 L
543.9 453.79 L
545.667 453.795 L
547.433 453.862 L
549.2 453.78 L
550.967 453.835 L
552.733 453.797 L
554.5 453.762 L
556.267 453.698 L
558.033 453.754 L
559.8 453.819 L
561.567 453.831 L
563.333 453.859 L
565.1 453.863 L
566.867 453.961 L
568.633 453.952 L
570.4 453.95 L
572.167 454 L
573.933 453.96 L
575.7 453.948 L
577.467 453.913 L
579.233 453.845 L
581 453.879 L
582.767 453.82 L
584.533 453.779 L
586.3 453.73 L
588.067 453.695 L
589.833 453.585 L
591.6 453.714 L
593.367 453.645 L
595.133 453.653 L
596.9 453.7 L
598.667 453.66 L
600.433 453.72 L
602.2 453.715 L
603.967 453.734 L
605.733 453.735 L
607.5 453.768 L
609.267 453.773 L
611.033 453.771 L
612.8 453.806 L
614.567 453.689 L
616.333 453.656 L
618.1 453.568 L
619.867 453.554 L
621.633 453.483 L
623.4 453.452 L
625.167 453.398 L
626.933 453.354 L
628.7 453.326 L
630.467 453.314 L
632.233 453.32 L
634 453.392 L
S
GR
GS
[0.6 0 0 0.6 0 0] CT
1 0 0 RC
[12 12] 0 setdash
2 LJ
3.333 LW
N
105.767 70.141 M
107.533 205.96 L
109.3 260.886 L
111.067 288.018 L
112.833 308.36 L
114.6 323.282 L
116.367 336.232 L
118.133 344.852 L
119.9 352.546 L
121.667 358.937 L
123.433 364.449 L
125.2 369.064 L
126.967 372.935 L
128.733 375.758 L
130.5 378.556 L
132.267 381.736 L
134.033 383.526 L
135.8 385.482 L
137.567 388.204 L
139.333 389.784 L
141.1 391.507 L
142.867 393.035 L
144.633 394.479 L
146.4 395.955 L
148.167 397.092 L
149.933 398.091 L
151.7 399.177 L
153.467 399.884 L
155.233 400.349 L
157 400.47 L
158.767 401.344 L
160.533 401.863 L
162.3 402.307 L
164.067 402.886 L
165.833 403.582 L
167.6 404.475 L
169.367 405.05 L
171.133 405.184 L
172.9 405.488 L
174.667 405.618 L
176.433 406.115 L
178.2 406.269 L
179.967 406.742 L
181.733 407.189 L
183.5 407.609 L
185.267 407.99 L
187.033 408.249 L
188.8 408.592 L
190.567 408.953 L
192.333 409.232 L
194.1 409.288 L
195.867 409.567 L
197.633 409.745 L
199.4 409.848 L
201.167 410.132 L
202.933 410.256 L
204.7 410.519 L
206.467 410.735 L
208.233 410.898 L
210 411.059 L
211.767 411.162 L
213.533 411.289 L
215.3 411.314 L
217.067 411.497 L
218.833 411.719 L
220.6 411.941 L
222.367 412.052 L
224.133 412.363 L
225.9 412.49 L
227.667 412.668 L
229.433 412.8 L
231.2 412.922 L
232.967 413.071 L
234.733 413.241 L
236.5 413.34 L
238.267 413.382 L
240.033 413.372 L
241.8 413.478 L
243.567 413.611 L
245.333 413.779 L
247.1 413.91 L
248.867 414.068 L
250.633 414.242 L
252.4 414.314 L
254.167 414.48 L
255.933 414.551 L
257.7 414.646 L
259.467 414.765 L
261.233 414.916 L
263 415.008 L
264.767 415.088 L
266.533 415.122 L
268.3 415.244 L
270.067 415.378 L
271.833 415.451 L
273.6 415.515 L
275.367 415.679 L
277.133 415.71 L
278.9 415.893 L
280.667 415.939 L
282.433 415.945 L
284.2 415.979 L
285.967 416.006 L
287.733 416.073 L
289.5 416.189 L
291.267 416.248 L
293.033 416.249 L
294.8 416.275 L
296.567 416.361 L
298.333 416.484 L
300.1 416.575 L
301.867 416.668 L
303.633 416.672 L
305.4 416.744 L
307.167 416.818 L
308.933 416.834 L
310.7 416.876 L
312.467 416.897 L
314.233 416.956 L
316 416.933 L
317.767 416.973 L
319.533 417.004 L
321.3 416.989 L
323.067 417.054 L
324.833 417.117 L
326.6 417.159 L
328.367 417.177 L
330.133 417.238 L
331.9 417.264 L
333.667 417.305 L
335.433 417.41 L
337.2 417.435 L
338.967 417.51 L
340.733 417.521 L
342.5 417.545 L
344.267 417.623 L
346.033 417.67 L
347.8 417.68 L
349.567 417.744 L
351.333 417.779 L
353.1 417.853 L
354.867 417.917 L
356.633 417.977 L
358.4 417.986 L
360.167 418.026 L
361.933 418.095 L
363.7 418.122 L
365.467 418.182 L
367.233 418.24 L
369 418.271 L
370.767 418.34 L
372.533 418.346 L
374.3 418.349 L
376.067 418.349 L
377.833 418.418 L
379.6 418.49 L
381.367 418.522 L
383.133 418.556 L
384.9 418.587 L
386.667 418.603 L
388.433 418.604 L
390.2 418.609 L
391.967 418.631 L
393.733 418.622 L
395.5 418.659 L
397.267 418.683 L
399.033 418.746 L
400.8 418.813 L
402.567 418.883 L
404.333 418.931 L
406.1 418.957 L
407.867 418.982 L
409.633 418.991 L
411.4 418.986 L
413.167 418.995 L
414.933 418.987 L
416.7 419.007 L
418.467 419.036 L
420.233 419.074 L
422 419.083 L
423.767 419.137 L
425.533 419.176 L
427.3 419.228 L
429.067 419.228 L
430.833 419.241 L
432.6 419.257 L
434.367 419.273 L
436.133 419.286 L
437.9 419.326 L
439.667 419.326 L
441.433 419.348 L
443.2 419.339 L
444.967 419.377 L
446.733 419.417 L
448.5 419.402 L
450.267 419.44 L
452.033 419.457 L
453.8 419.465 L
455.567 419.502 L
457.333 419.522 L
459.1 419.518 L
460.867 419.522 L
462.633 419.54 L
464.4 419.565 L
466.167 419.568 L
467.933 419.576 L
469.7 419.606 L
471.467 419.641 L
473.233 419.671 L
475 419.666 L
476.767 419.676 L
478.533 419.675 L
480.3 419.674 L
482.067 419.676 L
483.833 419.701 L
485.6 419.745 L
487.367 419.757 L
489.133 419.775 L
490.9 419.811 L
492.667 419.817 L
494.433 419.846 L
496.2 419.846 L
497.967 419.87 L
499.733 419.878 L
501.5 419.867 L
503.267 419.882 L
505.033 419.901 L
506.8 419.931 L
508.567 419.991 L
510.333 419.988 L
512.1 419.984 L
513.867 420.012 L
515.633 420.048 L
517.4 420.049 L
519.167 420.05 L
520.933 420.067 L
522.7 420.068 L
524.467 420.095 L
526.233 420.105 L
528 420.094 L
529.767 420.094 L
531.533 420.112 L
533.3 420.133 L
535.067 420.139 L
536.833 420.159 L
538.6 420.159 L
540.367 420.153 L
542.133 420.142 L
543.9 420.159 L
545.667 420.154 L
547.433 420.163 L
549.2 420.17 L
550.967 420.176 L
552.733 420.186 L
554.5 420.2 L
556.267 420.209 L
558.033 420.214 L
559.8 420.204 L
561.567 420.239 L
563.333 420.238 L
565.1 420.25 L
566.867 420.277 L
568.633 420.272 L
570.4 420.287 L
572.167 420.279 L
573.933 420.278 L
575.7 420.283 L
577.467 420.292 L
579.233 420.309 L
581 420.309 L
582.767 420.308 L
584.533 420.312 L
586.3 420.335 L
588.067 420.342 L
589.833 420.334 L
591.6 420.344 L
593.367 420.35 L
595.133 420.369 L
596.9 420.374 L
598.667 420.402 L
600.433 420.407 L
602.2 420.418 L
603.967 420.421 L
605.733 420.44 L
607.5 420.468 L
609.267 420.47 L
611.033 420.475 L
612.8 420.482 L
614.567 420.465 L
616.333 420.477 L
618.1 420.485 L
619.867 420.473 L
621.633 420.498 L
623.4 420.496 L
625.167 420.51 L
626.933 420.491 L
628.7 420.512 L
630.467 420.521 L
632.233 420.549 L
634 420.553 L
S
GR
GS
[0.6 0 0 0.6 0 0] CT
1 GC
N
621 118 M
621 52 L
480 52 L
480 118 L
cp
f
GR
GS
[0.6 0 0 0.6 323.31262 41.76] CT
/Helvetica 23.333 F
GS
[1 0 0 1 0 0] CT
0 9 moveto 
1 -1 scale
(1. profil) t 
GR
GR
GS
[0.6 0 0 0.6 0 0] CT
0 0 1 RC
1 LJ
3.333 LW
N
485.009 69.6 M
535.098 69.6 L
S
GR
GS
[0.6 0 0 0.6 323.31262 60.24] CT
/Helvetica 23.333 F
GS
[1 0 0 1 0 0] CT
0 9 moveto 
1 -1 scale
(2.profil) t 
GR
GR
GS
[0.6 0 0 0.6 0 0] CT
1 0 0 RC
[12 12] 0 setdash
2 LJ
3.333 LW
N
485.009 100.4 M
535.098 100.4 L
S
GR
GS
[0.6 0 0 0.6 0 0] CT
0.149 GC
10.0 ML
0.833 LW
N
480 118 M
480 52 L
621 52 L
621 118 L
cp
S
GR
%%Trailer
%%Pages: 1
%%EOF
