%!PS-Adobe-3.0 EPSF-3.0
%%Creator: (MATLAB, The Mathworks, Inc. Version 9.14.0.2206163 \(R2023a\). Operating System: Windows 10)
%%Title: C:/Users/radac/Desktop/Bachelor_thesis/thesis/Metody/fig/EKF/EKF_profil_h_1.eps
%%CreationDate: 2023-05-20T19:55:05
%%Pages: (atend)
%%BoundingBox:     0     0   420   315
%%LanguageLevel: 3
%%EndComments
%%BeginProlog
%%BeginResource: procset (Apache XML Graphics Std ProcSet) 1.2 0
%%Version: 1.2 0
%%Copyright: (Copyright 2001-2003,2010 The Apache Software Foundation. License terms: http://www.apache.org/licenses/LICENSE-2.0)
/bd{bind def}bind def
/ld{load def}bd
/GR/grestore ld
/GS/gsave ld
/RM/rmoveto ld
/C/curveto ld
/t/show ld
/L/lineto ld
/ML/setmiterlimit ld
/CT/concat ld
/f/fill ld
/N/newpath ld
/S/stroke ld
/CC/setcmykcolor ld
/A/ashow ld
/cp/closepath ld
/RC/setrgbcolor ld
/LJ/setlinejoin ld
/GC/setgray ld
/LW/setlinewidth ld
/M/moveto ld
/re {4 2 roll M
1 index 0 rlineto
0 exch rlineto
neg 0 rlineto
cp } bd
/_ctm matrix def
/_tm matrix def
/BT { _ctm currentmatrix pop matrix _tm copy pop 0 0 moveto } bd
/ET { _ctm setmatrix } bd
/iTm { _ctm setmatrix _tm concat } bd
/Tm { _tm astore pop iTm 0 0 moveto } bd
/ux 0.0 def
/uy 0.0 def
/F {
  /Tp exch def
  /Tf exch def
  Tf findfont Tp scalefont setfont
  /cf Tf def  /cs Tp def
} bd
/ULS {currentpoint /uy exch def /ux exch def} bd
/ULE {
  /Tcx currentpoint pop def
  gsave
  newpath
  cf findfont cs scalefont dup
  /FontMatrix get 0 get /Ts exch def /FontInfo get dup
  /UnderlinePosition get Ts mul /To exch def
  /UnderlineThickness get Ts mul /Tt exch def
  ux uy To add moveto  Tcx uy To add lineto
  Tt setlinewidth stroke
  grestore
} bd
/OLE {
  /Tcx currentpoint pop def
  gsave
  newpath
  cf findfont cs scalefont dup
  /FontMatrix get 0 get /Ts exch def /FontInfo get dup
  /UnderlinePosition get Ts mul /To exch def
  /UnderlineThickness get Ts mul /Tt exch def
  ux uy To add cs add moveto Tcx uy To add cs add lineto
  Tt setlinewidth stroke
  grestore
} bd
/SOE {
  /Tcx currentpoint pop def
  gsave
  newpath
  cf findfont cs scalefont dup
  /FontMatrix get 0 get /Ts exch def /FontInfo get dup
  /UnderlinePosition get Ts mul /To exch def
  /UnderlineThickness get Ts mul /Tt exch def
  ux uy To add cs 10 mul 26 idiv add moveto Tcx uy To add cs 10 mul 26 idiv add lineto
  Tt setlinewidth stroke
  grestore
} bd
/QT {
/Y22 exch store
/X22 exch store
/Y21 exch store
/X21 exch store
currentpoint
/Y21 load 2 mul add 3 div exch
/X21 load 2 mul add 3 div exch
/X21 load 2 mul /X22 load add 3 div
/Y21 load 2 mul /Y22 load add 3 div
/X22 load /Y22 load curveto
} bd
/SSPD {
dup length /d exch dict def
{
/v exch def
/k exch def
currentpagedevice k known {
/cpdv currentpagedevice k get def
v cpdv ne {
/upd false def
/nullv v type /nulltype eq def
/nullcpdv cpdv type /nulltype eq def
nullv nullcpdv or
{
/upd true def
} {
/sametype v type cpdv type eq def
sametype {
v type /arraytype eq {
/vlen v length def
/cpdvlen cpdv length def
vlen cpdvlen eq {
0 1 vlen 1 sub {
/i exch def
/obj v i get def
/cpdobj cpdv i get def
obj cpdobj ne {
/upd true def
exit
} if
} for
} {
/upd true def
} ifelse
} {
v type /dicttype eq {
v {
/dv exch def
/dk exch def
/cpddv cpdv dk get def
dv cpddv ne {
/upd true def
exit
} if
} forall
} {
/upd true def
} ifelse
} ifelse
} if
} ifelse
upd true eq {
d k v put
} if
} if
} if
} forall
d length 0 gt {
d setpagedevice
} if
} bd
/RE { % /NewFontName [NewEncodingArray] /FontName RE -
  findfont dup length dict begin
  {
    1 index /FID ne
    {def} {pop pop} ifelse
  } forall
  /Encoding exch def
  /FontName 1 index def
  currentdict definefont pop
  end
} bind def
%%EndResource
%%BeginResource: procset (Apache XML Graphics EPS ProcSet) 1.0 0
%%Version: 1.0 0
%%Copyright: (Copyright 2002-2003 The Apache Software Foundation. License terms: http://www.apache.org/licenses/LICENSE-2.0)
/BeginEPSF { %def
/b4_Inc_state save def         % Save state for cleanup
/dict_count countdictstack def % Count objects on dict stack
/op_count count 1 sub def      % Count objects on operand stack
userdict begin                 % Push userdict on dict stack
/showpage { } def              % Redefine showpage, { } = null proc
0 setgray 0 setlinecap         % Prepare graphics state
1 setlinewidth 0 setlinejoin
10 setmiterlimit [ ] 0 setdash newpath
/languagelevel where           % If level not equal to 1 then
{pop languagelevel             % set strokeadjust and
1 ne                           % overprint to their defaults.
{false setstrokeadjust false setoverprint
} if
} if
} bd
/EndEPSF { %def
count op_count sub {pop} repeat            % Clean up stacks
countdictstack dict_count sub {end} repeat
b4_Inc_state restore
} bd
%%EndResource
%FOPBeginFontDict
%%IncludeResource: font Courier-Oblique
%%IncludeResource: font Courier-BoldOblique
%%IncludeResource: font Courier-Bold
%%IncludeResource: font ZapfDingbats
%%IncludeResource: font Symbol
%%IncludeResource: font Helvetica
%%IncludeResource: font Helvetica-Oblique
%%IncludeResource: font Helvetica-Bold
%%IncludeResource: font Helvetica-BoldOblique
%%IncludeResource: font Times-Roman
%%IncludeResource: font Times-Italic
%%IncludeResource: font Times-Bold
%%IncludeResource: font Times-BoldItalic
%%IncludeResource: font Courier
%FOPEndFontDict
%%BeginResource: encoding WinAnsiEncoding
/WinAnsiEncoding [
/.notdef /.notdef /.notdef /.notdef /.notdef
/.notdef /.notdef /.notdef /.notdef /.notdef
/.notdef /.notdef /.notdef /.notdef /.notdef
/.notdef /.notdef /.notdef /.notdef /.notdef
/.notdef /.notdef /.notdef /.notdef /.notdef
/.notdef /.notdef /.notdef /.notdef /.notdef
/.notdef /.notdef /space /exclam /quotedbl
/numbersign /dollar /percent /ampersand /quotesingle
/parenleft /parenright /asterisk /plus /comma
/hyphen /period /slash /zero /one
/two /three /four /five /six
/seven /eight /nine /colon /semicolon
/less /equal /greater /question /at
/A /B /C /D /E
/F /G /H /I /J
/K /L /M /N /O
/P /Q /R /S /T
/U /V /W /X /Y
/Z /bracketleft /backslash /bracketright /asciicircum
/underscore /quoteleft /a /b /c
/d /e /f /g /h
/i /j /k /l /m
/n /o /p /q /r
/s /t /u /v /w
/x /y /z /braceleft /bar
/braceright /asciitilde /bullet /Euro /bullet
/quotesinglbase /florin /quotedblbase /ellipsis /dagger
/daggerdbl /circumflex /perthousand /Scaron /guilsinglleft
/OE /bullet /Zcaron /bullet /bullet
/quoteleft /quoteright /quotedblleft /quotedblright /bullet
/endash /emdash /asciitilde /trademark /scaron
/guilsinglright /oe /bullet /zcaron /Ydieresis
/space /exclamdown /cent /sterling /currency
/yen /brokenbar /section /dieresis /copyright
/ordfeminine /guillemotleft /logicalnot /sfthyphen /registered
/macron /degree /plusminus /twosuperior /threesuperior
/acute /mu /paragraph /middot /cedilla
/onesuperior /ordmasculine /guillemotright /onequarter /onehalf
/threequarters /questiondown /Agrave /Aacute /Acircumflex
/Atilde /Adieresis /Aring /AE /Ccedilla
/Egrave /Eacute /Ecircumflex /Edieresis /Igrave
/Iacute /Icircumflex /Idieresis /Eth /Ntilde
/Ograve /Oacute /Ocircumflex /Otilde /Odieresis
/multiply /Oslash /Ugrave /Uacute /Ucircumflex
/Udieresis /Yacute /Thorn /germandbls /agrave
/aacute /acircumflex /atilde /adieresis /aring
/ae /ccedilla /egrave /eacute /ecircumflex
/edieresis /igrave /iacute /icircumflex /idieresis
/eth /ntilde /ograve /oacute /ocircumflex
/otilde /odieresis /divide /oslash /ugrave
/uacute /ucircumflex /udieresis /yacute /thorn
/ydieresis
] def
%%EndResource
%FOPBeginFontReencode
/Courier-Oblique findfont
dup length dict begin
  {1 index /FID ne {def} {pop pop} ifelse} forall
  /Encoding WinAnsiEncoding def
  currentdict
end
/Courier-Oblique exch definefont pop
/Courier-BoldOblique findfont
dup length dict begin
  {1 index /FID ne {def} {pop pop} ifelse} forall
  /Encoding WinAnsiEncoding def
  currentdict
end
/Courier-BoldOblique exch definefont pop
/Courier-Bold findfont
dup length dict begin
  {1 index /FID ne {def} {pop pop} ifelse} forall
  /Encoding WinAnsiEncoding def
  currentdict
end
/Courier-Bold exch definefont pop
/Helvetica findfont
dup length dict begin
  {1 index /FID ne {def} {pop pop} ifelse} forall
  /Encoding WinAnsiEncoding def
  currentdict
end
/Helvetica exch definefont pop
/Helvetica-Oblique findfont
dup length dict begin
  {1 index /FID ne {def} {pop pop} ifelse} forall
  /Encoding WinAnsiEncoding def
  currentdict
end
/Helvetica-Oblique exch definefont pop
/Helvetica-Bold findfont
dup length dict begin
  {1 index /FID ne {def} {pop pop} ifelse} forall
  /Encoding WinAnsiEncoding def
  currentdict
end
/Helvetica-Bold exch definefont pop
/Helvetica-BoldOblique findfont
dup length dict begin
  {1 index /FID ne {def} {pop pop} ifelse} forall
  /Encoding WinAnsiEncoding def
  currentdict
end
/Helvetica-BoldOblique exch definefont pop
/Times-Roman findfont
dup length dict begin
  {1 index /FID ne {def} {pop pop} ifelse} forall
  /Encoding WinAnsiEncoding def
  currentdict
end
/Times-Roman exch definefont pop
/Times-Italic findfont
dup length dict begin
  {1 index /FID ne {def} {pop pop} ifelse} forall
  /Encoding WinAnsiEncoding def
  currentdict
end
/Times-Italic exch definefont pop
/Times-Bold findfont
dup length dict begin
  {1 index /FID ne {def} {pop pop} ifelse} forall
  /Encoding WinAnsiEncoding def
  currentdict
end
/Times-Bold exch definefont pop
/Times-BoldItalic findfont
dup length dict begin
  {1 index /FID ne {def} {pop pop} ifelse} forall
  /Encoding WinAnsiEncoding def
  currentdict
end
/Times-BoldItalic exch definefont pop
/Courier findfont
dup length dict begin
  {1 index /FID ne {def} {pop pop} ifelse} forall
  /Encoding WinAnsiEncoding def
  currentdict
end
/Courier exch definefont pop
%FOPEndFontReencode
%%EndProlog
%%Page: 1 1
%%PageBoundingBox: 0 0 420 315
%%BeginPageSetup
[1 0 0 -1 0 315] CT
%%EndPageSetup
GS
[0.6 0 0 0.6 0 0] CT
1 GC
N
0 0 700 525 re
f
GR
GS
[0.6 0 0 0.6 0 0] CT
1 GC
N
0 0 700 525 re
f
GR
GS
[0.6 0 0 0.6 0 0] CT
1 GC
N
91 454 M
634 454 L
634 39 L
91 39 L
cp
f
GR
GS
[0.6 0 0 0.6 0 0] CT
0.873 GC
1 LJ
0.833 LW
N
91 454 M
91 39 L
S
GR
GS
[0.6 0 0 0.6 0 0] CT
0.873 GC
1 LJ
0.833 LW
N
199.6 454 M
199.6 39 L
S
GR
GS
[0.6 0 0 0.6 0 0] CT
0.873 GC
1 LJ
0.833 LW
N
308.2 454 M
308.2 39 L
S
GR
GS
[0.6 0 0 0.6 0 0] CT
0.873 GC
1 LJ
0.833 LW
N
416.8 454 M
416.8 39 L
S
GR
GS
[0.6 0 0 0.6 0 0] CT
0.873 GC
1 LJ
0.833 LW
N
525.4 454 M
525.4 39 L
S
GR
GS
[0.6 0 0 0.6 0 0] CT
0.873 GC
1 LJ
0.833 LW
N
634 454 M
634 39 L
S
GR
GS
[0.6 0 0 0.6 0 0] CT
0.873 GC
1 LJ
0.833 LW
N
634 454 M
91 454 L
S
GR
GS
[0.6 0 0 0.6 0 0] CT
0.873 GC
1 LJ
0.833 LW
N
634 371 M
91 371 L
S
GR
GS
[0.6 0 0 0.6 0 0] CT
0.873 GC
1 LJ
0.833 LW
N
634 288 M
91 288 L
S
GR
GS
[0.6 0 0 0.6 0 0] CT
0.873 GC
1 LJ
0.833 LW
N
634 205 M
91 205 L
S
GR
GS
[0.6 0 0 0.6 0 0] CT
0.873 GC
1 LJ
0.833 LW
N
634 122 M
91 122 L
S
GR
GS
[0.6 0 0 0.6 0 0] CT
0.873 GC
1 LJ
0.833 LW
N
634 39 M
91 39 L
S
GR
GS
[0.6 0 0 0.6 0 0] CT
0.149 GC
2 setlinecap
1 LJ
0.833 LW
N
91 454 M
634 454 L
S
GR
GS
[0.6 0 0 0.6 0 0] CT
0.149 GC
2 setlinecap
1 LJ
0.833 LW
N
91 39 M
634 39 L
S
GR
GS
[0.6 0 0 0.6 0 0] CT
0.149 GC
2 setlinecap
1 LJ
0.833 LW
N
91 454 M
91 448.57 L
S
GR
GS
[0.6 0 0 0.6 0 0] CT
0.149 GC
2 setlinecap
1 LJ
0.833 LW
N
199.6 454 M
199.6 448.57 L
S
GR
GS
[0.6 0 0 0.6 0 0] CT
0.149 GC
2 setlinecap
1 LJ
0.833 LW
N
308.2 454 M
308.2 448.57 L
S
GR
GS
[0.6 0 0 0.6 0 0] CT
0.149 GC
2 setlinecap
1 LJ
0.833 LW
N
416.8 454 M
416.8 448.57 L
S
GR
GS
[0.6 0 0 0.6 0 0] CT
0.149 GC
2 setlinecap
1 LJ
0.833 LW
N
525.4 454 M
525.4 448.57 L
S
GR
GS
[0.6 0 0 0.6 0 0] CT
0.149 GC
2 setlinecap
1 LJ
0.833 LW
N
634 454 M
634 448.57 L
S
GR
GS
[0.6 0 0 0.6 0 0] CT
0.149 GC
2 setlinecap
1 LJ
0.833 LW
N
91 39 M
91 44.43 L
S
GR
GS
[0.6 0 0 0.6 0 0] CT
0.149 GC
2 setlinecap
1 LJ
0.833 LW
N
199.6 39 M
199.6 44.43 L
S
GR
GS
[0.6 0 0 0.6 0 0] CT
0.149 GC
2 setlinecap
1 LJ
0.833 LW
N
308.2 39 M
308.2 44.43 L
S
GR
GS
[0.6 0 0 0.6 0 0] CT
0.149 GC
2 setlinecap
1 LJ
0.833 LW
N
416.8 39 M
416.8 44.43 L
S
GR
GS
[0.6 0 0 0.6 0 0] CT
0.149 GC
2 setlinecap
1 LJ
0.833 LW
N
525.4 39 M
525.4 44.43 L
S
GR
GS
[0.6 0 0 0.6 0 0] CT
0.149 GC
2 setlinecap
1 LJ
0.833 LW
N
634 39 M
634 44.43 L
S
GR
GS
[0.6 0 0 0.6 54.6 277.2] CT
0.149 GC
/Helvetica 23.333 F
GS
[1 0 0 1 0 0] CT
-6.5 24 moveto 
1 -1 scale
(0) t 
GR
GR
GS
[0.6 0 0 0.6 119.76 277.2] CT
0.149 GC
/Helvetica 23.333 F
GS
[1 0 0 1 0 0] CT
-26 24 moveto 
1 -1 scale
(1000) t 
GR
GR
GS
[0.6 0 0 0.6 184.92001 277.2] CT
0.149 GC
/Helvetica 23.333 F
GS
[1 0 0 1 0 0] CT
-26 24 moveto 
1 -1 scale
(2000) t 
GR
GR
GS
[0.6 0 0 0.6 250.07999 277.2] CT
0.149 GC
/Helvetica 23.333 F
GS
[1 0 0 1 0 0] CT
-26 24 moveto 
1 -1 scale
(3000) t 
GR
GR
GS
[0.6 0 0 0.6 315.24001 277.2] CT
0.149 GC
/Helvetica 23.333 F
GS
[1 0 0 1 0 0] CT
-26 24 moveto 
1 -1 scale
(4000) t 
GR
GR
GS
[0.6 0 0 0.6 380.4 277.2] CT
0.149 GC
/Helvetica 23.333 F
GS
[1 0 0 1 0 0] CT
-26 24 moveto 
1 -1 scale
(5000) t 
GR
GR
GS
[0.6 0 0 0.6 217.50016 295.59999] CT
0.149 GC
/Helvetica 25.667 F
GS
[1 0 0 1 0 0] CT
-28 26 moveto 
1 -1 scale
(s [m]) t 
GR
GR
GS
[0.6 0 0 0.6 0 0] CT
0.149 GC
2 setlinecap
1 LJ
0.833 LW
N
91 454 M
91 39 L
S
GR
GS
[0.6 0 0 0.6 0 0] CT
0.149 GC
2 setlinecap
1 LJ
0.833 LW
N
634 454 M
634 39 L
S
GR
GS
[0.6 0 0 0.6 0 0] CT
0.149 GC
2 setlinecap
1 LJ
0.833 LW
N
91 454 M
96.43 454 L
S
GR
GS
[0.6 0 0 0.6 0 0] CT
0.149 GC
2 setlinecap
1 LJ
0.833 LW
N
91 371 M
96.43 371 L
S
GR
GS
[0.6 0 0 0.6 0 0] CT
0.149 GC
2 setlinecap
1 LJ
0.833 LW
N
91 288 M
96.43 288 L
S
GR
GS
[0.6 0 0 0.6 0 0] CT
0.149 GC
2 setlinecap
1 LJ
0.833 LW
N
91 205 M
96.43 205 L
S
GR
GS
[0.6 0 0 0.6 0 0] CT
0.149 GC
2 setlinecap
1 LJ
0.833 LW
N
91 122 M
96.43 122 L
S
GR
GS
[0.6 0 0 0.6 0 0] CT
0.149 GC
2 setlinecap
1 LJ
0.833 LW
N
91 39 M
96.43 39 L
S
GR
GS
[0.6 0 0 0.6 0 0] CT
0.149 GC
2 setlinecap
1 LJ
0.833 LW
N
634 454 M
628.57 454 L
S
GR
GS
[0.6 0 0 0.6 0 0] CT
0.149 GC
2 setlinecap
1 LJ
0.833 LW
N
634 371 M
628.57 371 L
S
GR
GS
[0.6 0 0 0.6 0 0] CT
0.149 GC
2 setlinecap
1 LJ
0.833 LW
N
634 288 M
628.57 288 L
S
GR
GS
[0.6 0 0 0.6 0 0] CT
0.149 GC
2 setlinecap
1 LJ
0.833 LW
N
634 205 M
628.57 205 L
S
GR
GS
[0.6 0 0 0.6 0 0] CT
0.149 GC
2 setlinecap
1 LJ
0.833 LW
N
634 122 M
628.57 122 L
S
GR
GS
[0.6 0 0 0.6 0 0] CT
0.149 GC
2 setlinecap
1 LJ
0.833 LW
N
634 39 M
628.57 39 L
S
GR
GS
[0.6 0 0 0.6 49.8 272.4] CT
0.149 GC
/Helvetica 23.333 F
GS
[1 0 0 1 0 0] CT
-21 9 moveto 
1 -1 scale
(-4) t 
GR
GR
GS
[0.6 0 0 0.6 49.8 222.6] CT
0.149 GC
/Helvetica 23.333 F
GS
[1 0 0 1 0 0] CT
-21 9 moveto 
1 -1 scale
(-2) t 
GR
GR
GS
[0.6 0 0 0.6 49.8 172.8] CT
0.149 GC
/Helvetica 23.333 F
GS
[1 0 0 1 0 0] CT
-13 9 moveto 
1 -1 scale
(0) t 
GR
GR
GS
[0.6 0 0 0.6 49.8 123] CT
0.149 GC
/Helvetica 23.333 F
GS
[1 0 0 1 0 0] CT
-13 9 moveto 
1 -1 scale
(2) t 
GR
GR
GS
[0.6 0 0 0.6 49.8 73.2] CT
0.149 GC
/Helvetica 23.333 F
GS
[1 0 0 1 0 0] CT
-13 9 moveto 
1 -1 scale
(4) t 
GR
GR
GS
[0.6 0 0 0.6 49.8 23.4] CT
0.149 GC
/Helvetica 23.333 F
GS
[1 0 0 1 0 0] CT
-13 9 moveto 
1 -1 scale
(6) t 
GR
GR
GS
[0 -0.6 0.6 0 34.2 147.89988] CT
0.149 GC
/Helvetica 25.667 F
GS
[1 0 0 1 0 0] CT
-46 -6 moveto 
1 -1 scale
(sklon [\260]) t 
GR
GR
GS
[0.6 0 0 0.6 0 0] CT
1 0 0 RC
[12 12] 0 setdash
2 LJ
3.333 LW
N
91 287.976 M
91.271 287.976 L
91.543 287.968 L
91.814 287.912 L
92.086 287.862 L
92.357 287.747 L
92.629 287.617 L
92.9 287.453 L
93.172 287.533 L
93.443 287.679 L
93.715 288.133 L
93.987 288.716 L
94.258 288.708 L
94.53 289.461 L
94.801 289.339 L
95.073 289.729 L
95.344 290.42 L
95.616 291.769 L
95.887 292.067 L
96.159 290.792 L
96.43 292.13 L
96.701 290.703 L
96.973 289.859 L
97.244 287.556 L
97.516 289.698 L
97.787 289.411 L
98.059 291.3 L
98.33 292.003 L
98.602 288.086 L
98.873 291.639 L
99.145 292.924 L
99.416 295.739 L
99.688 298.193 L
99.96 299.432 L
100.231 302.627 L
100.503 301.361 L
100.774 305.437 L
101.046 307.483 L
101.317 310.4 L
101.589 311.206 L
101.86 308.536 L
102.132 306.869 L
102.403 306.293 L
102.674 304.458 L
102.946 302.831 L
103.217 303.409 L
103.489 305.661 L
103.76 307.764 L
104.032 309.045 L
104.303 309.987 L
104.575 315.043 L
104.846 312.333 L
105.118 313.707 L
105.39 313.787 L
105.661 314.269 L
105.933 312.992 L
106.204 312.787 L
106.476 314.114 L
106.747 310.681 L
107.019 310.855 L
107.29 314.256 L
107.562 315.443 L
107.833 316.868 L
108.104 318.679 L
108.376 315.927 L
108.647 314.332 L
108.919 316.196 L
109.19 319.376 L
109.462 315.477 L
109.733 314.317 L
110.005 308.99 L
110.276 308.382 L
110.548 306.38 L
110.82 306.319 L
111.091 304.645 L
111.363 300.626 L
111.634 297.612 L
111.906 294.395 L
112.177 293.952 L
112.449 292.244 L
112.72 291.609 L
112.992 294.283 L
113.263 294.433 L
113.535 295.491 L
113.806 296.078 L
114.077 293.727 L
114.349 293.806 L
114.62 289.656 L
114.892 289.937 L
115.163 291.126 L
115.435 289.916 L
115.706 291.459 L
115.978 292.981 L
116.249 294.412 L
116.521 297.978 L
116.793 296.329 L
117.064 293.006 L
117.336 293.83 L
117.607 296.833 L
117.879 293.607 L
118.15 295.841 L
118.422 296.754 L
118.693 300.048 L
118.965 301.112 L
119.236 300.83 L
119.507 304.726 L
119.779 306.641 L
120.05 301.822 L
120.322 306.611 L
120.593 306.028 L
120.865 310.168 L
121.136 308.788 L
121.408 311.209 L
121.679 311.671 L
121.951 308.468 L
122.223 308.11 L
122.494 310.544 L
122.766 311.063 L
123.037 311.012 L
123.309 310.842 L
123.58 310.25 L
123.852 310.768 L
124.123 307.843 L
124.395 309.165 L
124.666 312.611 L
124.938 310.519 L
125.209 308.752 L
125.48 309.109 L
125.752 307.37 L
126.023 304.979 L
126.295 304.382 L
126.566 304.413 L
126.838 303.481 L
127.109 308.684 L
127.381 307.225 L
127.652 304.184 L
127.924 308.172 L
128.195 306.447 L
128.467 301.849 L
128.738 298.342 L
129.01 295.158 L
129.281 293.412 L
129.553 295.58 L
129.824 297.79 L
130.096 293.77 L
130.367 294.295 L
130.639 295.071 L
130.911 294.118 L
131.182 296.316 L
131.454 296.938 L
131.725 298.014 L
131.997 300.446 L
132.268 305.796 L
132.54 304.449 L
132.811 307.651 L
133.083 308.934 L
133.354 307.978 L
133.626 307.259 L
133.897 307.947 L
134.169 308.947 L
134.44 311.751 L
134.712 314.422 L
134.983 317.17 L
135.255 316.368 L
135.526 313.724 L
135.798 312.389 L
136.069 313.498 L
136.34 313.122 L
136.612 313.882 L
136.883 317.103 L
137.155 319.011 L
137.426 322.686 L
137.698 324.299 L
137.969 321.478 L
138.241 319.894 L
138.512 321.414 L
138.784 319.198 L
139.055 324.136 L
139.327 322.197 L
139.598 323.459 L
139.87 319.035 L
140.141 319.418 L
140.413 316.598 L
140.684 314.268 L
140.956 313.343 L
141.227 309.219 L
141.499 309.238 L
141.77 307.447 L
142.042 305.771 L
142.314 305.035 L
142.585 309.247 L
142.857 307.701 L
143.128 302.133 L
143.4 302.374 L
143.671 304.962 L
143.943 307.184 L
144.214 303.408 L
144.486 307.238 L
144.757 309.059 L
145.029 310.309 L
145.3 312.417 L
145.572 313.49 L
145.843 315.627 L
146.115 313.897 L
146.386 314.224 L
146.658 314.103 L
146.929 312.727 L
147.201 311.85 L
147.472 310.653 L
147.743 311.241 L
148.015 310.01 L
148.286 310.414 L
148.558 308.258 L
148.829 305.655 L
149.101 304.072 L
149.372 303.677 L
149.644 306.608 L
149.915 309.601 L
150.187 305.953 L
150.458 304.775 L
150.73 302.946 L
151.001 302.148 L
151.273 306.038 L
151.544 303.644 L
151.816 301.514 L
152.087 303.227 L
152.359 303.75 L
152.63 305.926 L
152.902 302.059 L
153.173 301.166 L
153.445 298.496 L
153.717 300.204 L
153.988 298.688 L
154.26 300.493 L
154.531 301.502 L
154.803 303.372 L
155.074 304.546 L
155.346 302.527 L
155.617 300.659 L
155.889 302.884 L
156.16 302.961 L
156.432 302.19 L
156.703 304.451 L
156.975 306.476 L
157.246 304.537 L
157.518 299.934 L
157.789 301.547 L
158.061 304.473 L
158.332 304.104 L
158.604 305.939 L
158.875 303.574 L
159.146 302.932 L
159.418 303.616 L
159.689 302.352 L
159.961 304.407 L
160.232 306.699 L
160.504 304.919 L
160.775 303.694 L
161.047 301.789 L
161.318 301.322 L
161.59 300.868 L
161.861 303.934 L
162.133 304.919 L
162.404 299.527 L
162.676 303.509 L
162.947 304.72 L
163.219 308.024 L
163.49 304.828 L
163.762 303.474 L
164.033 304.01 L
164.305 303.847 L
164.577 300.836 L
164.848 299.22 L
165.12 297.543 L
165.391 296.675 L
165.663 301.937 L
165.934 302.586 L
166.206 300.701 L
166.477 299.467 L
166.749 301.316 L
167.02 299.686 L
167.292 300.611 L
167.563 302.843 L
167.835 299.997 L
168.106 297.535 L
168.378 290.617 L
168.649 293.33 L
168.921 290.122 L
169.192 291.963 L
169.464 294.442 L
169.735 293.534 L
170.007 295.007 L
170.278 292.837 L
170.549 292.608 L
170.821 292.596 L
171.092 288.991 L
171.364 286.283 L
171.635 287.162 L
171.907 286.844 L
172.178 285.983 L
172.45 282.521 L
172.721 283.933 L
172.993 286.028 L
173.264 283.336 L
173.536 286.549 L
173.807 289.886 L
174.079 285.748 L
174.35 285.466 L
174.622 287.152 L
174.893 285.101 L
175.165 285.073 L
175.436 283.708 L
175.708 278.713 L
175.98 277.767 L
176.251 280.62 L
176.523 282.906 L
176.794 283.025 L
177.066 284.045 L
177.337 283.845 L
177.609 283.281 L
177.88 285.06 L
178.152 283.809 L
178.423 278.724 L
178.695 285.328 L
178.966 286.429 L
179.238 285.439 L
179.509 286.086 L
179.781 285.084 L
180.052 283.534 L
180.324 285.891 L
180.595 287.503 L
180.867 290.317 L
181.138 291.042 L
181.41 291.176 L
181.681 295.502 L
181.952 296.098 L
182.224 298.364 L
182.495 298.678 L
182.767 300.266 L
183.038 301.065 L
183.31 303.445 L
183.581 303.222 L
183.853 307.942 L
184.124 310.779 L
184.396 311.894 L
184.667 310.876 L
184.939 311.013 L
185.21 310.71 L
185.482 311.423 L
185.753 311.643 L
186.025 311.106 L
186.296 311.218 L
186.568 306.822 L
186.839 305.802 L
187.111 306.737 L
187.383 308.491 L
187.654 308.428 L
187.926 304.59 L
188.197 307.05 L
188.469 307.677 L
188.74 310.379 L
189.012 307.884 L
189.283 307.369 L
189.555 305.727 L
189.826 304.25 L
190.098 303.745 L
190.369 303.387 L
190.641 298.206 L
190.912 297.207 L
191.184 299.071 L
191.455 301.444 L
191.727 299.241 L
191.998 295.296 L
192.27 295.096 L
192.541 292.595 L
192.813 292.173 L
193.084 294.208 L
193.355 296.439 L
193.627 297.009 L
193.898 297.189 L
194.17 293.564 L
194.441 295.31 L
194.713 294.769 L
194.984 297.903 L
195.256 292.69 L
195.527 295.703 L
195.799 294.375 L
196.07 293.315 L
196.342 293.976 L
196.613 296.759 L
196.885 295.769 L
197.156 298.286 L
197.428 298.279 L
197.699 300.736 L
197.971 299.206 L
198.242 296.731 L
198.514 293.773 L
198.786 290.947 L
199.057 291.028 L
199.329 287.542 L
199.6 289.483 L
199.872 288.706 L
200.143 291.879 L
200.415 293.653 L
200.686 290.72 L
200.958 290.934 L
201.229 296.554 L
201.501 295.301 L
201.772 297.286 L
202.044 296.221 L
202.315 295.565 L
202.587 294.221 L
202.858 288.624 L
203.13 292.786 L
203.401 292.168 L
203.673 296.699 L
203.944 298.535 L
204.215 296.75 L
204.487 291.249 L
204.758 292.621 L
205.03 294.628 L
205.301 295.586 L
205.573 292.433 L
205.844 296.008 L
206.116 297.736 L
206.387 301.302 L
206.659 300.834 L
206.93 304.017 L
207.202 305.104 L
207.473 305.539 L
207.745 303.66 L
208.016 307.419 L
208.288 303.916 L
208.559 305.958 L
208.831 308.564 L
209.102 314.747 L
209.374 314.192 L
209.645 314.568 L
209.917 314.504 L
210.189 316.63 L
210.46 317.381 L
210.732 317.484 L
211.003 317.75 L
211.275 314.34 L
211.546 315.589 L
211.818 316.758 L
212.089 321.973 L
212.361 324.1 L
212.632 323.104 L
212.904 321.024 L
213.175 322.253 L
213.447 318.945 L
213.718 318.76 L
213.99 325.396 L
214.261 326.138 L
214.533 326.762 L
214.804 329.024 L
215.076 325.603 L
215.347 326.944 L
215.618 325.502 L
215.89 325.061 L
216.161 324.979 L
216.433 329.517 L
216.704 326.038 L
216.976 327.357 L
217.247 325.703 L
217.519 325.61 L
217.79 326.005 L
218.062 326.097 L
218.333 329.981 L
218.605 331.799 L
218.876 331.733 L
219.148 335.799 L
219.419 335.109 L
219.691 335.388 L
219.962 339.626 L
220.234 341.793 L
220.505 339.835 L
220.777 334.359 L
221.048 333.892 L
221.32 333.433 L
221.592 333.94 L
221.863 330.823 L
222.135 328.686 L
222.406 327.098 L
222.678 328.079 L
222.949 331.683 L
223.221 331.709 L
223.492 334.58 L
223.764 336.866 L
224.035 335.348 L
224.307 332.404 L
224.578 329.752 L
224.85 332.672 L
225.121 329.939 L
225.393 334.267 L
225.664 336.287 L
225.936 333.568 L
226.207 331.568 L
226.479 328.44 L
226.75 329.369 L
227.021 329.786 L
227.293 327.372 L
227.564 326.206 L
227.836 325.684 L
228.107 324.338 L
228.379 327.336 L
228.65 330.365 L
228.922 335.028 L
229.193 334.647 L
229.465 332.356 L
229.736 333.112 L
230.008 333.995 L
230.279 334.207 L
230.551 333.689 L
230.822 335.368 L
231.094 336.617 L
231.365 334.167 L
231.637 327.736 L
231.908 327.899 L
232.18 328.714 L
232.452 326.657 L
232.723 323.491 L
232.995 319.973 L
233.266 319.3 L
233.538 318.38 L
233.809 316.629 L
234.081 316.068 L
234.352 316.127 L
234.624 320.804 L
234.895 324.038 L
235.167 323.564 L
235.438 325.519 L
235.71 329.426 L
235.981 330.557 L
236.253 331.73 L
236.524 324.346 L
236.796 321.532 L
237.067 322.101 L
237.339 320.879 L
237.61 317.732 L
237.882 321.069 L
238.153 326.423 L
238.424 325.892 L
238.696 327.015 L
238.967 325.734 L
239.239 324.836 L
239.51 329.565 L
239.782 329.335 L
240.053 328.69 L
240.325 331.019 L
240.596 324.677 L
240.868 321.745 L
241.139 321.279 L
241.411 323.077 L
241.682 320.319 L
241.954 321.17 L
242.225 323.922 L
242.497 326.069 L
242.768 327.082 L
243.04 328.556 L
243.311 329.855 L
243.583 329.407 L
243.855 327.558 L
244.126 325.4 L
244.398 324.405 L
244.669 321.736 L
244.941 319.647 L
245.212 316.906 L
245.484 317.432 L
245.755 316.997 L
246.027 315.124 L
246.298 316.122 L
246.57 314.392 L
246.841 311.18 L
247.113 313.512 L
247.384 318.645 L
247.656 316.567 L
247.927 312.98 L
248.199 309.348 L
248.47 309.354 L
248.742 304.945 L
249.013 303.052 L
249.285 302.159 L
249.556 302.758 L
249.827 297.617 L
250.099 297.148 L
250.37 301.431 L
250.642 298.977 L
250.913 299.179 L
251.185 300.143 L
251.456 302.476 L
251.728 300.211 L
251.999 299.542 L
252.271 299.421 L
252.542 302.632 L
252.814 301.479 L
253.085 299.37 L
253.357 302.628 L
253.628 304.795 L
253.9 301.668 L
254.171 304.64 L
254.443 303.664 L
254.714 305.233 L
254.986 303.319 L
255.258 302.606 L
255.529 297.713 L
255.801 296.344 L
256.072 293.078 L
256.344 295.395 L
256.615 295.62 L
256.887 296.63 L
257.158 292.179 L
257.43 291.148 L
257.701 286.962 L
257.973 288.282 L
258.244 286.991 L
258.516 290.618 L
258.787 287.516 L
259.059 287.511 L
259.33 286.903 L
259.602 289.775 L
259.873 287.385 L
260.145 290.58 L
260.416 294.627 L
260.688 293.365 L
260.959 292.498 L
261.23 292.798 L
261.502 291.399 L
261.773 288.548 L
262.045 288.104 L
262.316 290.436 L
262.588 294.864 L
262.859 292.168 L
263.131 292.444 L
263.402 294.09 L
263.674 288.14 L
263.945 289.126 L
264.217 284.573 L
264.488 281.844 L
264.76 283.329 L
265.031 278.926 L
265.303 275.307 L
265.574 271.311 L
265.846 269.445 L
266.117 274.246 L
266.389 273.432 L
266.66 274.039 L
266.932 275.151 L
267.203 274.219 L
267.475 269.636 L
267.746 266.179 L
268.018 267.074 L
268.289 269.301 L
268.561 271.219 L
268.832 269.046 L
269.104 271.921 L
269.375 267.442 L
269.647 264.753 L
269.918 265.385 L
270.19 265.861 L
270.461 267.299 L
270.733 264.398 L
271.004 264.411 L
271.276 261.72 L
271.547 262.783 L
271.819 265.869 L
272.091 263.751 L
272.362 265.317 L
272.634 259.462 L
272.905 261.505 L
273.177 264.302 L
273.448 259.929 L
273.72 264.632 L
273.991 268.298 L
274.263 267.71 L
274.534 265.93 L
274.806 265.461 L
275.077 264.562 L
275.349 265.921 L
275.62 260.751 L
275.892 260.183 L
276.163 258.383 L
276.435 259.918 L
276.706 254.616 L
276.978 252.939 L
277.249 251.261 L
277.521 251.689 L
277.792 248.81 L
278.064 246.125 L
278.335 246.282 L
278.607 245.916 L
278.878 245.332 L
279.15 245.086 L
279.421 243.823 L
279.693 244.344 L
279.964 244.353 L
280.236 241.841 L
280.507 247.859 L
280.779 250.181 L
281.05 252.334 L
281.322 249.734 L
281.593 251.933 L
281.865 249.727 L
282.136 245.484 L
282.408 247.723 L
282.679 246.54 L
282.951 247.027 L
283.222 249.886 L
283.493 247.431 L
283.765 248.49 L
284.036 247.067 L
284.308 250.46 L
284.579 250.917 L
284.851 249.341 L
285.122 246.22 L
285.394 247.018 L
285.665 250.598 L
285.937 252.07 L
286.208 254.145 L
286.48 253.91 L
286.751 255.756 L
287.023 255.82 L
287.294 256.399 L
287.566 258.264 L
287.837 260.52 L
288.109 261.358 L
288.38 260.682 L
288.652 260.015 L
288.923 262.227 L
289.195 259.799 L
289.466 252.358 L
289.738 254.776 L
290.009 256.621 L
290.281 254.868 L
290.552 254.923 L
290.824 256.059 L
291.095 259.758 L
291.367 264.627 L
291.638 263.921 L
291.91 258.703 L
292.181 253.919 L
292.453 252.917 L
292.724 252.812 L
292.996 253.184 L
293.267 252.422 L
293.539 252.974 L
293.81 247.762 L
294.082 244.369 L
294.353 245.792 L
294.625 246.492 L
294.897 246.176 L
295.168 247.576 L
295.44 248.788 L
295.711 245.367 L
295.983 248.016 L
296.254 246.882 L
296.526 244.533 L
296.797 244.109 L
297.069 248.028 L
297.34 249.298 L
297.612 251.239 L
297.883 250.275 L
298.155 253.194 L
298.426 253.471 L
298.698 251.55 L
298.969 249.338 L
299.241 249.918 L
299.512 249.001 L
299.784 250.201 L
300.055 252.769 L
300.327 250.365 L
300.598 252.178 L
300.87 252.631 L
301.141 251.79 L
301.413 250.745 L
301.684 253.943 L
301.956 256.455 L
302.227 258.288 L
302.499 259.596 L
302.77 261.576 L
303.042 262.698 L
303.313 266.224 L
303.585 264.628 L
303.856 265.189 L
304.128 265.65 L
304.399 267.605 L
304.671 269.918 L
304.942 269.001 L
305.214 271.824 L
305.485 270.447 L
305.757 267.625 L
306.028 272.981 L
306.299 270.498 L
306.571 267.514 L
306.842 264.298 L
307.114 266.278 L
307.385 269.921 L
307.657 268.844 L
307.928 269.335 L
308.2 268.577 L
308.471 271.242 L
308.743 275.01 L
309.014 275.677 L
309.286 274.981 L
309.557 276.422 L
309.829 275.458 L
310.1 275.45 L
310.372 278.379 L
310.643 283.884 L
310.915 287.868 L
311.186 286.543 L
311.458 284.555 L
311.729 282.161 L
312.001 280.705 L
312.272 285.769 L
312.544 283.059 L
312.815 281.73 L
313.087 285.527 L
313.358 286.177 L
313.63 283.939 L
313.901 286.779 L
314.173 288.418 L
314.444 289.226 L
314.716 290.471 L
314.987 289.563 L
315.259 293.088 L
315.53 291.973 L
315.802 289.881 L
316.073 286.322 L
316.345 286.047 L
316.616 288.086 L
316.888 290.177 L
317.159 293.659 L
317.431 294.09 L
317.703 293.489 L
317.974 295.153 L
318.246 292.943 L
318.517 288.55 L
318.789 290.125 L
319.06 294.653 L
319.332 294.533 L
319.603 294.794 L
319.875 293.746 L
320.146 293.487 L
320.418 296.267 L
320.689 293.396 L
320.961 296.084 L
321.232 293.619 L
321.504 293.846 L
321.775 294.859 L
322.047 296.607 L
322.318 299.511 L
322.59 302.65 L
322.861 303.181 L
323.133 302.429 L
323.404 303.027 L
323.676 302.794 L
323.947 297.72 L
324.219 299.701 L
324.49 297.065 L
324.762 297.499 L
325.033 297.812 L
325.305 302.401 L
325.576 301.534 L
325.848 300.856 L
326.119 299.346 L
326.391 298.757 L
326.662 297.579 L
326.934 300.268 L
327.205 304.38 L
327.477 306.236 L
327.748 308.17 L
328.02 309.893 L
328.291 310.838 L
328.563 312.002 L
328.834 314.357 L
329.105 311.487 L
329.377 311.819 L
329.648 311.56 L
329.92 309.565 L
330.191 308.405 L
330.463 305.487 L
330.734 302.354 L
331.006 305.472 L
331.277 309.345 L
331.549 308.77 L
331.82 301.892 L
332.092 300.848 L
332.363 296.651 L
332.635 300.513 L
332.906 306.123 L
333.178 307.495 L
333.449 305.038 L
333.721 307.523 L
333.992 307.546 L
334.264 303.937 L
334.535 296.731 L
334.807 292.925 L
335.078 293.224 L
335.35 291.756 L
335.621 291.959 L
335.893 294.204 L
336.164 293.313 L
336.436 293.644 L
336.707 291.727 L
336.979 291.695 L
337.25 286.241 L
337.522 284.186 L
337.793 286.598 L
338.065 284.288 L
338.336 287.607 L
338.608 284.637 L
338.879 286.384 L
339.151 290.005 L
339.422 294.007 L
339.694 293.28 L
339.966 293.898 L
340.237 296.581 L
340.509 295.267 L
340.78 293.899 L
341.052 289.582 L
341.323 290.692 L
341.595 291.442 L
341.866 288.659 L
342.138 285.126 L
342.409 280.881 L
342.681 285.208 L
342.952 284.761 L
343.224 282.899 L
343.495 277.562 L
343.767 279.469 L
344.038 279.777 L
344.31 280.987 L
344.581 278.34 L
344.853 275.245 L
345.124 269.845 L
345.396 270.909 L
345.667 269.841 L
345.939 268.853 L
346.21 270.066 L
346.482 271.589 L
346.753 274.606 L
347.025 275.983 L
347.296 276.894 L
347.568 273.77 L
347.839 276.689 L
348.111 275.903 L
348.382 272.508 L
348.654 275.903 L
348.925 273.602 L
349.197 277.028 L
349.468 280.218 L
349.74 280.461 L
350.011 277.633 L
350.283 271.411 L
350.554 265.677 L
350.826 267.35 L
351.097 266.265 L
351.368 266.492 L
351.64 264.006 L
351.911 262.935 L
352.183 261.889 L
352.454 262.848 L
352.726 262.874 L
352.997 264.48 L
353.269 265.285 L
353.54 265.337 L
353.812 264.2 L
354.083 262.516 L
354.355 264.668 L
354.626 265.467 L
354.898 267.401 L
355.169 269.352 L
355.441 264.76 L
355.712 263.483 L
355.984 261.624 L
356.255 263.652 L
356.527 261.218 L
356.798 261.92 L
357.07 262.452 L
357.341 264.158 L
357.613 266.822 L
357.884 265.612 L
358.156 264.683 L
358.427 266.127 L
358.699 264.506 L
358.97 265.268 L
359.242 267.321 L
359.513 268.247 L
359.785 266.203 L
360.056 264.891 L
360.328 261.581 L
360.599 259.939 L
360.871 259.729 L
361.142 261.197 L
361.414 262.554 L
361.685 263.285 L
361.957 263.442 L
362.228 266.543 L
362.5 265.578 L
362.772 266.392 L
363.043 264.967 L
363.315 267.306 L
363.586 272.78 L
363.858 276.548 L
364.129 272.717 L
364.401 267.546 L
364.672 270.907 L
364.944 272.87 L
365.215 274.56 L
365.487 273.25 L
365.758 277.109 L
366.03 277.393 L
366.301 278.108 L
366.573 277.502 L
366.844 276.223 L
367.116 271.373 L
367.387 271.283 L
367.659 269.106 L
367.93 270.732 L
368.202 272.573 L
368.473 274.817 L
368.745 273.067 L
369.016 270.682 L
369.288 268.678 L
369.559 269.007 L
369.831 274.124 L
370.102 271.029 L
370.374 272.592 L
370.645 274.084 L
370.917 274.087 L
371.188 271.44 L
371.46 271.976 L
371.731 272.764 L
372.003 274.297 L
372.274 270.379 L
372.546 271.936 L
372.817 271.448 L
373.089 267.195 L
373.36 263.667 L
373.632 267.713 L
373.903 270.086 L
374.174 273.297 L
374.446 271.58 L
374.717 273.783 L
374.989 269.653 L
375.26 266.579 L
375.532 265.642 L
375.803 266.232 L
376.075 264.281 L
376.346 266.366 L
376.618 267.611 L
376.889 266.746 L
377.161 266.454 L
377.432 263.637 L
377.704 262.963 L
377.975 256.74 L
378.247 255.048 L
378.518 256.211 L
378.79 260.418 L
379.061 257.813 L
379.333 257.071 L
379.604 256.627 L
379.876 256.085 L
380.147 256.17 L
380.419 254.274 L
380.69 250.619 L
380.962 250.924 L
381.233 247.845 L
381.505 251.672 L
381.776 249.628 L
382.048 250.919 L
382.319 252.278 L
382.591 256.258 L
382.862 261.154 L
383.134 264.652 L
383.405 264.427 L
383.677 267.667 L
383.948 266.648 L
384.22 266.745 L
384.491 266.454 L
384.763 270.03 L
385.034 267.617 L
385.306 265.335 L
385.578 261.098 L
385.849 260.467 L
386.121 263.341 L
386.392 264.296 L
386.664 266.627 L
386.935 264.753 L
387.207 267.596 L
387.478 265.963 L
387.75 266.266 L
388.021 266.085 L
388.293 265.355 L
388.564 268.634 L
388.836 266.446 L
389.107 269.392 L
389.379 267.201 L
389.65 268.073 L
389.922 267.56 L
390.193 268.145 L
390.465 270.096 L
390.736 270.344 L
391.008 269.71 L
391.279 269.942 L
391.551 276.862 L
391.822 277.514 L
392.094 283.645 L
392.365 281.59 L
392.637 279.402 L
392.908 278.739 L
393.18 276.819 L
393.451 280.539 L
393.723 279.281 L
393.994 283.895 L
394.266 282.65 L
394.537 283.314 L
394.809 283.274 L
395.08 283.006 L
395.352 279.242 L
395.623 281.074 L
395.895 280.093 L
396.166 279.843 L
396.438 283.611 L
396.709 285.916 L
396.98 288.244 L
397.252 286.842 L
397.523 286.867 L
397.795 280.397 L
398.066 284.101 L
398.338 290.438 L
398.609 292.896 L
398.881 297.54 L
399.152 297.114 L
399.424 302.355 L
399.695 298.289 L
399.967 300.236 L
400.238 298.901 L
400.51 301.16 L
400.781 301.909 L
401.053 304.699 L
401.324 305.973 L
401.596 306.278 L
401.867 309.621 L
402.139 307.16 L
402.41 309.269 L
402.682 306.48 L
402.953 308.418 L
403.225 310.408 L
403.496 309.215 L
403.768 311.026 L
404.039 311.995 L
404.311 316.62 L
404.582 318.759 L
404.854 321.157 L
405.125 321.836 L
405.397 323.434 L
405.668 326.759 L
405.94 331.564 L
406.211 338.456 L
406.483 340.13 L
406.754 344.919 L
407.026 345.077 L
407.297 345.587 L
407.569 351.706 L
407.841 354.008 L
408.112 355.949 L
408.384 355.017 L
408.655 353.406 L
408.927 354.102 L
409.198 350.254 L
409.47 351.163 L
409.741 349.271 L
410.013 350.254 L
410.284 350.099 L
410.556 347.68 L
410.827 347.496 L
411.099 347.096 L
411.37 348.498 L
411.642 349.158 L
411.913 349.864 L
412.185 350.541 L
412.456 354.108 L
412.728 356.987 L
412.999 353.889 L
413.271 351.64 L
413.542 350.18 L
413.814 344.565 L
414.085 346.303 L
414.357 347.776 L
414.628 346.322 L
414.9 348.648 L
415.171 347.495 L
415.443 348.883 L
415.714 347.58 L
415.986 347.003 L
416.257 348.879 L
416.529 348.166 L
416.8 346.089 L
417.072 344.691 L
417.343 342.297 L
417.615 340.488 L
417.886 340.083 L
418.158 336.52 L
418.429 335.445 L
418.701 336.639 L
418.972 338.489 L
419.243 336.909 L
419.515 335.586 L
419.786 340.018 L
420.058 338.287 L
420.329 340.382 L
420.601 336.765 L
420.872 331.794 L
421.144 331.047 L
421.415 334.533 L
421.687 332.31 L
421.958 336.164 L
422.23 335.305 L
422.501 341.265 L
422.773 345.653 L
423.044 343.449 L
423.316 344.031 L
423.587 340.663 L
423.859 340.914 L
424.13 342.014 L
424.402 347.65 L
424.673 346.278 L
424.945 346.393 L
425.216 348.514 L
425.488 351.882 L
425.759 353.766 L
426.031 355.153 L
426.302 353.523 L
426.574 350.676 L
426.845 351.199 L
427.117 353.761 L
427.388 354.307 L
427.66 355.349 L
427.931 355.689 L
428.203 360.521 L
428.474 363.027 L
428.746 366.769 L
429.017 369.292 L
429.289 371.508 L
429.56 373.494 L
429.832 375.438 L
430.103 375.473 L
430.375 375.024 L
430.647 380.725 L
430.918 379.928 L
431.19 382.803 L
431.461 383.004 L
431.733 383.187 L
432.004 388.444 L
432.276 388.429 L
432.547 385.955 L
432.819 387.946 L
433.09 389.04 L
433.362 390.892 L
433.633 392.934 L
433.905 398.856 L
434.176 403.499 L
434.448 401.966 L
434.719 401.315 L
434.991 396.653 L
435.262 399.396 L
435.534 402.338 L
435.805 402.132 L
436.077 404.126 L
436.348 403.219 L
436.62 402.415 L
436.891 402.54 L
437.163 398.273 L
437.434 398.64 L
437.706 396.216 L
437.977 397.571 L
438.249 399.711 L
438.52 398.888 L
438.792 399.662 L
439.063 404.527 L
439.335 406.228 L
439.606 407.095 L
439.878 408.435 L
440.149 407.98 L
440.421 404.982 L
440.692 402.404 L
440.964 399.896 L
441.235 400.023 L
441.507 398.823 L
441.778 397.788 L
442.049 396.966 L
442.321 394.084 L
442.592 388.258 L
442.864 382.618 L
443.135 382.196 L
443.407 378.429 L
443.678 377.572 L
443.95 373.672 L
444.221 373.025 L
444.493 370.508 L
444.764 375.352 L
445.036 374.298 L
445.307 372.9 L
445.579 372.806 L
445.85 368.28 L
446.122 368.246 L
446.393 366.615 L
446.665 362.116 L
446.936 358.918 L
447.208 356.217 L
447.479 358.435 L
447.751 357.546 L
448.022 358.132 L
448.294 353.755 L
448.565 354.037 L
448.837 353.263 L
449.108 351.477 L
449.38 350.93 L
449.651 348.928 L
449.923 348.533 L
450.194 345.793 L
450.466 340.638 L
450.737 339.155 L
451.009 340.757 L
451.28 343.655 L
451.552 342.01 L
451.823 341.538 L
452.095 343.071 L
452.366 341.493 L
452.638 340.421 L
452.909 340.467 L
453.181 342.279 L
453.453 344.652 L
453.724 344.234 L
453.996 341.168 L
454.267 338.417 L
454.539 338.027 L
454.81 332.848 L
455.082 326.129 L
455.353 324.989 L
455.625 326.574 L
455.896 326.303 L
456.168 330.689 L
456.439 330.045 L
456.711 333.35 L
456.982 332.745 L
457.254 332.262 L
457.525 329.81 L
457.797 327.395 L
458.068 331.209 L
458.34 330.24 L
458.611 330.516 L
458.883 328.446 L
459.154 328.251 L
459.426 327.261 L
459.697 327.291 L
459.969 328.208 L
460.24 326.497 L
460.512 326.376 L
460.783 325.942 L
461.055 325.294 L
461.326 325.07 L
461.598 326.412 L
461.869 323.191 L
462.141 324.291 L
462.412 323.902 L
462.684 326.869 L
462.955 325.156 L
463.227 324.685 L
463.498 320.96 L
463.77 321.157 L
464.041 321.877 L
464.313 323.285 L
464.584 328.829 L
464.855 327.644 L
465.127 329.799 L
465.398 330.084 L
465.67 332.885 L
465.941 331.236 L
466.213 328.831 L
466.484 330.603 L
466.756 329.34 L
467.027 325.753 L
467.299 324.887 L
467.57 321.913 L
467.842 321.138 L
468.113 327.24 L
468.385 324.157 L
468.656 325.831 L
468.928 325.353 L
469.199 323.84 L
469.471 327.207 L
469.742 327.092 L
470.014 331.645 L
470.285 327.716 L
470.557 328.611 L
470.828 329.406 L
471.1 331.856 L
471.371 333.771 L
471.643 336.264 L
471.914 337.888 L
472.186 338.47 L
472.457 337.136 L
472.729 335.154 L
473 336.869 L
473.272 333.747 L
473.543 331.134 L
473.815 331.773 L
474.086 330.143 L
474.358 330.629 L
474.629 327.585 L
474.901 328.062 L
475.172 331.803 L
475.444 334.994 L
475.716 334.754 L
475.987 337.049 L
476.259 335.908 L
476.53 333.668 L
476.802 335.311 L
477.073 339.953 L
477.345 338.866 L
477.616 336.873 L
477.888 333.256 L
478.159 330.97 L
478.431 332.867 L
478.702 332.962 L
478.974 332.48 L
479.245 333.137 L
479.517 333.639 L
479.788 334.118 L
480.06 329.697 L
480.331 332.252 L
480.603 330.724 L
480.874 331.137 L
481.146 332.569 L
481.417 334.954 L
481.689 333.38 L
481.96 328.958 L
482.232 327.12 L
482.503 327.783 L
482.775 322.773 L
483.046 322.518 L
483.318 321.727 L
483.589 320.021 L
483.861 319.234 L
484.132 320.595 L
484.404 319.358 L
484.675 316.272 L
484.947 317.466 L
485.218 317.682 L
485.49 314.216 L
485.761 313.719 L
486.033 309.826 L
486.304 308.86 L
486.576 302.992 L
486.847 304.558 L
487.118 306.924 L
487.39 307.849 L
487.661 309.255 L
487.933 315.693 L
488.204 316.514 L
488.476 320.359 L
488.747 321.319 L
489.019 317.783 L
489.29 317.109 L
489.562 313.181 L
489.833 315.766 L
490.105 320.246 L
490.376 319.684 L
490.648 315.709 L
490.919 310.813 L
491.191 311.26 L
491.462 310.262 L
491.734 306.786 L
492.005 303.661 L
492.277 304.437 L
492.548 300.754 L
492.82 299.556 L
493.091 297.378 L
493.363 294.756 L
493.634 296.244 L
493.906 295.706 L
494.177 296.884 L
494.449 297.016 L
494.72 296.544 L
494.992 296.379 L
495.263 300.988 L
495.535 298.401 L
495.806 299.663 L
496.078 301.458 L
496.349 298.542 L
496.621 297.492 L
496.892 296.236 L
497.164 298.613 L
497.435 294.591 L
497.707 294.999 L
497.978 291.614 L
498.25 292.369 L
498.522 291.033 L
498.793 287.928 L
499.065 285.935 L
499.336 285.767 L
499.608 282.576 L
499.879 285.6 L
500.151 282.597 L
500.422 281.581 L
500.694 279.899 L
500.965 277.44 L
501.237 276.542 L
501.508 280.103 L
501.78 280.864 L
502.051 278.368 L
502.323 276.869 L
502.594 276.226 L
502.866 276.049 L
503.137 278.672 L
503.409 277.386 L
503.68 276.7 L
503.952 270.25 L
504.223 270.303 L
504.495 266.504 L
504.766 263.962 L
505.038 260.085 L
505.309 262.203 L
505.581 268.579 L
505.852 264.805 L
506.124 263.385 L
506.395 262.849 L
506.667 264.054 L
506.938 265.315 L
507.21 261.214 L
507.481 260.975 L
507.753 258.411 L
508.024 258.777 L
508.296 261.265 L
508.567 261.511 L
508.839 257.085 L
509.11 257.883 L
509.382 253.655 L
509.653 248.807 L
509.924 246.731 L
510.196 243.249 L
510.467 246.979 L
510.739 247.959 L
511.01 245.091 L
511.282 245.219 L
511.553 248.229 L
511.825 251.781 L
512.096 248.234 L
512.368 243.939 L
512.64 245.38 L
512.911 244.102 L
513.182 241.541 L
513.454 241.964 L
513.726 237.005 L
513.997 237.566 L
514.268 234.961 L
514.54 235.127 L
514.812 233.757 L
515.083 230.787 L
515.354 232.085 L
515.626 233.665 L
515.898 230.394 L
516.169 230.344 L
516.44 228.619 L
516.712 226.518 L
516.984 229.178 L
517.255 224.954 L
517.526 223.122 L
517.798 223.026 L
518.07 219.512 L
518.341 218.474 L
518.612 218.305 L
518.884 217.504 L
519.156 212.962 L
519.427 215.257 L
519.698 218.419 L
519.97 216.579 L
520.242 218.522 L
520.513 217.949 L
520.784 219.425 L
521.056 217.44 L
521.328 214.469 L
521.599 211.987 L
521.87 214.796 L
522.142 219.208 L
522.414 220.485 L
522.685 222.844 L
522.956 218.311 L
523.228 219.607 L
523.5 219.696 L
523.771 222.054 L
524.042 218.406 L
524.314 218.039 L
524.586 217.485 L
524.857 219.81 L
525.128 218.888 L
525.4 218.659 L
525.672 216.567 L
525.943 216.169 L
526.214 217.302 L
526.486 215.705 L
526.758 221.569 L
527.029 222.603 L
527.3 226.688 L
527.572 229.988 L
527.844 230.253 L
528.115 229.922 L
528.386 229.892 L
528.658 231.477 L
528.93 230.547 L
529.201 231.809 L
529.472 230.939 L
529.744 231.366 L
530.016 229.209 L
530.287 233.236 L
530.558 239.691 L
530.83 243.705 L
531.102 245.762 L
531.373 249.125 L
531.644 252.765 L
531.916 253.088 L
532.188 251.943 L
532.459 249.266 L
532.731 251.252 L
533.002 253.327 L
533.273 250.144 L
533.545 248.407 L
533.817 252.803 L
534.088 255.732 L
534.359 254.222 L
534.631 255.216 L
534.903 256.143 L
535.174 258.351 L
535.445 259.352 L
535.717 260.318 L
535.989 258.819 L
536.26 259.587 L
536.531 258.696 L
536.803 256.141 L
537.075 256.8 L
537.346 259.585 L
537.617 258.899 L
537.889 261.922 L
538.161 260.179 L
538.432 258.557 L
538.703 259.555 L
538.975 258.938 L
539.247 261.465 L
539.518 260.765 L
539.789 258.799 L
540.061 259.677 L
540.333 260.543 L
540.604 265.255 L
540.875 266.617 L
541.147 262.96 L
541.419 262.306 L
541.69 263.183 L
541.961 263.924 L
542.233 264.439 L
542.505 261.563 L
542.776 262.848 L
543.047 260.525 L
543.319 260.801 L
543.591 261.566 L
543.862 264.168 L
544.133 265.305 L
544.405 264.598 L
544.677 266.864 L
544.948 261.467 L
545.219 263.121 L
545.491 268.757 L
545.763 270.767 L
546.034 268.389 L
546.305 268.311 L
546.577 263.43 L
546.849 259.77 L
547.12 259.511 L
547.391 260.469 L
547.663 264.392 L
547.935 268.02 L
548.206 270.392 L
548.477 270.69 L
548.749 271.437 L
549.021 270.791 L
549.292 274.216 L
549.563 277.492 L
549.835 278.003 L
550.107 280.613 L
550.378 279.842 L
550.649 282.845 L
550.921 285.153 L
551.193 283.458 L
551.464 282.662 L
551.735 282.324 L
552.007 284.475 L
552.279 289.871 L
552.55 288.016 L
552.821 288.388 L
553.093 290.582 L
553.365 290.289 L
553.636 290.579 L
553.907 291.363 L
554.179 291.144 L
554.451 289.803 L
554.722 292.165 L
554.994 295.472 L
555.265 301.254 L
555.536 304.151 L
555.808 304.041 L
556.08 300.491 L
556.351 303.232 L
556.622 302.486 L
556.894 301.185 L
557.166 301.471 L
557.437 301.885 L
557.708 303.213 L
557.98 305.302 L
558.252 306.775 L
558.523 305.005 L
558.794 301.329 L
559.066 301.183 L
559.338 302.065 L
559.609 303.801 L
559.88 309.09 L
560.152 307.932 L
560.424 309.287 L
560.695 311.136 L
560.966 311.21 L
561.238 312.279 L
561.51 310.793 L
561.781 310.854 L
562.052 310.407 L
562.324 312.417 L
562.596 315.658 L
562.867 316.427 L
563.138 319.542 L
563.41 318.128 L
563.682 313.277 L
563.953 310.396 L
564.224 312.149 L
564.496 313.273 L
564.768 312.485 L
565.039 309.874 L
565.31 309.463 L
565.582 308.107 L
565.854 310.681 L
566.125 308.935 L
566.396 308.223 L
566.668 308.941 L
566.94 309.561 L
567.211 307.655 L
567.482 307.879 L
567.754 309.694 L
568.026 304.266 L
568.297 304.121 L
568.568 305.046 L
568.84 300.521 L
569.112 302.922 L
569.383 297.867 L
569.654 297.261 L
569.926 296.833 L
570.198 292.985 L
570.469 294.155 L
570.74 295.665 L
571.012 298.569 L
571.284 295.269 L
571.555 295.025 L
571.826 294.692 L
572.098 292.166 L
572.37 289.001 L
572.641 290.882 L
572.912 291.228 L
573.184 288.219 L
573.456 290.169 L
573.727 286.756 L
573.998 286.194 L
574.27 285.118 L
574.542 285.878 L
574.813 284.936 L
575.084 286.065 L
575.356 282.091 L
575.628 279.467 L
575.899 275.384 L
576.17 278.589 L
576.442 276.536 L
576.714 275.893 L
576.985 274.594 L
577.256 270.611 L
577.528 265.128 L
577.799 265.446 L
578.071 262.258 L
578.343 262.141 L
578.614 261.872 L
578.885 257.887 L
579.157 256.754 L
579.429 256.817 L
579.7 254.4 L
579.971 255.281 L
580.243 253.948 L
580.515 250.957 L
580.786 247.714 L
581.057 247.061 L
581.329 244.628 L
581.601 245.388 L
581.872 243.823 L
582.143 243.481 L
582.415 242.375 L
582.687 238.155 L
582.958 235.659 L
583.229 230.766 L
583.501 228.939 L
583.773 230.407 L
584.044 227.991 L
584.315 228.032 L
584.587 225.906 L
584.859 223.388 L
585.13 220.91 L
585.401 219.885 L
585.673 212.773 L
585.945 208.489 L
586.216 205.76 L
586.487 207.265 L
586.759 206.118 L
587.031 203.724 L
587.302 201.116 L
587.573 200.196 L
587.845 200.028 L
588.117 198.41 L
588.388 197.823 L
588.659 196.079 L
588.931 196.284 L
589.203 196.554 L
589.474 193.655 L
589.745 193.657 L
590.017 193.873 L
590.289 188.14 L
590.56 187.071 L
590.831 184.677 L
591.103 182.768 L
591.375 180.681 L
591.646 182.404 L
591.917 181.237 L
592.189 177.645 L
592.461 175.18 L
592.732 175.285 L
593.003 174.849 L
593.275 172.482 L
593.547 170.067 L
593.818 169.165 L
594.089 166.64 L
594.361 165.134 L
594.633 160.293 L
594.904 158.65 L
595.175 158.814 L
595.447 160.909 L
595.719 162.525 L
595.99 162.313 L
596.261 161.933 L
596.533 165.442 L
596.805 164.226 L
597.076 164.484 L
597.347 161.936 L
597.619 166.52 L
597.891 165.899 L
598.162 163.209 L
598.433 165.598 L
598.705 165.089 L
598.977 165.622 L
599.248 166.782 L
599.519 166.611 L
599.791 161.607 L
600.063 163.292 L
600.334 160.744 L
600.606 162.064 L
600.877 160.783 L
601.148 165.159 L
601.42 165.544 L
601.692 165.402 L
601.963 169.881 L
602.234 169.232 L
602.506 169.606 L
602.778 169.703 L
603.049 163.575 L
603.32 161.654 L
603.592 158.622 L
603.864 157.023 L
604.135 157.421 L
604.406 157.686 L
604.678 157.199 L
604.95 157.235 L
605.221 152.434 L
605.492 150.43 L
605.764 151.297 L
606.036 150.38 L
606.307 147.492 L
606.578 145.067 L
606.85 148.292 L
607.122 145.97 L
607.393 145.019 L
607.664 143.424 L
607.936 143.759 L
608.208 142.693 L
608.479 141.275 L
608.75 142.193 L
609.022 142.815 L
609.294 143.111 L
609.565 140.983 L
609.836 140.612 L
610.108 142.394 L
610.38 137.961 L
610.651 138.517 L
610.922 137.389 L
611.194 137.99 L
611.466 137.006 L
611.737 136.742 L
612.008 133.438 L
612.28 132.296 L
612.552 134.727 L
612.823 134.678 L
613.094 132.766 L
613.366 135.812 L
613.638 137.543 L
613.909 137.943 L
614.18 138.369 L
614.452 138.274 L
614.724 138.509 L
614.995 141.896 L
615.266 144.422 L
615.538 143.606 L
615.81 145.846 L
616.081 147.439 L
616.352 149.224 L
616.624 153.446 L
616.896 156.425 L
617.167 162.387 L
617.438 164.887 L
617.71 168.14 L
617.982 169.744 L
618.253 172.576 L
618.524 167.113 L
618.796 162.916 L
619.068 164.502 L
619.339 167.493 L
619.61 167.49 L
619.882 165.285 L
620.154 170.98 L
620.425 168.784 L
620.696 173.4 L
620.968 176.171 L
621.24 185.499 L
621.511 182.63 L
621.782 185.466 L
622.054 183.295 L
622.326 183.142 L
622.597 185.62 L
622.869 183.654 L
623.14 183.206 L
623.411 183.401 L
623.683 182.714 L
623.955 185.288 L
624.226 186.189 L
624.497 187.698 L
624.769 184.176 L
625.041 180.213 L
625.312 181.696 L
625.583 180.051 L
625.855 184.964 L
626.127 187.849 L
626.398 195.303 L
626.669 192.266 L
626.941 193.877 L
627.213 194.648 L
627.484 192.898 L
627.755 193.769 L
628.027 195.911 L
628.299 199.908 L
628.57 201.635 L
628.841 201.798 L
629.113 200.758 L
629.385 201.867 L
629.656 204.176 L
629.927 201.428 L
S
GR
GS
[0.6 0 0 0.6 0 0] CT
0 0 1 RC
1 LJ
3.333 LW
N
91 288 M
91.271 310.78 L
91.543 310.512 L
91.814 310.235 L
92.086 309.996 L
92.357 309.739 L
92.629 309.472 L
92.9 309.224 L
93.172 308.951 L
93.443 308.689 L
93.715 308.4 L
93.987 308.149 L
94.258 307.892 L
94.53 307.343 L
94.801 306.665 L
95.073 306.043 L
95.344 305.521 L
95.616 305.214 L
95.887 305.094 L
96.159 305.03 L
96.43 304.972 L
96.701 304.949 L
96.973 304.967 L
97.244 305.017 L
97.516 305.096 L
97.787 305.251 L
98.059 305.471 L
98.33 305.683 L
98.602 305.848 L
98.873 305.977 L
99.145 306.111 L
99.416 306.302 L
99.688 306.371 L
99.96 305.889 L
100.231 305.349 L
100.503 304.88 L
100.774 304.405 L
101.046 303.837 L
101.317 303.287 L
101.589 302.749 L
101.86 302.307 L
102.132 302.037 L
102.403 302.157 L
102.674 302.276 L
102.946 302.407 L
103.217 302.521 L
103.489 302.627 L
103.76 302.717 L
104.032 302.805 L
104.303 302.92 L
104.575 303.039 L
104.846 303.156 L
105.118 303.254 L
105.39 303.364 L
105.661 303.487 L
105.933 303.613 L
106.204 303.739 L
106.476 303.853 L
106.747 303.966 L
107.019 304.062 L
107.29 304.16 L
107.562 304.273 L
107.833 304.386 L
108.104 304.485 L
108.376 304.583 L
108.647 304.68 L
108.919 304.783 L
109.19 304.887 L
109.462 304.993 L
109.733 305.091 L
110.005 305.186 L
110.276 305.268 L
110.548 305.354 L
110.82 305.458 L
111.091 305.558 L
111.363 305.658 L
111.634 305.737 L
111.906 305.816 L
112.177 305.34 L
112.449 304.364 L
112.72 303.357 L
112.992 302.41 L
113.263 301.46 L
113.535 300.605 L
113.806 299.691 L
114.077 298.704 L
114.349 297.713 L
114.62 296.763 L
114.892 295.838 L
115.163 302.484 L
115.435 314.275 L
115.706 314.439 L
115.978 314.523 L
116.249 314.535 L
116.521 314.74 L
116.793 315.07 L
117.064 315.415 L
117.336 315.77 L
117.607 316.078 L
117.879 316.394 L
118.15 316.652 L
118.422 316.919 L
118.693 317.201 L
118.965 317.154 L
119.236 316.984 L
119.507 316.822 L
119.779 316.666 L
120.05 316.516 L
120.322 316.371 L
120.593 316.214 L
120.865 316.059 L
121.136 315.98 L
121.408 315.976 L
121.679 315.845 L
121.951 315.336 L
122.223 314.836 L
122.494 314.782 L
122.766 314.768 L
123.037 314.755 L
123.309 314.745 L
123.58 314.732 L
123.852 314.705 L
124.123 314.654 L
124.395 314.584 L
124.666 314.407 L
124.938 313.56 L
125.209 312.66 L
125.48 311.761 L
125.752 311.508 L
126.023 311.183 L
126.295 310.759 L
126.566 310.371 L
126.838 309.926 L
127.109 309.608 L
127.381 309.428 L
127.652 309.285 L
127.924 309.153 L
128.195 309.011 L
128.467 308.864 L
128.738 308.713 L
129.01 308.758 L
129.281 308.85 L
129.553 309.436 L
129.824 310.293 L
130.096 311.214 L
130.367 312.155 L
130.639 313.064 L
130.911 313.956 L
131.182 314.749 L
131.454 315.593 L
131.725 316.586 L
131.997 316.802 L
132.268 316.529 L
132.54 315.462 L
132.811 315.033 L
133.083 315.062 L
133.354 315.108 L
133.626 315.166 L
133.897 315.243 L
134.169 315.328 L
134.44 315.415 L
134.712 315.521 L
134.983 315.112 L
135.255 314.2 L
135.526 313.344 L
135.798 312.52 L
136.069 311.705 L
136.34 310.936 L
136.612 310.983 L
136.883 311.148 L
137.155 311.338 L
137.426 311.523 L
137.698 311.701 L
137.969 311.815 L
138.241 311.89 L
138.512 312.324 L
138.784 312.939 L
139.055 313.33 L
139.327 313.442 L
139.598 313.557 L
139.87 313.695 L
140.141 313.856 L
140.413 314.042 L
140.684 314.224 L
140.956 314.402 L
141.227 314.602 L
141.499 315.212 L
141.77 316.229 L
142.042 316.904 L
142.314 316.203 L
142.585 315.087 L
142.857 314.178 L
143.128 314.508 L
143.4 315.005 L
143.671 315.468 L
143.943 315.69 L
144.214 315.841 L
144.486 315.96 L
144.757 315.139 L
145.029 313.411 L
145.3 311.836 L
145.572 311.173 L
145.843 312.01 L
146.115 312.755 L
146.386 312.812 L
146.658 312.767 L
146.929 312.719 L
147.201 312.699 L
147.472 312.658 L
147.743 312.595 L
148.015 312.68 L
148.286 312.942 L
148.558 313.136 L
148.829 313.327 L
149.101 314.083 L
149.372 315.234 L
149.644 315.389 L
149.915 314.388 L
150.187 313.19 L
150.458 311.967 L
150.73 310.983 L
151.001 310.685 L
151.273 310.439 L
151.544 310.255 L
151.816 310.952 L
152.087 311.698 L
152.359 312.479 L
152.63 313.234 L
152.902 314.106 L
153.173 314.514 L
153.445 314.351 L
153.717 314.181 L
153.988 313.928 L
154.26 313.572 L
154.531 313.174 L
154.803 312.665 L
155.074 312.259 L
155.346 311.908 L
155.617 311.603 L
155.889 310.31 L
156.16 308.417 L
156.432 306.628 L
156.703 304.802 L
156.975 303.074 L
157.246 301.501 L
157.518 299.489 L
157.789 297.629 L
158.061 295.65 L
158.332 293.954 L
158.604 292.173 L
158.875 291.159 L
159.146 290.756 L
159.418 290.323 L
159.689 289.314 L
159.961 287.373 L
160.232 285.84 L
160.504 286.144 L
160.775 286.749 L
161.047 287.398 L
161.318 288.234 L
161.59 290.407 L
161.861 292.642 L
162.133 294.93 L
162.404 295.93 L
162.676 296.55 L
162.947 297.185 L
163.219 297.827 L
163.49 297.626 L
163.762 297.31 L
164.033 296.913 L
164.305 296.613 L
164.577 296.313 L
164.848 295.926 L
165.12 295.478 L
165.391 294.975 L
165.663 294.542 L
165.934 294.077 L
166.206 293.647 L
166.477 293.929 L
166.749 294.666 L
167.02 295.531 L
167.292 296.643 L
167.563 297.101 L
167.835 297.105 L
168.106 297.102 L
168.378 297.087 L
168.649 297.066 L
168.921 297.032 L
169.192 296.95 L
169.464 296.771 L
169.735 296.546 L
170.007 296.632 L
170.278 296.884 L
170.549 296.978 L
170.821 296.804 L
171.092 296.705 L
171.364 296.644 L
171.635 296.618 L
171.907 296.555 L
172.178 296.386 L
172.45 296.468 L
172.721 297.736 L
172.993 299.494 L
173.264 301.326 L
173.536 303.229 L
173.807 305.057 L
174.079 305.761 L
174.35 305.932 L
174.622 306.095 L
174.893 306.255 L
175.165 306.443 L
175.436 306.774 L
175.708 308.037 L
175.98 309.305 L
176.251 310.546 L
176.523 311.761 L
176.794 312.991 L
177.066 313.839 L
177.337 313.517 L
177.609 313.153 L
177.88 312.155 L
178.152 311.099 L
178.423 309.988 L
178.695 308.969 L
178.966 307.934 L
179.238 307.009 L
179.509 305.999 L
179.781 305.061 L
180.052 304.094 L
180.324 303.963 L
180.595 304.433 L
180.867 305.19 L
181.138 304.98 L
181.41 304.596 L
181.681 304.131 L
181.952 303.62 L
182.224 303.073 L
182.495 302.634 L
182.767 301.359 L
183.038 299.604 L
183.31 298.689 L
183.581 297.725 L
183.853 296.958 L
184.124 297.374 L
184.396 298.039 L
184.667 298.452 L
184.939 298.219 L
185.21 297.983 L
185.482 297.723 L
185.753 297.479 L
186.025 297.049 L
186.296 296.373 L
186.568 295.719 L
186.839 294.771 L
187.111 294.207 L
187.383 294.078 L
187.654 294.06 L
187.926 294.048 L
188.197 294.05 L
188.469 294.059 L
188.74 294.069 L
189.012 294.082 L
189.283 294.111 L
189.555 294.102 L
189.826 293.339 L
190.098 292.227 L
190.369 291.626 L
190.641 292.336 L
190.912 294.615 L
191.184 296.743 L
191.455 297.973 L
191.727 299.219 L
191.998 300.402 L
192.27 301.072 L
192.541 301.2 L
192.813 301.179 L
193.084 302.305 L
193.355 304.083 L
193.627 306.053 L
193.898 305.904 L
194.17 305.341 L
194.441 305 L
194.713 305.209 L
194.984 305.429 L
195.256 305.649 L
195.527 305.871 L
195.799 305.673 L
196.07 305.183 L
196.342 304.928 L
196.613 305.353 L
196.885 305.874 L
197.156 306.315 L
197.428 305.86 L
197.699 305.745 L
197.971 306.847 L
198.242 308.52 L
198.514 310.573 L
198.786 312.358 L
199.057 313.381 L
199.329 313.929 L
199.6 315.776 L
199.872 317.584 L
200.143 318.662 L
200.415 319.67 L
200.686 320.108 L
200.958 318.684 L
201.229 317.084 L
201.501 316.211 L
201.772 315.612 L
202.044 315.456 L
202.315 316.007 L
202.587 315.886 L
202.858 315.948 L
203.13 316.577 L
203.401 317.796 L
203.673 318.319 L
203.944 318.794 L
204.215 319.762 L
204.487 320.726 L
204.758 321.86 L
205.03 323.817 L
205.301 325.754 L
205.573 327.61 L
205.844 329.332 L
206.116 331.179 L
206.387 333.131 L
206.659 334.613 L
206.93 335.806 L
207.202 336.1 L
207.473 336.957 L
207.745 337.337 L
208.016 338.828 L
208.288 340.608 L
208.559 341.246 L
208.831 340.131 L
209.102 340.063 L
209.374 340.449 L
209.645 340.582 L
209.917 339.581 L
210.189 338.336 L
210.46 337.379 L
210.732 337.727 L
211.003 338.145 L
211.275 338.549 L
211.546 338.946 L
211.818 339.27 L
212.089 339.554 L
212.361 339.825 L
212.632 340.809 L
212.904 341.792 L
213.175 342.162 L
213.447 342.256 L
213.718 342.3 L
213.99 342.308 L
214.261 342.306 L
214.533 342.251 L
214.804 341.478 L
215.076 340.434 L
215.347 339.235 L
215.618 338.294 L
215.89 338.188 L
216.161 338.189 L
216.433 338.195 L
216.704 338.206 L
216.976 338.216 L
217.247 338.241 L
217.519 338.813 L
217.79 339.91 L
218.062 340.919 L
218.333 341.942 L
218.605 342.996 L
218.876 343.257 L
219.148 343.319 L
219.419 344.205 L
219.691 345.03 L
219.962 345.079 L
220.234 344.994 L
220.505 344.989 L
220.777 344.689 L
221.048 344.13 L
221.32 343.591 L
221.592 342.599 L
221.863 341.053 L
222.135 339.557 L
222.406 339.003 L
222.678 338.667 L
222.949 338.315 L
223.221 337.988 L
223.492 338.624 L
223.764 338.927 L
224.035 337.953 L
224.307 336.448 L
224.578 335.024 L
224.85 333.624 L
225.121 332.192 L
225.393 332.807 L
225.664 334.103 L
225.936 334.049 L
226.207 333.956 L
226.479 333.878 L
226.75 333.75 L
227.021 333.529 L
227.293 333.278 L
227.564 333.01 L
227.836 332.761 L
228.107 332.502 L
228.379 332.248 L
228.65 332.03 L
228.922 331.809 L
229.193 331.65 L
229.465 331.585 L
229.736 331.57 L
230.008 330.397 L
230.279 328.917 L
230.551 328.298 L
230.822 328.463 L
231.094 329.792 L
231.365 331.201 L
231.637 332.68 L
231.908 334.049 L
232.18 335.223 L
232.452 335.088 L
232.723 333.944 L
232.995 332.469 L
233.266 331.218 L
233.538 330.997 L
233.809 330.807 L
234.081 330.623 L
234.352 330.89 L
234.624 331.227 L
234.895 331.528 L
235.167 331.363 L
235.438 329.774 L
235.71 328.613 L
235.981 328.282 L
236.253 327.966 L
236.524 327.64 L
236.796 327.259 L
237.067 326.827 L
237.339 326.36 L
237.61 325.789 L
237.882 324.28 L
238.153 322.942 L
238.424 322.739 L
238.696 323.082 L
238.967 322.663 L
239.239 320.976 L
239.51 319.533 L
239.782 318.021 L
240.053 316.367 L
240.325 314.137 L
240.596 312.189 L
240.868 311.658 L
241.139 311.557 L
241.411 311.43 L
241.682 310.943 L
241.954 310.302 L
242.225 309.722 L
242.497 309.103 L
242.768 308.561 L
243.04 308.01 L
243.311 307.425 L
243.583 306.832 L
243.855 306.297 L
244.126 306.421 L
244.398 306.576 L
244.669 306.34 L
244.941 305.754 L
245.212 305.118 L
245.484 304.522 L
245.755 303.865 L
246.027 303.239 L
246.298 302.811 L
246.57 302.68 L
246.841 303.414 L
247.113 303.943 L
247.384 303.313 L
247.656 301.01 L
247.927 297.702 L
248.199 295.334 L
248.47 293.046 L
248.742 290.975 L
249.013 290.425 L
249.285 290.908 L
249.556 292.528 L
249.827 294.578 L
250.099 295.685 L
250.37 295.302 L
250.642 294.905 L
250.913 295.116 L
251.185 294.951 L
251.456 294.09 L
251.728 293.033 L
251.999 293.007 L
252.271 294.355 L
252.542 294.978 L
252.814 295.334 L
253.085 294.759 L
253.357 292.551 L
253.628 290.074 L
253.9 288.026 L
254.171 285.897 L
254.443 284.277 L
254.714 283.181 L
254.986 282.506 L
255.258 280.521 L
255.529 279.014 L
255.801 278.552 L
256.072 278.25 L
256.344 277.912 L
256.615 277.589 L
256.887 278.521 L
257.158 280.412 L
257.43 280.874 L
257.701 280.331 L
257.973 279.516 L
258.244 278.843 L
258.516 278.538 L
258.787 278.224 L
259.059 277.929 L
259.33 277.627 L
259.602 277.28 L
259.873 276.929 L
260.145 276.578 L
260.416 276.272 L
260.688 275.719 L
260.959 274.607 L
261.23 273.532 L
261.502 273.119 L
261.773 272.799 L
262.045 272.48 L
262.316 272.181 L
262.588 271.856 L
262.859 271.392 L
263.131 270.686 L
263.402 270.304 L
263.674 269.968 L
263.945 269.611 L
264.217 269.885 L
264.488 270.743 L
264.76 271.081 L
265.031 270.469 L
265.303 269.861 L
265.574 269.183 L
265.846 267.851 L
266.117 266.15 L
266.389 264.479 L
266.66 262.881 L
266.932 261.634 L
267.203 261.232 L
267.475 259.111 L
267.746 255.273 L
268.018 251.697 L
268.289 249.029 L
268.561 246.394 L
268.832 243.981 L
269.104 240.528 L
269.375 236.805 L
269.647 233.409 L
269.918 233.78 L
270.19 235.344 L
270.461 236.959 L
270.733 238.662 L
271.004 240.189 L
271.276 241.911 L
271.547 243.079 L
271.819 243.584 L
272.091 244.139 L
272.362 243.924 L
272.634 243.609 L
272.905 243.279 L
273.177 242.092 L
273.448 240.674 L
273.72 237.734 L
273.991 236.233 L
274.263 236.024 L
274.534 235.831 L
274.806 235.65 L
275.077 235.478 L
275.349 235.317 L
275.62 234.872 L
275.892 234.532 L
276.163 234.432 L
276.435 234.364 L
276.706 234.305 L
276.978 233.872 L
277.249 232.51 L
277.521 231.229 L
277.792 230.98 L
278.064 231.353 L
278.335 232.651 L
278.607 233.783 L
278.878 233.742 L
279.15 233.539 L
279.421 233.331 L
279.693 233.162 L
279.964 233.01 L
280.236 232.853 L
280.507 232.709 L
280.779 232.681 L
281.05 233.889 L
281.322 235.037 L
281.593 235.458 L
281.865 235.337 L
282.136 235.449 L
282.408 235.602 L
282.679 235.785 L
282.951 235.938 L
283.222 236.081 L
283.493 236.627 L
283.765 238.096 L
284.036 238.597 L
284.308 240.741 L
284.579 243.055 L
284.851 245.471 L
285.122 247.712 L
285.394 250.234 L
285.665 252.282 L
285.937 254.259 L
286.208 256.514 L
286.48 258.258 L
286.751 257.112 L
287.023 255.927 L
287.294 254.805 L
287.566 254.137 L
287.837 254.314 L
288.109 254.304 L
288.38 254.445 L
288.652 255.791 L
288.923 256.822 L
289.195 257.067 L
289.466 257.303 L
289.738 256.729 L
290.009 257.03 L
290.281 257.293 L
290.552 257.482 L
290.824 256.632 L
291.095 256.175 L
291.367 256.372 L
291.638 256.568 L
291.91 256.65 L
292.181 255.999 L
292.453 255.507 L
292.724 255.564 L
292.996 255.586 L
293.267 255.556 L
293.539 255.428 L
293.81 256.266 L
294.082 257.316 L
294.353 258.161 L
294.625 258.334 L
294.897 257.466 L
295.168 256.061 L
295.44 255.341 L
295.711 256.378 L
295.983 257.736 L
296.254 258.97 L
296.526 259.35 L
296.797 259.724 L
297.069 260.027 L
297.34 260.283 L
297.612 259.988 L
297.883 258.867 L
298.155 258.017 L
298.426 258.327 L
298.698 258.652 L
298.969 258.86 L
299.241 259.061 L
299.512 258.44 L
299.784 257.644 L
300.055 257.526 L
300.327 256.755 L
300.598 256.072 L
300.87 256.381 L
301.141 256.741 L
301.413 258.17 L
301.684 260.22 L
301.956 262.327 L
302.227 264.562 L
302.499 267.404 L
302.77 269.451 L
303.042 271.77 L
303.313 274.802 L
303.585 278.409 L
303.856 279.856 L
304.128 281.079 L
304.399 281.769 L
304.671 282.009 L
304.942 282.276 L
305.214 282.042 L
305.485 280.991 L
305.757 281.019 L
306.028 281.195 L
306.299 281.722 L
306.571 283.003 L
306.842 284.429 L
307.114 285.67 L
307.385 286.474 L
307.657 286.333 L
307.928 285.501 L
308.2 285.556 L
308.471 285.705 L
308.743 286.435 L
309.014 287.451 L
309.286 288.266 L
309.557 288.408 L
309.829 288.555 L
310.1 288.777 L
310.372 288.94 L
310.643 289.201 L
310.915 289.364 L
311.186 289.426 L
311.458 289.523 L
311.729 289.785 L
312.001 290.362 L
312.272 290.99 L
312.544 290.804 L
312.815 289.552 L
313.087 289.031 L
313.358 289.177 L
313.63 289.525 L
313.901 290.714 L
314.173 291.96 L
314.444 293.184 L
314.716 294.554 L
314.987 295.844 L
315.259 296.804 L
315.53 297.548 L
315.802 299.783 L
316.073 303.244 L
316.345 307.339 L
316.616 311.081 L
316.888 313.769 L
317.159 316.39 L
317.431 319.08 L
317.703 321.85 L
317.974 323.665 L
318.246 322.162 L
318.517 320.435 L
318.789 318.665 L
319.06 316.719 L
319.332 314.922 L
319.603 312.691 L
319.875 310.594 L
320.146 308.519 L
320.418 307.018 L
320.689 306.723 L
320.961 306.399 L
321.232 306.263 L
321.504 306.99 L
321.775 307.641 L
322.047 308.175 L
322.318 307.758 L
322.59 307.092 L
322.861 306.436 L
323.133 305.821 L
323.404 305.186 L
323.676 304.643 L
323.947 304.231 L
324.219 304.565 L
324.49 305.261 L
324.762 305.201 L
325.033 304.451 L
325.305 304.643 L
325.576 305.162 L
325.848 305.326 L
326.119 304.69 L
326.391 304.047 L
326.662 303.562 L
326.934 303.092 L
327.205 302.672 L
327.477 302.22 L
327.748 301.699 L
328.02 301.2 L
328.291 300.649 L
328.563 299.942 L
328.834 298.925 L
329.105 297.565 L
329.377 296.835 L
329.648 296.641 L
329.92 296.608 L
330.191 296.411 L
330.463 295.56 L
330.734 294.367 L
331.006 293.194 L
331.277 292.18 L
331.549 291.212 L
331.82 290.374 L
332.092 290.049 L
332.363 288.949 L
332.635 286.315 L
332.906 283.401 L
333.178 280.864 L
333.449 278.172 L
333.721 275.148 L
333.992 272.932 L
334.264 271.022 L
334.535 269.192 L
334.807 268.657 L
335.078 269.104 L
335.35 269.545 L
335.621 269.9 L
335.893 269.506 L
336.164 268.841 L
336.436 268.202 L
336.707 267.333 L
336.979 266.404 L
337.25 265.508 L
337.522 264.622 L
337.793 264.175 L
338.065 263.734 L
338.336 262.979 L
338.608 262.307 L
338.879 262.027 L
339.151 262.523 L
339.422 262.12 L
339.694 261.562 L
339.966 260.955 L
340.237 260.868 L
340.509 261.105 L
340.78 261.262 L
341.052 261.117 L
341.323 261.099 L
341.595 261.214 L
341.866 261.289 L
342.138 260.43 L
342.409 259.481 L
342.681 259.503 L
342.952 259.871 L
343.224 260.389 L
343.495 260.944 L
343.767 261.485 L
344.038 262.024 L
344.31 262.514 L
344.581 262.95 L
344.853 263.418 L
345.124 263.899 L
345.396 264.515 L
345.667 264.497 L
345.939 264.224 L
346.21 263.532 L
346.482 262.708 L
346.753 262.276 L
347.025 262.356 L
347.296 261.937 L
347.568 261.782 L
347.839 262.163 L
348.111 262.724 L
348.382 262.647 L
348.654 262.501 L
348.925 262.384 L
349.197 262.297 L
349.468 262.25 L
349.74 262.356 L
350.011 262.62 L
350.283 263.07 L
350.554 263.31 L
350.826 262.431 L
351.097 261.831 L
351.368 261.336 L
351.64 260.829 L
351.911 260.411 L
352.183 260.16 L
352.454 260.204 L
352.726 261.225 L
352.997 262.356 L
353.269 263.609 L
353.54 264.551 L
353.812 265.322 L
354.083 266.153 L
354.355 267.253 L
354.626 267.861 L
354.898 268.324 L
355.169 269.149 L
355.441 270.054 L
355.712 271.915 L
355.984 274.193 L
356.255 276.902 L
356.527 278.508 L
356.798 280.063 L
357.07 280.642 L
357.341 281.09 L
357.613 281.938 L
357.884 282.968 L
358.156 284.064 L
358.427 284.92 L
358.699 285.763 L
358.97 286.284 L
359.242 286.821 L
359.513 287.262 L
359.785 287.53 L
360.056 287.363 L
360.328 286.66 L
360.599 285.661 L
360.871 284.987 L
361.142 284.845 L
361.414 284.776 L
361.685 284.494 L
361.957 283.519 L
362.228 282.366 L
362.5 281.879 L
362.772 281.402 L
363.043 280.454 L
363.315 278.707 L
363.586 276.748 L
363.858 275.153 L
364.129 273.717 L
364.401 272.466 L
364.672 271.061 L
364.944 269.749 L
365.215 268.857 L
365.487 268.069 L
365.758 267.3 L
366.03 266.515 L
366.301 265.726 L
366.573 264.86 L
366.844 263.498 L
367.116 262.844 L
367.387 262.417 L
367.659 261.98 L
367.93 261.479 L
368.202 260.615 L
368.473 259.011 L
368.745 257.819 L
369.016 256.913 L
369.288 256.665 L
369.559 256.027 L
369.831 254.938 L
370.102 254.255 L
370.374 254.173 L
370.645 254.661 L
370.917 255.585 L
371.188 256.147 L
371.46 256.623 L
371.731 256.736 L
372.003 256.579 L
372.274 256.243 L
372.546 254.345 L
372.817 252.322 L
373.089 251.674 L
373.36 251.493 L
373.632 251.316 L
373.903 251.13 L
374.174 250.96 L
374.446 250.93 L
374.717 250.883 L
374.989 250.88 L
375.26 250.804 L
375.532 250.758 L
375.803 250.821 L
376.075 250.975 L
376.346 251.22 L
376.618 251.567 L
376.889 252.295 L
377.161 253.541 L
377.432 255.003 L
377.704 255.761 L
377.975 256.151 L
378.247 256.503 L
378.518 256.753 L
378.79 256.908 L
379.061 257.636 L
379.333 257.369 L
379.604 258.198 L
379.876 260.119 L
380.147 262.046 L
380.419 263.601 L
380.69 265.086 L
380.962 266.683 L
381.233 267.152 L
381.505 267.733 L
381.776 268.348 L
382.048 269.01 L
382.319 269.136 L
382.591 270.083 L
382.862 270.965 L
383.134 271.898 L
383.405 273.068 L
383.677 273.806 L
383.948 273.468 L
384.22 273.454 L
384.491 274.308 L
384.763 275.171 L
385.034 276.799 L
385.306 278.489 L
385.578 279.079 L
385.849 279.653 L
386.121 280.514 L
386.392 282.141 L
386.664 283.814 L
386.935 285.381 L
387.207 286.798 L
387.478 287.429 L
387.75 287.911 L
388.021 288.415 L
388.293 288.866 L
388.564 289.379 L
388.836 290.015 L
389.107 290.694 L
389.379 291.557 L
389.65 292.529 L
389.922 293.561 L
390.193 294.646 L
390.465 295.692 L
390.736 296.766 L
391.008 297.684 L
391.279 298.476 L
391.551 299.085 L
391.822 299.03 L
392.094 298.829 L
392.365 298.622 L
392.637 299.211 L
392.908 300.023 L
393.18 300.811 L
393.451 301.661 L
393.723 302.546 L
393.994 304.446 L
394.266 306.301 L
394.537 308.399 L
394.809 310.418 L
395.08 311.762 L
395.352 313.312 L
395.623 315.868 L
395.895 319.446 L
396.166 322.342 L
396.438 323.73 L
396.709 325.535 L
396.98 327.204 L
397.252 329.007 L
397.523 330.577 L
397.795 332.089 L
398.066 333.457 L
398.338 334.722 L
398.609 335.994 L
398.881 338.022 L
399.152 339.319 L
399.424 340.235 L
399.695 341.067 L
399.967 341.892 L
400.238 342.686 L
400.51 344.503 L
400.781 346.028 L
401.053 346.401 L
401.324 346.338 L
401.596 346.343 L
401.867 346.888 L
402.139 348.199 L
402.41 349.943 L
402.682 350.066 L
402.953 349.843 L
403.225 349.122 L
403.496 348.179 L
403.768 346.996 L
404.039 345.745 L
404.311 344.428 L
404.582 343.59 L
404.854 342.939 L
405.125 342.551 L
405.397 342.208 L
405.668 341.947 L
405.94 341.765 L
406.211 341.454 L
406.483 341.169 L
406.754 340.898 L
407.026 340.685 L
407.297 340.578 L
407.569 340.561 L
407.841 340.625 L
408.112 340.78 L
408.384 341.491 L
408.655 343.025 L
408.927 344.661 L
409.198 345.954 L
409.47 346.503 L
409.741 347.045 L
410.013 347.585 L
410.284 348.105 L
410.556 348.15 L
410.827 347.654 L
411.099 347.174 L
411.37 347.65 L
411.642 348.901 L
411.913 351.087 L
412.185 352.912 L
412.456 353.774 L
412.728 353.733 L
412.999 354.304 L
413.271 355.027 L
413.542 355.131 L
413.814 355.187 L
414.085 355.295 L
414.357 355.582 L
414.628 356.087 L
414.9 357.273 L
415.171 358.248 L
415.443 359.381 L
415.714 360.152 L
415.986 360.37 L
416.257 361.135 L
416.529 363.163 L
416.8 365.416 L
417.072 367.413 L
417.343 368.885 L
417.615 370.168 L
417.886 372.509 L
418.158 375.068 L
418.429 377.131 L
418.701 378.418 L
418.972 378.843 L
419.243 379.401 L
419.515 380.381 L
419.786 381.431 L
420.058 382.984 L
420.329 384.652 L
420.601 386.805 L
420.872 388.306 L
421.144 389.782 L
421.415 390.824 L
421.687 392.19 L
421.958 393.656 L
422.23 395.073 L
422.501 396.634 L
422.773 397.753 L
423.044 398.351 L
423.316 398.822 L
423.587 399.722 L
423.859 401.085 L
424.13 402.146 L
424.402 403.309 L
424.673 403.715 L
424.945 404.01 L
425.216 403.969 L
425.488 403.746 L
425.759 403.455 L
426.031 403.153 L
426.302 402.979 L
426.574 402.593 L
426.845 402.678 L
427.117 403.501 L
427.388 405.179 L
427.66 407.209 L
427.931 407.584 L
428.203 406.948 L
428.474 406.244 L
428.746 405.767 L
429.017 405.216 L
429.289 405.117 L
429.56 405.674 L
429.832 406.176 L
430.103 406.798 L
430.375 408.178 L
430.647 409.095 L
430.918 409.795 L
431.19 410.718 L
431.461 411.316 L
431.733 410.144 L
432.004 410.548 L
432.276 410.262 L
432.547 410.722 L
432.819 411.787 L
433.09 411.828 L
433.362 410.918 L
433.633 410.703 L
433.905 411.292 L
434.176 410.288 L
434.448 408.691 L
434.719 406.231 L
434.991 404.157 L
435.262 402.29 L
435.534 400.3 L
435.805 399.029 L
436.077 397.655 L
436.348 396.359 L
436.62 395.016 L
436.891 393.564 L
437.163 392.031 L
437.434 390.205 L
437.706 388.966 L
437.977 387.617 L
438.249 386.321 L
438.52 384.333 L
438.792 383.081 L
439.063 381.752 L
439.335 380.405 L
439.606 379.967 L
439.878 379.902 L
440.149 380.334 L
440.421 380.139 L
440.692 379.494 L
440.964 378.044 L
441.235 376.907 L
441.507 376.27 L
441.778 375.642 L
442.049 374.912 L
442.321 374.264 L
442.592 373.534 L
442.864 372.827 L
443.135 372.07 L
443.407 371.906 L
443.678 371.15 L
443.95 368.983 L
444.221 365.716 L
444.493 363.71 L
444.764 362.105 L
445.036 360.401 L
445.307 358.618 L
445.579 356.809 L
445.85 355.02 L
446.122 353.392 L
446.393 351.598 L
446.665 349.781 L
446.936 348.16 L
447.208 345.731 L
447.479 344.48 L
447.751 342.95 L
448.022 341.483 L
448.294 340.14 L
448.565 339.358 L
448.837 338.056 L
449.108 336.975 L
449.38 335.944 L
449.651 334.87 L
449.923 333.689 L
450.194 332.448 L
450.466 329.758 L
450.737 328.097 L
451.009 328.304 L
451.28 328.649 L
451.552 329.111 L
451.823 329.663 L
452.095 330.413 L
452.366 331.399 L
452.638 332.289 L
452.909 333.149 L
453.181 333.89 L
453.453 334.435 L
453.724 335.069 L
453.996 335.729 L
454.267 336.574 L
454.539 337.454 L
454.81 338.366 L
455.082 339.396 L
455.353 339.811 L
455.625 339.671 L
455.896 339.665 L
456.168 339.679 L
456.439 339.734 L
456.711 339.217 L
456.982 338.328 L
457.254 337.559 L
457.525 337.431 L
457.797 337.732 L
458.068 338.087 L
458.34 338.544 L
458.611 338.994 L
458.883 339.57 L
459.154 340.045 L
459.426 340.476 L
459.697 340.808 L
459.969 341.126 L
460.24 340.812 L
460.512 340.725 L
460.783 341.16 L
461.055 341.542 L
461.326 341.418 L
461.598 341.993 L
461.869 342.997 L
462.141 344.057 L
462.412 344.827 L
462.684 345.489 L
462.955 345.995 L
463.227 346.348 L
463.498 347.111 L
463.77 346.989 L
464.041 347.515 L
464.313 348.175 L
464.584 348.126 L
464.855 347.975 L
465.127 347.817 L
465.398 347.635 L
465.67 347.394 L
465.941 346.794 L
466.213 346.1 L
466.484 345.464 L
466.756 344.888 L
467.027 344.465 L
467.299 344.01 L
467.57 343.523 L
467.842 343.024 L
468.113 342.44 L
468.385 341.744 L
468.656 340.817 L
468.928 339.983 L
469.199 339.759 L
469.471 339.627 L
469.742 339.578 L
470.014 338.906 L
470.285 338.194 L
470.557 337.473 L
470.828 336.753 L
471.1 336.641 L
471.371 336.74 L
471.643 336.783 L
471.914 336.064 L
472.186 335.295 L
472.457 334.507 L
472.729 334.043 L
473 333.979 L
473.272 333.921 L
473.543 333.96 L
473.815 334.023 L
474.086 333.694 L
474.358 333.239 L
474.629 332.826 L
474.901 332.975 L
475.172 333.016 L
475.444 331.949 L
475.716 329.999 L
475.987 327.935 L
476.259 326.199 L
476.53 324.389 L
476.802 322.77 L
477.073 321.096 L
477.345 319.421 L
477.616 317.85 L
477.888 316.909 L
478.159 315.999 L
478.431 314.817 L
478.702 313.79 L
478.974 312.821 L
479.245 311.637 L
479.517 310.347 L
479.788 309.707 L
480.06 309.808 L
480.331 310.06 L
480.603 310.536 L
480.874 308.861 L
481.146 307.338 L
481.417 306.293 L
481.689 305.45 L
481.96 304.756 L
482.232 303.654 L
482.503 303.433 L
482.775 303.316 L
483.046 304.087 L
483.318 304.838 L
483.589 305.495 L
483.861 306.233 L
484.132 307.175 L
484.404 308.205 L
484.675 309.231 L
484.947 309.66 L
485.218 309.939 L
485.49 310.614 L
485.761 311.216 L
486.033 311.403 L
486.304 311.453 L
486.576 311.429 L
486.847 310.451 L
487.118 309.079 L
487.39 307.782 L
487.661 306.698 L
487.933 304.05 L
488.204 301.678 L
488.476 300.61 L
488.747 299.796 L
489.019 298.894 L
489.29 298.339 L
489.562 297.14 L
489.833 295.889 L
490.105 294.615 L
490.376 293.304 L
490.648 291.853 L
490.919 290.891 L
491.191 290.065 L
491.462 288.702 L
491.734 287.175 L
492.005 285.741 L
492.277 284.902 L
492.548 284.557 L
492.82 284.073 L
493.091 283.54 L
493.363 283.585 L
493.634 284.032 L
493.906 284.595 L
494.177 284.831 L
494.449 283.872 L
494.72 282.582 L
494.992 281.358 L
495.263 279.873 L
495.535 278.12 L
495.806 276.133 L
496.078 274.639 L
496.349 273.567 L
496.621 272.386 L
496.892 270.769 L
497.164 269.173 L
497.435 268.194 L
497.707 268.051 L
497.978 267.916 L
498.25 267.781 L
498.522 267.498 L
498.793 267.464 L
499.065 266.858 L
499.336 265.96 L
499.608 264.634 L
499.879 262.186 L
500.151 259.217 L
500.422 256.224 L
500.694 252.854 L
500.965 249.632 L
501.237 246.601 L
501.508 243.974 L
501.78 241.673 L
502.051 239.436 L
502.323 236.505 L
502.594 233.635 L
502.866 230.683 L
503.137 227.953 L
503.409 226.095 L
503.68 225.665 L
503.952 225.279 L
504.223 224.109 L
504.495 223.604 L
504.766 223.306 L
505.038 222.601 L
505.309 221.099 L
505.581 219.76 L
505.852 218.41 L
506.124 216.751 L
506.395 215.103 L
506.667 213.529 L
506.938 211.778 L
507.21 210.082 L
507.481 208.388 L
507.753 206.82 L
508.024 205.299 L
508.296 203.648 L
508.567 201.974 L
508.839 201.117 L
509.11 200.596 L
509.382 200.125 L
509.653 199.696 L
509.924 199.247 L
510.196 198.822 L
510.467 198.423 L
510.739 198.045 L
511.01 198.393 L
511.282 198.929 L
511.553 199.592 L
511.825 200.193 L
512.096 200.741 L
512.368 201.356 L
512.64 202.133 L
512.911 202.887 L
513.182 202.986 L
513.454 202.842 L
513.726 202.717 L
513.997 202.596 L
514.268 202.5 L
514.54 202.411 L
514.812 202.312 L
515.083 202.224 L
515.354 202.143 L
515.626 202.089 L
515.898 202.077 L
516.169 202.085 L
516.44 202.129 L
516.712 203.385 L
516.984 204.923 L
517.255 206.48 L
517.526 207.711 L
517.798 208.842 L
518.07 210.243 L
518.341 211.593 L
518.612 213.019 L
518.884 214.222 L
519.156 215.471 L
519.427 216.782 L
519.698 218.043 L
519.97 219.461 L
520.242 220.828 L
520.513 222.185 L
520.784 223.44 L
521.056 224.723 L
521.328 226.11 L
521.599 227.471 L
521.87 228.984 L
522.142 230.514 L
522.414 232.48 L
522.685 234.525 L
522.956 236.166 L
523.228 237.857 L
523.5 239.468 L
523.771 241.694 L
524.042 243.343 L
524.314 244.688 L
524.586 246.315 L
524.857 247.887 L
525.128 249.446 L
525.4 250.85 L
525.672 252.259 L
525.943 253.298 L
526.214 253.869 L
526.486 254.506 L
526.758 254.658 L
527.029 254.095 L
527.3 253.545 L
527.572 253.002 L
527.844 252.335 L
528.115 251.653 L
528.386 251.297 L
528.658 251.068 L
528.93 250.839 L
529.201 250.623 L
529.472 250.409 L
529.744 250.131 L
530.016 249.764 L
530.287 249.861 L
530.558 250.392 L
530.83 251.606 L
531.102 252.804 L
531.373 253.318 L
531.644 253.827 L
531.916 254.497 L
532.188 254.94 L
532.459 255.394 L
532.731 255.804 L
533.002 255.518 L
533.273 255.683 L
533.545 255.695 L
533.817 255.09 L
534.088 254.402 L
534.359 253.613 L
534.631 252.874 L
534.903 253.115 L
535.174 253.724 L
535.445 254.258 L
535.717 254.188 L
535.989 254.483 L
536.26 255.195 L
536.531 255.367 L
536.803 255.659 L
537.075 256.465 L
537.346 257.214 L
537.617 257.608 L
537.889 257.865 L
538.161 258.279 L
538.432 258.685 L
538.703 259.152 L
538.975 259.389 L
539.247 259.305 L
539.518 259.154 L
539.789 259.441 L
540.061 259.883 L
540.333 260.924 L
540.604 261.506 L
540.875 262.927 L
541.147 264.546 L
541.419 266.043 L
541.69 266.528 L
541.961 267.062 L
542.233 267.407 L
542.505 268.439 L
542.776 270.657 L
543.047 272.895 L
543.319 275.12 L
543.591 277.1 L
543.862 279.159 L
544.133 281.572 L
544.405 284.038 L
544.677 285.622 L
544.948 286.825 L
545.219 287.811 L
545.491 288.892 L
545.763 289.983 L
546.034 290.712 L
546.305 291.346 L
546.577 291.987 L
546.849 292.751 L
547.12 292.742 L
547.391 292.249 L
547.663 291.523 L
547.935 291.848 L
548.206 293.12 L
548.477 294.596 L
548.749 296.118 L
549.021 297.616 L
549.292 298.946 L
549.563 300.586 L
549.835 302.515 L
550.107 303.941 L
550.378 305.704 L
550.649 308.115 L
550.921 310.672 L
551.193 312.274 L
551.464 313.368 L
551.735 313.467 L
552.007 313.449 L
552.279 313.647 L
552.55 315.601 L
552.821 316.592 L
553.093 317.589 L
553.365 318.755 L
553.636 318.926 L
553.907 318.925 L
554.179 319.191 L
554.451 319.778 L
554.722 320.385 L
554.994 320.927 L
555.265 321.436 L
555.536 321.819 L
555.808 323.133 L
556.08 324.55 L
556.351 326.073 L
556.622 327.361 L
556.894 328.525 L
557.166 328.758 L
557.437 328.93 L
557.708 329.045 L
557.98 329.097 L
558.252 329.184 L
558.523 329.189 L
558.794 329.186 L
559.066 328.987 L
559.338 327.605 L
559.609 325.514 L
559.88 323.4 L
560.152 321.206 L
560.424 319.061 L
560.695 316.878 L
560.966 314.849 L
561.238 313.08 L
561.51 311.917 L
561.781 310.726 L
562.052 309.666 L
562.324 309.361 L
562.596 309.221 L
562.867 309.347 L
563.138 308.796 L
563.41 307.886 L
563.682 307.017 L
563.953 306.68 L
564.224 306.635 L
564.496 306.196 L
564.768 305.025 L
565.039 302.26 L
565.31 299.431 L
565.582 297.654 L
565.854 296.205 L
566.125 294.871 L
566.396 293.219 L
566.668 291.146 L
566.94 288.768 L
567.211 286.282 L
567.482 283.674 L
567.754 281.28 L
568.026 279.444 L
568.297 277.522 L
568.568 275.43 L
568.84 273.475 L
569.112 271.071 L
569.383 268.038 L
569.654 265.103 L
569.926 261.872 L
570.198 259.27 L
570.469 256.735 L
570.74 254.024 L
571.012 251.535 L
571.284 248.906 L
571.555 245.892 L
571.826 242.739 L
572.098 240.016 L
572.37 237.658 L
572.641 234.703 L
572.912 231.681 L
573.184 228.442 L
573.456 225.124 L
573.727 221.707 L
573.998 218.758 L
574.27 215.88 L
574.542 212.727 L
574.813 209.388 L
575.084 206.772 L
575.356 204.863 L
575.628 202.994 L
575.899 200.858 L
576.17 199.428 L
576.442 198.17 L
576.714 197.218 L
576.985 196.284 L
577.256 195.332 L
577.528 194.456 L
577.799 193.517 L
578.071 192.622 L
578.343 191.17 L
578.614 189.376 L
578.885 186.933 L
579.157 183.433 L
579.429 180.071 L
579.7 176.75 L
579.971 174.843 L
580.243 172.991 L
580.515 171.24 L
580.786 168.982 L
581.057 166.691 L
581.329 165.226 L
581.601 164.86 L
581.872 164.958 L
582.143 164.641 L
582.415 163.712 L
582.687 162.864 L
582.958 161.981 L
583.229 161.427 L
583.501 161.066 L
583.773 160.955 L
584.044 161.04 L
584.315 161.29 L
584.587 161.561 L
584.859 161.773 L
585.13 161.189 L
585.401 160.619 L
585.673 159.998 L
585.945 159.509 L
586.216 159.005 L
586.487 158.446 L
586.759 157.923 L
587.031 157.457 L
587.302 157.025 L
587.573 156.601 L
587.845 156.383 L
588.117 156.189 L
588.388 155.849 L
588.659 155.285 L
588.931 154.031 L
589.203 152.456 L
589.474 150.736 L
589.745 149.634 L
590.017 148.577 L
590.289 147.606 L
590.56 146.309 L
590.831 145.035 L
591.103 144.067 L
591.375 143.022 L
591.646 142.175 L
591.917 141.239 L
592.189 140.117 L
592.461 139.003 L
592.732 138.138 L
593.003 137.323 L
593.275 136.449 L
593.547 135.481 L
593.818 134.413 L
594.089 133.324 L
594.361 132.508 L
594.633 131.6 L
594.904 130.956 L
595.175 130.876 L
595.447 130.832 L
595.719 131.335 L
595.99 131.725 L
596.261 132.069 L
596.533 132.015 L
596.805 131.692 L
597.076 131.334 L
597.347 130.935 L
597.619 130.592 L
597.891 129.161 L
598.162 127.542 L
598.433 125.705 L
598.705 123.7 L
598.977 121.731 L
599.248 119.463 L
599.519 117.611 L
599.791 115.717 L
600.063 114.094 L
600.334 113.079 L
600.606 111.269 L
600.877 108.342 L
601.148 105.155 L
601.42 102.808 L
601.692 101.701 L
601.963 101.844 L
602.234 102.046 L
602.506 102.271 L
602.778 102.279 L
603.049 102.323 L
603.32 102.409 L
603.592 102.61 L
603.864 102.565 L
604.135 101.829 L
604.406 100.949 L
604.678 100.179 L
604.95 99.424 L
605.221 98.842 L
605.492 98.702 L
605.764 98.692 L
606.036 98.767 L
606.307 98.464 L
606.578 97.941 L
606.85 97.427 L
607.122 97.114 L
607.393 97.377 L
607.664 97.888 L
607.936 98.441 L
608.208 99.196 L
608.479 99.891 L
608.75 100.473 L
609.022 101.116 L
609.294 101.734 L
609.565 102.339 L
609.836 104.938 L
610.108 176.351 L
610.38 177.868 L
610.651 176.843 L
610.922 175.483 L
611.194 174.373 L
611.466 173.969 L
611.737 173.552 L
612.008 173.026 L
612.28 171.653 L
612.552 170.482 L
612.823 169.548 L
613.094 169.513 L
613.366 169.702 L
613.638 169.416 L
613.909 168.318 L
614.18 167.073 L
614.452 166.081 L
614.724 165.496 L
614.995 165.049 L
615.266 164.82 L
615.538 164.717 L
615.81 164.986 L
616.081 164.648 L
616.352 163.909 L
616.624 163.208 L
616.896 162.495 L
617.167 161.8 L
617.438 162.201 L
617.71 162.801 L
617.982 163.548 L
618.253 163.9 L
618.524 163.671 L
618.796 163.439 L
619.068 163.243 L
619.339 163.178 L
619.61 163.285 L
619.882 163.464 L
620.154 163.728 L
620.425 163.979 L
620.696 165.236 L
620.968 166.688 L
621.24 168.367 L
621.511 170.285 L
621.782 172.302 L
622.054 174.417 L
622.326 176.47 L
622.597 178.581 L
622.869 180.632 L
623.14 183.043 L
623.411 185.392 L
623.683 187.751 L
623.955 190.257 L
624.226 192.703 L
624.497 194.232 L
624.769 195.606 L
625.041 196.714 L
625.312 197.935 L
625.583 199.169 L
625.855 200.406 L
626.127 201.503 L
626.398 202.814 L
626.669 205.199 L
626.941 207.832 L
627.213 211.677 L
627.484 215.354 L
627.755 219.337 L
628.027 222.153 L
628.299 223.682 L
628.57 225.243 L
628.841 227.382 L
629.113 230.182 L
629.385 232.891 L
629.656 235.25 L
629.927 235.906 L
S
GR
GS
[0.6 0 0 0.6 0 0] CT
1 GC
N
569 116 M
569 50 L
441 50 L
441 116 L
cp
f
GR
GS
[0.6 0 0 0.6 299.91898 40.56] CT
/Helvetica 23.333 F
GS
[1 0 0 1 0 0] CT
0 9 moveto 
1 -1 scale
(EKF) t 
GR
GR
GS
[0.6 0 0 0.6 0 0] CT
1 0 0 RC
[12 12] 0 setdash
2 LJ
3.333 LW
N
446.01 67.6 M
496.108 67.6 L
S
GR
GS
[0.6 0 0 0.6 299.91898 59.04] CT
/Helvetica 23.333 F
GS
[1 0 0 1 0 0] CT
0 9 moveto 
1 -1 scale
(Model) t 
GR
GR
GS
[0.6 0 0 0.6 0 0] CT
0 0 1 RC
1 LJ
3.333 LW
N
446.01 98.4 M
496.108 98.4 L
S
GR
GS
[0.6 0 0 0.6 0 0] CT
0.149 GC
10.0 ML
0.833 LW
N
441 116 M
441 50 L
569 50 L
569 116 L
cp
S
GR
%%Trailer
%%Pages: 1
%%EOF
