%!PS-Adobe-3.0 EPSF-3.0
%%Creator: (MATLAB, The Mathworks, Inc. Version 9.11.0.1837725 \(R2021b\) Update 2. Operating System: Windows 10)
%%Title: C:/Users/radac/Downloads/ato-g1_aru-rec_20230316-155745_ARU/data_in_csv/model_a.eps
%%CreationDate: 2023-04-02T21:03:37
%%Pages: (atend)
%%BoundingBox:     0     0   420   315
%%LanguageLevel: 3
%%EndComments
%%BeginProlog
%%BeginResource: procset (Apache XML Graphics Std ProcSet) 1.2 0
%%Version: 1.2 0
%%Copyright: (Copyright 2001-2003,2010 The Apache Software Foundation. License terms: http://www.apache.org/licenses/LICENSE-2.0)
/bd{bind def}bind def
/ld{load def}bd
/GR/grestore ld
/GS/gsave ld
/RM/rmoveto ld
/C/curveto ld
/t/show ld
/L/lineto ld
/ML/setmiterlimit ld
/CT/concat ld
/f/fill ld
/N/newpath ld
/S/stroke ld
/CC/setcmykcolor ld
/A/ashow ld
/cp/closepath ld
/RC/setrgbcolor ld
/LJ/setlinejoin ld
/GC/setgray ld
/LW/setlinewidth ld
/M/moveto ld
/re {4 2 roll M
1 index 0 rlineto
0 exch rlineto
neg 0 rlineto
cp } bd
/_ctm matrix def
/_tm matrix def
/BT { _ctm currentmatrix pop matrix _tm copy pop 0 0 moveto } bd
/ET { _ctm setmatrix } bd
/iTm { _ctm setmatrix _tm concat } bd
/Tm { _tm astore pop iTm 0 0 moveto } bd
/ux 0.0 def
/uy 0.0 def
/F {
  /Tp exch def
  /Tf exch def
  Tf findfont Tp scalefont setfont
  /cf Tf def  /cs Tp def
} bd
/ULS {currentpoint /uy exch def /ux exch def} bd
/ULE {
  /Tcx currentpoint pop def
  gsave
  newpath
  cf findfont cs scalefont dup
  /FontMatrix get 0 get /Ts exch def /FontInfo get dup
  /UnderlinePosition get Ts mul /To exch def
  /UnderlineThickness get Ts mul /Tt exch def
  ux uy To add moveto  Tcx uy To add lineto
  Tt setlinewidth stroke
  grestore
} bd
/OLE {
  /Tcx currentpoint pop def
  gsave
  newpath
  cf findfont cs scalefont dup
  /FontMatrix get 0 get /Ts exch def /FontInfo get dup
  /UnderlinePosition get Ts mul /To exch def
  /UnderlineThickness get Ts mul /Tt exch def
  ux uy To add cs add moveto Tcx uy To add cs add lineto
  Tt setlinewidth stroke
  grestore
} bd
/SOE {
  /Tcx currentpoint pop def
  gsave
  newpath
  cf findfont cs scalefont dup
  /FontMatrix get 0 get /Ts exch def /FontInfo get dup
  /UnderlinePosition get Ts mul /To exch def
  /UnderlineThickness get Ts mul /Tt exch def
  ux uy To add cs 10 mul 26 idiv add moveto Tcx uy To add cs 10 mul 26 idiv add lineto
  Tt setlinewidth stroke
  grestore
} bd
/QT {
/Y22 exch store
/X22 exch store
/Y21 exch store
/X21 exch store
currentpoint
/Y21 load 2 mul add 3 div exch
/X21 load 2 mul add 3 div exch
/X21 load 2 mul /X22 load add 3 div
/Y21 load 2 mul /Y22 load add 3 div
/X22 load /Y22 load curveto
} bd
/SSPD {
dup length /d exch dict def
{
/v exch def
/k exch def
currentpagedevice k known {
/cpdv currentpagedevice k get def
v cpdv ne {
/upd false def
/nullv v type /nulltype eq def
/nullcpdv cpdv type /nulltype eq def
nullv nullcpdv or
{
/upd true def
} {
/sametype v type cpdv type eq def
sametype {
v type /arraytype eq {
/vlen v length def
/cpdvlen cpdv length def
vlen cpdvlen eq {
0 1 vlen 1 sub {
/i exch def
/obj v i get def
/cpdobj cpdv i get def
obj cpdobj ne {
/upd true def
exit
} if
} for
} {
/upd true def
} ifelse
} {
v type /dicttype eq {
v {
/dv exch def
/dk exch def
/cpddv cpdv dk get def
dv cpddv ne {
/upd true def
exit
} if
} forall
} {
/upd true def
} ifelse
} ifelse
} if
} ifelse
upd true eq {
d k v put
} if
} if
} if
} forall
d length 0 gt {
d setpagedevice
} if
} bd
/RE { % /NewFontName [NewEncodingArray] /FontName RE -
  findfont dup length dict begin
  {
    1 index /FID ne
    {def} {pop pop} ifelse
  } forall
  /Encoding exch def
  /FontName 1 index def
  currentdict definefont pop
  end
} bind def
%%EndResource
%%BeginResource: procset (Apache XML Graphics EPS ProcSet) 1.0 0
%%Version: 1.0 0
%%Copyright: (Copyright 2002-2003 The Apache Software Foundation. License terms: http://www.apache.org/licenses/LICENSE-2.0)
/BeginEPSF { %def
/b4_Inc_state save def         % Save state for cleanup
/dict_count countdictstack def % Count objects on dict stack
/op_count count 1 sub def      % Count objects on operand stack
userdict begin                 % Push userdict on dict stack
/showpage { } def              % Redefine showpage, { } = null proc
0 setgray 0 setlinecap         % Prepare graphics state
1 setlinewidth 0 setlinejoin
10 setmiterlimit [ ] 0 setdash newpath
/languagelevel where           % If level not equal to 1 then
{pop languagelevel             % set strokeadjust and
1 ne                           % overprint to their defaults.
{false setstrokeadjust false setoverprint
} if
} if
} bd
/EndEPSF { %def
count op_count sub {pop} repeat            % Clean up stacks
countdictstack dict_count sub {end} repeat
b4_Inc_state restore
} bd
%%EndResource
%FOPBeginFontDict
%%IncludeResource: font Courier-Oblique
%%IncludeResource: font Courier-BoldOblique
%%IncludeResource: font Courier-Bold
%%IncludeResource: font ZapfDingbats
%%IncludeResource: font Symbol
%%IncludeResource: font Helvetica
%%IncludeResource: font Helvetica-Oblique
%%IncludeResource: font Helvetica-Bold
%%IncludeResource: font Helvetica-BoldOblique
%%IncludeResource: font Times-Roman
%%IncludeResource: font Times-Italic
%%IncludeResource: font Times-Bold
%%IncludeResource: font Times-BoldItalic
%%IncludeResource: font Courier
%FOPEndFontDict
%%BeginResource: encoding WinAnsiEncoding
/WinAnsiEncoding [
/.notdef /.notdef /.notdef /.notdef /.notdef
/.notdef /.notdef /.notdef /.notdef /.notdef
/.notdef /.notdef /.notdef /.notdef /.notdef
/.notdef /.notdef /.notdef /.notdef /.notdef
/.notdef /.notdef /.notdef /.notdef /.notdef
/.notdef /.notdef /.notdef /.notdef /.notdef
/.notdef /.notdef /space /exclam /quotedbl
/numbersign /dollar /percent /ampersand /quotesingle
/parenleft /parenright /asterisk /plus /comma
/hyphen /period /slash /zero /one
/two /three /four /five /six
/seven /eight /nine /colon /semicolon
/less /equal /greater /question /at
/A /B /C /D /E
/F /G /H /I /J
/K /L /M /N /O
/P /Q /R /S /T
/U /V /W /X /Y
/Z /bracketleft /backslash /bracketright /asciicircum
/underscore /quoteleft /a /b /c
/d /e /f /g /h
/i /j /k /l /m
/n /o /p /q /r
/s /t /u /v /w
/x /y /z /braceleft /bar
/braceright /asciitilde /bullet /Euro /bullet
/quotesinglbase /florin /quotedblbase /ellipsis /dagger
/daggerdbl /circumflex /perthousand /Scaron /guilsinglleft
/OE /bullet /Zcaron /bullet /bullet
/quoteleft /quoteright /quotedblleft /quotedblright /bullet
/endash /emdash /asciitilde /trademark /scaron
/guilsinglright /oe /bullet /zcaron /Ydieresis
/space /exclamdown /cent /sterling /currency
/yen /brokenbar /section /dieresis /copyright
/ordfeminine /guillemotleft /logicalnot /sfthyphen /registered
/macron /degree /plusminus /twosuperior /threesuperior
/acute /mu /paragraph /middot /cedilla
/onesuperior /ordmasculine /guillemotright /onequarter /onehalf
/threequarters /questiondown /Agrave /Aacute /Acircumflex
/Atilde /Adieresis /Aring /AE /Ccedilla
/Egrave /Eacute /Ecircumflex /Edieresis /Igrave
/Iacute /Icircumflex /Idieresis /Eth /Ntilde
/Ograve /Oacute /Ocircumflex /Otilde /Odieresis
/multiply /Oslash /Ugrave /Uacute /Ucircumflex
/Udieresis /Yacute /Thorn /germandbls /agrave
/aacute /acircumflex /atilde /adieresis /aring
/ae /ccedilla /egrave /eacute /ecircumflex
/edieresis /igrave /iacute /icircumflex /idieresis
/eth /ntilde /ograve /oacute /ocircumflex
/otilde /odieresis /divide /oslash /ugrave
/uacute /ucircumflex /udieresis /yacute /thorn
/ydieresis
] def
%%EndResource
%FOPBeginFontReencode
/Courier-Oblique findfont
dup length dict begin
  {1 index /FID ne {def} {pop pop} ifelse} forall
  /Encoding WinAnsiEncoding def
  currentdict
end
/Courier-Oblique exch definefont pop
/Courier-BoldOblique findfont
dup length dict begin
  {1 index /FID ne {def} {pop pop} ifelse} forall
  /Encoding WinAnsiEncoding def
  currentdict
end
/Courier-BoldOblique exch definefont pop
/Courier-Bold findfont
dup length dict begin
  {1 index /FID ne {def} {pop pop} ifelse} forall
  /Encoding WinAnsiEncoding def
  currentdict
end
/Courier-Bold exch definefont pop
/Helvetica findfont
dup length dict begin
  {1 index /FID ne {def} {pop pop} ifelse} forall
  /Encoding WinAnsiEncoding def
  currentdict
end
/Helvetica exch definefont pop
/Helvetica-Oblique findfont
dup length dict begin
  {1 index /FID ne {def} {pop pop} ifelse} forall
  /Encoding WinAnsiEncoding def
  currentdict
end
/Helvetica-Oblique exch definefont pop
/Helvetica-Bold findfont
dup length dict begin
  {1 index /FID ne {def} {pop pop} ifelse} forall
  /Encoding WinAnsiEncoding def
  currentdict
end
/Helvetica-Bold exch definefont pop
/Helvetica-BoldOblique findfont
dup length dict begin
  {1 index /FID ne {def} {pop pop} ifelse} forall
  /Encoding WinAnsiEncoding def
  currentdict
end
/Helvetica-BoldOblique exch definefont pop
/Times-Roman findfont
dup length dict begin
  {1 index /FID ne {def} {pop pop} ifelse} forall
  /Encoding WinAnsiEncoding def
  currentdict
end
/Times-Roman exch definefont pop
/Times-Italic findfont
dup length dict begin
  {1 index /FID ne {def} {pop pop} ifelse} forall
  /Encoding WinAnsiEncoding def
  currentdict
end
/Times-Italic exch definefont pop
/Times-Bold findfont
dup length dict begin
  {1 index /FID ne {def} {pop pop} ifelse} forall
  /Encoding WinAnsiEncoding def
  currentdict
end
/Times-Bold exch definefont pop
/Times-BoldItalic findfont
dup length dict begin
  {1 index /FID ne {def} {pop pop} ifelse} forall
  /Encoding WinAnsiEncoding def
  currentdict
end
/Times-BoldItalic exch definefont pop
/Courier findfont
dup length dict begin
  {1 index /FID ne {def} {pop pop} ifelse} forall
  /Encoding WinAnsiEncoding def
  currentdict
end
/Courier exch definefont pop
%FOPEndFontReencode
%%EndProlog
%%Page: 1 1
%%PageBoundingBox: 0 0 420 315
%%BeginPageSetup
[1 0 0 -1 0 315] CT
%%EndPageSetup
GS
[0.6 0 0 0.6 0 0] CT
1 GC
N
0 0 700 525 re
f
GR
GS
[0.6 0 0 0.6 0 0] CT
1 GC
N
0 0 700 525 re
f
GR
GS
[0.6 0 0 0.6 0 0] CT
1 GC
N
91 467 M
634 467 L
634 39 L
91 39 L
cp
f
GR
GS
[0.6 0 0 0.6 0 0] CT
0.149 GC
2 setlinecap
1 LJ
0.833 LW
N
91 467 M
634 467 L
S
GR
GS
[0.6 0 0 0.6 0 0] CT
0.149 GC
2 setlinecap
1 LJ
0.833 LW
N
91 39 M
634 39 L
S
GR
GS
[0.6 0 0 0.6 0 0] CT
0.149 GC
2 setlinecap
1 LJ
0.833 LW
N
91 467 M
91 461.57 L
S
GR
GS
[0.6 0 0 0.6 0 0] CT
0.149 GC
2 setlinecap
1 LJ
0.833 LW
N
145.3 467 M
145.3 461.57 L
S
GR
GS
[0.6 0 0 0.6 0 0] CT
0.149 GC
2 setlinecap
1 LJ
0.833 LW
N
199.6 467 M
199.6 461.57 L
S
GR
GS
[0.6 0 0 0.6 0 0] CT
0.149 GC
2 setlinecap
1 LJ
0.833 LW
N
253.9 467 M
253.9 461.57 L
S
GR
GS
[0.6 0 0 0.6 0 0] CT
0.149 GC
2 setlinecap
1 LJ
0.833 LW
N
308.2 467 M
308.2 461.57 L
S
GR
GS
[0.6 0 0 0.6 0 0] CT
0.149 GC
2 setlinecap
1 LJ
0.833 LW
N
362.5 467 M
362.5 461.57 L
S
GR
GS
[0.6 0 0 0.6 0 0] CT
0.149 GC
2 setlinecap
1 LJ
0.833 LW
N
416.8 467 M
416.8 461.57 L
S
GR
GS
[0.6 0 0 0.6 0 0] CT
0.149 GC
2 setlinecap
1 LJ
0.833 LW
N
471.1 467 M
471.1 461.57 L
S
GR
GS
[0.6 0 0 0.6 0 0] CT
0.149 GC
2 setlinecap
1 LJ
0.833 LW
N
525.4 467 M
525.4 461.57 L
S
GR
GS
[0.6 0 0 0.6 0 0] CT
0.149 GC
2 setlinecap
1 LJ
0.833 LW
N
579.7 467 M
579.7 461.57 L
S
GR
GS
[0.6 0 0 0.6 0 0] CT
0.149 GC
2 setlinecap
1 LJ
0.833 LW
N
634 467 M
634 461.57 L
S
GR
GS
[0.6 0 0 0.6 0 0] CT
0.149 GC
2 setlinecap
1 LJ
0.833 LW
N
91 39 M
91 44.43 L
S
GR
GS
[0.6 0 0 0.6 0 0] CT
0.149 GC
2 setlinecap
1 LJ
0.833 LW
N
145.3 39 M
145.3 44.43 L
S
GR
GS
[0.6 0 0 0.6 0 0] CT
0.149 GC
2 setlinecap
1 LJ
0.833 LW
N
199.6 39 M
199.6 44.43 L
S
GR
GS
[0.6 0 0 0.6 0 0] CT
0.149 GC
2 setlinecap
1 LJ
0.833 LW
N
253.9 39 M
253.9 44.43 L
S
GR
GS
[0.6 0 0 0.6 0 0] CT
0.149 GC
2 setlinecap
1 LJ
0.833 LW
N
308.2 39 M
308.2 44.43 L
S
GR
GS
[0.6 0 0 0.6 0 0] CT
0.149 GC
2 setlinecap
1 LJ
0.833 LW
N
362.5 39 M
362.5 44.43 L
S
GR
GS
[0.6 0 0 0.6 0 0] CT
0.149 GC
2 setlinecap
1 LJ
0.833 LW
N
416.8 39 M
416.8 44.43 L
S
GR
GS
[0.6 0 0 0.6 0 0] CT
0.149 GC
2 setlinecap
1 LJ
0.833 LW
N
471.1 39 M
471.1 44.43 L
S
GR
GS
[0.6 0 0 0.6 0 0] CT
0.149 GC
2 setlinecap
1 LJ
0.833 LW
N
525.4 39 M
525.4 44.43 L
S
GR
GS
[0.6 0 0 0.6 0 0] CT
0.149 GC
2 setlinecap
1 LJ
0.833 LW
N
579.7 39 M
579.7 44.43 L
S
GR
GS
[0.6 0 0 0.6 0 0] CT
0.149 GC
2 setlinecap
1 LJ
0.833 LW
N
634 39 M
634 44.43 L
S
GR
GS
[0.6 0 0 0.6 54.6 284.19999] CT
0.149 GC
/Helvetica 16.667 F
GS
[1 0 0 1 0 0] CT
-16.5 17 moveto 
1 -1 scale
(7.53) t 
GR
GR
GS
[0.6 0 0 0.6 87.18 284.19999] CT
0.149 GC
/Helvetica 16.667 F
GS
[1 0 0 1 0 0] CT
-16.5 17 moveto 
1 -1 scale
(7.54) t 
GR
GR
GS
[0.6 0 0 0.6 119.76 284.19999] CT
0.149 GC
/Helvetica 16.667 F
GS
[1 0 0 1 0 0] CT
-16.5 17 moveto 
1 -1 scale
(7.55) t 
GR
GR
GS
[0.6 0 0 0.6 152.34 284.19999] CT
0.149 GC
/Helvetica 16.667 F
GS
[1 0 0 1 0 0] CT
-16.5 17 moveto 
1 -1 scale
(7.56) t 
GR
GR
GS
[0.6 0 0 0.6 184.92001 284.19999] CT
0.149 GC
/Helvetica 16.667 F
GS
[1 0 0 1 0 0] CT
-16.5 17 moveto 
1 -1 scale
(7.57) t 
GR
GR
GS
[0.6 0 0 0.6 217.5 284.19999] CT
0.149 GC
/Helvetica 16.667 F
GS
[1 0 0 1 0 0] CT
-16.5 17 moveto 
1 -1 scale
(7.58) t 
GR
GR
GS
[0.6 0 0 0.6 250.07999 284.19999] CT
0.149 GC
/Helvetica 16.667 F
GS
[1 0 0 1 0 0] CT
-16.5 17 moveto 
1 -1 scale
(7.59) t 
GR
GR
GS
[0.6 0 0 0.6 282.66 284.19999] CT
0.149 GC
/Helvetica 16.667 F
GS
[1 0 0 1 0 0] CT
-12 17 moveto 
1 -1 scale
(7.6) t 
GR
GR
GS
[0.6 0 0 0.6 315.24001 284.19999] CT
0.149 GC
/Helvetica 16.667 F
GS
[1 0 0 1 0 0] CT
-16.5 17 moveto 
1 -1 scale
(7.61) t 
GR
GR
GS
[0.6 0 0 0.6 347.82001 284.19999] CT
0.149 GC
/Helvetica 16.667 F
GS
[1 0 0 1 0 0] CT
-16.5 17 moveto 
1 -1 scale
(7.62) t 
GR
GR
GS
[0.6 0 0 0.6 380.4 284.19999] CT
0.149 GC
/Helvetica 16.667 F
GS
[1 0 0 1 0 0] CT
-16.5 17 moveto 
1 -1 scale
(7.63) t 
GR
GR
GS
[0.6 0 0 0.6 217.5 297.80001] CT
0.149 GC
/Helvetica 18.333 F
GS
[1 0 0 1 0 0] CT
-20 19 moveto 
1 -1 scale
(s [m]) t 
GR
GR
GS
[0.6 0 0 0.6 356.4 310.8] CT
0.149 GC
N
2.5 -0.484 M
2.5 -0.625 2.578 -0.734 QT
6.125 -4.25 L
2.578 -7.781 L
2.5 -7.875 2.5 -8.016 QT
2.5 -8.141 2.602 -8.242 QT
2.703 -8.344 2.844 -8.344 QT
2.953 -8.344 3.094 -8.25 QT
6.609 -4.719 L
10.125 -8.25 L
10.266 -8.344 10.375 -8.344 QT
10.516 -8.344 10.609 -8.25 QT
10.703 -8.156 10.703 -8.016 QT
10.703 -7.875 10.625 -7.781 QT
7.094 -4.25 L
10.625 -0.734 L
10.703 -0.625 10.703 -0.484 QT
10.703 -0.344 10.609 -0.25 QT
10.516 -0.156 10.375 -0.156 QT
10.25 -0.156 10.125 -0.281 QT
6.609 -3.781 L
3.094 -0.281 L
2.969 -0.156 2.844 -0.156 QT
2.703 -0.156 2.602 -0.258 QT
2.5 -0.359 2.5 -0.484 QT
cp
f
GR
GS
[0.6 0 0 0.6 364.2 310.8] CT
0.149 GC
/Helvetica 16.667 F
GS
[1 0 0 1 0 0] CT
0 0 moveto 
1 -1 scale
(10) t 
GR
GR
GS
[0.6 0 0 0.6 375.6 306] CT
0.149 GC
/Helvetica 13.333 F
GS
[1 0 0 1 0 0] CT
0 0 moveto 
1 -1 scale
(4) t 
GR
GR
GS
[0.6 0 0 0.6 0 0] CT
0.149 GC
2 setlinecap
1 LJ
0.833 LW
N
91 467 M
91 39 L
S
GR
GS
[0.6 0 0 0.6 0 0] CT
0.149 GC
2 setlinecap
1 LJ
0.833 LW
N
634 467 M
634 39 L
S
GR
GS
[0.6 0 0 0.6 0 0] CT
0.149 GC
2 setlinecap
1 LJ
0.833 LW
N
91 467 M
96.43 467 L
S
GR
GS
[0.6 0 0 0.6 0 0] CT
0.149 GC
2 setlinecap
1 LJ
0.833 LW
N
91 395.667 M
96.43 395.667 L
S
GR
GS
[0.6 0 0 0.6 0 0] CT
0.149 GC
2 setlinecap
1 LJ
0.833 LW
N
91 324.333 M
96.43 324.333 L
S
GR
GS
[0.6 0 0 0.6 0 0] CT
0.149 GC
2 setlinecap
1 LJ
0.833 LW
N
91 253 M
96.43 253 L
S
GR
GS
[0.6 0 0 0.6 0 0] CT
0.149 GC
2 setlinecap
1 LJ
0.833 LW
N
91 181.667 M
96.43 181.667 L
S
GR
GS
[0.6 0 0 0.6 0 0] CT
0.149 GC
2 setlinecap
1 LJ
0.833 LW
N
91 110.333 M
96.43 110.333 L
S
GR
GS
[0.6 0 0 0.6 0 0] CT
0.149 GC
2 setlinecap
1 LJ
0.833 LW
N
91 39 M
96.43 39 L
S
GR
GS
[0.6 0 0 0.6 0 0] CT
0.149 GC
2 setlinecap
1 LJ
0.833 LW
N
634 467 M
628.57 467 L
S
GR
GS
[0.6 0 0 0.6 0 0] CT
0.149 GC
2 setlinecap
1 LJ
0.833 LW
N
634 395.667 M
628.57 395.667 L
S
GR
GS
[0.6 0 0 0.6 0 0] CT
0.149 GC
2 setlinecap
1 LJ
0.833 LW
N
634 324.333 M
628.57 324.333 L
S
GR
GS
[0.6 0 0 0.6 0 0] CT
0.149 GC
2 setlinecap
1 LJ
0.833 LW
N
634 253 M
628.57 253 L
S
GR
GS
[0.6 0 0 0.6 0 0] CT
0.149 GC
2 setlinecap
1 LJ
0.833 LW
N
634 181.667 M
628.57 181.667 L
S
GR
GS
[0.6 0 0 0.6 0 0] CT
0.149 GC
2 setlinecap
1 LJ
0.833 LW
N
634 110.333 M
628.57 110.333 L
S
GR
GS
[0.6 0 0 0.6 0 0] CT
0.149 GC
2 setlinecap
1 LJ
0.833 LW
N
634 39 M
628.57 39 L
S
GR
GS
[0.6 0 0 0.6 50.59877 280.2] CT
0.149 GC
/Helvetica 16.667 F
GS
[1 0 0 1 0 0] CT
-29 6.5 moveto 
1 -1 scale
(-0.2) t 
GR
GR
GS
[0.6 0 0 0.6 50.59877 237.39999] CT
0.149 GC
/Helvetica 16.667 F
GS
[1 0 0 1 0 0] CT
-10 6.5 moveto 
1 -1 scale
(0) t 
GR
GR
GS
[0.6 0 0 0.6 50.59877 194.60001] CT
0.149 GC
/Helvetica 16.667 F
GS
[1 0 0 1 0 0] CT
-24 6.5 moveto 
1 -1 scale
(0.2) t 
GR
GR
GS
[0.6 0 0 0.6 50.59877 151.8] CT
0.149 GC
/Helvetica 16.667 F
GS
[1 0 0 1 0 0] CT
-24 6.5 moveto 
1 -1 scale
(0.4) t 
GR
GR
GS
[0.6 0 0 0.6 50.59877 108.99999] CT
0.149 GC
/Helvetica 16.667 F
GS
[1 0 0 1 0 0] CT
-24 6.5 moveto 
1 -1 scale
(0.6) t 
GR
GR
GS
[0.6 0 0 0.6 50.59877 66.2] CT
0.149 GC
/Helvetica 16.667 F
GS
[1 0 0 1 0 0] CT
-24 6.5 moveto 
1 -1 scale
(0.8) t 
GR
GR
GS
[0.6 0 0 0.6 50.59877 23.4] CT
0.149 GC
/Helvetica 16.667 F
GS
[1 0 0 1 0 0] CT
-10 6.5 moveto 
1 -1 scale
(1) t 
GR
GR
GS
[0 -0.6 0.6 0 30.20063 151.79988] CT
0.149 GC
/Helvetica 18.333 F
GS
[1 0 0 1 0 0] CT
-27 -5 moveto 
1 -1 scale
(v [m/s]) t 
GR
GR
GS
[0.6 0 0 0.6 0 0] CT
0 0.447 0.741 RC
1 LJ
3.333 LW
N
142.152 59.837 M
142.152 60.012 L
142.152 60.012 L
142.152 60.012 L
142.152 60.012 L
142.152 60.012 L
142.152 60.012 L
142.152 60.012 L
142.152 60.012 L
142.152 60.012 L
142.152 60.012 L
142.152 60.012 L
142.152 60.012 L
142.152 60.012 L
142.152 60.012 L
142.152 60.012 L
142.152 60.012 L
142.152 60.012 L
142.152 60.012 L
142.157 60.012 L
142.157 60.012 L
142.161 60.012 L
142.165 60.013 L
142.169 60.013 L
142.174 60.013 L
142.178 60.014 L
142.186 60.014 L
142.19 60.015 L
142.199 60.015 L
142.207 60.016 L
142.216 60.016 L
142.224 60.017 L
142.233 60.018 L
142.241 60.019 L
142.254 60.019 L
142.267 60.02 L
142.275 60.021 L
142.288 60.022 L
142.301 60.023 L
142.314 60.024 L
142.33 60.025 L
142.343 60.026 L
142.356 60.027 L
142.373 60.028 L
142.39 60.03 L
142.407 60.031 L
142.424 60.032 L
142.441 60.033 L
142.458 60.035 L
142.479 60.036 L
142.496 60.038 L
142.517 60.039 L
142.538 60.041 L
142.56 60.042 L
142.581 60.044 L
142.581 60.044 L
142.598 60.045 L
142.627 60.047 L
142.653 60.049 L
142.683 60.052 L
142.704 60.053 L
142.725 60.055 L
142.725 60.055 L
142.738 60.056 L
142.776 60.059 L
142.806 60.061 L
142.835 60.063 L
142.865 60.065 L
142.89 60.067 L
142.916 60.069 L
142.946 60.071 L
142.98 60.074 L
143.013 60.076 L
143.043 60.079 L
143.069 60.081 L
143.073 60.081 L
143.09 60.082 L
143.128 60.085 L
143.175 60.089 L
143.2 60.091 L
143.23 60.093 L
143.264 60.096 L
143.276 60.096 L
143.327 60.1 L
143.361 60.103 L
143.387 60.105 L
143.429 60.108 L
143.484 60.112 L
143.501 60.113 L
143.535 60.116 L
143.578 60.119 L
143.624 60.122 L
143.667 60.126 L
143.709 60.129 L
143.747 60.132 L
143.786 60.135 L
143.832 60.138 L
143.879 60.142 L
143.926 60.145 L
143.968 60.148 L
144.015 60.152 L
144.057 60.155 L
144.099 60.158 L
144.155 60.162 L
144.206 60.166 L
144.248 60.169 L
144.29 60.173 L
144.299 60.173 L
144.337 60.176 L
144.401 60.181 L
144.452 60.185 L
144.511 60.189 L
144.57 60.194 L
144.604 60.196 L
144.651 60.2 L
144.71 60.204 L
144.765 60.208 L
144.829 60.213 L
144.889 60.218 L
144.931 60.221 L
144.982 60.225 L
145.045 60.229 L
145.105 60.234 L
145.168 60.239 L
145.228 60.243 L
145.279 60.247 L
145.334 60.251 L
145.398 60.256 L
145.461 60.261 L
145.525 60.266 L
145.588 60.27 L
145.648 60.275 L
145.707 60.279 L
145.771 60.284 L
145.839 60.289 L
145.907 60.294 L
145.97 60.299 L
146.025 60.303 L
146.038 60.304 L
146.081 60.307 L
146.165 60.314 L
146.238 60.319 L
146.322 60.325 L
146.382 60.33 L
146.445 60.335 L
146.518 60.34 L
146.598 60.346 L
146.658 60.351 L
146.725 60.356 L
146.806 60.362 L
146.874 60.367 L
146.95 60.373 L
147.031 60.379 L
147.094 60.384 L
147.167 60.389 L
147.247 60.395 L
147.324 60.401 L
147.4 60.407 L
147.48 60.413 L
147.557 60.418 L
147.633 60.424 L
147.71 60.43 L
147.794 60.436 L
147.875 60.442 L
147.951 60.448 L
148.036 60.454 L
148.117 60.46 L
148.193 60.466 L
148.274 60.472 L
148.282 60.473 L
148.333 60.477 L
148.439 60.485 L
148.537 60.492 L
148.639 60.5 L
148.723 60.506 L
148.796 60.511 L
148.868 60.517 L
148.957 60.524 L
149.059 60.531 L
149.16 60.539 L
149.245 60.545 L
149.326 60.551 L
149.406 60.557 L
149.496 60.564 L
149.597 60.572 L
149.699 60.579 L
149.788 60.586 L
149.865 60.592 L
149.877 60.593 L
149.937 60.597 L
150.055 60.606 L
150.162 60.614 L
150.276 60.623 L
150.357 60.629 L
150.437 60.635 L
150.45 60.636 L
150.509 60.64 L
150.654 60.651 L
150.743 60.658 L
150.862 60.667 L
150.959 60.674 L
151.04 60.68 L
151.15 60.688 L
151.277 60.698 L
151.345 60.703 L
151.438 60.71 L
151.566 60.719 L
151.655 60.726 L
151.765 60.734 L
151.888 60.744 L
151.969 60.75 L
152.066 60.757 L
152.194 60.767 L
152.287 60.774 L
152.397 60.782 L
152.524 60.791 L
152.614 60.798 L
152.715 60.806 L
152.843 60.815 L
152.94 60.823 L
153.055 60.831 L
153.178 60.841 L
153.275 60.848 L
153.386 60.856 L
153.509 60.865 L
153.615 60.873 L
153.729 60.882 L
153.852 60.891 L
153.958 60.899 L
154.073 60.908 L
154.192 60.917 L
154.31 60.926 L
154.429 60.934 L
154.548 60.943 L
154.663 60.952 L
154.781 60.961 L
154.9 60.97 L
155.023 60.979 L
155.146 60.988 L
155.261 60.997 L
155.375 61.006 L
155.388 61.007 L
155.452 61.011 L
155.604 61.023 L
155.761 61.034 L
155.867 61.042 L
155.973 61.05 L
156.105 61.06 L
156.135 61.063 L
156.275 61.073 L
156.436 61.085 L
156.516 61.091 L
156.627 61.1 L
156.779 61.111 L
156.902 61.12 L
157.038 61.13 L
157.187 61.142 L
157.293 61.149 L
157.411 61.158 L
157.56 61.17 L
157.687 61.179 L
157.827 61.189 L
157.971 61.2 L
158.086 61.209 L
158.213 61.218 L
158.362 61.23 L
158.493 61.239 L
158.633 61.25 L
158.777 61.261 L
158.905 61.27 L
159.036 61.28 L
159.18 61.291 L
159.32 61.301 L
159.465 61.312 L
159.6 61.323 L
159.74 61.333 L
159.876 61.343 L
160.016 61.354 L
160.169 61.365 L
160.313 61.376 L
160.449 61.386 L
160.58 61.396 L
160.597 61.397 L
160.682 61.404 L
160.865 61.417 L
161.034 61.43 L
161.212 61.443 L
161.352 61.454 L
161.475 61.463 L
161.598 61.472 L
161.751 61.484 L
161.921 61.497 L
162.091 61.509 L
162.235 61.52 L
162.375 61.53 L
162.506 61.54 L
162.655 61.551 L
162.829 61.565 L
162.998 61.577 L
163.138 61.588 L
163.27 61.598 L
163.291 61.599 L
163.401 61.607 L
163.597 61.622 L
163.758 61.634 L
163.949 61.648 L
164.089 61.659 L
164.233 61.669 L
164.398 61.682 L
164.581 61.696 L
164.708 61.705 L
164.856 61.716 L
165.039 61.73 L
165.192 61.741 L
165.357 61.754 L
165.535 61.767 L
165.675 61.778 L
165.832 61.789 L
166.01 61.803 L
166.172 61.815 L
166.337 61.827 L
166.511 61.84 L
166.668 61.852 L
166.829 61.864 L
166.999 61.877 L
167.168 61.889 L
167.342 61.902 L
167.508 61.915 L
167.678 61.927 L
167.843 61.94 L
168.008 61.952 L
168.191 61.966 L
168.365 61.979 L
168.526 61.991 L
168.687 62.003 L
168.708 62.005 L
168.81 62.012 L
169.027 62.028 L
169.23 62.044 L
169.442 62.059 L
169.612 62.072 L
169.756 62.083 L
169.905 62.094 L
170.087 62.108 L
170.291 62.123 L
170.494 62.138 L
170.664 62.151 L
170.829 62.163 L
170.986 62.175 L
171.165 62.188 L
171.372 62.204 L
171.572 62.219 L
171.742 62.231 L
171.894 62.243 L
171.92 62.245 L
172.039 62.254 L
172.272 62.271 L
172.471 62.286 L
172.7 62.303 L
172.853 62.315 L
173.01 62.326 L
173.031 62.328 L
173.133 62.335 L
173.404 62.356 L
173.595 62.37 L
173.812 62.386 L
174.02 62.402 L
174.164 62.413 L
174.329 62.425 L
174.541 62.441 L
174.737 62.455 L
174.949 62.471 L
175.148 62.486 L
175.313 62.499 L
175.492 62.512 L
175.695 62.527 L
175.899 62.542 L
176.107 62.558 L
176.306 62.573 L
176.489 62.586 L
176.671 62.6 L
176.866 62.615 L
177.082 62.631 L
177.29 62.646 L
177.481 62.66 L
177.681 62.675 L
177.867 62.689 L
178.058 62.704 L
178.262 62.719 L
178.283 62.72 L
178.389 62.728 L
178.635 62.747 L
178.894 62.766 L
179.072 62.779 L
179.246 62.792 L
179.467 62.809 L
179.509 62.812 L
179.717 62.827 L
179.976 62.847 L
180.124 62.858 L
180.324 62.873 L
180.587 62.892 L
180.752 62.904 L
180.96 62.92 L
181.219 62.939 L
181.38 62.951 L
181.583 62.967 L
181.842 62.986 L
182.012 62.999 L
182.224 63.015 L
182.483 63.034 L
182.652 63.046 L
182.86 63.062 L
183.119 63.081 L
183.297 63.094 L
183.514 63.111 L
183.768 63.129 L
183.946 63.143 L
184.158 63.159 L
184.413 63.178 L
184.604 63.192 L
184.82 63.208 L
185.071 63.227 L
185.261 63.241 L
185.478 63.257 L
185.724 63.275 L
185.927 63.29 L
186.148 63.307 L
186.39 63.325 L
186.598 63.34 L
186.818 63.357 L
187.056 63.375 L
187.272 63.391 L
187.497 63.407 L
187.73 63.425 L
187.951 63.441 L
188.176 63.458 L
188.405 63.475 L
188.634 63.492 L
188.863 63.509 L
189.088 63.526 L
189.325 63.544 L
189.555 63.561 L
189.775 63.577 L
189.996 63.594 L
190.021 63.596 L
190.144 63.605 L
190.428 63.626 L
190.721 63.648 L
190.925 63.663 L
191.133 63.678 L
191.383 63.697 L
191.425 63.7 L
191.65 63.717 L
191.951 63.739 L
192.138 63.753 L
192.376 63.771 L
192.673 63.793 L
192.851 63.806 L
193.084 63.823 L
193.381 63.846 L
193.572 63.86 L
193.814 63.878 L
194.106 63.9 L
194.297 63.914 L
194.535 63.931 L
194.828 63.953 L
195.027 63.968 L
195.273 63.986 L
195.561 64.008 L
195.765 64.023 L
196.003 64.041 L
196.295 64.062 L
196.503 64.078 L
196.749 64.096 L
197.038 64.118 L
197.25 64.133 L
197.492 64.152 L
197.776 64.173 L
198.001 64.189 L
198.251 64.208 L
198.531 64.229 L
198.756 64.245 L
199.002 64.264 L
199.282 64.284 L
199.515 64.302 L
199.77 64.321 L
200.041 64.341 L
200.283 64.359 L
200.533 64.377 L
200.801 64.397 L
201.051 64.416 L
201.31 64.435 L
201.568 64.454 L
201.827 64.474 L
202.086 64.493 L
202.336 64.511 L
202.608 64.532 L
202.871 64.551 L
203.117 64.569 L
203.367 64.588 L
203.397 64.59 L
203.541 64.601 L
203.868 64.625 L
204.186 64.649 L
204.432 64.667 L
204.674 64.685 L
204.954 64.706 L
204.983 64.708 L
205.132 64.719 L
205.458 64.743 L
205.785 64.767 L
206.031 64.786 L
206.277 64.804 L
206.591 64.827 L
206.888 64.849 L
207.134 64.867 L
207.359 64.884 L
207.401 64.887 L
207.601 64.902 L
207.949 64.928 L
208.216 64.948 L
208.543 64.972 L
208.856 64.995 L
209.039 65.009 L
209.268 65.026 L
209.582 65.049 L
209.866 65.07 L
210.176 65.093 L
210.468 65.115 L
210.698 65.132 L
210.939 65.15 L
211.241 65.172 L
211.533 65.194 L
211.834 65.216 L
212.123 65.237 L
212.373 65.256 L
212.628 65.275 L
212.92 65.296 L
213.222 65.319 L
213.519 65.341 L
213.794 65.361 L
214.07 65.382 L
214.337 65.401 L
214.613 65.422 L
214.927 65.445 L
215.228 65.467 L
215.491 65.487 L
215.75 65.506 L
215.788 65.509 L
215.992 65.524 L
216.352 65.551 L
216.654 65.573 L
217.006 65.599 L
217.26 65.618 L
217.527 65.637 L
217.833 65.66 L
218.16 65.684 L
218.401 65.702 L
218.677 65.723 L
219.008 65.747 L
219.284 65.768 L
219.589 65.79 L
219.907 65.814 L
220.17 65.833 L
220.455 65.854 L
220.773 65.878 L
221.061 65.899 L
221.367 65.922 L
221.676 65.944 L
221.961 65.965 L
222.249 65.987 L
222.55 66.009 L
222.86 66.032 L
223.165 66.055 L
223.462 66.076 L
223.768 66.099 L
224.06 66.121 L
224.353 66.142 L
224.65 66.164 L
224.68 66.166 L
224.828 66.178 L
225.202 66.205 L
225.596 66.234 L
225.851 66.253 L
226.105 66.272 L
226.432 66.296 L
226.517 66.302 L
226.928 66.333 L
227.208 66.353 L
227.446 66.371 L
227.789 66.396 L
228.214 66.427 L
228.375 66.439 L
228.65 66.46 L
229.011 66.486 L
229.312 66.509 L
229.652 66.534 L
229.995 66.559 L
230.254 66.578 L
230.543 66.599 L
230.89 66.625 L
231.2 66.648 L
231.535 66.673 L
231.866 66.697 L
232.155 66.718 L
232.452 66.74 L
232.782 66.765 L
233.109 66.789 L
233.44 66.813 L
233.762 66.837 L
234.072 66.86 L
234.377 66.882 L
234.696 66.906 L
235.039 66.931 L
235.37 66.955 L
235.676 66.978 L
235.973 67 L
236.011 67.003 L
236.193 67.016 L
236.596 67.046 L
236.986 67.075 L
237.296 67.097 L
237.602 67.12 L
237.971 67.147 L
238.323 67.173 L
238.632 67.196 L
238.917 67.217 L
238.955 67.22 L
239.158 67.234 L
239.57 67.265 L
239.947 62.768 L
240.346 62.797 L
240.681 62.822 L
240.944 62.842 L
241.22 62.863 L
241.572 62.889 L
241.946 62.917 L
242.327 62.945 L
242.654 62.969 L
242.955 62.992 L
243.248 63.014 L
243.587 63.039 L
243.965 63.067 L
244.334 63.095 L
244.656 63.119 L
244.945 63.14 L
244.983 63.143 L
245.165 63.157 L
245.594 63.189 L
246.005 63.219 L
246.319 63.243 L
246.633 63.266 L
246.989 63.293 L
247.032 63.296 L
247.236 63.311 L
247.66 63.343 L
248.063 63.373 L
248.478 63.404 L
248.809 63.428 L
249.102 63.45 L
249.391 63.472 L
249.743 63.498 L
250.146 63.528 L
250.54 63.557 L
250.867 63.582 L
251.16 63.603 L
251.189 63.606 L
251.359 63.618 L
251.8 63.651 L
252.246 63.684 L
252.538 63.706 L
252.831 63.728 L
253.204 63.756 L
253.302 63.763 L
253.773 63.798 L
254.095 63.822 L
254.362 63.842 L
254.757 63.871 L
255.245 63.908 L
255.431 63.921 L
255.75 63.945 L
256.161 63.976 L
256.505 64.001 L
256.891 64.03 L
257.285 64.059 L
257.582 64.081 L
257.913 64.106 L
258.308 64.135 L
258.664 64.162 L
259.046 64.19 L
259.428 64.218 L
259.754 64.243 L
260.094 64.268 L
260.471 64.296 L
260.844 64.324 L
261.226 64.352 L
261.591 64.379 L
261.943 64.405 L
262.291 64.431 L
262.656 64.458 L
263.046 64.487 L
263.424 64.516 L
263.776 64.541 L
264.115 64.567 L
264.153 64.57 L
264.357 64.585 L
264.815 64.619 L
265.269 64.652 L
265.604 64.677 L
265.944 64.702 L
266.338 64.732 L
266.385 64.735 L
266.635 64.754 L
267.097 64.788 L
267.509 64.819 L
267.967 64.853 L
268.281 64.876 L
268.599 64.899 L
268.637 64.902 L
268.828 64.917 L
269.38 64.957 L
269.77 64.986 L
270.198 65.018 L
270.597 65.048 L
270.907 65.071 L
271.242 65.096 L
271.654 65.126 L
272.052 65.156 L
272.468 65.186 L
272.854 65.215 L
273.202 65.241 L
273.55 65.267 L
273.94 65.296 L
274.352 65.326 L
274.763 65.356 L
275.136 65.384 L
275.514 65.412 L
275.875 65.439 L
276.244 65.466 L
276.676 65.498 L
277.084 65.528 L
277.44 65.555 L
277.784 65.58 L
277.843 65.585 L
278.144 65.607 L
278.636 65.643 L
279.018 65.671 L
279.48 65.706 L
279.934 65.739 L
280.197 65.759 L
280.528 65.783 L
280.982 65.817 L
281.381 65.846 L
281.822 65.879 L
282.246 65.91 L
282.569 65.934 L
282.921 65.96 L
283.354 65.992 L
283.761 66.022 L
284.193 66.054 L
284.605 66.085 L
284.961 66.111 L
285.326 66.138 L
285.742 66.169 L
286.162 66.2 L
286.59 66.231 L
286.985 66.26 L
287.371 66.289 L
287.748 66.317 L
288.147 66.346 L
288.584 66.379 L
289.008 66.41 L
289.386 66.438 L
289.755 66.465 L
289.806 66.469 L
290.06 66.488 L
290.569 66.525 L
291.028 66.559 L
291.524 66.596 L
291.944 66.626 L
292.258 66.65 L
292.597 66.675 L
293.034 66.707 L
293.488 66.741 L
293.959 66.775 L
294.37 66.806 L
294.727 66.832 L
295.092 66.859 L
295.512 66.89 L
295.974 66.924 L
296.428 66.957 L
296.827 66.987 L
297.221 67.016 L
297.599 67.044 L
298.002 67.073 L
298.477 67.108 L
298.922 67.141 L
299.308 67.17 L
299.669 67.196 L
299.733 67.201 L
300.055 67.224 L
300.585 67.264 L
300.997 67.294 L
301.493 67.331 L
301.989 67.367 L
302.265 67.387 L
302.622 67.414 L
303.109 67.449 L
303.538 67.481 L
304.017 67.516 L
304.471 67.55 L
304.819 67.575 L
305.197 67.603 L
305.663 67.637 L
306.1 67.67 L
306.567 67.704 L
307.008 67.736 L
307.39 67.764 L
307.784 67.793 L
308.23 67.826 L
308.684 67.859 L
309.142 67.893 L
309.566 67.924 L
309.982 67.955 L
310.389 67.985 L
310.813 68.016 L
311.288 68.051 L
311.738 68.084 L
312.149 68.114 L
312.54 68.143 L
312.595 68.147 L
312.871 68.167 L
313.418 68.207 L
313.91 68.243 L
314.44 68.282 L
314.805 68.309 L
315.166 68.336 L
315.229 68.34 L
315.535 68.363 L
316.175 68.41 L
316.553 68.437 L
317.083 68.476 L
317.541 68.51 L
317.881 68.535 L
318.36 68.57 L
318.962 68.614 L
319.213 68.633 L
319.616 68.662 L
320.146 68.701 L
320.553 68.731 L
321.024 68.765 L
321.542 68.803 L
321.894 68.829 L
322.31 68.86 L
322.827 68.898 L
323.243 68.928 L
323.714 68.962 L
324.21 68.999 L
324.596 69.027 L
324.672 69.033 L
324.672 69.033 L
325.097 302.045 L
325.568 372.043 L
325.954 388.032 L
326.429 393.747 L
326.98 395.208 L
327.311 395.504 L
327.731 395.614 L
328.274 391.487 L
328.669 394.344 L
329.105 395.287 L
329.606 395.547 L
330.026 395.618 L
330.48 395.635 L
330.968 395.624 L
331.384 395.639 L
331.825 395.643 L
332.3 395.633 L
332.741 395.636 L
333.195 395.634 L
333.653 395.629 L
334.099 395.631 L
334.54 395.634 L
334.989 395.634 L
335.456 395.625 L
335.91 395.623 L
336.343 395.632 L
336.814 395.619 L
337.259 395.621 L
337.679 395.635 L
338.112 395.642 L
338.171 395.651 L
338.472 395.664 L
339.032 395.655 L
339.529 395.645 L
340.08 395.588 L
340.458 395.637 L
340.835 395.655 L
340.886 395.659 L
341.141 395.665 L
341.794 395.651 L
342.244 395.651 L
342.77 395.624 L
343.283 395.569 L
343.601 395.647 L
343.987 395.658 L
344.505 395.647 L
344.959 395.645 L
345.459 395.624 L
345.947 395.597 L
346.316 395.643 L
346.719 395.654 L
347.211 395.644 L
347.674 395.639 L
348.161 395.622 L
348.624 395.611 L
349.031 395.636 L
349.447 395.647 L
349.913 395.642 L
350.389 395.631 L
350.864 395.616 L
351.309 395.619 L
351.746 395.626 L
352.17 395.637 L
352.611 395.641 L
353.104 395.62 L
353.574 395.605 L
353.994 395.625 L
354.402 395.644 L
354.461 395.652 L
354.771 395.664 L
355.335 395.655 L
355.819 395.648 L
356.37 395.599 L
356.756 395.637 L
357.176 395.647 L
357.647 395.64 L
358.148 395.616 L
358.534 395.645 L
358.962 395.65 L
359.458 395.636 L
359.891 395.642 L
360.358 395.636 L
360.833 395.622 L
361.249 395.638 L
361.681 395.644 L
362.152 395.636 L
362.606 395.634 L
363.068 395.628 L
363.518 395.626 L
363.964 395.628 L
364.401 395.634 L
364.842 395.637 L
365.321 395.622 L
365.779 395.617 L
366.208 395.63 L
366.628 395.641 L
366.679 395.649 L
366.933 395.664 L
367.493 395.654 L
368.036 395.626 L
368.46 395.638 L
368.88 395.647 L
369.394 395.622 L
369.886 395.587 L
370.306 395.613 L
370.692 395.644 L
370.751 395.652 L
371.052 395.664 L
371.621 395.655 L
372.109 395.647 L
372.66 395.597 L
373.046 395.637 L
373.466 395.647 L
373.937 395.64 L
374.433 395.616 L
374.824 395.644 L
375.252 395.65 L
375.744 395.636 L
376.181 395.641 L
376.643 395.635 L
377.119 395.622 L
377.539 395.637 L
377.971 395.643 L
378.438 395.636 L
378.896 395.633 L
379.358 395.627 L
379.804 395.627 L
380.254 395.627 L
380.69 395.633 L
381.132 395.637 L
381.611 395.621 L
382.069 395.615 L
382.493 395.63 L
382.913 395.642 L
382.969 395.65 L
383.249 395.664 L
383.809 395.655 L
384.326 395.638 L
384.873 395.569 L
385.327 395.564 L
385.684 395.636 L
386.061 395.655 L
386.536 395.651 L
387.041 395.633 L
387.554 395.588 L
387.996 395.595 L
388.399 395.629 L
388.793 395.648 L
389.247 395.648 L
389.756 395.625 L
390.252 395.589 L
390.677 395.61 L
391.063 395.643 L
391.114 395.65 L
391.36 395.664 L
391.928 395.654 L
392.471 395.622 L
392.887 395.638 L
393.303 395.649 L
393.778 395.641 L
393.829 395.649 L
394.083 395.664 L
394.643 395.654 L
395.186 395.625 L
395.606 395.638 L
396.026 395.647 L
396.544 395.621 L
397.036 395.584 L
397.456 395.612 L
397.837 395.645 L
397.901 395.653 L
398.219 395.664 L
398.788 395.654 L
399.259 395.65 L
399.806 395.609 L
400.205 395.638 L
400.616 395.649 L
401.091 395.643 L
401.6 395.612 L
401.974 395.647 L
402.398 395.653 L
402.907 395.636 L
403.331 395.645 L
403.798 395.64 L
404.29 395.619 L
404.689 395.642 L
405.117 395.648 L
405.605 395.636 L
406.046 395.639 L
406.508 395.634 L
406.975 395.624 L
407.404 395.635 L
407.841 395.64 L
408.299 395.636 L
408.761 395.63 L
409.219 395.625 L
409.66 395.628 L
410.119 395.624 L
410.556 395.629 L
410.988 395.637 L
411.476 395.618 L
411.934 395.612 L
412.35 395.631 L
412.766 395.644 L
412.834 395.653 L
413.169 395.663 L
413.733 395.653 L
414.191 395.651 L
414.73 395.617 L
415.243 395.555 L
415.549 395.646 L
415.926 395.659 L
416.439 395.649 L
416.906 395.644 L
417.415 395.616 L
417.894 395.592 L
418.264 395.641 L
418.662 395.654 L
419.15 395.645 L
419.621 395.638 L
420.113 395.615 L
420.571 395.608 L
420.979 395.634 L
421.39 395.647 L
421.852 395.643 L
422.336 395.629 L
422.815 395.61 L
423.252 395.618 L
423.694 395.623 L
424.114 395.637 L
424.55 395.642 L
425.051 395.618 L
425.522 395.6 L
425.942 395.624 L
426.341 395.645 L
426.409 395.654 L
426.756 395.663 L
427.325 395.651 L
427.766 395.653 L
428.296 395.628 L
428.822 395.561 L
429.124 395.648 L
429.505 395.659 L
430.027 395.647 L
430.481 395.646 L
430.986 395.623 L
431.474 395.595 L
431.839 395.643 L
432.242 395.654 L
432.734 395.644 L
433.196 395.64 L
433.684 395.622 L
434.151 395.61 L
434.554 395.636 L
434.969 395.648 L
435.436 395.642 L
435.911 395.632 L
436.39 395.616 L
436.832 395.619 L
437.269 395.627 L
437.693 395.639 L
438.134 395.641 L
438.626 395.621 L
439.097 395.606 L
439.521 395.624 L
439.924 395.643 L
439.984 395.651 L
440.272 395.664 L
440.836 395.655 L
441.341 395.643 L
441.893 395.582 L
442.266 395.636 L
442.639 395.656 L
442.699 395.66 L
442.996 395.665 L
443.653 395.652 L
444.056 395.659 L
444.603 395.641 L
445.057 395.639 L
445.414 395.659 L
445.901 395.653 L
446.495 395.588 L
446.771 395.653 L
447.183 395.659 L
447.73 395.638 L
448.129 395.652 L
448.604 395.646 L
449.138 395.607 L
449.486 395.651 L
449.906 395.656 L
450.436 395.636 L
450.844 395.65 L
451.31 395.644 L
451.828 395.615 L
452.201 395.648 L
452.63 395.653 L
453.139 395.635 L
453.559 395.646 L
454.021 395.641 L
454.513 395.621 L
454.916 395.643 L
455.349 395.647 L
455.837 395.635 L
456.274 395.639 L
456.732 395.635 L
457.203 395.625 L
457.631 395.635 L
458.068 395.64 L
458.53 395.635 L
458.989 395.63 L
459.447 395.626 L
459.888 395.629 L
460.346 395.624 L
460.787 395.629 L
461.22 395.636 L
461.704 395.618 L
462.157 395.614 L
462.577 395.631 L
462.997 395.644 L
463.061 395.652 L
463.388 395.664 L
463.952 395.654 L
464.419 395.65 L
464.962 395.611 L
465.365 395.638 L
465.776 395.649 L
466.251 395.643 L
466.76 395.612 L
467.134 395.647 L
467.558 395.653 L
468.067 395.636 L
468.491 395.645 L
468.958 395.639 L
469.45 395.619 L
469.849 395.642 L
470.277 395.648 L
470.765 395.636 L
471.206 395.639 L
471.668 395.634 L
472.135 395.624 L
472.564 395.634 L
473 395.64 L
473.459 395.636 L
473.921 395.629 L
474.379 395.624 L
474.82 395.628 L
475.279 395.624 L
475.716 395.629 L
476.148 395.637 L
476.636 395.617 L
477.094 395.612 L
477.51 395.631 L
477.926 395.644 L
477.994 395.653 L
478.333 395.663 L
478.897 395.652 L
479.351 395.652 L
479.89 395.621 L
480.403 395.558 L
480.709 395.647 L
481.086 395.659 L
481.604 395.648 L
482.066 395.644 L
482.575 395.619 L
483.054 395.594 L
483.424 395.642 L
483.822 395.654 L
484.314 395.645 L
484.781 395.639 L
485.269 395.618 L
485.731 395.609 L
486.139 395.635 L
486.55 395.647 L
487.017 395.643 L
487.496 395.63 L
487.975 395.612 L
488.417 395.618 L
488.854 395.625 L
489.274 395.637 L
489.715 395.642 L
490.211 395.619 L
490.682 395.602 L
491.102 395.624 L
491.505 395.644 L
491.569 395.653 L
491.895 395.664 L
492.464 395.654 L
492.926 395.651 L
493.469 395.614 L
493.876 395.638 L
494.284 395.65 L
494.759 395.643 L
495.272 395.611 L
495.641 395.648 L
496.065 395.654 L
496.579 395.636 L
496.999 395.646 L
497.465 395.641 L
497.962 395.618 L
498.356 395.644 L
498.785 395.649 L
499.277 395.636 L
499.714 395.641 L
500.176 395.636 L
500.647 395.623 L
501.071 395.637 L
501.504 395.642 L
501.97 395.636 L
502.429 395.632 L
502.887 395.627 L
503.336 395.627 L
503.786 395.626 L
504.223 395.632 L
504.664 395.636 L
505.144 395.62 L
505.602 395.615 L
506.022 395.63 L
506.442 395.642 L
506.501 395.651 L
506.79 395.664 L
507.349 395.655 L
507.859 395.642 L
508.41 395.579 L
508.779 395.636 L
509.152 395.656 L
509.216 395.66 L
509.534 395.665 L
510.192 395.651 L
510.574 395.661 L
511.117 395.647 L
511.592 395.639 L
511.931 395.66 L
512.423 395.655 L
513.034 395.581 L
513.289 395.651 L
513.696 395.658 L
514.235 395.64 L
514.646 395.65 L
515.125 395.642 L
515.643 395.608 L
516.004 395.648 L
516.424 395.655 L
516.941 395.638 L
517.361 395.647 L
517.832 395.64 L
518.328 395.616 L
518.719 395.644 L
519.143 395.65 L
519.639 395.637 L
520.076 395.641 L
520.538 395.635 L
521.014 395.622 L
521.434 395.637 L
521.866 395.643 L
522.333 395.636 L
522.791 395.633 L
523.253 395.627 L
523.703 395.626 L
524.149 395.627 L
524.586 395.633 L
525.027 395.637 L
525.506 395.621 L
525.964 395.615 L
526.388 395.63 L
526.808 395.642 L
526.864 395.65 L
527.135 395.664 L
527.695 395.655 L
528.221 395.636 L
528.764 395.564 L
529.209 395.568 L
529.579 395.634 L
529.956 395.654 L
530.423 395.651 L
530.936 395.631 L
531.449 395.583 L
531.886 395.597 L
532.294 395.627 L
532.692 395.647 L
533.138 395.648 L
533.651 395.622 L
534.147 395.585 L
534.567 395.611 L
534.949 395.644 L
535.009 395.652 L
535.301 395.664 L
535.87 395.655 L
536.366 395.645 L
536.918 395.589 L
537.295 395.637 L
537.673 395.655 L
537.724 395.659 L
537.97 395.665 L
538.627 395.651 L
539.081 395.649 L
539.603 395.622 L
540.108 395.575 L
540.439 395.646 L
540.825 395.658 L
541.338 395.647 L
541.796 395.644 L
542.297 395.623 L
542.776 395.6 L
543.154 395.641 L
543.557 395.653 L
544.044 395.644 L
544.511 395.638 L
544.995 395.62 L
545.457 395.612 L
545.869 395.634 L
546.284 395.645 L
546.747 395.642 L
547.226 395.629 L
547.701 395.613 L
548.138 395.62 L
548.584 395.623 L
549.008 395.635 L
549.44 395.641 L
549.941 395.618 L
550.408 395.602 L
550.828 395.625 L
551.226 395.645 L
551.299 395.654 L
551.646 395.663 L
552.215 395.651 L
552.656 395.653 L
553.186 395.628 L
553.712 395.562 L
554.014 395.648 L
554.395 395.659 L
554.917 395.647 L
555.371 395.646 L
555.876 395.623 L
556.359 395.595 L
556.729 395.643 L
557.132 395.654 L
557.624 395.644 L
558.086 395.64 L
558.574 395.622 L
559.041 395.61 L
559.444 395.637 L
559.859 395.648 L
560.326 395.642 L
560.801 395.632 L
561.276 395.616 L
561.722 395.619 L
562.159 395.627 L
562.583 395.639 L
563.024 395.641 L
563.516 395.621 L
563.987 395.606 L
564.407 395.624 L
564.814 395.643 L
564.874 395.651 L
565.162 395.664 L
565.726 395.655 L
566.231 395.643 L
566.783 395.581 L
567.152 395.636 L
567.525 395.656 L
567.589 395.66 L
567.898 395.665 L
568.556 395.652 L
568.946 395.66 L
569.493 395.644 L
569.956 395.639 L
570.304 395.659 L
570.791 395.654 L
571.398 395.584 L
571.661 395.652 L
S
GR
GS
[0.6 0 0 0.6 0 0] CT
0.851 0.325 0.098 RC
1 LJ
3.333 LW
N
142.152 395.667 M
142.178 371.76 L
142.203 355.721 L
142.229 328.655 L
142.263 305.191 L
142.297 284.937 L
142.326 273.5 L
142.352 264.11 L
142.39 251.976 L
142.415 244.39 L
142.449 237.953 L
142.483 232.331 L
142.509 229.506 L
142.543 224.804 L
142.581 220.725 L
142.619 220.725 L
142.657 216.883 L
142.695 213.248 L
142.738 213.248 L
142.772 211.647 L
142.814 209.456 L
142.844 208.567 L
142.899 206.761 L
142.933 206.288 L
142.967 205.505 L
142.992 204.959 L
143.018 204.389 L
143.052 204.031 L
143.086 203.697 L
143.115 203.337 L
143.153 203.014 L
143.187 202.813 L
143.221 202.24 L
143.251 202.147 L
143.289 202.448 L
143.323 202.31 L
143.366 202.099 L
143.412 201.985 L
143.442 202.006 L
143.484 201.897 L
143.535 201.816 L
143.578 201.729 L
143.62 201.909 L
143.692 201.909 L
143.773 201.682 L
143.803 201.516 L
143.858 201.688 L
143.93 201.824 L
143.959 202.423 L
144.006 201.686 L
144.066 201.049 L
144.155 201.292 L
144.197 201.224 L
144.252 201.462 L
144.286 201.429 L
144.35 201.203 L
144.384 200.742 L
144.443 200.985 L
144.498 200.905 L
144.541 201.164 L
144.587 200.95 L
144.625 201.145 L
144.672 201.437 L
144.723 201.452 L
144.77 201.329 L
144.816 201.637 L
144.867 201.435 L
144.91 201.659 L
144.965 201.759 L
145.016 201.803 L
145.062 201.682 L
145.105 201.276 L
145.164 200.356 L
145.215 200.335 L
145.275 199.248 L
145.317 198.38 L
145.381 197.255 L
145.423 196.319 L
145.487 194.618 L
145.538 193.857 L
145.597 193.315 L
145.656 192.808 L
145.72 192.229 L
145.767 191.704 L
145.826 191.016 L
145.885 190.228 L
145.941 189.266 L
146 188.186 L
146.055 187.16 L
146.115 186.185 L
146.178 184.102 L
146.246 181.997 L
146.305 171.632 L
146.361 160.856 L
146.403 146.894 L
146.479 146.344 L
146.556 146.164 L
146.632 147.036 L
146.708 146.089 L
146.781 145.678 L
146.865 145.051 L
146.942 145.087 L
147.014 144.516 L
147.09 143.817 L
147.175 145.221 L
147.26 144.971 L
147.34 144.973 L
147.417 145.022 L
147.497 145.06 L
147.591 145.036 L
147.667 144.966 L
147.748 144.909 L
147.828 144.913 L
147.917 144.699 L
148.002 144.483 L
148.091 144.698 L
148.172 144.643 L
148.265 144.625 L
148.346 144.742 L
148.435 144.65 L
148.533 144.56 L
148.609 144.498 L
148.706 144.51 L
148.796 144.558 L
148.889 144.546 L
148.982 144.643 L
149.076 144.574 L
149.165 144.417 L
149.262 144.464 L
149.356 144.598 L
149.449 144.645 L
149.546 144.77 L
149.631 144.798 L
149.729 144.908 L
149.831 145.063 L
149.928 144.999 L
150.026 144.952 L
150.123 145.02 L
150.225 145.065 L
150.323 145.129 L
150.425 145.286 L
150.522 145.319 L
150.628 145.148 L
150.743 145.102 L
150.828 145.004 L
150.938 144.973 L
151.04 145.066 L
151.15 145.057 L
151.26 145.115 L
151.349 145.174 L
151.451 145.291 L
151.561 145.401 L
151.668 145.528 L
151.778 145.635 L
151.888 145.286 L
151.994 145.42 L
152.113 145.601 L
152.227 145.753 L
152.342 145.942 L
152.444 146.004 L
152.558 146.039 L
152.669 146.142 L
152.792 146.045 L
152.902 146.128 L
153.021 146.007 L
153.148 146.138 L
153.258 146.148 L
153.381 146.152 L
153.496 146.188 L
153.619 146.177 L
153.742 146.329 L
153.865 146.284 L
153.975 146.502 L
154.103 146.367 L
154.226 146.453 L
154.344 146.357 L
154.472 146.372 L
154.59 146.378 L
154.709 146.518 L
154.836 146.752 L
154.959 146.687 L
155.087 146.821 L
155.222 146.845 L
155.35 146.98 L
155.469 147.126 L
155.596 147.15 L
155.736 147.192 L
155.863 147.249 L
155.999 147.231 L
156.126 147.197 L
156.262 147.128 L
156.406 146.984 L
156.516 146.859 L
156.652 146.805 L
156.788 146.693 L
156.932 146.544 L
157.059 146.486 L
157.195 146.477 L
157.339 146.481 L
157.484 146.471 L
157.619 146.48 L
157.755 146.648 L
157.887 146.654 L
158.027 146.762 L
158.171 146.777 L
158.315 147.003 L
158.455 147.002 L
158.604 147.203 L
158.739 147.261 L
158.892 147.214 L
159.036 147.141 L
159.172 147.159 L
159.333 146.988 L
159.469 146.86 L
159.613 146.773 L
160.22 146.751 L
160.372 146.675 L
160.504 146.717 L
160.657 146.689 L
160.809 146.759 L
160.962 146.706 L
161.119 146.584 L
161.268 146.688 L
161.429 146.747 L
161.577 146.687 L
161.726 146.549 L
161.878 146.47 L
162.048 146.33 L
162.205 145.981 L
162.345 145.805 L
162.506 145.55 L
162.663 145.547 L
162.824 145.521 L
162.969 145.532 L
163.134 145.589 L
163.304 145.756 L
163.465 145.974 L
163.614 146.084 L
163.779 146.205 L
163.94 146.501 L
164.11 146.462 L
164.267 146.558 L
164.445 146.689 L
164.602 146.618 L
164.763 146.499 L
164.92 146.459 L
165.094 146.672 L
165.268 146.581 L
165.425 146.733 L
165.599 146.942 L
165.764 147.076 L
165.921 146.865 L
166.095 146.82 L
166.265 146.717 L
166.435 146.843 L
166.6 146.844 L
166.782 147.094 L
166.961 146.838 L
167.045 147.924 L
167.215 147.918 L
167.402 148.008 L
167.58 148.043 L
167.771 148.034 L
167.936 147.811 L
168.123 147.692 L
168.301 147.526 L
168.471 147.472 L
168.662 147.278 L
168.836 147.15 L
169.014 147.103 L
169.205 147.27 L
169.383 147.173 L
169.557 147.236 L
169.748 147.183 L
169.934 147.261 L
170.125 146.968 L
170.295 146.88 L
170.486 146.779 L
170.668 146.639 L
170.859 146.485 L
171.05 146.555 L
171.241 146.916 L
171.428 147.233 L
171.614 147.582 L
171.805 147.816 L
172.009 148.069 L
172.204 148.254 L
172.386 148.398 L
172.582 148.085 L
172.772 148.005 L
172.959 147.955 L
173.167 148.004 L
173.362 147.893 L
173.553 147.773 L
173.744 147.618 L
173.943 147.574 L
174.151 147.485 L
174.338 147.189 L
174.541 147.216 L
174.745 146.795 L
174.936 147.063 L
175.14 147.122 L
175.326 147.259 L
175.538 147.283 L
175.742 147.39 L
175.954 147.446 L
176.166 147.309 L
176.37 146.986 L
176.578 146.721 L
176.769 146.556 L
176.981 147.146 L
177.201 147.876 L
177.392 148.716 L
177.596 148.503 L
177.816 149.01 L
178.028 148.765 L
178.228 148.415 L
178.448 146.226 L
178.652 147.759 L
178.864 146.983 L
179.089 149.04 L
179.288 149.035 L
179.513 149.328 L
179.717 149.78 L
179.933 149.717 L
180.154 150.258 L
180.366 150.423 L
180.582 150.377 L
180.803 150.63 L
181.019 150.97 L
181.248 150.893 L
181.46 150.579 L
181.681 150.463 L
181.902 150.228 L
182.114 150.352 L
182.343 150.376 L
182.568 150.519 L
182.792 150.67 L
183.013 150.733 L
183.229 150.956 L
183.458 150.847 L
183.683 150.698 L
183.895 150.402 L
184.124 150.375 L
184.354 150.095 L
184.583 150.061 L
184.816 149.99 L
185.041 149.763 L
185.274 149.893 L
185.507 150.116 L
185.728 150.048 L
185.961 149.871 L
186.199 149.779 L
186.432 149.631 L
186.67 149.549 L
186.912 149.488 L
187.128 149.613 L
187.366 149.367 L
187.603 149.307 L
187.832 149.348 L
188.074 149.372 L
188.299 149.218 L
188.545 149.135 L
188.782 149.137 L
189.024 149.04 L
189.27 149.121 L
189.504 149.084 L
189.745 149.849 L
189.987 150.418 L
190.237 150.598 L
190.471 152.061 L
190.717 152.948 L
190.971 152.129 L
191.209 152.133 L
191.468 150.814 L
191.684 151.276 L
191.934 151.354 L
192.189 150.465 L
192.422 150.834 L
192.689 149.44 L
192.931 149.225 L
193.177 148.32 L
193.725 148.421 L
193.971 147.161 L
194.225 147.424 L
194.458 147.183 L
194.713 147.399 L
194.972 147.642 L
195.214 147.622 L
195.477 147.783 L
195.735 147.965 L
195.986 148.399 L
196.257 148.465 L
196.49 148.39 L
196.745 148.343 L
197.008 148.066 L
197.275 147.979 L
197.538 147.746 L
197.793 147.272 L
198.056 147.217 L
198.319 147.388 L
198.586 147.536 L
198.858 147.773 L
199.116 148.188 L
199.362 148.487 L
199.651 148.743 L
199.884 149.245 L
200.164 149.747 L
200.44 149.922 L
200.699 150.29 L
200.945 150.301 L
201.229 150.312 L
201.755 150.586 L
202.018 151.161 L
202.298 151.34 L
202.561 151.661 L
202.824 151.927 L
203.096 152.5 L
203.359 152.937 L
203.63 153.288 L
203.906 154.831 L
204.199 155.896 L
204.466 157.451 L
204.733 158.547 L
204.996 157.139 L
205.276 156.664 L
205.569 155.828 L
205.832 155.279 L
206.103 155.546 L
206.387 156.097 L
206.672 159.713 L
206.943 159.452 L
207.227 157.019 L
207.516 157.979 L
207.783 156.883 L
207.978 158.482 L
208.263 159.617 L
208.547 158.927 L
208.814 158.688 L
209.119 158.154 L
209.387 157.238 L
209.671 156.737 L
209.959 155.471 L
210.261 156.397 L
210.541 153.838 L
210.833 154.229 L
211.113 152.741 L
211.385 151.61 L
211.694 153.094 L
211.987 152.551 L
212.259 156.047 L
212.568 157.786 L
212.844 159.335 L
213.141 162.5 L
213.595 161.302 L
213.879 160.615 L
214.159 159.016 L
214.46 157.903 L
214.753 158.909 L
215.042 154.455 L
215.347 150.109 L
215.652 151.567 L
215.962 154.971 L
216.242 158.079 L
216.552 154.567 L
216.844 157.16 L
217.137 165.935 L
217.443 162.316 L
217.748 164.524 L
218.049 163.492 L
218.359 157.17 L
218.664 163.29 L
218.97 162.844 L
219.28 162.517 L
219.559 162.294 L
219.852 162.925 L
220.17 162.126 L
220.472 162.496 L
220.79 161.152 L
221.087 161.264 L
221.405 161.607 L
222.092 161.817 L
222.402 161.077 L
222.72 160.504 L
223.025 157.624 L
223.339 155.851 L
223.645 153.374 L
223.959 155.204 L
224.281 155.508 L
224.591 155.476 L
224.892 156.133 L
225.206 156.169 L
225.528 155.735 L
225.851 155.756 L
226.156 155.765 L
226.495 155.765 L
226.809 156.459 L
227.106 156.621 L
227.429 156.779 L
227.743 156.917 L
228.065 156.534 L
228.392 156.458 L
228.723 156.408 L
229.032 156.5 L
229.372 156.457 L
229.677 155.933 L
230.008 156.11 L
230.322 155.444 L
230.661 155.972 L
230.954 157.784 L
231.293 158.986 L
231.62 158.881 L
231.951 159.894 L
232.273 159.224 L
232.613 158.955 L
232.935 158.979 L
233.079 159.189 L
233.398 159.854 L
233.716 162.501 L
234.055 160.23 L
234.403 162.222 L
234.725 161.783 L
235.048 160.907 L
235.387 161.127 L
235.731 161.397 L
236.053 161.143 L
236.376 161.033 L
236.736 160.788 L
237.067 160.312 L
237.411 160.632 L
237.746 161.286 L
238.068 161.559 L
238.391 162.793 L
238.73 162.282 L
239.069 160.288 L
239.409 159.882 L
239.765 159.15 L
240.096 158.908 L
240.435 160.362 L
240.775 160.363 L
241.114 159.742 L
241.483 159.062 L
241.814 158.3 L
242.162 157.758 L
242.501 157.857 L
242.862 158.302 L
243.362 158.859 L
243.693 158.527 L
244.062 158.114 L
244.414 158.184 L
244.754 158.905 L
245.097 159.11 L
245.441 161.598 L
245.78 161.001 L
246.145 160.991 L
246.493 159.197 L
246.841 160.047 L
247.206 162.374 L
247.545 161.903 L
247.914 159.748 L
248.258 159.251 L
248.627 159.989 L
248.979 159.589 L
249.348 160.927 L
249.692 161.142 L
250.065 161.208 L
250.409 161.604 L
250.761 161.86 L
251.104 162.396 L
251.473 162.997 L
251.821 162.884 L
252.195 162.676 L
252.564 162.344 L
252.907 162.608 L
253.293 163.018 L
253.628 163.091 L
254.015 162.615 L
254.388 162.739 L
254.74 162.788 L
255.109 161.43 L
255.487 161.076 L
255.839 159.184 L
256.22 159.003 L
256.577 160.101 L
256.959 160.648 L
257.311 160.204 L
257.688 159.832 L
258.045 158.926 L
258.431 158.202 L
258.804 158.548 L
259.182 159.437 L
259.521 159.136 L
259.89 157.939 L
260.268 158.112 L
260.637 158.214 L
261.023 158.51 L
261.4 157.942 L
261.773 156.605 L
262.155 155.799 L
262.537 155.23 L
262.898 156.355 L
263.458 155.816 L
263.835 155.652 L
264.217 155.384 L
264.599 155.078 L
264.981 155.184 L
265.362 155.673 L
265.748 155.906 L
266.134 156.051 L
266.504 155.975 L
266.881 156.055 L
267.276 157.013 L
267.653 157.697 L
268.031 157.914 L
268.408 157.844 L
268.794 157.914 L
269.189 157.532 L
269.571 157.609 L
269.961 157.448 L
270.347 157.536 L
270.75 157.728 L
271.14 157.529 L
271.531 157.573 L
271.921 157.538 L
272.298 157.217 L
272.667 157.394 L
273.066 157.027 L
273.465 156.958 L
273.868 156.782 L
274.267 157.289 L
274.657 158.336 L
275.043 157.964 L
275.442 157.816 L
275.841 157.313 L
276.235 156.447 L
276.63 156.541 L
277.037 155.849 L
277.436 155.576 L
277.843 154.926 L
278.242 155.436 L
278.623 156.098 L
279.026 154.971 L
279.408 155.075 L
279.816 153.452 L
280.223 154.735 L
280.643 155.103 L
281.025 156.337 L
281.432 157.811 L
281.843 159.647 L
282.615 158.677 L
283.023 156.231 L
283.434 154.716 L
283.85 153.949 L
284.244 152.791 L
284.622 152.589 L
285.042 152.691 L
285.466 152.537 L
285.882 155.634 L
286.293 154.461 L
286.718 156.269 L
287.116 156.775 L
287.507 156.975 L
287.922 154.309 L
288.338 156.164 L
288.656 159.987 L
289.072 158.617 L
289.483 157.422 L
289.908 157.737 L
290.332 157.696 L
290.76 157.642 L
291.172 157.372 L
291.583 156.686 L
291.986 156.965 L
292.419 156.885 L
292.843 157.151 L
293.255 156.735 L
293.692 156.8 L
294.116 156.443 L
294.523 156.572 L
294.96 156.417 L
295.376 156.425 L
295.796 156.561 L
296.229 156.653 L
296.627 156.824 L
297.052 156.646 L
297.488 157.088 L
297.917 157.078 L
298.345 156.978 L
298.782 156.36 L
299.202 156.504 L
299.66 157.198 L
300.068 157.464 L
300.522 157.615 L
300.92 157.291 L
301.37 157.506 L
301.786 157.689 L
302.227 157.69 L
302.672 157.756 L
303.101 157.031 L
303.529 158.349 L
303.992 157.988 L
304.416 157.794 L
304.844 155.976 L
305.273 156.756 L
305.731 156.522 L
306.52 154.544 L
306.953 151.255 L
307.407 150.696 L
307.865 151.827 L
308.285 153.2 L
308.718 154.06 L
309.171 154.519 L
309.63 154.803 L
310.058 155.37 L
310.512 156.727 L
310.94 157.448 L
311.399 157.955 L
311.823 158.385 L
312.285 158.319 L
312.739 157.85 L
313.163 157.634 L
313.617 159.309 L
314.08 160.157 L
314.529 159.351 L
314.962 160.451 L
315.518 163.678 L
315.976 165.752 L
316.43 166.547 L
316.863 164.753 L
317.316 162.586 L
317.779 163.811 L
318.233 164.396 L
318.687 165.772 L
319.145 165.338 L
319.599 167.861 L
320.07 167.907 L
320.528 170.539 L
320.986 169.101 L
321.427 170.096 L
321.885 168.316 L
322.352 168.849 L
322.785 168.623 L
323.256 168.476 L
323.718 168.11 L
324.193 168.413 L
324.812 168.349 L
325.279 168.027 L
325.729 168.203 L
326.2 168.187 L
326.637 168.258 L
327.112 168.108 L
327.587 167.627 L
328.032 167.506 L
328.503 167.523 L
328.987 167.707 L
329.449 168.288 L
329.907 168.486 L
330.37 168.538 L
330.849 168.001 L
331.333 167.19 L
331.808 166.424 L
332.24 166.236 L
332.72 166.404 L
333.203 166.542 L
333.679 166.834 L
334.162 166.984 L
334.646 166.864 L
335.062 167.386 L
335.401 167.778 L
335.889 168.359 L
336.372 168.174 L
336.818 168.397 L
337.306 168.428 L
337.806 168.517 L
338.264 168.223 L
338.727 168.668 L
339.223 169.07 L
339.719 169.769 L
340.203 169.909 L
340.657 170.513 L
341.128 171.266 L
341.633 171.941 L
342.112 172.636 L
342.608 174.629 L
343.037 176.3 L
343.537 177.16 L
344.025 177.961 L
344.522 179.802 L
345.014 181.55 L
345.472 179.128 L
346.21 182.52 L
346.689 184.259 L
347.164 185.911 L
347.678 180.244 L
348.153 179.693 L
348.632 186.826 L
349.103 193.96 L
349.604 201.093 L
350.096 207.7 L
350.567 212.331 L
351.055 219.465 L
351.576 226.598 L
352.047 233.731 L
352.505 240.865 L
353.014 247.998 L
353.49 240.865 L
353.973 247.998 L
354.491 255.131 L
354.97 248.824 L
355.454 253.991 L
355.959 257.909 L
356.434 265.042 L
356.951 272.176 L
357.354 279.309 L
357.791 277.743 L
358.304 284.877 L
358.784 292.01 L
359.301 299.143 L
359.781 304.522 L
360.264 311.655 L
360.786 305.65 L
361.266 311.945 L
361.719 319.079 L
362.233 318.679 L
362.721 323.392 L
363.217 330.525 L
363.734 336.644 L
364.193 336.698 L
364.969 341.774 L
365.444 341.591 L
365.966 341.432 L
366.441 348.565 L
366.92 354.993 L
367.442 347.859 L
367.917 354.993 L
368.435 355.778 L
368.914 355.891 L
369.389 363.024 L
369.903 359.07 L
370.357 362.051 L
370.806 354.918 L
371.341 347.785 L
371.803 344.825 L
372.308 350.647 L
372.792 348.866 L
373.309 350.486 L
373.771 355.181 L
374.251 362.314 L
374.768 363.917 L
375.244 371.051 L
375.727 372.474 L
376.245 379.607 L
376.728 385.725 L
377.182 380.956 L
377.704 373.822 L
378.23 366.689 L
378.68 373.822 L
379.163 374.186 L
379.677 381.319 L
380.169 388.452 L
380.665 381.319 L
381.132 388.452 L
381.628 395.586 L
382.12 402.719 L
382.616 408.514 L
383.113 408.744 L
383.592 410.101 L
384.097 410.732 L
384.924 410.792 L
385.442 410.461 L
385.921 410.457 L
386.405 410.11 L
386.884 410.322 L
387.355 409.754 L
387.851 408.956 L
388.365 408.886 L
388.84 409.356 L
389.319 409.276 L
389.807 409.937 L
390.286 410.476 L
390.808 411.284 L
391.266 411.825 L
391.805 411.995 L
392.263 412.678 L
392.747 412.2 L
393.252 411.759 L
393.727 411.339 L
394.24 411.104 L
394.724 410.783 L
395.203 410.461 L
395.716 409.664 L
396.149 409.711 L
396.667 409.685 L
397.15 410.072 L
397.642 411.11 L
398.151 412.063 L
398.635 412.22 L
399.136 411.877 L
399.441 411.451 L
399.882 411.923 L
400.378 412.914 L
400.875 413.127 L
401.358 413.374 L
401.872 413.838 L
402.351 414.715 L
402.852 414.436 L
403.327 414.672 L
403.823 414.544 L
404.324 414.53 L
404.803 414.372 L
405.707 414.786 L
406.211 414.337 L
406.674 414.209 L
407.174 413.646 L
407.641 413.589 L
408.137 412.945 L
408.63 413.167 L
409.113 412.542 L
409.593 412.331 L
410.097 412.185 L
410.577 412.246 L
411.073 411.595 L
411.565 411.731 L
412.061 412.006 L
412.549 411.764 L
413.024 411.899 L
413.508 411.601 L
413.992 411.384 L
414.458 411.118 L
414.972 410.701 L
415.459 411.014 L
415.947 410.827 L
416.444 409.808 L
416.876 409.716 L
417.415 409.281 L
417.848 409.091 L
418.331 408.911 L
418.832 409.265 L
419.328 409.533 L
419.808 409.593 L
420.279 409.583 L
420.779 409.445 L
421.267 409.276 L
421.746 409.059 L
422.23 409.049 L
422.714 408.867 L
423.197 408.183 L
423.689 407.847 L
424.19 407.241 L
424.648 406.692 L
425.586 406.571 L
426.044 407.129 L
426.519 407.679 L
427.032 406.877 L
427.512 406.306 L
427.995 405.868 L
428.508 405.795 L
428.967 405.867 L
429.476 406.781 L
429.964 407.375 L
430.451 407.31 L
430.943 406.388 L
431.41 405.474 L
431.868 404.008 L
432.369 405.025 L
432.84 406.497 L
433.345 405.803 L
433.845 404.534 L
434.337 404.514 L
434.829 404.755 L
435.262 406.224 L
435.754 406.594 L
436.246 406.56 L
436.738 406.953 L
437.239 407.103 L
437.718 406.809 L
438.227 407.025 L
438.707 407.264 L
439.186 408.295 L
439.665 408.084 L
440.136 407.79 L
440.616 407.44 L
441.125 407.835 L
441.617 407.452 L
442.109 407.333 L
442.567 407.165 L
443.059 407.394 L
443.568 407.087 L
444.022 407.09 L
444.557 407.484 L
445.019 406.695 L
445.486 406.464 L
446.02 406.849 L
446.478 406.308 L
446.932 405.615 L
447.446 404.928 L
447.929 405.294 L
448.68 404.925 L
449.159 404.742 L
449.668 404.007 L
450.144 403.878 L
450.627 403.857 L
451.111 403.87 L
451.607 402.209 L
452.074 401.875 L
452.566 401.48 L
453.033 401.601 L
453.537 400.766 L
454.029 399.435 L
454.534 399.131 L
455.001 398.836 L
455.493 398.284 L
455.968 398.459 L
456.46 398.11 L
456.923 398.705 L
457.249 399.092 L
457.72 398.851 L
458.199 398.13 L
458.683 398.479 L
459.196 398.279 L
459.646 398.265 L
460.155 398.11 L
460.635 397.591 L
461.114 397.821 L
461.614 397.529 L
462.115 397.86 L
462.573 398.122 L
463.078 397.572 L
463.57 397.556 L
464.041 397.979 L
464.542 398.331 L
465.042 398.078 L
466.226 398.45 L
466.718 398.852 L
467.206 399.709 L
467.681 399.802 L
468.186 400.492 L
468.652 400.029 L
469.144 399.82 L
469.607 398.964 L
470.116 399.342 L
470.608 399.325 L
471.083 399.73 L
471.562 399.817 L
472.067 399.91 L
472.542 399.724 L
473.026 399.425 L
473.539 399.472 L
473.993 399.091 L
474.477 398.715 L
474.977 398.322 L
475.461 398.95 L
475.974 399.199 L
476.458 399.808 L
476.937 399.749 L
477.421 399.243 L
477.892 399.141 L
478.38 399.444 L
478.855 399.186 L
479.368 398.483 L
479.839 399.33 L
480.318 399.12 L
480.832 399.661 L
481.315 399.062 L
481.782 398.459 L
482.274 398 L
482.749 397.586 L
483.063 397.03 L
483.572 397.416 L
484.056 396.818 L
484.535 396.649 L
485.019 396.685 L
485.523 396.762 L
485.973 397.038 L
486.491 397.752 L
486.966 398.972 L
487.462 399.372 L
487.92 400.734 L
488.434 399.806 L
488.909 399.39 L
489.414 398.595 L
489.884 398.521 L
490.334 399.327 L
490.796 398.981 L
491.284 399.116 L
491.785 399.392 L
492.256 399.164 L
492.756 398.554 L
493.253 398.117 L
493.745 397.892 L
494.203 397.613 L
494.708 397.845 L
495.179 398.214 L
495.645 397.862 L
496.154 397.376 L
496.638 396.481 L
497.139 396.914 L
497.631 397.59 L
498.102 397.751 L
498.903 397.859 L
499.408 398.224 L
499.892 399.265 L
500.371 398.798 L
500.846 398.557 L
501.321 398.39 L
501.843 398.44 L
502.323 398.289 L
502.806 398.975 L
503.285 398.838 L
503.761 398.82 L
504.257 398.499 L
504.749 398.209 L
505.245 398.042 L
505.733 397.915 L
506.726 397.047 L
507.197 396.485 L
507.676 396.757 L
508.172 397.564 L
508.66 397.705 L
509.161 397.906 L
509.64 397.917 L
510.137 398.157 L
510.603 397.36 L
511.083 397.624 L
511.566 397.762 L
512.054 398.157 L
512.546 398.782 L
512.847 398.337 L
513.301 398.261 L
513.798 397.856 L
514.285 397.577 L
514.778 397.257 L
515.27 397.459 L
515.762 397.417 L
516.25 397.325 L
516.737 398.002 L
517.238 398.76 L
517.696 398.824 L
518.528 398.205 L
519.02 398.265 L
519.512 398.342 L
520.004 397.885 L
520.496 397.005 L
520.992 397.36 L
521.48 397.466 L
521.913 397.461 L
522.401 397.841 L
522.897 397.297 L
523.389 397.051 L
523.881 396.035 L
524.373 395.948 L
524.87 396.002 L
525.358 396.607 L
525.79 396.814 L
526.287 397.454 L
526.774 397.455 L
527.275 397.545 L
527.763 397.275 L
528.374 397.664 L
528.87 397.87 L
529.303 398.071 L
529.795 398.19 L
530.287 398.55 L
530.805 398.457 L
531.271 398.923 L
531.755 398.59 L
532.264 398.333 L
532.752 398.376 L
533.223 398.993 L
533.698 397.778 L
534.181 397.221 L
534.656 396.301 L
535.14 396.878 L
535.653 397.269 L
536.124 397.128 L
536.608 397.342 L
537.1 397.188 L
537.592 396.727 L
538.05 396.381 L
538.542 396.933 L
539.051 397.122 L
539.505 397.212 L
540.019 397.906 L
540.519 398.177 L
540.659 399.017 L
541.13 399.679 L
541.665 400.328 L
542.102 400.911 L
542.581 400.145 L
543.09 399.491 L
543.578 399.492 L
544.057 399.53 L
544.541 399.679 L
545.05 399.562 L
545.525 399.882 L
545.979 399.542 L
546.611 398.905 L
546.967 398.504 L
547.451 397.953 L
547.956 398.394 L
548.427 398.749 L
548.91 399.754 L
549.385 400.532 L
550.327 400.503 L
550.789 400.416 L
551.307 399.686 L
551.786 399.011 L
552.262 398.544 L
552.737 398.312 L
553.246 398.082 L
553.712 398.172 L
554.175 397.99 L
554.705 398.117 L
555.18 398.37 L
555.638 398.348 L
556.139 398.63 L
556.639 398.67 L
557.115 399.044 L
557.585 399.146 L
558.095 399.795 L
558.578 400.121 L
559.049 399.857 L
559.533 399.152 L
560.165 398.402 L
560.636 398.383 L
561.123 397.879 L
561.611 397.383 L
562.103 398.084 L
562.596 397.807 L
563.062 398.273 L
563.558 398.188 L
564.025 398.797 L
564.513 398.337 L
565.005 397.994 L
565.501 397.781 L
566.002 397.994 L
566.49 397.536 L
566.978 397.77 L
567.894 398.082 L
568.356 397.614 L
568.853 396.667 L
569.341 396.622 L
569.833 397.065 L
570.316 397.62 L
570.8 398.236 L
571.296 399.06 L
571.763 399.492 L
572.217 399.093 L
572.717 399.858 L
573.201 399.05 L
573.689 398.574 L
574.177 398.016 L
574.682 397.482 L
575.169 396.493 L
575.67 397.616 L
576.12 399.464 L
576.603 400.529 L
577.095 400.233 L
577.587 399.752 L
578.084 398.693 L
578.572 398.738 L
579.064 398.738 L
579.488 399.141 L
579.988 399.498 L
580.481 398.832 L
580.964 398.551 L
581.461 398.444 L
581.948 398.358 L
582.44 398.502 L
582.899 399.046 L
583.391 399.085 L
583.883 398.852 L
584.375 399.227 L
584.833 399.25 L
585.325 399.23 L
585.821 398.954 L
586.288 398.667 L
587.764 398.518 L
588.265 398.874 L
588.753 398.665 L
589.186 399.34 L
589.682 398.309 L
590.174 398.049 L
590.662 399.629 L
591.154 400.353 L
591.646 401.463 L
592.113 401.571 L
592.609 400.8 L
593.088 399.561 L
593.585 398.434 L
594.073 397.948 L
594.552 398.374 L
595.014 398.341 L
595.489 399.094 L
596.011 399.254 L
596.457 399.421 L
596.953 399.895 L
597.462 400.316 L
597.933 400.213 L
598.4 400.701 L
598.883 400.758 L
599.384 401.235 L
599.863 400.944 L
600.368 400.879 L
600.843 400.401 L
601.123 399.248 L
601.632 399.314 L
S
GR
GS
[0.6 0 0 0.6 0 0] CT
1 GC
N
621 98 M
621 52 L
445 52 L
445 98 L
cp
f
GR
GS
[0.6 0 0 0.6 302.30013 38.76164] CT
/Helvetica 15 F
GS
[1 0 0 1 0 0] CT
0 6 moveto 
1 -1 scale
(Simulovan\341 data) t 
GR
GR
GS
[0.6 0 0 0.6 0 0] CT
0 0.447 0.741 RC
1 LJ
3.333 LW
N
450.007 64.603 M
500.078 64.603 L
S
GR
GS
[0.6 0 0 0.6 302.30013 51.23836] CT
N
1.141 6 M
1.141 -4.734 L
2.594 -4.734 L
8.234 3.688 L
8.234 -4.734 L
9.609 -4.734 L
9.609 6 L
8.141 6 L
2.5 -2.438 L
2.5 6 L
1.141 6 L
cp
16.895 5.047 M
16.161 5.656 15.489 5.914 QT
14.817 6.172 14.036 6.172 QT
12.754 6.172 12.067 5.547 QT
11.379 4.922 11.379 3.953 QT
11.379 3.375 11.637 2.906 QT
11.895 2.438 12.317 2.148 QT
12.739 1.859 13.27 1.719 QT
13.645 1.609 14.442 1.516 QT
16.036 1.328 16.786 1.063 QT
16.801 0.797 16.801 0.719 QT
16.801 -0.094 16.426 -0.422 QT
15.911 -0.859 14.926 -0.859 QT
13.989 -0.859 13.543 -0.539 QT
13.098 -0.219 12.895 0.609 QT
11.598 0.438 L
11.77 -0.391 12.176 -0.898 QT
12.583 -1.406 13.348 -1.68 QT
14.114 -1.953 15.114 -1.953 QT
16.114 -1.953 16.731 -1.719 QT
17.348 -1.484 17.645 -1.133 QT
17.942 -0.781 18.051 -0.234 QT
18.114 0.109 18.114 0.984 QT
18.114 2.734 L
18.114 4.578 18.2 5.063 QT
18.286 5.547 18.536 6 QT
17.161 6 L
16.958 5.594 16.895 5.047 QT
cp
16.786 2.094 M
16.067 2.391 14.629 2.594 QT
13.817 2.719 13.481 2.859 QT
13.145 3 12.965 3.281 QT
12.786 3.563 12.786 3.906 QT
12.786 4.438 13.184 4.789 QT
13.583 5.141 14.348 5.141 QT
15.114 5.141 15.708 4.805 QT
16.301 4.469 16.583 3.891 QT
16.786 3.453 16.786 2.578 QT
16.786 2.094 L
cp
20.159 6 M
20.159 -1.781 L
21.347 -1.781 L
21.347 -0.688 L
21.706 -1.266 22.315 -1.609 QT
22.925 -1.953 23.706 -1.953 QT
24.565 -1.953 25.12 -1.594 QT
25.675 -1.234 25.894 -0.594 QT
26.815 -1.953 28.3 -1.953 QT
29.456 -1.953 30.081 -1.313 QT
30.706 -0.672 30.706 0.656 QT
30.706 6 L
29.394 6 L
29.394 1.094 L
29.394 0.313 29.269 -0.039 QT
29.144 -0.391 28.8 -0.602 QT
28.456 -0.813 28.003 -0.813 QT
27.19 -0.813 26.644 -0.266 QT
26.097 0.281 26.097 1.484 QT
26.097 6 L
24.784 6 L
24.784 0.953 L
24.784 0.063 24.464 -0.375 QT
24.144 -0.813 23.409 -0.813 QT
22.847 -0.813 22.378 -0.516 QT
21.909 -0.219 21.698 0.344 QT
21.487 0.906 21.487 1.969 QT
21.487 6 L
20.159 6 L
cp
37.982 3.5 M
39.342 3.656 L
39.029 4.859 38.154 5.516 QT
37.279 6.172 35.92 6.172 QT
34.217 6.172 33.217 5.125 QT
32.217 4.078 32.217 2.172 QT
32.217 0.219 33.232 -0.867 QT
34.248 -1.953 35.857 -1.953 QT
37.42 -1.953 38.404 -0.891 QT
39.389 0.172 39.389 2.094 QT
39.389 2.219 39.389 2.453 QT
33.576 2.453 L
33.654 3.734 34.303 4.414 QT
34.951 5.094 35.936 5.094 QT
36.654 5.094 37.17 4.711 QT
37.686 4.328 37.982 3.5 QT
cp
33.654 1.359 M
37.998 1.359 L
37.904 0.375 37.498 -0.109 QT
36.873 -0.875 35.873 -0.875 QT
34.951 -0.875 34.334 -0.266 QT
33.717 0.344 33.654 1.359 QT
cp
35.67 -3.797 M
36.482 -5.047 L
37.967 -5.047 L
36.326 -3 L
34.92 -3 L
33.342 -5.047 L
34.842 -5.047 L
35.67 -3.797 L
cp
40.981 6 M
40.981 -1.781 L
42.168 -1.781 L
42.168 -0.594 L
42.622 -1.422 43.012 -1.688 QT
43.403 -1.953 43.856 -1.953 QT
44.528 -1.953 45.215 -1.531 QT
44.762 -0.313 L
44.278 -0.594 43.793 -0.594 QT
43.356 -0.594 43.012 -0.336 QT
42.668 -0.078 42.528 0.391 QT
42.309 1.094 42.309 1.922 QT
42.309 6 L
40.981 6 L
cp
43.012 -3.797 M
43.825 -5.047 L
45.309 -5.047 L
43.668 -3 L
42.262 -3 L
40.684 -5.047 L
42.184 -5.047 L
43.012 -3.797 L
cp
51.32 3.5 M
52.679 3.656 L
52.367 4.859 51.492 5.516 QT
50.617 6.172 49.257 6.172 QT
47.554 6.172 46.554 5.125 QT
45.554 4.078 45.554 2.172 QT
45.554 0.219 46.57 -0.867 QT
47.585 -1.953 49.195 -1.953 QT
50.757 -1.953 51.742 -0.891 QT
52.726 0.172 52.726 2.094 QT
52.726 2.219 52.726 2.453 QT
46.914 2.453 L
46.992 3.734 47.64 4.414 QT
48.289 5.094 49.273 5.094 QT
49.992 5.094 50.507 4.711 QT
51.023 4.328 51.32 3.5 QT
cp
46.992 1.359 M
51.335 1.359 L
51.242 0.375 50.835 -0.109 QT
50.21 -0.875 49.21 -0.875 QT
48.289 -0.875 47.671 -0.266 QT
47.054 0.344 46.992 1.359 QT
cp
54.334 6 M
54.334 -1.781 L
55.521 -1.781 L
55.521 -0.672 L
56.381 -1.953 58.006 -1.953 QT
58.709 -1.953 59.295 -1.703 QT
59.881 -1.453 60.178 -1.039 QT
60.475 -0.625 60.584 -0.063 QT
60.662 0.297 60.662 1.219 QT
60.662 6 L
59.334 6 L
59.334 1.266 L
59.334 0.469 59.186 0.07 QT
59.037 -0.328 58.646 -0.57 QT
58.256 -0.813 57.725 -0.813 QT
56.881 -0.813 56.271 -0.281 QT
55.662 0.25 55.662 1.75 QT
55.662 6 L
54.334 6 L
cp
67.754 5.047 M
67.02 5.656 66.348 5.914 QT
65.676 6.172 64.895 6.172 QT
63.614 6.172 62.926 5.547 QT
62.239 4.922 62.239 3.953 QT
62.239 3.375 62.497 2.906 QT
62.754 2.438 63.176 2.148 QT
63.598 1.859 64.129 1.719 QT
64.504 1.609 65.301 1.516 QT
66.895 1.328 67.645 1.063 QT
67.661 0.797 67.661 0.719 QT
67.661 -0.094 67.286 -0.422 QT
66.77 -0.859 65.786 -0.859 QT
64.848 -0.859 64.403 -0.539 QT
63.958 -0.219 63.754 0.609 QT
62.458 0.438 L
62.629 -0.391 63.036 -0.898 QT
63.442 -1.406 64.208 -1.68 QT
64.973 -1.953 65.973 -1.953 QT
66.973 -1.953 67.59 -1.719 QT
68.208 -1.484 68.504 -1.133 QT
68.801 -0.781 68.911 -0.234 QT
68.973 0.109 68.973 0.984 QT
68.973 2.734 L
68.973 4.578 69.059 5.063 QT
69.145 5.547 69.395 6 QT
68.02 6 L
67.817 5.594 67.754 5.047 QT
cp
67.645 2.094 M
66.926 2.391 65.489 2.594 QT
64.676 2.719 64.34 2.859 QT
64.004 3 63.825 3.281 QT
63.645 3.563 63.645 3.906 QT
63.645 4.438 64.043 4.789 QT
64.442 5.141 65.208 5.141 QT
65.973 5.141 66.567 4.805 QT
67.161 4.469 67.442 3.891 QT
67.645 3.453 67.645 2.578 QT
67.645 2.094 L
cp
64.598 -3 M
65.567 -5.047 L
67.301 -5.047 L
65.692 -3 L
64.598 -3 L
cp
80.233 6 M
80.233 5.016 L
79.499 6.172 78.061 6.172 QT
77.139 6.172 76.358 5.664 QT
75.577 5.156 75.147 4.234 QT
74.717 3.313 74.717 2.125 QT
74.717 0.953 75.108 0.008 QT
75.499 -0.938 76.272 -1.445 QT
77.045 -1.953 77.999 -1.953 QT
78.702 -1.953 79.256 -1.656 QT
79.811 -1.359 80.155 -0.891 QT
80.155 -4.734 L
81.467 -4.734 L
81.467 6 L
80.233 6 L
cp
76.077 2.125 M
76.077 3.609 76.702 4.352 QT
77.327 5.094 78.186 5.094 QT
79.045 5.094 79.655 4.383 QT
80.264 3.672 80.264 2.234 QT
80.264 0.625 79.647 -0.117 QT
79.03 -0.859 78.124 -0.859 QT
77.249 -0.859 76.663 -0.141 QT
76.077 0.578 76.077 2.125 QT
cp
88.606 5.047 M
87.872 5.656 87.2 5.914 QT
86.528 6.172 85.747 6.172 QT
84.466 6.172 83.778 5.547 QT
83.091 4.922 83.091 3.953 QT
83.091 3.375 83.349 2.906 QT
83.606 2.438 84.028 2.148 QT
84.45 1.859 84.981 1.719 QT
85.356 1.609 86.153 1.516 QT
87.747 1.328 88.497 1.063 QT
88.513 0.797 88.513 0.719 QT
88.513 -0.094 88.138 -0.422 QT
87.622 -0.859 86.638 -0.859 QT
85.7 -0.859 85.255 -0.539 QT
84.81 -0.219 84.606 0.609 QT
83.31 0.438 L
83.481 -0.391 83.888 -0.898 QT
84.294 -1.406 85.06 -1.68 QT
85.825 -1.953 86.825 -1.953 QT
87.825 -1.953 88.442 -1.719 QT
89.06 -1.484 89.356 -1.133 QT
89.653 -0.781 89.763 -0.234 QT
89.825 0.109 89.825 0.984 QT
89.825 2.734 L
89.825 4.578 89.911 5.063 QT
89.997 5.547 90.247 6 QT
88.872 6 L
88.669 5.594 88.606 5.047 QT
cp
88.497 2.094 M
87.778 2.391 86.341 2.594 QT
85.528 2.719 85.192 2.859 QT
84.856 3 84.677 3.281 QT
84.497 3.563 84.497 3.906 QT
84.497 4.438 84.896 4.789 QT
85.294 5.141 86.06 5.141 QT
86.825 5.141 87.419 4.805 QT
88.013 4.469 88.294 3.891 QT
88.497 3.453 88.497 2.578 QT
88.497 2.094 L
cp
94.761 4.828 M
94.949 5.984 L
94.386 6.109 93.949 6.109 QT
93.23 6.109 92.832 5.875 QT
92.433 5.641 92.277 5.273 QT
92.121 4.906 92.121 3.719 QT
92.121 -0.75 L
91.152 -0.75 L
91.152 -1.781 L
92.121 -1.781 L
92.121 -3.703 L
93.433 -4.5 L
93.433 -1.781 L
94.761 -1.781 L
94.761 -0.75 L
93.433 -0.75 L
93.433 3.797 L
93.433 4.359 93.503 4.523 QT
93.574 4.688 93.73 4.781 QT
93.886 4.875 94.167 4.875 QT
94.402 4.875 94.761 4.828 QT
cp
101.116 5.047 M
100.382 5.656 99.71 5.914 QT
99.038 6.172 98.257 6.172 QT
96.976 6.172 96.288 5.547 QT
95.601 4.922 95.601 3.953 QT
95.601 3.375 95.858 2.906 QT
96.116 2.438 96.538 2.148 QT
96.96 1.859 97.491 1.719 QT
97.866 1.609 98.663 1.516 QT
100.257 1.328 101.007 1.063 QT
101.022 0.797 101.022 0.719 QT
101.022 -0.094 100.647 -0.422 QT
100.132 -0.859 99.147 -0.859 QT
98.21 -0.859 97.765 -0.539 QT
97.319 -0.219 97.116 0.609 QT
95.819 0.438 L
95.991 -0.391 96.397 -0.898 QT
96.804 -1.406 97.569 -1.68 QT
98.335 -1.953 99.335 -1.953 QT
100.335 -1.953 100.952 -1.719 QT
101.569 -1.484 101.866 -1.133 QT
102.163 -0.781 102.272 -0.234 QT
102.335 0.109 102.335 0.984 QT
102.335 2.734 L
102.335 4.578 102.421 5.063 QT
102.507 5.547 102.757 6 QT
101.382 6 L
101.179 5.594 101.116 5.047 QT
cp
101.007 2.094 M
100.288 2.391 98.851 2.594 QT
98.038 2.719 97.702 2.859 QT
97.366 3 97.187 3.281 QT
97.007 3.563 97.007 3.906 QT
97.007 4.438 97.405 4.789 QT
97.804 5.141 98.569 5.141 QT
99.335 5.141 99.929 4.805 QT
100.522 4.469 100.804 3.891 QT
101.007 3.453 101.007 2.578 QT
101.007 2.094 L
cp
f
GR
GS
[0.6 0 0 0.6 0 0] CT
0.851 0.325 0.098 RC
1 LJ
3.333 LW
N
450.007 85.397 M
500.078 85.397 L
S
GR
GS
[0.6 0 0 0.6 0 0] CT
0.149 GC
10.0 ML
0.833 LW
N
445 98 M
445 52 L
621 52 L
621 98 L
cp
S
GR
%%Trailer
%%Pages: 1
%%EOF
