%!PS-Adobe-3.0 EPSF-3.0
%%Creator: (MATLAB, The Mathworks, Inc. Version 9.14.0.2206163 \(R2023a\). Operating System: Windows 10)
%%Title: C:/Users/radac/Desktop/Bachelor_thesis/thesis/Metody/fig/Luenberg/luenberg_profil_a_no_noise.eps
%%CreationDate: 2023-05-20T19:42:19
%%Pages: (atend)
%%BoundingBox:     0     0   420   315
%%LanguageLevel: 3
%%EndComments
%%BeginProlog
%%BeginResource: procset (Apache XML Graphics Std ProcSet) 1.2 0
%%Version: 1.2 0
%%Copyright: (Copyright 2001-2003,2010 The Apache Software Foundation. License terms: http://www.apache.org/licenses/LICENSE-2.0)
/bd{bind def}bind def
/ld{load def}bd
/GR/grestore ld
/GS/gsave ld
/RM/rmoveto ld
/C/curveto ld
/t/show ld
/L/lineto ld
/ML/setmiterlimit ld
/CT/concat ld
/f/fill ld
/N/newpath ld
/S/stroke ld
/CC/setcmykcolor ld
/A/ashow ld
/cp/closepath ld
/RC/setrgbcolor ld
/LJ/setlinejoin ld
/GC/setgray ld
/LW/setlinewidth ld
/M/moveto ld
/re {4 2 roll M
1 index 0 rlineto
0 exch rlineto
neg 0 rlineto
cp } bd
/_ctm matrix def
/_tm matrix def
/BT { _ctm currentmatrix pop matrix _tm copy pop 0 0 moveto } bd
/ET { _ctm setmatrix } bd
/iTm { _ctm setmatrix _tm concat } bd
/Tm { _tm astore pop iTm 0 0 moveto } bd
/ux 0.0 def
/uy 0.0 def
/F {
  /Tp exch def
  /Tf exch def
  Tf findfont Tp scalefont setfont
  /cf Tf def  /cs Tp def
} bd
/ULS {currentpoint /uy exch def /ux exch def} bd
/ULE {
  /Tcx currentpoint pop def
  gsave
  newpath
  cf findfont cs scalefont dup
  /FontMatrix get 0 get /Ts exch def /FontInfo get dup
  /UnderlinePosition get Ts mul /To exch def
  /UnderlineThickness get Ts mul /Tt exch def
  ux uy To add moveto  Tcx uy To add lineto
  Tt setlinewidth stroke
  grestore
} bd
/OLE {
  /Tcx currentpoint pop def
  gsave
  newpath
  cf findfont cs scalefont dup
  /FontMatrix get 0 get /Ts exch def /FontInfo get dup
  /UnderlinePosition get Ts mul /To exch def
  /UnderlineThickness get Ts mul /Tt exch def
  ux uy To add cs add moveto Tcx uy To add cs add lineto
  Tt setlinewidth stroke
  grestore
} bd
/SOE {
  /Tcx currentpoint pop def
  gsave
  newpath
  cf findfont cs scalefont dup
  /FontMatrix get 0 get /Ts exch def /FontInfo get dup
  /UnderlinePosition get Ts mul /To exch def
  /UnderlineThickness get Ts mul /Tt exch def
  ux uy To add cs 10 mul 26 idiv add moveto Tcx uy To add cs 10 mul 26 idiv add lineto
  Tt setlinewidth stroke
  grestore
} bd
/QT {
/Y22 exch store
/X22 exch store
/Y21 exch store
/X21 exch store
currentpoint
/Y21 load 2 mul add 3 div exch
/X21 load 2 mul add 3 div exch
/X21 load 2 mul /X22 load add 3 div
/Y21 load 2 mul /Y22 load add 3 div
/X22 load /Y22 load curveto
} bd
/SSPD {
dup length /d exch dict def
{
/v exch def
/k exch def
currentpagedevice k known {
/cpdv currentpagedevice k get def
v cpdv ne {
/upd false def
/nullv v type /nulltype eq def
/nullcpdv cpdv type /nulltype eq def
nullv nullcpdv or
{
/upd true def
} {
/sametype v type cpdv type eq def
sametype {
v type /arraytype eq {
/vlen v length def
/cpdvlen cpdv length def
vlen cpdvlen eq {
0 1 vlen 1 sub {
/i exch def
/obj v i get def
/cpdobj cpdv i get def
obj cpdobj ne {
/upd true def
exit
} if
} for
} {
/upd true def
} ifelse
} {
v type /dicttype eq {
v {
/dv exch def
/dk exch def
/cpddv cpdv dk get def
dv cpddv ne {
/upd true def
exit
} if
} forall
} {
/upd true def
} ifelse
} ifelse
} if
} ifelse
upd true eq {
d k v put
} if
} if
} if
} forall
d length 0 gt {
d setpagedevice
} if
} bd
/RE { % /NewFontName [NewEncodingArray] /FontName RE -
  findfont dup length dict begin
  {
    1 index /FID ne
    {def} {pop pop} ifelse
  } forall
  /Encoding exch def
  /FontName 1 index def
  currentdict definefont pop
  end
} bind def
%%EndResource
%%BeginResource: procset (Apache XML Graphics EPS ProcSet) 1.0 0
%%Version: 1.0 0
%%Copyright: (Copyright 2002-2003 The Apache Software Foundation. License terms: http://www.apache.org/licenses/LICENSE-2.0)
/BeginEPSF { %def
/b4_Inc_state save def         % Save state for cleanup
/dict_count countdictstack def % Count objects on dict stack
/op_count count 1 sub def      % Count objects on operand stack
userdict begin                 % Push userdict on dict stack
/showpage { } def              % Redefine showpage, { } = null proc
0 setgray 0 setlinecap         % Prepare graphics state
1 setlinewidth 0 setlinejoin
10 setmiterlimit [ ] 0 setdash newpath
/languagelevel where           % If level not equal to 1 then
{pop languagelevel             % set strokeadjust and
1 ne                           % overprint to their defaults.
{false setstrokeadjust false setoverprint
} if
} if
} bd
/EndEPSF { %def
count op_count sub {pop} repeat            % Clean up stacks
countdictstack dict_count sub {end} repeat
b4_Inc_state restore
} bd
%%EndResource
%FOPBeginFontDict
%%IncludeResource: font Courier-Oblique
%%IncludeResource: font Courier-BoldOblique
%%IncludeResource: font Courier-Bold
%%IncludeResource: font ZapfDingbats
%%IncludeResource: font Symbol
%%IncludeResource: font Helvetica
%%IncludeResource: font Helvetica-Oblique
%%IncludeResource: font Helvetica-Bold
%%IncludeResource: font Helvetica-BoldOblique
%%IncludeResource: font Times-Roman
%%IncludeResource: font Times-Italic
%%IncludeResource: font Times-Bold
%%IncludeResource: font Times-BoldItalic
%%IncludeResource: font Courier
%FOPEndFontDict
%%BeginResource: encoding WinAnsiEncoding
/WinAnsiEncoding [
/.notdef /.notdef /.notdef /.notdef /.notdef
/.notdef /.notdef /.notdef /.notdef /.notdef
/.notdef /.notdef /.notdef /.notdef /.notdef
/.notdef /.notdef /.notdef /.notdef /.notdef
/.notdef /.notdef /.notdef /.notdef /.notdef
/.notdef /.notdef /.notdef /.notdef /.notdef
/.notdef /.notdef /space /exclam /quotedbl
/numbersign /dollar /percent /ampersand /quotesingle
/parenleft /parenright /asterisk /plus /comma
/hyphen /period /slash /zero /one
/two /three /four /five /six
/seven /eight /nine /colon /semicolon
/less /equal /greater /question /at
/A /B /C /D /E
/F /G /H /I /J
/K /L /M /N /O
/P /Q /R /S /T
/U /V /W /X /Y
/Z /bracketleft /backslash /bracketright /asciicircum
/underscore /quoteleft /a /b /c
/d /e /f /g /h
/i /j /k /l /m
/n /o /p /q /r
/s /t /u /v /w
/x /y /z /braceleft /bar
/braceright /asciitilde /bullet /Euro /bullet
/quotesinglbase /florin /quotedblbase /ellipsis /dagger
/daggerdbl /circumflex /perthousand /Scaron /guilsinglleft
/OE /bullet /Zcaron /bullet /bullet
/quoteleft /quoteright /quotedblleft /quotedblright /bullet
/endash /emdash /asciitilde /trademark /scaron
/guilsinglright /oe /bullet /zcaron /Ydieresis
/space /exclamdown /cent /sterling /currency
/yen /brokenbar /section /dieresis /copyright
/ordfeminine /guillemotleft /logicalnot /sfthyphen /registered
/macron /degree /plusminus /twosuperior /threesuperior
/acute /mu /paragraph /middot /cedilla
/onesuperior /ordmasculine /guillemotright /onequarter /onehalf
/threequarters /questiondown /Agrave /Aacute /Acircumflex
/Atilde /Adieresis /Aring /AE /Ccedilla
/Egrave /Eacute /Ecircumflex /Edieresis /Igrave
/Iacute /Icircumflex /Idieresis /Eth /Ntilde
/Ograve /Oacute /Ocircumflex /Otilde /Odieresis
/multiply /Oslash /Ugrave /Uacute /Ucircumflex
/Udieresis /Yacute /Thorn /germandbls /agrave
/aacute /acircumflex /atilde /adieresis /aring
/ae /ccedilla /egrave /eacute /ecircumflex
/edieresis /igrave /iacute /icircumflex /idieresis
/eth /ntilde /ograve /oacute /ocircumflex
/otilde /odieresis /divide /oslash /ugrave
/uacute /ucircumflex /udieresis /yacute /thorn
/ydieresis
] def
%%EndResource
%FOPBeginFontReencode
/Courier-Oblique findfont
dup length dict begin
  {1 index /FID ne {def} {pop pop} ifelse} forall
  /Encoding WinAnsiEncoding def
  currentdict
end
/Courier-Oblique exch definefont pop
/Courier-BoldOblique findfont
dup length dict begin
  {1 index /FID ne {def} {pop pop} ifelse} forall
  /Encoding WinAnsiEncoding def
  currentdict
end
/Courier-BoldOblique exch definefont pop
/Courier-Bold findfont
dup length dict begin
  {1 index /FID ne {def} {pop pop} ifelse} forall
  /Encoding WinAnsiEncoding def
  currentdict
end
/Courier-Bold exch definefont pop
/Helvetica findfont
dup length dict begin
  {1 index /FID ne {def} {pop pop} ifelse} forall
  /Encoding WinAnsiEncoding def
  currentdict
end
/Helvetica exch definefont pop
/Helvetica-Oblique findfont
dup length dict begin
  {1 index /FID ne {def} {pop pop} ifelse} forall
  /Encoding WinAnsiEncoding def
  currentdict
end
/Helvetica-Oblique exch definefont pop
/Helvetica-Bold findfont
dup length dict begin
  {1 index /FID ne {def} {pop pop} ifelse} forall
  /Encoding WinAnsiEncoding def
  currentdict
end
/Helvetica-Bold exch definefont pop
/Helvetica-BoldOblique findfont
dup length dict begin
  {1 index /FID ne {def} {pop pop} ifelse} forall
  /Encoding WinAnsiEncoding def
  currentdict
end
/Helvetica-BoldOblique exch definefont pop
/Times-Roman findfont
dup length dict begin
  {1 index /FID ne {def} {pop pop} ifelse} forall
  /Encoding WinAnsiEncoding def
  currentdict
end
/Times-Roman exch definefont pop
/Times-Italic findfont
dup length dict begin
  {1 index /FID ne {def} {pop pop} ifelse} forall
  /Encoding WinAnsiEncoding def
  currentdict
end
/Times-Italic exch definefont pop
/Times-Bold findfont
dup length dict begin
  {1 index /FID ne {def} {pop pop} ifelse} forall
  /Encoding WinAnsiEncoding def
  currentdict
end
/Times-Bold exch definefont pop
/Times-BoldItalic findfont
dup length dict begin
  {1 index /FID ne {def} {pop pop} ifelse} forall
  /Encoding WinAnsiEncoding def
  currentdict
end
/Times-BoldItalic exch definefont pop
/Courier findfont
dup length dict begin
  {1 index /FID ne {def} {pop pop} ifelse} forall
  /Encoding WinAnsiEncoding def
  currentdict
end
/Courier exch definefont pop
%FOPEndFontReencode
%%EndProlog
%%Page: 1 1
%%PageBoundingBox: 0 0 420 315
%%BeginPageSetup
[1 0 0 -1 0 315] CT
%%EndPageSetup
GS
[0.6 0 0 0.6 0 0] CT
1 GC
N
0 0 700 525 re
f
GR
GS
[0.6 0 0 0.6 0 0] CT
1 GC
N
0 0 700 525 re
f
GR
GS
[0.6 0 0 0.6 0 0] CT
1 GC
N
91 450 M
634 450 L
634 39 L
91 39 L
cp
f
GR
GS
[0.6 0 0 0.6 0 0] CT
0.873 GC
1 LJ
0.833 LW
N
91 450 M
91 39 L
S
GR
GS
[0.6 0 0 0.6 0 0] CT
0.873 GC
1 LJ
0.833 LW
N
181.5 450 M
181.5 39 L
S
GR
GS
[0.6 0 0 0.6 0 0] CT
0.873 GC
1 LJ
0.833 LW
N
272 450 M
272 39 L
S
GR
GS
[0.6 0 0 0.6 0 0] CT
0.873 GC
1 LJ
0.833 LW
N
362.5 450 M
362.5 39 L
S
GR
GS
[0.6 0 0 0.6 0 0] CT
0.873 GC
1 LJ
0.833 LW
N
453 450 M
453 39 L
S
GR
GS
[0.6 0 0 0.6 0 0] CT
0.873 GC
1 LJ
0.833 LW
N
543.5 450 M
543.5 39 L
S
GR
GS
[0.6 0 0 0.6 0 0] CT
0.873 GC
1 LJ
0.833 LW
N
634 450 M
634 39 L
S
GR
GS
[0.6 0 0 0.6 0 0] CT
0.873 GC
1 LJ
0.833 LW
N
634 450 M
91 450 L
S
GR
GS
[0.6 0 0 0.6 0 0] CT
0.873 GC
1 LJ
0.833 LW
N
634 367.8 M
91 367.8 L
S
GR
GS
[0.6 0 0 0.6 0 0] CT
0.873 GC
1 LJ
0.833 LW
N
634 285.6 M
91 285.6 L
S
GR
GS
[0.6 0 0 0.6 0 0] CT
0.873 GC
1 LJ
0.833 LW
N
634 203.4 M
91 203.4 L
S
GR
GS
[0.6 0 0 0.6 0 0] CT
0.873 GC
1 LJ
0.833 LW
N
634 121.2 M
91 121.2 L
S
GR
GS
[0.6 0 0 0.6 0 0] CT
0.873 GC
1 LJ
0.833 LW
N
634 39 M
91 39 L
S
GR
GS
[0.6 0 0 0.6 0 0] CT
0.149 GC
2 setlinecap
1 LJ
0.833 LW
N
91 450 M
634 450 L
S
GR
GS
[0.6 0 0 0.6 0 0] CT
0.149 GC
2 setlinecap
1 LJ
0.833 LW
N
91 39 M
634 39 L
S
GR
GS
[0.6 0 0 0.6 0 0] CT
0.149 GC
2 setlinecap
1 LJ
0.833 LW
N
91 450 M
91 444.57 L
S
GR
GS
[0.6 0 0 0.6 0 0] CT
0.149 GC
2 setlinecap
1 LJ
0.833 LW
N
181.5 450 M
181.5 444.57 L
S
GR
GS
[0.6 0 0 0.6 0 0] CT
0.149 GC
2 setlinecap
1 LJ
0.833 LW
N
272 450 M
272 444.57 L
S
GR
GS
[0.6 0 0 0.6 0 0] CT
0.149 GC
2 setlinecap
1 LJ
0.833 LW
N
362.5 450 M
362.5 444.57 L
S
GR
GS
[0.6 0 0 0.6 0 0] CT
0.149 GC
2 setlinecap
1 LJ
0.833 LW
N
453 450 M
453 444.57 L
S
GR
GS
[0.6 0 0 0.6 0 0] CT
0.149 GC
2 setlinecap
1 LJ
0.833 LW
N
543.5 450 M
543.5 444.57 L
S
GR
GS
[0.6 0 0 0.6 0 0] CT
0.149 GC
2 setlinecap
1 LJ
0.833 LW
N
634 450 M
634 444.57 L
S
GR
GS
[0.6 0 0 0.6 0 0] CT
0.149 GC
2 setlinecap
1 LJ
0.833 LW
N
91 39 M
91 44.43 L
S
GR
GS
[0.6 0 0 0.6 0 0] CT
0.149 GC
2 setlinecap
1 LJ
0.833 LW
N
181.5 39 M
181.5 44.43 L
S
GR
GS
[0.6 0 0 0.6 0 0] CT
0.149 GC
2 setlinecap
1 LJ
0.833 LW
N
272 39 M
272 44.43 L
S
GR
GS
[0.6 0 0 0.6 0 0] CT
0.149 GC
2 setlinecap
1 LJ
0.833 LW
N
362.5 39 M
362.5 44.43 L
S
GR
GS
[0.6 0 0 0.6 0 0] CT
0.149 GC
2 setlinecap
1 LJ
0.833 LW
N
453 39 M
453 44.43 L
S
GR
GS
[0.6 0 0 0.6 0 0] CT
0.149 GC
2 setlinecap
1 LJ
0.833 LW
N
543.5 39 M
543.5 44.43 L
S
GR
GS
[0.6 0 0 0.6 0 0] CT
0.149 GC
2 setlinecap
1 LJ
0.833 LW
N
634 39 M
634 44.43 L
S
GR
GS
[0.6 0 0 0.6 54.6 274.8] CT
0.149 GC
/Helvetica 23.333 F
GS
[1 0 0 1 0 0] CT
-6.5 24 moveto 
1 -1 scale
(0) t 
GR
GR
GS
[0.6 0 0 0.6 108.9 274.8] CT
0.149 GC
/Helvetica 23.333 F
GS
[1 0 0 1 0 0] CT
-16.5 24 moveto 
1 -1 scale
(0.5) t 
GR
GR
GS
[0.6 0 0 0.6 163.2 274.8] CT
0.149 GC
/Helvetica 23.333 F
GS
[1 0 0 1 0 0] CT
-6.5 24 moveto 
1 -1 scale
(1) t 
GR
GR
GS
[0.6 0 0 0.6 217.5 274.8] CT
0.149 GC
/Helvetica 23.333 F
GS
[1 0 0 1 0 0] CT
-16.5 24 moveto 
1 -1 scale
(1.5) t 
GR
GR
GS
[0.6 0 0 0.6 271.8 274.8] CT
0.149 GC
/Helvetica 23.333 F
GS
[1 0 0 1 0 0] CT
-6.5 24 moveto 
1 -1 scale
(2) t 
GR
GR
GS
[0.6 0 0 0.6 326.1 274.8] CT
0.149 GC
/Helvetica 23.333 F
GS
[1 0 0 1 0 0] CT
-16.5 24 moveto 
1 -1 scale
(2.5) t 
GR
GR
GS
[0.6 0 0 0.6 380.4 274.8] CT
0.149 GC
/Helvetica 23.333 F
GS
[1 0 0 1 0 0] CT
-6.5 24 moveto 
1 -1 scale
(3) t 
GR
GR
GS
[0.6 0 0 0.6 217.50016 293.20001] CT
0.149 GC
/Helvetica 25.667 F
GS
[1 0 0 1 0 0] CT
-28 26 moveto 
1 -1 scale
(s [m]) t 
GR
GR
GS
[0.6 0 0 0.6 346.8 311.4] CT
0.149 GC
N
3.375 -0.656 M
3.375 -0.844 3.5 -0.984 QT
8.281 -5.75 L
3.5 -10.531 L
3.375 -10.641 3.375 -10.844 QT
3.375 -11 3.516 -11.148 QT
3.656 -11.297 3.844 -11.297 QT
4 -11.297 4.188 -11.156 QT
8.953 -6.391 L
13.688 -11.156 L
13.875 -11.297 14.031 -11.297 QT
14.219 -11.297 14.352 -11.164 QT
14.484 -11.031 14.484 -10.844 QT
14.484 -10.641 14.375 -10.531 QT
9.594 -5.75 L
14.375 -0.984 L
14.484 -0.844 14.484 -0.656 QT
14.484 -0.469 14.352 -0.336 QT
14.219 -0.203 14.031 -0.203 QT
13.859 -0.203 13.688 -0.375 QT
8.953 -5.109 L
4.188 -0.375 L
4.016 -0.203 3.844 -0.203 QT
3.656 -0.203 3.516 -0.352 QT
3.375 -0.5 3.375 -0.656 QT
cp
f
GR
GS
[0.6 0 0 0.6 358.2 311.4] CT
0.149 GC
/Helvetica 23.333 F
GS
[1 0 0 1 0 0] CT
0 0 moveto 
1 -1 scale
(10) t 
GR
GR
GS
[0.6 0 0 0.6 373.8 304.8] CT
0.149 GC
/Helvetica 18.667 F
GS
[1 0 0 1 0 0] CT
0 0 moveto 
1 -1 scale
(4) t 
GR
GR
GS
[0.6 0 0 0.6 0 0] CT
0.149 GC
2 setlinecap
1 LJ
0.833 LW
N
91 450 M
91 39 L
S
GR
GS
[0.6 0 0 0.6 0 0] CT
0.149 GC
2 setlinecap
1 LJ
0.833 LW
N
634 450 M
634 39 L
S
GR
GS
[0.6 0 0 0.6 0 0] CT
0.149 GC
2 setlinecap
1 LJ
0.833 LW
N
91 450 M
96.43 450 L
S
GR
GS
[0.6 0 0 0.6 0 0] CT
0.149 GC
2 setlinecap
1 LJ
0.833 LW
N
91 367.8 M
96.43 367.8 L
S
GR
GS
[0.6 0 0 0.6 0 0] CT
0.149 GC
2 setlinecap
1 LJ
0.833 LW
N
91 285.6 M
96.43 285.6 L
S
GR
GS
[0.6 0 0 0.6 0 0] CT
0.149 GC
2 setlinecap
1 LJ
0.833 LW
N
91 203.4 M
96.43 203.4 L
S
GR
GS
[0.6 0 0 0.6 0 0] CT
0.149 GC
2 setlinecap
1 LJ
0.833 LW
N
91 121.2 M
96.43 121.2 L
S
GR
GS
[0.6 0 0 0.6 0 0] CT
0.149 GC
2 setlinecap
1 LJ
0.833 LW
N
91 39 M
96.43 39 L
S
GR
GS
[0.6 0 0 0.6 0 0] CT
0.149 GC
2 setlinecap
1 LJ
0.833 LW
N
634 450 M
628.57 450 L
S
GR
GS
[0.6 0 0 0.6 0 0] CT
0.149 GC
2 setlinecap
1 LJ
0.833 LW
N
634 367.8 M
628.57 367.8 L
S
GR
GS
[0.6 0 0 0.6 0 0] CT
0.149 GC
2 setlinecap
1 LJ
0.833 LW
N
634 285.6 M
628.57 285.6 L
S
GR
GS
[0.6 0 0 0.6 0 0] CT
0.149 GC
2 setlinecap
1 LJ
0.833 LW
N
634 203.4 M
628.57 203.4 L
S
GR
GS
[0.6 0 0 0.6 0 0] CT
0.149 GC
2 setlinecap
1 LJ
0.833 LW
N
634 121.2 M
628.57 121.2 L
S
GR
GS
[0.6 0 0 0.6 0 0] CT
0.149 GC
2 setlinecap
1 LJ
0.833 LW
N
634 39 M
628.57 39 L
S
GR
GS
[0.6 0 0 0.6 49.8 270] CT
0.149 GC
/Helvetica 23.333 F
GS
[1 0 0 1 0 0] CT
-21 9 moveto 
1 -1 scale
(-2) t 
GR
GR
GS
[0.6 0 0 0.6 49.8 220.67999] CT
0.149 GC
/Helvetica 23.333 F
GS
[1 0 0 1 0 0] CT
-21 9 moveto 
1 -1 scale
(-1) t 
GR
GR
GS
[0.6 0 0 0.6 49.8 171.36] CT
0.149 GC
/Helvetica 23.333 F
GS
[1 0 0 1 0 0] CT
-13 9 moveto 
1 -1 scale
(0) t 
GR
GR
GS
[0.6 0 0 0.6 49.8 122.04] CT
0.149 GC
/Helvetica 23.333 F
GS
[1 0 0 1 0 0] CT
-13 9 moveto 
1 -1 scale
(1) t 
GR
GR
GS
[0.6 0 0 0.6 49.8 72.72] CT
0.149 GC
/Helvetica 23.333 F
GS
[1 0 0 1 0 0] CT
-13 9 moveto 
1 -1 scale
(2) t 
GR
GR
GS
[0.6 0 0 0.6 49.8 23.4] CT
0.149 GC
/Helvetica 23.333 F
GS
[1 0 0 1 0 0] CT
-13 9 moveto 
1 -1 scale
(3) t 
GR
GR
GS
[0 -0.6 0.6 0 34.2 146.69988] CT
0.149 GC
/Helvetica 25.667 F
GS
[1 0 0 1 0 0] CT
-46 -6 moveto 
1 -1 scale
(sklon [\260]) t 
GR
GR
GS
[0.6 0 0 0.6 0 0] CT
0 0 1 RC
1 LJ
3.333 LW
N
91 285.6 M
91.037 345.485 L
91.662 344.883 L
91.667 344.877 L
92.495 344.023 L
92.501 344.017 L
93.333 343.108 L
93.339 343.101 L
94.152 342.154 L
94.167 342.137 L
94.996 341.081 L
95.001 341.074 L
95.821 339.898 L
95.836 339.875 L
96.663 338.494 L
96.668 338.486 L
97.499 336.847 L
97.508 336.828 L
98.324 334.924 L
98.339 334.886 L
99.157 332.644 L
99.169 332.609 L
99.998 329.984 L
100.014 329.928 L
100.821 327.043 L
100.844 326.955 L
101.663 323.722 L
101.682 323.643 L
102.491 320.214 L
102.505 320.153 L
103.325 316.531 L
103.342 316.455 L
104.156 312.81 L
104.168 312.756 L
104.999 309.103 L
105.004 309.08 L
105.815 305.686 L
105.839 305.589 L
106.66 302.437 L
106.669 302.403 L
107.491 299.608 L
107.507 299.559 L
108.328 297.198 L
108.334 297.182 L
109.152 295.295 L
109.17 295.258 L
109.996 293.846 L
110.004 293.836 L
110.819 292.918 L
110.837 292.903 L
111.649 292.436 L
111.673 292.428 L
112.218 292.344 L
112.495 292.363 L
112.504 292.365 L
113.317 292.635 L
113.336 292.644 L
114.162 293.186 L
114.172 293.194 L
114.995 293.919 L
115.007 293.93 L
115.832 294.761 L
115.852 294.781 L
116.653 295.613 L
116.667 295.627 L
117.477 296.427 L
117.502 296.45 L
118.333 297.166 L
118.344 297.174 L
119.163 297.732 L
119.177 297.74 L
119.998 298.117 L
120.013 298.122 L
120.825 298.296 L
120.841 298.297 L
121.123 298.31 L
121.654 298.269 L
121.673 298.266 L
122.491 298.04 L
122.505 298.035 L
123.328 297.633 L
123.345 297.623 L
124.15 297.097 L
124.175 297.079 L
124.999 296.451 L
125.012 296.441 L
125.823 295.792 L
125.837 295.782 L
126.664 295.153 L
126.68 295.142 L
127.492 294.624 L
127.506 294.616 L
128.324 294.26 L
128.337 294.256 L
129.129 294.131 L
129.136 294.131 L
129.168 294.132 L
129.982 294.3 L
130.006 294.31 L
130.825 294.839 L
130.839 294.851 L
131.663 295.799 L
131.677 295.819 L
132.496 297.225 L
132.512 297.257 L
133.333 299.177 L
133.34 299.196 L
134.166 301.671 L
134.176 301.705 L
134.993 304.718 L
135.006 304.77 L
135.83 308.38 L
135.843 308.444 L
136.663 312.596 L
136.678 312.678 L
137.5 317.366 L
137.508 317.413 L
138.332 322.586 L
138.351 322.714 L
139.165 328.215 L
139.184 328.349 L
139.991 334.094 L
140.001 334.166 L
140.823 340.201 L
140.845 340.363 L
141.665 346.444 L
141.672 346.495 L
142.482 352.419 L
142.501 352.553 L
143.331 358.405 L
143.345 358.499 L
144.16 363.885 L
144.178 363.999 L
145 368.927 L
145.016 369.021 L
145.83 373.278 L
145.838 373.315 L
146.656 376.843 L
146.675 376.915 L
147.488 379.533 L
147.501 379.567 L
148.328 381.198 L
148.339 381.213 L
149.097 381.7 L
149.154 381.696 L
149.174 381.693 L
150 380.935 L
150.01 380.918 L
150.824 378.891 L
150.836 378.853 L
151.661 375.483 L
151.673 375.421 L
152.494 370.775 L
152.508 370.685 L
153.301 365.039 L
153.334 364.784 L
154.163 357.8 L
154.176 357.683 L
154.999 349.91 L
155.013 349.769 L
155.825 341.567 L
155.839 341.429 L
156.664 332.913 L
156.688 332.668 L
157.494 324.601 L
157.502 324.516 L
158.328 316.914 L
158.34 316.806 L
159.161 310.335 L
159.171 310.265 L
159.995 305.213 L
160 305.186 L
160.816 301.856 L
160.835 301.8 L
161.665 300.267 L
161.681 300.255 L
161.945 300.16 L
162.499 300.529 L
162.514 300.55 L
163.33 302.396 L
163.334 302.409 L
164.158 305.522 L
164.173 305.587 L
164.996 309.53 L
165.007 309.586 L
165.817 313.805 L
165.841 313.928 L
166.667 318.065 L
166.678 318.119 L
167.493 321.584 L
167.508 321.639 L
168.333 324.122 L
168.347 324.154 L
169.148 325.306 L
169.171 325.319 L
169.435 325.387 L
169.999 325.015 L
170.011 324.999 L
170.826 323.191 L
170.834 323.166 L
171.659 319.888 L
171.672 319.829 L
172.499 315.261 L
172.504 315.232 L
173.321 309.732 L
173.337 309.622 L
174.167 303.359 L
174.175 303.29 L
174.998 296.781 L
175.014 296.652 L
175.828 290.27 L
175.841 290.174 L
176.666 284.105 L
176.682 283.995 L
177.492 278.713 L
177.511 278.601 L
178.329 274.158 L
178.343 274.089 L
179.162 270.648 L
179.179 270.589 L
179.99 268.212 L
180.001 268.187 L
180.818 266.768 L
180.836 266.747 L
181.653 266.186 L
181.669 266.182 L
181.907 266.157 L
182.48 266.297 L
182.505 266.309 L
183.324 266.898 L
183.344 266.917 L
184.162 267.763 L
184.174 267.776 L
184.987 268.684 L
185 268.699 L
185.826 269.551 L
185.837 269.562 L
186.661 270.272 L
186.673 270.281 L
187.498 270.865 L
187.51 270.872 L
188.333 271.42 L
188.343 271.427 L
189.161 272.098 L
189.17 272.108 L
189.993 273.128 L
190.003 273.144 L
190.804 274.704 L
190.836 274.781 L
191.666 277.264 L
191.681 277.319 L
192.497 280.825 L
192.51 280.889 L
193.302 285.458 L
193.336 285.681 L
194.165 291.793 L
194.189 291.988 L
194.998 299.223 L
195.007 299.312 L
195.82 307.658 L
195.848 307.959 L
196.667 317.211 L
196.682 317.395 L
197.482 326.864 L
197.501 327.092 L
198.33 336.892 L
198.341 337.016 L
199.154 346.099 L
199.171 346.277 L
199.997 354.418 L
200.015 354.578 L
200.822 360.982 L
200.839 361.098 L
201.666 365.619 L
201.689 365.713 L
202.491 367.805 L
202.507 367.823 L
202.801 367.984 L
203.331 367.465 L
203.344 367.438 L
204.149 364.652 L
204.169 364.556 L
204.994 359.4 L
205.008 359.295 L
205.811 352.468 L
205.842 352.175 L
206.64 344.174 L
206.67 343.861 L
207.495 335.104 L
207.507 334.981 L
208.31 326.741 L
208.334 326.508 L
209.16 319.098 L
209.17 319.015 L
209.996 313.271 L
210.007 313.206 L
210.817 309.595 L
210.841 309.518 L
211.662 308.137 L
211.673 308.133 L
211.749 308.122 L
212.5 309.012 L
212.511 309.038 L
213.33 311.95 L
213.349 312.04 L
214.164 316.621 L
214.177 316.706 L
214.98 322.4 L
215.013 322.651 L
215.83 329.14 L
215.834 329.174 L
216.659 335.867 L
216.676 336.005 L
217.486 342.214 L
217.501 342.317 L
218.323 347.79 L
218.338 347.878 L
219.154 352.134 L
219.168 352.197 L
220 355.081 L
220.015 355.12 L
220.831 356.421 L
220.864 356.442 L
221.13 356.526 L
221.656 356.25 L
221.672 356.233 L
222.499 354.686 L
222.515 354.646 L
223.329 352.035 L
223.341 351.989 L
224.166 348.579 L
224.181 348.512 L
224.992 344.788 L
225.008 344.712 L
225.832 340.955 L
225.844 340.902 L
226.657 337.604 L
226.669 337.558 L
227.494 334.97 L
227.505 334.942 L
228.333 333.398 L
228.348 333.381 L
228.95 333.035 L
229.156 333.074 L
229.169 333.079 L
230 334.069 L
230.005 334.079 L
230.83 336.314 L
230.845 336.364 L
231.654 339.609 L
231.669 339.674 L
232.493 343.77 L
232.514 343.879 L
233.327 348.333 L
233.338 348.394 L
234.15 352.815 L
234.171 352.926 L
234.991 356.884 L
235.007 356.953 L
235.825 359.931 L
235.838 359.967 L
236.662 361.561 L
236.667 361.566 L
237.029 361.735 L
237.488 361.436 L
237.502 361.418 L
238.324 359.345 L
238.337 359.296 L
239.164 355.196 L
239.173 355.143 L
239.985 349.264 L
240.013 349.033 L
240.827 341.535 L
240.834 341.472 L
241.665 332.597 L
241.676 332.474 L
242.499 322.971 L
242.511 322.826 L
243.323 313.297 L
243.334 313.17 L
244.163 303.828 L
244.176 303.686 L
244.995 295.373 L
245.008 295.254 L
245.823 288.304 L
245.837 288.204 L
246.664 282.826 L
246.684 282.722 L
247.495 279.271 L
247.508 279.231 L
248.326 277.565 L
248.341 277.55 L
248.742 277.361 L
249.163 277.553 L
249.177 277.565 L
250 278.921 L
250.014 278.954 L
250.831 281.163 L
250.844 281.202 L
251.665 283.695 L
251.678 283.732 L
252.495 285.807 L
252.506 285.828 L
253.327 286.786 L
253.343 286.788 L
253.398 286.793 L
254.16 285.907 L
254.179 285.861 L
254.983 282.571 L
255 282.473 L
255.822 276.113 L
255.838 275.953 L
256.665 266.132 L
256.682 265.892 L
257.498 252.691 L
257.507 252.516 L
258.333 235.729 L
258.34 235.579 L
259.157 215.936 L
259.172 215.542 L
259.995 193.282 L
260.003 193.073 L
260.83 169.044 L
260.835 168.92 L
261.66 144.362 L
261.674 143.928 L
262.495 120.043 L
262.51 119.61 L
263.329 97.565 L
263.354 96.93 L
264.146 78.429 L
264.169 77.952 L
264.989 62.855 L
265.002 62.654 L
265.822 52.567 L
265.838 52.43 L
266.657 48.09 L
266.677 48.058 L
266.828 47.938 L
267.493 49.895 L
267.504 49.96 L
268.328 58.095 L
268.337 58.211 L
269.155 72.288 L
269.176 72.719 L
269.997 92.358 L
270.009 92.679 L
270.83 116.888 L
270.838 117.163 L
271.659 144.801 L
271.681 145.584 L
272.485 174.665 L
272.504 175.394 L
273.322 205.589 L
273.34 206.235 L
274.151 235.291 L
274.171 235.982 L
275 263.281 L
275.011 263.628 L
275.828 286.959 L
275.843 287.326 L
276.653 305.947 L
276.668 306.237 L
277.493 319.879 L
277.506 320.057 L
278.325 327.988 L
278.35 328.142 L
279.119 330.461 L
279.161 330.455 L
279.168 330.452 L
279.995 327.657 L
280.006 327.591 L
280.832 320.319 L
280.847 320.161 L
281.649 309.774 L
281.669 309.481 L
282.497 296.513 L
282.507 296.352 L
283.326 282.586 L
283.337 282.405 L
284.159 268.878 L
284.169 268.725 L
284.997 256.515 L
285.025 256.139 L
285.832 246.529 L
285.845 246.404 L
286.653 239.591 L
286.676 239.444 L
287.491 235.764 L
287.508 235.721 L
288.045 235.053 L
288.331 235.233 L
288.343 235.249 L
289.166 237.723 L
289.182 237.797 L
289.998 242.719 L
290.003 242.752 L
290.825 249.559 L
290.835 249.656 L
291.661 257.696 L
291.676 257.849 L
292.499 266.369 L
292.514 266.517 L
293.331 274.84 L
293.341 274.932 L
294.152 282.542 L
294.167 282.672 L
294.999 289.384 L
295.009 289.456 L
295.833 294.78 L
295.846 294.856 L
296.659 298.717 L
296.675 298.782 L
297.488 301.317 L
297.512 301.373 L
298.329 302.744 L
298.342 302.758 L
299.157 303.222 L
299.169 303.224 L
299.326 303.234 L
299.989 303.086 L
300.005 303.079 L
300.825 302.648 L
300.836 302.642 L
301.664 302.208 L
301.68 302.201 L
302.496 302.014 L
302.508 302.014 L
302.519 302.014 L
303.333 302.235 L
303.347 302.242 L
304.166 302.953 L
304.175 302.965 L
304.978 304.131 L
305.007 304.18 L
305.821 305.764 L
305.838 305.8 L
306.655 307.636 L
306.671 307.673 L
307.495 309.572 L
307.512 309.609 L
308.328 311.313 L
308.349 311.351 L
309.158 312.64 L
309.17 312.655 L
309.998 313.363 L
310.01 313.368 L
310.374 313.44 L
310.82 313.309 L
310.836 313.3 L
311.66 312.373 L
311.672 312.353 L
312.491 310.542 L
312.5 310.515 L
313.322 307.844 L
313.336 307.791 L
314.162 304.349 L
314.173 304.298 L
314.983 300.336 L
315.014 300.177 L
315.832 295.77 L
315.844 295.702 L
316.66 291.13 L
316.677 291.033 L
317.494 286.486 L
317.517 286.362 L
318.331 282.069 L
318.346 281.99 L
319.158 278.114 L
319.168 278.067 L
319.995 274.661 L
320.008 274.612 L
320.833 271.855 L
320.85 271.805 L
321.658 269.766 L
321.674 269.733 L
322.493 268.325 L
322.515 268.296 L
323.321 267.513 L
323.336 267.503 L
324.165 267.23 L
324.179 267.229 L
324.241 267.227 L
324.998 267.378 L
325.013 267.384 L
325.832 267.828 L
325.837 267.831 L
326.666 268.453 L
326.678 268.463 L
327.493 269.132 L
327.51 269.145 L
328.332 269.778 L
328.34 269.784 L
329.154 270.296 L
329.18 270.31 L
329.988 270.657 L
330.004 270.662 L
330.811 270.832 L
330.837 270.835 L
331.227 270.854 L
331.658 270.834 L
331.674 270.832 L
332.484 270.694 L
332.514 270.687 L
333.326 270.462 L
333.337 270.459 L
334.164 270.205 L
334.181 270.2 L
334.998 269.992 L
335.013 269.989 L
335.828 269.884 L
335.84 269.884 L
336.027 269.88 L
336.652 269.929 L
336.667 269.932 L
337.492 270.165 L
337.51 270.172 L
338.327 270.602 L
338.337 270.609 L
339.158 271.23 L
339.169 271.24 L
339.996 272.031 L
340.007 272.042 L
340.824 272.946 L
340.843 272.968 L
341.661 273.941 L
341.678 273.961 L
342.491 274.937 L
342.5 274.948 L
343.326 275.887 L
343.34 275.902 L
344.166 276.727 L
344.181 276.741 L
344.991 277.384 L
345.001 277.392 L
345.83 277.837 L
345.843 277.842 L
346.667 278.036 L
346.678 278.037 L
346.863 278.043 L
347.485 277.965 L
347.515 277.958 L
348.311 277.622 L
348.339 277.606 L
349.155 276.997 L
349.17 276.984 L
349.987 276.13 L
350.017 276.095 L
350.821 275.05 L
350.848 275.011 L
351.647 273.815 L
351.671 273.777 L
352.482 272.463 L
352.501 272.431 L
353.322 271.063 L
353.339 271.034 L
354.157 269.701 L
354.183 269.66 L
354.995 268.442 L
355.009 268.421 L
355.832 267.354 L
355.849 267.335 L
356.662 266.505 L
356.667 266.5 L
357.489 265.926 L
357.503 265.92 L
358.332 265.639 L
358.345 265.637 L
358.693 265.611 L
359.162 265.656 L
359.176 265.659 L
359.99 265.947 L
360.008 265.956 L
360.833 266.475 L
360.856 266.493 L
361.666 267.16 L
361.692 267.183 L
362.487 267.909 L
362.501 267.921 L
363.324 268.656 L
363.337 268.667 L
364.155 269.291 L
364.182 269.309 L
364.985 269.738 L
365.01 269.748 L
365.833 269.932 L
365.849 269.933 L
365.965 269.935 L
366.663 269.82 L
366.671 269.818 L
367.488 269.391 L
367.512 269.373 L
368.33 268.629 L
368.339 268.618 L
369.16 267.588 L
369.172 267.572 L
369.998 266.304 L
370.014 266.279 L
370.828 264.879 L
370.838 264.86 L
371.665 263.375 L
371.676 263.354 L
372.486 261.931 L
372.501 261.905 L
373.329 260.571 L
373.344 260.549 L
374.165 259.422 L
374.181 259.403 L
374.998 258.535 L
375.01 258.524 L
375.826 257.947 L
375.835 257.943 L
376.663 257.676 L
376.671 257.675 L
376.941 257.658 L
377.49 257.728 L
377.507 257.732 L
378.321 258.089 L
378.334 258.097 L
379.159 258.739 L
379.19 258.768 L
379.988 259.626 L
380.003 259.644 L
380.823 260.718 L
380.839 260.741 L
381.658 261.955 L
381.677 261.984 L
382.493 263.28 L
382.503 263.297 L
383.327 264.64 L
383.343 264.667 L
384.161 265.985 L
384.171 266 L
384.997 267.273 L
385.032 267.324 L
385.817 268.441 L
385.837 268.468 L
386.652 269.511 L
386.67 269.532 L
387.495 270.45 L
387.506 270.462 L
388.333 271.242 L
388.352 271.259 L
389.165 271.893 L
389.191 271.912 L
389.998 272.427 L
390.017 272.438 L
390.823 272.859 L
390.843 272.868 L
391.657 273.221 L
391.675 273.228 L
392.496 273.534 L
392.531 273.546 L
393.331 273.816 L
393.35 273.822 L
394.159 274.084 L
394.169 274.087 L
394.997 274.356 L
395.007 274.36 L
395.823 274.631 L
395.838 274.636 L
396.661 274.915 L
396.668 274.917 L
397.495 275.199 L
397.502 275.201 L
398.333 275.475 L
398.344 275.479 L
399.155 275.727 L
399.167 275.731 L
399.991 275.95 L
400.003 275.953 L
400.828 276.128 L
400.842 276.13 L
401.663 276.25 L
401.677 276.251 L
402.483 276.309 L
402.5 276.31 L
402.902 276.317 L
403.329 276.309 L
403.338 276.309 L
404.162 276.256 L
404.176 276.255 L
404.999 276.165 L
405.016 276.163 L
405.823 276.062 L
405.839 276.06 L
406.661 275.97 L
406.672 275.969 L
407.487 275.926 L
407.502 275.926 L
407.593 275.925 L
408.324 275.961 L
408.335 275.963 L
409.15 276.107 L
409.167 276.112 L
409.999 276.402 L
410.003 276.403 L
410.823 276.848 L
410.834 276.855 L
411.66 277.477 L
411.68 277.495 L
412.494 278.282 L
412.507 278.296 L
413.322 279.244 L
413.334 279.259 L
414.163 280.362 L
414.181 280.387 L
414.993 281.568 L
415.007 281.59 L
415.827 282.841 L
415.843 282.867 L
416.661 284.13 L
416.671 284.147 L
417.495 285.393 L
417.511 285.416 L
418.321 286.578 L
418.334 286.597 L
419.165 287.693 L
419.178 287.71 L
419.999 288.676 L
420.016 288.694 L
420.824 289.51 L
420.837 289.522 L
421.658 290.203 L
421.673 290.214 L
422.497 290.735 L
422.512 290.743 L
423.333 291.09 L
423.345 291.094 L
424.165 291.258 L
424.173 291.259 L
424.47 291.272 L
424.991 291.231 L
425.008 291.228 L
425.826 290.993 L
425.837 290.989 L
426.666 290.53 L
426.678 290.522 L
427.495 289.843 L
427.505 289.833 L
428.331 288.914 L
428.344 288.899 L
429.154 287.773 L
429.17 287.748 L
429.991 286.387 L
430.015 286.344 L
430.823 284.802 L
430.837 284.772 L
431.661 283.016 L
431.675 282.984 L
432.498 281.073 L
432.506 281.053 L
433.33 279.022 L
433.336 279.006 L
434.162 276.895 L
434.187 276.832 L
434.997 274.748 L
435.009 274.716 L
435.822 272.682 L
435.838 272.644 L
436.661 270.727 L
436.672 270.703 L
437.492 269.03 L
437.504 269.009 L
438.319 267.687 L
438.335 267.665 L
439.156 266.79 L
439.17 266.78 L
439.999 266.465 L
440.016 266.465 L
440.833 266.805 L
440.85 266.82 L
441.663 267.854 L
441.672 267.87 L
442.5 269.646 L
442.507 269.664 L
443.325 272.096 L
443.342 272.152 L
444.156 275.152 L
444.172 275.214 L
444.996 278.677 L
445.005 278.719 L
445.831 282.383 L
445.838 282.415 L
446.656 285.956 L
446.67 286.011 L
447.498 289.151 L
447.508 289.183 L
448.325 291.463 L
448.336 291.486 L
449.145 292.57 L
449.178 292.584 L
449.35 292.619 L
449.997 292.086 L
450.003 292.076 L
450.831 289.682 L
450.867 289.531 L
451.658 285.204 L
451.689 284.996 L
452.497 278.446 L
452.511 278.322 L
453.329 269.63 L
453.342 269.485 L
454.16 258.98 L
454.174 258.79 L
454.99 246.958 L
455.009 246.671 L
455.828 234.015 L
455.84 233.821 L
456.66 221.158 L
456.678 220.879 L
457.497 209.091 L
457.506 208.962 L
458.323 198.937 L
458.337 198.784 L
459.159 191.345 L
459.172 191.253 L
459.99 187.254 L
460.003 187.22 L
460.408 186.702 L
460.828 187.243 L
460.842 187.279 L
461.657 191.657 L
461.667 191.741 L
462.499 200.709 L
462.505 200.786 L
463.323 213.75 L
463.335 213.966 L
464.157 230.561 L
464.18 231.071 L
464.994 250.183 L
465.009 250.554 L
465.826 271.346 L
465.837 271.622 L
466.662 292.979 L
466.672 293.234 L
467.498 313.722 L
467.509 313.985 L
468.327 332.228 L
468.338 332.466 L
469.156 347.615 L
469.171 347.866 L
469.998 359.243 L
470.015 359.433 L
470.828 366.24 L
470.84 366.303 L
471.652 368.605 L
471.671 368.605 L
471.681 368.605 L
472.496 366.442 L
472.513 366.354 L
473.325 360.239 L
473.337 360.126 L
474.144 350.808 L
474.176 350.392 L
475 338.34 L
475.008 338.205 L
475.828 324.699 L
475.839 324.507 L
476.66 310.45 L
476.671 310.268 L
477.499 296.476 L
477.512 296.27 L
478.328 283.898 L
478.352 283.561 L
479.162 273.137 L
479.178 272.953 L
479.995 264.785 L
480.007 264.689 L
480.817 259.138 L
480.834 259.054 L
481.664 256.077 L
481.673 256.058 L
482.236 255.52 L
482.491 255.641 L
482.506 255.655 L
483.33 257.475 L
483.365 257.594 L
484.163 261.127 L
484.177 261.202 L
484.993 266.072 L
485.009 266.173 L
485.822 271.758 L
485.835 271.846 L
486.663 277.737 L
486.679 277.848 L
487.491 283.335 L
487.503 283.411 L
488.329 288.267 L
488.338 288.319 L
489.154 292.092 L
489.174 292.168 L
489.999 294.714 L
490.016 294.754 L
490.826 295.916 L
490.839 295.924 L
491.152 296.017 L
491.658 295.773 L
491.668 295.763 L
492.495 294.376 L
492.504 294.356 L
493.331 291.933 L
493.359 291.836 L
494.153 288.769 L
494.175 288.674 L
494.994 285.06 L
495 285.031 L
495.826 281.245 L
495.841 281.177 L
496.661 277.592 L
496.672 277.547 L
497.486 274.441 L
497.502 274.387 L
498.328 271.95 L
498.347 271.904 L
499.162 270.399 L
499.178 270.379 L
499.987 269.883 L
500.016 269.884 L
500.83 270.455 L
500.836 270.463 L
501.663 272.085 L
501.674 272.113 L
502.5 274.688 L
502.51 274.727 L
503.331 278.066 L
503.341 278.109 L
504.165 282.02 L
504.178 282.088 L
504.994 286.252 L
505.002 286.293 L
505.83 290.523 L
505.84 290.572 L
506.66 294.477 L
506.675 294.545 L
507.5 297.902 L
507.511 297.942 L
508.331 300.477 L
508.343 300.51 L
509.161 302.067 L
509.177 302.086 L
509.955 302.573 L
509.99 302.572 L
510.013 302.57 L
510.829 301.976 L
510.841 301.959 L
511.647 300.414 L
511.674 300.348 L
512.492 297.978 L
512.516 297.898 L
513.331 295.017 L
513.339 294.987 L
514.158 291.921 L
514.169 291.877 L
514.976 289.058 L
515.008 288.954 L
515.832 286.685 L
515.848 286.648 L
516.665 285.357 L
516.676 285.348 L
517.131 285.151 L
517.487 285.287 L
517.506 285.302 L
518.325 286.673 L
518.334 286.698 L
519.156 289.563 L
519.167 289.611 L
519.991 293.888 L
520.003 293.957 L
520.825 299.381 L
520.839 299.485 L
521.662 305.673 L
521.673 305.754 L
522.484 312.077 L
522.502 312.216 L
523.328 318.27 L
523.338 318.339 L
524.152 323.31 L
524.167 323.387 L
524.987 326.77 L
525.012 326.842 L
525.828 328.043 L
525.839 328.042 L
526.653 326.742 L
526.667 326.697 L
527.49 322.639 L
527.507 322.525 L
528.316 315.821 L
528.339 315.597 L
529.161 306.211 L
529.178 305.991 L
529.997 294.449 L
530.013 294.199 L
530.83 281.047 L
530.85 280.707 L
531.661 266.659 L
531.679 266.346 L
532.492 252.021 L
532.505 251.794 L
533.332 237.762 L
533.364 237.234 L
534.161 225.002 L
534.175 224.8 L
534.998 214.156 L
535.018 213.925 L
535.829 205.979 L
535.834 205.94 L
536.662 200.788 L
536.688 200.681 L
537.494 198.774 L
537.506 198.768 L
537.605 198.744 L
538.318 199.848 L
538.334 199.9 L
539.164 203.86 L
539.179 203.956 L
539.984 210.1 L
540.005 210.287 L
540.829 218.363 L
540.841 218.497 L
541.656 227.578 L
541.669 227.729 L
542.486 237.259 L
542.504 237.463 L
543.326 246.862 L
543.336 246.974 L
544.153 255.607 L
544.17 255.768 L
544.983 263.244 L
545.001 263.397 L
545.822 269.556 L
545.848 269.733 L
546.653 274.293 L
546.667 274.362 L
547.495 277.569 L
547.508 277.607 L
548.325 279.431 L
548.336 279.449 L
549.153 280.162 L
549.168 280.166 L
549.399 280.201 L
549.99 280.033 L
550.002 280.026 L
550.825 279.343 L
550.84 279.327 L
551.65 278.406 L
551.672 278.38 L
552.489 277.461 L
552.502 277.448 L
553.32 276.747 L
553.357 276.723 L
554.162 276.396 L
554.184 276.392 L
554.409 276.376 L
554.974 276.482 L
555.01 276.496 L
555.825 277.021 L
555.835 277.03 L
556.659 277.931 L
556.676 277.953 L
557.498 279.111 L
557.516 279.138 L
558.329 280.394 L
558.341 280.411 L
559.162 281.625 L
559.173 281.64 L
559.99 282.637 L
560.003 282.651 L
560.825 283.302 L
560.836 283.308 L
561.58 283.509 L
561.66 283.506 L
561.669 283.506 L
562.497 283.197 L
562.525 283.178 L
563.315 282.405 L
563.337 282.378 L
564.158 281.148 L
564.177 281.116 L
565 279.571 L
565.013 279.545 L
565.831 277.871 L
565.846 277.84 L
566.657 276.243 L
566.667 276.224 L
567.498 274.872 L
567.514 274.851 L
568.321 274.027 L
568.334 274.019 L
568.924 273.827 L
569.161 273.861 L
569.177 273.865 L
569.997 274.526 L
570.009 274.542 L
570.824 276.052 L
570.837 276.085 L
571.654 278.414 L
571.673 278.477 L
572.5 281.534 L
572.513 281.587 L
573.332 285.079 L
573.343 285.128 L
574.163 288.79 L
574.176 288.852 L
574.995 292.331 L
575.027 292.46 L
575.829 295.332 L
575.84 295.366 L
576.661 297.425 L
576.676 297.453 L
577.496 298.306 L
577.509 298.309 L
577.6 298.317 L
578.332 297.717 L
578.343 297.699 L
579.153 295.556 L
579.172 295.489 L
579.989 291.693 L
580.004 291.605 L
580.83 286.169 L
580.837 286.114 L
581.659 279.283 L
581.671 279.176 L
582.498 271.131 L
582.513 270.969 L
583.324 262.247 L
583.338 262.093 L
584.158 252.791 L
584.173 252.617 L
584.994 243.199 L
585.008 243.047 L
585.833 233.856 L
585.842 233.762 L
586.665 225.198 L
586.676 225.085 L
587.484 217.561 L
587.509 217.344 L
588.32 210.889 L
588.335 210.779 L
589.161 205.47 L
589.176 205.385 L
589.996 201.442 L
590.006 201.403 L
590.822 198.768 L
590.837 198.729 L
591.656 197.281 L
591.667 197.269 L
592.468 196.85 L
592.489 196.851 L
592.504 196.851 L
593.322 197.256 L
593.346 197.278 L
594.156 198.249 L
594.171 198.269 L
594.994 199.572 L
595.005 199.591 L
595.825 200.96 L
595.836 200.978 L
596.656 202.202 L
596.693 202.251 L
597.5 203.138 L
597.503 203.14 L
598.321 203.615 L
598.338 203.62 L
598.727 203.673 L
599.157 203.6 L
599.17 203.596 L
599.992 203.077 L
600.005 203.065 L
600.824 202.098 L
600.836 202.081 L
601.666 200.73 L
601.68 200.706 L
602.499 199.13 L
602.509 199.109 L
603.321 197.438 L
603.339 197.4 L
604.156 195.745 L
604.167 195.725 L
604.99 194.21 L
605.002 194.19 L
605.823 192.937 L
605.847 192.906 L
606.662 191.992 L
606.676 191.98 L
607.485 191.431 L
607.502 191.424 L
608.321 191.229 L
608.334 191.228 L
608.405 191.227 L
609.158 191.354 L
609.172 191.359 L
609.977 191.722 L
610.006 191.738 L
610.823 192.256 L
610.839 192.266 L
611.65 192.817 L
611.668 192.829 L
612.498 193.32 L
612.503 193.322 L
613.329 193.637 L
613.336 193.639 L
613.934 193.714 L
614.161 193.702 L
614.174 193.701 L
614.996 193.459 L
615.008 193.453 L
615.833 192.885 L
615.847 192.872 L
616.666 191.997 L
616.678 191.982 L
617.494 190.848 L
617.515 190.815 L
618.332 189.485 L
618.342 189.468 L
619.161 188.033 L
619.171 188.016 L
619.992 186.577 L
620.001 186.563 L
620.816 185.236 L
620.841 185.198 L
621.661 184.066 L
621.668 184.056 L
622.489 183.193 L
622.502 183.182 L
623.323 182.64 L
623.339 182.633 L
624.164 182.429 L
624.176 182.428 L
624.267 182.426 L
625 182.544 L
625.01 182.547 L
625.83 182.931 L
625.842 182.938 L
626.665 183.519 L
626.681 183.532 L
627.495 184.21 L
627.512 184.225 L
628.325 184.913 L
628.348 184.932 L
628.959 185.403 L
S
GR
GS
[0.6 0 0 0.6 0 0] CT
1 0 0 RC
[12 12] 0 setdash
2 LJ
3.333 LW
N
91 285.6 M
91.662 341.583 L
91.667 341.643 L
92.495 344.269 L
92.501 344.27 L
92.544 344.272 L
93.333 343.898 L
93.339 343.893 L
94.152 343.212 L
94.167 343.199 L
94.996 342.399 L
95.001 342.394 L
95.821 341.516 L
95.836 341.499 L
96.663 340.501 L
96.668 340.495 L
97.499 339.313 L
97.508 339.299 L
98.324 337.844 L
98.339 337.814 L
99.157 336.078 L
99.169 336.051 L
99.998 334.045 L
100.014 334.003 L
100.821 331.849 L
100.844 331.783 L
101.663 329.348 L
101.682 329.288 L
102.491 326.518 L
102.505 326.466 L
103.325 323.191 L
103.342 323.119 L
104.156 319.5 L
104.168 319.444 L
104.999 315.706 L
105.004 315.683 L
105.815 312.267 L
105.839 312.168 L
106.66 308.908 L
106.669 308.871 L
107.491 305.671 L
107.507 305.612 L
108.328 302.485 L
108.334 302.463 L
109.152 299.603 L
109.17 299.542 L
109.996 297.161 L
110.004 297.143 L
110.819 295.409 L
110.837 295.377 L
111.649 294.146 L
111.673 294.116 L
112.495 293.278 L
112.504 293.271 L
113.317 292.806 L
113.336 292.8 L
113.913 292.705 L
114.162 292.721 L
114.172 292.723 L
114.995 292.992 L
115.007 292.997 L
115.832 293.495 L
115.852 293.508 L
116.653 294.126 L
116.667 294.138 L
117.477 294.856 L
117.502 294.88 L
118.333 295.692 L
118.344 295.703 L
119.163 296.495 L
119.177 296.507 L
119.998 297.185 L
120.013 297.196 L
120.825 297.676 L
120.841 297.684 L
121.654 297.987 L
121.673 297.991 L
122.491 298.124 L
122.505 298.125 L
122.702 298.131 L
123.328 298.075 L
123.345 298.072 L
124.15 297.829 L
124.175 297.819 L
124.999 297.4 L
125.012 297.393 L
125.823 296.893 L
125.837 296.884 L
126.664 296.328 L
126.68 296.317 L
127.492 295.751 L
127.506 295.741 L
128.324 295.174 L
128.337 295.166 L
129.136 294.697 L
129.168 294.681 L
129.982 294.394 L
130.006 294.389 L
130.497 294.343 L
130.825 294.365 L
130.839 294.367 L
131.663 294.628 L
131.677 294.635 L
132.496 295.231 L
132.512 295.246 L
133.333 296.299 L
133.34 296.311 L
134.166 297.916 L
134.176 297.939 L
134.993 300.074 L
135.006 300.111 L
135.83 302.64 L
135.843 302.685 L
136.663 305.61 L
136.678 305.669 L
137.5 309.135 L
137.508 309.171 L
138.332 313.418 L
138.351 313.527 L
139.165 318.443 L
139.184 318.567 L
139.991 323.925 L
140.001 323.991 L
140.823 329.405 L
140.845 329.549 L
141.665 334.956 L
141.672 335.002 L
142.482 340.551 L
142.501 340.684 L
143.331 346.762 L
143.345 346.865 L
144.16 352.978 L
144.178 353.112 L
145 359.064 L
145.016 359.177 L
145.83 364.281 L
145.838 364.326 L
146.656 368.754 L
146.675 368.85 L
147.488 372.74 L
147.501 372.797 L
148.328 376.193 L
148.339 376.233 L
149.154 378.782 L
149.174 378.835 L
150 380.335 L
150.01 380.345 L
150.592 380.648 L
150.824 380.604 L
150.836 380.6 L
151.661 379.706 L
151.673 379.683 L
152.494 377.597 L
152.508 377.551 L
153.301 374.247 L
153.334 374.082 L
154.163 369.162 L
154.176 369.074 L
154.999 362.812 L
155.013 362.693 L
155.825 355.826 L
155.839 355.71 L
156.664 348.443 L
156.688 348.229 L
157.494 340.811 L
157.502 340.728 L
158.328 332.663 L
158.34 332.539 L
159.161 324.4 L
159.171 324.304 L
159.995 316.639 L
160 316.593 L
160.816 310.426 L
160.835 310.305 L
161.665 305.877 L
161.681 305.809 L
162.499 303.085 L
162.514 303.049 L
163.33 301.818 L
163.334 301.816 L
163.573 301.745 L
164.158 302.142 L
164.173 302.163 L
164.996 304.068 L
165.007 304.103 L
165.817 307.09 L
165.841 307.186 L
166.667 310.706 L
166.678 310.756 L
167.493 314.335 L
167.508 314.399 L
168.333 317.941 L
168.347 317.999 L
169.148 321.048 L
169.171 321.126 L
169.999 323.334 L
170.011 323.358 L
170.826 324.18 L
170.834 324.181 L
170.883 324.184 L
171.659 323.598 L
171.672 323.58 L
172.499 321.695 L
172.504 321.68 L
173.321 318.52 L
173.337 318.447 L
174.167 313.843 L
174.175 313.788 L
174.998 308.065 L
175.014 307.943 L
175.828 301.716 L
175.841 301.622 L
176.666 295.533 L
176.682 295.42 L
177.492 289.766 L
177.511 289.641 L
178.329 284.232 L
178.343 284.139 L
179.162 278.985 L
179.179 278.887 L
179.99 274.433 L
180.001 274.379 L
180.818 270.941 L
180.836 270.882 L
181.653 268.676 L
181.669 268.643 L
182.48 267.389 L
182.505 267.363 L
183.324 266.82 L
183.344 266.815 L
183.68 266.767 L
184.162 266.855 L
184.174 266.859 L
184.987 267.355 L
185 267.366 L
185.826 268.117 L
185.837 268.128 L
186.661 268.896 L
186.673 268.906 L
187.498 269.61 L
187.51 269.619 L
188.333 270.259 L
188.343 270.267 L
189.161 270.897 L
189.17 270.905 L
189.993 271.621 L
190.003 271.63 L
190.804 272.515 L
190.836 272.556 L
191.666 273.829 L
191.681 273.857 L
192.497 275.665 L
192.51 275.698 L
193.302 278.282 L
193.336 278.417 L
194.165 282.417 L
194.189 282.553 L
194.998 287.918 L
195.007 287.987 L
195.82 294.394 L
195.848 294.624 L
196.667 301.756 L
196.682 301.899 L
197.482 309.492 L
197.501 309.681 L
198.33 318.492 L
198.341 318.612 L
199.154 328.127 L
199.171 328.328 L
199.997 338.204 L
200.015 338.413 L
200.822 347.025 L
200.839 347.189 L
201.666 354.318 L
201.689 354.494 L
202.491 359.832 L
202.507 359.924 L
203.331 363.786 L
203.344 363.835 L
204.149 365.607 L
204.169 365.622 L
204.367 365.695 L
204.994 364.947 L
205.008 364.913 L
205.811 361.905 L
205.842 361.751 L
206.64 357.015 L
206.67 356.811 L
207.495 350.499 L
207.507 350.4 L
208.31 343.048 L
208.334 342.814 L
209.16 334.471 L
209.17 334.365 L
209.996 326.126 L
210.007 326.018 L
210.817 319.132 L
210.841 318.953 L
211.662 314.073 L
211.673 314.017 L
212.5 311.107 L
212.511 311.081 L
213.33 310.089 L
213.349 310.088 L
214.164 311.094 L
214.177 311.127 L
214.98 314.081 L
215.013 314.241 L
215.83 318.899 L
215.834 318.925 L
216.659 324.346 L
216.676 324.465 L
217.486 330.102 L
217.501 330.202 L
218.323 336.1 L
218.338 336.207 L
219.154 342.052 L
219.168 342.15 L
220 347.49 L
220.015 347.581 L
220.831 351.623 L
220.864 351.75 L
221.656 354.102 L
221.672 354.136 L
222.499 355.172 L
222.515 355.179 L
222.763 355.233 L
223.329 354.939 L
223.341 354.926 L
224.166 353.446 L
224.181 353.408 L
224.992 350.868 L
225.008 350.808 L
225.832 347.465 L
225.844 347.414 L
226.657 344.038 L
226.669 343.988 L
227.494 340.797 L
227.505 340.757 L
228.333 337.939 L
228.348 337.891 L
229.156 335.694 L
229.169 335.664 L
230 334.348 L
230.005 334.343 L
230.463 334.138 L
230.83 334.267 L
230.845 334.277 L
231.654 335.409 L
231.669 335.439 L
232.493 337.594 L
232.514 337.659 L
233.327 340.639 L
233.338 340.685 L
234.15 344.459 L
234.171 344.566 L
234.991 348.877 L
235.007 348.962 L
235.825 353.249 L
235.838 353.31 L
236.662 356.804 L
236.667 356.823 L
237.488 359.154 L
237.502 359.183 L
238.324 360.226 L
238.337 360.231 L
238.502 360.263 L
239.164 359.708 L
239.173 359.694 L
239.985 357.309 L
240.013 357.192 L
240.827 352.724 L
240.834 352.682 L
241.665 346.488 L
241.676 346.399 L
242.499 339.26 L
242.511 339.146 L
243.323 331.291 L
243.334 331.178 L
244.163 322.211 L
244.176 322.061 L
244.995 312.595 L
245.008 312.447 L
245.823 303.141 L
245.837 302.996 L
246.664 294.796 L
246.684 294.627 L
247.495 288.461 L
247.508 288.378 L
248.326 283.828 L
248.341 283.759 L
249.163 280.682 L
249.177 280.642 L
250 279.052 L
250.014 279.038 L
250.438 278.84 L
250.831 279.006 L
250.844 279.017 L
251.665 280.229 L
251.678 280.254 L
252.495 282.042 L
252.506 282.066 L
253.327 283.881 L
253.343 283.913 L
254.16 285.239 L
254.179 285.259 L
254.699 285.553 L
254.983 285.44 L
255 285.426 L
255.822 283.575 L
255.838 283.511 L
256.665 278.98 L
256.682 278.859 L
257.498 271.781 L
257.507 271.682 L
258.333 261.727 L
258.34 261.634 L
259.157 248.383 L
259.172 248.094 L
259.995 230.41 L
260.003 230.231 L
260.83 208.576 L
260.835 208.461 L
261.66 185.689 L
261.674 185.284 L
262.495 162.575 L
262.51 162.153 L
263.329 139.756 L
263.354 139.072 L
264.146 116.917 L
264.169 116.281 L
264.989 94.388 L
265.002 94.072 L
265.822 76.156 L
265.838 75.865 L
266.657 62.917 L
266.677 62.662 L
267.493 54.989 L
267.504 54.923 L
268.264 52.579 L
268.328 52.6 L
268.337 52.606 L
269.155 56.324 L
269.176 56.498 L
269.997 66.449 L
270.009 66.636 L
270.83 82.069 L
270.838 82.255 L
271.659 101.979 L
271.681 102.563 L
272.485 125.2 L
272.504 125.79 L
273.322 152.33 L
273.34 152.95 L
274.151 182.963 L
274.171 183.714 L
275 214.333 L
275.011 214.732 L
275.828 242.055 L
275.843 242.495 L
276.653 265.953 L
276.668 266.343 L
277.493 286.436 L
277.506 286.738 L
278.325 303.452 L
278.35 303.909 L
279.161 316.457 L
279.168 316.54 L
279.995 324.091 L
280.006 324.148 L
280.684 325.94 L
280.832 325.868 L
280.847 325.853 L
281.649 322.976 L
281.669 322.857 L
282.497 316.254 L
282.507 316.156 L
283.326 306.378 L
283.337 306.231 L
284.159 293.776 L
284.169 293.619 L
284.997 279.716 L
285.025 279.248 L
285.832 266.736 L
285.845 266.561 L
286.653 256.144 L
286.676 255.883 L
287.491 247.71 L
287.508 247.563 L
288.331 241.564 L
288.343 241.495 L
289.166 238.219 L
289.182 238.186 L
289.61 237.755 L
289.998 238.11 L
290.003 238.119 L
290.825 240.817 L
290.835 240.866 L
291.661 245.607 L
291.676 245.708 L
292.499 251.876 L
292.514 251.994 L
293.331 259.478 L
293.341 259.57 L
294.152 267.877 L
294.167 268.032 L
294.999 276.499 L
295.009 276.592 L
295.833 283.691 L
295.846 283.797 L
296.659 289.497 L
296.675 289.601 L
297.488 294.14 L
297.512 294.26 L
298.329 297.882 L
298.342 297.933 L
299.157 300.508 L
299.169 300.54 L
299.989 302.045 L
300.005 302.064 L
300.825 302.632 L
300.836 302.635 L
301.3 302.697 L
301.664 302.668 L
301.68 302.665 L
302.496 302.472 L
302.508 302.469 L
303.333 302.272 L
303.347 302.27 L
303.72 302.241 L
304.166 302.291 L
304.175 302.293 L
304.978 302.693 L
305.007 302.714 L
305.821 303.523 L
305.838 303.543 L
306.655 304.697 L
306.671 304.723 L
307.495 306.167 L
307.512 306.199 L
308.328 307.895 L
308.349 307.938 L
309.158 309.699 L
309.17 309.724 L
309.998 311.326 L
310.01 311.345 L
310.82 312.385 L
310.836 312.4 L
311.66 312.829 L
311.672 312.83 L
311.79 312.837 L
312.491 312.579 L
312.5 312.572 L
313.322 311.514 L
313.336 311.488 L
314.162 309.489 L
314.173 309.456 L
314.983 306.591 L
315.014 306.47 L
315.832 303.044 L
315.844 302.99 L
316.66 299.264 L
316.677 299.182 L
317.494 295.204 L
317.517 295.088 L
318.331 290.744 L
318.346 290.659 L
319.158 286.129 L
319.168 286.07 L
319.995 281.574 L
320.008 281.507 L
320.833 277.715 L
320.85 277.645 L
321.658 274.648 L
321.674 274.596 L
322.493 272.178 L
322.515 272.119 L
323.321 270.207 L
323.336 270.176 L
324.165 268.74 L
324.179 268.72 L
324.998 267.89 L
325.013 267.88 L
325.832 267.61 L
325.837 267.61 L
325.951 267.606 L
326.666 267.725 L
326.678 267.728 L
327.493 268.086 L
327.51 268.095 L
328.332 268.629 L
328.34 268.636 L
329.154 269.249 L
329.18 269.268 L
329.988 269.846 L
330.004 269.856 L
330.811 270.286 L
330.837 270.297 L
331.658 270.574 L
331.674 270.577 L
332.484 270.704 L
332.514 270.706 L
332.861 270.718 L
333.326 270.697 L
333.337 270.696 L
334.164 270.565 L
334.181 270.562 L
334.998 270.36 L
335.013 270.356 L
335.828 270.164 L
335.84 270.161 L
336.652 270.027 L
336.667 270.025 L
337.36 269.985 L
337.492 269.987 L
337.51 269.987 L
338.327 270.094 L
338.337 270.096 L
339.158 270.394 L
339.169 270.4 L
339.996 270.898 L
340.007 270.906 L
340.824 271.532 L
340.843 271.548 L
341.661 272.283 L
341.678 272.299 L
342.491 273.127 L
342.5 273.137 L
343.326 274.093 L
343.34 274.11 L
344.166 275.112 L
344.181 275.13 L
344.991 276.029 L
345.001 276.039 L
345.83 276.771 L
345.843 276.781 L
346.667 277.321 L
346.678 277.327 L
347.485 277.673 L
347.515 277.683 L
348.311 277.817 L
348.339 277.817 L
348.359 277.817 L
349.155 277.684 L
349.17 277.678 L
349.987 277.269 L
350.017 277.249 L
350.821 276.631 L
350.848 276.607 L
351.647 275.81 L
351.671 275.783 L
352.482 274.78 L
352.501 274.753 L
353.322 273.517 L
353.339 273.489 L
354.157 272.104 L
354.183 272.06 L
354.995 270.718 L
355.009 270.695 L
355.832 269.474 L
355.849 269.451 L
356.662 268.387 L
356.667 268.38 L
357.489 267.428 L
357.503 267.413 L
358.332 266.615 L
358.345 266.605 L
359.162 266.073 L
359.176 266.066 L
359.99 265.852 L
360.008 265.85 L
360.201 265.842 L
360.833 265.914 L
360.856 265.92 L
361.666 266.205 L
361.692 266.218 L
362.487 266.693 L
362.501 266.702 L
363.324 267.36 L
363.337 267.371 L
364.155 268.103 L
364.182 268.127 L
364.985 268.764 L
365.01 268.781 L
365.833 269.283 L
365.849 269.291 L
366.663 269.603 L
366.671 269.605 L
367.388 269.704 L
367.488 269.702 L
367.512 269.701 L
368.33 269.506 L
368.339 269.501 L
369.16 268.973 L
369.172 268.963 L
369.998 268.168 L
370.014 268.151 L
370.828 267.167 L
370.838 267.153 L
371.665 265.987 L
371.676 265.969 L
372.486 264.633 L
372.501 264.607 L
373.329 263.113 L
373.344 263.086 L
374.165 261.636 L
374.181 261.611 L
374.998 260.405 L
375.01 260.389 L
375.826 259.423 L
375.835 259.414 L
376.663 258.671 L
376.671 258.665 L
377.49 258.157 L
377.507 258.149 L
378.321 257.934 L
378.334 257.933 L
378.456 257.929 L
379.159 258.047 L
379.19 258.057 L
379.988 258.445 L
380.003 258.455 L
380.823 259.08 L
380.839 259.095 L
381.658 259.928 L
381.677 259.95 L
382.493 261.021 L
382.503 261.036 L
383.327 262.315 L
383.343 262.342 L
384.161 263.671 L
384.171 263.687 L
384.997 264.958 L
385.032 265.009 L
385.817 266.152 L
385.837 266.181 L
386.652 267.33 L
386.67 267.354 L
387.495 268.512 L
387.506 268.528 L
388.333 269.621 L
388.352 269.645 L
389.165 270.553 L
389.191 270.578 L
389.998 271.288 L
390.017 271.303 L
390.823 271.878 L
390.843 271.89 L
391.657 272.385 L
391.675 272.395 L
392.496 272.841 L
392.531 272.859 L
393.331 273.241 L
393.35 273.249 L
394.159 273.572 L
394.169 273.575 L
394.997 273.856 L
395.007 273.86 L
395.823 274.116 L
395.838 274.12 L
396.661 274.385 L
396.668 274.387 L
397.495 274.675 L
397.502 274.677 L
398.333 274.979 L
398.344 274.983 L
399.155 275.26 L
399.167 275.263 L
399.991 275.513 L
400.003 275.517 L
400.828 275.738 L
400.842 275.742 L
401.663 275.939 L
401.677 275.942 L
402.483 276.103 L
402.5 276.106 L
403.329 276.219 L
403.338 276.22 L
404.162 276.268 L
404.176 276.268 L
404.45 276.271 L
404.999 276.26 L
405.016 276.26 L
405.823 276.213 L
405.839 276.212 L
406.661 276.136 L
406.672 276.135 L
407.487 276.05 L
407.502 276.048 L
408.324 275.985 L
408.335 275.984 L
408.802 275.973 L
409.15 275.98 L
409.167 275.981 L
409.999 276.059 L
410.003 276.06 L
410.823 276.239 L
410.834 276.242 L
411.66 276.569 L
411.68 276.579 L
412.494 277.084 L
412.507 277.094 L
413.322 277.792 L
413.334 277.803 L
414.163 278.631 L
414.181 278.649 L
414.993 279.557 L
415.007 279.574 L
415.827 280.587 L
415.843 280.609 L
416.661 281.772 L
416.671 281.788 L
417.495 283.081 L
417.511 283.107 L
418.321 284.411 L
418.334 284.432 L
419.165 285.639 L
419.178 285.657 L
419.999 286.728 L
420.016 286.748 L
420.824 287.707 L
420.837 287.722 L
421.658 288.651 L
421.673 288.668 L
422.497 289.51 L
422.512 289.524 L
423.333 290.212 L
423.345 290.22 L
424.165 290.693 L
424.173 290.696 L
424.991 290.983 L
425.008 290.987 L
425.826 291.104 L
425.837 291.104 L
425.973 291.107 L
426.666 291.035 L
426.678 291.033 L
427.495 290.742 L
427.505 290.737 L
428.331 290.201 L
428.344 290.191 L
429.154 289.483 L
429.17 289.467 L
429.991 288.569 L
430.015 288.541 L
430.823 287.455 L
430.837 287.433 L
431.661 286.036 L
431.675 286.009 L
432.498 284.327 L
432.506 284.309 L
433.33 282.432 L
433.336 282.417 L
434.162 280.533 L
434.187 280.477 L
434.997 278.613 L
435.009 278.585 L
435.822 276.656 L
435.838 276.618 L
436.661 274.525 L
436.672 274.497 L
437.492 272.389 L
437.504 272.361 L
438.319 270.475 L
438.335 270.441 L
439.156 268.951 L
439.17 268.928 L
439.999 267.83 L
440.016 267.811 L
440.833 267.153 L
440.85 267.144 L
441.457 266.982 L
441.663 267.003 L
441.672 267.005 L
442.5 267.553 L
442.507 267.561 L
443.325 268.801 L
443.342 268.832 L
444.156 270.638 L
444.172 270.678 L
444.996 273.022 L
445.005 273.052 L
445.831 275.942 L
445.838 275.97 L
446.656 279.384 L
446.67 279.443 L
447.498 283.162 L
447.508 283.206 L
448.325 286.519 L
448.336 286.557 L
449.145 289.105 L
449.178 289.191 L
449.997 290.845 L
450.003 290.854 L
450.743 291.404 L
450.831 291.396 L
450.867 291.388 L
451.658 290.363 L
451.689 290.288 L
452.497 287.208 L
452.511 287.14 L
453.329 282.046 L
453.342 281.957 L
454.16 275.216 L
454.174 275.089 L
454.99 266.825 L
455.009 266.614 L
455.828 256.377 L
455.84 256.206 L
456.66 244.034 L
456.678 243.744 L
457.497 230.645 L
457.506 230.496 L
458.323 218.491 L
458.337 218.299 L
459.159 207.895 L
459.172 207.747 L
459.99 199.367 L
460.003 199.249 L
460.828 193.002 L
460.842 192.921 L
461.657 190.024 L
461.667 190.013 L
461.822 189.936 L
462.499 191.402 L
462.505 191.427 L
463.323 196.891 L
463.335 196.998 L
464.157 206.204 L
464.18 206.511 L
464.994 219.089 L
465.009 219.358 L
465.826 236.061 L
465.837 236.302 L
466.662 256.536 L
466.672 256.793 L
467.498 277.827 L
467.509 278.1 L
468.327 297.482 L
468.338 297.745 L
469.156 315.347 L
469.171 315.661 L
469.998 331.559 L
470.015 331.87 L
470.828 345.664 L
470.84 345.837 L
471.652 356.455 L
471.671 356.665 L
472.496 363.023 L
472.513 363.101 L
473.247 364.736 L
473.325 364.718 L
473.337 364.713 L
474.144 362.541 L
474.176 362.387 L
475 356.554 L
475.008 356.475 L
475.828 347.286 L
475.839 347.139 L
476.66 335.149 L
476.671 334.979 L
477.499 321.2 L
477.512 320.987 L
478.328 307.903 L
478.352 307.534 L
479.162 295.572 L
479.178 295.349 L
479.995 284.467 L
480.007 284.321 L
480.817 274.525 L
480.834 274.346 L
481.664 266.146 L
481.673 266.066 L
482.491 260.535 L
482.506 260.461 L
483.33 257.887 L
483.365 257.835 L
483.808 257.524 L
484.163 257.707 L
484.177 257.722 L
484.993 259.444 L
485.009 259.494 L
485.822 262.921 L
485.835 262.986 L
486.663 267.913 L
486.679 268.018 L
487.491 273.578 L
487.503 273.658 L
488.329 279.006 L
488.338 279.066 L
489.154 283.805 L
489.174 283.909 L
489.999 288.028 L
490.016 288.108 L
490.826 291.472 L
490.839 291.516 L
491.658 293.864 L
491.668 293.884 L
492.495 294.885 L
492.504 294.888 L
492.679 294.916 L
493.331 294.552 L
493.359 294.521 L
494.153 293.192 L
494.175 293.142 L
494.994 290.932 L
495 290.911 L
495.826 287.854 L
495.841 287.793 L
496.661 284.181 L
496.672 284.13 L
497.486 280.437 L
497.502 280.369 L
498.328 277.121 L
498.347 277.053 L
499.162 274.444 L
499.178 274.397 L
499.987 272.427 L
500.016 272.368 L
500.83 271.11 L
500.836 271.104 L
501.469 270.78 L
501.663 270.81 L
501.674 270.814 L
502.5 271.625 L
502.51 271.642 L
503.331 273.352 L
503.341 273.377 L
504.165 275.832 L
504.178 275.878 L
504.994 278.987 L
505.002 279.022 L
505.83 282.888 L
505.84 282.937 L
506.66 287.19 L
506.675 287.27 L
507.5 291.388 L
507.511 291.44 L
508.331 294.9 L
508.343 294.949 L
509.161 297.739 L
509.177 297.785 L
509.99 299.897 L
510.013 299.946 L
510.829 301.279 L
510.841 301.292 L
511.49 301.634 L
511.647 301.613 L
511.674 301.606 L
512.492 300.863 L
512.516 300.828 L
513.331 299.274 L
513.339 299.255 L
514.158 297.127 L
514.169 297.094 L
514.976 294.576 L
515.008 294.467 L
515.832 291.624 L
515.848 291.567 L
516.665 288.928 L
516.676 288.895 L
517.487 287.008 L
517.506 286.975 L
518.325 286.155 L
518.334 286.152 L
518.519 286.123 L
519.156 286.474 L
519.167 286.486 L
519.991 288.087 L
520.003 288.119 L
520.825 291.214 L
520.839 291.283 L
521.662 295.87 L
521.673 295.936 L
522.484 301.356 L
522.502 301.479 L
523.328 307.155 L
523.338 307.223 L
524.152 312.677 L
524.167 312.773 L
524.987 317.946 L
525.012 318.095 L
525.828 322.49 L
525.839 322.54 L
526.653 325.37 L
526.667 325.401 L
527.258 326.052 L
527.49 325.961 L
527.507 325.946 L
528.316 324.108 L
528.339 324.025 L
529.161 319.814 L
529.178 319.701 L
529.997 312.934 L
530.013 312.769 L
530.83 303.196 L
530.85 302.927 L
531.661 290.878 L
531.679 290.59 L
532.492 277.092 L
532.505 276.877 L
533.332 263.333 L
533.364 262.809 L
534.161 250.175 L
534.175 249.956 L
534.998 237.29 L
535.018 236.981 L
535.829 224.913 L
535.834 224.843 L
536.662 214.17 L
536.688 213.888 L
537.494 206.633 L
537.506 206.548 L
538.318 202.458 L
538.334 202.403 L
539.119 201.171 L
539.164 201.174 L
539.179 201.177 L
539.984 202.645 L
540.005 202.72 L
540.829 207.071 L
540.841 207.159 L
541.656 213.775 L
541.669 213.893 L
542.486 221.697 L
542.504 221.871 L
543.326 230.234 L
543.336 230.338 L
544.153 238.776 L
544.17 238.946 L
544.983 247.574 L
545.001 247.769 L
545.822 256.316 L
545.848 256.585 L
546.653 263.959 L
546.667 264.074 L
547.495 269.792 L
547.508 269.867 L
548.325 273.907 L
548.336 273.955 L
549.153 276.714 L
549.168 276.755 L
549.99 278.522 L
550.002 278.54 L
550.825 279.35 L
550.84 279.357 L
551.21 279.435 L
551.65 279.345 L
551.672 279.337 L
552.489 278.828 L
552.502 278.818 L
553.32 278.129 L
553.357 278.097 L
554.162 277.444 L
554.184 277.428 L
554.974 276.931 L
555.01 276.913 L
555.825 276.712 L
555.835 276.712 L
556.659 276.923 L
556.676 276.931 L
557.498 277.507 L
557.516 277.522 L
558.329 278.354 L
558.341 278.367 L
559.162 279.384 L
559.173 279.398 L
559.99 280.543 L
560.003 280.562 L
560.825 281.69 L
560.836 281.704 L
561.66 282.591 L
561.669 282.599 L
562.497 283.07 L
562.525 283.079 L
563.004 283.149 L
563.315 283.119 L
563.337 283.115 L
564.158 282.736 L
564.177 282.722 L
565 281.872 L
565.013 281.855 L
565.831 280.575 L
565.846 280.548 L
566.657 279.026 L
566.667 279.006 L
567.498 277.49 L
567.514 277.463 L
568.321 276.16 L
568.334 276.141 L
569.161 275.096 L
569.177 275.079 L
569.997 274.482 L
570.009 274.478 L
570.327 274.421 L
570.824 274.57 L
570.837 274.578 L
571.654 275.49 L
571.673 275.519 L
572.5 277.171 L
572.513 277.202 L
573.332 279.455 L
573.343 279.489 L
574.163 282.322 L
574.176 282.376 L
574.995 285.767 L
575.027 285.909 L
575.829 289.456 L
575.84 289.504 L
576.661 292.771 L
576.676 292.825 L
577.496 295.249 L
577.509 295.282 L
578.332 296.771 L
578.343 296.784 L
579.036 297.207 L
579.153 297.193 L
579.172 297.188 L
579.989 296.228 L
580.004 296.195 L
580.83 293.512 L
580.837 293.481 L
581.659 289.228 L
581.671 289.158 L
582.498 283.721 L
582.513 283.607 L
583.324 277.261 L
583.338 277.145 L
584.158 269.532 L
584.173 269.379 L
584.994 260.422 L
585.008 260.268 L
585.833 250.421 L
585.842 250.318 L
586.665 240.92 L
586.676 240.796 L
587.484 232.46 L
587.509 232.214 L
588.32 224.655 L
588.335 224.519 L
589.161 217.317 L
589.176 217.189 L
589.996 210.659 L
590.006 210.586 L
590.822 205.362 L
590.837 205.279 L
591.656 201.646 L
591.667 201.607 L
592.489 199.294 L
592.504 199.263 L
593.322 198.024 L
593.346 198 L
594.151 197.621 L
594.156 197.621 L
594.171 197.621 L
594.994 198.006 L
595.005 198.015 L
595.825 198.927 L
595.836 198.941 L
596.656 200.06 L
596.693 200.112 L
597.5 201.209 L
597.503 201.212 L
598.321 202.184 L
598.338 202.202 L
599.157 202.943 L
599.17 202.951 L
599.992 203.288 L
600.005 203.289 L
600.14 203.296 L
600.824 203.132 L
600.836 203.126 L
601.666 202.525 L
601.68 202.512 L
602.499 201.562 L
602.509 201.548 L
603.321 200.297 L
603.339 200.265 L
604.156 198.695 L
604.167 198.673 L
604.99 196.972 L
605.002 196.948 L
605.823 195.391 L
605.847 195.35 L
606.662 194.044 L
606.676 194.024 L
607.485 192.986 L
607.502 192.968 L
608.321 192.17 L
608.334 192.16 L
609.158 191.654 L
609.172 191.649 L
609.961 191.5 L
609.977 191.5 L
610.006 191.5 L
610.823 191.643 L
610.839 191.648 L
611.65 191.976 L
611.668 191.985 L
612.498 192.421 L
612.503 192.425 L
613.329 192.898 L
613.336 192.902 L
614.161 193.308 L
614.174 193.313 L
614.996 193.517 L
615.008 193.518 L
615.243 193.53 L
615.833 193.463 L
615.847 193.46 L
616.666 193.136 L
616.678 193.129 L
617.494 192.532 L
617.515 192.512 L
618.332 191.583 L
618.342 191.569 L
619.161 190.353 L
619.171 190.337 L
619.992 189 L
620.001 188.987 L
620.816 187.665 L
620.841 187.625 L
621.661 186.359 L
621.668 186.347 L
622.489 185.164 L
622.502 185.146 L
623.323 184.074 L
623.339 184.054 L
624.164 183.253 L
624.176 183.244 L
625 182.801 L
625.01 182.798 L
625.776 182.676 L
625.83 182.676 L
625.842 182.677 L
626.665 182.822 L
626.681 182.827 L
627.495 183.202 L
627.512 183.212 L
628.325 183.785 L
628.348 183.803 L
628.959 184.29 L
S
GR
GS
[0.6 0 0 0.6 0 0] CT
1 GC
N
621 118 M
621 52 L
433 52 L
433 118 L
cp
f
GR
GS
[0.6 0 0 0.6 295.09693 41.76] CT
/Helvetica 23.333 F
GS
[1 0 0 1 0 0] CT
0 9 moveto 
1 -1 scale
(Model) t 
GR
GR
GS
[0.6 0 0 0.6 0 0] CT
0 0 1 RC
1 LJ
3.333 LW
N
438.007 69.6 M
488.073 69.6 L
S
GR
GS
[0.6 0 0 0.6 295.09693 60.24] CT
/Helvetica 23.333 F
GS
[1 0 0 1 0 0] CT
0 9 moveto 
1 -1 scale
(Pozorovatel) t 
GR
GR
GS
[0.6 0 0 0.6 0 0] CT
1 0 0 RC
[12 12] 0 setdash
2 LJ
3.333 LW
N
438.007 100.4 M
488.073 100.4 L
S
GR
GS
[0.6 0 0 0.6 0 0] CT
0.149 GC
10.0 ML
0.833 LW
N
433 118 M
433 52 L
621 52 L
621 118 L
cp
S
GR
%%Trailer
%%Pages: 1
%%EOF
