%!PS-Adobe-3.0 EPSF-3.0
%%Creator: (MATLAB, The Mathworks, Inc. Version 9.14.0.2206163 \(R2023a\). Operating System: Windows 10)
%%Title: C:/Users/radac/Desktop/Bachelor_thesis/thesis/Model/figs/model_fm.eps
%%CreationDate: 2023-05-20T19:24:28
%%Pages: (atend)
%%BoundingBox:     0     0   420   315
%%LanguageLevel: 3
%%EndComments
%%BeginProlog
%%BeginResource: procset (Apache XML Graphics Std ProcSet) 1.2 0
%%Version: 1.2 0
%%Copyright: (Copyright 2001-2003,2010 The Apache Software Foundation. License terms: http://www.apache.org/licenses/LICENSE-2.0)
/bd{bind def}bind def
/ld{load def}bd
/GR/grestore ld
/GS/gsave ld
/RM/rmoveto ld
/C/curveto ld
/t/show ld
/L/lineto ld
/ML/setmiterlimit ld
/CT/concat ld
/f/fill ld
/N/newpath ld
/S/stroke ld
/CC/setcmykcolor ld
/A/ashow ld
/cp/closepath ld
/RC/setrgbcolor ld
/LJ/setlinejoin ld
/GC/setgray ld
/LW/setlinewidth ld
/M/moveto ld
/re {4 2 roll M
1 index 0 rlineto
0 exch rlineto
neg 0 rlineto
cp } bd
/_ctm matrix def
/_tm matrix def
/BT { _ctm currentmatrix pop matrix _tm copy pop 0 0 moveto } bd
/ET { _ctm setmatrix } bd
/iTm { _ctm setmatrix _tm concat } bd
/Tm { _tm astore pop iTm 0 0 moveto } bd
/ux 0.0 def
/uy 0.0 def
/F {
  /Tp exch def
  /Tf exch def
  Tf findfont Tp scalefont setfont
  /cf Tf def  /cs Tp def
} bd
/ULS {currentpoint /uy exch def /ux exch def} bd
/ULE {
  /Tcx currentpoint pop def
  gsave
  newpath
  cf findfont cs scalefont dup
  /FontMatrix get 0 get /Ts exch def /FontInfo get dup
  /UnderlinePosition get Ts mul /To exch def
  /UnderlineThickness get Ts mul /Tt exch def
  ux uy To add moveto  Tcx uy To add lineto
  Tt setlinewidth stroke
  grestore
} bd
/OLE {
  /Tcx currentpoint pop def
  gsave
  newpath
  cf findfont cs scalefont dup
  /FontMatrix get 0 get /Ts exch def /FontInfo get dup
  /UnderlinePosition get Ts mul /To exch def
  /UnderlineThickness get Ts mul /Tt exch def
  ux uy To add cs add moveto Tcx uy To add cs add lineto
  Tt setlinewidth stroke
  grestore
} bd
/SOE {
  /Tcx currentpoint pop def
  gsave
  newpath
  cf findfont cs scalefont dup
  /FontMatrix get 0 get /Ts exch def /FontInfo get dup
  /UnderlinePosition get Ts mul /To exch def
  /UnderlineThickness get Ts mul /Tt exch def
  ux uy To add cs 10 mul 26 idiv add moveto Tcx uy To add cs 10 mul 26 idiv add lineto
  Tt setlinewidth stroke
  grestore
} bd
/QT {
/Y22 exch store
/X22 exch store
/Y21 exch store
/X21 exch store
currentpoint
/Y21 load 2 mul add 3 div exch
/X21 load 2 mul add 3 div exch
/X21 load 2 mul /X22 load add 3 div
/Y21 load 2 mul /Y22 load add 3 div
/X22 load /Y22 load curveto
} bd
/SSPD {
dup length /d exch dict def
{
/v exch def
/k exch def
currentpagedevice k known {
/cpdv currentpagedevice k get def
v cpdv ne {
/upd false def
/nullv v type /nulltype eq def
/nullcpdv cpdv type /nulltype eq def
nullv nullcpdv or
{
/upd true def
} {
/sametype v type cpdv type eq def
sametype {
v type /arraytype eq {
/vlen v length def
/cpdvlen cpdv length def
vlen cpdvlen eq {
0 1 vlen 1 sub {
/i exch def
/obj v i get def
/cpdobj cpdv i get def
obj cpdobj ne {
/upd true def
exit
} if
} for
} {
/upd true def
} ifelse
} {
v type /dicttype eq {
v {
/dv exch def
/dk exch def
/cpddv cpdv dk get def
dv cpddv ne {
/upd true def
exit
} if
} forall
} {
/upd true def
} ifelse
} ifelse
} if
} ifelse
upd true eq {
d k v put
} if
} if
} if
} forall
d length 0 gt {
d setpagedevice
} if
} bd
/RE { % /NewFontName [NewEncodingArray] /FontName RE -
  findfont dup length dict begin
  {
    1 index /FID ne
    {def} {pop pop} ifelse
  } forall
  /Encoding exch def
  /FontName 1 index def
  currentdict definefont pop
  end
} bind def
%%EndResource
%%BeginResource: procset (Apache XML Graphics EPS ProcSet) 1.0 0
%%Version: 1.0 0
%%Copyright: (Copyright 2002-2003 The Apache Software Foundation. License terms: http://www.apache.org/licenses/LICENSE-2.0)
/BeginEPSF { %def
/b4_Inc_state save def         % Save state for cleanup
/dict_count countdictstack def % Count objects on dict stack
/op_count count 1 sub def      % Count objects on operand stack
userdict begin                 % Push userdict on dict stack
/showpage { } def              % Redefine showpage, { } = null proc
0 setgray 0 setlinecap         % Prepare graphics state
1 setlinewidth 0 setlinejoin
10 setmiterlimit [ ] 0 setdash newpath
/languagelevel where           % If level not equal to 1 then
{pop languagelevel             % set strokeadjust and
1 ne                           % overprint to their defaults.
{false setstrokeadjust false setoverprint
} if
} if
} bd
/EndEPSF { %def
count op_count sub {pop} repeat            % Clean up stacks
countdictstack dict_count sub {end} repeat
b4_Inc_state restore
} bd
%%EndResource
%FOPBeginFontDict
%%IncludeResource: font Courier-Oblique
%%IncludeResource: font Courier-BoldOblique
%%IncludeResource: font Courier-Bold
%%IncludeResource: font ZapfDingbats
%%IncludeResource: font Symbol
%%IncludeResource: font Helvetica
%%IncludeResource: font Helvetica-Oblique
%%IncludeResource: font Helvetica-Bold
%%IncludeResource: font Helvetica-BoldOblique
%%IncludeResource: font Times-Roman
%%IncludeResource: font Times-Italic
%%IncludeResource: font Times-Bold
%%IncludeResource: font Times-BoldItalic
%%IncludeResource: font Courier
%FOPEndFontDict
%%BeginResource: encoding WinAnsiEncoding
/WinAnsiEncoding [
/.notdef /.notdef /.notdef /.notdef /.notdef
/.notdef /.notdef /.notdef /.notdef /.notdef
/.notdef /.notdef /.notdef /.notdef /.notdef
/.notdef /.notdef /.notdef /.notdef /.notdef
/.notdef /.notdef /.notdef /.notdef /.notdef
/.notdef /.notdef /.notdef /.notdef /.notdef
/.notdef /.notdef /space /exclam /quotedbl
/numbersign /dollar /percent /ampersand /quotesingle
/parenleft /parenright /asterisk /plus /comma
/hyphen /period /slash /zero /one
/two /three /four /five /six
/seven /eight /nine /colon /semicolon
/less /equal /greater /question /at
/A /B /C /D /E
/F /G /H /I /J
/K /L /M /N /O
/P /Q /R /S /T
/U /V /W /X /Y
/Z /bracketleft /backslash /bracketright /asciicircum
/underscore /quoteleft /a /b /c
/d /e /f /g /h
/i /j /k /l /m
/n /o /p /q /r
/s /t /u /v /w
/x /y /z /braceleft /bar
/braceright /asciitilde /bullet /Euro /bullet
/quotesinglbase /florin /quotedblbase /ellipsis /dagger
/daggerdbl /circumflex /perthousand /Scaron /guilsinglleft
/OE /bullet /Zcaron /bullet /bullet
/quoteleft /quoteright /quotedblleft /quotedblright /bullet
/endash /emdash /asciitilde /trademark /scaron
/guilsinglright /oe /bullet /zcaron /Ydieresis
/space /exclamdown /cent /sterling /currency
/yen /brokenbar /section /dieresis /copyright
/ordfeminine /guillemotleft /logicalnot /sfthyphen /registered
/macron /degree /plusminus /twosuperior /threesuperior
/acute /mu /paragraph /middot /cedilla
/onesuperior /ordmasculine /guillemotright /onequarter /onehalf
/threequarters /questiondown /Agrave /Aacute /Acircumflex
/Atilde /Adieresis /Aring /AE /Ccedilla
/Egrave /Eacute /Ecircumflex /Edieresis /Igrave
/Iacute /Icircumflex /Idieresis /Eth /Ntilde
/Ograve /Oacute /Ocircumflex /Otilde /Odieresis
/multiply /Oslash /Ugrave /Uacute /Ucircumflex
/Udieresis /Yacute /Thorn /germandbls /agrave
/aacute /acircumflex /atilde /adieresis /aring
/ae /ccedilla /egrave /eacute /ecircumflex
/edieresis /igrave /iacute /icircumflex /idieresis
/eth /ntilde /ograve /oacute /ocircumflex
/otilde /odieresis /divide /oslash /ugrave
/uacute /ucircumflex /udieresis /yacute /thorn
/ydieresis
] def
%%EndResource
%FOPBeginFontReencode
/Courier-Oblique findfont
dup length dict begin
  {1 index /FID ne {def} {pop pop} ifelse} forall
  /Encoding WinAnsiEncoding def
  currentdict
end
/Courier-Oblique exch definefont pop
/Courier-BoldOblique findfont
dup length dict begin
  {1 index /FID ne {def} {pop pop} ifelse} forall
  /Encoding WinAnsiEncoding def
  currentdict
end
/Courier-BoldOblique exch definefont pop
/Courier-Bold findfont
dup length dict begin
  {1 index /FID ne {def} {pop pop} ifelse} forall
  /Encoding WinAnsiEncoding def
  currentdict
end
/Courier-Bold exch definefont pop
/Helvetica findfont
dup length dict begin
  {1 index /FID ne {def} {pop pop} ifelse} forall
  /Encoding WinAnsiEncoding def
  currentdict
end
/Helvetica exch definefont pop
/Helvetica-Oblique findfont
dup length dict begin
  {1 index /FID ne {def} {pop pop} ifelse} forall
  /Encoding WinAnsiEncoding def
  currentdict
end
/Helvetica-Oblique exch definefont pop
/Helvetica-Bold findfont
dup length dict begin
  {1 index /FID ne {def} {pop pop} ifelse} forall
  /Encoding WinAnsiEncoding def
  currentdict
end
/Helvetica-Bold exch definefont pop
/Helvetica-BoldOblique findfont
dup length dict begin
  {1 index /FID ne {def} {pop pop} ifelse} forall
  /Encoding WinAnsiEncoding def
  currentdict
end
/Helvetica-BoldOblique exch definefont pop
/Times-Roman findfont
dup length dict begin
  {1 index /FID ne {def} {pop pop} ifelse} forall
  /Encoding WinAnsiEncoding def
  currentdict
end
/Times-Roman exch definefont pop
/Times-Italic findfont
dup length dict begin
  {1 index /FID ne {def} {pop pop} ifelse} forall
  /Encoding WinAnsiEncoding def
  currentdict
end
/Times-Italic exch definefont pop
/Times-Bold findfont
dup length dict begin
  {1 index /FID ne {def} {pop pop} ifelse} forall
  /Encoding WinAnsiEncoding def
  currentdict
end
/Times-Bold exch definefont pop
/Times-BoldItalic findfont
dup length dict begin
  {1 index /FID ne {def} {pop pop} ifelse} forall
  /Encoding WinAnsiEncoding def
  currentdict
end
/Times-BoldItalic exch definefont pop
/Courier findfont
dup length dict begin
  {1 index /FID ne {def} {pop pop} ifelse} forall
  /Encoding WinAnsiEncoding def
  currentdict
end
/Courier exch definefont pop
%FOPEndFontReencode
%%EndProlog
%%Page: 1 1
%%PageBoundingBox: 0 0 420 315
%%BeginPageSetup
[1 0 0 -1 0 315] CT
%%EndPageSetup
GS
[0.6 0 0 0.6 0 0] CT
1 GC
N
0 0 700 525 re
f
GR
GS
[0.6 0 0 0.6 0 0] CT
1 GC
N
0 0 700 525 re
f
GR
GS
[0.6 0 0 0.6 0 0] CT
1 GC
N
91 454 M
634 454 L
634 39 L
91 39 L
cp
f
GR
GS
[0.6 0 0 0.6 0 0] CT
0.873 GC
1 LJ
0.833 LW
N
91 454 M
91 39 L
S
GR
GS
[0.6 0 0 0.6 0 0] CT
0.873 GC
1 LJ
0.833 LW
N
199.6 454 M
199.6 39 L
S
GR
GS
[0.6 0 0 0.6 0 0] CT
0.873 GC
1 LJ
0.833 LW
N
308.2 454 M
308.2 39 L
S
GR
GS
[0.6 0 0 0.6 0 0] CT
0.873 GC
1 LJ
0.833 LW
N
416.8 454 M
416.8 39 L
S
GR
GS
[0.6 0 0 0.6 0 0] CT
0.873 GC
1 LJ
0.833 LW
N
525.4 454 M
525.4 39 L
S
GR
GS
[0.6 0 0 0.6 0 0] CT
0.873 GC
1 LJ
0.833 LW
N
634 454 M
634 39 L
S
GR
GS
[0.6 0 0 0.6 0 0] CT
0.873 GC
1 LJ
0.833 LW
N
634 439.134 M
91 439.134 L
S
GR
GS
[0.6 0 0 0.6 0 0] CT
0.873 GC
1 LJ
0.833 LW
N
634 305.756 M
91 305.756 L
S
GR
GS
[0.6 0 0 0.6 0 0] CT
0.873 GC
1 LJ
0.833 LW
N
634 172.378 M
91 172.378 L
S
GR
GS
[0.6 0 0 0.6 0 0] CT
0.873 GC
1 LJ
0.833 LW
N
634 39 M
91 39 L
S
GR
GS
[0.6 0 0 0.6 0 0] CT
0.149 GC
2 setlinecap
1 LJ
0.833 LW
N
91 454 M
634 454 L
S
GR
GS
[0.6 0 0 0.6 0 0] CT
0.149 GC
2 setlinecap
1 LJ
0.833 LW
N
91 39 M
634 39 L
S
GR
GS
[0.6 0 0 0.6 0 0] CT
0.149 GC
2 setlinecap
1 LJ
0.833 LW
N
91 454 M
91 448.57 L
S
GR
GS
[0.6 0 0 0.6 0 0] CT
0.149 GC
2 setlinecap
1 LJ
0.833 LW
N
199.6 454 M
199.6 448.57 L
S
GR
GS
[0.6 0 0 0.6 0 0] CT
0.149 GC
2 setlinecap
1 LJ
0.833 LW
N
308.2 454 M
308.2 448.57 L
S
GR
GS
[0.6 0 0 0.6 0 0] CT
0.149 GC
2 setlinecap
1 LJ
0.833 LW
N
416.8 454 M
416.8 448.57 L
S
GR
GS
[0.6 0 0 0.6 0 0] CT
0.149 GC
2 setlinecap
1 LJ
0.833 LW
N
525.4 454 M
525.4 448.57 L
S
GR
GS
[0.6 0 0 0.6 0 0] CT
0.149 GC
2 setlinecap
1 LJ
0.833 LW
N
634 454 M
634 448.57 L
S
GR
GS
[0.6 0 0 0.6 0 0] CT
0.149 GC
2 setlinecap
1 LJ
0.833 LW
N
91 39 M
91 44.43 L
S
GR
GS
[0.6 0 0 0.6 0 0] CT
0.149 GC
2 setlinecap
1 LJ
0.833 LW
N
199.6 39 M
199.6 44.43 L
S
GR
GS
[0.6 0 0 0.6 0 0] CT
0.149 GC
2 setlinecap
1 LJ
0.833 LW
N
308.2 39 M
308.2 44.43 L
S
GR
GS
[0.6 0 0 0.6 0 0] CT
0.149 GC
2 setlinecap
1 LJ
0.833 LW
N
416.8 39 M
416.8 44.43 L
S
GR
GS
[0.6 0 0 0.6 0 0] CT
0.149 GC
2 setlinecap
1 LJ
0.833 LW
N
525.4 39 M
525.4 44.43 L
S
GR
GS
[0.6 0 0 0.6 0 0] CT
0.149 GC
2 setlinecap
1 LJ
0.833 LW
N
634 39 M
634 44.43 L
S
GR
GS
[0.6 0 0 0.6 54.6 277.2] CT
0.149 GC
/Helvetica 23.333 F
GS
[1 0 0 1 0 0] CT
-6.5 24 moveto 
1 -1 scale
(0) t 
GR
GR
GS
[0.6 0 0 0.6 119.76 277.2] CT
0.149 GC
/Helvetica 23.333 F
GS
[1 0 0 1 0 0] CT
-19.5 24 moveto 
1 -1 scale
(200) t 
GR
GR
GS
[0.6 0 0 0.6 184.92001 277.2] CT
0.149 GC
/Helvetica 23.333 F
GS
[1 0 0 1 0 0] CT
-19.5 24 moveto 
1 -1 scale
(400) t 
GR
GR
GS
[0.6 0 0 0.6 250.07999 277.2] CT
0.149 GC
/Helvetica 23.333 F
GS
[1 0 0 1 0 0] CT
-19.5 24 moveto 
1 -1 scale
(600) t 
GR
GR
GS
[0.6 0 0 0.6 315.24001 277.2] CT
0.149 GC
/Helvetica 23.333 F
GS
[1 0 0 1 0 0] CT
-19.5 24 moveto 
1 -1 scale
(800) t 
GR
GR
GS
[0.6 0 0 0.6 380.4 277.2] CT
0.149 GC
/Helvetica 23.333 F
GS
[1 0 0 1 0 0] CT
-26 24 moveto 
1 -1 scale
(1000) t 
GR
GR
GS
[0.6 0 0 0.6 217.50016 295.59999] CT
0.149 GC
/Helvetica 25.667 F
GS
[1 0 0 1 0 0] CT
-28 26 moveto 
1 -1 scale
(s [m]) t 
GR
GR
GS
[0.6 0 0 0.6 0 0] CT
0.149 GC
2 setlinecap
1 LJ
0.833 LW
N
91 454 M
91 39 L
S
GR
GS
[0.6 0 0 0.6 0 0] CT
0.149 GC
2 setlinecap
1 LJ
0.833 LW
N
634 454 M
634 39 L
S
GR
GS
[0.6 0 0 0.6 0 0] CT
0.149 GC
2 setlinecap
1 LJ
0.833 LW
N
91 439.134 M
96.43 439.134 L
S
GR
GS
[0.6 0 0 0.6 0 0] CT
0.149 GC
2 setlinecap
1 LJ
0.833 LW
N
91 305.756 M
96.43 305.756 L
S
GR
GS
[0.6 0 0 0.6 0 0] CT
0.149 GC
2 setlinecap
1 LJ
0.833 LW
N
91 172.378 M
96.43 172.378 L
S
GR
GS
[0.6 0 0 0.6 0 0] CT
0.149 GC
2 setlinecap
1 LJ
0.833 LW
N
91 39 M
96.43 39 L
S
GR
GS
[0.6 0 0 0.6 0 0] CT
0.149 GC
2 setlinecap
1 LJ
0.833 LW
N
634 439.134 M
628.57 439.134 L
S
GR
GS
[0.6 0 0 0.6 0 0] CT
0.149 GC
2 setlinecap
1 LJ
0.833 LW
N
634 305.756 M
628.57 305.756 L
S
GR
GS
[0.6 0 0 0.6 0 0] CT
0.149 GC
2 setlinecap
1 LJ
0.833 LW
N
634 172.378 M
628.57 172.378 L
S
GR
GS
[0.6 0 0 0.6 0 0] CT
0.149 GC
2 setlinecap
1 LJ
0.833 LW
N
634 39 M
628.57 39 L
S
GR
GS
[0.6 0 0 0.6 49.8 263.4806] CT
0.149 GC
/Helvetica 23.333 F
GS
[1 0 0 1 0 0] CT
-13 9 moveto 
1 -1 scale
(0) t 
GR
GR
GS
[0.6 0 0 0.6 49.8 183.45374] CT
0.149 GC
/Helvetica 23.333 F
GS
[1 0 0 1 0 0] CT
-13 9 moveto 
1 -1 scale
(5) t 
GR
GR
GS
[0.6 0 0 0.6 49.8 103.42687] CT
0.149 GC
/Helvetica 23.333 F
GS
[1 0 0 1 0 0] CT
-26 9 moveto 
1 -1 scale
(10) t 
GR
GR
GS
[0.6 0 0 0.6 49.8 23.4] CT
0.149 GC
/Helvetica 23.333 F
GS
[1 0 0 1 0 0] CT
-26 9 moveto 
1 -1 scale
(15) t 
GR
GR
GS
[0 -0.6 0.6 0 21 183.6] CT
0.149 GC
/Helvetica 25.667 F
GS
[1 0 0 1 0 0] CT
0 0 moveto 
1 -1 scale
(F) t 
GR
GR
GS
[0 -0.6 0.6 0 28.2 174] CT
0.149 GC
/Helvetica 20.533 F
GS
[1 0 0 1 0 0] CT
0 0 moveto 
1 -1 scale
(motoru) t 
GR
GR
GS
[0 -0.6 0.6 0 21 135.6] CT
0.149 GC
/Helvetica 25.667 F
GS
[1 0 0 1 0 0] CT
0 0 moveto 
1 -1 scale
( [N]) t 
GR
GR
GS
[0.6 0 0 0.6 54.6 19.8] CT
0.149 GC
N
3.375 -0.656 M
3.375 -0.844 3.5 -0.984 QT
8.281 -5.75 L
3.5 -10.531 L
3.375 -10.641 3.375 -10.844 QT
3.375 -11 3.516 -11.148 QT
3.656 -11.297 3.844 -11.297 QT
4 -11.297 4.188 -11.156 QT
8.953 -6.391 L
13.688 -11.156 L
13.875 -11.297 14.031 -11.297 QT
14.219 -11.297 14.352 -11.164 QT
14.484 -11.031 14.484 -10.844 QT
14.484 -10.641 14.375 -10.531 QT
9.594 -5.75 L
14.375 -0.984 L
14.484 -0.844 14.484 -0.656 QT
14.484 -0.469 14.352 -0.336 QT
14.219 -0.203 14.031 -0.203 QT
13.859 -0.203 13.688 -0.375 QT
8.953 -5.109 L
4.188 -0.375 L
4.016 -0.203 3.844 -0.203 QT
3.656 -0.203 3.516 -0.352 QT
3.375 -0.5 3.375 -0.656 QT
cp
f
GR
GS
[0.6 0 0 0.6 66 19.8] CT
0.149 GC
/Helvetica 23.333 F
GS
[1 0 0 1 0 0] CT
0 0 moveto 
1 -1 scale
(10) t 
GR
GR
GS
[0.6 0 0 0.6 81.6 13.2] CT
0.149 GC
/Helvetica 18.667 F
GS
[1 0 0 1 0 0] CT
0 0 moveto 
1 -1 scale
(4) t 
GR
GR
GS
[0.6 0 0 0.6 0 0] CT
0 0 1 RC
1 LJ
3.333 LW
N
91 144.635 M
91.027 144.635 L
91.054 144.635 L
91.076 144.635 L
91.114 144.635 L
91.147 144.635 L
91.174 144.635 L
91.201 144.635 L
91.239 144.635 L
91.266 144.635 L
91.299 144.635 L
91.331 144.635 L
91.358 144.635 L
91.391 144.635 L
91.429 144.635 L
91.467 144.635 L
91.505 144.635 L
91.543 144.635 L
91.586 144.635 L
91.619 144.635 L
91.662 144.635 L
91.695 144.635 L
91.749 144.635 L
91.782 144.635 L
91.814 144.635 L
91.842 144.635 L
91.869 144.635 L
91.901 144.635 L
91.934 144.635 L
91.967 144.635 L
92.005 144.635 L
92.037 144.635 L
92.07 144.635 L
92.102 144.635 L
92.14 144.635 L
92.173 144.635 L
92.216 144.635 L
92.26 144.635 L
92.292 144.635 L
92.336 144.635 L
92.385 144.635 L
92.428 144.635 L
92.472 144.635 L
92.542 144.635 L
92.624 144.635 L
92.651 144.635 L
92.705 144.635 L
92.781 144.635 L
92.808 144.635 L
92.857 144.635 L
92.917 144.635 L
93.004 144.635 L
93.047 144.635 L
93.101 144.635 L
93.134 144.635 L
93.199 144.635 L
93.232 144.635 L
93.291 137.089 L
93.346 129.911 L
93.389 122.364 L
93.438 115.186 L
93.476 107.823 L
93.52 100.461 L
93.574 93.098 L
93.617 85.552 L
93.666 78.373 L
93.715 70.643 L
93.758 63.648 L
93.813 57.301 L
93.867 57.301 L
93.91 57.301 L
93.954 57.301 L
94.014 57.301 L
94.063 57.301 L
94.122 57.301 L
94.166 57.301 L
94.231 57.301 L
94.274 57.301 L
94.334 57.301 L
94.388 57.301 L
94.448 57.301 L
94.508 57.301 L
94.568 57.301 L
94.616 57.301 L
94.676 57.301 L
94.736 57.301 L
94.79 57.301 L
94.85 57.301 L
94.904 57.301 L
94.964 57.301 L
95.029 57.301 L
95.094 57.301 L
95.154 57.301 L
95.208 57.301 L
95.252 57.301 L
95.328 57.301 L
95.404 57.301 L
95.48 57.301 L
95.556 57.301 L
95.632 57.301 L
95.713 57.301 L
95.789 57.301 L
95.865 57.301 L
95.941 57.301 L
96.023 57.301 L
96.11 57.301 L
96.191 57.301 L
96.267 57.301 L
96.349 57.301 L
96.441 57.301 L
96.517 57.301 L
96.598 57.301 L
96.68 57.301 L
96.767 57.301 L
96.854 57.301 L
96.94 57.301 L
97.022 57.301 L
97.114 57.301 L
97.196 57.301 L
97.283 57.301 L
97.38 57.301 L
97.456 57.301 L
97.554 57.301 L
97.646 57.301 L
97.739 57.301 L
97.831 57.301 L
97.923 57.301 L
98.016 57.301 L
98.113 57.301 L
98.206 57.301 L
98.298 57.301 L
98.396 57.301 L
98.483 57.301 L
98.58 57.301 L
98.678 57.301 L
98.776 57.301 L
98.873 57.301 L
98.971 57.301 L
99.074 57.301 L
99.172 57.301 L
99.275 57.301 L
99.373 57.301 L
99.476 57.301 L
99.59 57.301 L
99.677 57.301 L
99.786 57.301 L
99.889 57.301 L
99.998 57.301 L
100.112 57.301 L
100.198 57.301 L
100.302 57.301 L
100.41 57.301 L
100.519 57.301 L
100.627 57.301 L
100.736 57.301 L
100.845 57.301 L
100.964 57.301 L
101.078 57.301 L
101.192 57.301 L
101.295 57.301 L
101.409 57.301 L
101.518 57.301 L
101.643 57.301 L
101.751 57.301 L
101.871 57.301 L
101.996 57.301 L
102.11 57.301 L
102.229 57.301 L
102.343 57.301 L
102.468 57.301 L
102.593 57.301 L
102.713 57.301 L
102.827 57.301 L
102.951 57.301 L
103.076 57.301 L
103.196 57.301 L
103.321 57.301 L
103.44 57.301 L
103.56 57.301 L
103.684 57.301 L
103.809 57.301 L
103.934 57.301 L
104.07 57.301 L
104.2 57.301 L
104.32 57.301 L
104.445 57.301 L
104.586 57.301 L
104.711 57.301 L
104.846 57.301 L
104.977 57.301 L
105.113 57.301 L
105.254 57.301 L
105.368 57.301 L
105.504 57.301 L
105.639 57.301 L
105.78 57.301 L
105.911 57.301 L
106.047 57.301 L
106.188 57.301 L
106.334 57.301 L
106.47 57.301 L
106.606 57.301 L
106.736 57.301 L
106.877 57.301 L
107.019 57.301 L
107.165 57.301 L
107.306 57.301 L
107.453 57.301 L
107.589 57.301 L
107.741 57.301 L
107.887 57.301 L
108.023 57.301 L
108.181 57.301 L
108.316 57.301 L
108.463 57.301 L
109.071 57.301 L
109.223 57.301 L
109.353 57.301 L
109.505 57.301 L
109.657 57.301 L
109.81 57.301 L
109.967 57.301 L
110.119 57.301 L
110.276 57.301 L
110.429 57.301 L
110.575 57.301 L
110.727 57.301 L
110.896 57.301 L
111.053 57.301 L
111.194 57.301 L
111.357 57.301 L
111.515 57.301 L
111.672 57.301 L
111.819 57.301 L
111.982 57.301 L
112.155 57.301 L
112.313 57.301 L
112.465 57.301 L
112.628 57.301 L
112.791 57.301 L
112.959 57.301 L
113.116 57.301 L
113.296 57.301 L
113.453 57.301 L
113.611 57.301 L
113.768 57.301 L
113.942 57.301 L
114.116 57.301 L
114.273 57.301 L
114.447 57.301 L
114.615 57.301 L
114.773 57.301 L
114.946 57.301 L
115.115 57.301 L
115.283 57.301 L
115.451 57.301 L
115.63 57.301 L
115.81 57.301 L
115.897 57.301 L
116.065 57.301 L
116.249 57.301 L
116.429 57.301 L
116.619 57.301 L
116.787 57.301 L
116.972 57.301 L
117.151 57.301 L
117.319 57.301 L
117.509 57.301 L
117.683 57.301 L
117.862 57.301 L
118.052 57.301 L
118.231 57.301 L
118.405 57.301 L
118.595 57.301 L
118.785 57.301 L
118.975 57.301 L
119.144 57.301 L
119.334 57.301 L
119.518 57.301 L
119.708 57.301 L
119.898 57.301 L
120.089 57.301 L
120.279 57.301 L
120.463 57.301 L
120.653 57.301 L
120.86 57.301 L
121.055 57.301 L
121.234 57.301 L
121.43 57.301 L
121.62 57.301 L
121.81 57.301 L
122.016 57.301 L
122.212 57.301 L
122.402 57.301 L
122.592 57.301 L
122.793 57.301 L
122.999 57.301 L
123.189 57.301 L
123.39 57.301 L
123.596 57.301 L
123.786 57.301 L
123.987 57.301 L
124.177 57.301 L
124.389 57.301 L
124.59 57.301 L
124.802 57.301 L
125.014 57.301 L
125.22 57.301 L
125.426 57.301 L
125.616 57.301 L
125.828 57.301 L
126.051 57.301 L
126.241 57.301 L
126.447 57.301 L
126.664 57.301 L
126.876 57.301 L
127.077 57.301 L
127.3 57.301 L
127.5 57.301 L
127.712 57.301 L
127.94 57.301 L
128.136 57.301 L
128.364 57.301 L
128.565 57.301 L
128.782 57.301 L
129.005 57.301 L
129.216 57.301 L
129.434 57.301 L
129.651 57.301 L
129.868 57.301 L
130.096 57.301 L
130.308 57.301 L
130.53 57.301 L
130.753 57.301 L
130.965 57.301 L
131.193 57.301 L
131.415 57.301 L
131.644 57.301 L
131.861 57.301 L
132.078 57.301 L
132.306 57.301 L
132.534 57.301 L
132.746 57.301 L
132.974 57.301 L
133.202 57.301 L
133.43 57.301 L
133.664 57.301 L
133.892 57.301 L
134.125 57.301 L
134.359 57.301 L
134.576 57.301 L
134.809 57.301 L
135.048 57.301 L
135.282 57.301 L
135.521 57.301 L
135.759 57.301 L
135.977 57.301 L
136.216 57.301 L
136.455 57.301 L
136.683 57.301 L
136.922 57.301 L
137.15 57.301 L
137.394 57.301 L
137.633 57.301 L
137.872 57.301 L
138.122 57.301 L
138.355 57.301 L
138.594 57.301 L
138.838 57.301 L
139.088 57.301 L
139.322 57.301 L
139.566 57.301 L
139.821 57.301 L
140.06 57.301 L
140.315 57.301 L
140.532 57.301 L
140.782 57.301 L
141.037 57.301 L
141.271 57.301 L
141.537 57.301 L
141.781 57.301 L
142.026 57.301 L
142.574 57.301 L
142.818 57.301 L
143.074 57.301 L
143.307 57.301 L
143.562 57.301 L
143.823 57.301 L
144.062 57.301 L
144.328 57.301 L
144.583 57.376 L
144.833 58.065 L
145.105 58.067 L
145.338 58.067 L
145.593 58.072 L
145.859 58.081 L
146.125 58.087 L
146.386 58.083 L
146.641 58.084 L
146.907 58.082 L
147.168 58.083 L
147.434 58.086 L
147.705 58.089 L
147.966 58.081 L
148.21 58.074 L
148.498 58.081 L
148.732 58.074 L
149.014 58.096 L
149.291 58.063 L
149.546 58.083 L
149.796 58.099 L
150.078 58.066 L
150.605 58.084 L
150.866 58.074 L
151.148 58.083 L
151.409 58.082 L
151.675 58.085 L
151.946 58.17 L
152.207 57.997 L
152.478 58.077 L
152.755 58.072 L
153.049 58.165 L
153.315 57.993 L
153.581 58.073 L
153.847 58.075 L
154.124 58.098 L
154.417 58.069 L
154.683 58.105 L
154.955 58.074 L
155.237 58.092 L
155.519 58.182 L
155.791 58.01 L
156.079 58.106 L
156.366 58.099 L
156.632 58.095 L
156.828 58.107 L
157.11 58.187 L
157.398 58.017 L
157.664 58.11 L
157.968 58.205 L
158.234 58.031 L
158.522 58.122 L
158.81 58.124 L
159.108 58.128 L
159.391 58.16 L
159.684 58.129 L
159.961 58.243 L
160.232 58.059 L
160.542 58.149 L
160.835 58.151 L
161.107 58.138 L
161.416 58.125 L
161.693 58.117 L
161.992 58.11 L
162.443 58.117 L
162.73 58.13 L
163.007 58.22 L
163.311 58.054 L
163.605 58.149 L
163.892 58.15 L
164.196 58.274 L
164.5 58.094 L
164.81 58.176 L
165.092 58.163 L
165.402 58.182 L
165.695 58.155 L
165.988 58.161 L
166.292 58.157 L
166.596 58.128 L
166.901 58.147 L
167.21 57.981 L
167.514 57.892 L
167.818 57.882 L
168.128 57.88 L
168.41 57.877 L
168.703 57.869 L
169.018 57.899 L
169.322 57.931 L
169.637 57.83 L
169.936 57.905 L
170.256 57.878 L
170.94 57.887 L
171.25 57.891 L
171.57 57.9 L
171.874 57.907 L
172.189 57.913 L
172.493 57.915 L
172.808 57.913 L
173.129 57.909 L
173.438 57.919 L
173.742 57.916 L
174.057 57.915 L
174.378 57.919 L
174.698 57.916 L
175.008 57.925 L
175.344 57.925 L
175.659 57.913 L
175.958 57.918 L
176.278 57.912 L
176.593 57.917 L
176.913 57.923 L
177.239 57.917 L
177.57 57.918 L
177.88 57.925 L
178.222 57.927 L
178.526 58 L
178.857 57.864 L
179.172 58.001 L
179.509 57.867 L
179.802 58.002 L
180.144 57.856 L
180.47 57.918 L
180.801 57.917 L
181.122 57.937 L
181.464 57.907 L
181.784 57.933 L
181.931 57.928 L
182.246 57.924 L
182.566 57.909 L
182.903 57.92 L
183.25 57.922 L
183.576 57.916 L
183.896 57.931 L
184.239 57.931 L
184.581 57.932 L
184.901 57.928 L
185.227 57.93 L
185.585 57.942 L
185.916 57.947 L
186.258 58.013 L
186.595 57.865 L
186.916 57.936 L
187.241 57.948 L
187.578 57.923 L
187.92 58.013 L
188.257 57.873 L
188.615 57.962 L
188.946 57.932 L
189.283 57.948 L
189.625 57.947 L
189.962 57.952 L
190.331 57.956 L
190.662 57.956 L
191.01 57.957 L
191.352 57.966 L
191.71 57.972 L
192.21 57.963 L
192.541 57.964 L
192.91 57.968 L
193.263 58.044 L
193.605 57.898 L
193.947 57.961 L
194.289 57.962 L
194.632 57.963 L
194.995 57.966 L
195.343 57.974 L
195.69 57.981 L
196.054 57.948 L
196.396 57.972 L
196.766 57.98 L
197.108 57.997 L
197.477 57.957 L
197.83 57.986 L
198.199 57.973 L
198.541 57.978 L
198.916 57.98 L
199.258 57.974 L
199.611 57.976 L
199.953 57.97 L
200.322 57.968 L
200.67 57.979 L
201.044 57.988 L
201.414 57.989 L
201.756 57.98 L
202.141 57.98 L
202.478 58 L
202.863 57.975 L
203.238 58.065 L
203.591 57.924 L
203.96 57.975 L
204.335 58.071 L
204.688 57.928 L
205.068 58.077 L
205.426 57.926 L
205.806 58.004 L
206.159 58.094 L
206.54 57.912 L
206.892 58.001 L
207.278 58.016 L
207.653 58.013 L
208.033 58.009 L
208.369 58.011 L
208.739 58.027 L
209.119 58.016 L
209.488 58.013 L
209.874 58.017 L
210.248 58.035 L
210.623 58.045 L
211.003 58.036 L
211.389 58.052 L
211.747 58.025 L
212.306 58.043 L
212.686 58.041 L
213.066 58.048 L
213.447 58.055 L
213.832 58.05 L
214.212 58.039 L
214.598 58.044 L
214.983 58.056 L
215.352 58.056 L
215.733 58.045 L
216.123 58.053 L
216.504 58.045 L
216.878 58.053 L
217.258 58.053 L
217.644 58.05 L
218.04 58.061 L
218.42 58.051 L
218.811 58.053 L
219.197 58.066 L
219.599 58.063 L
219.99 58.066 L
220.381 58.057 L
220.772 58.066 L
221.146 58.082 L
221.515 58.067 L
221.917 58.079 L
222.314 57.722 L
222.716 57.718 L
223.117 57.721 L
223.508 57.691 L
223.894 57.718 L
224.29 57.732 L
224.692 57.72 L
225.083 57.726 L
225.479 57.724 L
225.887 57.74 L
226.283 57.714 L
226.69 57.731 L
227.092 57.78 L
227.472 57.681 L
227.874 57.775 L
228.26 57.68 L
228.667 57.734 L
229.074 57.775 L
229.492 57.682 L
229.872 57.775 L
230.279 57.681 L
230.692 57.726 L
231.463 57.723 L
231.87 57.724 L
232.283 57.733 L
232.701 57.733 L
233.092 57.734 L
233.472 57.743 L
233.89 57.737 L
234.314 57.737 L
234.732 57.79 L
235.145 57.69 L
235.568 57.731 L
235.965 57.728 L
236.356 57.733 L
236.774 57.741 L
237.186 57.732 L
237.507 57.737 L
237.92 57.737 L
238.332 57.727 L
238.756 57.736 L
239.179 57.744 L
239.608 57.742 L
240.021 57.732 L
240.434 57.743 L
240.835 57.735 L
241.27 57.736 L
241.693 57.734 L
242.106 57.759 L
242.54 57.727 L
242.964 57.739 L
243.371 57.739 L
243.811 57.747 L
244.224 57.744 L
244.647 57.743 L
245.076 57.745 L
245.478 57.739 L
245.902 57.739 L
246.336 57.74 L
246.765 57.747 L
247.194 57.744 L
247.634 57.749 L
248.052 57.75 L
248.508 57.743 L
248.915 57.743 L
249.371 57.748 L
249.768 57.756 L
250.218 57.746 L
250.637 57.746 L
251.076 57.749 L
251.522 57.75 L
251.951 57.799 L
252.38 57.702 L
252.841 57.763 L
253.265 57.735 L
253.694 57.75 L
254.123 57.759 L
254.579 57.76 L
255.372 57.756 L
255.801 57.767 L
256.257 57.769 L
256.713 57.769 L
257.136 57.76 L
257.565 57.767 L
258.021 57.767 L
258.477 57.754 L
258.906 57.766 L
259.363 57.738 L
259.792 57.747 L
260.248 57.751 L
260.671 57.752 L
261.133 57.755 L
261.589 57.803 L
262.012 57.806 L
262.469 57.695 L
262.93 57.702 L
263.381 57.755 L
263.81 57.812 L
264.369 57.693 L
264.825 57.786 L
265.281 57.701 L
265.71 57.736 L
266.166 57.793 L
266.628 57.71 L
267.084 57.755 L
267.535 57.749 L
267.996 57.753 L
268.447 57.75 L
268.919 57.749 L
269.375 57.742 L
269.837 57.741 L
270.277 57.745 L
270.733 57.737 L
271.2 57.748 L
271.634 57.763 L
272.107 57.759 L
272.568 57.754 L
273.041 57.758 L
273.66 57.753 L
274.127 57.756 L
274.577 57.755 L
275.05 57.756 L
275.484 57.759 L
275.962 57.758 L
276.435 57.767 L
276.88 57.76 L
277.352 57.765 L
277.835 57.759 L
278.297 57.755 L
278.759 57.755 L
279.22 57.759 L
279.698 57.766 L
280.181 57.77 L
280.659 439.134 L
281.088 434.896 L
281.571 440.27 L
282.055 441.548 L
282.527 442.876 L
283.01 444.454 L
283.493 446.205 L
283.912 447.913 L
284.248 449.781 L
284.737 451.664 L
285.22 454 L
285.665 450.113 L
286.154 446.13 L
286.654 442.053 L
287.115 439.134 L
287.577 439.134 L
288.071 439.134 L
288.571 439.134 L
289.054 439.134 L
289.505 439.134 L
289.977 439.134 L
290.482 439.134 L
290.96 439.134 L
291.459 439.134 L
291.888 439.134 L
292.388 439.134 L
292.877 439.134 L
293.371 439.134 L
293.865 439.134 L
294.321 439.134 L
295.059 439.134 L
295.537 439.134 L
296.015 439.134 L
296.526 439.134 L
297.003 439.134 L
297.481 439.134 L
297.954 439.134 L
298.453 439.134 L
298.947 439.134 L
299.414 439.134 L
299.903 439.134 L
300.424 439.134 L
300.897 439.134 L
301.353 439.134 L
301.863 439.134 L
302.341 439.134 L
302.824 439.134 L
303.34 439.134 L
303.818 439.134 L
304.301 439.134 L
304.806 439.134 L
305.284 439.134 L
305.8 439.134 L
306.202 439.134 L
306.642 439.134 L
307.152 439.134 L
307.635 439.134 L
308.151 439.134 L
308.629 439.134 L
309.112 439.134 L
309.634 439.134 L
310.117 439.134 L
310.567 439.134 L
311.083 439.134 L
311.572 439.134 L
312.066 439.134 L
312.582 439.134 L
313.044 439.134 L
313.82 439.134 L
314.292 439.134 L
314.814 439.134 L
315.292 439.134 L
315.769 439.134 L
316.291 439.134 L
316.769 439.134 L
317.284 439.134 L
317.762 439.134 L
318.24 439.134 L
318.75 439.134 L
319.207 439.134 L
319.657 439.134 L
320.189 439.134 L
320.651 439.134 L
321.156 439.134 L
321.639 439.134 L
322.161 439.134 L
322.622 439.134 L
323.1 439.134 L
323.616 439.134 L
324.094 439.134 L
324.577 439.134 L
325.093 439.134 L
325.576 439.134 L
326.032 439.134 L
326.553 439.134 L
327.08 439.134 L
327.531 439.134 L
328.014 439.134 L
328.524 439.134 L
329.019 439.134 L
329.513 439.134 L
329.98 439.134 L
330.479 439.134 L
330.968 439.134 L
331.468 439.134 L
331.962 439.134 L
332.44 439.134 L
332.945 439.134 L
333.775 439.134 L
334.291 439.134 L
334.769 439.134 L
335.252 439.134 L
335.736 439.134 L
336.203 439.134 L
336.702 439.134 L
337.212 439.134 L
337.69 439.134 L
338.168 439.134 L
338.657 439.134 L
339.135 439.134 L
339.656 439.134 L
340.118 439.134 L
340.655 439.134 L
341.111 439.134 L
341.595 439.134 L
342.099 439.134 L
342.577 439.134 L
343.088 439.134 L
343.571 439.134 L
344.054 439.134 L
344.565 439.134 L
344.999 439.134 L
345.515 439.134 L
345.998 439.134 L
346.492 439.134 L
347.003 439.134 L
347.486 439.134 L
347.986 439.134 L
348.29 439.134 L
348.73 439.134 L
349.229 439.134 L
349.723 439.134 L
350.206 439.134 L
350.722 439.134 L
351.2 439.134 L
351.7 439.134 L
352.178 439.134 L
352.672 439.134 L
353.171 439.134 L
353.655 439.134 L
354.556 439.134 L
355.061 439.134 L
355.522 439.134 L
356.022 439.134 L
356.489 439.134 L
356.989 439.134 L
357.477 439.134 L
357.961 439.134 L
358.444 439.134 L
358.949 439.134 L
359.427 439.134 L
359.921 439.134 L
360.415 439.134 L
360.909 439.134 L
361.398 439.134 L
361.876 439.134 L
362.359 439.134 L
362.842 439.134 L
363.309 439.134 L
363.819 439.134 L
364.308 439.134 L
364.797 439.134 L
365.291 439.134 L
365.725 439.134 L
366.263 439.134 L
366.697 439.134 L
367.181 439.134 L
367.68 439.134 L
368.18 439.134 L
368.658 439.134 L
369.13 439.134 L
369.63 439.134 L
370.118 439.134 L
370.596 439.134 L
371.079 439.134 L
371.563 439.134 L
372.046 439.134 L
372.54 439.134 L
373.04 439.134 L
373.496 439.134 L
374.435 439.134 L
374.891 439.134 L
375.369 439.134 L
375.88 439.134 L
376.363 439.134 L
376.846 439.134 L
377.356 439.134 L
377.818 439.134 L
378.323 439.134 L
378.812 439.134 L
379.3 439.134 L
379.795 439.134 L
380.262 439.134 L
380.718 439.134 L
381.217 439.134 L
381.69 439.134 L
382.195 439.134 L
382.694 439.134 L
383.188 439.134 L
383.677 439.134 L
384.111 439.134 L
384.606 439.134 L
385.094 439.134 L
385.588 439.134 L
386.088 439.134 L
386.566 439.134 L
387.076 439.134 L
387.554 439.134 L
388.037 439.134 L
388.515 439.134 L
388.988 439.134 L
389.465 439.134 L
389.976 439.134 L
390.465 439.134 L
390.959 439.134 L
391.415 439.134 L
391.909 439.134 L
392.419 439.134 L
392.87 439.134 L
393.408 439.134 L
393.869 439.134 L
394.336 439.134 L
394.868 439.134 L
395.33 439.134 L
395.78 439.134 L
396.296 439.134 L
396.78 439.134 L
397.529 439.134 L
398.007 439.134 L
398.517 439.134 L
398.995 439.134 L
399.478 439.134 L
399.962 439.134 L
400.456 439.134 L
400.923 439.134 L
401.417 439.134 L
401.884 439.134 L
402.389 439.134 L
402.877 439.134 L
403.382 439.134 L
403.849 439.134 L
404.344 439.134 L
404.816 439.134 L
405.31 439.134 L
405.772 439.134 L
406.097 439.134 L
406.57 439.134 L
407.048 439.134 L
407.531 439.134 L
408.047 439.134 L
408.498 439.134 L
409.003 439.134 L
409.486 439.134 L
409.964 439.134 L
410.463 439.134 L
410.963 439.134 L
411.424 439.134 L
411.929 439.134 L
412.418 439.134 L
412.89 439.134 L
413.39 439.134 L
413.89 439.134 L
415.073 439.134 L
415.567 439.134 L
416.056 439.134 L
416.529 439.134 L
417.033 439.134 L
417.5 439.134 L
417.995 439.134 L
418.456 439.134 L
418.967 439.134 L
419.455 439.134 L
419.933 439.134 L
420.411 439.134 L
420.916 439.134 L
421.394 439.134 L
421.877 439.134 L
422.387 439.134 L
422.844 439.134 L
423.327 439.134 L
423.826 439.134 L
424.31 439.134 L
424.826 439.134 L
425.309 439.134 L
425.787 439.134 L
426.27 439.134 L
426.742 439.134 L
427.231 439.134 L
427.703 439.134 L
428.219 439.134 L
428.686 439.134 L
429.17 439.134 L
429.68 439.134 L
430.163 439.134 L
430.63 439.134 L
431.124 439.134 L
431.597 439.134 L
431.912 439.134 L
432.422 439.134 L
432.905 439.134 L
433.383 439.134 L
433.866 439.134 L
434.371 439.134 L
434.822 439.134 L
435.338 439.134 L
435.816 439.134 L
436.31 439.134 L
436.772 439.134 L
437.282 439.134 L
437.76 439.134 L
438.265 439.134 L
438.732 439.134 L
439.182 439.134 L
439.644 439.134 L
440.133 439.134 L
440.632 439.134 L
441.105 439.134 L
441.604 439.134 L
442.104 439.134 L
442.592 439.134 L
443.054 439.134 L
443.559 439.134 L
444.026 439.134 L
444.493 439.134 L
445.003 439.134 L
445.487 439.134 L
445.986 439.134 L
446.48 439.134 L
446.953 439.134 L
447.751 439.134 L
448.256 439.134 L
448.739 439.134 L
449.223 439.134 L
449.695 439.134 L
450.173 439.134 L
450.694 439.134 L
451.172 439.134 L
451.655 439.134 L
452.133 439.134 L
452.611 439.134 L
453.105 439.134 L
453.599 439.134 L
454.093 439.134 L
454.582 439.134 L
455.576 439.134 L
456.048 439.134 L
456.526 439.134 L
457.02 439.134 L
457.509 439.134 L
458.008 439.134 L
458.492 439.134 L
458.986 439.134 L
459.453 439.134 L
459.93 439.134 L
460.414 439.134 L
460.902 439.134 L
461.397 439.134 L
461.695 439.134 L
462.151 439.134 L
462.645 439.134 L
463.134 439.134 L
463.628 439.134 L
464.117 439.134 L
464.611 439.134 L
465.1 439.134 L
465.589 439.134 L
466.088 439.134 L
466.544 439.134 L
467.375 439.134 L
467.869 439.134 L
468.363 439.134 L
468.852 439.134 L
469.346 439.134 L
469.84 439.134 L
470.329 439.134 L
470.763 439.134 L
471.252 439.134 L
471.746 439.134 L
472.24 439.134 L
472.729 439.134 L
473.223 439.134 L
473.717 439.134 L
474.206 439.134 L
474.64 439.134 L
475.134 439.134 L
475.623 439.134 L
476.123 439.134 L
476.611 439.134 L
477.225 439.134 L
477.719 439.134 L
478.154 439.134 L
478.642 439.134 L
479.136 439.134 L
479.652 439.134 L
480.119 439.134 L
480.603 439.134 L
481.113 439.134 L
481.602 439.134 L
482.074 439.134 L
482.546 439.134 L
483.03 439.134 L
483.508 439.134 L
483.991 439.134 L
484.501 439.134 L
484.974 439.134 L
485.457 439.134 L
485.951 439.134 L
486.44 439.134 L
486.901 439.134 L
487.39 439.134 L
487.9 439.134 L
488.357 439.134 L
488.867 439.134 L
489.367 439.134 L
489.508 439.134 L
489.98 439.134 L
490.512 439.134 L
490.952 439.134 L
491.43 439.134 L
491.94 439.134 L
492.429 439.134 L
492.907 439.134 L
493.39 439.134 L
493.901 439.134 L
494.373 439.134 L
494.829 439.134 L
495.459 439.134 L
495.817 439.134 L
496.301 439.134 L
496.806 439.134 L
497.278 439.134 L
497.761 439.134 L
498.234 439.134 L
499.179 439.134 L
499.64 439.134 L
500.156 439.134 L
500.634 439.134 L
501.112 439.134 L
501.584 439.134 L
502.094 439.134 L
502.561 439.134 L
503.023 439.134 L
503.555 439.134 L
504.028 439.134 L
504.489 439.134 L
504.989 439.134 L
505.488 439.134 L
505.966 439.134 L
506.433 439.134 L
506.943 439.134 L
507.427 439.134 L
507.899 439.134 L
508.382 439.134 L
509.012 439.134 L
509.485 439.134 L
509.973 439.134 L
510.462 439.134 L
510.951 439.134 L
511.445 439.134 L
511.912 439.134 L
512.406 439.134 L
512.873 439.134 L
513.362 439.134 L
513.856 439.134 L
514.35 439.134 L
514.849 439.134 L
515.338 439.134 L
515.827 439.134 L
516.745 439.134 L
517.206 439.134 L
517.7 439.134 L
518.189 439.134 L
518.683 439.134 L
519.166 439.134 L
519.65 439.134 L
520.144 439.134 L
520.611 439.134 L
521.067 439.134 L
521.566 439.134 L
522.05 439.134 L
522.538 439.134 L
523.027 439.134 L
523.532 439.134 L
524.021 439.134 L
524.52 439.134 L
524.971 439.134 L
525.454 439.134 L
525.943 439.134 L
S
GR
GS
[0.6 0 0 0.6 0 0] CT
1 0 0 RC
[12 12] 0 setdash
2 LJ
3.333 LW
N
91 57.299 M
91.027 57.299 L
91.054 57.299 L
91.076 57.299 L
91.114 57.299 L
91.147 57.299 L
91.174 57.299 L
91.201 57.299 L
91.239 57.299 L
91.266 57.299 L
91.299 57.299 L
91.331 57.299 L
91.358 57.299 L
91.391 57.299 L
91.429 57.299 L
91.467 57.299 L
91.505 57.299 L
91.543 57.299 L
91.586 57.299 L
91.619 57.299 L
91.662 57.299 L
91.695 57.299 L
91.749 57.299 L
91.782 57.299 L
91.814 57.299 L
91.842 57.299 L
91.869 57.299 L
91.901 57.299 L
91.934 57.299 L
91.967 57.299 L
92.005 57.299 L
92.037 57.299 L
92.07 57.299 L
92.102 57.299 L
92.14 57.299 L
92.173 57.299 L
92.216 57.299 L
92.26 57.299 L
92.292 57.299 L
92.336 57.299 L
92.385 57.299 L
92.428 57.299 L
92.472 57.299 L
92.542 57.299 L
92.624 57.299 L
92.651 57.299 L
92.705 57.299 L
92.781 57.299 L
92.808 57.299 L
92.857 57.299 L
92.917 57.299 L
93.004 57.299 L
93.047 57.299 L
93.101 57.299 L
93.134 57.299 L
93.199 57.299 L
93.232 57.299 L
93.291 57.299 L
93.346 57.299 L
93.389 57.299 L
93.438 57.299 L
93.476 57.299 L
93.52 57.299 L
93.574 57.299 L
93.617 57.299 L
93.666 57.299 L
93.715 57.299 L
93.758 57.299 L
93.813 57.299 L
93.867 57.299 L
93.91 57.299 L
93.954 57.299 L
94.014 57.299 L
94.063 57.299 L
94.122 57.299 L
94.166 57.299 L
94.231 57.299 L
94.274 57.299 L
94.334 57.299 L
94.388 57.299 L
94.448 57.299 L
94.508 57.299 L
94.568 57.299 L
94.616 57.299 L
94.676 57.299 L
94.736 57.299 L
94.79 57.299 L
94.85 57.299 L
94.904 57.299 L
94.964 57.299 L
95.029 57.299 L
95.094 57.299 L
95.154 57.299 L
95.208 57.299 L
95.252 57.299 L
95.328 57.299 L
95.404 57.299 L
95.48 57.299 L
95.556 57.299 L
95.632 57.299 L
95.713 57.299 L
95.789 57.299 L
95.865 57.299 L
95.941 57.299 L
96.023 57.299 L
96.11 57.299 L
96.191 57.299 L
96.267 57.299 L
96.349 57.299 L
96.441 57.299 L
96.517 57.299 L
96.598 57.299 L
96.68 57.299 L
96.767 57.299 L
96.854 57.299 L
96.94 57.299 L
97.022 57.299 L
97.114 57.299 L
97.196 57.299 L
97.283 57.299 L
97.38 57.299 L
97.456 57.299 L
97.554 57.299 L
97.646 57.299 L
97.739 57.299 L
97.831 57.299 L
97.923 57.299 L
98.016 57.299 L
98.113 57.299 L
98.206 57.299 L
98.298 57.299 L
98.396 57.299 L
98.483 57.299 L
98.58 57.299 L
98.678 57.299 L
98.776 57.299 L
98.873 57.299 L
98.971 57.299 L
99.074 57.299 L
99.172 57.299 L
99.275 57.299 L
99.373 57.299 L
99.476 57.299 L
99.59 57.299 L
99.677 57.299 L
99.786 57.299 L
99.889 57.299 L
99.998 57.299 L
100.112 57.299 L
100.198 57.299 L
100.302 57.299 L
100.41 57.299 L
100.519 57.299 L
100.627 57.299 L
100.736 57.299 L
100.845 57.299 L
100.964 57.299 L
101.078 57.299 L
101.192 57.299 L
101.295 57.299 L
101.409 57.299 L
101.518 57.299 L
101.643 57.299 L
101.751 57.299 L
101.871 57.299 L
101.996 57.299 L
102.11 57.299 L
102.229 57.299 L
102.343 57.299 L
102.468 57.299 L
102.593 57.299 L
102.713 57.299 L
102.827 57.299 L
102.951 57.299 L
103.076 57.299 L
103.196 57.299 L
103.321 57.299 L
103.44 57.299 L
103.56 57.299 L
103.684 57.299 L
103.809 57.299 L
103.934 57.299 L
104.07 57.299 L
104.2 57.299 L
104.32 57.299 L
104.445 57.299 L
104.586 57.299 L
104.711 57.299 L
104.846 57.299 L
104.977 57.299 L
105.113 57.299 L
105.254 57.299 L
105.368 57.299 L
105.504 57.299 L
105.639 57.299 L
105.78 57.299 L
105.911 57.299 L
106.047 57.299 L
106.188 57.299 L
106.334 57.299 L
106.47 57.299 L
106.606 57.299 L
106.736 57.299 L
106.877 57.299 L
107.019 57.299 L
107.165 57.299 L
107.306 57.299 L
107.453 57.299 L
107.589 57.299 L
107.741 57.299 L
107.887 57.299 L
108.023 57.299 L
108.181 57.299 L
108.316 57.299 L
108.463 57.299 L
109.071 57.299 L
109.223 57.299 L
109.353 57.299 L
109.505 57.299 L
109.657 57.299 L
109.81 57.299 L
109.967 57.299 L
110.119 57.299 L
110.276 57.299 L
110.429 57.299 L
110.575 57.299 L
110.727 57.299 L
110.896 57.299 L
111.053 57.299 L
111.194 57.299 L
111.357 57.299 L
111.515 57.299 L
111.672 57.299 L
111.819 57.299 L
111.982 57.299 L
112.155 57.299 L
112.313 57.299 L
112.465 57.299 L
112.628 57.299 L
112.791 57.299 L
112.959 57.299 L
113.116 57.299 L
113.296 57.299 L
113.453 57.299 L
113.611 57.299 L
113.768 57.299 L
113.942 57.299 L
114.116 57.299 L
114.273 57.299 L
114.447 57.299 L
114.615 57.299 L
114.773 57.299 L
114.946 57.299 L
115.115 57.299 L
115.283 57.299 L
115.451 57.299 L
115.63 57.299 L
115.81 57.299 L
115.897 57.299 L
116.065 57.299 L
116.249 57.299 L
116.429 57.299 L
116.619 57.299 L
116.787 57.299 L
116.972 57.299 L
117.151 57.299 L
117.319 57.299 L
117.509 57.299 L
117.683 57.299 L
117.862 57.299 L
118.052 57.299 L
118.231 57.299 L
118.405 57.299 L
118.595 57.299 L
118.785 57.299 L
118.975 57.299 L
119.144 57.299 L
119.334 57.299 L
119.518 57.299 L
119.708 57.299 L
119.898 57.299 L
120.089 57.299 L
120.279 57.299 L
120.463 57.299 L
120.653 57.299 L
120.86 57.299 L
121.055 57.299 L
121.234 57.299 L
121.43 57.299 L
121.62 57.299 L
121.81 57.299 L
122.016 57.299 L
122.212 57.299 L
122.402 57.299 L
122.592 57.299 L
122.793 57.299 L
122.999 57.299 L
123.189 57.299 L
123.39 57.299 L
123.596 57.299 L
123.786 57.299 L
123.987 57.299 L
124.177 57.299 L
124.389 57.299 L
124.59 57.299 L
124.802 57.299 L
125.014 57.299 L
125.22 57.299 L
125.426 57.299 L
125.616 57.299 L
125.828 57.299 L
126.051 57.299 L
126.241 57.299 L
126.447 57.299 L
126.664 57.299 L
126.876 57.299 L
127.077 57.299 L
127.3 57.299 L
127.5 57.299 L
127.712 57.299 L
127.94 57.299 L
128.136 57.299 L
128.364 57.299 L
128.565 57.299 L
128.782 57.299 L
129.005 57.299 L
129.216 57.299 L
129.434 57.299 L
129.651 57.299 L
129.868 57.299 L
130.096 57.299 L
130.308 57.299 L
130.53 57.299 L
130.753 57.299 L
130.965 57.299 L
131.193 57.299 L
131.415 57.299 L
131.644 57.299 L
131.861 57.299 L
132.078 57.299 L
132.306 57.299 L
132.534 57.299 L
132.746 57.299 L
132.974 57.299 L
133.202 57.299 L
133.43 57.299 L
133.664 57.299 L
133.892 57.299 L
134.125 57.299 L
134.359 57.299 L
134.576 57.299 L
134.809 57.299 L
135.048 57.299 L
135.282 57.299 L
135.521 57.299 L
135.759 57.299 L
135.977 57.299 L
136.216 57.299 L
136.455 57.299 L
136.683 57.299 L
136.922 57.299 L
137.15 57.299 L
137.394 57.299 L
137.633 57.299 L
137.872 57.299 L
138.122 57.299 L
138.355 57.299 L
138.594 57.299 L
138.838 57.299 L
139.088 57.299 L
139.322 57.299 L
139.566 57.299 L
139.821 57.299 L
140.06 57.299 L
140.315 57.299 L
140.532 57.299 L
140.782 57.299 L
141.037 57.299 L
141.271 57.299 L
141.537 57.299 L
141.781 57.299 L
142.026 57.299 L
142.574 57.299 L
142.818 57.299 L
143.074 57.299 L
143.307 57.299 L
143.562 57.299 L
143.823 57.299 L
144.062 57.299 L
144.328 57.299 L
144.583 57.299 L
144.833 57.299 L
145.105 57.299 L
145.338 57.299 L
145.593 57.299 L
145.859 57.299 L
146.125 57.299 L
146.386 57.299 L
146.641 57.299 L
146.907 57.299 L
147.168 57.299 L
147.434 57.299 L
147.705 57.299 L
147.966 57.299 L
148.21 57.299 L
148.498 57.299 L
148.732 57.299 L
149.014 57.299 L
149.291 57.299 L
149.546 57.299 L
149.796 57.299 L
150.078 57.299 L
150.605 57.299 L
150.866 57.299 L
151.148 57.299 L
151.409 57.299 L
151.675 57.299 L
151.946 57.299 L
152.207 57.299 L
152.478 57.299 L
152.755 57.299 L
153.049 57.299 L
153.315 57.299 L
153.581 57.299 L
153.847 57.299 L
154.124 57.299 L
154.417 57.299 L
154.683 57.299 L
154.955 57.299 L
155.237 57.299 L
155.519 57.299 L
155.791 57.299 L
156.079 57.299 L
156.366 57.299 L
156.632 57.299 L
156.828 57.299 L
157.11 57.299 L
157.398 57.299 L
157.664 57.299 L
157.968 57.299 L
158.234 57.299 L
158.522 57.299 L
158.81 57.299 L
159.108 57.299 L
159.391 57.299 L
159.684 57.299 L
159.961 57.299 L
160.232 57.299 L
160.542 57.299 L
160.835 57.299 L
161.107 57.299 L
161.416 57.299 L
161.693 57.299 L
161.992 57.299 L
162.443 57.299 L
162.73 57.299 L
163.007 57.299 L
163.311 57.299 L
163.605 57.299 L
163.892 57.299 L
164.196 57.299 L
164.5 57.299 L
164.81 57.299 L
165.092 57.299 L
165.402 57.299 L
165.695 57.299 L
165.988 57.299 L
166.292 57.299 L
166.596 57.299 L
166.901 57.299 L
167.21 57.299 L
167.514 57.299 L
167.818 57.299 L
168.128 57.299 L
168.41 57.299 L
168.703 57.299 L
169.018 57.299 L
169.322 57.299 L
169.637 57.299 L
169.936 57.299 L
170.256 57.299 L
170.94 57.299 L
171.25 57.299 L
171.57 57.299 L
171.874 57.299 L
172.189 57.299 L
172.493 57.299 L
172.808 57.299 L
173.129 57.299 L
173.438 57.299 L
173.742 57.299 L
174.057 57.299 L
174.378 57.299 L
174.698 57.299 L
175.008 57.299 L
175.344 57.299 L
175.659 57.299 L
175.958 57.299 L
176.278 57.299 L
176.593 57.299 L
176.913 57.299 L
177.239 57.299 L
177.57 57.299 L
177.88 57.299 L
178.222 57.299 L
178.526 57.299 L
178.857 57.299 L
179.172 57.299 L
179.509 57.299 L
179.802 57.299 L
180.144 57.299 L
180.47 57.299 L
180.801 57.299 L
181.122 57.299 L
181.464 57.299 L
181.784 57.299 L
181.931 57.299 L
182.246 57.299 L
182.566 57.299 L
182.903 57.299 L
183.25 57.299 L
183.576 57.299 L
183.896 57.299 L
184.239 57.299 L
184.581 57.299 L
184.901 57.299 L
185.227 57.299 L
185.585 57.299 L
185.916 57.299 L
186.258 57.299 L
186.595 57.299 L
186.916 57.299 L
187.241 57.299 L
187.578 57.299 L
187.92 57.299 L
188.257 57.299 L
188.615 57.299 L
188.946 57.299 L
189.283 57.299 L
189.625 57.299 L
189.962 57.299 L
190.331 57.299 L
190.662 57.299 L
191.01 57.299 L
191.352 57.299 L
191.71 57.299 L
192.21 57.299 L
192.541 57.299 L
192.91 57.299 L
193.263 57.299 L
193.605 57.299 L
193.947 57.299 L
194.289 57.299 L
194.632 57.299 L
194.995 57.299 L
195.343 57.299 L
195.69 57.299 L
196.054 57.299 L
196.396 57.299 L
196.766 57.299 L
197.108 57.299 L
197.477 57.299 L
197.83 57.299 L
198.199 57.299 L
198.541 57.299 L
198.916 57.299 L
199.258 57.299 L
199.611 57.299 L
199.953 57.299 L
200.322 57.299 L
200.67 57.299 L
201.044 57.299 L
201.414 57.299 L
201.756 57.299 L
202.141 57.299 L
202.478 57.299 L
202.863 57.299 L
203.238 57.299 L
203.591 57.299 L
203.96 57.299 L
204.335 57.299 L
204.688 57.299 L
205.068 57.299 L
205.426 57.299 L
205.806 57.299 L
206.159 57.299 L
206.54 57.299 L
206.892 57.299 L
207.278 57.299 L
207.653 57.299 L
208.033 57.299 L
208.369 57.299 L
208.739 57.299 L
209.119 57.299 L
209.488 57.299 L
209.874 57.299 L
210.248 57.299 L
210.623 57.299 L
211.003 57.299 L
211.389 57.299 L
211.747 57.299 L
212.306 57.299 L
212.686 57.299 L
213.066 57.299 L
213.447 57.299 L
213.832 57.299 L
214.212 57.299 L
214.598 57.299 L
214.983 57.299 L
215.352 57.299 L
215.733 57.299 L
216.123 57.299 L
216.504 57.299 L
216.878 57.299 L
217.258 57.299 L
217.644 57.299 L
218.04 57.299 L
218.42 57.299 L
218.811 57.299 L
219.197 57.299 L
219.599 57.299 L
219.99 57.299 L
220.381 57.299 L
220.772 57.299 L
221.146 57.299 L
221.515 57.299 L
221.917 57.299 L
222.314 57.299 L
222.716 57.299 L
223.117 57.299 L
223.508 57.299 L
223.894 57.299 L
224.29 57.299 L
224.692 57.299 L
225.083 57.299 L
225.479 57.299 L
225.887 57.299 L
226.283 57.299 L
226.69 57.299 L
227.092 57.299 L
227.472 57.299 L
227.874 57.299 L
228.26 57.299 L
228.667 57.299 L
229.074 57.299 L
229.492 57.299 L
229.872 57.299 L
230.279 57.299 L
230.692 57.299 L
231.463 57.299 L
231.87 57.299 L
232.283 57.299 L
232.701 57.299 L
233.092 57.299 L
233.472 57.299 L
233.89 57.299 L
234.314 57.299 L
234.732 57.299 L
235.145 57.299 L
235.568 57.299 L
235.965 57.299 L
236.356 57.299 L
236.774 57.299 L
237.186 57.299 L
237.507 57.299 L
237.92 57.299 L
238.332 57.299 L
238.756 57.299 L
239.179 57.299 L
239.608 57.299 L
240.021 57.299 L
240.434 57.299 L
240.835 57.299 L
241.27 57.299 L
241.693 57.299 L
242.106 57.299 L
242.54 57.299 L
242.964 57.299 L
243.371 57.299 L
243.811 57.299 L
244.224 57.299 L
244.647 57.299 L
245.076 57.299 L
245.478 57.299 L
245.902 57.299 L
246.336 57.299 L
246.765 57.299 L
247.194 57.299 L
247.634 57.299 L
248.052 57.299 L
248.508 57.299 L
248.915 57.299 L
249.371 57.299 L
249.768 57.299 L
250.218 57.299 L
250.637 57.299 L
251.076 57.299 L
251.522 57.299 L
251.951 57.299 L
252.38 57.299 L
252.841 57.299 L
253.265 57.299 L
253.694 57.299 L
254.123 57.299 L
254.579 57.299 L
255.372 57.299 L
255.801 57.299 L
256.257 57.299 L
256.713 57.299 L
257.136 57.299 L
257.565 57.299 L
258.021 57.299 L
258.477 57.299 L
258.906 57.299 L
259.363 57.299 L
259.792 57.299 L
260.248 57.299 L
260.671 57.299 L
261.133 57.299 L
261.589 57.299 L
262.012 57.299 L
262.469 57.299 L
262.93 57.299 L
263.381 57.299 L
263.81 57.299 L
264.369 57.299 L
264.825 57.299 L
265.281 57.299 L
265.71 57.299 L
266.166 57.299 L
266.628 57.299 L
267.084 57.299 L
267.535 57.299 L
267.996 57.299 L
268.447 57.299 L
268.919 57.299 L
269.375 57.299 L
269.837 57.299 L
270.277 57.299 L
270.733 57.299 L
271.2 57.299 L
271.634 57.299 L
272.107 57.299 L
272.568 57.299 L
273.041 57.299 L
273.66 356.645 L
274.127 445.124 L
274.577 432.94 L
275.05 424.671 L
275.484 422.418 L
275.962 422.075 L
276.435 422.011 L
276.88 421.966 L
277.352 421.968 L
277.835 421.983 L
278.297 421.984 L
278.759 421.964 L
279.22 421.921 L
279.698 421.874 L
280.181 422.017 L
280.659 421.864 L
281.088 421.999 L
281.571 421.955 L
282.055 421.864 L
282.527 421.976 L
283.01 421.958 L
283.493 421.878 L
283.912 421.982 L
284.248 421.93 L
284.737 421.978 L
285.22 422.01 L
285.665 421.929 L
286.154 421.98 L
286.654 421.905 L
287.115 422 L
287.577 421.885 L
288.071 421.906 L
288.571 421.951 L
289.054 422.015 L
289.505 421.836 L
289.977 421.947 L
290.482 421.961 L
290.96 421.986 L
291.459 421.942 L
291.888 421.939 L
292.388 421.922 L
292.877 421.951 L
293.371 421.972 L
293.865 422.012 L
294.321 421.887 L
295.059 421.873 L
295.537 421.909 L
296.015 421.999 L
296.526 421.931 L
297.003 421.922 L
297.481 421.975 L
297.954 421.912 L
298.453 421.951 L
298.947 422.021 L
299.414 421.947 L
299.903 421.954 L
300.424 421.887 L
300.897 421.967 L
301.353 421.893 L
301.863 422.118 L
302.341 421.9 L
302.824 421.95 L
303.34 421.932 L
303.818 421.948 L
304.301 421.998 L
304.806 421.987 L
305.284 421.934 L
305.8 421.939 L
306.202 421.962 L
306.642 421.967 L
307.152 421.819 L
307.635 421.936 L
308.151 422.012 L
308.629 421.876 L
309.112 421.927 L
309.634 421.995 L
310.117 421.906 L
310.567 421.984 L
311.083 421.939 L
311.572 421.945 L
312.066 421.962 L
312.582 421.96 L
313.044 421.932 L
313.82 421.936 L
314.292 421.956 L
314.814 421.916 L
315.292 421.914 L
315.769 421.932 L
316.291 421.935 L
316.769 421.916 L
317.284 421.972 L
317.762 421.928 L
318.24 422.004 L
318.75 421.961 L
319.207 422.026 L
319.657 421.954 L
320.189 421.908 L
320.651 421.962 L
321.156 421.968 L
321.639 422.057 L
322.161 421.959 L
322.622 421.959 L
323.1 421.985 L
323.616 421.824 L
324.094 421.983 L
324.577 421.989 L
325.093 421.876 L
325.576 421.987 L
326.032 421.962 L
326.553 421.931 L
327.08 421.867 L
327.531 422.089 L
328.014 421.95 L
328.524 421.918 L
329.019 422.01 L
329.513 421.853 L
329.98 421.994 L
330.479 421.957 L
330.968 421.863 L
331.468 421.973 L
331.962 421.949 L
332.44 421.967 L
332.945 421.951 L
333.775 421.933 L
334.291 422.07 L
334.769 421.955 L
335.252 421.853 L
335.736 422.007 L
336.203 421.968 L
336.702 421.912 L
337.212 421.979 L
337.69 421.891 L
338.168 421.942 L
338.657 421.932 L
339.135 421.967 L
339.656 421.965 L
340.118 421.953 L
340.655 421.98 L
341.111 421.889 L
341.595 421.945 L
342.099 421.96 L
342.577 421.985 L
343.088 421.933 L
343.571 421.957 L
344.054 421.915 L
344.565 422.08 L
344.999 421.931 L
345.515 421.945 L
345.998 422.065 L
346.492 421.95 L
347.003 421.958 L
347.486 421.99 L
347.986 421.917 L
348.29 421.941 L
348.73 421.898 L
349.229 421.937 L
349.723 421.961 L
350.206 421.978 L
350.722 421.968 L
351.2 421.92 L
351.7 421.99 L
352.178 421.889 L
352.672 422.014 L
353.171 421.936 L
353.655 421.948 L
354.556 421.985 L
355.061 421.91 L
355.522 421.915 L
356.022 422.04 L
356.489 421.958 L
356.989 421.837 L
357.477 422.018 L
357.961 421.997 L
358.444 421.816 L
358.949 421.996 L
359.427 421.96 L
359.921 421.926 L
360.415 422.024 L
360.909 421.964 L
361.398 421.836 L
361.876 421.961 L
362.359 422.021 L
362.842 421.839 L
363.309 421.925 L
363.819 422.076 L
364.308 421.875 L
364.797 421.901 L
365.291 422.095 L
365.725 421.933 L
366.263 421.901 L
366.697 421.981 L
367.181 421.94 L
367.68 421.998 L
368.18 421.93 L
368.658 421.943 L
369.13 421.944 L
369.63 421.883 L
370.118 421.972 L
370.596 421.963 L
371.079 421.972 L
371.563 421.925 L
372.046 421.946 L
372.54 421.906 L
373.04 421.965 L
373.496 421.975 L
374.435 421.997 L
374.891 421.91 L
375.369 421.963 L
375.88 421.959 L
376.363 421.864 L
376.846 421.95 L
377.356 421.893 L
377.818 422.065 L
378.323 421.967 L
378.812 421.889 L
379.3 422.016 L
379.795 421.906 L
380.262 421.986 L
380.718 421.946 L
381.217 421.922 L
381.69 421.97 L
382.195 421.938 L
382.694 421.951 L
383.188 421.998 L
383.677 421.976 L
384.111 421.948 L
384.606 421.977 L
385.094 421.977 L
385.588 421.936 L
386.088 421.964 L
386.566 421.918 L
387.076 421.984 L
387.554 421.916 L
388.037 421.919 L
388.515 421.927 L
388.988 421.945 L
389.465 421.919 L
389.976 421.966 L
390.465 421.999 L
390.959 421.899 L
391.415 421.954 L
391.909 422.017 L
392.419 421.897 L
392.87 421.949 L
393.408 422 L
393.869 421.935 L
394.336 421.993 L
394.868 421.945 L
395.33 421.916 L
395.78 421.951 L
396.296 421.968 L
396.78 421.872 L
397.529 421.968 L
398.007 421.912 L
398.517 421.944 L
398.995 421.933 L
399.478 421.946 L
399.962 421.969 L
400.456 421.907 L
400.923 421.981 L
401.417 422.021 L
401.884 421.847 L
402.389 421.942 L
402.877 421.978 L
403.382 421.936 L
403.849 421.953 L
404.344 421.951 L
404.816 421.952 L
405.31 421.949 L
405.772 421.919 L
406.097 421.887 L
406.57 421.977 L
407.048 421.942 L
407.531 421.883 L
408.047 421.949 L
408.498 421.938 L
409.003 421.999 L
409.486 421.911 L
409.964 422.076 L
410.463 421.879 L
410.963 421.899 L
411.424 422.111 L
411.929 421.946 L
412.418 421.915 L
412.89 421.976 L
413.39 421.939 L
413.89 421.942 L
415.073 421.903 L
415.567 421.995 L
416.056 421.934 L
416.529 421.971 L
417.033 421.899 L
417.5 421.947 L
417.995 421.962 L
418.456 421.982 L
418.967 421.961 L
419.455 421.891 L
419.933 422.015 L
420.411 421.919 L
420.916 421.96 L
421.394 421.924 L
421.877 422.023 L
422.387 421.911 L
422.844 421.947 L
423.327 421.912 L
423.826 421.935 L
424.31 421.946 L
424.826 421.988 L
425.309 421.877 L
425.787 421.953 L
426.27 421.937 L
426.742 421.974 L
427.231 421.874 L
427.703 421.97 L
428.219 421.976 L
428.686 421.92 L
429.17 421.988 L
429.68 421.937 L
430.163 421.956 L
430.63 421.98 L
431.124 421.948 L
431.597 421.944 L
431.912 421.912 L
432.422 421.945 L
432.905 421.893 L
433.383 421.932 L
433.866 421.941 L
434.371 421.926 L
434.822 421.977 L
435.338 421.996 L
435.816 421.9 L
436.31 421.954 L
436.772 421.982 L
437.282 421.914 L
437.76 421.966 L
438.265 421.896 L
438.732 421.945 L
439.182 421.947 L
439.644 421.925 L
440.133 421.973 L
440.632 421.948 L
441.105 421.889 L
441.604 422.046 L
442.104 421.985 L
442.592 421.798 L
443.054 421.974 L
443.559 421.997 L
444.026 421.906 L
444.493 421.955 L
445.003 421.97 L
445.487 421.893 L
445.986 421.985 L
446.48 421.953 L
446.953 421.891 L
447.751 421.907 L
448.256 421.879 L
448.739 421.958 L
449.223 422.011 L
449.695 421.805 L
450.173 421.938 L
450.694 422.008 L
451.172 421.85 L
451.655 421.966 L
452.133 421.91 L
452.611 422 L
453.105 421.892 L
453.599 421.998 L
454.093 421.907 L
454.582 421.937 L
455.576 421.953 L
456.048 421.907 L
456.526 422.056 L
457.02 421.953 L
457.509 421.923 L
458.008 422.034 L
458.492 421.905 L
458.986 421.899 L
459.453 422.021 L
459.93 421.903 L
460.414 421.915 L
460.902 421.984 L
461.397 421.988 L
461.695 421.988 L
462.151 421.955 L
462.645 421.933 L
463.134 421.919 L
463.628 421.947 L
464.117 421.936 L
464.611 421.879 L
465.1 421.975 L
465.589 421.805 L
466.088 421.972 L
466.544 422.009 L
467.375 422.052 L
467.869 421.983 L
468.363 421.808 L
468.852 422.019 L
469.346 421.98 L
469.84 421.929 L
470.329 421.967 L
470.763 421.872 L
471.252 421.971 L
471.746 421.947 L
472.24 421.914 L
472.729 421.982 L
473.223 421.977 L
473.717 421.94 L
474.206 421.957 L
474.64 421.992 L
475.134 421.956 L
475.623 421.955 L
476.123 421.981 L
476.611 421.973 L
477.225 421.946 L
477.719 421.909 L
478.154 421.922 L
478.642 421.928 L
479.136 421.903 L
479.652 421.928 L
480.119 421.942 L
480.603 421.934 L
481.113 422.04 L
481.602 421.932 L
482.074 421.899 L
482.546 421.975 L
483.03 421.902 L
483.508 421.938 L
483.991 421.948 L
484.501 421.928 L
484.974 421.929 L
485.457 421.959 L
485.951 421.937 L
486.44 422.013 L
486.901 421.907 L
487.39 422.036 L
487.9 421.894 L
488.357 421.941 L
488.867 421.982 L
489.367 421.89 L
489.508 421.95 L
489.98 421.886 L
490.512 422.015 L
490.952 421.98 L
491.43 421.813 L
491.94 422.065 L
492.429 421.919 L
492.907 421.984 L
493.39 421.911 L
493.901 421.958 L
494.373 421.994 L
494.829 421.978 L
495.459 421.973 L
495.817 421.841 L
496.301 421.947 L
496.806 421.969 L
497.278 422.016 L
497.761 421.863 L
498.234 421.992 L
499.179 421.879 L
499.64 421.991 L
500.156 421.952 L
500.634 421.92 L
501.112 421.941 L
501.584 421.948 L
502.094 421.948 L
502.561 421.987 L
503.023 421.952 L
503.555 421.976 L
504.028 421.976 L
504.489 421.952 L
504.989 421.959 L
505.488 421.914 L
505.966 421.943 L
506.433 421.963 L
506.943 421.961 L
507.427 421.913 L
507.899 421.978 L
508.382 421.904 L
509.012 421.854 L
509.485 422.028 L
509.973 421.982 L
510.462 421.882 L
510.951 421.97 L
511.445 421.993 L
511.912 421.911 L
512.406 421.948 L
512.873 421.946 L
513.362 421.964 L
513.856 421.953 L
514.35 421.894 L
514.849 421.931 L
515.338 421.928 L
515.827 421.966 L
516.745 421.986 L
517.206 422.019 L
517.7 421.961 L
518.189 421.914 L
518.683 421.897 L
519.166 421.934 L
519.65 422.029 L
520.144 421.929 L
520.611 421.947 L
521.067 421.979 L
521.566 421.905 L
522.05 421.935 L
522.538 421.917 L
523.027 421.927 L
523.532 421.897 L
524.021 421.947 L
524.52 421.941 L
524.971 421.921 L
525.454 421.911 L
525.943 421.936 L
S
GR
GS
[0.6 0 0 0.6 0 0] CT
1 GC
N
621 118 M
621 52 L
383 52 L
383 118 L
cp
f
GR
GS
[0.6 0 0 0.6 265.08706 41.76] CT
N
1.75 9 M
1.75 -7.469 L
3.984 -7.469 L
12.641 5.469 L
12.641 -7.469 L
14.719 -7.469 L
14.719 9 L
12.484 9 L
3.844 -3.938 L
3.844 9 L
1.75 9 L
cp
26.132 7.531 M
25.007 8.484 23.968 8.875 QT
22.929 9.266 21.742 9.266 QT
19.773 9.266 18.718 8.305 QT
17.664 7.344 17.664 5.859 QT
17.664 4.984 18.062 4.258 QT
18.461 3.531 19.109 3.094 QT
19.757 2.656 20.57 2.438 QT
21.164 2.266 22.367 2.125 QT
24.804 1.828 25.961 1.438 QT
25.976 1.016 25.976 0.906 QT
25.976 -0.328 25.398 -0.844 QT
24.632 -1.516 23.101 -1.516 QT
21.679 -1.516 21 -1.023 QT
20.32 -0.531 19.992 0.75 QT
18.007 0.469 L
18.289 -0.797 18.906 -1.578 QT
19.523 -2.359 20.687 -2.781 QT
21.851 -3.203 23.398 -3.203 QT
24.929 -3.203 25.882 -2.844 QT
26.836 -2.484 27.281 -1.938 QT
27.726 -1.391 27.914 -0.563 QT
28.007 -0.047 28.007 1.313 QT
28.007 4 L
28.007 6.828 28.14 7.57 QT
28.273 8.313 28.648 9 QT
26.539 9 L
26.226 8.375 26.132 7.531 QT
cp
25.961 3.016 M
24.867 3.469 22.664 3.781 QT
21.414 3.953 20.898 4.18 QT
20.382 4.406 20.101 4.836 QT
19.82 5.266 19.82 5.797 QT
19.82 6.609 20.437 7.148 QT
21.054 7.688 22.226 7.688 QT
23.398 7.688 24.304 7.172 QT
25.211 6.656 25.648 5.781 QT
25.961 5.094 25.961 3.75 QT
25.961 3.016 L
cp
31.316 9 M
31.316 -2.922 L
33.129 -2.922 L
33.129 -1.25 L
33.691 -2.125 34.621 -2.664 QT
35.551 -3.203 36.738 -3.203 QT
38.066 -3.203 38.918 -2.648 QT
39.77 -2.094 40.113 -1.109 QT
41.52 -3.203 43.801 -3.203 QT
45.566 -3.203 46.52 -2.219 QT
47.473 -1.234 47.473 0.813 QT
47.473 9 L
45.473 9 L
45.473 1.484 L
45.473 0.281 45.277 -0.258 QT
45.082 -0.797 44.559 -1.117 QT
44.035 -1.438 43.348 -1.438 QT
42.082 -1.438 41.254 -0.602 QT
40.426 0.234 40.426 2.078 QT
40.426 9 L
38.41 9 L
38.41 1.25 L
38.41 -0.094 37.91 -0.766 QT
37.41 -1.438 36.285 -1.438 QT
35.441 -1.438 34.715 -0.992 QT
33.988 -0.547 33.66 0.32 QT
33.332 1.188 33.332 2.813 QT
33.332 9 L
31.316 9 L
cp
58.908 5.156 M
60.986 5.422 L
60.502 7.25 59.166 8.258 QT
57.83 9.266 55.752 9.266 QT
53.127 9.266 51.595 7.656 QT
50.064 6.047 50.064 3.141 QT
50.064 0.125 51.611 -1.539 QT
53.158 -3.203 55.627 -3.203 QT
58.033 -3.203 59.548 -1.57 QT
61.064 0.063 61.064 3.016 QT
61.064 3.188 61.048 3.547 QT
52.158 3.547 L
52.267 5.516 53.267 6.563 QT
54.267 7.609 55.752 7.609 QT
56.861 7.609 57.65 7.023 QT
58.439 6.438 58.908 5.156 QT
cp
52.267 1.891 M
58.923 1.891 L
58.783 0.391 58.158 -0.359 QT
57.189 -1.531 55.658 -1.531 QT
54.267 -1.531 53.314 -0.602 QT
52.361 0.328 52.267 1.891 QT
cp
55.22 -6.234 M
56.455 -8.141 L
58.752 -8.141 L
56.22 -5 L
54.064 -5 L
51.642 -8.141 L
53.955 -8.141 L
55.22 -6.234 L
cp
63.686 9 M
63.686 -2.922 L
65.498 -2.922 L
65.498 -1.125 L
66.201 -2.391 66.787 -2.797 QT
67.373 -3.203 68.076 -3.203 QT
69.108 -3.203 70.154 -2.547 QT
69.467 -0.672 L
68.717 -1.109 67.983 -1.109 QT
67.311 -1.109 66.787 -0.711 QT
66.264 -0.313 66.045 0.391 QT
65.701 1.469 65.701 2.75 QT
65.701 9 L
63.686 9 L
cp
67.186 -6.234 M
68.42 -8.141 L
70.717 -8.141 L
68.186 -5 L
66.029 -5 L
63.608 -8.141 L
65.92 -8.141 L
67.186 -6.234 L
cp
79.636 5.156 M
81.715 5.422 L
81.23 7.25 79.894 8.258 QT
78.558 9.266 76.48 9.266 QT
73.855 9.266 72.324 7.656 QT
70.793 6.047 70.793 3.141 QT
70.793 0.125 72.34 -1.539 QT
73.886 -3.203 76.355 -3.203 QT
78.761 -3.203 80.277 -1.57 QT
81.793 0.063 81.793 3.016 QT
81.793 3.188 81.777 3.547 QT
72.886 3.547 L
72.996 5.516 73.996 6.563 QT
74.996 7.609 76.48 7.609 QT
77.59 7.609 78.379 7.023 QT
79.168 6.438 79.636 5.156 QT
cp
72.996 1.891 M
79.652 1.891 L
79.511 0.391 78.886 -0.359 QT
77.918 -1.531 76.386 -1.531 QT
74.996 -1.531 74.043 -0.602 QT
73.09 0.328 72.996 1.891 QT
cp
84.43 9 M
84.43 -2.922 L
86.242 -2.922 L
86.242 -1.234 L
87.57 -3.203 90.039 -3.203 QT
91.117 -3.203 92.024 -2.813 QT
92.93 -2.422 93.383 -1.789 QT
93.836 -1.156 94.008 -0.297 QT
94.117 0.266 94.117 1.672 QT
94.117 9 L
92.102 9 L
92.102 1.75 L
92.102 0.516 91.867 -0.102 QT
91.633 -0.719 91.031 -1.078 QT
90.43 -1.438 89.617 -1.438 QT
88.32 -1.438 87.383 -0.625 QT
86.445 0.188 86.445 2.484 QT
86.445 9 L
84.43 9 L
cp
105.176 7.531 M
104.051 8.484 103.012 8.875 QT
101.973 9.266 100.786 9.266 QT
98.817 9.266 97.762 8.305 QT
96.708 7.344 96.708 5.859 QT
96.708 4.984 97.106 4.258 QT
97.504 3.531 98.153 3.094 QT
98.801 2.656 99.614 2.438 QT
100.208 2.266 101.411 2.125 QT
103.848 1.828 105.004 1.438 QT
105.02 1.016 105.02 0.906 QT
105.02 -0.328 104.442 -0.844 QT
103.676 -1.516 102.145 -1.516 QT
100.723 -1.516 100.044 -1.023 QT
99.364 -0.531 99.036 0.75 QT
97.051 0.469 L
97.333 -0.797 97.95 -1.578 QT
98.567 -2.359 99.731 -2.781 QT
100.895 -3.203 102.442 -3.203 QT
103.973 -3.203 104.926 -2.844 QT
105.879 -2.484 106.325 -1.938 QT
106.77 -1.391 106.958 -0.563 QT
107.051 -0.047 107.051 1.313 QT
107.051 4 L
107.051 6.828 107.184 7.57 QT
107.317 8.313 107.692 9 QT
105.583 9 L
105.27 8.375 105.176 7.531 QT
cp
105.004 3.016 M
103.911 3.469 101.708 3.781 QT
100.458 3.953 99.942 4.18 QT
99.426 4.406 99.145 4.836 QT
98.864 5.266 98.864 5.797 QT
98.864 6.609 99.481 7.148 QT
100.098 7.688 101.27 7.688 QT
102.442 7.688 103.348 7.172 QT
104.254 6.656 104.692 5.781 QT
105.004 5.094 105.004 3.75 QT
105.004 3.016 L
cp
101.208 -5 M
102.692 -8.141 L
105.348 -8.141 L
102.879 -5 L
101.208 -5 L
cp
124.572 9 M
124.572 7.5 L
123.447 9.266 121.244 9.266 QT
119.822 9.266 118.619 8.484 QT
117.415 7.703 116.759 6.289 QT
116.103 4.875 116.103 3.047 QT
116.103 1.266 116.705 -0.188 QT
117.306 -1.641 118.494 -2.422 QT
119.681 -3.203 121.15 -3.203 QT
122.228 -3.203 123.072 -2.742 QT
123.915 -2.281 124.447 -1.563 QT
124.447 -7.469 L
126.447 -7.469 L
126.447 9 L
124.572 9 L
cp
118.181 3.047 M
118.181 5.344 119.15 6.477 QT
120.119 7.609 121.431 7.609 QT
122.759 7.609 123.681 6.523 QT
124.603 5.438 124.603 3.219 QT
124.603 0.766 123.665 -0.375 QT
122.728 -1.516 121.337 -1.516 QT
119.994 -1.516 119.087 -0.422 QT
118.181 0.672 118.181 3.047 QT
cp
137.584 7.531 M
136.459 8.484 135.42 8.875 QT
134.381 9.266 133.193 9.266 QT
131.225 9.266 130.17 8.305 QT
129.115 7.344 129.115 5.859 QT
129.115 4.984 129.514 4.258 QT
129.912 3.531 130.56 3.094 QT
131.209 2.656 132.021 2.438 QT
132.615 2.266 133.818 2.125 QT
136.256 1.828 137.412 1.438 QT
137.428 1.016 137.428 0.906 QT
137.428 -0.328 136.85 -0.844 QT
136.084 -1.516 134.553 -1.516 QT
133.131 -1.516 132.451 -1.023 QT
131.771 -0.531 131.443 0.75 QT
129.459 0.469 L
129.74 -0.797 130.357 -1.578 QT
130.975 -2.359 132.139 -2.781 QT
133.303 -3.203 134.85 -3.203 QT
136.381 -3.203 137.334 -2.844 QT
138.287 -2.484 138.732 -1.938 QT
139.178 -1.391 139.365 -0.563 QT
139.459 -0.047 139.459 1.313 QT
139.459 4 L
139.459 6.828 139.592 7.57 QT
139.725 8.313 140.1 9 QT
137.99 9 L
137.678 8.375 137.584 7.531 QT
cp
137.412 3.016 M
136.318 3.469 134.115 3.781 QT
132.865 3.953 132.35 4.18 QT
131.834 4.406 131.553 4.836 QT
131.271 5.266 131.271 5.797 QT
131.271 6.609 131.889 7.148 QT
132.506 7.688 133.678 7.688 QT
134.85 7.688 135.756 7.172 QT
136.662 6.656 137.1 5.781 QT
137.412 5.094 137.412 3.75 QT
137.412 3.016 L
cp
147.19 7.188 M
147.471 8.984 L
146.627 9.156 145.94 9.156 QT
144.846 9.156 144.237 8.805 QT
143.627 8.453 143.385 7.891 QT
143.143 7.328 143.143 5.5 QT
143.143 -1.359 L
141.659 -1.359 L
141.659 -2.922 L
143.143 -2.922 L
143.143 -5.875 L
145.143 -7.094 L
145.143 -2.922 L
147.19 -2.922 L
147.19 -1.359 L
145.143 -1.359 L
145.143 5.625 L
145.143 6.484 145.252 6.734 QT
145.362 6.984 145.604 7.125 QT
145.846 7.266 146.299 7.266 QT
146.627 7.266 147.19 7.188 QT
cp
157.026 7.531 M
155.901 8.484 154.862 8.875 QT
153.823 9.266 152.636 9.266 QT
150.667 9.266 149.612 8.305 QT
148.557 7.344 148.557 5.859 QT
148.557 4.984 148.956 4.258 QT
149.354 3.531 150.003 3.094 QT
150.651 2.656 151.464 2.438 QT
152.057 2.266 153.261 2.125 QT
155.698 1.828 156.854 1.438 QT
156.87 1.016 156.87 0.906 QT
156.87 -0.328 156.292 -0.844 QT
155.526 -1.516 153.995 -1.516 QT
152.573 -1.516 151.893 -1.023 QT
151.214 -0.531 150.886 0.75 QT
148.901 0.469 L
149.182 -0.797 149.8 -1.578 QT
150.417 -2.359 151.581 -2.781 QT
152.745 -3.203 154.292 -3.203 QT
155.823 -3.203 156.776 -2.844 QT
157.729 -2.484 158.175 -1.938 QT
158.62 -1.391 158.807 -0.563 QT
158.901 -0.047 158.901 1.313 QT
158.901 4 L
158.901 6.828 159.034 7.57 QT
159.167 8.313 159.542 9 QT
157.432 9 L
157.12 8.375 157.026 7.531 QT
cp
156.854 3.016 M
155.761 3.469 153.557 3.781 QT
152.307 3.953 151.792 4.18 QT
151.276 4.406 150.995 4.836 QT
150.714 5.266 150.714 5.797 QT
150.714 6.609 151.331 7.148 QT
151.948 7.688 153.12 7.688 QT
154.292 7.688 155.198 7.172 QT
156.104 6.656 156.542 5.781 QT
156.854 5.094 156.854 3.75 QT
156.854 3.016 L
cp
f
GR
GS
[0.6 0 0 0.6 0 0] CT
0 0 1 RC
1 LJ
3.333 LW
N
388.005 69.6 M
438.058 69.6 L
S
GR
GS
[0.6 0 0 0.6 265.08706 60.24] CT
/Helvetica 23.333 F
GS
[1 0 0 1 0 0] CT
0 9 moveto 
1 -1 scale
(Simulovan\341 data) t 
GR
GR
GS
[0.6 0 0 0.6 0 0] CT
1 0 0 RC
[12 12] 0 setdash
2 LJ
3.333 LW
N
388.005 100.4 M
438.058 100.4 L
S
GR
GS
[0.6 0 0 0.6 0 0] CT
0.149 GC
10.0 ML
0.833 LW
N
383 118 M
383 52 L
621 52 L
621 118 L
cp
S
GR
%%Trailer
%%Pages: 1
%%EOF
