%!PS-Adobe-3.0 EPSF-3.0
%%Creator: (MATLAB, The Mathworks, Inc. Version 9.11.0.1837725 \(R2021b\) Update 2. Operating System: Windows 10)
%%Title: C:/Users/radac/Downloads/ato-g1_aru-rec_20230316-155745_ARU/data_in_csv/model_fm.eps
%%CreationDate: 2023-04-02T15:05:14
%%Pages: (atend)
%%BoundingBox:     0     0   420   315
%%LanguageLevel: 3
%%EndComments
%%BeginProlog
%%BeginResource: procset (Apache XML Graphics Std ProcSet) 1.2 0
%%Version: 1.2 0
%%Copyright: (Copyright 2001-2003,2010 The Apache Software Foundation. License terms: http://www.apache.org/licenses/LICENSE-2.0)
/bd{bind def}bind def
/ld{load def}bd
/GR/grestore ld
/GS/gsave ld
/RM/rmoveto ld
/C/curveto ld
/t/show ld
/L/lineto ld
/ML/setmiterlimit ld
/CT/concat ld
/f/fill ld
/N/newpath ld
/S/stroke ld
/CC/setcmykcolor ld
/A/ashow ld
/cp/closepath ld
/RC/setrgbcolor ld
/LJ/setlinejoin ld
/GC/setgray ld
/LW/setlinewidth ld
/M/moveto ld
/re {4 2 roll M
1 index 0 rlineto
0 exch rlineto
neg 0 rlineto
cp } bd
/_ctm matrix def
/_tm matrix def
/BT { _ctm currentmatrix pop matrix _tm copy pop 0 0 moveto } bd
/ET { _ctm setmatrix } bd
/iTm { _ctm setmatrix _tm concat } bd
/Tm { _tm astore pop iTm 0 0 moveto } bd
/ux 0.0 def
/uy 0.0 def
/F {
  /Tp exch def
  /Tf exch def
  Tf findfont Tp scalefont setfont
  /cf Tf def  /cs Tp def
} bd
/ULS {currentpoint /uy exch def /ux exch def} bd
/ULE {
  /Tcx currentpoint pop def
  gsave
  newpath
  cf findfont cs scalefont dup
  /FontMatrix get 0 get /Ts exch def /FontInfo get dup
  /UnderlinePosition get Ts mul /To exch def
  /UnderlineThickness get Ts mul /Tt exch def
  ux uy To add moveto  Tcx uy To add lineto
  Tt setlinewidth stroke
  grestore
} bd
/OLE {
  /Tcx currentpoint pop def
  gsave
  newpath
  cf findfont cs scalefont dup
  /FontMatrix get 0 get /Ts exch def /FontInfo get dup
  /UnderlinePosition get Ts mul /To exch def
  /UnderlineThickness get Ts mul /Tt exch def
  ux uy To add cs add moveto Tcx uy To add cs add lineto
  Tt setlinewidth stroke
  grestore
} bd
/SOE {
  /Tcx currentpoint pop def
  gsave
  newpath
  cf findfont cs scalefont dup
  /FontMatrix get 0 get /Ts exch def /FontInfo get dup
  /UnderlinePosition get Ts mul /To exch def
  /UnderlineThickness get Ts mul /Tt exch def
  ux uy To add cs 10 mul 26 idiv add moveto Tcx uy To add cs 10 mul 26 idiv add lineto
  Tt setlinewidth stroke
  grestore
} bd
/QT {
/Y22 exch store
/X22 exch store
/Y21 exch store
/X21 exch store
currentpoint
/Y21 load 2 mul add 3 div exch
/X21 load 2 mul add 3 div exch
/X21 load 2 mul /X22 load add 3 div
/Y21 load 2 mul /Y22 load add 3 div
/X22 load /Y22 load curveto
} bd
/SSPD {
dup length /d exch dict def
{
/v exch def
/k exch def
currentpagedevice k known {
/cpdv currentpagedevice k get def
v cpdv ne {
/upd false def
/nullv v type /nulltype eq def
/nullcpdv cpdv type /nulltype eq def
nullv nullcpdv or
{
/upd true def
} {
/sametype v type cpdv type eq def
sametype {
v type /arraytype eq {
/vlen v length def
/cpdvlen cpdv length def
vlen cpdvlen eq {
0 1 vlen 1 sub {
/i exch def
/obj v i get def
/cpdobj cpdv i get def
obj cpdobj ne {
/upd true def
exit
} if
} for
} {
/upd true def
} ifelse
} {
v type /dicttype eq {
v {
/dv exch def
/dk exch def
/cpddv cpdv dk get def
dv cpddv ne {
/upd true def
exit
} if
} forall
} {
/upd true def
} ifelse
} ifelse
} if
} ifelse
upd true eq {
d k v put
} if
} if
} if
} forall
d length 0 gt {
d setpagedevice
} if
} bd
/RE { % /NewFontName [NewEncodingArray] /FontName RE -
  findfont dup length dict begin
  {
    1 index /FID ne
    {def} {pop pop} ifelse
  } forall
  /Encoding exch def
  /FontName 1 index def
  currentdict definefont pop
  end
} bind def
%%EndResource
%%BeginResource: procset (Apache XML Graphics EPS ProcSet) 1.0 0
%%Version: 1.0 0
%%Copyright: (Copyright 2002-2003 The Apache Software Foundation. License terms: http://www.apache.org/licenses/LICENSE-2.0)
/BeginEPSF { %def
/b4_Inc_state save def         % Save state for cleanup
/dict_count countdictstack def % Count objects on dict stack
/op_count count 1 sub def      % Count objects on operand stack
userdict begin                 % Push userdict on dict stack
/showpage { } def              % Redefine showpage, { } = null proc
0 setgray 0 setlinecap         % Prepare graphics state
1 setlinewidth 0 setlinejoin
10 setmiterlimit [ ] 0 setdash newpath
/languagelevel where           % If level not equal to 1 then
{pop languagelevel             % set strokeadjust and
1 ne                           % overprint to their defaults.
{false setstrokeadjust false setoverprint
} if
} if
} bd
/EndEPSF { %def
count op_count sub {pop} repeat            % Clean up stacks
countdictstack dict_count sub {end} repeat
b4_Inc_state restore
} bd
%%EndResource
%FOPBeginFontDict
%%IncludeResource: font Courier-Oblique
%%IncludeResource: font Courier-BoldOblique
%%IncludeResource: font Courier-Bold
%%IncludeResource: font ZapfDingbats
%%IncludeResource: font Symbol
%%IncludeResource: font Helvetica
%%IncludeResource: font Helvetica-Oblique
%%IncludeResource: font Helvetica-Bold
%%IncludeResource: font Helvetica-BoldOblique
%%IncludeResource: font Times-Roman
%%IncludeResource: font Times-Italic
%%IncludeResource: font Times-Bold
%%IncludeResource: font Times-BoldItalic
%%IncludeResource: font Courier
%FOPEndFontDict
%%BeginResource: encoding WinAnsiEncoding
/WinAnsiEncoding [
/.notdef /.notdef /.notdef /.notdef /.notdef
/.notdef /.notdef /.notdef /.notdef /.notdef
/.notdef /.notdef /.notdef /.notdef /.notdef
/.notdef /.notdef /.notdef /.notdef /.notdef
/.notdef /.notdef /.notdef /.notdef /.notdef
/.notdef /.notdef /.notdef /.notdef /.notdef
/.notdef /.notdef /space /exclam /quotedbl
/numbersign /dollar /percent /ampersand /quotesingle
/parenleft /parenright /asterisk /plus /comma
/hyphen /period /slash /zero /one
/two /three /four /five /six
/seven /eight /nine /colon /semicolon
/less /equal /greater /question /at
/A /B /C /D /E
/F /G /H /I /J
/K /L /M /N /O
/P /Q /R /S /T
/U /V /W /X /Y
/Z /bracketleft /backslash /bracketright /asciicircum
/underscore /quoteleft /a /b /c
/d /e /f /g /h
/i /j /k /l /m
/n /o /p /q /r
/s /t /u /v /w
/x /y /z /braceleft /bar
/braceright /asciitilde /bullet /Euro /bullet
/quotesinglbase /florin /quotedblbase /ellipsis /dagger
/daggerdbl /circumflex /perthousand /Scaron /guilsinglleft
/OE /bullet /Zcaron /bullet /bullet
/quoteleft /quoteright /quotedblleft /quotedblright /bullet
/endash /emdash /asciitilde /trademark /scaron
/guilsinglright /oe /bullet /zcaron /Ydieresis
/space /exclamdown /cent /sterling /currency
/yen /brokenbar /section /dieresis /copyright
/ordfeminine /guillemotleft /logicalnot /sfthyphen /registered
/macron /degree /plusminus /twosuperior /threesuperior
/acute /mu /paragraph /middot /cedilla
/onesuperior /ordmasculine /guillemotright /onequarter /onehalf
/threequarters /questiondown /Agrave /Aacute /Acircumflex
/Atilde /Adieresis /Aring /AE /Ccedilla
/Egrave /Eacute /Ecircumflex /Edieresis /Igrave
/Iacute /Icircumflex /Idieresis /Eth /Ntilde
/Ograve /Oacute /Ocircumflex /Otilde /Odieresis
/multiply /Oslash /Ugrave /Uacute /Ucircumflex
/Udieresis /Yacute /Thorn /germandbls /agrave
/aacute /acircumflex /atilde /adieresis /aring
/ae /ccedilla /egrave /eacute /ecircumflex
/edieresis /igrave /iacute /icircumflex /idieresis
/eth /ntilde /ograve /oacute /ocircumflex
/otilde /odieresis /divide /oslash /ugrave
/uacute /ucircumflex /udieresis /yacute /thorn
/ydieresis
] def
%%EndResource
%FOPBeginFontReencode
/Courier-Oblique findfont
dup length dict begin
  {1 index /FID ne {def} {pop pop} ifelse} forall
  /Encoding WinAnsiEncoding def
  currentdict
end
/Courier-Oblique exch definefont pop
/Courier-BoldOblique findfont
dup length dict begin
  {1 index /FID ne {def} {pop pop} ifelse} forall
  /Encoding WinAnsiEncoding def
  currentdict
end
/Courier-BoldOblique exch definefont pop
/Courier-Bold findfont
dup length dict begin
  {1 index /FID ne {def} {pop pop} ifelse} forall
  /Encoding WinAnsiEncoding def
  currentdict
end
/Courier-Bold exch definefont pop
/Helvetica findfont
dup length dict begin
  {1 index /FID ne {def} {pop pop} ifelse} forall
  /Encoding WinAnsiEncoding def
  currentdict
end
/Helvetica exch definefont pop
/Helvetica-Oblique findfont
dup length dict begin
  {1 index /FID ne {def} {pop pop} ifelse} forall
  /Encoding WinAnsiEncoding def
  currentdict
end
/Helvetica-Oblique exch definefont pop
/Helvetica-Bold findfont
dup length dict begin
  {1 index /FID ne {def} {pop pop} ifelse} forall
  /Encoding WinAnsiEncoding def
  currentdict
end
/Helvetica-Bold exch definefont pop
/Helvetica-BoldOblique findfont
dup length dict begin
  {1 index /FID ne {def} {pop pop} ifelse} forall
  /Encoding WinAnsiEncoding def
  currentdict
end
/Helvetica-BoldOblique exch definefont pop
/Times-Roman findfont
dup length dict begin
  {1 index /FID ne {def} {pop pop} ifelse} forall
  /Encoding WinAnsiEncoding def
  currentdict
end
/Times-Roman exch definefont pop
/Times-Italic findfont
dup length dict begin
  {1 index /FID ne {def} {pop pop} ifelse} forall
  /Encoding WinAnsiEncoding def
  currentdict
end
/Times-Italic exch definefont pop
/Times-Bold findfont
dup length dict begin
  {1 index /FID ne {def} {pop pop} ifelse} forall
  /Encoding WinAnsiEncoding def
  currentdict
end
/Times-Bold exch definefont pop
/Times-BoldItalic findfont
dup length dict begin
  {1 index /FID ne {def} {pop pop} ifelse} forall
  /Encoding WinAnsiEncoding def
  currentdict
end
/Times-BoldItalic exch definefont pop
/Courier findfont
dup length dict begin
  {1 index /FID ne {def} {pop pop} ifelse} forall
  /Encoding WinAnsiEncoding def
  currentdict
end
/Courier exch definefont pop
%FOPEndFontReencode
%%EndProlog
%%Page: 1 1
%%PageBoundingBox: 0 0 420 315
%%BeginPageSetup
[1 0 0 -1 0 315] CT
%%EndPageSetup
GS
[0.6 0 0 0.6 0 0] CT
1 GC
N
0 0 700 525 re
f
GR
GS
[0.6 0 0 0.6 0 0] CT
1 GC
N
0 0 700 525 re
f
GR
GS
[0.6 0 0 0.6 0 0] CT
1 GC
N
91 467 M
634 467 L
634 39 L
91 39 L
cp
f
GR
GS
[0.6 0 0 0.6 0 0] CT
0.149 GC
2 setlinecap
1 LJ
0.833 LW
N
91 467 M
634 467 L
S
GR
GS
[0.6 0 0 0.6 0 0] CT
0.149 GC
2 setlinecap
1 LJ
0.833 LW
N
91 39 M
634 39 L
S
GR
GS
[0.6 0 0 0.6 0 0] CT
0.149 GC
2 setlinecap
1 LJ
0.833 LW
N
91 467 M
91 461.57 L
S
GR
GS
[0.6 0 0 0.6 0 0] CT
0.149 GC
2 setlinecap
1 LJ
0.833 LW
N
151.333 467 M
151.333 461.57 L
S
GR
GS
[0.6 0 0 0.6 0 0] CT
0.149 GC
2 setlinecap
1 LJ
0.833 LW
N
211.667 467 M
211.667 461.57 L
S
GR
GS
[0.6 0 0 0.6 0 0] CT
0.149 GC
2 setlinecap
1 LJ
0.833 LW
N
272 467 M
272 461.57 L
S
GR
GS
[0.6 0 0 0.6 0 0] CT
0.149 GC
2 setlinecap
1 LJ
0.833 LW
N
332.333 467 M
332.333 461.57 L
S
GR
GS
[0.6 0 0 0.6 0 0] CT
0.149 GC
2 setlinecap
1 LJ
0.833 LW
N
392.667 467 M
392.667 461.57 L
S
GR
GS
[0.6 0 0 0.6 0 0] CT
0.149 GC
2 setlinecap
1 LJ
0.833 LW
N
453 467 M
453 461.57 L
S
GR
GS
[0.6 0 0 0.6 0 0] CT
0.149 GC
2 setlinecap
1 LJ
0.833 LW
N
513.333 467 M
513.333 461.57 L
S
GR
GS
[0.6 0 0 0.6 0 0] CT
0.149 GC
2 setlinecap
1 LJ
0.833 LW
N
573.667 467 M
573.667 461.57 L
S
GR
GS
[0.6 0 0 0.6 0 0] CT
0.149 GC
2 setlinecap
1 LJ
0.833 LW
N
634 467 M
634 461.57 L
S
GR
GS
[0.6 0 0 0.6 0 0] CT
0.149 GC
2 setlinecap
1 LJ
0.833 LW
N
91 39 M
91 44.43 L
S
GR
GS
[0.6 0 0 0.6 0 0] CT
0.149 GC
2 setlinecap
1 LJ
0.833 LW
N
151.333 39 M
151.333 44.43 L
S
GR
GS
[0.6 0 0 0.6 0 0] CT
0.149 GC
2 setlinecap
1 LJ
0.833 LW
N
211.667 39 M
211.667 44.43 L
S
GR
GS
[0.6 0 0 0.6 0 0] CT
0.149 GC
2 setlinecap
1 LJ
0.833 LW
N
272 39 M
272 44.43 L
S
GR
GS
[0.6 0 0 0.6 0 0] CT
0.149 GC
2 setlinecap
1 LJ
0.833 LW
N
332.333 39 M
332.333 44.43 L
S
GR
GS
[0.6 0 0 0.6 0 0] CT
0.149 GC
2 setlinecap
1 LJ
0.833 LW
N
392.667 39 M
392.667 44.43 L
S
GR
GS
[0.6 0 0 0.6 0 0] CT
0.149 GC
2 setlinecap
1 LJ
0.833 LW
N
453 39 M
453 44.43 L
S
GR
GS
[0.6 0 0 0.6 0 0] CT
0.149 GC
2 setlinecap
1 LJ
0.833 LW
N
513.333 39 M
513.333 44.43 L
S
GR
GS
[0.6 0 0 0.6 0 0] CT
0.149 GC
2 setlinecap
1 LJ
0.833 LW
N
573.667 39 M
573.667 44.43 L
S
GR
GS
[0.6 0 0 0.6 0 0] CT
0.149 GC
2 setlinecap
1 LJ
0.833 LW
N
634 39 M
634 44.43 L
S
GR
GS
[0.6 0 0 0.6 54.6 284.19999] CT
0.149 GC
/Helvetica 16.667 F
GS
[1 0 0 1 0 0] CT
-16.5 17 moveto 
1 -1 scale
(7.53) t 
GR
GR
GS
[0.6 0 0 0.6 90.8 284.19999] CT
0.149 GC
/Helvetica 16.667 F
GS
[1 0 0 1 0 0] CT
-16.5 17 moveto 
1 -1 scale
(7.54) t 
GR
GR
GS
[0.6 0 0 0.6 127 284.19999] CT
0.149 GC
/Helvetica 16.667 F
GS
[1 0 0 1 0 0] CT
-16.5 17 moveto 
1 -1 scale
(7.55) t 
GR
GR
GS
[0.6 0 0 0.6 163.2 284.19999] CT
0.149 GC
/Helvetica 16.667 F
GS
[1 0 0 1 0 0] CT
-16.5 17 moveto 
1 -1 scale
(7.56) t 
GR
GR
GS
[0.6 0 0 0.6 199.40001 284.19999] CT
0.149 GC
/Helvetica 16.667 F
GS
[1 0 0 1 0 0] CT
-16.5 17 moveto 
1 -1 scale
(7.57) t 
GR
GR
GS
[0.6 0 0 0.6 235.59999 284.19999] CT
0.149 GC
/Helvetica 16.667 F
GS
[1 0 0 1 0 0] CT
-16.5 17 moveto 
1 -1 scale
(7.58) t 
GR
GR
GS
[0.6 0 0 0.6 271.8 284.19999] CT
0.149 GC
/Helvetica 16.667 F
GS
[1 0 0 1 0 0] CT
-16.5 17 moveto 
1 -1 scale
(7.59) t 
GR
GR
GS
[0.6 0 0 0.6 307.99999 284.19999] CT
0.149 GC
/Helvetica 16.667 F
GS
[1 0 0 1 0 0] CT
-12 17 moveto 
1 -1 scale
(7.6) t 
GR
GR
GS
[0.6 0 0 0.6 344.20001 284.19999] CT
0.149 GC
/Helvetica 16.667 F
GS
[1 0 0 1 0 0] CT
-16.5 17 moveto 
1 -1 scale
(7.61) t 
GR
GR
GS
[0.6 0 0 0.6 380.4 284.19999] CT
0.149 GC
/Helvetica 16.667 F
GS
[1 0 0 1 0 0] CT
-16.5 17 moveto 
1 -1 scale
(7.62) t 
GR
GR
GS
[0.6 0 0 0.6 217.5 297.80001] CT
0.149 GC
/Helvetica 18.333 F
GS
[1 0 0 1 0 0] CT
-20 19 moveto 
1 -1 scale
(s [m]) t 
GR
GR
GS
[0.6 0 0 0.6 356.4 310.8] CT
0.149 GC
N
2.5 -0.484 M
2.5 -0.625 2.578 -0.734 QT
6.125 -4.25 L
2.578 -7.781 L
2.5 -7.875 2.5 -8.016 QT
2.5 -8.141 2.602 -8.242 QT
2.703 -8.344 2.844 -8.344 QT
2.953 -8.344 3.094 -8.25 QT
6.609 -4.719 L
10.125 -8.25 L
10.266 -8.344 10.375 -8.344 QT
10.516 -8.344 10.609 -8.25 QT
10.703 -8.156 10.703 -8.016 QT
10.703 -7.875 10.625 -7.781 QT
7.094 -4.25 L
10.625 -0.734 L
10.703 -0.625 10.703 -0.484 QT
10.703 -0.344 10.609 -0.25 QT
10.516 -0.156 10.375 -0.156 QT
10.25 -0.156 10.125 -0.281 QT
6.609 -3.781 L
3.094 -0.281 L
2.969 -0.156 2.844 -0.156 QT
2.703 -0.156 2.602 -0.258 QT
2.5 -0.359 2.5 -0.484 QT
cp
f
GR
GS
[0.6 0 0 0.6 364.2 310.8] CT
0.149 GC
/Helvetica 16.667 F
GS
[1 0 0 1 0 0] CT
0 0 moveto 
1 -1 scale
(10) t 
GR
GR
GS
[0.6 0 0 0.6 375.6 306] CT
0.149 GC
/Helvetica 13.333 F
GS
[1 0 0 1 0 0] CT
0 0 moveto 
1 -1 scale
(4) t 
GR
GR
GS
[0.6 0 0 0.6 0 0] CT
0.149 GC
2 setlinecap
1 LJ
0.833 LW
N
91 467 M
91 39 L
S
GR
GS
[0.6 0 0 0.6 0 0] CT
0.149 GC
2 setlinecap
1 LJ
0.833 LW
N
634 467 M
634 39 L
S
GR
GS
[0.6 0 0 0.6 0 0] CT
0.149 GC
2 setlinecap
1 LJ
0.833 LW
N
91 467 M
96.43 467 L
S
GR
GS
[0.6 0 0 0.6 0 0] CT
0.149 GC
2 setlinecap
1 LJ
0.833 LW
N
91 419.444 M
96.43 419.444 L
S
GR
GS
[0.6 0 0 0.6 0 0] CT
0.149 GC
2 setlinecap
1 LJ
0.833 LW
N
91 371.889 M
96.43 371.889 L
S
GR
GS
[0.6 0 0 0.6 0 0] CT
0.149 GC
2 setlinecap
1 LJ
0.833 LW
N
91 324.333 M
96.43 324.333 L
S
GR
GS
[0.6 0 0 0.6 0 0] CT
0.149 GC
2 setlinecap
1 LJ
0.833 LW
N
91 276.778 M
96.43 276.778 L
S
GR
GS
[0.6 0 0 0.6 0 0] CT
0.149 GC
2 setlinecap
1 LJ
0.833 LW
N
91 229.222 M
96.43 229.222 L
S
GR
GS
[0.6 0 0 0.6 0 0] CT
0.149 GC
2 setlinecap
1 LJ
0.833 LW
N
91 181.667 M
96.43 181.667 L
S
GR
GS
[0.6 0 0 0.6 0 0] CT
0.149 GC
2 setlinecap
1 LJ
0.833 LW
N
91 134.111 M
96.43 134.111 L
S
GR
GS
[0.6 0 0 0.6 0 0] CT
0.149 GC
2 setlinecap
1 LJ
0.833 LW
N
91 86.556 M
96.43 86.556 L
S
GR
GS
[0.6 0 0 0.6 0 0] CT
0.149 GC
2 setlinecap
1 LJ
0.833 LW
N
91 39 M
96.43 39 L
S
GR
GS
[0.6 0 0 0.6 0 0] CT
0.149 GC
2 setlinecap
1 LJ
0.833 LW
N
634 467 M
628.57 467 L
S
GR
GS
[0.6 0 0 0.6 0 0] CT
0.149 GC
2 setlinecap
1 LJ
0.833 LW
N
634 419.444 M
628.57 419.444 L
S
GR
GS
[0.6 0 0 0.6 0 0] CT
0.149 GC
2 setlinecap
1 LJ
0.833 LW
N
634 371.889 M
628.57 371.889 L
S
GR
GS
[0.6 0 0 0.6 0 0] CT
0.149 GC
2 setlinecap
1 LJ
0.833 LW
N
634 324.333 M
628.57 324.333 L
S
GR
GS
[0.6 0 0 0.6 0 0] CT
0.149 GC
2 setlinecap
1 LJ
0.833 LW
N
634 276.778 M
628.57 276.778 L
S
GR
GS
[0.6 0 0 0.6 0 0] CT
0.149 GC
2 setlinecap
1 LJ
0.833 LW
N
634 229.222 M
628.57 229.222 L
S
GR
GS
[0.6 0 0 0.6 0 0] CT
0.149 GC
2 setlinecap
1 LJ
0.833 LW
N
634 181.667 M
628.57 181.667 L
S
GR
GS
[0.6 0 0 0.6 0 0] CT
0.149 GC
2 setlinecap
1 LJ
0.833 LW
N
634 134.111 M
628.57 134.111 L
S
GR
GS
[0.6 0 0 0.6 0 0] CT
0.149 GC
2 setlinecap
1 LJ
0.833 LW
N
634 86.556 M
628.57 86.556 L
S
GR
GS
[0.6 0 0 0.6 0 0] CT
0.149 GC
2 setlinecap
1 LJ
0.833 LW
N
634 39 M
628.57 39 L
S
GR
GS
[0.6 0 0 0.6 50.60103 280.2] CT
0.149 GC
/Helvetica 16.667 F
GS
[1 0 0 1 0 0] CT
-15 6.5 moveto 
1 -1 scale
(-2) t 
GR
GR
GS
[0.6 0 0 0.6 50.60103 251.66667] CT
0.149 GC
/Helvetica 16.667 F
GS
[1 0 0 1 0 0] CT
-10 6.5 moveto 
1 -1 scale
(0) t 
GR
GR
GS
[0.6 0 0 0.6 50.60103 223.13333] CT
0.149 GC
/Helvetica 16.667 F
GS
[1 0 0 1 0 0] CT
-10 6.5 moveto 
1 -1 scale
(2) t 
GR
GR
GS
[0.6 0 0 0.6 50.60103 194.60001] CT
0.149 GC
/Helvetica 16.667 F
GS
[1 0 0 1 0 0] CT
-10 6.5 moveto 
1 -1 scale
(4) t 
GR
GR
GS
[0.6 0 0 0.6 50.60103 166.06666] CT
0.149 GC
/Helvetica 16.667 F
GS
[1 0 0 1 0 0] CT
-10 6.5 moveto 
1 -1 scale
(6) t 
GR
GR
GS
[0.6 0 0 0.6 50.60103 137.53334] CT
0.149 GC
/Helvetica 16.667 F
GS
[1 0 0 1 0 0] CT
-10 6.5 moveto 
1 -1 scale
(8) t 
GR
GR
GS
[0.6 0 0 0.6 50.60103 109] CT
0.149 GC
/Helvetica 16.667 F
GS
[1 0 0 1 0 0] CT
-19 6.5 moveto 
1 -1 scale
(10) t 
GR
GR
GS
[0.6 0 0 0.6 50.60103 80.46667] CT
0.149 GC
/Helvetica 16.667 F
GS
[1 0 0 1 0 0] CT
-19 6.5 moveto 
1 -1 scale
(12) t 
GR
GR
GS
[0.6 0 0 0.6 50.60103 51.93333] CT
0.149 GC
/Helvetica 16.667 F
GS
[1 0 0 1 0 0] CT
-19 6.5 moveto 
1 -1 scale
(14) t 
GR
GR
GS
[0.6 0 0 0.6 50.60103 23.4] CT
0.149 GC
/Helvetica 16.667 F
GS
[1 0 0 1 0 0] CT
-19 6.5 moveto 
1 -1 scale
(16) t 
GR
GR
GS
[0 -0.6 0.6 0 28.2 168] CT
0.149 GC
/Helvetica 18.333 F
GS
[1 0 0 1 0 0] CT
0 0 moveto 
1 -1 scale
(F) t 
GR
GR
GS
[0 -0.6 0.6 0 33.6 160.8] CT
0.149 GC
/Helvetica 14.667 F
GS
[1 0 0 1 0 0] CT
0 0 moveto 
1 -1 scale
(m) t 
GR
GR
GS
[0 -0.6 0.6 0 28.2 153] CT
0.149 GC
/Helvetica 18.333 F
GS
[1 0 0 1 0 0] CT
0 0 moveto 
1 -1 scale
( [N]) t 
GR
GR
GS
[0.6 0 0 0.6 54.6 21] CT
0.149 GC
N
/f-320005929{2.5 -0.484 M
2.5 -0.625 2.578 -0.734 QT
6.125 -4.25 L
2.578 -7.781 L
2.5 -7.875 2.5 -8.016 QT
2.5 -8.141 2.602 -8.242 QT
2.703 -8.344 2.844 -8.344 QT
2.953 -8.344 3.094 -8.25 QT
6.609 -4.719 L
10.125 -8.25 L
10.266 -8.344 10.375 -8.344 QT
10.516 -8.344 10.609 -8.25 QT
10.703 -8.156 10.703 -8.016 QT
10.703 -7.875 10.625 -7.781 QT
7.094 -4.25 L
10.625 -0.734 L
10.703 -0.625 10.703 -0.484 QT
10.703 -0.344 10.609 -0.25 QT
10.516 -0.156 10.375 -0.156 QT
10.25 -0.156 10.125 -0.281 QT
6.609 -3.781 L
3.094 -0.281 L
2.969 -0.156 2.844 -0.156 QT
2.703 -0.156 2.602 -0.258 QT
2.5 -0.359 2.5 -0.484 QT
cp}def
f-320005929
f
GR
GS
[0.6 0 0 0.6 62.4 21] CT
0.149 GC
/Helvetica 16.667 F
GS
[1 0 0 1 0 0] CT
0 0 moveto 
1 -1 scale
(10) t 
GR
GR
GS
[0.6 0 0 0.6 73.8 16.2] CT
0.149 GC
/Helvetica 13.333 F
GS
[1 0 0 1 0 0] CT
0 0 moveto 
1 -1 scale
(4) t 
GR
GR
GS
[0.6 0 0 0.6 0 0] CT
0 0.447 0.741 RC
1 LJ
3.333 LW
N
147.836 79.089 M
147.836 79.089 L
147.836 79.089 L
147.836 79.089 L
147.836 79.089 L
147.836 79.089 L
147.836 79.089 L
147.836 79.089 L
147.836 79.089 L
147.836 79.089 L
147.836 79.089 L
147.836 79.089 L
147.836 79.089 L
147.836 79.089 L
147.836 79.089 L
147.836 79.089 L
147.836 79.089 L
147.836 79.089 L
147.836 79.089 L
147.841 79.089 L
147.845 79.089 L
147.85 79.089 L
147.85 79.089 L
147.859 79.089 L
147.864 79.089 L
147.869 79.089 L
147.878 79.089 L
147.883 79.089 L
147.897 79.089 L
147.902 79.089 L
147.911 79.089 L
147.921 79.089 L
147.935 79.089 L
147.944 79.089 L
147.954 79.089 L
147.968 79.089 L
147.987 79.089 L
148.001 79.089 L
148.015 79.089 L
148.024 79.089 L
148.039 79.089 L
148.057 79.089 L
148.081 79.089 L
148.095 79.089 L
148.114 79.089 L
148.128 79.089 L
148.147 79.089 L
148.175 79.089 L
148.189 79.089 L
148.208 79.089 L
148.232 79.089 L
148.26 79.089 L
148.288 79.089 L
148.307 79.089 L
148.326 79.089 L
148.35 79.089 L
148.383 79.089 L
148.411 79.089 L
148.439 79.089 L
148.463 79.089 L
148.486 79.089 L
148.519 79.089 L
148.552 79.089 L
148.581 79.089 L
148.604 79.089 L
148.637 79.089 L
148.68 79.089 L
148.713 79.089 L
148.741 79.089 L
148.769 79.089 L
148.802 79.089 L
148.845 79.089 L
148.887 79.089 L
148.92 79.089 L
148.953 79.089 L
148.986 79.089 L
149.024 79.089 L
149.076 79.089 L
149.109 79.089 L
149.142 79.089 L
149.184 79.089 L
149.236 79.089 L
149.283 79.089 L
149.321 79.089 L
149.354 79.089 L
149.396 79.089 L
149.448 79.089 L
149.5 79.089 L
149.547 79.089 L
149.585 79.089 L
149.627 79.089 L
149.674 79.089 L
149.735 79.089 L
149.778 79.089 L
149.82 79.089 L
149.872 79.089 L
149.933 79.089 L
149.99 79.089 L
150.037 79.089 L
150.08 79.089 L
150.131 79.089 L
150.193 79.089 L
150.259 79.089 L
150.311 79.089 L
150.358 79.089 L
150.405 79.089 L
150.466 79.089 L
150.537 79.089 L
150.589 79.089 L
150.636 79.089 L
150.702 79.089 L
150.772 79.089 L
150.838 79.089 L
150.895 79.089 L
150.942 79.089 L
151.003 79.089 L
151.079 79.089 L
151.154 79.089 L
151.215 79.089 L
151.267 79.089 L
151.324 79.089 L
151.395 79.089 L
151.479 79.089 L
151.536 79.089 L
151.597 79.089 L
151.668 79.089 L
151.753 79.089 L
151.828 79.089 L
151.89 79.089 L
151.951 79.089 L
152.017 79.089 L
152.102 79.089 L
152.191 79.089 L
152.262 79.089 L
152.323 79.089 L
152.389 79.089 L
152.469 79.089 L
152.559 79.089 L
152.63 79.089 L
152.696 79.089 L
152.776 79.089 L
152.875 79.089 L
152.96 79.089 L
153.03 79.089 L
153.096 79.089 L
153.172 79.089 L
153.271 79.089 L
153.365 79.089 L
153.45 79.089 L
153.516 79.089 L
153.591 79.089 L
153.681 79.089 L
153.784 79.089 L
153.86 79.089 L
153.935 79.089 L
154.029 79.089 L
154.133 79.089 L
154.232 79.089 L
154.308 79.089 L
154.383 79.089 L
154.468 79.089 L
154.576 79.089 L
154.685 79.089 L
154.774 79.089 L
154.85 79.089 L
154.93 79.089 L
155.033 79.089 L
155.147 79.089 L
155.231 79.089 L
155.316 79.089 L
155.415 79.089 L
155.533 79.089 L
155.642 79.089 L
155.731 79.089 L
155.811 79.089 L
155.905 79.089 L
156.023 79.089 L
156.141 79.089 L
156.24 79.089 L
156.325 79.089 L
156.415 79.089 L
156.528 79.089 L
156.65 79.089 L
156.744 79.089 L
156.834 79.089 L
156.947 79.089 L
157.074 79.089 L
157.192 79.089 L
157.291 79.089 L
157.376 79.089 L
157.485 79.089 L
157.612 79.089 L
157.739 79.089 L
157.847 79.089 L
157.942 79.089 L
158.041 79.089 L
158.159 79.089 L
158.295 79.089 L
158.399 79.089 L
158.498 79.089 L
158.62 79.089 L
158.757 79.089 L
158.884 79.089 L
158.988 79.089 L
159.087 79.089 L
159.2 79.089 L
159.337 79.089 L
159.478 79.089 L
159.596 79.089 L
159.695 79.089 L
159.804 79.089 L
159.931 79.089 L
160.082 79.089 L
160.19 79.089 L
160.298 79.089 L
160.43 79.089 L
160.581 79.089 L
160.718 79.089 L
160.831 79.089 L
160.935 79.089 L
161.057 79.089 L
161.208 79.089 L
161.359 79.089 L
161.486 79.089 L
161.595 79.089 L
161.708 79.089 L
161.849 79.089 L
162.01 79.089 L
162.123 79.089 L
162.24 79.089 L
162.382 79.089 L
162.542 79.089 L
162.693 79.089 L
162.811 79.089 L
162.924 79.089 L
163.056 79.089 L
163.216 79.089 L
163.381 79.089 L
163.518 79.089 L
163.631 79.089 L
163.754 79.089 L
163.904 79.089 L
164.074 79.089 L
164.197 79.089 L
164.324 79.089 L
164.475 79.089 L
164.649 79.089 L
164.805 79.089 L
164.932 79.089 L
165.054 79.089 L
165.196 79.089 L
165.366 79.089 L
165.54 79.089 L
165.686 79.089 L
165.809 79.089 L
165.936 79.089 L
166.096 79.089 L
166.28 79.089 L
166.412 79.089 L
166.544 79.089 L
166.709 79.089 L
166.893 79.089 L
167.058 79.089 L
167.194 79.089 L
167.322 79.089 L
167.473 79.089 L
167.656 79.089 L
167.84 79.089 L
167.996 79.089 L
168.123 79.089 L
168.26 79.089 L
168.434 79.089 L
168.627 79.089 L
168.769 79.089 L
168.91 79.089 L
169.08 79.089 L
169.273 79.089 L
169.452 79.089 L
169.598 79.089 L
169.735 79.089 L
169.891 79.089 L
170.084 79.089 L
170.282 79.089 L
170.442 79.089 L
170.583 79.089 L
170.73 79.089 L
170.909 79.089 L
171.111 79.089 L
171.262 79.089 L
171.413 79.089 L
171.592 79.089 L
171.8 79.089 L
171.988 79.089 L
172.139 79.089 L
172.285 79.089 L
172.45 79.089 L
172.653 79.089 L
172.86 79.089 L
173.034 79.089 L
173.181 79.089 L
173.331 79.089 L
173.525 79.089 L
173.742 79.089 L
173.897 79.089 L
174.053 79.089 L
174.246 79.089 L
174.463 79.089 L
174.661 79.089 L
174.821 79.089 L
174.972 79.089 L
175.151 79.089 L
175.363 79.089 L
175.58 79.089 L
175.764 79.089 L
175.914 79.089 L
176.079 79.089 L
176.277 79.089 L
176.508 79.089 L
176.673 79.089 L
176.838 79.089 L
177.036 79.089 L
177.267 79.089 L
177.475 79.089 L
177.644 79.089 L
177.805 79.089 L
177.988 79.089 L
178.215 79.089 L
178.441 79.089 L
178.634 79.089 L
178.794 79.089 L
178.964 79.089 L
179.172 79.089 L
179.412 79.089 L
179.586 79.089 L
179.761 79.089 L
179.973 79.089 L
180.208 79.089 L
180.43 79.089 L
180.609 79.089 L
180.774 79.089 L
180.967 79.089 L
181.203 79.089 L
181.443 79.089 L
181.641 79.089 L
181.811 79.089 L
181.99 79.089 L
182.207 79.089 L
182.462 79.089 L
182.641 79.089 L
182.825 79.089 L
183.041 79.089 L
183.296 79.089 L
183.522 79.089 L
183.711 79.089 L
183.88 79.089 L
184.083 79.089 L
184.333 79.089 L
184.583 79.089 L
184.79 79.089 L
184.969 79.089 L
185.153 79.089 L
185.384 79.089 L
185.648 79.089 L
185.836 79.089 L
186.025 79.089 L
186.256 79.089 L
186.515 79.089 L
186.756 79.089 L
186.949 79.089 L
187.133 79.089 L
187.345 79.089 L
187.599 79.089 L
187.863 79.089 L
188.08 79.089 L
188.264 79.089 L
188.457 79.089 L
188.698 79.089 L
188.971 79.089 L
189.169 79.089 L
189.367 79.089 L
189.607 79.089 L
189.881 79.089 L
190.13 79.089 L
190.333 79.089 L
190.522 79.089 L
190.743 79.089 L
191.007 79.089 L
191.281 79.089 L
191.512 79.089 L
191.7 79.089 L
191.903 79.089 L
192.153 79.089 L
192.435 79.089 L
192.643 79.089 L
192.85 79.089 L
193.1 79.089 L
193.383 79.089 L
193.642 79.089 L
193.854 79.089 L
194.047 79.089 L
194.278 79.089 L
194.557 79.089 L
194.839 79.089 L
195.075 79.089 L
195.278 79.089 L
195.485 79.089 L
195.744 79.089 L
196.041 79.089 L
196.253 79.089 L
196.47 79.089 L
196.729 79.089 L
197.026 79.089 L
197.295 79.089 L
197.512 79.089 L
197.715 79.089 L
197.955 79.089 L
198.242 79.089 L
198.539 79.089 L
198.785 79.089 L
198.992 79.089 L
199.209 79.089 L
199.477 79.089 L
199.784 79.089 L
200.005 79.089 L
200.232 79.089 L
200.5 79.089 L
200.807 79.089 L
201.085 79.089 L
201.311 79.089 L
201.523 79.089 L
201.773 79.089 L
202.07 79.089 L
202.376 79.089 L
202.631 79.089 L
202.843 79.089 L
203.069 79.089 L
203.352 79.089 L
203.668 79.089 L
203.899 79.089 L
204.13 79.089 L
204.408 79.089 L
204.728 79.089 L
205.016 79.089 L
205.252 79.089 L
205.468 79.089 L
205.728 79.089 L
206.039 79.089 L
206.355 79.089 L
206.618 79.089 L
206.84 79.089 L
207.071 79.089 L
207.363 79.089 L
207.693 79.089 L
207.929 79.089 L
208.169 79.089 L
208.457 79.089 L
208.787 79.089 L
209.084 79.089 L
209.329 79.089 L
209.555 79.089 L
209.819 79.089 L
210.144 79.089 L
210.469 79.089 L
210.743 79.089 L
210.969 79.089 L
211.214 79.089 L
211.511 79.089 L
211.855 79.089 L
212.1 79.089 L
212.345 79.089 L
212.642 79.089 L
212.986 79.089 L
213.293 79.089 L
213.547 79.089 L
213.778 79.089 L
214.052 79.089 L
214.386 79.089 L
214.726 79.089 L
215.004 79.089 L
215.244 79.089 L
215.494 79.089 L
215.8 79.089 L
216.154 79.089 L
216.408 79.089 L
216.663 79.089 L
216.969 79.089 L
217.323 79.089 L
217.643 79.089 L
217.903 79.089 L
218.143 79.089 L
218.426 79.089 L
218.77 79.089 L
219.119 79.089 L
219.406 79.089 L
219.651 79.089 L
219.911 79.089 L
220.231 79.089 L
220.594 79.089 L
220.853 79.089 L
221.117 79.089 L
221.438 79.089 L
221.796 79.089 L
222.126 79.089 L
222.395 79.089 L
222.645 79.089 L
222.937 79.089 L
223.29 79.089 L
223.653 79.089 L
223.95 79.089 L
224.2 79.089 L
224.469 79.089 L
224.799 79.089 L
225.171 79.089 L
225.44 79.089 L
225.713 79.089 L
226.038 79.089 L
226.411 79.089 L
226.755 79.089 L
227.028 79.089 L
227.287 79.089 L
227.584 79.089 L
227.952 79.089 L
228.32 79.089 L
228.631 79.089 L
228.89 79.089 L
229.163 79.089 L
229.503 79.089 L
229.889 79.089 L
230.167 79.089 L
230.445 79.089 L
230.78 79.089 L
231.167 79.089 L
231.515 79.089 L
231.798 79.089 L
232.067 79.089 L
232.373 79.089 L
232.75 79.089 L
233.132 79.089 L
233.448 79.089 L
233.717 79.089 L
233.995 79.089 L
234.344 79.089 L
234.744 79.089 L
235.027 79.089 L
235.314 79.089 L
235.663 79.089 L
236.059 79.089 L
236.417 79.089 L
236.71 79.089 L
236.983 79.089 L
237.299 79.089 L
237.685 79.089 L
238.077 79.089 L
238.407 79.089 L
238.68 79.089 L
238.967 79.089 L
239.326 79.089 L
239.736 79.089 L
240.028 79.089 L
240.325 79.089 L
240.683 79.089 L
241.089 79.089 L
241.456 79.089 L
241.758 79.089 L
242.036 79.089 L
242.366 79.089 L
242.762 79.089 L
243.163 79.089 L
243.502 79.089 L
243.78 79.089 L
244.082 79.089 L
244.449 79.089 L
244.869 79.089 L
245.171 79.089 L
245.472 79.089 L
245.84 79.089 L
246.255 79.089 L
246.636 79.089 L
246.943 79.089 L
247.23 79.089 L
247.565 79.089 L
247.975 79.089 L
248.39 79.089 L
248.734 79.089 L
249.021 79.089 L
249.328 79.089 L
249.705 79.089 L
250.139 79.089 L
250.445 79.089 L
250.756 79.089 L
251.133 79.089 L
251.562 79.089 L
251.953 79.089 L
252.269 79.089 L
252.561 79.089 L
252.905 79.089 L
253.325 79.089 L
253.749 79.089 L
254.103 79.089 L
254.4 79.089 L
254.715 79.089 L
255.102 79.089 L
255.545 79.089 L
255.861 79.089 L
256.181 79.089 L
256.568 79.089 L
257.006 79.089 L
257.407 79.089 L
257.732 79.089 L
258.034 79.089 L
258.387 79.089 L
258.812 79.089 L
259.25 79.089 L
259.613 79.089 L
259.914 79.089 L
260.24 79.089 L
260.636 79.089 L
261.088 79.089 L
261.413 79.089 L
261.743 79.089 L
262.139 79.089 L
262.587 79.089 L
262.997 79.089 L
263.332 79.089 L
263.643 79.089 L
264.001 79.089 L
264.439 79.089 L
264.887 79.089 L
265.26 79.089 L
265.571 79.089 L
265.901 79.089 L
266.311 79.089 L
266.773 79.089 L
267.107 79.089 L
267.442 79.089 L
267.847 79.089 L
268.309 79.089 L
268.729 79.089 L
269.073 79.089 L
269.389 79.089 L
269.761 79.089 L
270.209 79.089 L
270.666 79.089 L
271.048 79.089 L
271.368 79.089 L
271.703 79.089 L
272.123 79.089 L
272.599 79.089 L
272.938 79.089 L
273.282 79.089 L
273.697 79.089 L
274.173 79.089 L
274.602 79.089 L
274.951 79.089 L
275.276 79.089 L
275.653 79.089 L
276.115 79.089 L
276.586 79.089 L
276.973 79.089 L
277.303 79.089 L
277.647 79.089 L
278.076 79.089 L
278.561 79.089 L
278.91 79.089 L
279.264 79.089 L
279.688 79.089 L
280.173 79.089 L
280.612 79.089 L
280.97 79.089 L
281.3 79.089 L
281.691 79.089 L
282.162 79.089 L
282.643 79.089 L
283.039 79.089 L
283.374 79.089 L
283.727 79.089 L
284.166 79.089 L
284.665 79.089 L
285.024 79.089 L
285.382 79.089 L
285.815 79.089 L
286.31 79.089 L
286.763 79.089 L
287.126 79.089 L
287.465 79.089 L
287.866 79.089 L
288.347 79.089 L
288.837 79.089 L
289.242 79.089 L
289.586 79.089 L
289.949 79.089 L
290.397 79.089 L
290.906 79.089 L
291.269 79.089 L
291.637 79.089 L
292.084 79.089 L
292.589 79.089 L
293.051 79.089 L
293.423 79.089 L
293.772 79.089 L
294.177 79.089 L
294.667 79.089 L
295.172 79.089 L
295.587 79.089 L
295.935 79.089 L
296.308 79.089 L
296.765 79.089 L
297.283 79.089 L
297.656 79.089 L
298.033 79.089 L
298.485 79.089 L
299.004 79.089 L
299.475 79.089 L
299.857 79.089 L
300.211 79.089 L
300.625 79.089 L
301.13 79.089 L
301.643 79.089 L
302.068 79.089 L
302.426 79.089 L
302.803 79.089 L
303.27 79.089 L
303.802 79.089 L
304.184 79.089 L
304.566 79.089 L
305.033 79.089 L
305.56 79.089 L
306.041 79.089 L
306.428 79.089 L
306.791 79.089 L
307.215 79.089 L
307.729 79.089 L
308.252 79.089 L
308.69 79.089 L
309.053 79.089 L
309.44 79.089 L
309.916 79.089 L
310.458 79.089 L
310.849 79.089 L
311.24 79.089 L
311.712 79.089 L
312.254 79.089 L
312.744 79.089 L
313.14 79.089 L
313.512 79.089 L
313.941 79.089 L
314.469 79.089 L
315.002 79.089 L
315.445 79.089 L
315.817 79.089 L
316.213 79.089 L
316.699 79.089 L
317.25 79.089 L
317.651 79.089 L
318.047 79.089 L
318.532 79.089 L
319.084 79.089 L
319.583 79.089 L
319.989 79.089 L
320.366 79.089 L
320.809 79.089 L
321.346 79.089 L
321.888 79.089 L
322.341 79.089 L
322.722 79.089 L
323.123 79.089 L
323.618 79.089 L
324.184 79.089 L
324.589 79.089 L
324.994 79.089 L
325.489 79.089 L
326.05 79.089 L
326.564 79.089 L
326.979 79.089 L
327.361 79.089 L
327.813 79.089 L
328.36 79.089 L
328.916 79.089 L
329.373 79.089 L
329.76 79.089 L
330.17 79.089 L
330.679 79.089 L
331.254 79.089 L
331.669 79.089 L
332.084 79.089 L
332.588 79.089 L
333.158 79.089 L
333.677 79.089 L
334.101 79.089 L
334.492 79.089 L
334.954 79.089 L
335.51 79.089 L
336.076 79.089 L
336.547 79.089 L
336.938 79.089 L
337.358 79.089 L
337.872 79.089 L
338.461 79.089 L
338.885 79.089 L
339.305 79.089 L
339.818 79.089 L
340.403 79.089 L
340.931 79.089 L
341.364 79.089 L
341.765 79.089 L
342.232 79.089 L
342.797 79.089 L
343.377 79.089 L
343.853 79.089 L
344.254 79.089 L
344.683 79.089 L
345.206 79.089 L
345.805 79.089 L
346.234 79.089 L
346.667 79.089 L
347.19 79.089 L
347.784 79.089 L
348.322 79.089 L
348.76 79.089 L
349.17 79.089 L
349.646 79.089 L
350.221 79.089 L
350.636 79.089 L
350.636 79.089 L
351.225 334.671 L
351.763 388.131 L
352.201 400.175 L
352.616 403.858 L
353.101 405.177 L
353.681 405.549 L
354.261 408.041 L
354.742 415.079 L
355.152 416.953 L
355.595 417.607 L
356.132 417.82 L
356.735 417.828 L
357.273 417.801 L
357.702 417.864 L
358.112 417.895 L
358.597 417.898 L
359.186 417.873 L
359.776 417.806 L
360.252 417.831 L
360.657 417.886 L
361.091 417.899 L
361.637 417.891 L
362.245 417.839 L
362.674 417.882 L
363.099 417.899 L
363.631 417.894 L
364.239 417.849 L
364.678 417.882 L
365.111 417.898 L
365.644 417.892 L
366.238 417.851 L
366.78 417.81 L
367.223 417.861 L
367.633 417.894 L
368.114 417.898 L
368.694 417.877 L
369.278 417.816 L
369.768 417.829 L
370.178 417.883 L
370.612 417.899 L
371.145 417.892 L
371.748 417.847 L
372.295 417.802 L
372.728 417.861 L
373.134 417.895 L
373.615 417.898 L
374.199 417.876 L
374.793 417.808 L
375.274 417.826 L
375.679 417.884 L
376.113 417.899 L
376.65 417.892 L
377.258 417.844 L
377.692 417.882 L
378.121 417.898 L
378.649 417.893 L
379.257 417.85 L
379.695 417.882 L
380.133 417.897 L
380.661 417.891 L
381.255 417.852 L
381.797 417.812 L
382.24 417.862 L
382.655 417.894 L
383.131 417.897 L
383.711 417.877 L
384.295 417.818 L
384.781 417.831 L
385.196 417.883 L
385.629 417.898 L
386.162 417.892 L
386.765 417.847 L
387.307 417.804 L
387.746 417.862 L
388.151 417.895 L
388.632 417.898 L
389.216 417.876 L
389.806 417.81 L
390.291 417.827 L
390.696 417.884 L
391.13 417.899 L
391.667 417.892 L
392.275 417.844 L
392.709 417.882 L
393.138 417.898 L
393.666 417.893 L
394.274 417.85 L
394.821 417.801 L
395.259 417.859 L
395.664 417.894 L
396.141 417.898 L
396.72 417.878 L
397.314 417.812 L
397.804 417.823 L
398.21 417.883 L
398.639 417.899 L
399.171 417.893 L
399.784 417.847 L
400.218 417.882 L
400.651 417.898 L
401.179 417.892 L
401.783 417.851 L
402.325 417.806 L
402.768 417.86 L
403.173 417.894 L
403.654 417.898 L
404.234 417.877 L
404.823 417.814 L
405.308 417.827 L
405.718 417.883 L
406.152 417.899 L
406.685 417.892 L
407.293 417.847 L
407.726 417.882 L
408.16 417.898 L
408.688 417.892 L
409.287 417.851 L
409.833 417.807 L
410.276 417.86 L
410.682 417.894 L
411.163 417.898 L
411.742 417.877 L
412.332 417.814 L
412.817 417.827 L
413.227 417.883 L
413.661 417.899 L
414.193 417.892 L
414.797 417.847 L
415.235 417.882 L
415.669 417.898 L
416.197 417.892 L
416.795 417.851 L
417.342 417.807 L
417.78 417.86 L
418.19 417.894 L
418.671 417.898 L
419.251 417.877 L
419.84 417.815 L
420.326 417.827 L
420.736 417.883 L
421.169 417.899 L
421.702 417.892 L
422.305 417.847 L
422.744 417.882 L
423.177 417.898 L
423.705 417.892 L
424.304 417.851 L
424.851 417.808 L
425.289 417.86 L
425.699 417.894 L
426.18 417.898 L
426.755 417.877 L
427.349 417.815 L
427.834 417.827 L
428.244 417.883 L
428.673 417.899 L
429.211 417.892 L
429.814 417.847 L
430.252 417.882 L
430.686 417.898 L
431.214 417.892 L
431.813 417.851 L
432.359 417.808 L
432.798 417.86 L
433.208 417.894 L
433.684 417.898 L
434.264 417.877 L
434.853 417.815 L
435.343 417.827 L
435.753 417.883 L
436.182 417.899 L
436.715 417.892 L
437.323 417.847 L
437.761 417.882 L
438.195 417.898 L
438.723 417.892 L
439.321 417.851 L
439.868 417.808 L
440.306 417.86 L
440.717 417.894 L
441.193 417.898 L
441.772 417.877 L
442.362 417.815 L
442.852 417.827 L
443.262 417.883 L
443.691 417.899 L
444.223 417.892 L
444.831 417.847 L
445.265 417.882 L
445.703 417.898 L
446.231 417.892 L
446.83 417.851 L
447.372 417.808 L
447.815 417.86 L
448.225 417.894 L
448.701 417.898 L
449.281 417.877 L
449.87 417.815 L
450.36 417.827 L
450.766 417.883 L
451.199 417.899 L
451.732 417.892 L
452.34 417.847 L
452.774 417.882 L
453.212 417.898 L
453.74 417.892 L
454.339 417.851 L
454.881 417.808 L
455.324 417.86 L
455.734 417.894 L
456.21 417.898 L
456.79 417.877 L
457.379 417.815 L
457.869 417.827 L
458.274 417.883 L
458.708 417.899 L
459.241 417.892 L
459.849 417.847 L
460.282 417.882 L
460.721 417.898 L
461.249 417.892 L
461.847 417.851 L
462.389 417.808 L
462.832 417.86 L
463.243 417.894 L
463.719 417.898 L
464.298 417.877 L
464.888 417.815 L
465.373 417.827 L
465.783 417.883 L
466.217 417.899 L
466.749 417.892 L
467.357 417.847 L
467.791 417.882 L
468.225 417.898 L
468.757 417.892 L
469.351 417.851 L
469.898 417.808 L
470.341 417.86 L
470.751 417.894 L
471.227 417.898 L
471.807 417.877 L
472.396 417.815 L
472.882 417.827 L
473.292 417.883 L
473.725 417.899 L
474.258 417.892 L
474.866 417.847 L
475.3 417.882 L
475.733 417.898 L
476.261 417.892 L
476.86 417.851 L
477.407 417.808 L
477.85 417.86 L
478.255 417.894 L
478.736 417.898 L
479.316 417.877 L
479.905 417.815 L
480.39 417.827 L
480.8 417.883 L
481.234 417.899 L
481.767 417.892 L
482.37 417.847 L
482.808 417.882 L
483.242 417.898 L
483.77 417.892 L
484.369 417.851 L
484.915 417.808 L
485.354 417.86 L
485.764 417.894 L
486.245 417.898 L
486.824 417.877 L
487.414 417.815 L
487.899 417.827 L
488.309 417.883 L
488.743 417.899 L
489.275 417.892 L
489.879 417.847 L
490.317 417.882 L
490.751 417.898 L
491.279 417.892 L
491.877 417.851 L
492.424 417.808 L
492.862 417.86 L
493.272 417.894 L
493.753 417.898 L
494.328 417.877 L
494.918 417.815 L
495.408 417.827 L
495.818 417.883 L
496.247 417.899 L
496.784 417.892 L
497.387 417.847 L
497.826 417.882 L
498.259 417.898 L
498.787 417.892 L
499.386 417.851 L
499.933 417.808 L
500.371 417.86 L
500.781 417.894 L
501.257 417.898 L
501.837 417.877 L
502.426 417.815 L
502.916 417.827 L
503.326 417.883 L
503.755 417.899 L
504.288 417.892 L
504.896 417.847 L
505.33 417.882 L
505.768 417.898 L
506.296 417.892 L
506.895 417.851 L
507.437 417.808 L
507.88 417.86 L
508.29 417.894 L
508.766 417.898 L
509.346 417.877 L
509.935 417.815 L
510.425 417.827 L
510.83 417.883 L
511.264 417.899 L
511.797 417.892 L
512.405 417.847 L
512.838 417.882 L
513.277 417.898 L
513.805 417.892 L
514.403 417.851 L
514.945 417.808 L
515.388 417.86 L
515.799 417.894 L
516.275 417.898 L
516.854 417.877 L
517.444 417.815 L
517.934 417.827 L
518.339 417.883 L
518.773 417.899 L
519.305 417.892 L
519.913 417.847 L
520.347 417.882 L
520.785 417.898 L
521.313 417.892 L
521.912 417.851 L
522.454 417.808 L
522.897 417.86 L
523.307 417.894 L
523.783 417.898 L
524.363 417.877 L
524.952 417.815 L
525.438 417.827 L
525.848 417.883 L
526.281 417.899 L
526.814 417.892 L
527.422 417.847 L
527.856 417.882 L
528.289 417.898 L
528.822 417.892 L
529.421 417.851 L
529.963 417.808 L
530.406 417.86 L
530.816 417.894 L
531.292 417.898 L
531.872 417.877 L
532.461 417.815 L
532.946 417.827 L
533.356 417.883 L
533.79 417.899 L
534.323 417.892 L
534.931 417.847 L
535.364 417.882 L
535.798 417.898 L
536.326 417.892 L
536.925 417.851 L
537.471 417.808 L
537.914 417.86 L
538.325 417.894 L
538.801 417.898 L
539.38 417.877 L
539.97 417.815 L
540.455 417.827 L
540.865 417.883 L
541.299 417.899 L
541.831 417.892 L
542.439 417.847 L
542.873 417.882 L
543.307 417.898 L
543.835 417.892 L
544.433 417.851 L
544.98 417.808 L
545.418 417.86 L
545.828 417.894 L
546.309 417.898 L
546.889 417.877 L
547.478 417.815 L
547.964 417.827 L
548.374 417.883 L
548.807 417.899 L
549.34 417.892 L
549.943 417.847 L
550.382 417.882 L
550.815 417.898 L
551.343 417.892 L
551.942 417.851 L
552.489 417.808 L
552.927 417.86 L
553.337 417.894 L
553.818 417.898 L
554.398 417.877 L
554.987 417.815 L
555.472 417.827 L
555.882 417.883 L
556.316 417.899 L
556.849 417.892 L
557.452 417.847 L
557.89 417.882 L
558.324 417.898 L
558.852 417.892 L
559.451 417.851 L
559.997 417.808 L
560.436 417.86 L
560.846 417.894 L
561.327 417.898 L
561.902 417.877 L
562.491 417.815 L
562.981 417.827 L
563.391 417.883 L
563.82 417.899 L
564.357 417.892 L
564.961 417.847 L
565.399 417.882 L
565.833 417.898 L
566.361 417.892 L
566.959 417.851 L
567.506 417.808 L
567.944 417.86 L
568.354 417.894 L
568.831 417.898 L
569.41 417.877 L
570 417.815 L
570.49 417.827 L
570.9 417.883 L
571.329 417.899 L
571.861 417.892 L
572.469 417.847 L
572.903 417.882 L
573.341 417.898 L
573.869 417.892 L
574.468 417.851 L
575.01 417.808 L
575.453 417.86 L
575.863 417.894 L
576.339 417.898 L
576.919 417.877 L
577.508 417.815 L
577.998 417.827 L
578.404 417.883 L
578.837 417.899 L
579.37 417.892 L
579.978 417.847 L
580.412 417.882 L
580.85 417.898 L
581.378 417.892 L
581.977 417.851 L
582.519 417.808 L
582.962 417.86 L
583.372 417.894 L
583.848 417.898 L
584.428 417.877 L
585.017 417.815 L
585.507 417.827 L
585.912 417.883 L
586.346 417.899 L
586.879 417.892 L
587.487 417.847 L
587.92 417.882 L
588.359 417.898 L
588.887 417.892 L
589.485 417.851 L
590.027 417.808 L
590.47 417.86 L
590.88 417.894 L
591.357 417.898 L
591.936 417.877 L
592.526 417.815 L
593.011 417.827 L
593.421 417.883 L
593.855 417.899 L
594.387 417.892 L
594.995 417.847 L
595.429 417.882 L
595.863 417.898 L
596.395 417.892 L
596.994 417.851 L
597.536 417.808 L
597.979 417.86 L
598.389 417.894 L
598.865 417.898 L
599.445 417.877 L
600.034 417.815 L
600.52 417.827 L
600.93 417.883 L
601.363 417.899 L
601.896 417.892 L
602.504 417.847 L
602.938 417.882 L
603.371 417.898 L
603.899 417.892 L
604.498 417.851 L
605.045 417.808 L
605.488 417.86 L
605.893 417.894 L
606.374 417.898 L
606.954 417.877 L
607.543 417.815 L
608.028 417.827 L
608.438 417.883 L
608.872 417.899 L
609.405 417.892 L
610.008 417.847 L
610.446 417.882 L
610.88 417.898 L
611.408 417.892 L
612.007 417.851 L
612.553 417.808 L
612.992 417.86 L
613.402 417.894 L
613.883 417.898 L
614.462 417.877 L
615.052 417.815 L
615.537 417.827 L
615.947 417.883 L
616.381 417.899 L
616.913 417.892 L
617.517 417.847 L
617.955 417.882 L
618.389 417.898 L
618.917 417.892 L
619.515 417.851 L
620.062 417.808 L
620.5 417.86 L
620.911 417.894 L
621.391 417.898 L
621.966 417.877 L
622.56 417.815 L
623.046 417.827 L
623.456 417.883 L
623.885 417.899 L
624.422 417.892 L
625.068 417.816 L
S
GR
GS
[0.6 0 0 0.6 0 0] CT
0.851 0.325 0.098 RC
1 LJ
3.333 LW
N
147.836 156.938 M
147.864 156.938 L
147.892 156.938 L
147.921 156.938 L
147.958 156.938 L
147.996 156.938 L
148.029 156.938 L
148.057 156.938 L
148.1 156.938 L
148.128 156.938 L
148.166 156.938 L
148.204 156.938 L
148.232 156.938 L
148.27 156.938 L
148.312 156.938 L
148.354 156.938 L
148.397 156.938 L
148.439 156.938 L
148.486 156.938 L
148.524 156.938 L
148.571 156.938 L
148.604 156.938 L
148.665 156.938 L
148.703 156.938 L
148.741 156.938 L
148.769 156.938 L
148.797 156.938 L
148.835 156.938 L
148.873 156.938 L
148.906 156.938 L
148.948 156.938 L
148.986 156.938 L
149.024 156.938 L
149.057 156.938 L
149.099 156.938 L
149.137 156.938 L
149.184 156.938 L
149.236 156.938 L
149.269 156.938 L
149.316 156.938 L
149.372 156.938 L
149.42 156.938 L
149.467 156.938 L
149.547 156.938 L
149.636 156.938 L
149.669 156.938 L
149.731 156.938 L
149.811 156.938 L
149.844 156.938 L
149.896 156.938 L
149.962 156.938 L
150.061 156.938 L
150.108 156.938 L
150.169 156.938 L
150.207 156.938 L
150.277 156.938 L
150.315 156.938 L
150.381 150.211 L
150.442 143.812 L
150.49 137.086 L
150.541 130.687 L
150.584 124.124 L
150.636 117.562 L
150.692 110.999 L
150.744 104.272 L
150.796 97.874 L
150.853 90.983 L
150.9 84.748 L
150.961 79.091 L
151.018 79.091 L
151.069 79.091 L
151.117 79.091 L
151.182 79.091 L
151.239 79.091 L
151.305 79.091 L
151.352 79.091 L
151.423 79.091 L
151.47 79.091 L
151.541 79.091 L
151.597 79.091 L
151.663 79.091 L
151.729 79.091 L
151.8 79.091 L
151.852 79.091 L
151.918 79.091 L
151.984 79.091 L
152.045 79.091 L
152.111 79.091 L
152.172 79.091 L
152.238 79.091 L
152.309 79.091 L
152.384 79.091 L
152.45 79.091 L
152.512 79.091 L
152.559 79.091 L
152.644 79.091 L
152.729 79.091 L
152.813 79.091 L
152.898 79.091 L
152.978 79.091 L
153.073 79.091 L
153.157 79.091 L
153.238 79.091 L
153.322 79.091 L
153.417 79.091 L
153.511 79.091 L
153.601 79.091 L
153.685 79.091 L
153.775 79.091 L
153.879 79.091 L
153.963 79.091 L
154.053 79.091 L
154.143 79.091 L
154.242 79.091 L
154.336 79.091 L
154.435 79.091 L
154.524 79.091 L
154.628 79.091 L
154.718 79.091 L
154.817 79.091 L
154.925 79.091 L
155.01 79.091 L
155.118 79.091 L
155.217 79.091 L
155.321 79.091 L
155.425 79.091 L
155.528 79.091 L
155.627 79.091 L
155.736 79.091 L
155.839 79.091 L
155.943 79.091 L
156.052 79.091 L
156.146 79.091 L
156.254 79.091 L
156.367 79.091 L
156.476 79.091 L
156.584 79.091 L
156.693 79.091 L
156.806 79.091 L
156.914 79.091 L
157.027 79.091 L
157.136 79.091 L
157.254 79.091 L
157.381 79.091 L
157.475 79.091 L
157.598 79.091 L
157.711 79.091 L
157.833 79.091 L
157.956 79.091 L
158.055 79.091 L
158.168 79.091 L
158.291 79.091 L
158.408 79.091 L
158.531 79.091 L
158.653 79.091 L
158.771 79.091 L
158.903 79.091 L
159.031 79.091 L
159.158 79.091 L
159.271 79.091 L
159.398 79.091 L
159.521 79.091 L
159.657 79.091 L
159.78 79.091 L
159.912 79.091 L
160.053 79.091 L
160.176 79.091 L
160.313 79.091 L
160.44 79.091 L
160.577 79.091 L
160.713 79.091 L
160.85 79.091 L
160.973 79.091 L
161.114 79.091 L
161.251 79.091 L
161.383 79.091 L
161.524 79.091 L
161.656 79.091 L
161.788 79.091 L
161.929 79.091 L
162.066 79.091 L
162.207 79.091 L
162.358 79.091 L
162.5 79.091 L
162.632 79.091 L
162.773 79.091 L
162.929 79.091 L
163.07 79.091 L
163.221 79.091 L
163.362 79.091 L
163.513 79.091 L
163.673 79.091 L
163.796 79.091 L
163.947 79.091 L
164.098 79.091 L
164.258 79.091 L
164.399 79.091 L
164.55 79.091 L
164.71 79.091 L
164.871 79.091 L
165.021 79.091 L
165.172 79.091 L
165.318 79.091 L
165.474 79.091 L
165.634 79.091 L
165.794 79.091 L
165.95 79.091 L
166.115 79.091 L
166.266 79.091 L
166.436 79.091 L
166.596 79.091 L
166.747 79.091 L
166.926 79.091 L
167.077 79.091 L
167.237 79.091 L
167.911 79.091 L
168.081 79.091 L
168.227 79.091 L
168.396 79.091 L
168.566 79.091 L
168.736 79.091 L
168.91 79.091 L
169.075 79.091 L
169.254 79.091 L
169.419 79.091 L
169.584 79.091 L
169.754 79.091 L
169.942 79.091 L
170.117 79.091 L
170.272 79.091 L
170.451 79.091 L
170.626 79.091 L
170.805 79.091 L
170.965 79.091 L
171.149 79.091 L
171.338 79.091 L
171.517 79.091 L
171.682 79.091 L
171.866 79.091 L
172.045 79.091 L
172.233 79.091 L
172.408 79.091 L
172.606 79.091 L
172.78 79.091 L
172.959 79.091 L
173.133 79.091 L
173.327 79.091 L
173.52 79.091 L
173.694 79.091 L
173.888 79.091 L
174.071 79.091 L
174.246 79.091 L
174.439 79.091 L
174.628 79.091 L
174.816 79.091 L
175 79.091 L
175.203 79.091 L
175.401 79.091 L
175.495 79.091 L
175.683 79.091 L
175.891 79.091 L
176.089 79.091 L
176.301 79.091 L
176.485 79.091 L
176.692 79.091 L
176.89 79.091 L
177.079 79.091 L
177.291 79.091 L
177.484 79.091 L
177.682 79.091 L
177.894 79.091 L
178.092 79.091 L
178.285 79.091 L
178.497 79.091 L
178.705 79.091 L
178.917 79.091 L
179.106 79.091 L
179.318 79.091 L
179.52 79.091 L
179.732 79.091 L
179.945 79.091 L
180.157 79.091 L
180.364 79.091 L
180.571 79.091 L
180.784 79.091 L
181.01 79.091 L
181.227 79.091 L
181.429 79.091 L
181.646 79.091 L
181.858 79.091 L
182.066 79.091 L
182.297 79.091 L
182.513 79.091 L
182.726 79.091 L
182.938 79.091 L
183.159 79.091 L
183.39 79.091 L
183.598 79.091 L
183.824 79.091 L
184.05 79.091 L
184.262 79.091 L
184.488 79.091 L
184.696 79.091 L
184.931 79.091 L
185.158 79.091 L
185.393 79.091 L
185.629 79.091 L
185.855 79.091 L
186.086 79.091 L
186.298 79.091 L
186.534 79.091 L
186.779 79.091 L
186.991 79.091 L
187.218 79.091 L
187.463 79.091 L
187.698 79.091 L
187.92 79.091 L
188.165 79.091 L
188.391 79.091 L
188.627 79.091 L
188.877 79.091 L
189.098 79.091 L
189.348 79.091 L
189.574 79.091 L
189.815 79.091 L
190.06 79.091 L
190.295 79.091 L
190.536 79.091 L
190.781 79.091 L
191.021 79.091 L
191.276 79.091 L
191.512 79.091 L
191.757 79.091 L
192.002 79.091 L
192.237 79.091 L
192.492 79.091 L
192.742 79.091 L
192.992 79.091 L
193.237 79.091 L
193.477 79.091 L
193.732 79.091 L
193.981 79.091 L
194.217 79.091 L
194.472 79.091 L
194.726 79.091 L
194.981 79.091 L
195.24 79.091 L
195.49 79.091 L
195.749 79.091 L
196.008 79.091 L
196.253 79.091 L
196.513 79.091 L
196.777 79.091 L
197.036 79.091 L
197.3 79.091 L
197.568 79.091 L
197.809 79.091 L
198.073 79.091 L
198.337 79.091 L
198.591 79.091 L
198.86 79.091 L
199.11 79.091 L
199.383 79.091 L
199.647 79.091 L
199.916 79.091 L
200.189 79.091 L
200.448 79.091 L
200.717 79.091 L
200.986 79.091 L
201.264 79.091 L
201.523 79.091 L
201.797 79.091 L
202.079 79.091 L
202.343 79.091 L
202.631 79.091 L
202.871 79.091 L
203.149 79.091 L
203.432 79.091 L
203.691 79.091 L
203.988 79.091 L
204.257 79.091 L
204.53 79.091 L
205.138 79.091 L
205.412 79.091 L
205.695 79.091 L
205.954 79.091 L
206.237 79.091 L
206.524 79.091 L
206.793 79.091 L
207.085 79.091 L
207.373 79.157 L
207.651 79.772 L
207.952 79.773 L
208.212 79.773 L
208.494 79.778 L
208.787 79.786 L
209.084 79.791 L
209.376 79.787 L
209.659 79.789 L
209.951 79.787 L
210.243 79.788 L
210.54 79.791 L
210.842 79.793 L
211.129 79.786 L
211.403 79.78 L
211.723 79.786 L
211.982 79.779 L
212.294 79.799 L
212.6 79.77 L
212.887 79.788 L
213.161 79.802 L
213.477 79.773 L
214.061 79.788 L
214.353 79.78 L
214.664 79.788 L
214.957 79.787 L
215.249 79.79 L
215.551 79.865 L
215.843 79.711 L
216.145 79.782 L
216.451 79.778 L
216.776 79.861 L
217.073 79.707 L
217.37 79.779 L
217.662 79.781 L
217.973 79.801 L
218.299 79.776 L
218.591 79.807 L
218.893 79.78 L
219.208 79.796 L
219.524 79.876 L
219.826 79.723 L
220.142 79.809 L
220.462 79.802 L
220.759 79.798 L
220.976 79.809 L
221.292 79.88 L
221.608 79.729 L
221.904 79.812 L
222.244 79.897 L
222.541 79.742 L
222.857 79.823 L
223.177 79.824 L
223.512 79.827 L
223.823 79.856 L
224.148 79.829 L
224.459 79.931 L
224.761 79.766 L
225.105 79.847 L
225.43 79.848 L
225.732 79.837 L
226.076 79.825 L
226.382 79.818 L
226.712 79.811 L
227.217 79.818 L
227.532 79.83 L
227.844 79.91 L
228.178 79.762 L
228.503 79.847 L
228.824 79.848 L
229.163 79.958 L
229.503 79.797 L
229.847 79.871 L
230.158 79.859 L
230.502 79.876 L
230.827 79.852 L
231.152 79.858 L
231.492 79.854 L
231.831 79.827 L
232.166 79.845 L
232.51 79.697 L
232.849 79.617 L
233.189 79.608 L
233.533 79.607 L
233.844 79.604 L
234.169 79.597 L
234.523 79.623 L
234.857 79.652 L
235.211 79.562 L
235.541 79.629 L
235.894 79.605 L
236.658 79.613 L
237.002 79.617 L
237.355 79.625 L
237.695 79.631 L
238.044 79.636 L
238.383 79.638 L
238.732 79.636 L
239.09 79.633 L
239.434 79.641 L
239.769 79.639 L
240.118 79.638 L
240.476 79.641 L
240.834 79.639 L
241.173 79.647 L
241.551 79.647 L
241.899 79.636 L
242.229 79.64 L
242.587 79.635 L
242.936 79.64 L
243.295 79.645 L
243.657 79.64 L
244.025 79.641 L
244.369 79.647 L
244.746 79.648 L
245.086 79.714 L
245.453 79.592 L
245.802 79.715 L
246.179 79.595 L
246.504 79.715 L
246.882 79.586 L
247.244 79.64 L
247.612 79.64 L
247.97 79.658 L
248.347 79.631 L
248.706 79.654 L
248.866 79.65 L
249.219 79.646 L
249.573 79.633 L
249.95 79.642 L
250.337 79.644 L
250.695 79.639 L
251.053 79.653 L
251.43 79.652 L
251.812 79.653 L
252.17 79.65 L
252.528 79.651 L
252.929 79.662 L
253.297 79.666 L
253.678 79.725 L
254.051 79.594 L
254.409 79.657 L
254.767 79.668 L
255.144 79.645 L
255.521 79.726 L
255.899 79.601 L
256.294 79.68 L
256.662 79.653 L
257.039 79.667 L
257.416 79.666 L
257.793 79.671 L
258.203 79.675 L
258.571 79.674 L
258.958 79.675 L
259.335 79.683 L
259.735 79.689 L
260.292 79.681 L
260.659 79.681 L
261.069 79.685 L
261.461 79.753 L
261.838 79.623 L
262.219 79.679 L
262.601 79.68 L
262.978 79.681 L
263.384 79.684 L
263.77 79.69 L
264.157 79.697 L
264.562 79.668 L
264.939 79.689 L
265.349 79.696 L
265.731 79.711 L
266.141 79.675 L
266.532 79.701 L
266.942 79.689 L
267.324 79.694 L
267.739 79.696 L
268.121 79.691 L
268.512 79.693 L
268.894 79.687 L
269.304 79.685 L
269.69 79.695 L
270.105 79.703 L
270.515 79.704 L
270.897 79.696 L
271.326 79.696 L
271.698 79.714 L
272.127 79.691 L
272.542 79.772 L
272.933 79.646 L
273.343 79.692 L
273.763 79.777 L
274.154 79.649 L
274.578 79.782 L
274.974 79.648 L
275.398 79.717 L
275.79 79.797 L
276.209 79.636 L
276.605 79.714 L
277.034 79.728 L
277.449 79.725 L
277.868 79.722 L
278.245 79.724 L
278.656 79.738 L
279.075 79.728 L
279.485 79.726 L
279.914 79.728 L
280.334 79.745 L
280.748 79.754 L
281.173 79.746 L
281.597 79.76 L
281.997 79.736 L
282.62 79.752 L
283.039 79.75 L
283.463 79.756 L
283.888 79.763 L
284.312 79.758 L
284.736 79.748 L
285.165 79.753 L
285.594 79.764 L
286.004 79.763 L
286.423 79.754 L
286.862 79.761 L
287.281 79.754 L
287.701 79.761 L
288.12 79.761 L
288.549 79.758 L
288.988 79.768 L
289.412 79.759 L
289.845 79.761 L
290.274 79.773 L
290.722 79.77 L
291.156 79.772 L
291.589 79.765 L
292.023 79.773 L
292.443 79.787 L
292.853 79.774 L
293.296 79.784 L
293.739 79.466 L
294.187 79.463 L
294.63 79.465 L
295.063 79.438 L
295.492 79.462 L
295.935 79.475 L
296.378 79.465 L
296.817 79.47 L
297.255 79.468 L
297.708 79.482 L
298.151 79.459 L
298.603 79.474 L
299.046 79.518 L
299.471 79.43 L
299.918 79.513 L
300.343 79.429 L
300.795 79.476 L
301.248 79.514 L
301.714 79.43 L
302.138 79.513 L
302.591 79.429 L
303.048 79.469 L
303.906 79.467 L
304.358 79.468 L
304.816 79.476 L
305.278 79.476 L
305.716 79.477 L
306.135 79.485 L
306.602 79.48 L
307.073 79.48 L
307.535 79.527 L
307.993 79.437 L
308.464 79.474 L
308.907 79.472 L
309.341 79.476 L
309.803 79.483 L
310.265 79.475 L
310.618 79.479 L
311.08 79.48 L
311.537 79.47 L
312.009 79.479 L
312.48 79.486 L
312.956 79.484 L
313.413 79.475 L
313.87 79.485 L
314.318 79.477 L
314.799 79.479 L
315.27 79.477 L
315.728 79.499 L
316.213 79.47 L
316.684 79.481 L
317.137 79.481 L
317.622 79.489 L
318.084 79.486 L
318.551 79.485 L
319.032 79.486 L
319.475 79.481 L
319.946 79.481 L
320.432 79.482 L
320.908 79.488 L
321.384 79.485 L
321.869 79.49 L
322.336 79.491 L
322.845 79.485 L
323.297 79.484 L
323.802 79.49 L
324.245 79.496 L
324.745 79.488 L
325.206 79.487 L
325.697 79.49 L
326.192 79.491 L
326.668 79.534 L
327.144 79.448 L
327.658 79.502 L
328.129 79.477 L
328.605 79.491 L
329.081 79.499 L
329.59 79.5 L
330.467 79.497 L
330.948 79.506 L
331.452 79.508 L
331.961 79.508 L
332.428 79.5 L
332.908 79.506 L
333.413 79.506 L
333.922 79.495 L
334.398 79.505 L
334.902 79.48 L
335.378 79.488 L
335.887 79.492 L
336.359 79.493 L
336.872 79.495 L
337.377 79.538 L
337.848 79.541 L
338.353 79.442 L
338.866 79.448 L
339.366 79.495 L
339.847 79.546 L
340.464 79.44 L
340.973 79.523 L
341.478 79.447 L
341.958 79.479 L
342.463 79.529 L
342.977 79.456 L
343.481 79.495 L
343.985 79.49 L
344.494 79.494 L
344.999 79.491 L
345.522 79.49 L
346.031 79.483 L
346.54 79.483 L
347.03 79.487 L
347.539 79.48 L
348.058 79.489 L
348.538 79.502 L
349.062 79.499 L
349.575 79.494 L
350.103 79.498 L
350.792 79.494 L
351.31 79.496 L
351.81 79.495 L
352.333 79.496 L
352.818 79.499 L
353.346 79.498 L
353.874 79.506 L
354.369 79.5 L
354.892 79.504 L
355.43 79.499 L
355.943 79.495 L
356.453 79.495 L
356.966 79.499 L
357.499 79.505 L
358.036 79.509 L
358.564 419.444 L
359.045 415.667 L
359.578 420.457 L
360.115 421.596 L
360.643 422.78 L
361.18 424.186 L
361.718 425.747 L
362.179 427.27 L
362.557 428.934 L
363.099 430.613 L
363.636 432.695 L
364.131 429.23 L
364.673 425.68 L
365.229 422.046 L
365.738 419.444 L
366.252 419.444 L
366.803 419.444 L
367.355 419.444 L
367.892 419.444 L
368.397 419.444 L
368.92 419.444 L
369.481 419.444 L
370.013 419.444 L
370.565 419.444 L
371.041 419.444 L
371.597 419.444 L
372.139 419.444 L
372.691 419.444 L
373.237 419.444 L
373.747 419.444 L
374.567 419.444 L
375.099 419.444 L
375.627 419.444 L
376.198 419.444 L
376.725 419.444 L
377.258 419.444 L
377.781 419.444 L
378.337 419.444 L
378.884 419.444 L
379.407 419.444 L
379.95 419.444 L
380.529 419.444 L
381.052 419.444 L
381.562 419.444 L
382.127 419.444 L
382.655 419.444 L
383.192 419.444 L
383.767 419.444 L
384.3 419.444 L
384.837 419.444 L
385.398 419.444 L
385.926 419.444 L
386.501 419.444 L
386.949 419.444 L
387.435 419.444 L
388.005 419.444 L
388.538 419.444 L
389.113 419.444 L
389.645 419.444 L
390.183 419.444 L
390.762 419.444 L
391.295 419.444 L
391.799 419.444 L
392.37 419.444 L
392.912 419.444 L
393.463 419.444 L
394.038 419.444 L
394.547 419.444 L
395.41 419.444 L
395.938 419.444 L
396.518 419.444 L
397.046 419.444 L
397.578 419.444 L
398.158 419.444 L
398.686 419.444 L
399.261 419.444 L
399.794 419.444 L
400.321 419.444 L
400.892 419.444 L
401.396 419.444 L
401.896 419.444 L
402.49 419.444 L
403.003 419.444 L
403.564 419.444 L
404.102 419.444 L
404.677 419.444 L
405.191 419.444 L
405.723 419.444 L
406.298 419.444 L
406.826 419.444 L
407.363 419.444 L
407.939 419.444 L
408.476 419.444 L
408.98 419.444 L
409.56 419.444 L
410.144 419.444 L
410.644 419.444 L
411.181 419.444 L
411.752 419.444 L
412.299 419.444 L
412.85 419.444 L
413.369 419.444 L
413.92 419.444 L
414.467 419.444 L
415.018 419.444 L
415.57 419.444 L
416.102 419.444 L
416.663 419.444 L
417.582 419.444 L
418.158 419.444 L
418.69 419.444 L
419.227 419.444 L
419.76 419.444 L
420.283 419.444 L
420.835 419.444 L
421.405 419.444 L
421.933 419.444 L
422.466 419.444 L
423.008 419.444 L
423.54 419.444 L
424.12 419.444 L
424.629 419.444 L
425.228 419.444 L
425.737 419.444 L
426.274 419.444 L
426.835 419.444 L
427.363 419.444 L
427.933 419.444 L
428.471 419.444 L
429.003 419.444 L
429.574 419.444 L
430.054 419.444 L
430.63 419.444 L
431.167 419.444 L
431.714 419.444 L
432.279 419.444 L
432.817 419.444 L
433.373 419.444 L
433.712 419.444 L
434.202 419.444 L
434.754 419.444 L
435.305 419.444 L
435.843 419.444 L
436.413 419.444 L
436.946 419.444 L
437.502 419.444 L
438.03 419.444 L
438.581 419.444 L
439.137 419.444 L
439.67 419.444 L
440.674 419.444 L
441.235 419.444 L
441.749 419.444 L
442.305 419.444 L
442.823 419.444 L
443.375 419.444 L
443.922 419.444 L
444.459 419.444 L
444.992 419.444 L
445.553 419.444 L
446.085 419.444 L
446.637 419.444 L
447.184 419.444 L
447.735 419.444 L
448.277 419.444 L
448.805 419.444 L
449.342 419.444 L
449.88 419.444 L
450.398 419.444 L
450.968 419.444 L
451.511 419.444 L
452.053 419.444 L
452.604 419.444 L
453.085 419.444 L
453.683 419.444 L
454.164 419.444 L
454.702 419.444 L
455.258 419.444 L
455.809 419.444 L
456.342 419.444 L
456.865 419.444 L
457.421 419.444 L
457.963 419.444 L
458.496 419.444 L
459.033 419.444 L
459.571 419.444 L
460.108 419.444 L
460.655 419.444 L
461.211 419.444 L
461.72 419.444 L
462.762 419.444 L
463.271 419.444 L
463.799 419.444 L
464.369 419.444 L
464.902 419.444 L
465.439 419.444 L
466.009 419.444 L
466.518 419.444 L
467.084 419.444 L
467.626 419.444 L
468.168 419.444 L
468.715 419.444 L
469.233 419.444 L
469.742 419.444 L
470.299 419.444 L
470.822 419.444 L
471.383 419.444 L
471.939 419.444 L
472.486 419.444 L
473.033 419.444 L
473.513 419.444 L
474.06 419.444 L
474.607 419.444 L
475.154 419.444 L
475.71 419.444 L
476.242 419.444 L
476.808 419.444 L
477.341 419.444 L
477.873 419.444 L
478.406 419.444 L
478.929 419.444 L
479.462 419.444 L
480.027 419.444 L
480.574 419.444 L
481.121 419.444 L
481.63 419.444 L
482.177 419.444 L
482.742 419.444 L
483.247 419.444 L
483.841 419.444 L
484.354 419.444 L
484.873 419.444 L
485.467 419.444 L
485.976 419.444 L
486.48 419.444 L
487.051 419.444 L
487.588 419.444 L
488.422 419.444 L
488.955 419.444 L
489.521 419.444 L
490.048 419.444 L
490.586 419.444 L
491.123 419.444 L
491.675 419.444 L
492.193 419.444 L
492.74 419.444 L
493.258 419.444 L
493.819 419.444 L
494.366 419.444 L
494.927 419.444 L
495.445 419.444 L
495.992 419.444 L
496.52 419.444 L
497.067 419.444 L
497.581 419.444 L
497.944 419.444 L
498.467 419.444 L
498.999 419.444 L
499.537 419.444 L
500.107 419.444 L
500.607 419.444 L
501.172 419.444 L
501.705 419.444 L
502.238 419.444 L
502.794 419.444 L
503.35 419.444 L
503.859 419.444 L
504.42 419.444 L
504.967 419.444 L
505.49 419.444 L
506.046 419.444 L
506.602 419.444 L
507.917 419.444 L
508.464 419.444 L
509.006 419.444 L
509.534 419.444 L
510.095 419.444 L
510.614 419.444 L
511.16 419.444 L
511.674 419.444 L
512.24 419.444 L
512.787 419.444 L
513.314 419.444 L
513.847 419.444 L
514.408 419.444 L
514.936 419.444 L
515.473 419.444 L
516.044 419.444 L
516.548 419.444 L
517.085 419.444 L
517.642 419.444 L
518.179 419.444 L
518.749 419.444 L
519.287 419.444 L
519.819 419.444 L
520.357 419.444 L
520.88 419.444 L
521.422 419.444 L
521.95 419.444 L
522.52 419.444 L
523.043 419.444 L
523.576 419.444 L
524.146 419.444 L
524.684 419.444 L
525.202 419.444 L
525.749 419.444 L
526.277 419.444 L
526.626 419.444 L
527.191 419.444 L
527.729 419.444 L
528.261 419.444 L
528.798 419.444 L
529.359 419.444 L
529.859 419.444 L
530.434 419.444 L
530.962 419.444 L
531.513 419.444 L
532.023 419.444 L
532.593 419.444 L
533.121 419.444 L
533.682 419.444 L
534.205 419.444 L
534.705 419.444 L
535.218 419.444 L
535.76 419.444 L
536.317 419.444 L
536.84 419.444 L
537.396 419.444 L
537.947 419.444 L
538.494 419.444 L
539.003 419.444 L
539.564 419.444 L
540.087 419.444 L
540.606 419.444 L
541.172 419.444 L
541.709 419.444 L
542.265 419.444 L
542.812 419.444 L
543.335 419.444 L
544.226 419.444 L
544.787 419.444 L
545.324 419.444 L
545.857 419.444 L
546.385 419.444 L
546.913 419.444 L
547.492 419.444 L
548.025 419.444 L
548.562 419.444 L
549.095 419.444 L
549.623 419.444 L
550.174 419.444 L
550.721 419.444 L
551.273 419.444 L
551.815 419.444 L
552.918 419.444 L
553.441 419.444 L
553.974 419.444 L
554.525 419.444 L
555.067 419.444 L
555.623 419.444 L
556.156 419.444 L
556.707 419.444 L
557.226 419.444 L
557.758 419.444 L
558.296 419.444 L
558.838 419.444 L
559.385 419.444 L
559.719 419.444 L
560.224 419.444 L
560.775 419.444 L
561.317 419.444 L
561.864 419.444 L
562.411 419.444 L
562.958 419.444 L
563.5 419.444 L
564.042 419.444 L
564.598 419.444 L
565.107 419.444 L
566.031 419.444 L
566.578 419.444 L
567.124 419.444 L
567.671 419.444 L
568.218 419.444 L
568.769 419.444 L
569.311 419.444 L
569.792 419.444 L
570.334 419.444 L
570.886 419.444 L
571.432 419.444 L
571.979 419.444 L
572.526 419.444 L
573.077 419.444 L
573.62 419.444 L
574.1 419.444 L
574.652 419.444 L
575.194 419.444 L
575.75 419.444 L
576.292 419.444 L
576.971 419.444 L
577.522 419.444 L
578.003 419.444 L
578.55 419.444 L
579.097 419.444 L
579.672 419.444 L
580.19 419.444 L
580.728 419.444 L
581.293 419.444 L
581.835 419.444 L
582.358 419.444 L
582.886 419.444 L
583.424 419.444 L
583.952 419.444 L
584.489 419.444 L
585.059 419.444 L
585.583 419.444 L
586.12 419.444 L
586.667 419.444 L
587.213 419.444 L
587.722 419.444 L
588.269 419.444 L
588.835 419.444 L
589.339 419.444 L
589.91 419.444 L
590.466 419.444 L
590.621 419.444 L
591.144 419.444 L
591.738 419.444 L
592.224 419.444 L
592.757 419.444 L
593.322 419.444 L
593.864 419.444 L
594.397 419.444 L
594.934 419.444 L
595.5 419.444 L
596.028 419.444 L
596.532 419.444 L
597.234 419.444 L
597.63 419.444 L
598.168 419.444 L
598.729 419.444 L
599.252 419.444 L
599.789 419.444 L
600.317 419.444 L
601.363 419.444 L
601.877 419.444 L
602.452 419.444 L
602.985 419.444 L
603.513 419.444 L
604.041 419.444 L
604.606 419.444 L
605.125 419.444 L
605.639 419.444 L
606.228 419.444 L
606.756 419.444 L
607.265 419.444 L
607.821 419.444 L
608.377 419.444 L
608.905 419.444 L
609.428 419.444 L
609.994 419.444 L
610.531 419.444 L
611.055 419.444 L
611.592 419.444 L
612.294 419.444 L
612.817 419.444 L
613.359 419.444 L
613.901 419.444 L
614.448 419.444 L
614.995 419.444 L
615.513 419.444 L
616.065 419.444 L
616.583 419.444 L
617.126 419.444 L
617.672 419.444 L
618.224 419.444 L
618.78 419.444 L
619.322 419.444 L
619.864 419.444 L
620.882 419.444 L
621.396 419.444 L
621.947 419.444 L
622.49 419.444 L
623.036 419.444 L
623.574 419.444 L
624.111 419.444 L
624.662 419.444 L
625.181 419.444 L
S
GR
GS
[0.6 0 0 0.6 0 0] CT
1 GC
N
621 98 M
621 52 L
445 52 L
445 98 L
cp
f
GR
GS
[0.6 0 0 0.6 302.30013 38.76164] CT
/Helvetica 15 F
GS
[1 0 0 1 0 0] CT
0 6 moveto 
1 -1 scale
(Simulovan\341 data) t 
GR
GR
GS
[0.6 0 0 0.6 0 0] CT
0 0.447 0.741 RC
1 LJ
3.333 LW
N
450.007 64.603 M
500.078 64.603 L
S
GR
GS
[0.6 0 0 0.6 302.30013 51.23836] CT
N
/f-1534607047{1.141 6 M
1.141 -4.734 L
2.594 -4.734 L
8.234 3.688 L
8.234 -4.734 L
9.609 -4.734 L
9.609 6 L
8.141 6 L
2.5 -2.438 L
2.5 6 L
1.141 6 L
cp
16.895 5.047 M
16.161 5.656 15.489 5.914 QT
14.817 6.172 14.036 6.172 QT
12.754 6.172 12.067 5.547 QT
11.379 4.922 11.379 3.953 QT
11.379 3.375 11.637 2.906 QT
11.895 2.438 12.317 2.148 QT
12.739 1.859 13.27 1.719 QT
13.645 1.609 14.442 1.516 QT
16.036 1.328 16.786 1.063 QT
16.801 0.797 16.801 0.719 QT
16.801 -0.094 16.426 -0.422 QT
15.911 -0.859 14.926 -0.859 QT
13.989 -0.859 13.543 -0.539 QT
13.098 -0.219 12.895 0.609 QT
11.598 0.438 L
11.77 -0.391 12.176 -0.898 QT
12.583 -1.406 13.348 -1.68 QT
14.114 -1.953 15.114 -1.953 QT
16.114 -1.953 16.731 -1.719 QT
17.348 -1.484 17.645 -1.133 QT
17.942 -0.781 18.051 -0.234 QT
18.114 0.109 18.114 0.984 QT
18.114 2.734 L
18.114 4.578 18.2 5.063 QT
18.286 5.547 18.536 6 QT
17.161 6 L
16.958 5.594 16.895 5.047 QT
cp
16.786 2.094 M
16.067 2.391 14.629 2.594 QT
13.817 2.719 13.481 2.859 QT
13.145 3 12.965 3.281 QT
12.786 3.563 12.786 3.906 QT
12.786 4.438 13.184 4.789 QT
13.583 5.141 14.348 5.141 QT
15.114 5.141 15.708 4.805 QT
16.301 4.469 16.583 3.891 QT
16.786 3.453 16.786 2.578 QT
16.786 2.094 L
cp
20.159 6 M
20.159 -1.781 L
21.347 -1.781 L
21.347 -0.688 L
21.706 -1.266 22.315 -1.609 QT
22.925 -1.953 23.706 -1.953 QT
24.565 -1.953 25.12 -1.594 QT
25.675 -1.234 25.894 -0.594 QT
26.815 -1.953 28.3 -1.953 QT
29.456 -1.953 30.081 -1.313 QT
30.706 -0.672 30.706 0.656 QT
30.706 6 L
29.394 6 L
29.394 1.094 L
29.394 0.313 29.269 -0.039 QT
29.144 -0.391 28.8 -0.602 QT
28.456 -0.813 28.003 -0.813 QT
27.19 -0.813 26.644 -0.266 QT
26.097 0.281 26.097 1.484 QT
26.097 6 L
24.784 6 L
24.784 0.953 L
24.784 0.063 24.464 -0.375 QT
24.144 -0.813 23.409 -0.813 QT
22.847 -0.813 22.378 -0.516 QT
21.909 -0.219 21.698 0.344 QT
21.487 0.906 21.487 1.969 QT
21.487 6 L
20.159 6 L
cp
37.982 3.5 M
39.342 3.656 L
39.029 4.859 38.154 5.516 QT
37.279 6.172 35.92 6.172 QT
34.217 6.172 33.217 5.125 QT
32.217 4.078 32.217 2.172 QT
32.217 0.219 33.232 -0.867 QT
34.248 -1.953 35.857 -1.953 QT
37.42 -1.953 38.404 -0.891 QT
39.389 0.172 39.389 2.094 QT
39.389 2.219 39.389 2.453 QT
33.576 2.453 L
33.654 3.734 34.303 4.414 QT
34.951 5.094 35.936 5.094 QT
36.654 5.094 37.17 4.711 QT
37.686 4.328 37.982 3.5 QT
cp
33.654 1.359 M
37.998 1.359 L
37.904 0.375 37.498 -0.109 QT
36.873 -0.875 35.873 -0.875 QT
34.951 -0.875 34.334 -0.266 QT
33.717 0.344 33.654 1.359 QT
cp
35.67 -3.797 M
36.482 -5.047 L
37.967 -5.047 L
36.326 -3 L
34.92 -3 L
33.342 -5.047 L
34.842 -5.047 L
35.67 -3.797 L
cp
40.981 6 M
40.981 -1.781 L
42.168 -1.781 L
42.168 -0.594 L
42.622 -1.422 43.012 -1.688 QT
43.403 -1.953 43.856 -1.953 QT
44.528 -1.953 45.215 -1.531 QT
44.762 -0.313 L
44.278 -0.594 43.793 -0.594 QT
43.356 -0.594 43.012 -0.336 QT
42.668 -0.078 42.528 0.391 QT
42.309 1.094 42.309 1.922 QT
42.309 6 L
40.981 6 L
cp
43.012 -3.797 M
43.825 -5.047 L
45.309 -5.047 L
43.668 -3 L
42.262 -3 L
40.684 -5.047 L
42.184 -5.047 L
43.012 -3.797 L
cp
51.32 3.5 M
52.679 3.656 L
52.367 4.859 51.492 5.516 QT
50.617 6.172 49.257 6.172 QT
47.554 6.172 46.554 5.125 QT
45.554 4.078 45.554 2.172 QT
45.554 0.219 46.57 -0.867 QT
47.585 -1.953 49.195 -1.953 QT
50.757 -1.953 51.742 -0.891 QT
52.726 0.172 52.726 2.094 QT
52.726 2.219 52.726 2.453 QT
46.914 2.453 L
46.992 3.734 47.64 4.414 QT
48.289 5.094 49.273 5.094 QT
49.992 5.094 50.507 4.711 QT
51.023 4.328 51.32 3.5 QT
cp
46.992 1.359 M
51.335 1.359 L
51.242 0.375 50.835 -0.109 QT
50.21 -0.875 49.21 -0.875 QT
48.289 -0.875 47.671 -0.266 QT
47.054 0.344 46.992 1.359 QT
cp
54.334 6 M
54.334 -1.781 L
55.521 -1.781 L
55.521 -0.672 L
56.381 -1.953 58.006 -1.953 QT
58.709 -1.953 59.295 -1.703 QT
59.881 -1.453 60.178 -1.039 QT
60.475 -0.625 60.584 -0.063 QT
60.662 0.297 60.662 1.219 QT
60.662 6 L
59.334 6 L
59.334 1.266 L
59.334 0.469 59.186 0.07 QT
59.037 -0.328 58.646 -0.57 QT
58.256 -0.813 57.725 -0.813 QT
56.881 -0.813 56.271 -0.281 QT
55.662 0.25 55.662 1.75 QT
55.662 6 L
54.334 6 L
cp
67.754 5.047 M
67.02 5.656 66.348 5.914 QT
65.676 6.172 64.895 6.172 QT
63.614 6.172 62.926 5.547 QT
62.239 4.922 62.239 3.953 QT
62.239 3.375 62.497 2.906 QT
62.754 2.438 63.176 2.148 QT
63.598 1.859 64.129 1.719 QT
64.504 1.609 65.301 1.516 QT
66.895 1.328 67.645 1.063 QT
67.661 0.797 67.661 0.719 QT
67.661 -0.094 67.286 -0.422 QT
66.77 -0.859 65.786 -0.859 QT
64.848 -0.859 64.403 -0.539 QT
63.958 -0.219 63.754 0.609 QT
62.458 0.438 L
62.629 -0.391 63.036 -0.898 QT
63.442 -1.406 64.208 -1.68 QT
64.973 -1.953 65.973 -1.953 QT
66.973 -1.953 67.59 -1.719 QT
68.208 -1.484 68.504 -1.133 QT
68.801 -0.781 68.911 -0.234 QT
68.973 0.109 68.973 0.984 QT
68.973 2.734 L
68.973 4.578 69.059 5.063 QT
69.145 5.547 69.395 6 QT
68.02 6 L
67.817 5.594 67.754 5.047 QT
cp
67.645 2.094 M
66.926 2.391 65.489 2.594 QT
64.676 2.719 64.34 2.859 QT
64.004 3 63.825 3.281 QT
63.645 3.563 63.645 3.906 QT
63.645 4.438 64.043 4.789 QT
64.442 5.141 65.208 5.141 QT
65.973 5.141 66.567 4.805 QT
67.161 4.469 67.442 3.891 QT
67.645 3.453 67.645 2.578 QT
67.645 2.094 L
cp
64.598 -3 M
65.567 -5.047 L
67.301 -5.047 L
65.692 -3 L
64.598 -3 L
cp
80.233 6 M
80.233 5.016 L
79.499 6.172 78.061 6.172 QT
77.139 6.172 76.358 5.664 QT
75.577 5.156 75.147 4.234 QT
74.717 3.313 74.717 2.125 QT
74.717 0.953 75.108 0.008 QT
75.499 -0.938 76.272 -1.445 QT
77.045 -1.953 77.999 -1.953 QT
78.702 -1.953 79.256 -1.656 QT
79.811 -1.359 80.155 -0.891 QT
80.155 -4.734 L
81.467 -4.734 L
81.467 6 L
80.233 6 L
cp
76.077 2.125 M
76.077 3.609 76.702 4.352 QT
77.327 5.094 78.186 5.094 QT
79.045 5.094 79.655 4.383 QT
80.264 3.672 80.264 2.234 QT
80.264 0.625 79.647 -0.117 QT
79.03 -0.859 78.124 -0.859 QT
77.249 -0.859 76.663 -0.141 QT
76.077 0.578 76.077 2.125 QT
cp
88.606 5.047 M
87.872 5.656 87.2 5.914 QT
86.528 6.172 85.747 6.172 QT
84.466 6.172 83.778 5.547 QT
83.091 4.922 83.091 3.953 QT
83.091 3.375 83.349 2.906 QT
83.606 2.438 84.028 2.148 QT
84.45 1.859 84.981 1.719 QT
85.356 1.609 86.153 1.516 QT
87.747 1.328 88.497 1.063 QT
88.513 0.797 88.513 0.719 QT
88.513 -0.094 88.138 -0.422 QT
87.622 -0.859 86.638 -0.859 QT
85.7 -0.859 85.255 -0.539 QT
84.81 -0.219 84.606 0.609 QT
83.31 0.438 L
83.481 -0.391 83.888 -0.898 QT
84.294 -1.406 85.06 -1.68 QT
85.825 -1.953 86.825 -1.953 QT
87.825 -1.953 88.442 -1.719 QT
89.06 -1.484 89.356 -1.133 QT
89.653 -0.781 89.763 -0.234 QT
89.825 0.109 89.825 0.984 QT
89.825 2.734 L
89.825 4.578 89.911 5.063 QT
89.997 5.547 90.247 6 QT
88.872 6 L
88.669 5.594 88.606 5.047 QT
cp
88.497 2.094 M
87.778 2.391 86.341 2.594 QT
85.528 2.719 85.192 2.859 QT
84.856 3 84.677 3.281 QT
84.497 3.563 84.497 3.906 QT
84.497 4.438 84.896 4.789 QT
85.294 5.141 86.06 5.141 QT
86.825 5.141 87.419 4.805 QT
88.013 4.469 88.294 3.891 QT
88.497 3.453 88.497 2.578 QT
88.497 2.094 L
cp
94.761 4.828 M
94.949 5.984 L
94.386 6.109 93.949 6.109 QT
93.23 6.109 92.832 5.875 QT
92.433 5.641 92.277 5.273 QT
92.121 4.906 92.121 3.719 QT
92.121 -0.75 L
91.152 -0.75 L
91.152 -1.781 L
92.121 -1.781 L
92.121 -3.703 L
93.433 -4.5 L
93.433 -1.781 L
94.761 -1.781 L
94.761 -0.75 L
93.433 -0.75 L
93.433 3.797 L
93.433 4.359 93.503 4.523 QT
93.574 4.688 93.73 4.781 QT
93.886 4.875 94.167 4.875 QT
94.402 4.875 94.761 4.828 QT
cp
101.116 5.047 M
100.382 5.656 99.71 5.914 QT
99.038 6.172 98.257 6.172 QT
96.976 6.172 96.288 5.547 QT
95.601 4.922 95.601 3.953 QT
95.601 3.375 95.858 2.906 QT
96.116 2.438 96.538 2.148 QT
96.96 1.859 97.491 1.719 QT
97.866 1.609 98.663 1.516 QT
100.257 1.328 101.007 1.063 QT
101.022 0.797 101.022 0.719 QT
101.022 -0.094 100.647 -0.422 QT
100.132 -0.859 99.147 -0.859 QT
98.21 -0.859 97.765 -0.539 QT
97.319 -0.219 97.116 0.609 QT
95.819 0.438 L
95.991 -0.391 96.397 -0.898 QT
96.804 -1.406 97.569 -1.68 QT
98.335 -1.953 99.335 -1.953 QT
100.335 -1.953 100.952 -1.719 QT
101.569 -1.484 101.866 -1.133 QT
102.163 -0.781 102.272 -0.234 QT
102.335 0.109 102.335 0.984 QT
102.335 2.734 L
102.335 4.578 102.421 5.063 QT
102.507 5.547 102.757 6 QT
101.382 6 L
101.179 5.594 101.116 5.047 QT
cp
101.007 2.094 M
100.288 2.391 98.851 2.594 QT
98.038 2.719 97.702 2.859 QT
97.366 3 97.187 3.281 QT
97.007 3.563 97.007 3.906 QT
97.007 4.438 97.405 4.789 QT
97.804 5.141 98.569 5.141 QT
99.335 5.141 99.929 4.805 QT
100.522 4.469 100.804 3.891 QT
101.007 3.453 101.007 2.578 QT
101.007 2.094 L
cp}def
f-1534607047
f
GR
GS
[0.6 0 0 0.6 0 0] CT
0.851 0.325 0.098 RC
1 LJ
3.333 LW
N
450.007 85.397 M
500.078 85.397 L
S
GR
GS
[0.6 0 0 0.6 0 0] CT
0.149 GC
10.0 ML
0.833 LW
N
445 98 M
445 52 L
621 52 L
621 98 L
cp
S
GR
%%Trailer
%%Pages: 1
%%EOF
