%!PS-Adobe-3.0 EPSF-3.0
%%Creator: (MATLAB, The Mathworks, Inc. Version 9.14.0.2206163 \(R2023a\). Operating System: Windows 10)
%%Title: C:/Users/radac/Desktop/Bachelor_thesis/thesis/Model/figs/model_v.eps
%%CreationDate: 2023-05-20T19:24:08
%%Pages: (atend)
%%BoundingBox:     0     0   420   315
%%LanguageLevel: 3
%%EndComments
%%BeginProlog
%%BeginResource: procset (Apache XML Graphics Std ProcSet) 1.2 0
%%Version: 1.2 0
%%Copyright: (Copyright 2001-2003,2010 The Apache Software Foundation. License terms: http://www.apache.org/licenses/LICENSE-2.0)
/bd{bind def}bind def
/ld{load def}bd
/GR/grestore ld
/GS/gsave ld
/RM/rmoveto ld
/C/curveto ld
/t/show ld
/L/lineto ld
/ML/setmiterlimit ld
/CT/concat ld
/f/fill ld
/N/newpath ld
/S/stroke ld
/CC/setcmykcolor ld
/A/ashow ld
/cp/closepath ld
/RC/setrgbcolor ld
/LJ/setlinejoin ld
/GC/setgray ld
/LW/setlinewidth ld
/M/moveto ld
/re {4 2 roll M
1 index 0 rlineto
0 exch rlineto
neg 0 rlineto
cp } bd
/_ctm matrix def
/_tm matrix def
/BT { _ctm currentmatrix pop matrix _tm copy pop 0 0 moveto } bd
/ET { _ctm setmatrix } bd
/iTm { _ctm setmatrix _tm concat } bd
/Tm { _tm astore pop iTm 0 0 moveto } bd
/ux 0.0 def
/uy 0.0 def
/F {
  /Tp exch def
  /Tf exch def
  Tf findfont Tp scalefont setfont
  /cf Tf def  /cs Tp def
} bd
/ULS {currentpoint /uy exch def /ux exch def} bd
/ULE {
  /Tcx currentpoint pop def
  gsave
  newpath
  cf findfont cs scalefont dup
  /FontMatrix get 0 get /Ts exch def /FontInfo get dup
  /UnderlinePosition get Ts mul /To exch def
  /UnderlineThickness get Ts mul /Tt exch def
  ux uy To add moveto  Tcx uy To add lineto
  Tt setlinewidth stroke
  grestore
} bd
/OLE {
  /Tcx currentpoint pop def
  gsave
  newpath
  cf findfont cs scalefont dup
  /FontMatrix get 0 get /Ts exch def /FontInfo get dup
  /UnderlinePosition get Ts mul /To exch def
  /UnderlineThickness get Ts mul /Tt exch def
  ux uy To add cs add moveto Tcx uy To add cs add lineto
  Tt setlinewidth stroke
  grestore
} bd
/SOE {
  /Tcx currentpoint pop def
  gsave
  newpath
  cf findfont cs scalefont dup
  /FontMatrix get 0 get /Ts exch def /FontInfo get dup
  /UnderlinePosition get Ts mul /To exch def
  /UnderlineThickness get Ts mul /Tt exch def
  ux uy To add cs 10 mul 26 idiv add moveto Tcx uy To add cs 10 mul 26 idiv add lineto
  Tt setlinewidth stroke
  grestore
} bd
/QT {
/Y22 exch store
/X22 exch store
/Y21 exch store
/X21 exch store
currentpoint
/Y21 load 2 mul add 3 div exch
/X21 load 2 mul add 3 div exch
/X21 load 2 mul /X22 load add 3 div
/Y21 load 2 mul /Y22 load add 3 div
/X22 load /Y22 load curveto
} bd
/SSPD {
dup length /d exch dict def
{
/v exch def
/k exch def
currentpagedevice k known {
/cpdv currentpagedevice k get def
v cpdv ne {
/upd false def
/nullv v type /nulltype eq def
/nullcpdv cpdv type /nulltype eq def
nullv nullcpdv or
{
/upd true def
} {
/sametype v type cpdv type eq def
sametype {
v type /arraytype eq {
/vlen v length def
/cpdvlen cpdv length def
vlen cpdvlen eq {
0 1 vlen 1 sub {
/i exch def
/obj v i get def
/cpdobj cpdv i get def
obj cpdobj ne {
/upd true def
exit
} if
} for
} {
/upd true def
} ifelse
} {
v type /dicttype eq {
v {
/dv exch def
/dk exch def
/cpddv cpdv dk get def
dv cpddv ne {
/upd true def
exit
} if
} forall
} {
/upd true def
} ifelse
} ifelse
} if
} ifelse
upd true eq {
d k v put
} if
} if
} if
} forall
d length 0 gt {
d setpagedevice
} if
} bd
/RE { % /NewFontName [NewEncodingArray] /FontName RE -
  findfont dup length dict begin
  {
    1 index /FID ne
    {def} {pop pop} ifelse
  } forall
  /Encoding exch def
  /FontName 1 index def
  currentdict definefont pop
  end
} bind def
%%EndResource
%%BeginResource: procset (Apache XML Graphics EPS ProcSet) 1.0 0
%%Version: 1.0 0
%%Copyright: (Copyright 2002-2003 The Apache Software Foundation. License terms: http://www.apache.org/licenses/LICENSE-2.0)
/BeginEPSF { %def
/b4_Inc_state save def         % Save state for cleanup
/dict_count countdictstack def % Count objects on dict stack
/op_count count 1 sub def      % Count objects on operand stack
userdict begin                 % Push userdict on dict stack
/showpage { } def              % Redefine showpage, { } = null proc
0 setgray 0 setlinecap         % Prepare graphics state
1 setlinewidth 0 setlinejoin
10 setmiterlimit [ ] 0 setdash newpath
/languagelevel where           % If level not equal to 1 then
{pop languagelevel             % set strokeadjust and
1 ne                           % overprint to their defaults.
{false setstrokeadjust false setoverprint
} if
} if
} bd
/EndEPSF { %def
count op_count sub {pop} repeat            % Clean up stacks
countdictstack dict_count sub {end} repeat
b4_Inc_state restore
} bd
%%EndResource
%FOPBeginFontDict
%%IncludeResource: font Courier-Oblique
%%IncludeResource: font Courier-BoldOblique
%%IncludeResource: font Courier-Bold
%%IncludeResource: font ZapfDingbats
%%IncludeResource: font Symbol
%%IncludeResource: font Helvetica
%%IncludeResource: font Helvetica-Oblique
%%IncludeResource: font Helvetica-Bold
%%IncludeResource: font Helvetica-BoldOblique
%%IncludeResource: font Times-Roman
%%IncludeResource: font Times-Italic
%%IncludeResource: font Times-Bold
%%IncludeResource: font Times-BoldItalic
%%IncludeResource: font Courier
%FOPEndFontDict
%%BeginResource: encoding WinAnsiEncoding
/WinAnsiEncoding [
/.notdef /.notdef /.notdef /.notdef /.notdef
/.notdef /.notdef /.notdef /.notdef /.notdef
/.notdef /.notdef /.notdef /.notdef /.notdef
/.notdef /.notdef /.notdef /.notdef /.notdef
/.notdef /.notdef /.notdef /.notdef /.notdef
/.notdef /.notdef /.notdef /.notdef /.notdef
/.notdef /.notdef /space /exclam /quotedbl
/numbersign /dollar /percent /ampersand /quotesingle
/parenleft /parenright /asterisk /plus /comma
/hyphen /period /slash /zero /one
/two /three /four /five /six
/seven /eight /nine /colon /semicolon
/less /equal /greater /question /at
/A /B /C /D /E
/F /G /H /I /J
/K /L /M /N /O
/P /Q /R /S /T
/U /V /W /X /Y
/Z /bracketleft /backslash /bracketright /asciicircum
/underscore /quoteleft /a /b /c
/d /e /f /g /h
/i /j /k /l /m
/n /o /p /q /r
/s /t /u /v /w
/x /y /z /braceleft /bar
/braceright /asciitilde /bullet /Euro /bullet
/quotesinglbase /florin /quotedblbase /ellipsis /dagger
/daggerdbl /circumflex /perthousand /Scaron /guilsinglleft
/OE /bullet /Zcaron /bullet /bullet
/quoteleft /quoteright /quotedblleft /quotedblright /bullet
/endash /emdash /asciitilde /trademark /scaron
/guilsinglright /oe /bullet /zcaron /Ydieresis
/space /exclamdown /cent /sterling /currency
/yen /brokenbar /section /dieresis /copyright
/ordfeminine /guillemotleft /logicalnot /sfthyphen /registered
/macron /degree /plusminus /twosuperior /threesuperior
/acute /mu /paragraph /middot /cedilla
/onesuperior /ordmasculine /guillemotright /onequarter /onehalf
/threequarters /questiondown /Agrave /Aacute /Acircumflex
/Atilde /Adieresis /Aring /AE /Ccedilla
/Egrave /Eacute /Ecircumflex /Edieresis /Igrave
/Iacute /Icircumflex /Idieresis /Eth /Ntilde
/Ograve /Oacute /Ocircumflex /Otilde /Odieresis
/multiply /Oslash /Ugrave /Uacute /Ucircumflex
/Udieresis /Yacute /Thorn /germandbls /agrave
/aacute /acircumflex /atilde /adieresis /aring
/ae /ccedilla /egrave /eacute /ecircumflex
/edieresis /igrave /iacute /icircumflex /idieresis
/eth /ntilde /ograve /oacute /ocircumflex
/otilde /odieresis /divide /oslash /ugrave
/uacute /ucircumflex /udieresis /yacute /thorn
/ydieresis
] def
%%EndResource
%FOPBeginFontReencode
/Courier-Oblique findfont
dup length dict begin
  {1 index /FID ne {def} {pop pop} ifelse} forall
  /Encoding WinAnsiEncoding def
  currentdict
end
/Courier-Oblique exch definefont pop
/Courier-BoldOblique findfont
dup length dict begin
  {1 index /FID ne {def} {pop pop} ifelse} forall
  /Encoding WinAnsiEncoding def
  currentdict
end
/Courier-BoldOblique exch definefont pop
/Courier-Bold findfont
dup length dict begin
  {1 index /FID ne {def} {pop pop} ifelse} forall
  /Encoding WinAnsiEncoding def
  currentdict
end
/Courier-Bold exch definefont pop
/Helvetica findfont
dup length dict begin
  {1 index /FID ne {def} {pop pop} ifelse} forall
  /Encoding WinAnsiEncoding def
  currentdict
end
/Helvetica exch definefont pop
/Helvetica-Oblique findfont
dup length dict begin
  {1 index /FID ne {def} {pop pop} ifelse} forall
  /Encoding WinAnsiEncoding def
  currentdict
end
/Helvetica-Oblique exch definefont pop
/Helvetica-Bold findfont
dup length dict begin
  {1 index /FID ne {def} {pop pop} ifelse} forall
  /Encoding WinAnsiEncoding def
  currentdict
end
/Helvetica-Bold exch definefont pop
/Helvetica-BoldOblique findfont
dup length dict begin
  {1 index /FID ne {def} {pop pop} ifelse} forall
  /Encoding WinAnsiEncoding def
  currentdict
end
/Helvetica-BoldOblique exch definefont pop
/Times-Roman findfont
dup length dict begin
  {1 index /FID ne {def} {pop pop} ifelse} forall
  /Encoding WinAnsiEncoding def
  currentdict
end
/Times-Roman exch definefont pop
/Times-Italic findfont
dup length dict begin
  {1 index /FID ne {def} {pop pop} ifelse} forall
  /Encoding WinAnsiEncoding def
  currentdict
end
/Times-Italic exch definefont pop
/Times-Bold findfont
dup length dict begin
  {1 index /FID ne {def} {pop pop} ifelse} forall
  /Encoding WinAnsiEncoding def
  currentdict
end
/Times-Bold exch definefont pop
/Times-BoldItalic findfont
dup length dict begin
  {1 index /FID ne {def} {pop pop} ifelse} forall
  /Encoding WinAnsiEncoding def
  currentdict
end
/Times-BoldItalic exch definefont pop
/Courier findfont
dup length dict begin
  {1 index /FID ne {def} {pop pop} ifelse} forall
  /Encoding WinAnsiEncoding def
  currentdict
end
/Courier exch definefont pop
%FOPEndFontReencode
%%EndProlog
%%Page: 1 1
%%PageBoundingBox: 0 0 420 315
%%BeginPageSetup
[1 0 0 -1 0 315] CT
%%EndPageSetup
GS
[0.6 0 0 0.6 0 0] CT
1 GC
N
0 0 700 525 re
f
GR
GS
[0.6 0 0 0.6 0 0] CT
1 GC
N
0 0 700 525 re
f
GR
GS
[0.6 0 0 0.6 0 0] CT
1 GC
N
91 454 M
634 454 L
634 39 L
91 39 L
cp
f
GR
GS
[0.6 0 0 0.6 0 0] CT
0.873 GC
1 LJ
0.833 LW
N
91 454 M
91 39 L
S
GR
GS
[0.6 0 0 0.6 0 0] CT
0.873 GC
1 LJ
0.833 LW
N
199.6 454 M
199.6 39 L
S
GR
GS
[0.6 0 0 0.6 0 0] CT
0.873 GC
1 LJ
0.833 LW
N
308.2 454 M
308.2 39 L
S
GR
GS
[0.6 0 0 0.6 0 0] CT
0.873 GC
1 LJ
0.833 LW
N
416.8 454 M
416.8 39 L
S
GR
GS
[0.6 0 0 0.6 0 0] CT
0.873 GC
1 LJ
0.833 LW
N
525.4 454 M
525.4 39 L
S
GR
GS
[0.6 0 0 0.6 0 0] CT
0.873 GC
1 LJ
0.833 LW
N
634 454 M
634 39 L
S
GR
GS
[0.6 0 0 0.6 0 0] CT
0.873 GC
1 LJ
0.833 LW
N
634 454 M
91 454 L
S
GR
GS
[0.6 0 0 0.6 0 0] CT
0.873 GC
1 LJ
0.833 LW
N
634 384.833 M
91 384.833 L
S
GR
GS
[0.6 0 0 0.6 0 0] CT
0.873 GC
1 LJ
0.833 LW
N
634 315.667 M
91 315.667 L
S
GR
GS
[0.6 0 0 0.6 0 0] CT
0.873 GC
1 LJ
0.833 LW
N
634 246.5 M
91 246.5 L
S
GR
GS
[0.6 0 0 0.6 0 0] CT
0.873 GC
1 LJ
0.833 LW
N
634 177.333 M
91 177.333 L
S
GR
GS
[0.6 0 0 0.6 0 0] CT
0.873 GC
1 LJ
0.833 LW
N
634 108.167 M
91 108.167 L
S
GR
GS
[0.6 0 0 0.6 0 0] CT
0.873 GC
1 LJ
0.833 LW
N
634 39 M
91 39 L
S
GR
GS
[0.6 0 0 0.6 0 0] CT
0.149 GC
2 setlinecap
1 LJ
0.833 LW
N
91 454 M
634 454 L
S
GR
GS
[0.6 0 0 0.6 0 0] CT
0.149 GC
2 setlinecap
1 LJ
0.833 LW
N
91 39 M
634 39 L
S
GR
GS
[0.6 0 0 0.6 0 0] CT
0.149 GC
2 setlinecap
1 LJ
0.833 LW
N
91 454 M
91 448.57 L
S
GR
GS
[0.6 0 0 0.6 0 0] CT
0.149 GC
2 setlinecap
1 LJ
0.833 LW
N
199.6 454 M
199.6 448.57 L
S
GR
GS
[0.6 0 0 0.6 0 0] CT
0.149 GC
2 setlinecap
1 LJ
0.833 LW
N
308.2 454 M
308.2 448.57 L
S
GR
GS
[0.6 0 0 0.6 0 0] CT
0.149 GC
2 setlinecap
1 LJ
0.833 LW
N
416.8 454 M
416.8 448.57 L
S
GR
GS
[0.6 0 0 0.6 0 0] CT
0.149 GC
2 setlinecap
1 LJ
0.833 LW
N
525.4 454 M
525.4 448.57 L
S
GR
GS
[0.6 0 0 0.6 0 0] CT
0.149 GC
2 setlinecap
1 LJ
0.833 LW
N
634 454 M
634 448.57 L
S
GR
GS
[0.6 0 0 0.6 0 0] CT
0.149 GC
2 setlinecap
1 LJ
0.833 LW
N
91 39 M
91 44.43 L
S
GR
GS
[0.6 0 0 0.6 0 0] CT
0.149 GC
2 setlinecap
1 LJ
0.833 LW
N
199.6 39 M
199.6 44.43 L
S
GR
GS
[0.6 0 0 0.6 0 0] CT
0.149 GC
2 setlinecap
1 LJ
0.833 LW
N
308.2 39 M
308.2 44.43 L
S
GR
GS
[0.6 0 0 0.6 0 0] CT
0.149 GC
2 setlinecap
1 LJ
0.833 LW
N
416.8 39 M
416.8 44.43 L
S
GR
GS
[0.6 0 0 0.6 0 0] CT
0.149 GC
2 setlinecap
1 LJ
0.833 LW
N
525.4 39 M
525.4 44.43 L
S
GR
GS
[0.6 0 0 0.6 0 0] CT
0.149 GC
2 setlinecap
1 LJ
0.833 LW
N
634 39 M
634 44.43 L
S
GR
GS
[0.6 0 0 0.6 54.6 277.2] CT
0.149 GC
/Helvetica 23.333 F
GS
[1 0 0 1 0 0] CT
-6.5 24 moveto 
1 -1 scale
(0) t 
GR
GR
GS
[0.6 0 0 0.6 119.76 277.2] CT
0.149 GC
/Helvetica 23.333 F
GS
[1 0 0 1 0 0] CT
-19.5 24 moveto 
1 -1 scale
(200) t 
GR
GR
GS
[0.6 0 0 0.6 184.92001 277.2] CT
0.149 GC
/Helvetica 23.333 F
GS
[1 0 0 1 0 0] CT
-19.5 24 moveto 
1 -1 scale
(400) t 
GR
GR
GS
[0.6 0 0 0.6 250.07999 277.2] CT
0.149 GC
/Helvetica 23.333 F
GS
[1 0 0 1 0 0] CT
-19.5 24 moveto 
1 -1 scale
(600) t 
GR
GR
GS
[0.6 0 0 0.6 315.24001 277.2] CT
0.149 GC
/Helvetica 23.333 F
GS
[1 0 0 1 0 0] CT
-19.5 24 moveto 
1 -1 scale
(800) t 
GR
GR
GS
[0.6 0 0 0.6 380.4 277.2] CT
0.149 GC
/Helvetica 23.333 F
GS
[1 0 0 1 0 0] CT
-26 24 moveto 
1 -1 scale
(1000) t 
GR
GR
GS
[0.6 0 0 0.6 217.50016 295.59999] CT
0.149 GC
/Helvetica 25.667 F
GS
[1 0 0 1 0 0] CT
-28 26 moveto 
1 -1 scale
(s [m]) t 
GR
GR
GS
[0.6 0 0 0.6 0 0] CT
0.149 GC
2 setlinecap
1 LJ
0.833 LW
N
91 454 M
91 39 L
S
GR
GS
[0.6 0 0 0.6 0 0] CT
0.149 GC
2 setlinecap
1 LJ
0.833 LW
N
634 454 M
634 39 L
S
GR
GS
[0.6 0 0 0.6 0 0] CT
0.149 GC
2 setlinecap
1 LJ
0.833 LW
N
91 454 M
96.43 454 L
S
GR
GS
[0.6 0 0 0.6 0 0] CT
0.149 GC
2 setlinecap
1 LJ
0.833 LW
N
91 384.833 M
96.43 384.833 L
S
GR
GS
[0.6 0 0 0.6 0 0] CT
0.149 GC
2 setlinecap
1 LJ
0.833 LW
N
91 315.667 M
96.43 315.667 L
S
GR
GS
[0.6 0 0 0.6 0 0] CT
0.149 GC
2 setlinecap
1 LJ
0.833 LW
N
91 246.5 M
96.43 246.5 L
S
GR
GS
[0.6 0 0 0.6 0 0] CT
0.149 GC
2 setlinecap
1 LJ
0.833 LW
N
91 177.333 M
96.43 177.333 L
S
GR
GS
[0.6 0 0 0.6 0 0] CT
0.149 GC
2 setlinecap
1 LJ
0.833 LW
N
91 108.167 M
96.43 108.167 L
S
GR
GS
[0.6 0 0 0.6 0 0] CT
0.149 GC
2 setlinecap
1 LJ
0.833 LW
N
91 39 M
96.43 39 L
S
GR
GS
[0.6 0 0 0.6 0 0] CT
0.149 GC
2 setlinecap
1 LJ
0.833 LW
N
634 454 M
628.57 454 L
S
GR
GS
[0.6 0 0 0.6 0 0] CT
0.149 GC
2 setlinecap
1 LJ
0.833 LW
N
634 384.833 M
628.57 384.833 L
S
GR
GS
[0.6 0 0 0.6 0 0] CT
0.149 GC
2 setlinecap
1 LJ
0.833 LW
N
634 315.667 M
628.57 315.667 L
S
GR
GS
[0.6 0 0 0.6 0 0] CT
0.149 GC
2 setlinecap
1 LJ
0.833 LW
N
634 246.5 M
628.57 246.5 L
S
GR
GS
[0.6 0 0 0.6 0 0] CT
0.149 GC
2 setlinecap
1 LJ
0.833 LW
N
634 177.333 M
628.57 177.333 L
S
GR
GS
[0.6 0 0 0.6 0 0] CT
0.149 GC
2 setlinecap
1 LJ
0.833 LW
N
634 108.167 M
628.57 108.167 L
S
GR
GS
[0.6 0 0 0.6 0 0] CT
0.149 GC
2 setlinecap
1 LJ
0.833 LW
N
634 39 M
628.57 39 L
S
GR
GS
[0.6 0 0 0.6 49.8 272.4] CT
0.149 GC
/Helvetica 23.333 F
GS
[1 0 0 1 0 0] CT
-13 9 moveto 
1 -1 scale
(0) t 
GR
GR
GS
[0.6 0 0 0.6 49.8 230.90001] CT
0.149 GC
/Helvetica 23.333 F
GS
[1 0 0 1 0 0] CT
-13 9 moveto 
1 -1 scale
(5) t 
GR
GR
GS
[0.6 0 0 0.6 49.8 189.39999] CT
0.149 GC
/Helvetica 23.333 F
GS
[1 0 0 1 0 0] CT
-26 9 moveto 
1 -1 scale
(10) t 
GR
GR
GS
[0.6 0 0 0.6 49.8 147.9] CT
0.149 GC
/Helvetica 23.333 F
GS
[1 0 0 1 0 0] CT
-26 9 moveto 
1 -1 scale
(15) t 
GR
GR
GS
[0.6 0 0 0.6 49.8 106.4] CT
0.149 GC
/Helvetica 23.333 F
GS
[1 0 0 1 0 0] CT
-26 9 moveto 
1 -1 scale
(20) t 
GR
GR
GS
[0.6 0 0 0.6 49.8 64.9] CT
0.149 GC
/Helvetica 23.333 F
GS
[1 0 0 1 0 0] CT
-26 9 moveto 
1 -1 scale
(25) t 
GR
GR
GS
[0.6 0 0 0.6 49.8 23.4] CT
0.149 GC
/Helvetica 23.333 F
GS
[1 0 0 1 0 0] CT
-26 9 moveto 
1 -1 scale
(30) t 
GR
GR
GS
[0 -0.6 0.6 0 31.2 147.89988] CT
0.149 GC
/Helvetica 25.667 F
GS
[1 0 0 1 0 0] CT
-38 -6 moveto 
1 -1 scale
(v [m/s]) t 
GR
GR
GS
[0.6 0 0 0.6 0 0] CT
0 0 1 RC
1 LJ
3.333 LW
N
91 454 M
91.027 453.265 L
91.054 451.881 L
91.076 450.771 L
91.114 449.618 L
91.147 448.439 L
91.174 447.564 L
91.201 446.751 L
91.239 445.943 L
91.266 445.329 L
91.299 444.42 L
91.331 443.672 L
91.358 443.382 L
91.391 442.63 L
91.429 441.904 L
91.467 441.606 L
91.505 440.936 L
91.543 440.369 L
91.586 440.06 L
91.619 439.752 L
91.662 439.116 L
91.695 438.796 L
91.749 438.134 L
91.782 437.808 L
91.814 437.48 L
91.842 437.147 L
91.869 436.821 L
91.901 436.484 L
91.934 436.168 L
91.967 435.84 L
92.005 435.517 L
92.037 435.19 L
92.07 434.87 L
92.102 434.545 L
92.14 434.228 L
92.173 433.908 L
92.216 433.594 L
92.26 433.274 L
92.292 432.963 L
92.336 432.645 L
92.385 432.331 L
92.428 432.009 L
92.472 431.695 L
92.542 431.367 L
92.624 430.744 L
92.651 430.432 L
92.705 430.117 L
92.781 429.494 L
92.808 429.189 L
92.857 428.881 L
92.917 428.572 L
93.004 427.962 L
93.047 427.654 L
93.101 427.344 L
93.134 427.04 L
93.199 426.73 L
93.232 426.422 L
93.291 426.115 L
93.346 425.811 L
93.389 425.506 L
93.438 425.199 L
93.476 424.894 L
93.52 424.591 L
93.574 424.288 L
93.617 423.986 L
93.666 423.682 L
93.715 423.377 L
93.758 423.073 L
93.813 422.769 L
93.867 422.455 L
93.91 422.159 L
93.954 421.857 L
94.014 421.554 L
94.063 421.248 L
94.122 420.931 L
94.166 420.628 L
94.231 420.314 L
94.274 419.996 L
94.334 419.675 L
94.388 419.349 L
94.448 419.019 L
94.508 418.686 L
94.568 418.35 L
94.616 418.014 L
94.676 417.674 L
94.736 417.329 L
94.79 416.981 L
94.85 416.629 L
94.904 416.275 L
94.964 415.918 L
95.029 415.558 L
95.094 415.149 L
95.154 414.73 L
95.208 414.382 L
95.252 407.379 L
95.328 407.061 L
95.404 406.726 L
95.48 406.381 L
95.556 406.031 L
95.632 405.666 L
95.713 405.285 L
95.789 404.885 L
95.865 404.485 L
95.941 404.086 L
96.023 403.685 L
96.11 403.285 L
96.191 402.886 L
96.267 402.489 L
96.349 402.091 L
96.441 401.693 L
96.517 401.297 L
96.598 400.901 L
96.68 400.504 L
96.767 400.106 L
96.854 399.708 L
96.94 399.311 L
97.022 398.916 L
97.114 398.52 L
97.196 398.126 L
97.283 397.731 L
97.38 397.327 L
97.456 396.943 L
97.554 396.549 L
97.646 396.155 L
97.739 395.76 L
97.831 395.366 L
97.923 394.972 L
98.016 394.578 L
98.113 394.185 L
98.206 393.793 L
98.298 393.401 L
98.396 393.009 L
98.483 392.618 L
98.58 392.229 L
98.678 391.831 L
98.776 391.45 L
98.873 391.059 L
98.971 390.669 L
99.074 390.279 L
99.172 389.888 L
99.275 389.499 L
99.373 389.11 L
99.476 388.71 L
99.59 388.328 L
99.677 387.939 L
99.786 387.55 L
99.889 387.158 L
99.998 386.768 L
100.112 386.377 L
100.198 385.598 L
100.302 385.211 L
100.41 384.824 L
100.519 384.438 L
100.627 384.053 L
100.736 383.665 L
100.845 383.279 L
100.964 382.891 L
101.078 382.503 L
101.192 382.116 L
101.295 381.731 L
101.409 381.346 L
101.518 380.962 L
101.643 380.576 L
101.751 380.191 L
101.871 379.804 L
101.996 379.418 L
102.11 379.032 L
102.229 378.646 L
102.343 378.26 L
102.468 377.873 L
102.593 377.488 L
102.713 377.102 L
102.827 376.718 L
102.951 376.33 L
103.076 375.945 L
103.196 375.559 L
103.321 375.172 L
103.44 374.786 L
103.56 374.392 L
103.684 374.018 L
103.809 373.634 L
103.934 373.251 L
104.07 372.866 L
104.2 372.482 L
104.32 372.098 L
104.445 371.715 L
104.586 371.33 L
104.711 370.936 L
104.846 370.559 L
104.977 370.173 L
105.113 369.786 L
105.254 369.398 L
105.368 369.012 L
105.504 368.626 L
105.639 368.239 L
105.78 367.85 L
105.911 367.462 L
106.047 367.075 L
106.188 366.686 L
106.334 366.297 L
106.47 365.909 L
106.606 365.523 L
106.736 365.138 L
106.877 364.745 L
107.019 364.37 L
107.165 363.985 L
107.306 363.599 L
107.453 363.214 L
107.589 362.83 L
107.741 362.443 L
107.887 362.057 L
108.023 361.672 L
108.181 361.285 L
108.316 360.898 L
108.463 360.511 L
109.071 360.124 L
109.223 359.735 L
109.353 359.35 L
109.505 358.955 L
109.657 358.579 L
109.81 358.193 L
109.967 357.805 L
110.119 357.419 L
110.276 357.031 L
110.429 356.644 L
110.575 356.256 L
110.727 355.866 L
110.896 355.476 L
111.053 355.075 L
111.194 354.693 L
111.357 354.301 L
111.515 353.913 L
111.672 353.525 L
111.819 353.128 L
111.982 352.751 L
112.155 352.365 L
112.313 351.977 L
112.465 351.59 L
112.628 351.193 L
112.791 350.817 L
112.959 350.43 L
113.116 350.044 L
113.296 349.659 L
113.453 349.274 L
113.611 348.888 L
113.768 348.493 L
113.942 348.117 L
114.116 347.729 L
114.273 347.343 L
114.447 346.958 L
114.615 346.575 L
114.773 346.19 L
114.946 345.803 L
115.115 345.416 L
115.283 345.03 L
115.451 344.643 L
115.63 344.259 L
115.81 343.872 L
115.897 342.348 L
116.065 341.969 L
116.249 341.579 L
116.429 341.206 L
116.619 340.824 L
116.787 340.44 L
116.972 340.055 L
117.151 339.671 L
117.319 339.289 L
117.509 338.904 L
117.683 338.518 L
117.862 338.133 L
118.052 337.75 L
118.231 337.364 L
118.405 336.98 L
118.595 336.595 L
118.785 336.209 L
118.975 335.82 L
119.144 335.435 L
119.334 335.049 L
119.518 334.663 L
119.708 334.275 L
119.898 333.878 L
120.089 333.504 L
120.279 333.122 L
120.463 332.743 L
120.653 332.362 L
120.86 331.98 L
121.055 331.598 L
121.234 331.217 L
121.43 330.831 L
121.62 330.447 L
121.81 330.056 L
122.016 329.683 L
122.212 329.3 L
122.402 328.917 L
122.592 328.522 L
122.793 328.144 L
122.999 327.757 L
123.189 327.37 L
123.39 326.986 L
123.596 326.597 L
123.786 326.215 L
123.987 325.832 L
124.177 325.45 L
124.389 325.066 L
124.59 324.682 L
124.802 324.288 L
125.014 323.871 L
125.22 323.524 L
125.426 323.138 L
125.616 322.753 L
125.828 322.325 L
126.051 321.981 L
126.241 321.598 L
126.447 321.216 L
126.664 320.832 L
126.876 320.447 L
127.077 320.062 L
127.3 319.676 L
127.5 319.291 L
127.712 318.908 L
127.94 318.524 L
128.136 318.143 L
128.364 317.762 L
128.565 317.383 L
128.782 317.005 L
129.005 316.627 L
129.216 316.249 L
129.434 315.87 L
129.651 315.495 L
129.868 315.118 L
130.096 314.74 L
130.308 314.359 L
130.53 313.98 L
130.753 313.598 L
130.965 313.221 L
131.193 312.844 L
131.415 312.468 L
131.644 312.09 L
131.861 311.709 L
132.078 311.333 L
132.306 310.955 L
132.534 310.577 L
132.746 310.196 L
132.974 309.813 L
133.202 309.43 L
133.43 309.046 L
133.664 308.664 L
133.892 308.281 L
134.125 307.897 L
134.359 307.513 L
134.576 307.122 L
134.809 306.75 L
135.048 306.367 L
135.282 305.983 L
135.521 305.598 L
135.759 305.204 L
135.977 304.829 L
136.216 304.444 L
136.455 304.056 L
136.683 303.67 L
136.922 303.287 L
137.15 302.903 L
137.394 302.52 L
137.633 302.135 L
137.872 301.75 L
138.122 301.322 L
138.355 300.977 L
138.594 300.553 L
138.838 300.214 L
139.088 299.836 L
139.322 299.461 L
139.566 299.088 L
139.821 298.712 L
140.06 298.335 L
140.315 297.955 L
140.532 297.573 L
140.782 297.197 L
141.037 296.818 L
141.271 296.439 L
141.537 296.055 L
141.781 295.667 L
142.026 295.278 L
142.574 294.884 L
142.818 294.503 L
143.074 294.115 L
143.307 293.722 L
143.562 293.348 L
143.823 292.961 L
144.062 292.576 L
144.328 292.191 L
144.583 291.805 L
144.833 291.422 L
145.105 291.038 L
145.338 290.656 L
145.593 290.272 L
145.859 289.883 L
146.125 289.493 L
146.386 289.106 L
146.641 288.719 L
146.907 288.333 L
147.168 287.948 L
147.434 287.562 L
147.705 287.176 L
147.966 286.794 L
148.21 286.417 L
148.498 286.036 L
148.732 285.661 L
149.014 285.275 L
149.291 284.905 L
149.546 284.527 L
149.796 284.142 L
150.078 283.774 L
150.605 283.398 L
150.866 283.027 L
151.148 282.653 L
151.409 282.28 L
151.675 281.906 L
151.946 281.493 L
152.207 281.163 L
152.478 280.795 L
152.755 280.431 L
153.049 280.023 L
153.315 279.697 L
153.581 279.335 L
153.847 278.972 L
154.124 278.599 L
154.417 278.24 L
154.683 277.866 L
154.955 277.506 L
155.237 277.139 L
155.519 276.731 L
155.791 276.404 L
156.079 276.032 L
156.366 275.665 L
156.632 275.3 L
156.828 274.561 L
157.11 274.157 L
157.398 273.831 L
157.664 273.463 L
157.968 273.053 L
158.234 272.723 L
158.522 272.352 L
158.81 271.982 L
159.108 271.61 L
159.391 271.225 L
159.684 270.854 L
159.961 270.433 L
160.232 270.095 L
160.542 269.718 L
160.835 269.341 L
161.107 268.971 L
161.416 268.607 L
161.693 268.247 L
161.992 267.892 L
162.443 267.534 L
162.73 267.171 L
163.007 266.769 L
163.311 266.441 L
163.605 266.072 L
163.892 265.703 L
164.196 265.282 L
164.5 264.939 L
164.81 264.562 L
165.092 264.191 L
165.402 263.813 L
165.695 263.447 L
165.988 263.08 L
166.292 262.715 L
166.596 262.363 L
166.901 262.004 L
167.21 261.641 L
167.514 261.269 L
167.818 260.904 L
168.128 260.541 L
168.41 260.18 L
168.703 259.824 L
169.018 259.451 L
169.322 259.058 L
169.637 258.729 L
169.936 258.353 L
170.256 257.995 L
170.94 257.632 L
171.25 257.267 L
171.57 256.896 L
171.874 256.523 L
172.189 256.146 L
172.493 255.768 L
172.808 255.392 L
173.129 255.019 L
173.438 254.641 L
173.742 254.265 L
174.057 253.891 L
174.378 253.514 L
174.698 253.14 L
175.008 252.761 L
175.344 252.383 L
175.659 252.012 L
175.958 251.64 L
176.278 251.271 L
176.593 250.9 L
176.913 250.526 L
177.239 250.156 L
177.57 249.787 L
177.88 249.413 L
178.222 249.039 L
178.526 248.622 L
178.857 248.287 L
179.172 247.871 L
179.509 247.536 L
179.802 247.12 L
180.144 246.792 L
180.47 246.428 L
180.801 246.065 L
181.122 245.69 L
181.464 245.334 L
181.784 244.963 L
181.931 244.596 L
182.246 244.232 L
182.566 243.877 L
182.903 243.516 L
183.25 243.155 L
183.576 242.797 L
183.896 242.431 L
184.239 242.067 L
184.581 241.702 L
184.901 241.34 L
185.227 240.978 L
185.585 240.609 L
185.916 240.238 L
186.258 239.83 L
186.595 239.507 L
186.916 239.144 L
187.241 238.775 L
187.578 238.421 L
187.92 238.016 L
188.257 237.691 L
188.615 237.317 L
188.946 236.96 L
189.283 236.595 L
189.625 236.231 L
189.962 235.864 L
190.331 235.496 L
190.662 235.129 L
191.01 234.761 L
191.352 234.39 L
191.71 234.015 L
192.21 233.647 L
192.541 233.278 L
192.91 232.908 L
193.263 232.496 L
193.605 232.166 L
193.947 231.802 L
194.289 231.437 L
194.632 231.073 L
194.995 230.708 L
195.343 230.339 L
195.69 229.967 L
196.054 229.613 L
196.396 229.247 L
196.766 228.877 L
197.108 228.499 L
197.477 228.143 L
197.83 227.772 L
198.199 227.409 L
198.541 227.043 L
198.916 226.678 L
199.258 226.316 L
199.611 225.953 L
199.953 225.594 L
200.322 225.237 L
200.67 224.875 L
201.044 224.509 L
201.414 224.143 L
201.756 223.782 L
202.141 223.422 L
202.478 223.052 L
202.863 222.696 L
203.238 222.293 L
203.591 221.965 L
203.96 221.611 L
204.335 221.207 L
204.688 220.879 L
205.068 220.473 L
205.426 220.147 L
205.806 219.781 L
206.159 219.37 L
206.54 219.052 L
206.892 218.69 L
207.278 218.321 L
207.653 217.954 L
208.033 217.589 L
208.369 217.224 L
208.739 216.852 L
209.119 216.486 L
209.488 216.121 L
209.874 215.757 L
210.248 215.383 L
210.623 215.005 L
211.003 214.632 L
211.389 214.252 L
211.747 213.886 L
212.306 213.512 L
212.686 213.14 L
213.066 212.765 L
213.447 212.387 L
213.832 212.012 L
214.212 211.644 L
214.598 211.273 L
214.983 210.897 L
215.352 210.523 L
215.733 210.154 L
216.123 209.782 L
216.504 209.415 L
216.878 209.045 L
217.258 208.675 L
217.644 208.308 L
218.04 207.935 L
218.42 207.569 L
218.811 207.202 L
219.197 206.83 L
219.599 206.46 L
219.99 206.089 L
220.381 205.723 L
220.772 205.354 L
221.146 204.977 L
221.515 204.609 L
221.917 204.235 L
222.314 203.864 L
222.716 203.492 L
223.117 203.119 L
223.508 202.773 L
223.894 202.403 L
224.29 202.021 L
224.692 201.65 L
225.083 201.274 L
225.479 200.9 L
225.887 200.513 L
226.283 200.149 L
226.69 199.77 L
227.092 199.349 L
227.472 199.015 L
227.874 198.6 L
228.26 198.267 L
228.667 197.888 L
229.074 197.474 L
229.492 197.141 L
229.872 196.728 L
230.279 196.397 L
230.692 196.027 L
231.463 195.66 L
231.87 195.293 L
232.283 194.919 L
232.701 194.544 L
233.092 194.169 L
233.472 193.787 L
233.89 193.41 L
234.314 193.033 L
234.732 192.612 L
235.145 192.277 L
235.568 191.907 L
235.965 191.54 L
236.356 191.17 L
236.774 190.793 L
237.186 190.425 L
237.507 189.687 L
237.92 189.315 L
238.332 188.952 L
238.756 188.582 L
239.179 188.205 L
239.608 187.831 L
240.021 187.466 L
240.434 187.091 L
240.835 186.724 L
241.27 186.356 L
241.693 185.99 L
242.106 185.604 L
242.54 185.245 L
242.964 184.877 L
243.371 184.509 L
243.811 184.134 L
244.224 183.762 L
244.647 183.392 L
245.076 183.02 L
245.478 182.655 L
245.902 182.289 L
246.336 181.924 L
246.765 181.553 L
247.194 181.185 L
247.634 180.812 L
248.052 180.44 L
248.508 180.073 L
248.915 179.708 L
249.371 179.338 L
249.768 178.962 L
250.218 178.594 L
250.637 178.228 L
251.076 177.859 L
251.522 177.49 L
251.951 177.081 L
252.38 176.753 L
252.841 176.375 L
253.265 176.02 L
253.694 175.653 L
254.123 175.28 L
254.579 174.905 L
255.372 174.534 L
255.801 174.155 L
256.257 173.775 L
256.713 173.395 L
257.136 173.023 L
257.565 172.646 L
258.021 172.27 L
258.477 171.904 L
258.906 171.529 L
259.363 171.177 L
259.792 170.818 L
260.248 170.457 L
260.671 170.095 L
261.133 169.731 L
261.589 169.329 L
262.012 168.926 L
262.469 168.611 L
262.93 168.291 L
263.381 167.93 L
263.81 167.523 L
264.369 167.211 L
264.825 166.826 L
265.281 166.509 L
265.71 166.164 L
266.166 165.774 L
266.628 165.451 L
267.084 165.093 L
267.535 164.74 L
267.996 164.384 L
268.447 164.031 L
268.919 163.679 L
269.375 163.333 L
269.837 162.988 L
270.277 162.64 L
270.733 162.299 L
271.2 161.95 L
271.634 161.59 L
272.107 161.233 L
272.568 160.881 L
273.041 160.526 L
273.66 160.175 L
274.127 159.822 L
274.577 159.471 L
275.05 159.118 L
275.484 158.765 L
275.962 158.412 L
276.435 158.053 L
276.88 157.7 L
277.352 157.343 L
277.835 156.991 L
278.297 156.643 L
278.759 156.296 L
279.22 155.945 L
279.698 155.59 L
280.181 155.232 L
280.659 154.87 L
281.088 154.513 L
281.571 154.163 L
282.055 153.806 L
282.527 153.452 L
283.01 153.097 L
283.493 152.74 L
283.912 152.388 L
284.248 152.035 L
284.737 151.687 L
285.22 151.332 L
285.665 150.985 L
286.154 150.638 L
286.654 150.288 L
287.115 149.935 L
287.577 149.592 L
288.071 149.242 L
288.571 148.894 L
289.054 148.548 L
289.505 148.205 L
289.977 147.857 L
290.482 147.516 L
290.96 147.178 L
291.459 146.853 L
291.888 146.532 L
292.388 146.212 L
292.877 145.895 L
293.371 145.589 L
293.865 145.281 L
294.321 144.979 L
295.059 144.677 L
295.537 144.38 L
296.015 144.098 L
296.526 143.818 L
297.003 143.498 L
297.481 143.191 L
297.954 142.9 L
298.453 142.639 L
298.947 142.401 L
299.414 142.203 L
299.903 142.096 L
300.424 142.002 L
300.897 141.926 L
301.353 141.776 L
301.863 141.699 L
302.341 141.601 L
302.824 141.504 L
303.34 141.441 L
303.818 141.279 L
304.301 141.185 L
304.806 141.087 L
305.284 141.011 L
305.8 140.944 L
306.202 140.804 L
306.642 140.748 L
307.152 140.675 L
307.635 140.603 L
308.151 140.546 L
308.629 140.506 L
309.112 140.503 L
309.634 140.472 L
310.117 140.43 L
310.567 140.393 L
311.083 140.366 L
311.572 140.333 L
312.066 140.331 L
312.582 140.344 L
313.044 140.354 L
313.82 140.379 L
314.292 140.388 L
314.814 140.402 L
315.292 140.413 L
315.769 140.442 L
316.291 140.449 L
316.769 140.487 L
317.284 140.526 L
317.762 140.552 L
318.24 140.574 L
318.75 140.603 L
319.207 140.648 L
319.657 140.686 L
320.189 140.722 L
320.651 140.723 L
321.156 140.723 L
321.639 140.747 L
322.161 140.755 L
322.622 140.789 L
323.1 140.835 L
323.616 140.884 L
324.094 140.968 L
324.577 141.018 L
325.093 141.022 L
325.576 141.05 L
326.032 141.074 L
326.553 141.11 L
327.08 141.143 L
327.531 141.136 L
328.014 141.124 L
328.524 141.113 L
329.019 141.132 L
329.513 141.163 L
329.98 141.176 L
330.479 141.21 L
330.968 141.241 L
331.468 141.268 L
331.962 141.324 L
332.44 141.39 L
332.945 141.44 L
333.775 141.497 L
334.291 141.55 L
334.769 141.596 L
335.252 141.641 L
335.736 141.688 L
336.203 141.719 L
336.702 141.755 L
337.212 141.797 L
337.69 141.832 L
338.168 141.867 L
338.657 141.91 L
339.135 141.948 L
339.656 141.992 L
340.118 142.037 L
340.655 142.077 L
341.111 142.129 L
341.595 142.172 L
342.099 142.208 L
342.577 142.239 L
343.088 142.275 L
343.571 142.309 L
344.054 142.34 L
344.565 142.365 L
344.999 142.397 L
345.515 142.422 L
345.998 142.446 L
346.492 142.478 L
347.003 142.509 L
347.486 142.537 L
347.986 142.568 L
348.29 142.595 L
348.73 142.622 L
349.229 142.656 L
349.723 142.682 L
350.206 142.712 L
350.722 142.738 L
351.2 142.771 L
351.7 142.8 L
352.178 142.836 L
352.672 142.865 L
353.171 142.898 L
353.655 142.927 L
354.556 142.963 L
355.061 142.987 L
355.522 143.012 L
356.022 143.038 L
356.489 143.063 L
356.989 143.089 L
357.477 143.116 L
357.961 143.131 L
358.444 143.155 L
358.949 143.179 L
359.427 143.201 L
359.921 143.219 L
360.415 143.24 L
360.909 143.263 L
361.398 143.282 L
361.876 143.301 L
362.359 143.318 L
362.842 143.337 L
363.309 143.356 L
363.819 143.374 L
364.308 143.398 L
364.797 143.416 L
365.291 143.427 L
365.725 143.447 L
366.263 143.463 L
366.697 143.475 L
367.181 143.491 L
367.68 143.512 L
368.18 143.53 L
368.658 143.548 L
369.13 143.566 L
369.63 143.584 L
370.118 143.604 L
370.596 143.622 L
371.079 143.639 L
371.563 143.654 L
372.046 143.67 L
372.54 143.68 L
373.04 143.686 L
373.496 143.7 L
374.435 143.712 L
374.891 143.734 L
375.369 143.75 L
375.88 143.76 L
376.363 143.77 L
376.846 143.779 L
377.356 143.79 L
377.818 143.798 L
378.323 143.822 L
378.812 143.84 L
379.3 143.853 L
379.795 143.864 L
380.262 143.872 L
380.718 143.882 L
381.217 143.891 L
381.69 143.916 L
382.195 143.923 L
382.694 143.927 L
383.188 143.938 L
383.677 143.953 L
384.111 143.975 L
384.606 143.994 L
385.094 144.007 L
385.588 144.036 L
386.088 144.051 L
386.566 144.071 L
387.076 144.085 L
387.554 144.097 L
388.037 144.111 L
388.515 144.134 L
388.988 144.146 L
389.465 144.158 L
389.976 144.178 L
390.465 144.186 L
390.959 144.195 L
391.415 144.211 L
391.909 144.224 L
392.419 144.233 L
392.87 144.254 L
393.408 144.273 L
393.869 144.281 L
394.336 144.291 L
394.868 144.308 L
395.33 144.316 L
395.78 144.324 L
396.296 144.331 L
396.78 144.338 L
397.529 144.344 L
398.007 144.356 L
398.517 144.36 L
398.995 144.366 L
399.478 144.379 L
399.962 144.387 L
400.456 144.377 L
400.923 144.388 L
401.417 144.396 L
401.884 144.396 L
402.389 144.398 L
402.877 144.394 L
403.382 144.39 L
403.849 144.393 L
404.344 144.389 L
404.816 144.387 L
405.31 144.386 L
405.772 144.393 L
406.097 144.395 L
406.57 144.399 L
407.048 144.401 L
407.531 144.405 L
408.047 144.408 L
408.498 144.411 L
409.003 144.414 L
409.486 144.409 L
409.964 144.412 L
410.463 144.408 L
410.963 144.412 L
411.424 144.415 L
411.929 144.413 L
412.418 144.41 L
412.89 144.417 L
413.39 144.417 L
413.89 144.413 L
415.073 144.421 L
415.567 144.428 L
416.056 144.435 L
416.529 144.442 L
417.033 144.454 L
417.5 144.454 L
417.995 144.456 L
418.456 144.453 L
418.967 144.459 L
419.455 144.463 L
419.933 144.469 L
420.411 144.47 L
420.916 144.476 L
421.394 144.482 L
421.877 144.486 L
422.387 144.488 L
422.844 144.493 L
423.327 144.495 L
423.826 144.493 L
424.31 144.501 L
424.826 144.507 L
425.309 144.514 L
425.787 144.525 L
426.27 144.525 L
426.742 144.525 L
427.231 144.536 L
427.703 144.539 L
428.219 144.531 L
428.686 144.541 L
429.17 144.551 L
429.68 144.556 L
430.163 144.557 L
430.63 144.561 L
431.124 144.558 L
431.597 144.561 L
431.912 144.559 L
432.422 144.555 L
432.905 144.55 L
433.383 144.551 L
433.866 144.548 L
434.371 144.549 L
434.822 144.548 L
435.338 144.551 L
435.816 144.567 L
436.31 144.576 L
436.772 144.593 L
437.282 144.591 L
437.76 144.587 L
438.265 144.585 L
438.732 144.583 L
439.182 144.593 L
439.644 144.596 L
440.133 144.596 L
440.632 144.599 L
441.105 144.604 L
441.604 144.6 L
442.104 144.598 L
442.592 144.603 L
443.054 144.605 L
443.559 144.606 L
444.026 144.614 L
444.493 144.613 L
445.003 144.608 L
445.487 144.607 L
445.986 144.603 L
446.48 144.603 L
446.953 144.61 L
447.751 144.618 L
448.256 144.623 L
448.739 144.634 L
449.223 144.637 L
449.695 144.64 L
450.173 144.648 L
450.694 144.655 L
451.172 144.653 L
451.655 144.66 L
452.133 144.667 L
452.611 144.671 L
453.105 144.673 L
453.599 144.678 L
454.093 144.678 L
454.582 144.685 L
455.576 144.68 L
456.048 144.675 L
456.526 144.681 L
457.02 144.688 L
457.509 144.685 L
458.008 144.688 L
458.492 144.693 L
458.986 144.698 L
459.453 144.694 L
459.93 144.699 L
460.414 144.704 L
460.902 144.713 L
461.397 144.724 L
461.695 144.734 L
462.151 144.742 L
462.645 144.747 L
463.134 144.746 L
463.628 144.752 L
464.117 144.757 L
464.611 144.753 L
465.1 144.756 L
465.589 144.765 L
466.088 144.777 L
466.544 144.777 L
467.375 144.78 L
467.869 144.78 L
468.363 144.777 L
468.852 144.776 L
469.346 144.767 L
469.84 144.772 L
470.329 144.779 L
470.763 144.784 L
471.252 144.791 L
471.746 144.798 L
472.24 144.796 L
472.729 144.787 L
473.223 144.79 L
473.717 144.789 L
474.206 144.789 L
474.64 144.793 L
475.134 144.801 L
475.623 144.8 L
476.123 144.805 L
476.611 144.806 L
477.225 144.808 L
477.719 144.815 L
478.154 144.822 L
478.642 144.826 L
479.136 144.835 L
479.652 144.841 L
480.119 144.848 L
480.603 144.852 L
481.113 144.855 L
481.602 144.859 L
482.074 144.873 L
482.546 144.872 L
483.03 144.871 L
483.508 144.869 L
483.991 144.875 L
484.501 144.877 L
484.974 144.882 L
485.457 144.888 L
485.951 144.893 L
486.44 144.891 L
486.901 144.89 L
487.39 144.894 L
487.9 144.895 L
488.357 144.899 L
488.867 144.905 L
489.367 144.907 L
489.508 144.919 L
489.98 144.932 L
490.512 144.944 L
490.952 144.954 L
491.43 144.958 L
491.94 144.957 L
492.429 144.969 L
492.907 144.975 L
493.39 144.984 L
493.901 144.992 L
494.373 144.997 L
494.829 144.996 L
495.459 144.995 L
495.817 144.998 L
496.301 144.994 L
496.806 144.994 L
497.278 145.004 L
497.761 145.015 L
498.234 145.023 L
499.179 145.032 L
499.64 145.037 L
500.156 145.038 L
500.634 145.039 L
501.112 145.042 L
501.584 145.043 L
502.094 145.042 L
502.561 145.046 L
503.023 145.046 L
503.555 145.05 L
504.028 145.058 L
504.489 145.061 L
504.989 145.07 L
505.488 145.079 L
505.966 145.087 L
506.433 145.094 L
506.943 145.109 L
507.427 145.12 L
507.899 145.124 L
508.382 145.127 L
509.012 145.126 L
509.485 145.129 L
509.973 145.131 L
510.462 145.131 L
510.951 145.14 L
511.445 145.143 L
511.912 145.151 L
512.406 145.158 L
512.873 145.166 L
513.362 145.162 L
513.856 145.165 L
514.35 145.168 L
514.849 145.168 L
515.338 145.164 L
515.827 145.173 L
516.745 145.177 L
517.206 145.176 L
517.7 145.175 L
518.189 145.178 L
518.683 145.178 L
519.166 145.184 L
519.65 145.191 L
520.144 145.201 L
520.611 145.207 L
521.067 145.221 L
521.566 145.235 L
522.05 145.236 L
522.538 145.241 L
523.027 145.248 L
523.532 145.249 L
524.021 145.245 L
524.52 145.251 L
524.971 145.272 L
525.454 145.28 L
525.943 145.285 L
S
GR
GS
[0.6 0 0 0.6 0 0] CT
1 0 0 RC
[12 12] 0 setdash
2 LJ
3.333 LW
N
91 454 M
91.027 449.743 L
91.054 447.974 L
91.076 446.871 L
91.114 445.268 L
91.147 444.096 L
91.174 443.22 L
91.201 442.412 L
91.239 441.357 L
91.266 440.659 L
91.299 439.865 L
91.331 439.114 L
91.358 438.515 L
91.391 437.827 L
91.429 437.059 L
91.467 436.324 L
91.505 435.618 L
91.543 434.94 L
91.586 434.193 L
91.619 433.649 L
91.662 432.947 L
91.695 432.436 L
91.749 431.609 L
91.782 431.127 L
91.814 430.656 L
91.842 430.271 L
91.869 429.892 L
91.901 429.443 L
91.934 429.003 L
91.967 428.57 L
92.005 428.075 L
92.037 427.659 L
92.07 427.248 L
92.102 426.844 L
92.14 426.379 L
92.173 425.988 L
92.216 425.474 L
92.26 424.97 L
92.292 424.598 L
92.336 424.107 L
92.385 423.564 L
92.428 423.091 L
92.472 422.624 L
92.542 421.88 L
92.624 421.043 L
92.651 420.769 L
92.705 420.227 L
92.781 419.483 L
92.808 419.22 L
92.857 418.753 L
92.917 418.191 L
93.004 417.388 L
93.047 416.994 L
93.101 416.506 L
93.134 416.217 L
93.199 415.644 L
93.232 415.362 L
93.291 414.848 L
93.346 414.387 L
93.389 414.022 L
93.438 413.615 L
93.476 413.301 L
93.52 412.946 L
93.574 412.506 L
93.617 412.158 L
93.666 411.77 L
93.715 411.384 L
93.758 411.044 L
93.813 410.624 L
93.867 410.209 L
93.91 409.877 L
93.954 409.549 L
94.014 409.102 L
94.063 408.74 L
94.122 408.3 L
94.166 407.984 L
94.231 407.513 L
94.274 407.201 L
94.334 406.776 L
94.388 406.394 L
94.448 405.976 L
94.508 405.562 L
94.568 405.151 L
94.616 404.818 L
94.676 404.414 L
94.736 404.013 L
94.79 403.651 L
94.85 403.257 L
94.904 402.9 L
94.964 402.51 L
95.029 402.089 L
95.094 401.671 L
95.154 401.291 L
95.208 400.948 L
95.252 400.675 L
95.328 400.2 L
95.404 399.73 L
95.48 399.264 L
95.556 398.802 L
95.632 398.343 L
95.713 397.856 L
95.789 397.406 L
95.865 396.958 L
95.941 396.515 L
96.023 396.044 L
96.11 395.544 L
96.191 395.081 L
96.267 394.651 L
96.349 394.194 L
96.441 393.68 L
96.517 393.261 L
96.598 392.814 L
96.68 392.371 L
96.767 391.903 L
96.854 391.436 L
96.94 390.974 L
97.022 390.544 L
97.114 390.059 L
97.196 389.635 L
97.283 389.186 L
97.38 388.684 L
97.456 388.296 L
97.554 387.801 L
97.646 387.337 L
97.739 386.876 L
97.831 386.418 L
97.923 385.963 L
98.016 385.512 L
98.113 385.036 L
98.206 384.591 L
98.298 384.148 L
98.396 383.682 L
98.483 383.271 L
98.58 382.811 L
98.678 382.354 L
98.776 381.899 L
98.873 381.448 L
98.971 380.999 L
99.074 380.529 L
99.172 380.086 L
99.275 379.622 L
99.373 379.184 L
99.476 378.725 L
99.59 378.221 L
99.677 377.839 L
99.786 377.364 L
99.889 376.916 L
99.998 376.447 L
100.112 375.957 L
100.198 375.587 L
100.302 375.149 L
100.41 374.691 L
100.519 374.234 L
100.627 373.781 L
100.736 373.33 L
100.845 372.882 L
100.964 372.392 L
101.078 371.927 L
101.192 371.464 L
101.295 371.049 L
101.409 370.591 L
101.518 370.157 L
101.643 369.662 L
101.751 369.233 L
101.871 368.764 L
101.996 368.276 L
102.11 367.833 L
102.229 367.372 L
102.343 366.934 L
102.468 366.456 L
102.593 365.982 L
102.713 365.53 L
102.827 365.101 L
102.951 364.633 L
103.076 364.168 L
103.196 363.725 L
103.321 363.265 L
103.44 362.827 L
103.56 362.391 L
103.684 361.937 L
103.809 361.486 L
103.934 361.036 L
104.07 360.55 L
104.2 360.087 L
104.32 359.663 L
104.445 359.222 L
104.586 358.727 L
104.711 358.291 L
104.846 357.819 L
104.977 357.368 L
105.113 356.9 L
105.254 356.417 L
105.368 356.028 L
105.504 355.567 L
105.639 355.108 L
105.78 354.633 L
105.911 354.197 L
106.047 353.744 L
106.188 353.276 L
106.334 352.792 L
106.47 352.345 L
106.606 351.901 L
106.736 351.477 L
106.877 351.018 L
107.019 350.562 L
107.165 350.091 L
107.306 349.639 L
107.453 349.172 L
107.589 348.741 L
107.741 348.261 L
107.887 347.799 L
108.023 347.374 L
108.181 346.883 L
108.316 346.462 L
108.463 346.008 L
109.071 344.148 L
109.223 343.688 L
109.353 343.295 L
109.505 342.838 L
109.657 342.383 L
109.81 341.93 L
109.967 341.463 L
110.119 341.014 L
110.276 340.551 L
110.429 340.105 L
110.575 339.678 L
110.727 339.235 L
110.896 338.747 L
111.053 338.293 L
111.194 337.888 L
111.357 337.421 L
111.515 336.972 L
111.672 336.525 L
111.819 336.11 L
111.982 335.651 L
112.155 335.163 L
112.313 334.722 L
112.465 334.299 L
112.628 333.847 L
112.791 333.396 L
112.959 332.932 L
113.116 332.5 L
113.296 332.01 L
113.453 331.581 L
113.611 331.154 L
113.768 330.728 L
113.942 330.259 L
114.116 329.793 L
114.273 329.372 L
114.447 328.908 L
114.615 328.461 L
114.773 328.045 L
114.946 327.586 L
115.115 327.144 L
115.283 326.703 L
115.451 326.264 L
115.63 325.798 L
115.81 325.334 L
115.897 325.109 L
116.065 324.676 L
116.249 324.202 L
116.429 323.743 L
116.619 323.259 L
116.787 322.831 L
116.972 322.364 L
117.151 321.912 L
117.319 321.489 L
117.509 321.012 L
117.683 320.579 L
117.862 320.133 L
118.052 319.661 L
118.231 319.219 L
118.405 318.791 L
118.595 318.324 L
118.785 317.859 L
118.975 317.396 L
119.144 316.987 L
119.334 316.526 L
119.518 316.08 L
119.708 315.623 L
119.898 315.167 L
120.089 314.713 L
120.279 314.26 L
120.463 313.822 L
120.653 313.372 L
120.86 312.885 L
121.055 312.426 L
121.234 312.006 L
121.43 311.549 L
121.62 311.106 L
121.81 310.665 L
122.016 310.187 L
122.212 309.737 L
122.402 309.3 L
122.592 308.864 L
122.793 308.405 L
122.999 307.935 L
123.189 307.503 L
123.39 307.048 L
123.596 306.583 L
123.786 306.155 L
123.987 305.705 L
124.177 305.28 L
124.389 304.807 L
124.59 304.361 L
124.802 303.892 L
125.014 303.424 L
125.22 302.97 L
125.426 302.517 L
125.616 302.101 L
125.828 301.639 L
126.051 301.154 L
126.241 300.742 L
126.447 300.296 L
126.664 299.828 L
126.876 299.372 L
127.077 298.942 L
127.3 298.466 L
127.5 298.038 L
127.712 297.588 L
127.94 297.105 L
128.136 296.692 L
128.364 296.212 L
128.565 295.79 L
128.782 295.335 L
129.005 294.87 L
129.216 294.43 L
129.434 293.979 L
129.651 293.529 L
129.868 293.081 L
130.096 292.611 L
130.308 292.177 L
130.53 291.721 L
130.753 291.267 L
130.965 290.836 L
131.193 290.373 L
131.415 289.923 L
131.644 289.463 L
131.861 289.025 L
132.078 288.59 L
132.306 288.133 L
132.534 287.678 L
132.746 287.257 L
132.974 286.804 L
133.202 286.352 L
133.43 285.902 L
133.664 285.443 L
133.892 284.995 L
134.125 284.538 L
134.359 284.082 L
134.576 283.659 L
134.809 283.205 L
135.048 282.742 L
135.282 282.291 L
135.521 281.831 L
135.759 281.372 L
135.977 280.956 L
136.216 280.499 L
136.455 280.044 L
136.683 279.61 L
136.922 279.157 L
137.15 278.725 L
137.394 278.265 L
137.633 277.815 L
137.872 277.366 L
138.122 276.899 L
138.355 276.463 L
138.594 276.018 L
138.838 275.564 L
139.088 275.102 L
139.322 274.67 L
139.566 274.22 L
139.821 273.751 L
140.06 273.312 L
140.315 272.846 L
140.532 272.449 L
140.782 271.995 L
141.037 271.531 L
141.271 271.109 L
141.537 270.628 L
141.781 270.188 L
142.026 269.748 L
142.574 268.767 L
142.818 268.331 L
143.074 267.877 L
143.307 267.463 L
143.562 267.011 L
143.823 266.55 L
144.062 266.129 L
144.328 265.662 L
144.583 265.214 L
144.833 264.778 L
145.105 264.304 L
145.338 263.897 L
145.593 263.454 L
145.859 262.993 L
146.125 262.534 L
146.386 262.084 L
146.641 261.645 L
146.907 261.189 L
147.168 260.743 L
147.434 260.289 L
147.705 259.826 L
147.966 259.383 L
148.21 258.969 L
148.498 258.482 L
148.732 258.088 L
149.014 257.613 L
149.291 257.147 L
149.546 256.72 L
149.796 256.302 L
150.078 255.831 L
150.605 254.956 L
150.866 254.524 L
151.148 254.057 L
151.409 253.627 L
151.675 253.19 L
151.946 252.744 L
152.207 252.317 L
152.478 251.873 L
152.755 251.422 L
153.049 250.944 L
153.315 250.513 L
153.581 250.082 L
153.847 249.652 L
154.124 249.205 L
154.417 248.734 L
154.683 248.307 L
154.955 247.871 L
155.237 247.42 L
155.519 246.97 L
155.791 246.538 L
156.079 246.081 L
156.366 245.625 L
156.632 245.205 L
156.828 244.896 L
157.11 244.452 L
157.398 243.999 L
157.664 243.582 L
157.968 243.106 L
158.234 242.691 L
158.522 242.243 L
158.81 241.795 L
159.108 241.332 L
159.391 240.895 L
159.684 240.442 L
159.961 240.015 L
160.232 239.598 L
160.542 239.123 L
160.835 238.674 L
161.107 238.259 L
161.416 237.787 L
161.693 237.366 L
161.992 236.912 L
162.443 236.23 L
162.73 235.795 L
163.007 235.378 L
163.311 234.92 L
163.605 234.48 L
163.892 234.049 L
164.196 233.594 L
164.5 233.141 L
164.81 232.68 L
165.092 232.261 L
165.402 231.802 L
165.695 231.368 L
165.988 230.935 L
166.292 230.487 L
166.596 230.04 L
166.901 229.594 L
167.21 229.141 L
167.514 228.696 L
167.818 228.253 L
168.128 227.803 L
168.41 227.392 L
168.703 226.967 L
169.018 226.512 L
169.322 226.073 L
169.637 225.619 L
169.936 225.19 L
170.256 224.73 L
170.94 223.751 L
171.25 223.31 L
171.57 222.854 L
171.874 222.422 L
172.189 221.976 L
172.493 221.546 L
172.808 221.101 L
173.129 220.649 L
173.438 220.214 L
173.742 219.787 L
174.057 219.346 L
174.378 218.898 L
174.698 218.451 L
175.008 218.02 L
175.344 217.553 L
175.659 217.116 L
175.958 216.702 L
176.278 216.259 L
176.593 215.825 L
176.913 215.384 L
177.239 214.936 L
177.57 214.482 L
177.88 214.058 L
178.222 213.591 L
178.526 213.176 L
178.857 212.726 L
179.172 212.298 L
179.509 211.841 L
179.802 211.445 L
180.144 210.982 L
180.47 210.543 L
180.801 210.097 L
181.122 209.667 L
181.464 209.209 L
181.784 208.78 L
181.931 208.584 L
182.246 208.164 L
182.566 207.737 L
182.903 207.289 L
183.25 206.828 L
183.576 206.396 L
183.896 205.973 L
184.239 205.521 L
184.581 205.071 L
184.901 204.649 L
185.227 204.222 L
185.585 203.752 L
185.916 203.319 L
186.258 202.872 L
186.595 202.434 L
186.916 202.017 L
187.241 201.594 L
187.578 201.158 L
187.92 200.715 L
188.257 200.281 L
188.615 199.819 L
188.946 199.392 L
189.283 198.96 L
189.625 198.521 L
189.962 198.091 L
190.331 197.619 L
190.662 197.196 L
191.01 196.754 L
191.352 196.319 L
191.71 195.865 L
192.21 195.233 L
192.541 194.814 L
192.91 194.349 L
193.263 193.905 L
193.605 193.475 L
193.947 193.046 L
194.289 192.618 L
194.632 192.19 L
194.995 191.737 L
195.343 191.304 L
195.69 190.872 L
196.054 190.421 L
196.396 189.997 L
196.766 189.54 L
197.108 189.118 L
197.477 188.663 L
197.83 188.229 L
198.199 187.775 L
198.541 187.356 L
198.916 186.897 L
199.258 186.479 L
199.611 186.049 L
199.953 185.632 L
200.322 185.184 L
200.67 184.762 L
201.044 184.308 L
201.414 183.862 L
201.756 183.449 L
202.141 182.984 L
202.478 182.579 L
202.863 182.116 L
203.238 181.667 L
203.591 181.244 L
203.96 180.803 L
204.335 180.356 L
204.688 179.936 L
205.068 179.484 L
205.426 179.058 L
205.806 178.608 L
206.159 178.19 L
206.54 177.741 L
206.892 177.325 L
207.278 176.871 L
207.653 176.431 L
208.033 175.985 L
208.369 175.591 L
208.739 175.159 L
209.119 174.715 L
209.488 174.285 L
209.874 173.836 L
210.248 173.401 L
210.623 172.966 L
211.003 172.526 L
211.389 172.08 L
211.747 171.666 L
212.306 171.022 L
212.686 170.585 L
213.066 170.149 L
213.447 169.713 L
213.832 169.272 L
214.212 168.838 L
214.598 168.399 L
214.983 167.96 L
215.352 167.54 L
215.733 167.109 L
216.123 166.665 L
216.504 166.236 L
216.878 165.812 L
217.258 165.384 L
217.644 164.95 L
218.04 164.504 L
218.42 164.077 L
218.811 163.639 L
219.197 163.208 L
219.599 162.759 L
219.99 162.323 L
220.381 161.888 L
220.772 161.453 L
221.146 161.037 L
221.515 160.628 L
221.917 160.183 L
222.314 159.745 L
222.716 159.302 L
223.117 158.859 L
223.508 158.43 L
223.894 158.006 L
224.29 157.572 L
224.692 157.132 L
225.083 156.705 L
225.479 156.272 L
225.887 155.829 L
226.283 155.397 L
226.69 154.955 L
227.092 154.519 L
227.472 154.108 L
227.874 153.673 L
228.26 153.257 L
228.667 152.818 L
229.074 152.38 L
229.492 151.93 L
229.872 151.523 L
230.279 151.086 L
230.692 150.645 L
231.463 149.822 L
231.87 149.388 L
232.283 148.949 L
232.701 148.505 L
233.092 148.091 L
233.472 147.688 L
233.89 147.247 L
234.314 146.799 L
234.732 146.359 L
235.145 145.925 L
235.568 145.48 L
235.965 145.064 L
236.356 144.654 L
236.774 144.217 L
237.186 143.786 L
237.507 143.452 L
237.92 143.022 L
238.332 142.592 L
238.756 142.152 L
239.179 141.713 L
239.608 141.269 L
240.021 140.842 L
240.434 140.416 L
240.835 140.002 L
241.27 139.555 L
241.693 139.119 L
242.106 138.696 L
242.54 138.25 L
242.964 137.817 L
243.371 137.401 L
243.811 136.952 L
244.224 136.531 L
244.647 136.1 L
245.076 135.665 L
245.478 135.257 L
245.902 134.828 L
246.336 134.388 L
246.765 133.955 L
247.194 133.522 L
247.634 133.079 L
248.052 132.659 L
248.508 132.2 L
248.915 131.792 L
249.371 131.335 L
249.768 130.939 L
250.218 130.489 L
250.637 130.072 L
251.076 129.634 L
251.522 129.191 L
251.951 128.765 L
252.38 128.34 L
252.841 127.883 L
253.265 127.464 L
253.694 127.041 L
254.123 126.618 L
254.579 126.169 L
255.372 125.39 L
255.801 124.969 L
256.257 124.522 L
256.713 124.076 L
257.136 123.663 L
257.565 123.244 L
258.021 122.8 L
258.477 122.357 L
258.906 121.94 L
259.363 121.498 L
259.792 121.083 L
260.248 120.642 L
260.671 120.233 L
261.133 119.788 L
261.589 119.348 L
262.012 118.941 L
262.469 118.503 L
262.93 118.061 L
263.381 117.629 L
263.81 117.219 L
264.369 116.685 L
264.825 116.25 L
265.281 115.816 L
265.71 115.408 L
266.166 114.975 L
266.628 114.537 L
267.084 114.105 L
267.535 113.679 L
267.996 113.243 L
268.447 112.818 L
268.919 112.373 L
269.375 111.944 L
269.837 111.511 L
270.277 111.098 L
270.733 110.671 L
271.2 110.235 L
271.634 109.829 L
272.107 109.388 L
272.568 108.958 L
273.041 108.518 L
273.66 108.238 L
274.127 108.161 L
274.577 108.172 L
275.05 108.179 L
275.484 108.181 L
275.962 108.181 L
276.435 108.181 L
276.88 108.182 L
277.352 108.182 L
277.835 108.182 L
278.297 108.182 L
278.759 108.182 L
279.22 108.182 L
279.698 108.182 L
280.181 108.181 L
280.659 108.182 L
281.088 108.181 L
281.571 108.182 L
282.055 108.182 L
282.527 108.182 L
283.01 108.182 L
283.493 108.182 L
283.912 108.182 L
284.248 108.182 L
284.737 108.182 L
285.22 108.181 L
285.665 108.182 L
286.154 108.182 L
286.654 108.182 L
287.115 108.181 L
287.577 108.182 L
288.071 108.182 L
288.571 108.182 L
289.054 108.181 L
289.505 108.182 L
289.977 108.182 L
290.482 108.182 L
290.96 108.181 L
291.459 108.182 L
291.888 108.182 L
292.388 108.182 L
292.877 108.182 L
293.371 108.182 L
293.865 108.181 L
294.321 108.182 L
295.059 108.182 L
295.537 108.182 L
296.015 108.181 L
296.526 108.182 L
297.003 108.182 L
297.481 108.182 L
297.954 108.182 L
298.453 108.182 L
298.947 108.181 L
299.414 108.182 L
299.903 108.182 L
300.424 108.182 L
300.897 108.182 L
301.353 108.182 L
301.863 108.181 L
302.341 108.182 L
302.824 108.182 L
303.34 108.182 L
303.818 108.182 L
304.301 108.181 L
304.806 108.181 L
305.284 108.182 L
305.8 108.182 L
306.202 108.182 L
306.642 108.182 L
307.152 108.182 L
307.635 108.182 L
308.151 108.181 L
308.629 108.182 L
309.112 108.182 L
309.634 108.181 L
310.117 108.182 L
310.567 108.182 L
311.083 108.182 L
311.572 108.182 L
312.066 108.182 L
312.582 108.182 L
313.044 108.182 L
313.82 108.182 L
314.292 108.182 L
314.814 108.182 L
315.292 108.182 L
315.769 108.182 L
316.291 108.182 L
316.769 108.182 L
317.284 108.182 L
317.762 108.182 L
318.24 108.181 L
318.75 108.182 L
319.207 108.181 L
319.657 108.182 L
320.189 108.182 L
320.651 108.182 L
321.156 108.182 L
321.639 108.181 L
322.161 108.182 L
322.622 108.182 L
323.1 108.182 L
323.616 108.182 L
324.094 108.182 L
324.577 108.181 L
325.093 108.182 L
325.576 108.181 L
326.032 108.182 L
326.553 108.182 L
327.08 108.182 L
327.531 108.181 L
328.014 108.182 L
328.524 108.182 L
329.019 108.181 L
329.513 108.182 L
329.98 108.181 L
330.479 108.182 L
330.968 108.182 L
331.468 108.182 L
331.962 108.182 L
332.44 108.182 L
332.945 108.182 L
333.775 108.182 L
334.291 108.181 L
334.769 108.182 L
335.252 108.182 L
335.736 108.181 L
336.203 108.182 L
336.702 108.182 L
337.212 108.182 L
337.69 108.182 L
338.168 108.182 L
338.657 108.182 L
339.135 108.182 L
339.656 108.182 L
340.118 108.182 L
340.655 108.182 L
341.111 108.182 L
341.595 108.182 L
342.099 108.182 L
342.577 108.182 L
343.088 108.182 L
343.571 108.182 L
344.054 108.182 L
344.565 108.181 L
344.999 108.182 L
345.515 108.182 L
345.998 108.181 L
346.492 108.182 L
347.003 108.182 L
347.486 108.181 L
347.986 108.182 L
348.29 108.182 L
348.73 108.182 L
349.229 108.182 L
349.723 108.182 L
350.206 108.182 L
350.722 108.182 L
351.2 108.182 L
351.7 108.181 L
352.178 108.182 L
352.672 108.181 L
353.171 108.182 L
353.655 108.182 L
354.556 108.182 L
355.061 108.182 L
355.522 108.182 L
356.022 108.181 L
356.489 108.182 L
356.989 108.182 L
357.477 108.181 L
357.961 108.181 L
358.444 108.182 L
358.949 108.181 L
359.427 108.182 L
359.921 108.182 L
360.415 108.181 L
360.909 108.182 L
361.398 108.182 L
361.876 108.182 L
362.359 108.181 L
362.842 108.182 L
363.309 108.182 L
363.819 108.181 L
364.308 108.182 L
364.797 108.182 L
365.291 108.181 L
365.725 108.182 L
366.263 108.182 L
366.697 108.182 L
367.181 108.182 L
367.68 108.181 L
368.18 108.182 L
368.658 108.182 L
369.13 108.182 L
369.63 108.182 L
370.118 108.182 L
370.596 108.182 L
371.079 108.182 L
371.563 108.182 L
372.046 108.182 L
372.54 108.182 L
373.04 108.182 L
373.496 108.182 L
374.435 108.181 L
374.891 108.182 L
375.369 108.182 L
375.88 108.182 L
376.363 108.182 L
376.846 108.182 L
377.356 108.182 L
377.818 108.181 L
378.323 108.182 L
378.812 108.182 L
379.3 108.181 L
379.795 108.182 L
380.262 108.181 L
380.718 108.182 L
381.217 108.182 L
381.69 108.182 L
382.195 108.182 L
382.694 108.182 L
383.188 108.181 L
383.677 108.182 L
384.111 108.182 L
384.606 108.182 L
385.094 108.182 L
385.588 108.182 L
386.088 108.182 L
386.566 108.182 L
387.076 108.182 L
387.554 108.182 L
388.037 108.182 L
388.515 108.182 L
388.988 108.182 L
389.465 108.182 L
389.976 108.182 L
390.465 108.181 L
390.959 108.182 L
391.415 108.182 L
391.909 108.181 L
392.419 108.182 L
392.87 108.182 L
393.408 108.181 L
393.869 108.182 L
394.336 108.181 L
394.868 108.182 L
395.33 108.182 L
395.78 108.182 L
396.296 108.182 L
396.78 108.182 L
397.529 108.182 L
398.007 108.182 L
398.517 108.182 L
398.995 108.182 L
399.478 108.182 L
399.962 108.182 L
400.456 108.182 L
400.923 108.182 L
401.417 108.181 L
401.884 108.182 L
402.389 108.182 L
402.877 108.182 L
403.382 108.182 L
403.849 108.182 L
404.344 108.182 L
404.816 108.182 L
405.31 108.182 L
405.772 108.182 L
406.097 108.182 L
406.57 108.182 L
407.048 108.182 L
407.531 108.182 L
408.047 108.182 L
408.498 108.182 L
409.003 108.181 L
409.486 108.182 L
409.964 108.181 L
410.463 108.182 L
410.963 108.182 L
411.424 108.181 L
411.929 108.182 L
412.418 108.182 L
412.89 108.182 L
413.39 108.182 L
413.89 108.182 L
415.073 108.182 L
415.567 108.181 L
416.056 108.182 L
416.529 108.182 L
417.033 108.182 L
417.5 108.182 L
417.995 108.182 L
418.456 108.182 L
418.967 108.182 L
419.455 108.182 L
419.933 108.181 L
420.411 108.182 L
420.916 108.182 L
421.394 108.182 L
421.877 108.181 L
422.387 108.182 L
422.844 108.182 L
423.327 108.182 L
423.826 108.182 L
424.31 108.182 L
424.826 108.181 L
425.309 108.182 L
425.787 108.182 L
426.27 108.182 L
426.742 108.182 L
427.231 108.182 L
427.703 108.182 L
428.219 108.182 L
428.686 108.182 L
429.17 108.181 L
429.68 108.182 L
430.163 108.182 L
430.63 108.182 L
431.124 108.182 L
431.597 108.182 L
431.912 108.182 L
432.422 108.182 L
432.905 108.182 L
433.383 108.182 L
433.866 108.182 L
434.371 108.182 L
434.822 108.182 L
435.338 108.181 L
435.816 108.182 L
436.31 108.182 L
436.772 108.182 L
437.282 108.182 L
437.76 108.182 L
438.265 108.182 L
438.732 108.182 L
439.182 108.182 L
439.644 108.182 L
440.133 108.182 L
440.632 108.182 L
441.105 108.182 L
441.604 108.181 L
442.104 108.182 L
442.592 108.182 L
443.054 108.182 L
443.559 108.181 L
444.026 108.182 L
444.493 108.182 L
445.003 108.182 L
445.487 108.182 L
445.986 108.182 L
446.48 108.182 L
446.953 108.182 L
447.751 108.182 L
448.256 108.182 L
448.739 108.182 L
449.223 108.181 L
449.695 108.182 L
450.173 108.182 L
450.694 108.181 L
451.172 108.182 L
451.655 108.182 L
452.133 108.182 L
452.611 108.181 L
453.105 108.182 L
453.599 108.181 L
454.093 108.182 L
454.582 108.182 L
455.576 108.182 L
456.048 108.182 L
456.526 108.181 L
457.02 108.182 L
457.509 108.182 L
458.008 108.181 L
458.492 108.182 L
458.986 108.182 L
459.453 108.181 L
459.93 108.182 L
460.414 108.182 L
460.902 108.182 L
461.397 108.181 L
461.695 108.181 L
462.151 108.182 L
462.645 108.182 L
463.134 108.182 L
463.628 108.182 L
464.117 108.182 L
464.611 108.182 L
465.1 108.182 L
465.589 108.182 L
466.088 108.182 L
466.544 108.181 L
467.375 108.181 L
467.869 108.182 L
468.363 108.182 L
468.852 108.181 L
469.346 108.182 L
469.84 108.182 L
470.329 108.182 L
470.763 108.182 L
471.252 108.182 L
471.746 108.182 L
472.24 108.182 L
472.729 108.182 L
473.223 108.182 L
473.717 108.182 L
474.206 108.182 L
474.64 108.181 L
475.134 108.182 L
475.623 108.182 L
476.123 108.182 L
476.611 108.182 L
477.225 108.182 L
477.719 108.182 L
478.154 108.182 L
478.642 108.182 L
479.136 108.182 L
479.652 108.182 L
480.119 108.182 L
480.603 108.182 L
481.113 108.181 L
481.602 108.182 L
482.074 108.182 L
482.546 108.182 L
483.03 108.182 L
483.508 108.182 L
483.991 108.182 L
484.501 108.182 L
484.974 108.182 L
485.457 108.182 L
485.951 108.182 L
486.44 108.181 L
486.901 108.182 L
487.39 108.181 L
487.9 108.182 L
488.357 108.182 L
488.867 108.182 L
489.367 108.182 L
489.508 108.182 L
489.98 108.182 L
490.512 108.181 L
490.952 108.182 L
491.43 108.182 L
491.94 108.181 L
492.429 108.182 L
492.907 108.182 L
493.39 108.182 L
493.901 108.182 L
494.373 108.181 L
494.829 108.182 L
495.459 108.182 L
495.817 108.182 L
496.301 108.182 L
496.806 108.182 L
497.278 108.181 L
497.761 108.182 L
498.234 108.181 L
499.179 108.182 L
499.64 108.181 L
500.156 108.182 L
500.634 108.182 L
501.112 108.182 L
501.584 108.182 L
502.094 108.182 L
502.561 108.181 L
503.023 108.182 L
503.555 108.182 L
504.028 108.182 L
504.489 108.182 L
504.989 108.182 L
505.488 108.182 L
505.966 108.182 L
506.433 108.182 L
506.943 108.182 L
507.427 108.182 L
507.899 108.182 L
508.382 108.182 L
509.012 108.182 L
509.485 108.181 L
509.973 108.182 L
510.462 108.182 L
510.951 108.182 L
511.445 108.181 L
511.912 108.182 L
512.406 108.182 L
512.873 108.182 L
513.362 108.182 L
513.856 108.182 L
514.35 108.182 L
514.849 108.182 L
515.338 108.182 L
515.827 108.182 L
516.745 108.181 L
517.206 108.181 L
517.7 108.182 L
518.189 108.182 L
518.683 108.182 L
519.166 108.182 L
519.65 108.181 L
520.144 108.182 L
520.611 108.182 L
521.067 108.182 L
521.566 108.182 L
522.05 108.182 L
522.538 108.182 L
523.027 108.182 L
523.532 108.182 L
524.021 108.182 L
524.52 108.182 L
524.971 108.182 L
525.454 108.182 L
525.943 108.182 L
S
GR
GS
[0.6 0 0 0.6 0 0] CT
1 GC
N
631 249 M
631 183 L
393 183 L
393 249 L
cp
f
GR
GS
[0.6 0 0 0.6 271.08706 120.36] CT
N
1.75 9 M
1.75 -7.469 L
3.984 -7.469 L
12.641 5.469 L
12.641 -7.469 L
14.719 -7.469 L
14.719 9 L
12.484 9 L
3.844 -3.938 L
3.844 9 L
1.75 9 L
cp
26.132 7.531 M
25.007 8.484 23.968 8.875 QT
22.929 9.266 21.742 9.266 QT
19.773 9.266 18.718 8.305 QT
17.664 7.344 17.664 5.859 QT
17.664 4.984 18.062 4.258 QT
18.461 3.531 19.109 3.094 QT
19.757 2.656 20.57 2.438 QT
21.164 2.266 22.367 2.125 QT
24.804 1.828 25.961 1.438 QT
25.976 1.016 25.976 0.906 QT
25.976 -0.328 25.398 -0.844 QT
24.632 -1.516 23.101 -1.516 QT
21.679 -1.516 21 -1.023 QT
20.32 -0.531 19.992 0.75 QT
18.007 0.469 L
18.289 -0.797 18.906 -1.578 QT
19.523 -2.359 20.687 -2.781 QT
21.851 -3.203 23.398 -3.203 QT
24.929 -3.203 25.882 -2.844 QT
26.836 -2.484 27.281 -1.938 QT
27.726 -1.391 27.914 -0.563 QT
28.007 -0.047 28.007 1.313 QT
28.007 4 L
28.007 6.828 28.14 7.57 QT
28.273 8.313 28.648 9 QT
26.539 9 L
26.226 8.375 26.132 7.531 QT
cp
25.961 3.016 M
24.867 3.469 22.664 3.781 QT
21.414 3.953 20.898 4.18 QT
20.382 4.406 20.101 4.836 QT
19.82 5.266 19.82 5.797 QT
19.82 6.609 20.437 7.148 QT
21.054 7.688 22.226 7.688 QT
23.398 7.688 24.304 7.172 QT
25.211 6.656 25.648 5.781 QT
25.961 5.094 25.961 3.75 QT
25.961 3.016 L
cp
31.316 9 M
31.316 -2.922 L
33.129 -2.922 L
33.129 -1.25 L
33.691 -2.125 34.621 -2.664 QT
35.551 -3.203 36.738 -3.203 QT
38.066 -3.203 38.918 -2.648 QT
39.77 -2.094 40.113 -1.109 QT
41.52 -3.203 43.801 -3.203 QT
45.566 -3.203 46.52 -2.219 QT
47.473 -1.234 47.473 0.813 QT
47.473 9 L
45.473 9 L
45.473 1.484 L
45.473 0.281 45.277 -0.258 QT
45.082 -0.797 44.559 -1.117 QT
44.035 -1.438 43.348 -1.438 QT
42.082 -1.438 41.254 -0.602 QT
40.426 0.234 40.426 2.078 QT
40.426 9 L
38.41 9 L
38.41 1.25 L
38.41 -0.094 37.91 -0.766 QT
37.41 -1.438 36.285 -1.438 QT
35.441 -1.438 34.715 -0.992 QT
33.988 -0.547 33.66 0.32 QT
33.332 1.188 33.332 2.813 QT
33.332 9 L
31.316 9 L
cp
58.908 5.156 M
60.986 5.422 L
60.502 7.25 59.166 8.258 QT
57.83 9.266 55.752 9.266 QT
53.127 9.266 51.595 7.656 QT
50.064 6.047 50.064 3.141 QT
50.064 0.125 51.611 -1.539 QT
53.158 -3.203 55.627 -3.203 QT
58.033 -3.203 59.548 -1.57 QT
61.064 0.063 61.064 3.016 QT
61.064 3.188 61.048 3.547 QT
52.158 3.547 L
52.267 5.516 53.267 6.563 QT
54.267 7.609 55.752 7.609 QT
56.861 7.609 57.65 7.023 QT
58.439 6.438 58.908 5.156 QT
cp
52.267 1.891 M
58.923 1.891 L
58.783 0.391 58.158 -0.359 QT
57.189 -1.531 55.658 -1.531 QT
54.267 -1.531 53.314 -0.602 QT
52.361 0.328 52.267 1.891 QT
cp
55.22 -6.234 M
56.455 -8.141 L
58.752 -8.141 L
56.22 -5 L
54.064 -5 L
51.642 -8.141 L
53.955 -8.141 L
55.22 -6.234 L
cp
63.686 9 M
63.686 -2.922 L
65.498 -2.922 L
65.498 -1.125 L
66.201 -2.391 66.787 -2.797 QT
67.373 -3.203 68.076 -3.203 QT
69.108 -3.203 70.154 -2.547 QT
69.467 -0.672 L
68.717 -1.109 67.983 -1.109 QT
67.311 -1.109 66.787 -0.711 QT
66.264 -0.313 66.045 0.391 QT
65.701 1.469 65.701 2.75 QT
65.701 9 L
63.686 9 L
cp
67.186 -6.234 M
68.42 -8.141 L
70.717 -8.141 L
68.186 -5 L
66.029 -5 L
63.608 -8.141 L
65.92 -8.141 L
67.186 -6.234 L
cp
79.636 5.156 M
81.715 5.422 L
81.23 7.25 79.894 8.258 QT
78.558 9.266 76.48 9.266 QT
73.855 9.266 72.324 7.656 QT
70.793 6.047 70.793 3.141 QT
70.793 0.125 72.34 -1.539 QT
73.886 -3.203 76.355 -3.203 QT
78.761 -3.203 80.277 -1.57 QT
81.793 0.063 81.793 3.016 QT
81.793 3.188 81.777 3.547 QT
72.886 3.547 L
72.996 5.516 73.996 6.563 QT
74.996 7.609 76.48 7.609 QT
77.59 7.609 78.379 7.023 QT
79.168 6.438 79.636 5.156 QT
cp
72.996 1.891 M
79.652 1.891 L
79.511 0.391 78.886 -0.359 QT
77.918 -1.531 76.386 -1.531 QT
74.996 -1.531 74.043 -0.602 QT
73.09 0.328 72.996 1.891 QT
cp
84.43 9 M
84.43 -2.922 L
86.242 -2.922 L
86.242 -1.234 L
87.57 -3.203 90.039 -3.203 QT
91.117 -3.203 92.024 -2.813 QT
92.93 -2.422 93.383 -1.789 QT
93.836 -1.156 94.008 -0.297 QT
94.117 0.266 94.117 1.672 QT
94.117 9 L
92.102 9 L
92.102 1.75 L
92.102 0.516 91.867 -0.102 QT
91.633 -0.719 91.031 -1.078 QT
90.43 -1.438 89.617 -1.438 QT
88.32 -1.438 87.383 -0.625 QT
86.445 0.188 86.445 2.484 QT
86.445 9 L
84.43 9 L
cp
105.176 7.531 M
104.051 8.484 103.012 8.875 QT
101.973 9.266 100.786 9.266 QT
98.817 9.266 97.762 8.305 QT
96.708 7.344 96.708 5.859 QT
96.708 4.984 97.106 4.258 QT
97.504 3.531 98.153 3.094 QT
98.801 2.656 99.614 2.438 QT
100.208 2.266 101.411 2.125 QT
103.848 1.828 105.004 1.438 QT
105.02 1.016 105.02 0.906 QT
105.02 -0.328 104.442 -0.844 QT
103.676 -1.516 102.145 -1.516 QT
100.723 -1.516 100.044 -1.023 QT
99.364 -0.531 99.036 0.75 QT
97.051 0.469 L
97.333 -0.797 97.95 -1.578 QT
98.567 -2.359 99.731 -2.781 QT
100.895 -3.203 102.442 -3.203 QT
103.973 -3.203 104.926 -2.844 QT
105.879 -2.484 106.325 -1.938 QT
106.77 -1.391 106.958 -0.563 QT
107.051 -0.047 107.051 1.313 QT
107.051 4 L
107.051 6.828 107.184 7.57 QT
107.317 8.313 107.692 9 QT
105.583 9 L
105.27 8.375 105.176 7.531 QT
cp
105.004 3.016 M
103.911 3.469 101.708 3.781 QT
100.458 3.953 99.942 4.18 QT
99.426 4.406 99.145 4.836 QT
98.864 5.266 98.864 5.797 QT
98.864 6.609 99.481 7.148 QT
100.098 7.688 101.27 7.688 QT
102.442 7.688 103.348 7.172 QT
104.254 6.656 104.692 5.781 QT
105.004 5.094 105.004 3.75 QT
105.004 3.016 L
cp
101.208 -5 M
102.692 -8.141 L
105.348 -8.141 L
102.879 -5 L
101.208 -5 L
cp
124.572 9 M
124.572 7.5 L
123.447 9.266 121.244 9.266 QT
119.822 9.266 118.619 8.484 QT
117.415 7.703 116.759 6.289 QT
116.103 4.875 116.103 3.047 QT
116.103 1.266 116.705 -0.188 QT
117.306 -1.641 118.494 -2.422 QT
119.681 -3.203 121.15 -3.203 QT
122.228 -3.203 123.072 -2.742 QT
123.915 -2.281 124.447 -1.563 QT
124.447 -7.469 L
126.447 -7.469 L
126.447 9 L
124.572 9 L
cp
118.181 3.047 M
118.181 5.344 119.15 6.477 QT
120.119 7.609 121.431 7.609 QT
122.759 7.609 123.681 6.523 QT
124.603 5.438 124.603 3.219 QT
124.603 0.766 123.665 -0.375 QT
122.728 -1.516 121.337 -1.516 QT
119.994 -1.516 119.087 -0.422 QT
118.181 0.672 118.181 3.047 QT
cp
137.584 7.531 M
136.459 8.484 135.42 8.875 QT
134.381 9.266 133.193 9.266 QT
131.225 9.266 130.17 8.305 QT
129.115 7.344 129.115 5.859 QT
129.115 4.984 129.514 4.258 QT
129.912 3.531 130.56 3.094 QT
131.209 2.656 132.021 2.438 QT
132.615 2.266 133.818 2.125 QT
136.256 1.828 137.412 1.438 QT
137.428 1.016 137.428 0.906 QT
137.428 -0.328 136.85 -0.844 QT
136.084 -1.516 134.553 -1.516 QT
133.131 -1.516 132.451 -1.023 QT
131.771 -0.531 131.443 0.75 QT
129.459 0.469 L
129.74 -0.797 130.357 -1.578 QT
130.975 -2.359 132.139 -2.781 QT
133.303 -3.203 134.85 -3.203 QT
136.381 -3.203 137.334 -2.844 QT
138.287 -2.484 138.732 -1.938 QT
139.178 -1.391 139.365 -0.563 QT
139.459 -0.047 139.459 1.313 QT
139.459 4 L
139.459 6.828 139.592 7.57 QT
139.725 8.313 140.1 9 QT
137.99 9 L
137.678 8.375 137.584 7.531 QT
cp
137.412 3.016 M
136.318 3.469 134.115 3.781 QT
132.865 3.953 132.35 4.18 QT
131.834 4.406 131.553 4.836 QT
131.271 5.266 131.271 5.797 QT
131.271 6.609 131.889 7.148 QT
132.506 7.688 133.678 7.688 QT
134.85 7.688 135.756 7.172 QT
136.662 6.656 137.1 5.781 QT
137.412 5.094 137.412 3.75 QT
137.412 3.016 L
cp
147.19 7.188 M
147.471 8.984 L
146.627 9.156 145.94 9.156 QT
144.846 9.156 144.237 8.805 QT
143.627 8.453 143.385 7.891 QT
143.143 7.328 143.143 5.5 QT
143.143 -1.359 L
141.659 -1.359 L
141.659 -2.922 L
143.143 -2.922 L
143.143 -5.875 L
145.143 -7.094 L
145.143 -2.922 L
147.19 -2.922 L
147.19 -1.359 L
145.143 -1.359 L
145.143 5.625 L
145.143 6.484 145.252 6.734 QT
145.362 6.984 145.604 7.125 QT
145.846 7.266 146.299 7.266 QT
146.627 7.266 147.19 7.188 QT
cp
157.026 7.531 M
155.901 8.484 154.862 8.875 QT
153.823 9.266 152.636 9.266 QT
150.667 9.266 149.612 8.305 QT
148.557 7.344 148.557 5.859 QT
148.557 4.984 148.956 4.258 QT
149.354 3.531 150.003 3.094 QT
150.651 2.656 151.464 2.438 QT
152.057 2.266 153.261 2.125 QT
155.698 1.828 156.854 1.438 QT
156.87 1.016 156.87 0.906 QT
156.87 -0.328 156.292 -0.844 QT
155.526 -1.516 153.995 -1.516 QT
152.573 -1.516 151.893 -1.023 QT
151.214 -0.531 150.886 0.75 QT
148.901 0.469 L
149.182 -0.797 149.8 -1.578 QT
150.417 -2.359 151.581 -2.781 QT
152.745 -3.203 154.292 -3.203 QT
155.823 -3.203 156.776 -2.844 QT
157.729 -2.484 158.175 -1.938 QT
158.62 -1.391 158.807 -0.563 QT
158.901 -0.047 158.901 1.313 QT
158.901 4 L
158.901 6.828 159.034 7.57 QT
159.167 8.313 159.542 9 QT
157.432 9 L
157.12 8.375 157.026 7.531 QT
cp
156.854 3.016 M
155.761 3.469 153.557 3.781 QT
152.307 3.953 151.792 4.18 QT
151.276 4.406 150.995 4.836 QT
150.714 5.266 150.714 5.797 QT
150.714 6.609 151.331 7.148 QT
151.948 7.688 153.12 7.688 QT
154.292 7.688 155.198 7.172 QT
156.104 6.656 156.542 5.781 QT
156.854 5.094 156.854 3.75 QT
156.854 3.016 L
cp
f
GR
GS
[0.6 0 0 0.6 0 0] CT
0 0 1 RC
1 LJ
3.333 LW
N
398.005 200.6 M
448.058 200.6 L
S
GR
GS
[0.6 0 0 0.6 271.08706 138.84] CT
/Helvetica 23.333 F
GS
[1 0 0 1 0 0] CT
0 9 moveto 
1 -1 scale
(Simulovan\341 data) t 
GR
GR
GS
[0.6 0 0 0.6 0 0] CT
1 0 0 RC
[12 12] 0 setdash
2 LJ
3.333 LW
N
398.005 231.4 M
448.058 231.4 L
S
GR
GS
[0.6 0 0 0.6 0 0] CT
0.149 GC
10.0 ML
0.833 LW
N
393 249 M
393 183 L
631 183 L
631 249 L
cp
S
GR
%%Trailer
%%Pages: 1
%%EOF
