%!PS-Adobe-3.0 EPSF-3.0
%%Creator: (MATLAB, The Mathworks, Inc. Version 9.14.0.2206163 \(R2023a\). Operating System: Windows 10)
%%Title: C:/Users/radac/Desktop/Bachelor_thesis/thesis/Model/figs/odporove_sily.eps
%%CreationDate: 2023-05-20T19:29:47
%%Pages: (atend)
%%BoundingBox:     0     0   420   315
%%LanguageLevel: 3
%%EndComments
%%BeginProlog
%%BeginResource: procset (Apache XML Graphics Std ProcSet) 1.2 0
%%Version: 1.2 0
%%Copyright: (Copyright 2001-2003,2010 The Apache Software Foundation. License terms: http://www.apache.org/licenses/LICENSE-2.0)
/bd{bind def}bind def
/ld{load def}bd
/GR/grestore ld
/GS/gsave ld
/RM/rmoveto ld
/C/curveto ld
/t/show ld
/L/lineto ld
/ML/setmiterlimit ld
/CT/concat ld
/f/fill ld
/N/newpath ld
/S/stroke ld
/CC/setcmykcolor ld
/A/ashow ld
/cp/closepath ld
/RC/setrgbcolor ld
/LJ/setlinejoin ld
/GC/setgray ld
/LW/setlinewidth ld
/M/moveto ld
/re {4 2 roll M
1 index 0 rlineto
0 exch rlineto
neg 0 rlineto
cp } bd
/_ctm matrix def
/_tm matrix def
/BT { _ctm currentmatrix pop matrix _tm copy pop 0 0 moveto } bd
/ET { _ctm setmatrix } bd
/iTm { _ctm setmatrix _tm concat } bd
/Tm { _tm astore pop iTm 0 0 moveto } bd
/ux 0.0 def
/uy 0.0 def
/F {
  /Tp exch def
  /Tf exch def
  Tf findfont Tp scalefont setfont
  /cf Tf def  /cs Tp def
} bd
/ULS {currentpoint /uy exch def /ux exch def} bd
/ULE {
  /Tcx currentpoint pop def
  gsave
  newpath
  cf findfont cs scalefont dup
  /FontMatrix get 0 get /Ts exch def /FontInfo get dup
  /UnderlinePosition get Ts mul /To exch def
  /UnderlineThickness get Ts mul /Tt exch def
  ux uy To add moveto  Tcx uy To add lineto
  Tt setlinewidth stroke
  grestore
} bd
/OLE {
  /Tcx currentpoint pop def
  gsave
  newpath
  cf findfont cs scalefont dup
  /FontMatrix get 0 get /Ts exch def /FontInfo get dup
  /UnderlinePosition get Ts mul /To exch def
  /UnderlineThickness get Ts mul /Tt exch def
  ux uy To add cs add moveto Tcx uy To add cs add lineto
  Tt setlinewidth stroke
  grestore
} bd
/SOE {
  /Tcx currentpoint pop def
  gsave
  newpath
  cf findfont cs scalefont dup
  /FontMatrix get 0 get /Ts exch def /FontInfo get dup
  /UnderlinePosition get Ts mul /To exch def
  /UnderlineThickness get Ts mul /Tt exch def
  ux uy To add cs 10 mul 26 idiv add moveto Tcx uy To add cs 10 mul 26 idiv add lineto
  Tt setlinewidth stroke
  grestore
} bd
/QT {
/Y22 exch store
/X22 exch store
/Y21 exch store
/X21 exch store
currentpoint
/Y21 load 2 mul add 3 div exch
/X21 load 2 mul add 3 div exch
/X21 load 2 mul /X22 load add 3 div
/Y21 load 2 mul /Y22 load add 3 div
/X22 load /Y22 load curveto
} bd
/SSPD {
dup length /d exch dict def
{
/v exch def
/k exch def
currentpagedevice k known {
/cpdv currentpagedevice k get def
v cpdv ne {
/upd false def
/nullv v type /nulltype eq def
/nullcpdv cpdv type /nulltype eq def
nullv nullcpdv or
{
/upd true def
} {
/sametype v type cpdv type eq def
sametype {
v type /arraytype eq {
/vlen v length def
/cpdvlen cpdv length def
vlen cpdvlen eq {
0 1 vlen 1 sub {
/i exch def
/obj v i get def
/cpdobj cpdv i get def
obj cpdobj ne {
/upd true def
exit
} if
} for
} {
/upd true def
} ifelse
} {
v type /dicttype eq {
v {
/dv exch def
/dk exch def
/cpddv cpdv dk get def
dv cpddv ne {
/upd true def
exit
} if
} forall
} {
/upd true def
} ifelse
} ifelse
} if
} ifelse
upd true eq {
d k v put
} if
} if
} if
} forall
d length 0 gt {
d setpagedevice
} if
} bd
/RE { % /NewFontName [NewEncodingArray] /FontName RE -
  findfont dup length dict begin
  {
    1 index /FID ne
    {def} {pop pop} ifelse
  } forall
  /Encoding exch def
  /FontName 1 index def
  currentdict definefont pop
  end
} bind def
%%EndResource
%%BeginResource: procset (Apache XML Graphics EPS ProcSet) 1.0 0
%%Version: 1.0 0
%%Copyright: (Copyright 2002-2003 The Apache Software Foundation. License terms: http://www.apache.org/licenses/LICENSE-2.0)
/BeginEPSF { %def
/b4_Inc_state save def         % Save state for cleanup
/dict_count countdictstack def % Count objects on dict stack
/op_count count 1 sub def      % Count objects on operand stack
userdict begin                 % Push userdict on dict stack
/showpage { } def              % Redefine showpage, { } = null proc
0 setgray 0 setlinecap         % Prepare graphics state
1 setlinewidth 0 setlinejoin
10 setmiterlimit [ ] 0 setdash newpath
/languagelevel where           % If level not equal to 1 then
{pop languagelevel             % set strokeadjust and
1 ne                           % overprint to their defaults.
{false setstrokeadjust false setoverprint
} if
} if
} bd
/EndEPSF { %def
count op_count sub {pop} repeat            % Clean up stacks
countdictstack dict_count sub {end} repeat
b4_Inc_state restore
} bd
%%EndResource
%FOPBeginFontDict
%%IncludeResource: font Courier-Oblique
%%IncludeResource: font Courier-BoldOblique
%%IncludeResource: font Courier-Bold
%%IncludeResource: font ZapfDingbats
%%IncludeResource: font Symbol
%%IncludeResource: font Helvetica
%%IncludeResource: font Helvetica-Oblique
%%IncludeResource: font Helvetica-Bold
%%IncludeResource: font Helvetica-BoldOblique
%%IncludeResource: font Times-Roman
%%IncludeResource: font Times-Italic
%%IncludeResource: font Times-Bold
%%IncludeResource: font Times-BoldItalic
%%IncludeResource: font Courier
%FOPEndFontDict
%%BeginResource: encoding WinAnsiEncoding
/WinAnsiEncoding [
/.notdef /.notdef /.notdef /.notdef /.notdef
/.notdef /.notdef /.notdef /.notdef /.notdef
/.notdef /.notdef /.notdef /.notdef /.notdef
/.notdef /.notdef /.notdef /.notdef /.notdef
/.notdef /.notdef /.notdef /.notdef /.notdef
/.notdef /.notdef /.notdef /.notdef /.notdef
/.notdef /.notdef /space /exclam /quotedbl
/numbersign /dollar /percent /ampersand /quotesingle
/parenleft /parenright /asterisk /plus /comma
/hyphen /period /slash /zero /one
/two /three /four /five /six
/seven /eight /nine /colon /semicolon
/less /equal /greater /question /at
/A /B /C /D /E
/F /G /H /I /J
/K /L /M /N /O
/P /Q /R /S /T
/U /V /W /X /Y
/Z /bracketleft /backslash /bracketright /asciicircum
/underscore /quoteleft /a /b /c
/d /e /f /g /h
/i /j /k /l /m
/n /o /p /q /r
/s /t /u /v /w
/x /y /z /braceleft /bar
/braceright /asciitilde /bullet /Euro /bullet
/quotesinglbase /florin /quotedblbase /ellipsis /dagger
/daggerdbl /circumflex /perthousand /Scaron /guilsinglleft
/OE /bullet /Zcaron /bullet /bullet
/quoteleft /quoteright /quotedblleft /quotedblright /bullet
/endash /emdash /asciitilde /trademark /scaron
/guilsinglright /oe /bullet /zcaron /Ydieresis
/space /exclamdown /cent /sterling /currency
/yen /brokenbar /section /dieresis /copyright
/ordfeminine /guillemotleft /logicalnot /sfthyphen /registered
/macron /degree /plusminus /twosuperior /threesuperior
/acute /mu /paragraph /middot /cedilla
/onesuperior /ordmasculine /guillemotright /onequarter /onehalf
/threequarters /questiondown /Agrave /Aacute /Acircumflex
/Atilde /Adieresis /Aring /AE /Ccedilla
/Egrave /Eacute /Ecircumflex /Edieresis /Igrave
/Iacute /Icircumflex /Idieresis /Eth /Ntilde
/Ograve /Oacute /Ocircumflex /Otilde /Odieresis
/multiply /Oslash /Ugrave /Uacute /Ucircumflex
/Udieresis /Yacute /Thorn /germandbls /agrave
/aacute /acircumflex /atilde /adieresis /aring
/ae /ccedilla /egrave /eacute /ecircumflex
/edieresis /igrave /iacute /icircumflex /idieresis
/eth /ntilde /ograve /oacute /ocircumflex
/otilde /odieresis /divide /oslash /ugrave
/uacute /ucircumflex /udieresis /yacute /thorn
/ydieresis
] def
%%EndResource
%FOPBeginFontReencode
/Courier-Oblique findfont
dup length dict begin
  {1 index /FID ne {def} {pop pop} ifelse} forall
  /Encoding WinAnsiEncoding def
  currentdict
end
/Courier-Oblique exch definefont pop
/Courier-BoldOblique findfont
dup length dict begin
  {1 index /FID ne {def} {pop pop} ifelse} forall
  /Encoding WinAnsiEncoding def
  currentdict
end
/Courier-BoldOblique exch definefont pop
/Courier-Bold findfont
dup length dict begin
  {1 index /FID ne {def} {pop pop} ifelse} forall
  /Encoding WinAnsiEncoding def
  currentdict
end
/Courier-Bold exch definefont pop
/Helvetica findfont
dup length dict begin
  {1 index /FID ne {def} {pop pop} ifelse} forall
  /Encoding WinAnsiEncoding def
  currentdict
end
/Helvetica exch definefont pop
/Helvetica-Oblique findfont
dup length dict begin
  {1 index /FID ne {def} {pop pop} ifelse} forall
  /Encoding WinAnsiEncoding def
  currentdict
end
/Helvetica-Oblique exch definefont pop
/Helvetica-Bold findfont
dup length dict begin
  {1 index /FID ne {def} {pop pop} ifelse} forall
  /Encoding WinAnsiEncoding def
  currentdict
end
/Helvetica-Bold exch definefont pop
/Helvetica-BoldOblique findfont
dup length dict begin
  {1 index /FID ne {def} {pop pop} ifelse} forall
  /Encoding WinAnsiEncoding def
  currentdict
end
/Helvetica-BoldOblique exch definefont pop
/Times-Roman findfont
dup length dict begin
  {1 index /FID ne {def} {pop pop} ifelse} forall
  /Encoding WinAnsiEncoding def
  currentdict
end
/Times-Roman exch definefont pop
/Times-Italic findfont
dup length dict begin
  {1 index /FID ne {def} {pop pop} ifelse} forall
  /Encoding WinAnsiEncoding def
  currentdict
end
/Times-Italic exch definefont pop
/Times-Bold findfont
dup length dict begin
  {1 index /FID ne {def} {pop pop} ifelse} forall
  /Encoding WinAnsiEncoding def
  currentdict
end
/Times-Bold exch definefont pop
/Times-BoldItalic findfont
dup length dict begin
  {1 index /FID ne {def} {pop pop} ifelse} forall
  /Encoding WinAnsiEncoding def
  currentdict
end
/Times-BoldItalic exch definefont pop
/Courier findfont
dup length dict begin
  {1 index /FID ne {def} {pop pop} ifelse} forall
  /Encoding WinAnsiEncoding def
  currentdict
end
/Courier exch definefont pop
%FOPEndFontReencode
%%EndProlog
%%Page: 1 1
%%PageBoundingBox: 0 0 420 315
%%BeginPageSetup
[1 0 0 -1 0 315] CT
%%EndPageSetup
GS
[0.6 0 0 0.6 0 0] CT
1 GC
N
0 0 700 525 re
f
GR
GS
[0.6 0 0 0.6 0 0] CT
1 GC
N
0 0 700 525 re
f
GR
GS
[0.6 0 0 0.6 0 0] CT
1 GC
N
108 454 M
634 454 L
634 39 L
108 39 L
cp
f
GR
GS
[0.6 0 0 0.6 0 0] CT
0.873 GC
1 LJ
0.833 LW
N
108 454 M
108 39 L
S
GR
GS
[0.6 0 0 0.6 0 0] CT
0.873 GC
1 LJ
0.833 LW
N
213.2 454 M
213.2 39 L
S
GR
GS
[0.6 0 0 0.6 0 0] CT
0.873 GC
1 LJ
0.833 LW
N
318.4 454 M
318.4 39 L
S
GR
GS
[0.6 0 0 0.6 0 0] CT
0.873 GC
1 LJ
0.833 LW
N
423.6 454 M
423.6 39 L
S
GR
GS
[0.6 0 0 0.6 0 0] CT
0.873 GC
1 LJ
0.833 LW
N
528.8 454 M
528.8 39 L
S
GR
GS
[0.6 0 0 0.6 0 0] CT
0.873 GC
1 LJ
0.833 LW
N
634 454 M
634 39 L
S
GR
GS
[0.6 0 0 0.6 0 0] CT
0.873 GC
1 LJ
0.833 LW
N
634 454 M
108 454 L
S
GR
GS
[0.6 0 0 0.6 0 0] CT
0.873 GC
1 LJ
0.833 LW
N
634 394.714 M
108 394.714 L
S
GR
GS
[0.6 0 0 0.6 0 0] CT
0.873 GC
1 LJ
0.833 LW
N
634 335.429 M
108 335.429 L
S
GR
GS
[0.6 0 0 0.6 0 0] CT
0.873 GC
1 LJ
0.833 LW
N
634 276.143 M
108 276.143 L
S
GR
GS
[0.6 0 0 0.6 0 0] CT
0.873 GC
1 LJ
0.833 LW
N
634 216.857 M
108 216.857 L
S
GR
GS
[0.6 0 0 0.6 0 0] CT
0.873 GC
1 LJ
0.833 LW
N
634 157.571 M
108 157.571 L
S
GR
GS
[0.6 0 0 0.6 0 0] CT
0.873 GC
1 LJ
0.833 LW
N
634 98.286 M
108 98.286 L
S
GR
GS
[0.6 0 0 0.6 0 0] CT
0.873 GC
1 LJ
0.833 LW
N
634 39 M
108 39 L
S
GR
GS
[0.6 0 0 0.6 0 0] CT
0.149 GC
2 setlinecap
1 LJ
0.833 LW
N
108 454 M
634 454 L
S
GR
GS
[0.6 0 0 0.6 0 0] CT
0.149 GC
2 setlinecap
1 LJ
0.833 LW
N
108 39 M
634 39 L
S
GR
GS
[0.6 0 0 0.6 0 0] CT
0.149 GC
2 setlinecap
1 LJ
0.833 LW
N
108 454 M
108 448.74 L
S
GR
GS
[0.6 0 0 0.6 0 0] CT
0.149 GC
2 setlinecap
1 LJ
0.833 LW
N
213.2 454 M
213.2 448.74 L
S
GR
GS
[0.6 0 0 0.6 0 0] CT
0.149 GC
2 setlinecap
1 LJ
0.833 LW
N
318.4 454 M
318.4 448.74 L
S
GR
GS
[0.6 0 0 0.6 0 0] CT
0.149 GC
2 setlinecap
1 LJ
0.833 LW
N
423.6 454 M
423.6 448.74 L
S
GR
GS
[0.6 0 0 0.6 0 0] CT
0.149 GC
2 setlinecap
1 LJ
0.833 LW
N
528.8 454 M
528.8 448.74 L
S
GR
GS
[0.6 0 0 0.6 0 0] CT
0.149 GC
2 setlinecap
1 LJ
0.833 LW
N
634 454 M
634 448.74 L
S
GR
GS
[0.6 0 0 0.6 0 0] CT
0.149 GC
2 setlinecap
1 LJ
0.833 LW
N
108 39 M
108 44.26 L
S
GR
GS
[0.6 0 0 0.6 0 0] CT
0.149 GC
2 setlinecap
1 LJ
0.833 LW
N
213.2 39 M
213.2 44.26 L
S
GR
GS
[0.6 0 0 0.6 0 0] CT
0.149 GC
2 setlinecap
1 LJ
0.833 LW
N
318.4 39 M
318.4 44.26 L
S
GR
GS
[0.6 0 0 0.6 0 0] CT
0.149 GC
2 setlinecap
1 LJ
0.833 LW
N
423.6 39 M
423.6 44.26 L
S
GR
GS
[0.6 0 0 0.6 0 0] CT
0.149 GC
2 setlinecap
1 LJ
0.833 LW
N
528.8 39 M
528.8 44.26 L
S
GR
GS
[0.6 0 0 0.6 0 0] CT
0.149 GC
2 setlinecap
1 LJ
0.833 LW
N
634 39 M
634 44.26 L
S
GR
GS
[0.6 0 0 0.6 64.8 277.2] CT
0.149 GC
/Helvetica 23.333 F
GS
[1 0 0 1 0 0] CT
-6.5 24 moveto 
1 -1 scale
(0) t 
GR
GR
GS
[0.6 0 0 0.6 127.92 277.2] CT
0.149 GC
/Helvetica 23.333 F
GS
[1 0 0 1 0 0] CT
-19.5 24 moveto 
1 -1 scale
(200) t 
GR
GR
GS
[0.6 0 0 0.6 191.04 277.2] CT
0.149 GC
/Helvetica 23.333 F
GS
[1 0 0 1 0 0] CT
-19.5 24 moveto 
1 -1 scale
(400) t 
GR
GR
GS
[0.6 0 0 0.6 254.16 277.2] CT
0.149 GC
/Helvetica 23.333 F
GS
[1 0 0 1 0 0] CT
-19.5 24 moveto 
1 -1 scale
(600) t 
GR
GR
GS
[0.6 0 0 0.6 317.27999 277.2] CT
0.149 GC
/Helvetica 23.333 F
GS
[1 0 0 1 0 0] CT
-19.5 24 moveto 
1 -1 scale
(800) t 
GR
GR
GS
[0.6 0 0 0.6 380.4 277.2] CT
0.149 GC
/Helvetica 23.333 F
GS
[1 0 0 1 0 0] CT
-26 24 moveto 
1 -1 scale
(1000) t 
GR
GR
GS
[0.6 0 0 0.6 222.60015 295.59999] CT
0.149 GC
/Helvetica 25.667 F
GS
[1 0 0 1 0 0] CT
-28 26 moveto 
1 -1 scale
(s [m]) t 
GR
GR
GS
[0.6 0 0 0.6 0 0] CT
0.149 GC
2 setlinecap
1 LJ
0.833 LW
N
108 454 M
108 39 L
S
GR
GS
[0.6 0 0 0.6 0 0] CT
0.149 GC
2 setlinecap
1 LJ
0.833 LW
N
634 454 M
634 39 L
S
GR
GS
[0.6 0 0 0.6 0 0] CT
0.149 GC
2 setlinecap
1 LJ
0.833 LW
N
108 454 M
113.26 454 L
S
GR
GS
[0.6 0 0 0.6 0 0] CT
0.149 GC
2 setlinecap
1 LJ
0.833 LW
N
108 394.714 M
113.26 394.714 L
S
GR
GS
[0.6 0 0 0.6 0 0] CT
0.149 GC
2 setlinecap
1 LJ
0.833 LW
N
108 335.429 M
113.26 335.429 L
S
GR
GS
[0.6 0 0 0.6 0 0] CT
0.149 GC
2 setlinecap
1 LJ
0.833 LW
N
108 276.143 M
113.26 276.143 L
S
GR
GS
[0.6 0 0 0.6 0 0] CT
0.149 GC
2 setlinecap
1 LJ
0.833 LW
N
108 216.857 M
113.26 216.857 L
S
GR
GS
[0.6 0 0 0.6 0 0] CT
0.149 GC
2 setlinecap
1 LJ
0.833 LW
N
108 157.571 M
113.26 157.571 L
S
GR
GS
[0.6 0 0 0.6 0 0] CT
0.149 GC
2 setlinecap
1 LJ
0.833 LW
N
108 98.286 M
113.26 98.286 L
S
GR
GS
[0.6 0 0 0.6 0 0] CT
0.149 GC
2 setlinecap
1 LJ
0.833 LW
N
108 39 M
113.26 39 L
S
GR
GS
[0.6 0 0 0.6 0 0] CT
0.149 GC
2 setlinecap
1 LJ
0.833 LW
N
634 454 M
628.74 454 L
S
GR
GS
[0.6 0 0 0.6 0 0] CT
0.149 GC
2 setlinecap
1 LJ
0.833 LW
N
634 394.714 M
628.74 394.714 L
S
GR
GS
[0.6 0 0 0.6 0 0] CT
0.149 GC
2 setlinecap
1 LJ
0.833 LW
N
634 335.429 M
628.74 335.429 L
S
GR
GS
[0.6 0 0 0.6 0 0] CT
0.149 GC
2 setlinecap
1 LJ
0.833 LW
N
634 276.143 M
628.74 276.143 L
S
GR
GS
[0.6 0 0 0.6 0 0] CT
0.149 GC
2 setlinecap
1 LJ
0.833 LW
N
634 216.857 M
628.74 216.857 L
S
GR
GS
[0.6 0 0 0.6 0 0] CT
0.149 GC
2 setlinecap
1 LJ
0.833 LW
N
634 157.571 M
628.74 157.571 L
S
GR
GS
[0.6 0 0 0.6 0 0] CT
0.149 GC
2 setlinecap
1 LJ
0.833 LW
N
634 98.286 M
628.74 98.286 L
S
GR
GS
[0.6 0 0 0.6 0 0] CT
0.149 GC
2 setlinecap
1 LJ
0.833 LW
N
634 39 M
628.74 39 L
S
GR
GS
[0.6 0 0 0.6 60 272.4] CT
0.149 GC
/Helvetica 23.333 F
GS
[1 0 0 1 0 0] CT
-13 9 moveto 
1 -1 scale
(0) t 
GR
GR
GS
[0.6 0 0 0.6 60 236.82858] CT
0.149 GC
/Helvetica 23.333 F
GS
[1 0 0 1 0 0] CT
-52 9 moveto 
1 -1 scale
(1000) t 
GR
GR
GS
[0.6 0 0 0.6 60 201.25714] CT
0.149 GC
/Helvetica 23.333 F
GS
[1 0 0 1 0 0] CT
-52 9 moveto 
1 -1 scale
(2000) t 
GR
GR
GS
[0.6 0 0 0.6 60 165.68571] CT
0.149 GC
/Helvetica 23.333 F
GS
[1 0 0 1 0 0] CT
-52 9 moveto 
1 -1 scale
(3000) t 
GR
GR
GS
[0.6 0 0 0.6 60 130.11429] CT
0.149 GC
/Helvetica 23.333 F
GS
[1 0 0 1 0 0] CT
-52 9 moveto 
1 -1 scale
(4000) t 
GR
GR
GS
[0.6 0 0 0.6 60 94.54286] CT
0.149 GC
/Helvetica 23.333 F
GS
[1 0 0 1 0 0] CT
-52 9 moveto 
1 -1 scale
(5000) t 
GR
GR
GS
[0.6 0 0 0.6 60 58.97143] CT
0.149 GC
/Helvetica 23.333 F
GS
[1 0 0 1 0 0] CT
-52 9 moveto 
1 -1 scale
(6000) t 
GR
GR
GS
[0.6 0 0 0.6 60 23.4] CT
0.149 GC
/Helvetica 23.333 F
GS
[1 0 0 1 0 0] CT
-52 9 moveto 
1 -1 scale
(7000) t 
GR
GR
GS
[0 -0.6 0.6 0 15.6 190.2] CT
0.149 GC
/Helvetica 25.667 F
GS
[1 0 0 1 0 0] CT
0 0 moveto 
1 -1 scale
(F) t 
GR
GR
GS
[0 -0.6 0.6 0 22.8 180.6] CT
0.149 GC
/Helvetica 20.533 F
GS
[1 0 0 1 0 0] CT
0 0 moveto 
1 -1 scale
(odporove) t 
GR
GR
GS
[0 -0.6 0.6 0 15.6 129] CT
0.149 GC
/Helvetica 25.667 F
GS
[1 0 0 1 0 0] CT
0 0 moveto 
1 -1 scale
( [N]) t 
GR
GR
GS
[0.6 0 0 0.6 0 0] CT
0 0 1 RC
1 LJ
3.333 LW
N
108 454 M
108.026 410.329 L
108.053 410.278 L
108.074 410.237 L
108.11 410.165 L
108.142 410.103 L
108.168 410.052 L
108.195 410 L
108.231 409.928 L
108.258 409.877 L
108.289 409.815 L
108.321 409.753 L
108.347 409.702 L
108.379 409.64 L
108.416 409.568 L
108.452 409.496 L
108.489 409.425 L
108.526 409.353 L
108.568 409.27 L
108.6 409.209 L
108.642 409.126 L
108.673 409.065 L
108.726 408.962 L
108.757 408.9 L
108.789 408.839 L
108.815 408.787 L
108.842 408.736 L
108.873 408.674 L
108.905 408.613 L
108.936 408.551 L
108.973 408.479 L
109.005 408.417 L
109.036 408.356 L
109.068 408.294 L
109.105 408.222 L
109.136 408.16 L
109.178 408.078 L
109.22 407.996 L
109.252 407.934 L
109.294 407.852 L
109.341 407.759 L
109.383 407.677 L
109.425 407.595 L
109.494 407.461 L
109.573 407.307 L
109.599 407.256 L
109.652 407.153 L
109.725 407.009 L
109.752 406.958 L
109.799 406.865 L
109.857 406.752 L
109.941 406.588 L
109.983 406.506 L
110.036 406.403 L
110.067 406.341 L
110.13 406.218 L
110.162 406.156 L
110.22 406.043 L
110.272 405.941 L
110.314 405.858 L
110.362 405.766 L
110.399 405.694 L
110.441 405.612 L
110.493 405.509 L
110.535 405.427 L
110.583 405.334 L
110.63 405.242 L
110.672 405.16 L
110.725 405.057 L
110.777 404.954 L
110.819 404.872 L
110.861 404.79 L
110.919 404.677 L
110.967 404.584 L
111.024 404.471 L
111.067 404.389 L
111.13 404.266 L
111.172 404.184 L
111.23 404.071 L
111.282 403.968 L
111.34 403.855 L
111.398 403.742 L
111.456 403.629 L
111.503 403.537 L
111.561 403.424 L
111.619 403.311 L
111.671 403.208 L
111.729 403.095 L
111.782 402.992 L
111.84 402.879 L
111.903 402.756 L
111.966 402.633 L
112.024 402.52 L
112.076 402.417 L
112.119 402.335 L
112.192 402.191 L
112.266 402.047 L
112.34 401.904 L
112.413 401.76 L
112.487 401.616 L
112.566 401.462 L
112.639 401.318 L
112.713 401.174 L
112.787 401.031 L
112.866 400.877 L
112.95 400.712 L
113.029 400.558 L
113.102 400.415 L
113.181 400.261 L
113.271 400.086 L
113.344 399.942 L
113.423 399.788 L
113.502 399.634 L
113.586 399.47 L
113.67 399.306 L
113.754 399.141 L
113.833 398.987 L
113.923 398.813 L
114.002 398.659 L
114.086 398.495 L
114.18 398.31 L
114.254 398.166 L
114.349 397.981 L
114.438 397.807 L
114.528 397.632 L
114.617 397.458 L
114.706 397.283 L
114.796 397.109 L
114.891 396.924 L
114.98 396.75 L
115.069 396.575 L
115.164 396.39 L
115.248 396.226 L
115.343 396.042 L
115.438 395.857 L
115.532 395.672 L
115.627 395.487 L
115.722 395.303 L
115.822 395.108 L
115.916 394.923 L
116.016 394.728 L
116.111 394.543 L
116.211 394.348 L
116.321 394.133 L
116.405 393.969 L
116.511 393.764 L
116.611 393.569 L
116.716 393.363 L
116.826 393.148 L
116.91 392.984 L
117.01 392.789 L
117.116 392.584 L
117.221 392.379 L
117.326 392.173 L
117.431 391.968 L
117.536 391.763 L
117.652 391.537 L
117.763 391.322 L
117.873 391.107 L
117.973 390.912 L
118.083 390.696 L
118.189 390.491 L
118.31 390.255 L
118.415 390.05 L
118.531 389.825 L
118.651 389.589 L
118.762 389.373 L
118.878 389.148 L
118.988 388.932 L
119.109 388.697 L
119.23 388.461 L
119.346 388.235 L
119.456 388.02 L
119.577 387.784 L
119.698 387.548 L
119.814 387.323 L
119.935 387.087 L
120.051 386.861 L
120.166 386.636 L
120.287 386.4 L
120.408 386.164 L
120.529 385.929 L
120.661 385.672 L
120.787 385.426 L
120.903 385.201 L
121.024 384.965 L
121.161 384.699 L
121.282 384.463 L
121.413 384.207 L
121.539 383.961 L
121.671 383.704 L
121.808 383.438 L
121.918 383.223 L
122.049 382.967 L
122.181 382.711 L
122.318 382.444 L
122.444 382.198 L
122.575 381.942 L
122.712 381.676 L
122.854 381.399 L
122.986 381.143 L
123.117 380.887 L
123.243 380.641 L
123.38 380.375 L
123.517 380.108 L
123.659 379.832 L
123.796 379.565 L
123.938 379.289 L
124.069 379.033 L
124.217 378.746 L
124.359 378.47 L
124.49 378.213 L
124.643 377.916 L
124.774 377.66 L
124.916 377.384 L
125.505 376.237 L
125.653 375.951 L
125.779 375.705 L
125.926 375.418 L
126.073 375.131 L
126.221 374.845 L
126.373 374.548 L
126.52 374.261 L
126.673 373.965 L
126.82 373.678 L
126.962 373.402 L
127.11 373.115 L
127.273 372.798 L
127.425 372.501 L
127.562 372.235 L
127.72 371.928 L
127.872 371.631 L
128.025 371.334 L
128.167 371.058 L
128.325 370.751 L
128.493 370.424 L
128.645 370.127 L
128.793 369.84 L
128.951 369.534 L
129.108 369.227 L
129.271 368.91 L
129.424 368.613 L
129.598 368.275 L
129.75 367.979 L
129.903 367.682 L
130.055 367.385 L
130.223 367.058 L
130.392 366.731 L
130.544 366.434 L
130.713 366.107 L
130.876 365.79 L
131.028 365.493 L
131.197 365.166 L
131.36 364.849 L
131.523 364.532 L
131.686 364.215 L
131.859 363.878 L
132.033 363.541 L
132.117 363.377 L
132.28 363.06 L
132.459 362.713 L
132.633 362.375 L
132.817 362.017 L
132.98 361.701 L
133.159 361.353 L
133.332 361.016 L
133.495 360.699 L
133.679 360.341 L
133.848 360.014 L
134.021 359.677 L
134.205 359.319 L
134.379 358.982 L
134.547 358.655 L
134.731 358.298 L
134.915 357.94 L
135.1 357.583 L
135.263 357.266 L
135.447 356.908 L
135.626 356.561 L
135.81 356.204 L
135.994 355.846 L
136.178 355.489 L
136.362 355.131 L
136.541 354.784 L
136.725 354.426 L
136.925 354.038 L
137.114 353.671 L
137.288 353.334 L
137.477 352.966 L
137.661 352.609 L
137.845 352.252 L
138.045 351.864 L
138.234 351.496 L
138.419 351.139 L
138.603 350.782 L
138.797 350.404 L
138.997 350.016 L
139.181 349.659 L
139.376 349.281 L
139.576 348.893 L
139.76 348.536 L
139.954 348.159 L
140.139 347.801 L
140.344 347.404 L
140.538 347.026 L
140.743 346.628 L
140.949 346.23 L
141.149 345.842 L
141.348 345.455 L
141.533 345.098 L
141.738 344.7 L
141.953 344.282 L
142.137 343.925 L
142.337 343.537 L
142.548 343.129 L
142.753 342.732 L
142.947 342.354 L
143.163 341.936 L
143.358 341.559 L
143.563 341.161 L
143.784 340.733 L
143.973 340.366 L
144.194 339.938 L
144.389 339.561 L
144.599 339.153 L
144.815 338.735 L
145.02 338.337 L
145.23 337.93 L
145.441 337.522 L
145.651 337.114 L
145.872 336.686 L
146.077 336.289 L
146.293 335.871 L
146.508 335.453 L
146.714 335.056 L
146.935 334.628 L
147.15 334.211 L
147.371 333.783 L
147.581 333.375 L
147.792 332.968 L
148.013 332.54 L
148.234 332.112 L
148.439 331.715 L
148.66 331.287 L
148.881 330.86 L
149.102 330.432 L
149.328 329.994 L
149.549 329.566 L
149.775 329.129 L
150.001 328.691 L
150.212 328.284 L
150.438 327.846 L
150.669 327.398 L
150.895 326.96 L
151.127 326.512 L
151.358 326.065 L
151.569 325.657 L
151.8 325.21 L
152.031 324.762 L
152.252 324.335 L
152.484 323.887 L
152.705 323.459 L
152.941 323.002 L
153.173 322.554 L
153.404 322.106 L
153.646 321.638 L
153.872 321.201 L
154.104 320.754 L
154.341 320.296 L
154.583 319.828 L
154.809 319.391 L
155.045 318.933 L
155.293 318.455 L
155.524 318.008 L
155.771 317.53 L
155.982 317.123 L
156.224 316.656 L
156.471 316.178 L
156.697 315.741 L
156.955 315.243 L
157.192 314.785 L
157.428 314.328 L
157.959 313.301 L
158.196 312.844 L
158.443 312.367 L
158.67 311.93 L
158.917 311.452 L
159.169 310.965 L
159.401 310.517 L
159.658 310.02 L
159.906 309.542 L
160.148 309.075 L
160.411 308.567 L
160.637 308.131 L
160.884 307.653 L
161.142 307.156 L
161.4 306.658 L
161.652 306.171 L
161.899 305.694 L
162.157 305.196 L
162.409 304.709 L
162.667 304.211 L
162.93 303.704 L
163.183 303.217 L
163.419 302.76 L
163.698 302.222 L
163.924 301.786 L
164.198 301.258 L
164.466 300.74 L
164.713 300.264 L
164.955 299.797 L
165.229 299.269 L
165.739 298.285 L
165.992 297.798 L
166.265 297.271 L
166.518 296.784 L
166.775 296.287 L
167.038 295.78 L
167.291 295.293 L
167.554 294.786 L
167.822 294.269 L
168.106 293.722 L
168.364 293.225 L
168.622 292.728 L
168.879 292.232 L
169.148 291.715 L
169.432 291.167 L
169.689 290.671 L
169.952 290.164 L
170.226 289.637 L
170.499 289.11 L
170.762 288.604 L
171.041 288.067 L
171.32 287.53 L
171.578 287.033 L
171.767 286.669 L
172.04 286.142 L
172.319 285.605 L
172.577 285.109 L
172.872 284.542 L
173.129 284.046 L
173.408 283.509 L
173.687 282.972 L
173.976 282.415 L
174.25 281.889 L
174.534 281.342 L
174.802 280.826 L
175.065 280.32 L
175.365 279.743 L
175.649 279.196 L
175.912 278.69 L
176.212 278.114 L
176.48 277.598 L
176.769 277.041 L
177.206 276.201 L
177.485 275.665 L
177.753 275.149 L
178.047 274.583 L
178.331 274.037 L
178.61 273.501 L
178.905 272.934 L
179.199 272.368 L
179.499 271.792 L
179.773 271.266 L
180.073 270.689 L
180.357 270.144 L
180.641 269.598 L
180.935 269.032 L
181.23 268.466 L
181.524 267.9 L
181.824 267.324 L
182.119 266.758 L
182.413 266.192 L
182.713 265.616 L
182.987 265.09 L
183.271 264.545 L
183.576 263.959 L
183.87 263.393 L
184.175 262.807 L
184.465 262.252 L
184.775 261.656 L
185.438 260.384 L
185.738 259.808 L
186.048 259.212 L
186.342 258.647 L
186.648 258.061 L
186.942 257.496 L
187.247 256.911 L
187.557 256.315 L
187.857 255.74 L
188.152 255.175 L
188.457 254.59 L
188.767 253.994 L
189.078 253.399 L
189.377 252.824 L
189.704 252.198 L
190.009 251.613 L
190.298 251.059 L
190.608 250.464 L
190.913 249.879 L
191.224 249.284 L
191.539 248.679 L
191.86 248.064 L
192.16 247.489 L
192.491 246.854 L
192.786 246.289 L
193.107 245.674 L
193.412 245.09 L
193.738 244.465 L
194.022 243.921 L
194.353 243.286 L
194.669 242.681 L
194.99 242.067 L
195.3 241.472 L
195.632 240.838 L
195.942 240.243 L
196.084 239.971 L
196.389 239.387 L
196.699 238.793 L
197.025 238.168 L
197.362 237.524 L
197.678 236.92 L
197.988 236.326 L
198.319 235.691 L
198.651 235.057 L
198.961 234.463 L
199.277 233.859 L
199.624 233.195 L
199.945 232.581 L
200.276 231.947 L
200.602 231.323 L
200.913 230.73 L
201.228 230.126 L
201.554 229.502 L
201.886 228.868 L
202.212 228.245 L
202.559 227.581 L
202.88 226.967 L
203.206 226.344 L
203.537 225.71 L
203.863 225.087 L
204.221 224.403 L
204.542 223.79 L
204.879 223.147 L
205.21 222.514 L
205.557 221.85 L
206.041 220.926 L
206.362 220.313 L
206.72 219.629 L
207.062 218.976 L
207.393 218.343 L
207.724 217.71 L
208.056 217.077 L
208.387 216.445 L
208.74 215.772 L
209.076 215.129 L
209.413 214.486 L
209.765 213.814 L
210.097 213.181 L
210.454 212.498 L
210.786 211.866 L
211.143 211.183 L
211.485 210.531 L
211.843 209.848 L
212.174 209.216 L
212.537 208.524 L
212.869 207.892 L
213.211 207.239 L
213.542 206.607 L
213.9 205.925 L
214.236 205.283 L
214.599 204.591 L
214.957 203.909 L
215.288 203.277 L
215.662 202.565 L
215.988 201.944 L
216.361 201.232 L
216.724 200.54 L
217.066 199.889 L
217.424 199.207 L
217.787 198.515 L
218.129 197.864 L
218.497 197.163 L
218.844 196.501 L
219.212 195.8 L
219.554 195.149 L
219.922 194.447 L
220.264 193.796 L
220.638 193.085 L
221.001 192.394 L
221.369 191.693 L
221.695 191.072 L
222.053 190.391 L
222.421 189.691 L
222.778 189.01 L
223.152 188.299 L
223.515 187.608 L
223.878 186.918 L
224.246 186.217 L
224.619 185.507 L
224.967 184.846 L
225.508 183.816 L
225.877 183.116 L
226.245 182.415 L
226.613 181.715 L
226.986 181.005 L
227.355 180.305 L
227.728 179.595 L
228.102 178.885 L
228.459 178.205 L
228.827 177.506 L
229.206 176.786 L
229.574 176.086 L
229.937 175.397 L
230.306 174.697 L
230.679 173.988 L
231.063 173.258 L
231.431 172.559 L
231.81 171.839 L
232.183 171.13 L
232.573 170.391 L
232.951 169.672 L
233.33 168.953 L
233.709 168.234 L
234.072 167.545 L
234.429 166.866 L
234.819 166.127 L
235.203 165.399 L
235.592 164.66 L
235.981 163.921 L
236.36 163.203 L
236.733 162.494 L
237.117 161.766 L
237.506 161.028 L
237.885 160.309 L
238.269 159.581 L
238.664 158.833 L
239.048 158.105 L
239.442 157.357 L
239.831 156.619 L
240.2 155.921 L
240.589 155.183 L
240.962 154.476 L
241.357 153.728 L
241.751 152.98 L
242.156 152.213 L
242.525 151.516 L
242.919 150.768 L
243.319 150.011 L
244.066 148.596 L
244.46 147.849 L
244.86 147.092 L
245.265 146.325 L
245.644 145.608 L
246.012 144.911 L
246.417 144.145 L
246.827 143.368 L
247.232 142.602 L
247.632 141.845 L
248.042 141.069 L
248.426 140.342 L
248.805 139.626 L
249.21 138.86 L
249.61 138.104 L
249.92 137.517 L
250.32 136.761 L
250.72 136.005 L
251.13 135.229 L
251.54 134.453 L
251.956 133.668 L
252.355 132.912 L
252.755 132.156 L
253.144 131.421 L
253.565 130.626 L
253.976 129.85 L
254.375 129.095 L
254.796 128.3 L
255.206 127.525 L
255.601 126.78 L
256.027 125.975 L
256.427 125.22 L
256.837 124.446 L
257.253 123.661 L
257.642 122.926 L
258.052 122.152 L
258.473 121.357 L
258.888 120.573 L
259.304 119.789 L
259.73 118.985 L
260.135 118.221 L
260.577 117.387 L
260.971 116.643 L
261.413 115.809 L
261.797 115.085 L
262.234 114.262 L
262.639 113.498 L
263.065 112.695 L
263.496 111.881 L
263.912 111.098 L
264.327 110.315 L
264.774 109.472 L
265.185 108.699 L
265.6 107.916 L
266.016 107.133 L
266.457 106.3 L
267.225 104.853 L
267.641 104.071 L
268.083 103.238 L
268.525 102.406 L
268.935 101.634 L
269.35 100.851 L
269.792 100.02 L
270.234 99.188 L
270.65 98.406 L
271.092 97.574 L
271.507 96.792 L
271.949 95.961 L
272.359 95.189 L
272.806 94.348 L
273.248 93.516 L
273.658 92.745 L
274.1 91.914 L
274.547 91.073 L
274.984 90.252 L
275.4 89.471 L
275.941 88.452 L
276.383 87.621 L
276.825 86.791 L
277.241 86.01 L
277.682 85.18 L
278.129 84.34 L
278.571 83.509 L
279.008 82.689 L
279.455 81.849 L
279.892 81.029 L
280.349 80.17 L
280.791 79.34 L
281.238 78.501 L
281.664 77.701 L
282.106 76.871 L
282.558 76.022 L
282.979 75.232 L
283.437 74.374 L
283.884 73.535 L
284.341 72.676 L
284.941 72.127 L
285.393 71.978 L
285.83 71.998 L
286.288 72.012 L
286.708 72.016 L
287.171 72.017 L
287.629 72.017 L
288.06 72.017 L
288.518 72.017 L
288.986 72.017 L
289.433 72.017 L
289.88 72.017 L
290.327 72.017 L
290.79 72.017 L
291.258 72.017 L
291.721 72.017 L
292.137 72.017 L
292.605 72.017 L
293.073 72.017 L
293.531 72.017 L
293.999 72.017 L
294.467 72.017 L
294.872 72.017 L
295.198 72.017 L
295.672 72.017 L
296.14 72.017 L
296.571 72.017 L
297.044 72.017 L
297.528 72.017 L
297.975 72.017 L
298.423 72.017 L
298.901 72.017 L
299.385 72.017 L
299.853 72.017 L
300.29 72.017 L
300.747 72.017 L
301.237 72.017 L
301.699 72.017 L
302.183 72.017 L
302.599 72.017 L
303.083 72.017 L
303.556 72.017 L
304.035 72.017 L
304.514 72.017 L
304.955 72.017 L
305.671 72.017 L
306.134 72.017 L
306.597 72.017 L
307.091 72.017 L
307.554 72.017 L
308.017 72.017 L
308.474 72.017 L
308.958 72.017 L
309.437 72.017 L
309.889 72.017 L
310.363 72.017 L
310.868 72.017 L
311.325 72.017 L
311.767 72.017 L
312.262 72.017 L
312.724 72.017 L
313.193 72.017 L
313.692 72.017 L
314.155 72.017 L
314.623 72.017 L
315.112 72.017 L
315.575 72.017 L
316.075 72.017 L
316.464 72.017 L
316.89 72.017 L
317.385 72.017 L
317.853 72.017 L
318.353 72.017 L
318.816 72.017 L
319.284 72.017 L
319.789 72.017 L
320.257 72.017 L
320.693 72.017 L
321.193 72.017 L
321.666 72.017 L
322.145 72.017 L
322.645 72.017 L
323.092 72.017 L
323.844 72.017 L
324.302 72.017 L
324.807 72.017 L
325.27 72.017 L
325.732 72.017 L
326.237 72.017 L
326.7 72.017 L
327.2 72.017 L
327.663 72.017 L
328.126 72.017 L
328.62 72.017 L
329.062 72.017 L
329.499 72.017 L
330.014 72.017 L
330.461 72.017 L
330.95 72.017 L
331.418 72.017 L
331.923 72.017 L
332.371 72.017 L
332.833 72.017 L
333.333 72.017 L
333.796 72.017 L
334.264 72.017 L
334.764 72.017 L
335.232 72.017 L
335.674 72.017 L
336.179 72.017 L
336.689 72.017 L
337.126 72.017 L
337.594 72.017 L
338.088 72.017 L
338.567 72.017 L
339.046 72.017 L
339.498 72.017 L
339.982 72.017 L
340.455 72.017 L
340.939 72.017 L
341.418 72.017 L
341.881 72.017 L
342.37 72.017 L
343.175 72.017 L
343.674 72.017 L
344.137 72.017 L
344.605 72.017 L
345.073 72.017 L
345.526 72.017 L
346.01 72.017 L
346.504 72.017 L
346.967 72.017 L
347.43 72.017 L
347.903 72.017 L
348.366 72.017 L
348.871 72.017 L
349.318 72.017 L
349.839 72.017 L
350.281 72.017 L
350.749 72.017 L
351.238 72.017 L
351.701 72.017 L
352.195 72.017 L
352.664 72.017 L
353.132 72.017 L
353.626 72.017 L
354.047 72.017 L
354.547 72.017 L
355.015 72.017 L
355.493 72.017 L
355.988 72.017 L
356.456 72.017 L
356.94 72.017 L
357.235 72.017 L
357.661 72.017 L
358.145 72.017 L
358.623 72.017 L
359.091 72.017 L
359.591 72.017 L
360.054 72.017 L
360.538 72.017 L
361.001 72.017 L
361.479 72.017 L
361.963 72.017 L
362.431 72.017 L
363.305 72.017 L
363.794 72.017 L
364.241 72.017 L
364.725 72.017 L
365.177 72.017 L
365.661 72.017 L
366.134 72.017 L
366.603 72.017 L
367.071 72.017 L
367.56 72.017 L
368.023 72.017 L
368.501 72.017 L
368.98 72.017 L
369.459 72.017 L
369.932 72.017 L
370.395 72.017 L
370.863 72.017 L
371.331 72.017 L
371.784 72.017 L
372.278 72.017 L
372.752 72.017 L
373.225 72.017 L
373.704 72.017 L
374.124 72.017 L
374.645 72.017 L
375.066 72.017 L
375.534 72.017 L
376.018 72.017 L
376.502 72.017 L
376.965 72.017 L
377.422 72.017 L
377.906 72.017 L
378.38 72.017 L
378.843 72.017 L
379.311 72.017 L
379.779 72.017 L
380.247 72.017 L
380.726 72.017 L
381.21 72.017 L
381.651 72.017 L
382.561 72.017 L
383.003 72.017 L
383.466 72.017 L
383.961 72.017 L
384.429 72.017 L
384.897 72.017 L
385.391 72.017 L
385.838 72.017 L
386.328 72.017 L
386.801 72.017 L
387.274 72.017 L
387.753 72.017 L
388.205 72.017 L
388.647 72.017 L
389.131 72.017 L
389.589 72.017 L
390.078 72.017 L
390.562 72.017 L
391.041 72.017 L
391.514 72.017 L
391.935 72.017 L
392.413 72.017 L
392.887 72.017 L
393.366 72.017 L
393.849 72.017 L
394.312 72.017 L
394.807 72.017 L
395.27 72.017 L
395.738 72.017 L
396.201 72.017 L
396.658 72.017 L
397.121 72.017 L
397.616 72.017 L
398.089 72.017 L
398.568 72.017 L
399.009 72.017 L
399.488 72.017 L
399.983 72.017 L
400.419 72.017 L
400.94 72.017 L
401.387 72.017 L
401.839 72.017 L
402.355 72.017 L
402.802 72.017 L
403.239 72.017 L
403.738 72.017 L
404.206 72.017 L
404.932 72.017 L
405.395 72.017 L
405.89 72.017 L
406.352 72.017 L
406.821 72.017 L
407.289 72.017 L
407.767 72.017 L
408.22 72.017 L
408.698 72.017 L
409.151 72.017 L
409.64 72.017 L
410.113 72.017 L
410.603 72.017 L
411.055 72.017 L
411.534 72.017 L
411.991 72.017 L
412.47 72.017 L
412.917 72.017 L
413.233 72.017 L
413.69 72.017 L
414.153 72.017 L
414.621 72.017 L
415.121 72.017 L
415.557 72.017 L
416.047 72.017 L
416.515 72.017 L
416.978 72.017 L
417.462 72.017 L
417.945 72.017 L
418.393 72.017 L
418.882 72.017 L
419.355 72.017 L
419.813 72.017 L
420.297 72.017 L
420.781 72.017 L
421.927 72.017 L
422.406 72.017 L
422.879 72.017 L
423.337 72.017 L
423.826 72.017 L
424.279 72.017 L
424.757 72.017 L
425.204 72.017 L
425.699 72.017 L
426.172 72.017 L
426.635 72.017 L
427.098 72.017 L
427.587 72.017 L
428.05 72.017 L
428.518 72.017 L
429.013 72.017 L
429.454 72.017 L
429.923 72.017 L
430.406 72.017 L
430.875 72.017 L
431.374 72.017 L
431.842 72.017 L
432.305 72.017 L
432.773 72.017 L
433.231 72.017 L
433.704 72.017 L
434.162 72.017 L
434.662 72.017 L
435.114 72.017 L
435.582 72.017 L
436.077 72.017 L
436.545 72.017 L
436.997 72.017 L
437.476 72.017 L
437.934 72.017 L
438.239 72.017 L
438.733 72.017 L
439.201 72.017 L
439.664 72.017 L
440.132 72.017 L
440.621 72.017 L
441.058 72.017 L
441.558 72.017 L
442.021 72.017 L
442.499 72.017 L
442.946 72.017 L
443.441 72.017 L
443.904 72.017 L
444.393 72.017 L
444.845 72.017 L
445.282 72.017 L
445.729 72.017 L
446.202 72.017 L
446.686 72.017 L
447.144 72.017 L
447.628 72.017 L
448.112 72.017 L
448.585 72.017 L
449.032 72.017 L
449.521 72.017 L
449.974 72.017 L
450.426 72.017 L
450.92 72.017 L
451.389 72.017 L
451.872 72.017 L
452.351 72.017 L
452.809 72.017 L
453.582 72.017 L
454.071 72.017 L
454.539 72.017 L
455.007 72.017 L
455.465 72.017 L
455.928 72.017 L
456.433 72.017 L
456.896 72.017 L
457.364 72.017 L
457.827 72.017 L
458.29 72.017 L
458.768 72.017 L
459.247 72.017 L
459.726 72.017 L
460.199 72.017 L
461.162 72.017 L
461.619 72.017 L
462.082 72.017 L
462.561 72.017 L
463.034 72.017 L
463.518 72.017 L
463.986 72.017 L
464.465 72.017 L
464.917 72.017 L
465.38 72.017 L
465.848 72.017 L
466.322 72.017 L
466.8 72.017 L
467.09 72.017 L
467.532 72.017 L
468.01 72.017 L
468.484 72.017 L
468.962 72.017 L
469.436 72.017 L
469.914 72.017 L
470.388 72.017 L
470.861 72.017 L
471.345 72.017 L
471.787 72.017 L
472.592 72.017 L
473.07 72.017 L
473.549 72.017 L
474.022 72.017 L
474.501 72.017 L
474.98 72.017 L
475.453 72.017 L
475.874 72.017 L
476.347 72.017 L
476.826 72.017 L
477.305 72.017 L
477.778 72.017 L
478.257 72.017 L
478.735 72.017 L
479.209 72.017 L
479.63 72.017 L
480.108 72.017 L
480.582 72.017 L
481.065 72.017 L
481.539 72.017 L
482.133 72.017 L
482.612 72.017 L
483.033 72.017 L
483.506 72.017 L
483.985 72.017 L
484.484 72.017 L
484.937 72.017 L
485.405 72.017 L
485.899 72.017 L
486.373 72.017 L
486.83 72.017 L
487.288 72.017 L
487.756 72.017 L
488.219 72.017 L
488.687 72.017 L
489.182 72.017 L
489.639 72.017 L
490.107 72.017 L
490.586 72.017 L
491.06 72.017 L
491.507 72.017 L
491.98 72.017 L
492.474 72.017 L
492.916 72.017 L
493.411 72.017 L
493.895 72.017 L
494.031 72.017 L
494.489 72.017 L
495.004 72.017 L
495.431 72.017 L
495.893 72.017 L
496.388 72.017 L
496.861 72.017 L
497.324 72.017 L
497.792 72.017 L
498.287 72.017 L
498.744 72.017 L
499.186 72.017 L
499.796 72.017 L
500.144 72.017 L
500.612 72.017 L
501.101 72.017 L
501.558 72.017 L
502.027 72.017 L
502.484 72.017 L
503.399 72.017 L
503.847 72.017 L
504.346 72.017 L
504.809 72.017 L
505.272 72.017 L
505.73 72.017 L
506.224 72.017 L
506.676 72.017 L
507.124 72.017 L
507.639 72.017 L
508.097 72.017 L
508.544 72.017 L
509.028 72.017 L
509.512 72.017 L
509.974 72.017 L
510.427 72.017 L
510.921 72.017 L
511.389 72.017 L
511.847 72.017 L
512.315 72.017 L
512.925 72.017 L
513.383 72.017 L
513.856 72.017 L
514.33 72.017 L
514.803 72.017 L
515.282 72.017 L
515.734 72.017 L
516.213 72.017 L
516.665 72.017 L
517.139 72.017 L
517.617 72.017 L
518.096 72.017 L
518.58 72.017 L
519.053 72.017 L
519.527 72.017 L
520.416 72.017 L
520.863 72.017 L
521.341 72.017 L
521.815 72.017 L
522.293 72.017 L
522.762 72.017 L
523.23 72.017 L
523.708 72.017 L
524.161 72.017 L
524.603 72.017 L
525.086 72.017 L
525.555 72.017 L
526.028 72.017 L
526.501 72.017 L
526.991 72.017 L
527.464 72.017 L
527.948 72.017 L
528.384 72.017 L
528.853 72.017 L
529.326 72.017 L
S
GR
%%Trailer
%%Pages: 1
%%EOF
