%!PS-Adobe-3.0 EPSF-3.0
%%Creator: (MATLAB, The Mathworks, Inc. Version 9.11.0.1837725 \(R2021b\) Update 2. Operating System: Windows 10)
%%Title: C:/Users/radac/Downloads/ato-g1_aru-rec_20230316-155745_ARU/data_in_csv/model_s.eps
%%CreationDate: 2023-04-02T15:05:32
%%Pages: (atend)
%%BoundingBox:     0     0   420   315
%%LanguageLevel: 3
%%EndComments
%%BeginProlog
%%BeginResource: procset (Apache XML Graphics Std ProcSet) 1.2 0
%%Version: 1.2 0
%%Copyright: (Copyright 2001-2003,2010 The Apache Software Foundation. License terms: http://www.apache.org/licenses/LICENSE-2.0)
/bd{bind def}bind def
/ld{load def}bd
/GR/grestore ld
/GS/gsave ld
/RM/rmoveto ld
/C/curveto ld
/t/show ld
/L/lineto ld
/ML/setmiterlimit ld
/CT/concat ld
/f/fill ld
/N/newpath ld
/S/stroke ld
/CC/setcmykcolor ld
/A/ashow ld
/cp/closepath ld
/RC/setrgbcolor ld
/LJ/setlinejoin ld
/GC/setgray ld
/LW/setlinewidth ld
/M/moveto ld
/re {4 2 roll M
1 index 0 rlineto
0 exch rlineto
neg 0 rlineto
cp } bd
/_ctm matrix def
/_tm matrix def
/BT { _ctm currentmatrix pop matrix _tm copy pop 0 0 moveto } bd
/ET { _ctm setmatrix } bd
/iTm { _ctm setmatrix _tm concat } bd
/Tm { _tm astore pop iTm 0 0 moveto } bd
/ux 0.0 def
/uy 0.0 def
/F {
  /Tp exch def
  /Tf exch def
  Tf findfont Tp scalefont setfont
  /cf Tf def  /cs Tp def
} bd
/ULS {currentpoint /uy exch def /ux exch def} bd
/ULE {
  /Tcx currentpoint pop def
  gsave
  newpath
  cf findfont cs scalefont dup
  /FontMatrix get 0 get /Ts exch def /FontInfo get dup
  /UnderlinePosition get Ts mul /To exch def
  /UnderlineThickness get Ts mul /Tt exch def
  ux uy To add moveto  Tcx uy To add lineto
  Tt setlinewidth stroke
  grestore
} bd
/OLE {
  /Tcx currentpoint pop def
  gsave
  newpath
  cf findfont cs scalefont dup
  /FontMatrix get 0 get /Ts exch def /FontInfo get dup
  /UnderlinePosition get Ts mul /To exch def
  /UnderlineThickness get Ts mul /Tt exch def
  ux uy To add cs add moveto Tcx uy To add cs add lineto
  Tt setlinewidth stroke
  grestore
} bd
/SOE {
  /Tcx currentpoint pop def
  gsave
  newpath
  cf findfont cs scalefont dup
  /FontMatrix get 0 get /Ts exch def /FontInfo get dup
  /UnderlinePosition get Ts mul /To exch def
  /UnderlineThickness get Ts mul /Tt exch def
  ux uy To add cs 10 mul 26 idiv add moveto Tcx uy To add cs 10 mul 26 idiv add lineto
  Tt setlinewidth stroke
  grestore
} bd
/QT {
/Y22 exch store
/X22 exch store
/Y21 exch store
/X21 exch store
currentpoint
/Y21 load 2 mul add 3 div exch
/X21 load 2 mul add 3 div exch
/X21 load 2 mul /X22 load add 3 div
/Y21 load 2 mul /Y22 load add 3 div
/X22 load /Y22 load curveto
} bd
/SSPD {
dup length /d exch dict def
{
/v exch def
/k exch def
currentpagedevice k known {
/cpdv currentpagedevice k get def
v cpdv ne {
/upd false def
/nullv v type /nulltype eq def
/nullcpdv cpdv type /nulltype eq def
nullv nullcpdv or
{
/upd true def
} {
/sametype v type cpdv type eq def
sametype {
v type /arraytype eq {
/vlen v length def
/cpdvlen cpdv length def
vlen cpdvlen eq {
0 1 vlen 1 sub {
/i exch def
/obj v i get def
/cpdobj cpdv i get def
obj cpdobj ne {
/upd true def
exit
} if
} for
} {
/upd true def
} ifelse
} {
v type /dicttype eq {
v {
/dv exch def
/dk exch def
/cpddv cpdv dk get def
dv cpddv ne {
/upd true def
exit
} if
} forall
} {
/upd true def
} ifelse
} ifelse
} if
} ifelse
upd true eq {
d k v put
} if
} if
} if
} forall
d length 0 gt {
d setpagedevice
} if
} bd
/RE { % /NewFontName [NewEncodingArray] /FontName RE -
  findfont dup length dict begin
  {
    1 index /FID ne
    {def} {pop pop} ifelse
  } forall
  /Encoding exch def
  /FontName 1 index def
  currentdict definefont pop
  end
} bind def
%%EndResource
%%BeginResource: procset (Apache XML Graphics EPS ProcSet) 1.0 0
%%Version: 1.0 0
%%Copyright: (Copyright 2002-2003 The Apache Software Foundation. License terms: http://www.apache.org/licenses/LICENSE-2.0)
/BeginEPSF { %def
/b4_Inc_state save def         % Save state for cleanup
/dict_count countdictstack def % Count objects on dict stack
/op_count count 1 sub def      % Count objects on operand stack
userdict begin                 % Push userdict on dict stack
/showpage { } def              % Redefine showpage, { } = null proc
0 setgray 0 setlinecap         % Prepare graphics state
1 setlinewidth 0 setlinejoin
10 setmiterlimit [ ] 0 setdash newpath
/languagelevel where           % If level not equal to 1 then
{pop languagelevel             % set strokeadjust and
1 ne                           % overprint to their defaults.
{false setstrokeadjust false setoverprint
} if
} if
} bd
/EndEPSF { %def
count op_count sub {pop} repeat            % Clean up stacks
countdictstack dict_count sub {end} repeat
b4_Inc_state restore
} bd
%%EndResource
%FOPBeginFontDict
%%IncludeResource: font Courier-Oblique
%%IncludeResource: font Courier-BoldOblique
%%IncludeResource: font Courier-Bold
%%IncludeResource: font ZapfDingbats
%%IncludeResource: font Symbol
%%IncludeResource: font Helvetica
%%IncludeResource: font Helvetica-Oblique
%%IncludeResource: font Helvetica-Bold
%%IncludeResource: font Helvetica-BoldOblique
%%IncludeResource: font Times-Roman
%%IncludeResource: font Times-Italic
%%IncludeResource: font Times-Bold
%%IncludeResource: font Times-BoldItalic
%%IncludeResource: font Courier
%FOPEndFontDict
%%BeginResource: encoding WinAnsiEncoding
/WinAnsiEncoding [
/.notdef /.notdef /.notdef /.notdef /.notdef
/.notdef /.notdef /.notdef /.notdef /.notdef
/.notdef /.notdef /.notdef /.notdef /.notdef
/.notdef /.notdef /.notdef /.notdef /.notdef
/.notdef /.notdef /.notdef /.notdef /.notdef
/.notdef /.notdef /.notdef /.notdef /.notdef
/.notdef /.notdef /space /exclam /quotedbl
/numbersign /dollar /percent /ampersand /quotesingle
/parenleft /parenright /asterisk /plus /comma
/hyphen /period /slash /zero /one
/two /three /four /five /six
/seven /eight /nine /colon /semicolon
/less /equal /greater /question /at
/A /B /C /D /E
/F /G /H /I /J
/K /L /M /N /O
/P /Q /R /S /T
/U /V /W /X /Y
/Z /bracketleft /backslash /bracketright /asciicircum
/underscore /quoteleft /a /b /c
/d /e /f /g /h
/i /j /k /l /m
/n /o /p /q /r
/s /t /u /v /w
/x /y /z /braceleft /bar
/braceright /asciitilde /bullet /Euro /bullet
/quotesinglbase /florin /quotedblbase /ellipsis /dagger
/daggerdbl /circumflex /perthousand /Scaron /guilsinglleft
/OE /bullet /Zcaron /bullet /bullet
/quoteleft /quoteright /quotedblleft /quotedblright /bullet
/endash /emdash /asciitilde /trademark /scaron
/guilsinglright /oe /bullet /zcaron /Ydieresis
/space /exclamdown /cent /sterling /currency
/yen /brokenbar /section /dieresis /copyright
/ordfeminine /guillemotleft /logicalnot /sfthyphen /registered
/macron /degree /plusminus /twosuperior /threesuperior
/acute /mu /paragraph /middot /cedilla
/onesuperior /ordmasculine /guillemotright /onequarter /onehalf
/threequarters /questiondown /Agrave /Aacute /Acircumflex
/Atilde /Adieresis /Aring /AE /Ccedilla
/Egrave /Eacute /Ecircumflex /Edieresis /Igrave
/Iacute /Icircumflex /Idieresis /Eth /Ntilde
/Ograve /Oacute /Ocircumflex /Otilde /Odieresis
/multiply /Oslash /Ugrave /Uacute /Ucircumflex
/Udieresis /Yacute /Thorn /germandbls /agrave
/aacute /acircumflex /atilde /adieresis /aring
/ae /ccedilla /egrave /eacute /ecircumflex
/edieresis /igrave /iacute /icircumflex /idieresis
/eth /ntilde /ograve /oacute /ocircumflex
/otilde /odieresis /divide /oslash /ugrave
/uacute /ucircumflex /udieresis /yacute /thorn
/ydieresis
] def
%%EndResource
%FOPBeginFontReencode
/Courier-Oblique findfont
dup length dict begin
  {1 index /FID ne {def} {pop pop} ifelse} forall
  /Encoding WinAnsiEncoding def
  currentdict
end
/Courier-Oblique exch definefont pop
/Courier-BoldOblique findfont
dup length dict begin
  {1 index /FID ne {def} {pop pop} ifelse} forall
  /Encoding WinAnsiEncoding def
  currentdict
end
/Courier-BoldOblique exch definefont pop
/Courier-Bold findfont
dup length dict begin
  {1 index /FID ne {def} {pop pop} ifelse} forall
  /Encoding WinAnsiEncoding def
  currentdict
end
/Courier-Bold exch definefont pop
/Helvetica findfont
dup length dict begin
  {1 index /FID ne {def} {pop pop} ifelse} forall
  /Encoding WinAnsiEncoding def
  currentdict
end
/Helvetica exch definefont pop
/Helvetica-Oblique findfont
dup length dict begin
  {1 index /FID ne {def} {pop pop} ifelse} forall
  /Encoding WinAnsiEncoding def
  currentdict
end
/Helvetica-Oblique exch definefont pop
/Helvetica-Bold findfont
dup length dict begin
  {1 index /FID ne {def} {pop pop} ifelse} forall
  /Encoding WinAnsiEncoding def
  currentdict
end
/Helvetica-Bold exch definefont pop
/Helvetica-BoldOblique findfont
dup length dict begin
  {1 index /FID ne {def} {pop pop} ifelse} forall
  /Encoding WinAnsiEncoding def
  currentdict
end
/Helvetica-BoldOblique exch definefont pop
/Times-Roman findfont
dup length dict begin
  {1 index /FID ne {def} {pop pop} ifelse} forall
  /Encoding WinAnsiEncoding def
  currentdict
end
/Times-Roman exch definefont pop
/Times-Italic findfont
dup length dict begin
  {1 index /FID ne {def} {pop pop} ifelse} forall
  /Encoding WinAnsiEncoding def
  currentdict
end
/Times-Italic exch definefont pop
/Times-Bold findfont
dup length dict begin
  {1 index /FID ne {def} {pop pop} ifelse} forall
  /Encoding WinAnsiEncoding def
  currentdict
end
/Times-Bold exch definefont pop
/Times-BoldItalic findfont
dup length dict begin
  {1 index /FID ne {def} {pop pop} ifelse} forall
  /Encoding WinAnsiEncoding def
  currentdict
end
/Times-BoldItalic exch definefont pop
/Courier findfont
dup length dict begin
  {1 index /FID ne {def} {pop pop} ifelse} forall
  /Encoding WinAnsiEncoding def
  currentdict
end
/Courier exch definefont pop
%FOPEndFontReencode
%%EndProlog
%%Page: 1 1
%%PageBoundingBox: 0 0 420 315
%%BeginPageSetup
[1 0 0 -1 0 315] CT
%%EndPageSetup
GS
[0.6 0 0 0.6 0 0] CT
1 GC
N
0 0 700 525 re
f
GR
GS
[0.6 0 0 0.6 0 0] CT
1 GC
N
0 0 700 525 re
f
GR
GS
[0.6 0 0 0.6 0 0] CT
1 GC
N
91 467 M
634 467 L
634 39 L
91 39 L
cp
f
GR
GS
[0.6 0 0 0.6 0 0] CT
0.149 GC
2 setlinecap
1 LJ
0.833 LW
N
91 467 M
634 467 L
S
GR
GS
[0.6 0 0 0.6 0 0] CT
0.149 GC
2 setlinecap
1 LJ
0.833 LW
N
91 39 M
634 39 L
S
GR
GS
[0.6 0 0 0.6 0 0] CT
0.149 GC
2 setlinecap
1 LJ
0.833 LW
N
91 467 M
91 461.57 L
S
GR
GS
[0.6 0 0 0.6 0 0] CT
0.149 GC
2 setlinecap
1 LJ
0.833 LW
N
168.571 467 M
168.571 461.57 L
S
GR
GS
[0.6 0 0 0.6 0 0] CT
0.149 GC
2 setlinecap
1 LJ
0.833 LW
N
246.143 467 M
246.143 461.57 L
S
GR
GS
[0.6 0 0 0.6 0 0] CT
0.149 GC
2 setlinecap
1 LJ
0.833 LW
N
323.714 467 M
323.714 461.57 L
S
GR
GS
[0.6 0 0 0.6 0 0] CT
0.149 GC
2 setlinecap
1 LJ
0.833 LW
N
401.286 467 M
401.286 461.57 L
S
GR
GS
[0.6 0 0 0.6 0 0] CT
0.149 GC
2 setlinecap
1 LJ
0.833 LW
N
478.857 467 M
478.857 461.57 L
S
GR
GS
[0.6 0 0 0.6 0 0] CT
0.149 GC
2 setlinecap
1 LJ
0.833 LW
N
556.429 467 M
556.429 461.57 L
S
GR
GS
[0.6 0 0 0.6 0 0] CT
0.149 GC
2 setlinecap
1 LJ
0.833 LW
N
634 467 M
634 461.57 L
S
GR
GS
[0.6 0 0 0.6 0 0] CT
0.149 GC
2 setlinecap
1 LJ
0.833 LW
N
91 39 M
91 44.43 L
S
GR
GS
[0.6 0 0 0.6 0 0] CT
0.149 GC
2 setlinecap
1 LJ
0.833 LW
N
168.571 39 M
168.571 44.43 L
S
GR
GS
[0.6 0 0 0.6 0 0] CT
0.149 GC
2 setlinecap
1 LJ
0.833 LW
N
246.143 39 M
246.143 44.43 L
S
GR
GS
[0.6 0 0 0.6 0 0] CT
0.149 GC
2 setlinecap
1 LJ
0.833 LW
N
323.714 39 M
323.714 44.43 L
S
GR
GS
[0.6 0 0 0.6 0 0] CT
0.149 GC
2 setlinecap
1 LJ
0.833 LW
N
401.286 39 M
401.286 44.43 L
S
GR
GS
[0.6 0 0 0.6 0 0] CT
0.149 GC
2 setlinecap
1 LJ
0.833 LW
N
478.857 39 M
478.857 44.43 L
S
GR
GS
[0.6 0 0 0.6 0 0] CT
0.149 GC
2 setlinecap
1 LJ
0.833 LW
N
556.429 39 M
556.429 44.43 L
S
GR
GS
[0.6 0 0 0.6 0 0] CT
0.149 GC
2 setlinecap
1 LJ
0.833 LW
N
634 39 M
634 44.43 L
S
GR
GS
[0.6 0 0 0.6 54.6 284.20047] CT
0.149 GC
/Helvetica 16.667 F
GS
[1 0 0 1 0 0] CT
-5 17 moveto 
1 -1 scale
(0) t 
GR
GR
GS
[0.6 0 0 0.6 101.14286 284.20047] CT
0.149 GC
/Helvetica 16.667 F
GS
[1 0 0 1 0 0] CT
-14 17 moveto 
1 -1 scale
(200) t 
GR
GR
GS
[0.6 0 0 0.6 147.68571 284.20047] CT
0.149 GC
/Helvetica 16.667 F
GS
[1 0 0 1 0 0] CT
-14 17 moveto 
1 -1 scale
(400) t 
GR
GR
GS
[0.6 0 0 0.6 194.22858 284.20047] CT
0.149 GC
/Helvetica 16.667 F
GS
[1 0 0 1 0 0] CT
-14 17 moveto 
1 -1 scale
(600) t 
GR
GR
GS
[0.6 0 0 0.6 240.77142 284.20047] CT
0.149 GC
/Helvetica 16.667 F
GS
[1 0 0 1 0 0] CT
-14 17 moveto 
1 -1 scale
(800) t 
GR
GR
GS
[0.6 0 0 0.6 287.31429 284.20047] CT
0.149 GC
/Helvetica 16.667 F
GS
[1 0 0 1 0 0] CT
-19 17 moveto 
1 -1 scale
(1000) t 
GR
GR
GS
[0.6 0 0 0.6 333.85715 284.20047] CT
0.149 GC
/Helvetica 16.667 F
GS
[1 0 0 1 0 0] CT
-19 17 moveto 
1 -1 scale
(1200) t 
GR
GR
GS
[0.6 0 0 0.6 380.4 284.20047] CT
0.149 GC
/Helvetica 16.667 F
GS
[1 0 0 1 0 0] CT
-19 17 moveto 
1 -1 scale
(1400) t 
GR
GR
GS
[0.6 0 0 0.6 217.50016 297.80083] CT
0.149 GC
/Helvetica 18.333 F
GS
[1 0 0 1 0 0] CT
-35 19 moveto 
1 -1 scale
(index [~]) t 
GR
GR
GS
[0.6 0 0 0.6 0 0] CT
0.149 GC
2 setlinecap
1 LJ
0.833 LW
N
91 467 M
91 39 L
S
GR
GS
[0.6 0 0 0.6 0 0] CT
0.149 GC
2 setlinecap
1 LJ
0.833 LW
N
634 467 M
634 39 L
S
GR
GS
[0.6 0 0 0.6 0 0] CT
0.149 GC
2 setlinecap
1 LJ
0.833 LW
N
91 467 M
96.43 467 L
S
GR
GS
[0.6 0 0 0.6 0 0] CT
0.149 GC
2 setlinecap
1 LJ
0.833 LW
N
91 424.2 M
96.43 424.2 L
S
GR
GS
[0.6 0 0 0.6 0 0] CT
0.149 GC
2 setlinecap
1 LJ
0.833 LW
N
91 381.4 M
96.43 381.4 L
S
GR
GS
[0.6 0 0 0.6 0 0] CT
0.149 GC
2 setlinecap
1 LJ
0.833 LW
N
91 338.6 M
96.43 338.6 L
S
GR
GS
[0.6 0 0 0.6 0 0] CT
0.149 GC
2 setlinecap
1 LJ
0.833 LW
N
91 295.8 M
96.43 295.8 L
S
GR
GS
[0.6 0 0 0.6 0 0] CT
0.149 GC
2 setlinecap
1 LJ
0.833 LW
N
91 253 M
96.43 253 L
S
GR
GS
[0.6 0 0 0.6 0 0] CT
0.149 GC
2 setlinecap
1 LJ
0.833 LW
N
91 210.2 M
96.43 210.2 L
S
GR
GS
[0.6 0 0 0.6 0 0] CT
0.149 GC
2 setlinecap
1 LJ
0.833 LW
N
91 167.4 M
96.43 167.4 L
S
GR
GS
[0.6 0 0 0.6 0 0] CT
0.149 GC
2 setlinecap
1 LJ
0.833 LW
N
91 124.6 M
96.43 124.6 L
S
GR
GS
[0.6 0 0 0.6 0 0] CT
0.149 GC
2 setlinecap
1 LJ
0.833 LW
N
91 81.8 M
96.43 81.8 L
S
GR
GS
[0.6 0 0 0.6 0 0] CT
0.149 GC
2 setlinecap
1 LJ
0.833 LW
N
91 39 M
96.43 39 L
S
GR
GS
[0.6 0 0 0.6 0 0] CT
0.149 GC
2 setlinecap
1 LJ
0.833 LW
N
634 467 M
628.57 467 L
S
GR
GS
[0.6 0 0 0.6 0 0] CT
0.149 GC
2 setlinecap
1 LJ
0.833 LW
N
634 424.2 M
628.57 424.2 L
S
GR
GS
[0.6 0 0 0.6 0 0] CT
0.149 GC
2 setlinecap
1 LJ
0.833 LW
N
634 381.4 M
628.57 381.4 L
S
GR
GS
[0.6 0 0 0.6 0 0] CT
0.149 GC
2 setlinecap
1 LJ
0.833 LW
N
634 338.6 M
628.57 338.6 L
S
GR
GS
[0.6 0 0 0.6 0 0] CT
0.149 GC
2 setlinecap
1 LJ
0.833 LW
N
634 295.8 M
628.57 295.8 L
S
GR
GS
[0.6 0 0 0.6 0 0] CT
0.149 GC
2 setlinecap
1 LJ
0.833 LW
N
634 253 M
628.57 253 L
S
GR
GS
[0.6 0 0 0.6 0 0] CT
0.149 GC
2 setlinecap
1 LJ
0.833 LW
N
634 210.2 M
628.57 210.2 L
S
GR
GS
[0.6 0 0 0.6 0 0] CT
0.149 GC
2 setlinecap
1 LJ
0.833 LW
N
634 167.4 M
628.57 167.4 L
S
GR
GS
[0.6 0 0 0.6 0 0] CT
0.149 GC
2 setlinecap
1 LJ
0.833 LW
N
634 124.6 M
628.57 124.6 L
S
GR
GS
[0.6 0 0 0.6 0 0] CT
0.149 GC
2 setlinecap
1 LJ
0.833 LW
N
634 81.8 M
628.57 81.8 L
S
GR
GS
[0.6 0 0 0.6 0 0] CT
0.149 GC
2 setlinecap
1 LJ
0.833 LW
N
634 39 M
628.57 39 L
S
GR
GS
[0.6 0 0 0.6 50.6 280.2] CT
0.149 GC
/Helvetica 16.667 F
GS
[1 0 0 1 0 0] CT
-33 6.5 moveto 
1 -1 scale
(7.53) t 
GR
GR
GS
[0.6 0 0 0.6 50.6 254.52001] CT
0.149 GC
/Helvetica 16.667 F
GS
[1 0 0 1 0 0] CT
-33 6.5 moveto 
1 -1 scale
(7.54) t 
GR
GR
GS
[0.6 0 0 0.6 50.6 228.84] CT
0.149 GC
/Helvetica 16.667 F
GS
[1 0 0 1 0 0] CT
-33 6.5 moveto 
1 -1 scale
(7.55) t 
GR
GR
GS
[0.6 0 0 0.6 50.6 203.16] CT
0.149 GC
/Helvetica 16.667 F
GS
[1 0 0 1 0 0] CT
-33 6.5 moveto 
1 -1 scale
(7.56) t 
GR
GR
GS
[0.6 0 0 0.6 50.6 177.47999] CT
0.149 GC
/Helvetica 16.667 F
GS
[1 0 0 1 0 0] CT
-33 6.5 moveto 
1 -1 scale
(7.57) t 
GR
GR
GS
[0.6 0 0 0.6 50.6 151.8] CT
0.149 GC
/Helvetica 16.667 F
GS
[1 0 0 1 0 0] CT
-33 6.5 moveto 
1 -1 scale
(7.58) t 
GR
GR
GS
[0.6 0 0 0.6 50.6 126.12] CT
0.149 GC
/Helvetica 16.667 F
GS
[1 0 0 1 0 0] CT
-33 6.5 moveto 
1 -1 scale
(7.59) t 
GR
GR
GS
[0.6 0 0 0.6 50.6 100.44] CT
0.149 GC
/Helvetica 16.667 F
GS
[1 0 0 1 0 0] CT
-24 6.5 moveto 
1 -1 scale
(7.6) t 
GR
GR
GS
[0.6 0 0 0.6 50.6 74.76] CT
0.149 GC
/Helvetica 16.667 F
GS
[1 0 0 1 0 0] CT
-33 6.5 moveto 
1 -1 scale
(7.61) t 
GR
GR
GS
[0.6 0 0 0.6 50.6 49.08] CT
0.149 GC
/Helvetica 16.667 F
GS
[1 0 0 1 0 0] CT
-33 6.5 moveto 
1 -1 scale
(7.62) t 
GR
GR
GS
[0.6 0 0 0.6 50.6 23.4] CT
0.149 GC
/Helvetica 16.667 F
GS
[1 0 0 1 0 0] CT
-33 6.5 moveto 
1 -1 scale
(7.63) t 
GR
GR
GS
[0 -0.6 0.6 0 27.8 151.8] CT
0.149 GC
/Helvetica 18.333 F
GS
[1 0 0 1 0 0] CT
-20 -5 moveto 
1 -1 scale
(s [m]) t 
GR
GR
GS
[0.6 0 0 0.6 54.6 21] CT
0.149 GC
N
2.5 -0.484 M
2.5 -0.625 2.578 -0.734 QT
6.125 -4.25 L
2.578 -7.781 L
2.5 -7.875 2.5 -8.016 QT
2.5 -8.141 2.602 -8.242 QT
2.703 -8.344 2.844 -8.344 QT
2.953 -8.344 3.094 -8.25 QT
6.609 -4.719 L
10.125 -8.25 L
10.266 -8.344 10.375 -8.344 QT
10.516 -8.344 10.609 -8.25 QT
10.703 -8.156 10.703 -8.016 QT
10.703 -7.875 10.625 -7.781 QT
7.094 -4.25 L
10.625 -0.734 L
10.703 -0.625 10.703 -0.484 QT
10.703 -0.344 10.609 -0.25 QT
10.516 -0.156 10.375 -0.156 QT
10.25 -0.156 10.125 -0.281 QT
6.609 -3.781 L
3.094 -0.281 L
2.969 -0.156 2.844 -0.156 QT
2.703 -0.156 2.602 -0.258 QT
2.5 -0.359 2.5 -0.484 QT
cp
f
GR
GS
[0.6 0 0 0.6 62.4 21] CT
0.149 GC
/Helvetica 16.667 F
GS
[1 0 0 1 0 0] CT
0 0 moveto 
1 -1 scale
(10) t 
GR
GR
GS
[0.6 0 0 0.6 73.8 16.2] CT
0.149 GC
/Helvetica 13.333 F
GS
[1 0 0 1 0 0] CT
0 0 moveto 
1 -1 scale
(4) t 
GR
GR
GS
[0.6 0 0 0.6 0 0] CT
0 0.447 0.741 RC
1 LJ
3.333 LW
N
91.388 426.681 M
91.776 426.681 L
92.164 426.681 L
92.551 426.681 L
92.939 426.681 L
93.327 426.681 L
93.715 426.681 L
94.103 426.681 L
94.491 426.681 L
94.879 426.681 L
95.266 426.681 L
95.654 426.681 L
96.042 426.681 L
96.43 426.681 L
96.818 426.681 L
97.206 426.681 L
97.594 426.681 L
97.981 426.681 L
98.369 426.681 L
98.757 426.678 L
99.145 426.674 L
99.533 426.671 L
99.921 426.671 L
100.309 426.664 L
100.696 426.661 L
101.084 426.658 L
101.472 426.651 L
101.86 426.648 L
102.248 426.638 L
102.636 426.634 L
103.024 426.628 L
103.411 426.621 L
103.799 426.611 L
104.187 426.604 L
104.575 426.597 L
104.963 426.587 L
105.351 426.574 L
105.739 426.564 L
106.126 426.554 L
106.514 426.547 L
106.902 426.537 L
107.29 426.524 L
107.678 426.507 L
108.066 426.497 L
108.454 426.484 L
108.841 426.474 L
109.229 426.46 L
109.617 426.44 L
110.005 426.43 L
110.393 426.417 L
110.781 426.4 L
111.169 426.38 L
111.556 426.36 L
111.944 426.347 L
112.332 426.333 L
112.72 426.317 L
113.108 426.293 L
113.496 426.273 L
113.884 426.253 L
114.271 426.236 L
114.659 426.22 L
115.047 426.196 L
115.435 426.173 L
115.823 426.153 L
116.211 426.136 L
116.599 426.113 L
116.986 426.083 L
117.374 426.059 L
117.762 426.039 L
118.15 426.019 L
118.538 425.996 L
118.926 425.966 L
119.314 425.935 L
119.701 425.912 L
120.089 425.889 L
120.477 425.865 L
120.865 425.838 L
121.253 425.802 L
121.641 425.778 L
122.029 425.755 L
122.416 425.725 L
122.804 425.688 L
123.192 425.655 L
123.58 425.628 L
123.968 425.604 L
124.356 425.574 L
124.744 425.538 L
125.131 425.501 L
125.519 425.467 L
125.907 425.441 L
126.295 425.41 L
126.683 425.377 L
127.071 425.334 L
127.459 425.303 L
127.846 425.273 L
128.234 425.237 L
128.622 425.193 L
129.01 425.153 L
129.398 425.12 L
129.786 425.089 L
130.174 425.053 L
130.561 425.009 L
130.949 424.962 L
131.337 424.926 L
131.725 424.892 L
132.113 424.859 L
132.501 424.815 L
132.889 424.765 L
133.276 424.728 L
133.664 424.695 L
134.052 424.648 L
134.44 424.598 L
134.828 424.551 L
135.216 424.511 L
135.604 424.478 L
135.991 424.434 L
136.379 424.381 L
136.767 424.327 L
137.155 424.284 L
137.543 424.247 L
137.931 424.207 L
138.319 424.157 L
138.706 424.096 L
139.094 424.056 L
139.482 424.013 L
139.87 423.963 L
140.258 423.902 L
140.646 423.849 L
141.034 423.805 L
141.421 423.762 L
141.809 423.715 L
142.197 423.655 L
142.585 423.591 L
142.973 423.541 L
143.361 423.498 L
143.749 423.451 L
144.136 423.394 L
144.524 423.331 L
144.912 423.28 L
145.3 423.234 L
145.688 423.177 L
146.076 423.107 L
146.464 423.046 L
146.851 422.996 L
147.239 422.949 L
147.627 422.896 L
148.015 422.826 L
148.403 422.759 L
148.791 422.699 L
149.179 422.652 L
149.566 422.598 L
149.954 422.535 L
150.342 422.461 L
150.73 422.408 L
151.118 422.354 L
151.506 422.287 L
151.894 422.214 L
152.281 422.144 L
152.669 422.09 L
153.057 422.037 L
153.445 421.976 L
153.833 421.9 L
154.221 421.823 L
154.609 421.759 L
154.996 421.706 L
155.384 421.649 L
155.772 421.575 L
156.16 421.495 L
156.548 421.435 L
156.936 421.375 L
157.324 421.304 L
157.711 421.221 L
158.099 421.144 L
158.487 421.08 L
158.875 421.023 L
159.263 420.957 L
159.651 420.873 L
160.039 420.789 L
160.426 420.719 L
160.814 420.659 L
161.202 420.595 L
161.59 420.515 L
161.978 420.428 L
162.366 420.361 L
162.754 420.298 L
163.141 420.218 L
163.529 420.127 L
163.917 420.044 L
164.305 419.974 L
164.693 419.913 L
165.081 419.836 L
165.469 419.746 L
165.856 419.656 L
166.244 419.579 L
166.632 419.512 L
167.02 419.442 L
167.408 419.358 L
167.796 419.261 L
168.184 419.188 L
168.571 419.117 L
168.959 419.031 L
169.347 418.934 L
169.735 418.843 L
170.123 418.77 L
170.511 418.7 L
170.899 418.619 L
171.286 418.522 L
171.674 418.422 L
172.062 418.338 L
172.45 418.268 L
172.838 418.191 L
173.226 418.101 L
173.614 417.994 L
174.001 417.917 L
174.389 417.84 L
174.777 417.747 L
175.165 417.64 L
175.553 417.543 L
175.941 417.462 L
176.329 417.389 L
176.716 417.302 L
177.104 417.195 L
177.492 417.088 L
177.88 416.998 L
178.268 416.921 L
178.656 416.84 L
179.044 416.74 L
179.431 416.626 L
179.819 416.546 L
180.207 416.463 L
180.595 416.362 L
180.983 416.249 L
181.371 416.142 L
181.759 416.058 L
182.146 415.978 L
182.534 415.884 L
182.922 415.77 L
183.31 415.653 L
183.698 415.556 L
184.086 415.476 L
184.474 415.389 L
184.861 415.282 L
185.249 415.162 L
185.637 415.075 L
186.025 414.985 L
186.413 414.878 L
186.801 414.754 L
187.189 414.644 L
187.576 414.553 L
187.964 414.466 L
188.352 414.366 L
188.74 414.246 L
189.128 414.122 L
189.516 414.018 L
189.904 413.931 L
190.291 413.841 L
190.679 413.727 L
191.067 413.597 L
191.455 413.503 L
191.843 413.41 L
192.231 413.293 L
192.619 413.162 L
193.006 413.045 L
193.394 412.948 L
193.782 412.858 L
194.17 412.751 L
194.558 412.621 L
194.946 412.49 L
195.334 412.38 L
195.721 412.29 L
196.109 412.193 L
196.497 412.069 L
196.885 411.932 L
197.273 411.831 L
197.661 411.731 L
198.049 411.611 L
198.436 411.474 L
198.824 411.347 L
199.212 411.243 L
199.6 411.146 L
199.988 411.036 L
200.376 410.899 L
200.764 410.758 L
201.151 410.644 L
201.539 410.544 L
201.927 410.44 L
202.315 410.313 L
202.703 410.17 L
203.091 410.063 L
203.479 409.956 L
203.866 409.829 L
204.254 409.681 L
204.642 409.548 L
205.03 409.441 L
205.418 409.337 L
205.806 409.22 L
206.194 409.076 L
206.581 408.929 L
206.969 408.805 L
207.357 408.702 L
207.745 408.595 L
208.133 408.458 L
208.521 408.304 L
208.909 408.193 L
209.296 408.083 L
209.684 407.946 L
210.072 407.792 L
210.46 407.652 L
210.848 407.538 L
211.236 407.431 L
211.624 407.304 L
212.011 407.154 L
212.399 407 L
212.787 406.869 L
213.175 406.762 L
213.563 406.645 L
213.951 406.505 L
214.339 406.341 L
214.726 406.224 L
215.114 406.107 L
215.502 405.967 L
215.89 405.803 L
216.278 405.656 L
216.666 405.535 L
217.054 405.422 L
217.441 405.291 L
217.829 405.131 L
218.217 404.97 L
218.605 404.833 L
218.993 404.719 L
219.381 404.599 L
219.769 404.452 L
220.156 404.281 L
220.544 404.158 L
220.932 404.034 L
221.32 403.883 L
221.708 403.716 L
222.096 403.559 L
222.484 403.432 L
222.871 403.315 L
223.259 403.178 L
223.647 403.011 L
224.035 402.84 L
224.423 402.7 L
224.811 402.579 L
225.199 402.452 L
225.586 402.298 L
225.974 402.118 L
226.362 401.991 L
226.75 401.86 L
227.138 401.707 L
227.526 401.526 L
227.914 401.366 L
228.301 401.232 L
228.689 401.111 L
229.077 400.968 L
229.465 400.79 L
229.853 400.613 L
230.241 400.466 L
230.629 400.339 L
231.016 400.209 L
231.404 400.045 L
231.792 399.858 L
232.18 399.724 L
232.568 399.59 L
232.956 399.426 L
233.344 399.242 L
233.731 399.072 L
234.119 398.935 L
234.507 398.804 L
234.895 398.654 L
235.283 398.473 L
235.671 398.286 L
236.059 398.132 L
236.446 398.002 L
236.834 397.865 L
237.222 397.694 L
237.61 397.5 L
237.998 397.36 L
238.386 397.219 L
238.774 397.049 L
239.161 396.855 L
239.549 396.678 L
239.937 396.534 L
240.325 396.4 L
240.713 396.243 L
241.101 396.056 L
241.489 395.862 L
241.876 395.698 L
242.264 395.564 L
242.652 395.42 L
243.04 395.243 L
243.428 395.043 L
243.816 394.895 L
244.204 394.748 L
244.591 394.571 L
244.979 394.37 L
245.367 394.186 L
245.755 394.036 L
246.143 393.899 L
246.531 393.735 L
246.919 393.538 L
247.306 393.337 L
247.694 393.17 L
248.082 393.026 L
248.47 392.879 L
248.858 392.695 L
249.246 392.485 L
249.634 392.334 L
250.021 392.18 L
250.409 391.996 L
250.797 391.786 L
251.185 391.595 L
251.573 391.441 L
251.961 391.297 L
252.349 391.127 L
252.736 390.923 L
253.124 390.712 L
253.512 390.538 L
253.9 390.391 L
254.288 390.238 L
254.676 390.047 L
255.064 389.83 L
255.451 389.672 L
255.839 389.512 L
256.227 389.321 L
256.615 389.104 L
257.003 388.907 L
257.391 388.746 L
257.779 388.596 L
258.166 388.419 L
258.554 388.208 L
258.942 387.991 L
259.33 387.81 L
259.718 387.659 L
260.106 387.499 L
260.494 387.298 L
260.881 387.074 L
261.269 386.91 L
261.657 386.747 L
262.045 386.549 L
262.433 386.322 L
262.821 386.118 L
263.209 385.951 L
263.596 385.797 L
263.984 385.613 L
264.372 385.392 L
264.76 385.168 L
265.148 384.981 L
265.536 384.824 L
265.924 384.66 L
266.311 384.453 L
266.699 384.219 L
267.087 384.052 L
267.475 383.881 L
267.863 383.677 L
268.251 383.443 L
268.639 383.232 L
269.026 383.059 L
269.414 382.898 L
269.802 382.711 L
270.19 382.48 L
270.578 382.249 L
270.966 382.055 L
271.354 381.895 L
271.741 381.721 L
272.129 381.51 L
272.517 381.266 L
272.905 381.092 L
273.293 380.918 L
273.681 380.708 L
274.069 380.464 L
274.456 380.246 L
274.844 380.066 L
275.232 379.902 L
275.62 379.708 L
276.008 379.471 L
276.396 379.23 L
276.784 379.033 L
277.171 378.862 L
277.559 378.685 L
277.947 378.468 L
278.335 378.217 L
278.723 378.036 L
279.111 377.856 L
279.499 377.638 L
279.886 377.388 L
280.274 377.16 L
280.662 376.976 L
281.05 376.806 L
281.438 376.605 L
281.826 376.361 L
282.214 376.114 L
282.601 375.91 L
282.989 375.736 L
283.377 375.552 L
283.765 375.324 L
284.153 375.067 L
284.541 374.883 L
284.929 374.696 L
285.316 374.468 L
285.704 374.214 L
286.092 373.98 L
286.48 373.79 L
286.868 373.612 L
287.256 373.405 L
287.644 373.154 L
288.031 372.897 L
288.419 372.686 L
288.807 372.509 L
289.195 372.318 L
289.583 372.084 L
289.971 371.82 L
290.359 371.63 L
290.746 371.436 L
291.134 371.205 L
291.522 370.941 L
291.91 370.697 L
292.298 370.503 L
292.686 370.319 L
293.074 370.108 L
293.461 369.847 L
293.849 369.587 L
294.237 369.366 L
294.625 369.182 L
295.013 368.988 L
295.401 368.747 L
295.789 368.473 L
296.176 368.276 L
296.564 368.078 L
296.952 367.841 L
297.34 367.567 L
297.728 367.319 L
298.116 367.119 L
298.504 366.928 L
298.891 366.711 L
299.279 366.443 L
299.667 366.173 L
300.055 365.949 L
300.443 365.758 L
300.831 365.561 L
301.219 365.313 L
301.606 365.029 L
301.994 364.828 L
302.382 364.624 L
302.77 364.377 L
303.158 364.096 L
303.546 363.842 L
303.934 363.635 L
304.321 363.441 L
304.709 363.217 L
305.097 362.943 L
305.485 362.665 L
305.873 362.431 L
306.261 362.237 L
306.649 362.033 L
307.036 361.779 L
307.424 361.488 L
307.812 361.281 L
308.2 361.07 L
308.588 360.816 L
308.976 360.528 L
309.364 360.267 L
309.751 360.053 L
310.139 359.856 L
310.527 359.622 L
310.915 359.341 L
311.303 359.057 L
311.691 358.816 L
312.079 358.619 L
312.466 358.405 L
312.854 358.144 L
313.242 357.847 L
313.63 357.633 L
314.018 357.419 L
314.406 357.158 L
314.794 356.864 L
315.181 356.593 L
315.569 356.375 L
315.957 356.171 L
316.345 355.934 L
316.733 355.643 L
317.121 355.349 L
317.509 355.105 L
317.896 354.901 L
318.284 354.683 L
318.672 354.416 L
319.06 354.108 L
319.448 353.891 L
319.836 353.67 L
320.224 353.403 L
320.611 353.099 L
320.999 352.821 L
321.387 352.597 L
321.775 352.39 L
322.163 352.146 L
322.551 351.848 L
322.939 351.547 L
323.326 351.296 L
323.714 351.086 L
324.102 350.862 L
324.49 350.587 L
324.878 350.273 L
325.266 350.049 L
325.654 349.822 L
326.041 349.547 L
326.429 349.236 L
326.817 348.952 L
327.205 348.722 L
327.593 348.508 L
327.981 348.257 L
328.369 347.956 L
328.756 347.645 L
329.144 347.387 L
329.532 347.173 L
329.92 346.943 L
330.308 346.662 L
330.696 346.341 L
331.084 346.11 L
331.471 345.876 L
331.859 345.595 L
332.247 345.277 L
332.635 344.987 L
333.023 344.749 L
333.411 344.528 L
333.799 344.274 L
334.186 343.963 L
334.574 343.646 L
334.962 343.382 L
335.35 343.161 L
335.738 342.927 L
336.126 342.636 L
336.514 342.308 L
336.901 342.071 L
337.289 341.833 L
337.677 341.546 L
338.065 341.218 L
338.453 340.921 L
338.841 340.676 L
339.229 340.452 L
339.616 340.188 L
340.004 339.871 L
340.392 339.546 L
340.78 339.275 L
341.168 339.048 L
341.556 338.811 L
341.944 338.513 L
342.331 338.175 L
342.719 337.935 L
343.107 337.69 L
343.495 337.396 L
343.883 337.059 L
344.271 336.754 L
344.659 336.507 L
345.046 336.276 L
345.434 336.009 L
345.822 335.681 L
346.21 335.347 L
346.598 335.072 L
346.986 334.838 L
347.374 334.594 L
347.761 334.29 L
348.149 333.945 L
348.537 333.698 L
348.925 333.447 L
349.313 333.146 L
349.701 332.802 L
350.089 332.491 L
350.476 332.237 L
350.864 332.003 L
351.252 331.725 L
351.64 331.391 L
352.028 331.05 L
352.416 330.769 L
352.804 330.532 L
353.191 330.281 L
353.579 329.97 L
353.967 329.615 L
354.355 329.361 L
354.743 329.107 L
355.131 328.799 L
355.519 328.448 L
355.906 328.127 L
356.294 327.87 L
356.682 327.629 L
357.07 327.345 L
357.458 327.004 L
357.846 326.656 L
358.234 326.369 L
358.621 326.124 L
359.009 325.867 L
359.397 325.549 L
359.785 325.188 L
360.173 324.931 L
360.561 324.67 L
360.949 324.352 L
361.336 323.995 L
361.724 323.667 L
362.112 323.403 L
362.5 323.155 L
362.888 322.868 L
363.276 322.52 L
363.664 322.162 L
364.051 321.868 L
364.439 321.62 L
364.827 321.356 L
365.215 321.032 L
365.603 320.664 L
365.991 320.4 L
366.379 320.132 L
366.766 319.811 L
367.154 319.444 L
367.542 319.109 L
367.93 318.838 L
368.318 318.588 L
368.706 318.293 L
369.094 317.936 L
369.481 317.571 L
369.869 317.27 L
370.257 317.016 L
370.645 316.749 L
371.033 316.418 L
371.421 316.04 L
371.809 315.769 L
372.196 315.498 L
372.584 315.167 L
372.972 314.793 L
373.36 314.451 L
373.748 314.177 L
374.136 313.92 L
374.524 313.619 L
374.911 313.254 L
375.299 312.883 L
375.687 312.572 L
376.075 312.315 L
376.463 312.041 L
376.851 311.703 L
377.239 311.318 L
377.626 311.041 L
378.014 310.763 L
378.402 310.429 L
378.79 310.044 L
379.178 309.697 L
379.566 309.416 L
379.954 309.152 L
380.341 308.847 L
380.729 308.473 L
381.117 308.095 L
381.505 307.781 L
381.893 307.517 L
382.281 307.236 L
382.669 306.891 L
383.056 306.5 L
383.444 306.216 L
383.832 305.935 L
384.22 305.591 L
384.608 305.199 L
384.996 304.845 L
385.384 304.557 L
385.771 304.29 L
386.159 303.975 L
386.547 303.594 L
386.935 303.21 L
387.323 302.889 L
387.711 302.618 L
388.099 302.334 L
388.486 301.983 L
388.874 301.581 L
389.262 301.294 L
389.65 301.006 L
390.038 300.655 L
390.426 300.257 L
390.814 299.893 L
391.201 299.599 L
391.589 299.328 L
391.977 299.007 L
392.365 298.619 L
392.753 298.224 L
393.141 297.9 L
393.529 297.626 L
393.916 297.335 L
394.304 296.974 L
394.692 296.566 L
395.08 296.271 L
395.468 295.977 L
395.856 295.619 L
396.244 295.215 L
396.631 294.847 L
397.019 294.546 L
397.407 294.269 L
397.795 293.941 L
398.183 293.546 L
398.571 293.145 L
398.959 292.811 L
399.346 292.533 L
399.734 292.236 L
400.122 291.871 L
400.51 291.453 L
400.898 291.152 L
401.286 290.855 L
401.674 290.49 L
402.061 290.076 L
402.449 289.701 L
402.837 289.393 L
403.225 289.109 L
403.613 288.778 L
404.001 288.377 L
404.389 287.966 L
404.776 287.628 L
405.164 287.344 L
405.552 287.039 L
405.94 286.668 L
406.328 286.244 L
406.716 285.939 L
407.104 285.632 L
407.491 285.26 L
407.879 284.839 L
408.267 284.458 L
408.655 284.147 L
409.043 283.856 L
409.431 283.518 L
409.819 283.11 L
410.206 282.816 L
410.594 282.816 L
410.982 282.398 L
411.37 282.017 L
411.758 281.706 L
412.146 281.412 L
412.534 281.067 L
412.921 280.656 L
413.309 280.245 L
413.697 279.904 L
414.085 279.613 L
414.473 279.299 L
414.861 278.917 L
415.249 278.489 L
415.636 278.108 L
416.024 277.804 L
416.412 277.513 L
416.8 277.169 L
417.188 276.751 L
417.576 276.333 L
417.964 275.995 L
418.351 275.707 L
418.739 275.4 L
419.127 275.012 L
419.515 274.581 L
419.903 274.276 L
420.291 273.975 L
420.679 273.598 L
421.066 273.166 L
421.454 272.855 L
421.842 272.548 L
422.23 272.17 L
422.618 271.748 L
423.006 271.364 L
423.394 271.05 L
423.781 270.759 L
424.169 270.418 L
424.557 270.006 L
424.945 269.592 L
425.333 269.244 L
425.721 268.953 L
426.109 268.645 L
426.496 268.268 L
426.884 267.84 L
427.272 267.452 L
427.66 267.144 L
428.048 266.857 L
428.436 266.515 L
428.824 266.101 L
429.211 265.68 L
429.599 265.338 L
429.987 265.051 L
430.375 264.743 L
430.763 264.362 L
431.151 263.931 L
431.539 263.623 L
431.926 263.319 L
432.314 262.944 L
432.702 262.513 L
433.09 262.202 L
433.478 261.891 L
433.866 261.517 L
434.254 261.095 L
434.641 260.711 L
435.029 260.396 L
435.417 260.102 L
435.805 259.764 L
436.193 259.353 L
436.581 258.939 L
436.969 258.594 L
437.356 258.3 L
437.744 257.992 L
438.132 257.614 L
438.52 257.186 L
438.908 256.802 L
439.296 256.491 L
439.684 256.203 L
440.071 255.862 L
440.459 255.448 L
440.847 255.03 L
441.235 254.685 L
441.623 254.398 L
442.011 254.09 L
442.399 253.709 L
442.786 253.278 L
443.174 252.97 L
443.562 252.666 L
443.95 252.291 L
444.338 251.86 L
444.726 251.472 L
445.114 251.161 L
445.501 250.873 L
445.889 250.536 L
446.277 250.124 L
446.665 249.703 L
447.053 249.355 L
447.441 249.068 L
447.829 248.763 L
448.216 248.386 L
448.604 247.951 L
448.992 247.643 L
449.38 247.336 L
449.768 246.961 L
450.156 246.533 L
450.544 246.149 L
450.931 245.834 L
451.319 245.547 L
451.707 245.206 L
452.095 244.794 L
452.483 244.376 L
452.871 244.032 L
453.259 243.741 L
453.646 243.434 L
454.034 243.056 L
454.422 242.624 L
454.81 242.317 L
455.198 242.009 L
455.586 241.635 L
455.974 241.21 L
456.361 240.822 L
456.749 240.508 L
457.137 240.22 L
457.525 239.879 L
457.913 239.468 L
458.301 239.05 L
458.689 238.705 L
459.076 238.415 L
459.464 238.107 L
459.852 237.729 L
460.24 237.301 L
460.628 236.99 L
461.016 236.682 L
461.404 236.308 L
461.791 235.883 L
462.179 235.495 L
462.567 235.184 L
462.955 234.894 L
463.343 234.553 L
463.731 234.141 L
464.119 233.723 L
464.506 233.379 L
464.894 233.088 L
465.282 232.78 L
465.67 232.402 L
466.058 231.975 L
466.446 231.664 L
466.834 231.356 L
467.221 230.981 L
467.609 230.557 L
467.997 230.169 L
468.385 229.858 L
468.773 229.567 L
469.161 229.226 L
469.549 228.818 L
469.936 228.397 L
470.324 228.052 L
470.712 227.761 L
471.1 227.457 L
471.488 227.076 L
471.876 226.648 L
472.264 226.337 L
472.651 226.029 L
473.039 225.655 L
473.427 225.23 L
473.815 224.842 L
474.203 224.531 L
474.591 224.24 L
474.979 223.903 L
475.366 223.491 L
475.754 223.073 L
476.142 222.726 L
476.53 222.435 L
476.918 222.13 L
477.306 221.753 L
477.694 221.321 L
478.081 221.01 L
478.469 220.703 L
478.857 220.328 L
479.245 219.904 L
479.633 219.516 L
480.021 219.205 L
480.409 218.914 L
480.796 218.576 L
481.184 218.165 L
481.572 217.747 L
481.96 217.399 L
482.348 217.108 L
482.736 216.804 L
483.124 216.426 L
483.511 215.995 L
483.899 215.687 L
484.287 215.376 L
484.675 215.002 L
485.063 214.577 L
485.451 214.192 L
485.839 213.878 L
486.226 213.587 L
486.614 213.249 L
487.002 212.838 L
487.39 212.42 L
487.778 212.072 L
488.166 211.785 L
488.554 211.477 L
488.941 211.099 L
489.329 210.668 L
489.717 210.361 L
490.105 210.05 L
490.493 209.675 L
490.881 209.25 L
491.269 208.866 L
491.656 208.552 L
492.044 208.261 L
492.432 207.923 L
492.82 207.512 L
493.208 207.094 L
493.596 206.746 L
493.984 206.458 L
494.371 206.151 L
494.759 205.773 L
495.147 205.342 L
495.535 205.034 L
495.923 204.723 L
496.311 204.348 L
496.699 203.924 L
497.086 203.539 L
497.474 203.225 L
497.862 202.934 L
498.25 202.596 L
498.638 202.185 L
499.026 201.767 L
499.414 201.423 L
499.801 201.132 L
500.189 200.824 L
500.577 200.446 L
500.965 200.015 L
501.353 199.707 L
501.741 199.4 L
502.129 199.022 L
502.516 198.601 L
502.904 198.213 L
503.292 197.898 L
503.68 197.607 L
504.068 197.27 L
504.456 196.858 L
504.844 196.44 L
505.231 196.096 L
505.619 195.805 L
506.007 195.498 L
506.395 195.12 L
506.783 194.688 L
507.171 194.381 L
507.559 194.073 L
507.946 193.699 L
508.334 193.274 L
508.722 192.886 L
509.11 192.572 L
509.498 192.284 L
509.886 191.943 L
510.274 191.532 L
510.661 191.114 L
511.049 190.769 L
511.437 190.479 L
511.825 190.171 L
512.213 189.793 L
512.601 189.365 L
512.989 189.054 L
513.376 188.747 L
513.764 188.372 L
514.152 187.947 L
514.54 187.559 L
514.928 187.249 L
515.316 186.958 L
515.704 186.617 L
516.091 186.205 L
516.479 185.787 L
516.867 185.443 L
517.255 185.152 L
517.643 184.844 L
518.031 184.467 L
518.419 184.038 L
518.806 183.728 L
519.194 183.42 L
519.582 183.045 L
519.97 182.621 L
520.358 182.233 L
520.746 181.922 L
521.134 181.631 L
521.521 181.29 L
521.909 180.882 L
522.297 180.464 L
522.685 180.116 L
523.073 179.825 L
523.461 179.521 L
523.849 179.14 L
524.236 178.712 L
524.624 178.401 L
525.012 178.093 L
525.4 177.719 L
525.788 177.294 L
526.176 176.906 L
526.564 176.595 L
526.951 176.304 L
527.339 175.967 L
527.727 175.555 L
528.115 175.137 L
528.503 174.79 L
528.891 174.499 L
529.279 174.195 L
529.666 173.817 L
530.054 173.385 L
530.442 173.078 L
530.83 172.767 L
531.218 172.392 L
531.606 171.968 L
531.994 171.583 L
532.381 171.269 L
532.769 170.978 L
533.157 170.64 L
533.545 170.229 L
533.933 169.811 L
534.321 169.463 L
534.709 169.176 L
535.096 168.868 L
535.484 168.49 L
535.872 168.059 L
536.26 167.751 L
536.648 167.44 L
537.036 167.066 L
537.424 166.641 L
537.811 166.256 L
538.199 165.942 L
538.587 165.651 L
538.975 165.314 L
539.363 164.902 L
539.751 164.484 L
540.139 164.137 L
540.526 163.849 L
540.914 163.541 L
541.302 163.163 L
541.69 162.732 L
542.078 162.424 L
542.466 162.114 L
542.854 161.739 L
543.241 161.314 L
543.629 160.93 L
544.017 160.616 L
544.405 160.325 L
544.793 159.987 L
545.181 159.576 L
545.569 159.158 L
545.956 158.813 L
546.344 158.522 L
546.732 158.215 L
547.12 157.837 L
547.508 157.406 L
547.896 157.098 L
548.284 156.79 L
548.671 156.412 L
549.059 155.988 L
549.447 155.603 L
549.835 155.289 L
550.223 154.998 L
550.611 154.66 L
550.999 154.249 L
551.386 153.831 L
551.774 153.487 L
552.162 153.196 L
552.55 152.888 L
552.938 152.51 L
553.326 152.079 L
553.714 151.771 L
554.101 151.464 L
554.489 151.089 L
554.877 150.665 L
555.265 150.277 L
555.653 149.962 L
556.041 149.671 L
556.429 149.334 L
556.816 148.922 L
557.204 148.504 L
557.592 148.16 L
557.98 147.869 L
558.368 147.562 L
558.756 147.184 L
559.144 146.752 L
559.531 146.445 L
559.919 146.137 L
560.307 145.763 L
560.695 145.338 L
561.083 144.95 L
561.471 144.639 L
561.859 144.348 L
562.246 144.007 L
562.634 143.596 L
563.022 143.178 L
563.41 142.833 L
563.798 142.543 L
564.186 142.235 L
564.574 141.857 L
564.961 141.429 L
565.349 141.118 L
565.737 140.811 L
566.125 140.436 L
566.513 140.011 L
566.901 139.623 L
567.289 139.313 L
567.676 139.022 L
568.064 138.681 L
568.452 138.269 L
568.84 137.851 L
569.228 137.507 L
569.616 137.216 L
570.004 136.908 L
570.391 136.531 L
570.779 136.102 L
571.167 135.792 L
571.555 135.484 L
571.943 135.109 L
572.331 134.685 L
572.719 134.297 L
573.106 133.986 L
573.494 133.695 L
573.882 133.354 L
574.27 132.946 L
574.658 132.528 L
575.046 132.18 L
575.434 131.889 L
575.821 131.585 L
576.209 131.204 L
576.597 130.776 L
576.985 130.465 L
577.373 130.157 L
577.761 129.783 L
578.149 129.358 L
578.536 128.97 L
578.924 128.659 L
579.312 128.368 L
579.7 128.031 L
580.088 127.619 L
580.476 127.201 L
580.864 126.854 L
581.251 126.563 L
581.639 126.258 L
582.027 125.881 L
582.415 125.449 L
582.803 125.142 L
583.191 124.831 L
583.579 124.456 L
583.966 124.032 L
584.354 123.647 L
584.742 123.333 L
585.13 123.042 L
585.518 122.704 L
585.906 122.293 L
586.294 121.875 L
586.681 121.527 L
587.069 121.24 L
587.457 120.932 L
587.845 120.554 L
588.233 120.123 L
588.621 119.815 L
589.009 119.504 L
589.396 119.13 L
589.784 118.705 L
590.172 118.32 L
590.56 118.006 L
590.948 117.715 L
591.336 117.378 L
591.724 116.966 L
592.111 116.548 L
592.499 116.201 L
592.887 115.913 L
593.275 115.605 L
593.663 115.227 L
594.051 114.796 L
594.439 114.489 L
594.826 114.178 L
595.214 113.803 L
595.602 113.378 L
595.99 112.994 L
596.378 112.68 L
596.766 112.389 L
597.154 112.051 L
597.541 111.64 L
597.929 111.222 L
598.317 110.877 L
598.705 110.586 L
599.093 110.279 L
599.481 109.901 L
599.869 109.47 L
600.256 109.162 L
600.644 108.854 L
601.032 108.476 L
601.42 108.052 L
601.808 107.667 L
602.196 107.353 L
602.584 107.062 L
602.971 106.724 L
603.359 106.313 L
603.747 105.895 L
604.135 105.551 L
604.523 105.26 L
604.911 104.952 L
605.299 104.574 L
605.686 104.143 L
606.074 103.835 L
606.462 103.528 L
606.85 103.153 L
607.238 102.729 L
607.626 102.341 L
608.014 102.026 L
608.401 101.739 L
608.789 101.398 L
609.177 100.986 L
609.565 100.568 L
609.953 100.224 L
610.341 99.933 L
610.729 99.626 L
611.116 99.248 L
611.504 98.82 L
611.892 98.509 L
612.28 98.201 L
612.668 97.827 L
613.056 97.402 L
613.444 97.014 L
613.831 96.703 L
614.219 96.412 L
614.607 96.071 L
614.995 95.66 L
615.383 95.242 L
615.771 94.897 L
616.159 94.607 L
616.546 94.299 L
616.934 93.921 L
617.322 93.493 L
617.71 93.182 L
618.098 92.874 L
618.486 92.5 L
618.874 92.075 L
619.261 91.687 L
619.649 91.377 L
620.037 91.086 L
620.425 90.745 L
620.813 90.337 L
621.201 89.915 L
621.589 89.571 L
621.976 89.28 L
622.364 88.976 L
622.752 88.594 L
623.14 88.136 L
S
GR
GS
[0.6 0 0 0.6 0 0] CT
0.851 0.325 0.098 RC
1 LJ
3.333 LW
N
91.388 426.681 M
91.776 426.661 L
92.164 426.641 L
92.551 426.621 L
92.939 426.594 L
93.327 426.567 L
93.715 426.544 L
94.103 426.524 L
94.491 426.494 L
94.879 426.474 L
95.266 426.447 L
95.654 426.42 L
96.042 426.4 L
96.43 426.373 L
96.818 426.343 L
97.206 426.313 L
97.594 426.283 L
97.981 426.253 L
98.369 426.22 L
98.757 426.193 L
99.145 426.159 L
99.533 426.136 L
99.921 426.093 L
100.309 426.066 L
100.696 426.039 L
101.084 426.019 L
101.472 425.999 L
101.86 425.972 L
102.248 425.945 L
102.636 425.922 L
103.024 425.892 L
103.411 425.865 L
103.799 425.838 L
104.187 425.815 L
104.575 425.785 L
104.963 425.758 L
105.351 425.725 L
105.739 425.688 L
106.126 425.665 L
106.514 425.631 L
106.902 425.591 L
107.29 425.558 L
107.678 425.524 L
108.066 425.467 L
108.454 425.404 L
108.841 425.38 L
109.229 425.337 L
109.617 425.28 L
110.005 425.257 L
110.393 425.22 L
110.781 425.173 L
111.169 425.103 L
111.556 425.069 L
111.944 425.026 L
112.332 424.999 L
112.72 424.949 L
113.108 424.922 L
113.496 424.875 L
113.884 424.832 L
114.271 424.799 L
114.659 424.762 L
115.047 424.732 L
115.435 424.695 L
115.823 424.655 L
116.211 424.618 L
116.599 424.581 L
116.986 424.541 L
117.374 424.508 L
117.762 424.464 L
118.15 424.424 L
118.538 424.387 L
118.926 424.354 L
119.314 424.307 L
119.701 424.267 L
120.089 424.22 L
120.477 424.187 L
120.865 424.136 L
121.253 424.103 L
121.641 424.053 L
122.029 424.013 L
122.416 423.966 L
122.804 423.919 L
123.192 423.869 L
123.58 423.832 L
123.968 423.785 L
124.356 423.739 L
124.744 423.695 L
125.131 423.648 L
125.519 423.605 L
125.907 423.558 L
126.295 423.508 L
126.683 423.454 L
127.071 423.408 L
127.459 423.364 L
127.846 423.331 L
128.234 423.27 L
128.622 423.21 L
129.01 423.15 L
129.398 423.09 L
129.786 423.033 L
130.174 422.966 L
130.561 422.906 L
130.949 422.849 L
131.337 422.789 L
131.725 422.722 L
132.113 422.655 L
132.501 422.592 L
132.889 422.531 L
133.276 422.468 L
133.664 422.394 L
134.052 422.334 L
134.44 422.271 L
134.828 422.207 L
135.216 422.137 L
135.604 422.07 L
135.991 422 L
136.379 421.936 L
136.767 421.863 L
137.155 421.799 L
137.543 421.729 L
137.931 421.652 L
138.319 421.592 L
138.706 421.515 L
139.094 421.445 L
139.482 421.371 L
139.87 421.298 L
140.258 421.224 L
140.646 421.154 L
141.034 421.077 L
141.421 421.003 L
141.809 420.93 L
142.197 420.853 L
142.585 420.786 L
142.973 420.709 L
143.361 420.629 L
143.749 420.552 L
144.136 420.475 L
144.524 420.398 L
144.912 420.318 L
145.3 420.241 L
145.688 420.161 L
146.076 420.084 L
146.464 420 L
146.851 419.91 L
147.239 419.843 L
147.627 419.756 L
148.015 419.676 L
148.403 419.589 L
148.791 419.502 L
149.179 419.432 L
149.566 419.352 L
149.954 419.265 L
150.342 419.181 L
150.73 419.094 L
151.118 419.007 L
151.506 418.924 L
151.894 418.83 L
152.281 418.74 L
152.669 418.649 L
153.057 418.569 L
153.445 418.479 L
153.833 418.392 L
154.221 418.295 L
154.609 418.208 L
154.996 418.114 L
155.384 418.014 L
155.772 417.927 L
156.16 417.83 L
156.548 417.74 L
156.936 417.643 L
157.324 417.546 L
157.711 417.449 L
158.099 417.362 L
158.487 417.262 L
158.875 417.165 L
159.263 417.071 L
159.651 416.971 L
160.039 416.877 L
160.426 416.784 L
160.814 416.683 L
161.202 416.586 L
161.59 416.486 L
161.978 416.379 L
162.366 416.279 L
162.754 416.185 L
163.141 416.085 L
163.529 415.974 L
163.917 415.874 L
164.305 415.767 L
164.693 415.667 L
165.081 415.56 L
165.469 415.446 L
165.856 415.359 L
166.244 415.252 L
166.632 415.145 L
167.02 415.031 L
167.408 414.931 L
167.796 414.824 L
168.184 414.71 L
168.571 414.597 L
168.959 414.49 L
169.347 414.383 L
169.735 414.279 L
170.123 414.169 L
170.511 414.055 L
170.899 413.941 L
171.286 413.831 L
171.674 413.714 L
172.062 413.607 L
172.45 413.487 L
172.838 413.373 L
173.226 413.266 L
173.614 413.139 L
174.001 413.032 L
174.389 412.918 L
174.777 412.44 L
175.165 412.32 L
175.553 412.216 L
175.941 412.096 L
176.329 411.975 L
176.716 411.855 L
177.104 411.731 L
177.492 411.614 L
177.88 411.487 L
178.268 411.37 L
178.656 411.253 L
179.044 411.133 L
179.431 410.999 L
179.819 410.875 L
180.207 410.765 L
180.595 410.638 L
180.983 410.514 L
181.371 410.387 L
181.759 410.273 L
182.146 410.143 L
182.534 410.009 L
182.922 409.882 L
183.31 409.765 L
183.698 409.635 L
184.086 409.508 L
184.474 409.374 L
184.861 409.25 L
185.249 409.11 L
185.637 408.986 L
186.025 408.859 L
186.413 408.735 L
186.801 408.598 L
187.189 408.461 L
187.576 408.337 L
187.964 408.2 L
188.352 408.07 L
188.74 407.946 L
189.128 407.809 L
189.516 407.675 L
189.904 407.541 L
190.291 407.411 L
190.679 407.267 L
191.067 407.127 L
191.455 407.06 L
191.843 406.926 L
192.231 406.779 L
192.619 406.639 L
193.006 406.488 L
193.394 406.358 L
193.782 406.211 L
194.17 406.07 L
194.558 405.936 L
194.946 405.786 L
195.334 405.649 L
195.721 405.508 L
196.109 405.358 L
196.497 405.218 L
196.885 405.08 L
197.273 404.93 L
197.661 404.783 L
198.049 404.632 L
198.436 404.499 L
198.824 404.348 L
199.212 404.204 L
199.6 404.054 L
199.988 403.903 L
200.376 403.753 L
200.764 403.606 L
201.151 403.459 L
201.539 403.308 L
201.927 403.148 L
202.315 402.994 L
202.703 402.85 L
203.091 402.696 L
203.479 402.546 L
203.866 402.399 L
204.254 402.235 L
204.642 402.081 L
205.03 401.931 L
205.418 401.78 L
205.806 401.623 L
206.194 401.459 L
206.581 401.312 L
206.969 401.152 L
207.357 400.991 L
207.745 400.841 L
208.133 400.68 L
208.521 400.533 L
208.909 400.366 L
209.296 400.205 L
209.684 400.038 L
210.072 399.871 L
210.46 399.71 L
210.848 399.547 L
211.236 399.396 L
211.624 399.229 L
212.011 399.055 L
212.399 398.905 L
212.787 398.744 L
213.175 398.57 L
213.563 398.403 L
213.951 398.246 L
214.339 398.072 L
214.726 397.911 L
215.114 397.744 L
215.502 397.567 L
215.89 397.41 L
216.278 397.233 L
216.666 397.072 L
217.054 396.902 L
217.441 396.728 L
217.829 396.561 L
218.217 396.39 L
218.605 396.216 L
218.993 396.046 L
219.381 395.865 L
219.769 395.698 L
220.156 395.524 L
220.544 395.35 L
220.932 395.183 L
221.32 395.002 L
221.708 394.825 L
222.096 394.648 L
222.484 394.474 L
222.871 394.304 L
223.259 394.123 L
223.647 393.946 L
224.035 393.779 L
224.423 393.598 L
224.811 393.417 L
225.199 393.237 L
225.586 393.053 L
225.974 392.876 L
226.362 392.692 L
226.75 392.508 L
227.138 392.334 L
227.526 392.15 L
227.914 391.963 L
228.301 391.779 L
228.689 391.592 L
229.077 391.401 L
229.465 391.231 L
229.853 391.043 L
230.241 390.856 L
230.629 390.676 L
231.016 390.485 L
231.404 390.308 L
231.792 390.114 L
232.18 389.927 L
232.568 389.736 L
232.956 389.542 L
233.344 389.358 L
233.731 389.168 L
234.119 388.977 L
234.507 388.78 L
234.895 388.596 L
235.283 388.402 L
235.671 388.201 L
236.059 388.014 L
236.446 387.81 L
236.834 387.639 L
237.222 387.442 L
237.61 387.242 L
237.998 387.058 L
238.386 386.847 L
238.774 386.656 L
239.161 386.462 L
239.549 386.031 L
239.937 385.837 L
240.325 385.637 L
240.713 385.453 L
241.101 385.252 L
241.489 385.048 L
241.876 384.857 L
242.264 384.65 L
242.652 384.446 L
243.04 384.249 L
243.428 384.035 L
243.816 383.851 L
244.204 383.65 L
244.591 383.443 L
244.979 383.232 L
245.367 383.025 L
245.755 382.824 L
246.143 382.617 L
246.531 382.41 L
246.919 382.199 L
247.306 381.985 L
247.694 381.781 L
248.082 381.587 L
248.47 381.36 L
248.858 381.176 L
249.246 380.955 L
249.634 380.738 L
250.021 380.534 L
250.409 380.34 L
250.797 380.116 L
251.185 379.701 L
251.573 379.494 L
251.961 379.273 L
252.349 379.066 L
252.736 378.859 L
253.124 378.645 L
253.512 378.437 L
253.9 378.223 L
254.288 378.006 L
254.676 377.775 L
255.064 377.565 L
255.451 377.354 L
255.839 377.147 L
256.227 376.926 L
256.615 376.695 L
257.003 376.488 L
257.391 376.274 L
257.779 376.05 L
258.166 375.826 L
258.554 375.612 L
258.942 375.388 L
259.33 375.161 L
259.718 374.95 L
260.106 374.796 L
260.494 374.572 L
260.881 374.348 L
261.269 374.137 L
261.657 373.897 L
262.045 373.686 L
262.433 373.462 L
262.821 373.235 L
263.209 372.997 L
263.596 372.776 L
263.984 372.546 L
264.372 372.325 L
264.76 372.111 L
265.148 371.867 L
265.536 371.636 L
265.924 371.422 L
266.311 371.178 L
266.699 370.961 L
267.087 370.727 L
267.475 370.369 L
267.863 370.145 L
268.251 369.924 L
268.639 369.687 L
269.026 369.456 L
269.414 369.229 L
269.802 368.988 L
270.19 368.747 L
270.578 368.503 L
270.966 368.282 L
271.354 368.038 L
271.741 367.808 L
272.129 367.577 L
272.517 367.336 L
272.905 367.095 L
273.293 366.858 L
273.681 366.614 L
274.069 366.373 L
274.456 366.132 L
274.844 365.888 L
275.232 365.668 L
275.62 365.437 L
276.008 365.186 L
276.396 364.949 L
276.784 364.698 L
277.171 364.464 L
277.559 364.213 L
277.947 363.671 L
278.335 363.427 L
278.723 363.177 L
279.111 362.936 L
279.499 362.688 L
279.886 362.448 L
280.274 362.2 L
280.662 361.946 L
281.05 361.702 L
281.438 361.465 L
281.826 361.217 L
282.214 360.963 L
282.601 360.709 L
282.989 360.468 L
283.377 360.201 L
283.765 359.953 L
284.153 359.719 L
284.541 359.465 L
284.929 359.218 L
285.316 358.963 L
285.704 358.706 L
286.092 358.445 L
286.48 358.201 L
286.868 357.934 L
287.256 357.693 L
287.644 357.432 L
288.031 357.185 L
288.419 356.917 L
288.807 356.686 L
289.195 356.419 L
289.583 356.161 L
289.971 355.901 L
290.359 355.646 L
290.746 355.379 L
291.134 355.125 L
291.522 355.011 L
291.91 354.76 L
292.298 354.51 L
292.686 354.242 L
293.074 353.968 L
293.461 353.714 L
293.849 353.46 L
294.237 353.192 L
294.625 352.921 L
295.013 352.667 L
295.401 352.413 L
295.789 352.129 L
296.176 351.868 L
296.564 351.597 L
296.952 351.333 L
297.34 351.079 L
297.728 350.825 L
298.116 350.557 L
298.504 350.29 L
298.891 350.022 L
299.279 349.741 L
299.667 349.481 L
300.055 349.213 L
300.443 348.946 L
300.831 348.678 L
301.219 348.387 L
301.606 348.126 L
301.994 347.852 L
302.382 347.585 L
302.77 347.3 L
303.158 346.906 L
303.546 346.645 L
303.934 346.354 L
304.321 346.077 L
304.709 345.809 L
305.097 345.538 L
305.485 345.267 L
305.873 345 L
306.261 344.712 L
306.649 344.438 L
307.036 344.164 L
307.424 343.876 L
307.812 343.609 L
308.2 343.318 L
308.588 343.047 L
308.976 342.756 L
309.364 342.479 L
309.751 342.188 L
310.139 341.917 L
310.527 341.623 L
310.915 341.352 L
311.303 341.074 L
311.691 340.804 L
312.079 340.513 L
312.466 340.238 L
312.854 339.944 L
313.242 339.653 L
313.63 339.382 L
314.018 339.078 L
314.406 338.814 L
314.794 338.51 L
315.181 338.215 L
315.569 337.938 L
315.957 337.647 L
316.345 337.349 L
316.733 337.072 L
317.121 336.771 L
317.509 336.49 L
317.896 336.189 L
318.284 335.912 L
318.672 335.614 L
319.06 335.333 L
319.448 335.029 L
319.836 334.735 L
320.224 334.437 L
320.611 334.17 L
320.999 333.879 L
321.387 333.581 L
321.775 333.29 L
322.163 332.986 L
322.551 332.688 L
322.939 332.394 L
323.326 332.093 L
323.714 331.792 L
324.102 331.508 L
324.49 331.067 L
324.878 330.769 L
325.266 330.468 L
325.654 330.167 L
326.041 329.866 L
326.429 329.565 L
326.817 329.261 L
327.205 328.957 L
327.593 328.666 L
327.981 328.368 L
328.369 328.057 L
328.756 327.76 L
329.144 327.462 L
329.532 327.164 L
329.92 326.86 L
330.308 326.549 L
330.696 326.248 L
331.084 325.941 L
331.471 325.636 L
331.859 325.319 L
332.247 325.011 L
332.635 324.703 L
333.023 324.396 L
333.411 324.098 L
333.799 323.807 L
334.186 323.493 L
334.574 323.179 L
334.962 322.861 L
335.35 322.547 L
335.738 322.239 L
336.126 321.935 L
336.514 321.62 L
336.901 321.306 L
337.289 320.995 L
337.677 320.684 L
338.065 320.363 L
338.453 320.049 L
338.841 319.728 L
339.229 319.414 L
339.616 319.113 L
340.004 318.795 L
340.392 318.494 L
340.78 318.173 L
341.168 317.852 L
341.556 317.521 L
341.944 317.22 L
342.331 316.899 L
342.719 316.575 L
343.107 315.966 L
343.495 315.645 L
343.883 315.321 L
344.271 314.993 L
344.659 314.682 L
345.046 314.385 L
345.434 314.054 L
345.822 313.719 L
346.21 313.391 L
346.598 313.067 L
346.986 312.733 L
347.374 312.418 L
347.761 312.111 L
348.149 311.783 L
348.537 311.455 L
348.925 311.205 L
349.313 310.877 L
349.701 310.553 L
350.089 310.218 L
350.476 309.884 L
350.864 309.546 L
351.252 309.222 L
351.64 308.897 L
352.028 308.58 L
352.416 308.239 L
352.804 307.904 L
353.191 307.58 L
353.579 307.236 L
353.967 306.901 L
354.355 306.58 L
354.743 306.236 L
355.131 305.908 L
355.519 305.577 L
355.906 305.236 L
356.294 304.922 L
356.682 304.587 L
357.07 304.243 L
357.458 303.905 L
357.846 303.568 L
358.234 303.223 L
358.621 302.892 L
359.009 302.531 L
359.397 302.21 L
359.785 301.852 L
360.173 301.538 L
360.561 301.183 L
360.949 300.856 L
361.336 300.508 L
361.724 300.157 L
362.112 299.819 L
362.5 299.481 L
362.888 299.117 L
363.276 298.783 L
363.664 298.445 L
364.051 298.107 L
364.439 297.746 L
364.827 297.124 L
365.215 296.783 L
365.603 296.425 L
365.991 296.064 L
366.379 295.733 L
366.766 295.392 L
367.154 295.034 L
367.542 294.673 L
367.93 294.335 L
368.318 293.978 L
368.706 293.64 L
369.094 293.279 L
369.481 292.944 L
369.869 292.58 L
370.257 292.222 L
370.645 291.888 L
371.033 291.53 L
371.421 291.166 L
371.809 290.811 L
372.196 290.47 L
372.584 290.032 L
372.972 289.671 L
373.36 289.313 L
373.748 288.972 L
374.136 288.614 L
374.524 288.25 L
374.911 287.892 L
375.299 287.534 L
375.687 287.173 L
376.075 286.815 L
376.463 286.444 L
376.851 286.083 L
377.239 285.722 L
377.626 285.374 L
378.014 285.013 L
378.402 284.645 L
378.79 284.304 L
379.178 283.933 L
379.566 283.569 L
379.954 283.194 L
380.341 282.706 L
380.729 282.338 L
381.117 281.984 L
381.505 281.612 L
381.893 281.268 L
382.281 280.894 L
382.669 280.519 L
383.056 280.168 L
383.444 279.797 L
383.832 279.416 L
384.22 279.051 L
384.608 278.69 L
384.996 278.326 L
385.384 277.948 L
385.771 277.567 L
386.159 277.192 L
386.547 276.851 L
386.935 276.473 L
387.323 276.092 L
387.711 275.717 L
388.099 275.336 L
388.486 274.955 L
388.874 274.627 L
389.262 274.36 L
389.65 273.975 L
390.038 273.594 L
390.426 273.243 L
390.814 272.859 L
391.201 272.464 L
391.589 272.103 L
391.977 271.738 L
392.365 271.347 L
392.753 270.956 L
393.141 270.575 L
393.529 270.217 L
393.916 269.846 L
394.304 269.448 L
394.692 269.07 L
395.08 268.679 L
395.468 268.341 L
395.856 267.947 L
396.244 267.562 L
396.631 267.171 L
397.019 266.783 L
397.407 266.422 L
397.795 265.84 L
398.183 265.462 L
398.571 265.088 L
398.959 264.683 L
399.346 264.309 L
399.734 263.931 L
400.122 263.56 L
400.51 263.165 L
400.898 262.777 L
401.286 262.406 L
401.674 262.021 L
402.061 261.61 L
402.449 261.239 L
402.837 260.878 L
403.225 260.477 L
403.613 260.102 L
404.001 259.721 L
404.389 259.313 L
404.776 258.935 L
405.164 258.554 L
405.552 258.156 L
405.94 257.782 L
406.328 257.374 L
406.716 257.056 L
407.104 256.712 L
407.491 256.307 L
407.879 255.929 L
408.267 255.521 L
408.655 255.143 L
409.043 254.762 L
409.431 254.351 L
409.819 253.973 L
410.206 253.615 L
410.594 253.211 L
410.982 252.826 L
411.37 252.435 L
411.758 252.027 L
412.146 251.666 L
412.534 251.054 L
412.921 250.679 L
413.309 250.268 L
413.697 249.894 L
414.085 249.516 L
414.473 249.105 L
414.861 248.73 L
415.249 248.322 L
415.636 247.944 L
416.024 247.57 L
416.412 247.165 L
416.8 246.807 L
417.188 246.453 L
417.576 246.032 L
417.964 245.667 L
418.351 245.269 L
418.739 244.888 L
419.127 244.48 L
419.515 244.116 L
419.903 243.738 L
420.291 243.33 L
420.679 242.955 L
421.066 242.574 L
421.454 242.166 L
421.842 241.785 L
422.23 241.427 L
422.618 241.016 L
423.006 240.601 L
423.394 240.247 L
423.781 239.866 L
424.169 239.461 L
424.557 239.073 L
424.945 238.682 L
425.333 238.314 L
425.721 237.923 L
426.109 237.535 L
426.496 237.144 L
426.884 236.753 L
427.272 236.375 L
427.66 235.977 L
428.048 235.325 L
428.436 234.917 L
428.824 234.539 L
429.211 234.158 L
429.599 233.78 L
429.987 233.409 L
430.375 233.018 L
430.763 232.613 L
431.151 232.239 L
431.539 231.861 L
431.926 231.476 L
432.314 231.098 L
432.702 230.687 L
433.09 230.326 L
433.478 229.901 L
433.866 229.54 L
434.254 229.159 L
434.641 228.761 L
435.029 228.387 L
435.417 227.982 L
435.805 227.601 L
436.193 227.223 L
436.581 226.818 L
436.969 226.477 L
437.356 226.069 L
437.744 225.688 L
438.132 225.3 L
438.52 224.899 L
438.908 224.518 L
439.296 224.123 L
439.684 223.883 L
440.071 223.535 L
440.459 223.144 L
440.847 222.752 L
441.235 222.371 L
441.623 221.967 L
442.011 221.589 L
442.399 221.194 L
442.786 220.82 L
443.174 220.429 L
443.562 220.034 L
443.95 219.656 L
444.338 218.944 L
444.726 218.546 L
445.114 218.182 L
445.501 217.787 L
445.889 217.419 L
446.277 217.028 L
446.665 216.64 L
447.053 216.259 L
447.441 215.881 L
447.829 215.483 L
448.216 215.105 L
448.604 214.714 L
448.992 214.326 L
449.38 213.935 L
449.768 213.55 L
450.156 213.176 L
450.544 212.795 L
450.931 212.414 L
451.319 212.046 L
451.707 211.641 L
452.095 211.257 L
452.483 210.872 L
452.871 210.481 L
453.259 210.14 L
453.646 209.715 L
454.034 209.374 L
454.422 208.993 L
454.81 208.598 L
455.198 208.207 L
455.586 207.829 L
455.974 207.458 L
456.361 207.064 L
456.749 206.679 L
457.137 206.301 L
457.525 205.92 L
457.913 205.539 L
458.301 205.158 L
458.689 204.77 L
459.076 204.375 L
459.464 204.014 L
459.852 203.275 L
460.24 202.914 L
460.628 202.539 L
461.016 202.135 L
461.404 201.757 L
461.791 201.376 L
462.179 200.971 L
462.567 200.61 L
462.955 200.209 L
463.343 199.824 L
463.731 199.44 L
464.119 199.052 L
464.506 198.684 L
464.894 198.323 L
465.282 197.928 L
465.67 197.557 L
466.058 197.159 L
466.446 196.765 L
466.834 196.377 L
467.221 195.989 L
467.609 195.648 L
467.997 195.26 L
468.385 194.872 L
468.773 194.484 L
469.161 194.09 L
469.549 193.712 L
469.936 193.311 L
470.324 192.933 L
470.712 192.555 L
471.1 192.177 L
471.488 191.806 L
471.876 191.428 L
472.264 191.027 L
472.651 190.639 L
473.039 190.251 L
473.427 189.89 L
473.815 189.502 L
474.203 189.101 L
474.591 188.743 L
474.979 188.322 L
475.366 187.957 L
475.754 187.59 L
476.142 187.168 L
476.53 186.807 L
476.918 186.449 L
477.306 186.045 L
477.694 185.664 L
478.081 185.072 L
478.469 184.694 L
478.857 184.293 L
479.245 183.918 L
479.633 183.537 L
480.021 183.156 L
480.409 182.765 L
480.796 182.397 L
481.184 182.009 L
481.572 181.641 L
481.96 181.243 L
482.348 180.855 L
482.736 180.457 L
483.124 180.09 L
483.511 179.702 L
483.899 179.327 L
484.287 178.939 L
484.675 178.575 L
485.063 178.317 L
485.451 177.946 L
485.839 177.568 L
486.226 177.187 L
486.614 176.783 L
487.002 176.428 L
487.39 176.027 L
487.778 175.649 L
488.166 175.271 L
488.554 174.877 L
488.941 174.482 L
489.329 174.121 L
489.717 173.723 L
490.105 173.335 L
490.493 172.964 L
490.881 172.569 L
491.269 172.175 L
491.656 171.242 L
492.044 170.854 L
492.432 170.47 L
492.82 170.095 L
493.208 169.697 L
493.596 169.329 L
493.984 168.941 L
494.371 168.577 L
494.759 168.176 L
495.147 167.788 L
495.535 167.413 L
495.923 167.036 L
496.311 166.638 L
496.699 166.263 L
497.086 165.882 L
497.474 165.477 L
497.862 165.12 L
498.25 164.738 L
498.638 164.344 L
499.026 163.963 L
499.414 163.558 L
499.801 163.177 L
500.189 162.799 L
500.577 162.418 L
500.965 162.047 L
501.353 161.662 L
501.741 161.288 L
502.129 160.883 L
502.516 160.512 L
502.904 160.134 L
503.292 159.729 L
503.68 159.348 L
504.068 158.98 L
504.456 158.593 L
504.844 158.218 L
505.231 157.971 L
505.619 157.569 L
506.007 157.188 L
506.395 156.81 L
506.783 156.429 L
507.171 156.031 L
507.559 155.677 L
507.946 155.269 L
508.334 154.894 L
508.722 154.503 L
509.11 154.142 L
509.498 153.737 L
509.886 153.363 L
510.274 152.965 L
510.661 152.594 L
511.049 152.239 L
511.437 151.875 L
511.825 151.49 L
512.213 151.096 L
512.601 150.725 L
512.989 150.33 L
513.376 149.939 L
513.764 149.551 L
514.152 149.19 L
514.54 148.792 L
514.928 148.421 L
515.316 148.053 L
515.704 147.652 L
516.091 147.271 L
516.479 146.876 L
516.867 146.488 L
517.255 146.117 L
517.643 145.485 L
518.031 145.087 L
518.419 144.706 L
518.806 144.328 L
519.194 143.954 L
519.582 143.579 L
519.97 143.168 L
520.358 142.79 L
520.746 142.409 L
521.134 142.031 L
521.521 141.656 L
521.909 141.265 L
522.297 140.877 L
522.685 140.486 L
523.073 140.102 L
523.461 139.319 L
523.849 138.948 L
524.236 138.57 L
524.624 138.179 L
525.012 137.794 L
525.4 137.4 L
525.788 137.022 L
526.176 136.631 L
526.564 136.263 L
526.951 135.885 L
527.339 135.504 L
527.727 135.119 L
528.115 134.732 L
528.503 134.494 L
528.891 134.136 L
529.279 133.745 L
529.666 133.361 L
530.054 132.973 L
530.442 132.585 L
530.83 132.197 L
531.218 131.812 L
531.606 131.428 L
531.994 131.033 L
532.381 130.672 L
532.769 130.017 L
533.157 129.629 L
533.545 129.241 L
533.933 128.853 L
534.321 128.465 L
534.709 128.074 L
535.096 127.69 L
535.484 127.349 L
535.872 126.964 L
536.26 126.573 L
536.648 126.185 L
537.036 125.797 L
537.424 125.409 L
537.811 125.018 L
538.199 124.633 L
538.587 124.292 L
538.975 123.901 L
539.363 123.517 L
539.751 123.122 L
540.139 122.738 L
540.526 122.256 L
540.914 121.865 L
541.302 121.524 L
541.69 121.136 L
542.078 120.748 L
542.466 120.34 L
542.854 119.972 L
543.241 119.591 L
543.629 119.19 L
544.017 118.805 L
544.405 118.434 L
544.793 118.06 L
545.181 117.678 L
545.569 117.304 L
545.956 116.923 L
546.344 116.518 L
546.732 116.147 L
547.12 115.766 L
547.508 115.378 L
547.896 114.99 L
548.284 114.629 L
548.671 114.241 L
549.059 113.84 L
549.447 113.482 L
549.835 113.077 L
550.223 112.683 L
550.611 112.573 L
550.999 112.201 L
551.386 111.78 L
551.774 111.436 L
552.162 111.058 L
552.55 110.657 L
552.938 110.272 L
553.326 109.894 L
553.714 109.513 L
554.101 109.112 L
554.489 108.737 L
554.877 108.379 L
555.265 107.881 L
555.653 107.6 L
556.041 107.219 L
556.429 106.821 L
556.816 106.45 L
557.204 106.069 L
557.592 105.694 L
557.98 104.952 L
558.368 104.588 L
558.756 104.18 L
559.144 103.802 L
559.531 103.427 L
559.919 103.053 L
560.307 102.652 L
560.695 102.284 L
561.083 101.919 L
561.471 101.501 L
561.859 101.127 L
562.246 100.766 L
562.634 100.371 L
563.022 99.977 L
563.41 99.602 L
563.798 99.231 L
564.186 98.83 L
564.574 98.449 L
564.961 98.077 L
565.349 97.696 L
565.737 97.198 L
566.125 96.827 L
566.513 96.442 L
566.901 96.058 L
567.289 95.67 L
567.676 95.282 L
568.064 94.914 L
568.452 94.523 L
568.84 94.155 L
569.228 93.771 L
569.616 93.383 L
570.004 92.992 L
570.391 92.597 L
570.779 92.212 L
571.167 91.828 L
571.555 91.106 L
571.943 90.741 L
572.331 90.35 L
572.719 89.965 L
573.106 89.578 L
573.494 89.196 L
573.882 88.815 L
574.27 88.424 L
574.658 88.056 L
575.046 87.698 L
575.434 87.304 L
575.821 86.923 L
576.209 86.538 L
576.597 86.154 L
576.985 85.756 L
577.373 85.371 L
577.761 84.977 L
578.149 84.622 L
578.536 84.241 L
578.924 83.853 L
579.312 83.465 L
579.7 83.074 L
580.088 82.689 L
580.476 82.302 L
580.864 81.967 L
581.251 81.573 L
581.639 81.185 L
582.027 80.804 L
582.415 80.412 L
582.803 80.028 L
583.191 79.64 L
583.579 79.279 L
583.966 78.891 L
584.354 78.503 L
584.742 78.115 L
585.13 77.754 L
585.518 77.366 L
585.906 76.975 L
586.294 76.607 L
586.681 75.444 L
587.069 75.049 L
587.457 74.664 L
587.845 74.323 L
588.233 73.932 L
588.621 73.544 L
589.009 73.16 L
589.396 72.772 L
589.784 72.384 L
590.172 72.016 L
590.56 71.625 L
590.948 71.247 L
591.336 70.856 L
591.724 70.471 L
592.111 70.094 L
592.499 69.729 L
592.887 69.355 L
593.275 68.943 L
593.663 68.592 L
594.051 68.201 L
594.439 67.8 L
594.826 67.429 L
595.214 67.061 L
595.602 66.68 L
595.99 66.285 L
596.378 65.907 L
596.766 65.509 L
597.154 65.135 L
597.541 64.914 L
597.929 64.513 L
598.317 64.135 L
598.705 63.764 L
599.093 63.386 L
599.481 63.001 L
599.869 62.634 L
600.256 62.249 L
600.644 61.841 L
601.032 61.47 L
601.42 61.089 L
601.808 60.738 L
602.196 60.336 L
602.584 59.962 L
602.971 59.591 L
603.359 59.183 L
603.747 58.805 L
604.135 58.431 L
604.523 58.046 L
604.911 57.661 L
605.299 57.27 L
605.686 56.899 L
606.074 56.505 L
606.462 56.123 L
606.85 55.759 L
607.238 55.358 L
607.626 54.9 L
608.014 54.515 L
608.401 54.147 L
608.789 53.756 L
609.177 53.378 L
609.565 53.004 L
609.953 52.622 L
610.341 52.235 L
610.729 51.85 L
611.116 51.472 L
611.504 51.091 L
611.892 50.69 L
612.28 50.302 L
612.668 49.954 L
613.056 49.573 L
613.444 49.178 L
613.831 48.787 L
614.219 48.413 L
614.607 48.035 L
614.995 47.657 L
615.383 47.272 L
615.771 46.888 L
616.159 46.523 L
616.546 46.119 L
616.934 45.751 L
617.322 45.373 L
617.71 44.982 L
618.098 44.604 L
618.486 44.233 L
618.874 43.848 L
619.261 42.929 L
619.649 42.564 L
620.037 42.177 L
620.425 41.812 L
620.813 41.428 L
621.201 41.053 L
621.589 40.652 L
621.976 40.294 L
622.364 39.93 L
622.752 39.555 L
623.14 39.167 L
S
GR
GS
[0.6 0 0 0.6 0 0] CT
1 GC
N
555 96 M
555 50 L
379 50 L
379 96 L
cp
f
GR
GS
[0.6 0 0 0.6 262.70013 37.56164] CT
/Helvetica 15 F
GS
[1 0 0 1 0 0] CT
0 6 moveto 
1 -1 scale
(Simulovan\341 data) t 
GR
GR
GS
[0.6 0 0 0.6 0 0] CT
0 0.447 0.741 RC
1 LJ
3.333 LW
N
384.007 62.603 M
434.078 62.603 L
S
GR
GS
[0.6 0 0 0.6 262.70013 50.03836] CT
N
1.141 6 M
1.141 -4.734 L
2.594 -4.734 L
8.234 3.688 L
8.234 -4.734 L
9.609 -4.734 L
9.609 6 L
8.141 6 L
2.5 -2.438 L
2.5 6 L
1.141 6 L
cp
16.895 5.047 M
16.161 5.656 15.489 5.914 QT
14.817 6.172 14.036 6.172 QT
12.754 6.172 12.067 5.547 QT
11.379 4.922 11.379 3.953 QT
11.379 3.375 11.637 2.906 QT
11.895 2.438 12.317 2.148 QT
12.739 1.859 13.27 1.719 QT
13.645 1.609 14.442 1.516 QT
16.036 1.328 16.786 1.063 QT
16.801 0.797 16.801 0.719 QT
16.801 -0.094 16.426 -0.422 QT
15.911 -0.859 14.926 -0.859 QT
13.989 -0.859 13.543 -0.539 QT
13.098 -0.219 12.895 0.609 QT
11.598 0.438 L
11.77 -0.391 12.176 -0.898 QT
12.583 -1.406 13.348 -1.68 QT
14.114 -1.953 15.114 -1.953 QT
16.114 -1.953 16.731 -1.719 QT
17.348 -1.484 17.645 -1.133 QT
17.942 -0.781 18.051 -0.234 QT
18.114 0.109 18.114 0.984 QT
18.114 2.734 L
18.114 4.578 18.2 5.063 QT
18.286 5.547 18.536 6 QT
17.161 6 L
16.958 5.594 16.895 5.047 QT
cp
16.786 2.094 M
16.067 2.391 14.629 2.594 QT
13.817 2.719 13.481 2.859 QT
13.145 3 12.965 3.281 QT
12.786 3.563 12.786 3.906 QT
12.786 4.438 13.184 4.789 QT
13.583 5.141 14.348 5.141 QT
15.114 5.141 15.708 4.805 QT
16.301 4.469 16.583 3.891 QT
16.786 3.453 16.786 2.578 QT
16.786 2.094 L
cp
20.159 6 M
20.159 -1.781 L
21.347 -1.781 L
21.347 -0.688 L
21.706 -1.266 22.315 -1.609 QT
22.925 -1.953 23.706 -1.953 QT
24.565 -1.953 25.12 -1.594 QT
25.675 -1.234 25.894 -0.594 QT
26.815 -1.953 28.3 -1.953 QT
29.456 -1.953 30.081 -1.313 QT
30.706 -0.672 30.706 0.656 QT
30.706 6 L
29.394 6 L
29.394 1.094 L
29.394 0.313 29.269 -0.039 QT
29.144 -0.391 28.8 -0.602 QT
28.456 -0.813 28.003 -0.813 QT
27.19 -0.813 26.644 -0.266 QT
26.097 0.281 26.097 1.484 QT
26.097 6 L
24.784 6 L
24.784 0.953 L
24.784 0.063 24.464 -0.375 QT
24.144 -0.813 23.409 -0.813 QT
22.847 -0.813 22.378 -0.516 QT
21.909 -0.219 21.698 0.344 QT
21.487 0.906 21.487 1.969 QT
21.487 6 L
20.159 6 L
cp
37.982 3.5 M
39.342 3.656 L
39.029 4.859 38.154 5.516 QT
37.279 6.172 35.92 6.172 QT
34.217 6.172 33.217 5.125 QT
32.217 4.078 32.217 2.172 QT
32.217 0.219 33.232 -0.867 QT
34.248 -1.953 35.857 -1.953 QT
37.42 -1.953 38.404 -0.891 QT
39.389 0.172 39.389 2.094 QT
39.389 2.219 39.389 2.453 QT
33.576 2.453 L
33.654 3.734 34.303 4.414 QT
34.951 5.094 35.936 5.094 QT
36.654 5.094 37.17 4.711 QT
37.686 4.328 37.982 3.5 QT
cp
33.654 1.359 M
37.998 1.359 L
37.904 0.375 37.498 -0.109 QT
36.873 -0.875 35.873 -0.875 QT
34.951 -0.875 34.334 -0.266 QT
33.717 0.344 33.654 1.359 QT
cp
35.67 -3.797 M
36.482 -5.047 L
37.967 -5.047 L
36.326 -3 L
34.92 -3 L
33.342 -5.047 L
34.842 -5.047 L
35.67 -3.797 L
cp
40.981 6 M
40.981 -1.781 L
42.168 -1.781 L
42.168 -0.594 L
42.622 -1.422 43.012 -1.688 QT
43.403 -1.953 43.856 -1.953 QT
44.528 -1.953 45.215 -1.531 QT
44.762 -0.313 L
44.278 -0.594 43.793 -0.594 QT
43.356 -0.594 43.012 -0.336 QT
42.668 -0.078 42.528 0.391 QT
42.309 1.094 42.309 1.922 QT
42.309 6 L
40.981 6 L
cp
43.012 -3.797 M
43.825 -5.047 L
45.309 -5.047 L
43.668 -3 L
42.262 -3 L
40.684 -5.047 L
42.184 -5.047 L
43.012 -3.797 L
cp
51.32 3.5 M
52.679 3.656 L
52.367 4.859 51.492 5.516 QT
50.617 6.172 49.257 6.172 QT
47.554 6.172 46.554 5.125 QT
45.554 4.078 45.554 2.172 QT
45.554 0.219 46.57 -0.867 QT
47.585 -1.953 49.195 -1.953 QT
50.757 -1.953 51.742 -0.891 QT
52.726 0.172 52.726 2.094 QT
52.726 2.219 52.726 2.453 QT
46.914 2.453 L
46.992 3.734 47.64 4.414 QT
48.289 5.094 49.273 5.094 QT
49.992 5.094 50.507 4.711 QT
51.023 4.328 51.32 3.5 QT
cp
46.992 1.359 M
51.335 1.359 L
51.242 0.375 50.835 -0.109 QT
50.21 -0.875 49.21 -0.875 QT
48.289 -0.875 47.671 -0.266 QT
47.054 0.344 46.992 1.359 QT
cp
54.334 6 M
54.334 -1.781 L
55.521 -1.781 L
55.521 -0.672 L
56.381 -1.953 58.006 -1.953 QT
58.709 -1.953 59.295 -1.703 QT
59.881 -1.453 60.178 -1.039 QT
60.475 -0.625 60.584 -0.063 QT
60.662 0.297 60.662 1.219 QT
60.662 6 L
59.334 6 L
59.334 1.266 L
59.334 0.469 59.186 0.07 QT
59.037 -0.328 58.646 -0.57 QT
58.256 -0.813 57.725 -0.813 QT
56.881 -0.813 56.271 -0.281 QT
55.662 0.25 55.662 1.75 QT
55.662 6 L
54.334 6 L
cp
67.754 5.047 M
67.02 5.656 66.348 5.914 QT
65.676 6.172 64.895 6.172 QT
63.614 6.172 62.926 5.547 QT
62.239 4.922 62.239 3.953 QT
62.239 3.375 62.497 2.906 QT
62.754 2.438 63.176 2.148 QT
63.598 1.859 64.129 1.719 QT
64.504 1.609 65.301 1.516 QT
66.895 1.328 67.645 1.063 QT
67.661 0.797 67.661 0.719 QT
67.661 -0.094 67.286 -0.422 QT
66.77 -0.859 65.786 -0.859 QT
64.848 -0.859 64.403 -0.539 QT
63.958 -0.219 63.754 0.609 QT
62.458 0.438 L
62.629 -0.391 63.036 -0.898 QT
63.442 -1.406 64.208 -1.68 QT
64.973 -1.953 65.973 -1.953 QT
66.973 -1.953 67.59 -1.719 QT
68.208 -1.484 68.504 -1.133 QT
68.801 -0.781 68.911 -0.234 QT
68.973 0.109 68.973 0.984 QT
68.973 2.734 L
68.973 4.578 69.059 5.063 QT
69.145 5.547 69.395 6 QT
68.02 6 L
67.817 5.594 67.754 5.047 QT
cp
67.645 2.094 M
66.926 2.391 65.489 2.594 QT
64.676 2.719 64.34 2.859 QT
64.004 3 63.825 3.281 QT
63.645 3.563 63.645 3.906 QT
63.645 4.438 64.043 4.789 QT
64.442 5.141 65.208 5.141 QT
65.973 5.141 66.567 4.805 QT
67.161 4.469 67.442 3.891 QT
67.645 3.453 67.645 2.578 QT
67.645 2.094 L
cp
64.598 -3 M
65.567 -5.047 L
67.301 -5.047 L
65.692 -3 L
64.598 -3 L
cp
80.233 6 M
80.233 5.016 L
79.499 6.172 78.061 6.172 QT
77.139 6.172 76.358 5.664 QT
75.577 5.156 75.147 4.234 QT
74.717 3.313 74.717 2.125 QT
74.717 0.953 75.108 0.008 QT
75.499 -0.938 76.272 -1.445 QT
77.045 -1.953 77.999 -1.953 QT
78.702 -1.953 79.256 -1.656 QT
79.811 -1.359 80.155 -0.891 QT
80.155 -4.734 L
81.467 -4.734 L
81.467 6 L
80.233 6 L
cp
76.077 2.125 M
76.077 3.609 76.702 4.352 QT
77.327 5.094 78.186 5.094 QT
79.045 5.094 79.655 4.383 QT
80.264 3.672 80.264 2.234 QT
80.264 0.625 79.647 -0.117 QT
79.03 -0.859 78.124 -0.859 QT
77.249 -0.859 76.663 -0.141 QT
76.077 0.578 76.077 2.125 QT
cp
88.606 5.047 M
87.872 5.656 87.2 5.914 QT
86.528 6.172 85.747 6.172 QT
84.466 6.172 83.778 5.547 QT
83.091 4.922 83.091 3.953 QT
83.091 3.375 83.349 2.906 QT
83.606 2.438 84.028 2.148 QT
84.45 1.859 84.981 1.719 QT
85.356 1.609 86.153 1.516 QT
87.747 1.328 88.497 1.063 QT
88.513 0.797 88.513 0.719 QT
88.513 -0.094 88.138 -0.422 QT
87.622 -0.859 86.638 -0.859 QT
85.7 -0.859 85.255 -0.539 QT
84.81 -0.219 84.606 0.609 QT
83.31 0.438 L
83.481 -0.391 83.888 -0.898 QT
84.294 -1.406 85.06 -1.68 QT
85.825 -1.953 86.825 -1.953 QT
87.825 -1.953 88.442 -1.719 QT
89.06 -1.484 89.356 -1.133 QT
89.653 -0.781 89.763 -0.234 QT
89.825 0.109 89.825 0.984 QT
89.825 2.734 L
89.825 4.578 89.911 5.063 QT
89.997 5.547 90.247 6 QT
88.872 6 L
88.669 5.594 88.606 5.047 QT
cp
88.497 2.094 M
87.778 2.391 86.341 2.594 QT
85.528 2.719 85.192 2.859 QT
84.856 3 84.677 3.281 QT
84.497 3.563 84.497 3.906 QT
84.497 4.438 84.896 4.789 QT
85.294 5.141 86.06 5.141 QT
86.825 5.141 87.419 4.805 QT
88.013 4.469 88.294 3.891 QT
88.497 3.453 88.497 2.578 QT
88.497 2.094 L
cp
94.761 4.828 M
94.949 5.984 L
94.386 6.109 93.949 6.109 QT
93.23 6.109 92.832 5.875 QT
92.433 5.641 92.277 5.273 QT
92.121 4.906 92.121 3.719 QT
92.121 -0.75 L
91.152 -0.75 L
91.152 -1.781 L
92.121 -1.781 L
92.121 -3.703 L
93.433 -4.5 L
93.433 -1.781 L
94.761 -1.781 L
94.761 -0.75 L
93.433 -0.75 L
93.433 3.797 L
93.433 4.359 93.503 4.523 QT
93.574 4.688 93.73 4.781 QT
93.886 4.875 94.167 4.875 QT
94.402 4.875 94.761 4.828 QT
cp
101.116 5.047 M
100.382 5.656 99.71 5.914 QT
99.038 6.172 98.257 6.172 QT
96.976 6.172 96.288 5.547 QT
95.601 4.922 95.601 3.953 QT
95.601 3.375 95.858 2.906 QT
96.116 2.438 96.538 2.148 QT
96.96 1.859 97.491 1.719 QT
97.866 1.609 98.663 1.516 QT
100.257 1.328 101.007 1.063 QT
101.022 0.797 101.022 0.719 QT
101.022 -0.094 100.647 -0.422 QT
100.132 -0.859 99.147 -0.859 QT
98.21 -0.859 97.765 -0.539 QT
97.319 -0.219 97.116 0.609 QT
95.819 0.438 L
95.991 -0.391 96.397 -0.898 QT
96.804 -1.406 97.569 -1.68 QT
98.335 -1.953 99.335 -1.953 QT
100.335 -1.953 100.952 -1.719 QT
101.569 -1.484 101.866 -1.133 QT
102.163 -0.781 102.272 -0.234 QT
102.335 0.109 102.335 0.984 QT
102.335 2.734 L
102.335 4.578 102.421 5.063 QT
102.507 5.547 102.757 6 QT
101.382 6 L
101.179 5.594 101.116 5.047 QT
cp
101.007 2.094 M
100.288 2.391 98.851 2.594 QT
98.038 2.719 97.702 2.859 QT
97.366 3 97.187 3.281 QT
97.007 3.563 97.007 3.906 QT
97.007 4.438 97.405 4.789 QT
97.804 5.141 98.569 5.141 QT
99.335 5.141 99.929 4.805 QT
100.522 4.469 100.804 3.891 QT
101.007 3.453 101.007 2.578 QT
101.007 2.094 L
cp
f
GR
GS
[0.6 0 0 0.6 0 0] CT
0.851 0.325 0.098 RC
1 LJ
3.333 LW
N
384.007 83.397 M
434.078 83.397 L
S
GR
GS
[0.6 0 0 0.6 0 0] CT
0.149 GC
10.0 ML
0.833 LW
N
379 96 M
379 50 L
555 50 L
555 96 L
cp
S
GR
%%Trailer
%%Pages: 1
%%EOF
