%!PS-Adobe-3.0 EPSF-3.0
%%Creator: (MATLAB, The Mathworks, Inc. Version 9.14.0.2206163 \(R2023a\). Operating System: Windows 10)
%%Title: C:/Users/radac/Desktop/Bachelor_thesis/thesis/Model/figs/model_a.eps
%%CreationDate: 2023-05-20T19:23:52
%%Pages: (atend)
%%BoundingBox:     0     0   420   315
%%LanguageLevel: 3
%%EndComments
%%BeginProlog
%%BeginResource: procset (Apache XML Graphics Std ProcSet) 1.2 0
%%Version: 1.2 0
%%Copyright: (Copyright 2001-2003,2010 The Apache Software Foundation. License terms: http://www.apache.org/licenses/LICENSE-2.0)
/bd{bind def}bind def
/ld{load def}bd
/GR/grestore ld
/GS/gsave ld
/RM/rmoveto ld
/C/curveto ld
/t/show ld
/L/lineto ld
/ML/setmiterlimit ld
/CT/concat ld
/f/fill ld
/N/newpath ld
/S/stroke ld
/CC/setcmykcolor ld
/A/ashow ld
/cp/closepath ld
/RC/setrgbcolor ld
/LJ/setlinejoin ld
/GC/setgray ld
/LW/setlinewidth ld
/M/moveto ld
/re {4 2 roll M
1 index 0 rlineto
0 exch rlineto
neg 0 rlineto
cp } bd
/_ctm matrix def
/_tm matrix def
/BT { _ctm currentmatrix pop matrix _tm copy pop 0 0 moveto } bd
/ET { _ctm setmatrix } bd
/iTm { _ctm setmatrix _tm concat } bd
/Tm { _tm astore pop iTm 0 0 moveto } bd
/ux 0.0 def
/uy 0.0 def
/F {
  /Tp exch def
  /Tf exch def
  Tf findfont Tp scalefont setfont
  /cf Tf def  /cs Tp def
} bd
/ULS {currentpoint /uy exch def /ux exch def} bd
/ULE {
  /Tcx currentpoint pop def
  gsave
  newpath
  cf findfont cs scalefont dup
  /FontMatrix get 0 get /Ts exch def /FontInfo get dup
  /UnderlinePosition get Ts mul /To exch def
  /UnderlineThickness get Ts mul /Tt exch def
  ux uy To add moveto  Tcx uy To add lineto
  Tt setlinewidth stroke
  grestore
} bd
/OLE {
  /Tcx currentpoint pop def
  gsave
  newpath
  cf findfont cs scalefont dup
  /FontMatrix get 0 get /Ts exch def /FontInfo get dup
  /UnderlinePosition get Ts mul /To exch def
  /UnderlineThickness get Ts mul /Tt exch def
  ux uy To add cs add moveto Tcx uy To add cs add lineto
  Tt setlinewidth stroke
  grestore
} bd
/SOE {
  /Tcx currentpoint pop def
  gsave
  newpath
  cf findfont cs scalefont dup
  /FontMatrix get 0 get /Ts exch def /FontInfo get dup
  /UnderlinePosition get Ts mul /To exch def
  /UnderlineThickness get Ts mul /Tt exch def
  ux uy To add cs 10 mul 26 idiv add moveto Tcx uy To add cs 10 mul 26 idiv add lineto
  Tt setlinewidth stroke
  grestore
} bd
/QT {
/Y22 exch store
/X22 exch store
/Y21 exch store
/X21 exch store
currentpoint
/Y21 load 2 mul add 3 div exch
/X21 load 2 mul add 3 div exch
/X21 load 2 mul /X22 load add 3 div
/Y21 load 2 mul /Y22 load add 3 div
/X22 load /Y22 load curveto
} bd
/SSPD {
dup length /d exch dict def
{
/v exch def
/k exch def
currentpagedevice k known {
/cpdv currentpagedevice k get def
v cpdv ne {
/upd false def
/nullv v type /nulltype eq def
/nullcpdv cpdv type /nulltype eq def
nullv nullcpdv or
{
/upd true def
} {
/sametype v type cpdv type eq def
sametype {
v type /arraytype eq {
/vlen v length def
/cpdvlen cpdv length def
vlen cpdvlen eq {
0 1 vlen 1 sub {
/i exch def
/obj v i get def
/cpdobj cpdv i get def
obj cpdobj ne {
/upd true def
exit
} if
} for
} {
/upd true def
} ifelse
} {
v type /dicttype eq {
v {
/dv exch def
/dk exch def
/cpddv cpdv dk get def
dv cpddv ne {
/upd true def
exit
} if
} forall
} {
/upd true def
} ifelse
} ifelse
} if
} ifelse
upd true eq {
d k v put
} if
} if
} if
} forall
d length 0 gt {
d setpagedevice
} if
} bd
/RE { % /NewFontName [NewEncodingArray] /FontName RE -
  findfont dup length dict begin
  {
    1 index /FID ne
    {def} {pop pop} ifelse
  } forall
  /Encoding exch def
  /FontName 1 index def
  currentdict definefont pop
  end
} bind def
%%EndResource
%%BeginResource: procset (Apache XML Graphics EPS ProcSet) 1.0 0
%%Version: 1.0 0
%%Copyright: (Copyright 2002-2003 The Apache Software Foundation. License terms: http://www.apache.org/licenses/LICENSE-2.0)
/BeginEPSF { %def
/b4_Inc_state save def         % Save state for cleanup
/dict_count countdictstack def % Count objects on dict stack
/op_count count 1 sub def      % Count objects on operand stack
userdict begin                 % Push userdict on dict stack
/showpage { } def              % Redefine showpage, { } = null proc
0 setgray 0 setlinecap         % Prepare graphics state
1 setlinewidth 0 setlinejoin
10 setmiterlimit [ ] 0 setdash newpath
/languagelevel where           % If level not equal to 1 then
{pop languagelevel             % set strokeadjust and
1 ne                           % overprint to their defaults.
{false setstrokeadjust false setoverprint
} if
} if
} bd
/EndEPSF { %def
count op_count sub {pop} repeat            % Clean up stacks
countdictstack dict_count sub {end} repeat
b4_Inc_state restore
} bd
%%EndResource
%FOPBeginFontDict
%%IncludeResource: font Courier-Oblique
%%IncludeResource: font Courier-BoldOblique
%%IncludeResource: font Courier-Bold
%%IncludeResource: font ZapfDingbats
%%IncludeResource: font Symbol
%%IncludeResource: font Helvetica
%%IncludeResource: font Helvetica-Oblique
%%IncludeResource: font Helvetica-Bold
%%IncludeResource: font Helvetica-BoldOblique
%%IncludeResource: font Times-Roman
%%IncludeResource: font Times-Italic
%%IncludeResource: font Times-Bold
%%IncludeResource: font Times-BoldItalic
%%IncludeResource: font Courier
%FOPEndFontDict
%%BeginResource: encoding WinAnsiEncoding
/WinAnsiEncoding [
/.notdef /.notdef /.notdef /.notdef /.notdef
/.notdef /.notdef /.notdef /.notdef /.notdef
/.notdef /.notdef /.notdef /.notdef /.notdef
/.notdef /.notdef /.notdef /.notdef /.notdef
/.notdef /.notdef /.notdef /.notdef /.notdef
/.notdef /.notdef /.notdef /.notdef /.notdef
/.notdef /.notdef /space /exclam /quotedbl
/numbersign /dollar /percent /ampersand /quotesingle
/parenleft /parenright /asterisk /plus /comma
/hyphen /period /slash /zero /one
/two /three /four /five /six
/seven /eight /nine /colon /semicolon
/less /equal /greater /question /at
/A /B /C /D /E
/F /G /H /I /J
/K /L /M /N /O
/P /Q /R /S /T
/U /V /W /X /Y
/Z /bracketleft /backslash /bracketright /asciicircum
/underscore /quoteleft /a /b /c
/d /e /f /g /h
/i /j /k /l /m
/n /o /p /q /r
/s /t /u /v /w
/x /y /z /braceleft /bar
/braceright /asciitilde /bullet /Euro /bullet
/quotesinglbase /florin /quotedblbase /ellipsis /dagger
/daggerdbl /circumflex /perthousand /Scaron /guilsinglleft
/OE /bullet /Zcaron /bullet /bullet
/quoteleft /quoteright /quotedblleft /quotedblright /bullet
/endash /emdash /asciitilde /trademark /scaron
/guilsinglright /oe /bullet /zcaron /Ydieresis
/space /exclamdown /cent /sterling /currency
/yen /brokenbar /section /dieresis /copyright
/ordfeminine /guillemotleft /logicalnot /sfthyphen /registered
/macron /degree /plusminus /twosuperior /threesuperior
/acute /mu /paragraph /middot /cedilla
/onesuperior /ordmasculine /guillemotright /onequarter /onehalf
/threequarters /questiondown /Agrave /Aacute /Acircumflex
/Atilde /Adieresis /Aring /AE /Ccedilla
/Egrave /Eacute /Ecircumflex /Edieresis /Igrave
/Iacute /Icircumflex /Idieresis /Eth /Ntilde
/Ograve /Oacute /Ocircumflex /Otilde /Odieresis
/multiply /Oslash /Ugrave /Uacute /Ucircumflex
/Udieresis /Yacute /Thorn /germandbls /agrave
/aacute /acircumflex /atilde /adieresis /aring
/ae /ccedilla /egrave /eacute /ecircumflex
/edieresis /igrave /iacute /icircumflex /idieresis
/eth /ntilde /ograve /oacute /ocircumflex
/otilde /odieresis /divide /oslash /ugrave
/uacute /ucircumflex /udieresis /yacute /thorn
/ydieresis
] def
%%EndResource
%FOPBeginFontReencode
/Courier-Oblique findfont
dup length dict begin
  {1 index /FID ne {def} {pop pop} ifelse} forall
  /Encoding WinAnsiEncoding def
  currentdict
end
/Courier-Oblique exch definefont pop
/Courier-BoldOblique findfont
dup length dict begin
  {1 index /FID ne {def} {pop pop} ifelse} forall
  /Encoding WinAnsiEncoding def
  currentdict
end
/Courier-BoldOblique exch definefont pop
/Courier-Bold findfont
dup length dict begin
  {1 index /FID ne {def} {pop pop} ifelse} forall
  /Encoding WinAnsiEncoding def
  currentdict
end
/Courier-Bold exch definefont pop
/Helvetica findfont
dup length dict begin
  {1 index /FID ne {def} {pop pop} ifelse} forall
  /Encoding WinAnsiEncoding def
  currentdict
end
/Helvetica exch definefont pop
/Helvetica-Oblique findfont
dup length dict begin
  {1 index /FID ne {def} {pop pop} ifelse} forall
  /Encoding WinAnsiEncoding def
  currentdict
end
/Helvetica-Oblique exch definefont pop
/Helvetica-Bold findfont
dup length dict begin
  {1 index /FID ne {def} {pop pop} ifelse} forall
  /Encoding WinAnsiEncoding def
  currentdict
end
/Helvetica-Bold exch definefont pop
/Helvetica-BoldOblique findfont
dup length dict begin
  {1 index /FID ne {def} {pop pop} ifelse} forall
  /Encoding WinAnsiEncoding def
  currentdict
end
/Helvetica-BoldOblique exch definefont pop
/Times-Roman findfont
dup length dict begin
  {1 index /FID ne {def} {pop pop} ifelse} forall
  /Encoding WinAnsiEncoding def
  currentdict
end
/Times-Roman exch definefont pop
/Times-Italic findfont
dup length dict begin
  {1 index /FID ne {def} {pop pop} ifelse} forall
  /Encoding WinAnsiEncoding def
  currentdict
end
/Times-Italic exch definefont pop
/Times-Bold findfont
dup length dict begin
  {1 index /FID ne {def} {pop pop} ifelse} forall
  /Encoding WinAnsiEncoding def
  currentdict
end
/Times-Bold exch definefont pop
/Times-BoldItalic findfont
dup length dict begin
  {1 index /FID ne {def} {pop pop} ifelse} forall
  /Encoding WinAnsiEncoding def
  currentdict
end
/Times-BoldItalic exch definefont pop
/Courier findfont
dup length dict begin
  {1 index /FID ne {def} {pop pop} ifelse} forall
  /Encoding WinAnsiEncoding def
  currentdict
end
/Courier exch definefont pop
%FOPEndFontReencode
%%EndProlog
%%Page: 1 1
%%PageBoundingBox: 0 0 420 315
%%BeginPageSetup
[1 0 0 -1 0 315] CT
%%EndPageSetup
GS
[0.6 0 0 0.6 0 0] CT
1 GC
N
0 0 700 525 re
f
GR
GS
[0.6 0 0 0.6 0 0] CT
1 GC
N
0 0 700 525 re
f
GR
GS
[0.6 0 0 0.6 0 0] CT
1 GC
N
93 454 M
634 454 L
634 39 L
93 39 L
cp
f
GR
GS
[0.6 0 0 0.6 0 0] CT
0.873 GC
1 LJ
0.833 LW
N
93 454 M
93 39 L
S
GR
GS
[0.6 0 0 0.6 0 0] CT
0.873 GC
1 LJ
0.833 LW
N
201.2 454 M
201.2 39 L
S
GR
GS
[0.6 0 0 0.6 0 0] CT
0.873 GC
1 LJ
0.833 LW
N
309.4 454 M
309.4 39 L
S
GR
GS
[0.6 0 0 0.6 0 0] CT
0.873 GC
1 LJ
0.833 LW
N
417.6 454 M
417.6 39 L
S
GR
GS
[0.6 0 0 0.6 0 0] CT
0.873 GC
1 LJ
0.833 LW
N
525.8 454 M
525.8 39 L
S
GR
GS
[0.6 0 0 0.6 0 0] CT
0.873 GC
1 LJ
0.833 LW
N
634 454 M
634 39 L
S
GR
GS
[0.6 0 0 0.6 0 0] CT
0.873 GC
1 LJ
0.833 LW
N
634 454 M
93 454 L
S
GR
GS
[0.6 0 0 0.6 0 0] CT
0.873 GC
1 LJ
0.833 LW
N
634 384.833 M
93 384.833 L
S
GR
GS
[0.6 0 0 0.6 0 0] CT
0.873 GC
1 LJ
0.833 LW
N
634 315.667 M
93 315.667 L
S
GR
GS
[0.6 0 0 0.6 0 0] CT
0.873 GC
1 LJ
0.833 LW
N
634 246.5 M
93 246.5 L
S
GR
GS
[0.6 0 0 0.6 0 0] CT
0.873 GC
1 LJ
0.833 LW
N
634 177.333 M
93 177.333 L
S
GR
GS
[0.6 0 0 0.6 0 0] CT
0.873 GC
1 LJ
0.833 LW
N
634 108.167 M
93 108.167 L
S
GR
GS
[0.6 0 0 0.6 0 0] CT
0.873 GC
1 LJ
0.833 LW
N
634 39 M
93 39 L
S
GR
GS
[0.6 0 0 0.6 0 0] CT
0.149 GC
2 setlinecap
1 LJ
0.833 LW
N
93 454 M
634 454 L
S
GR
GS
[0.6 0 0 0.6 0 0] CT
0.149 GC
2 setlinecap
1 LJ
0.833 LW
N
93 39 M
634 39 L
S
GR
GS
[0.6 0 0 0.6 0 0] CT
0.149 GC
2 setlinecap
1 LJ
0.833 LW
N
93 454 M
93 448.59 L
S
GR
GS
[0.6 0 0 0.6 0 0] CT
0.149 GC
2 setlinecap
1 LJ
0.833 LW
N
201.2 454 M
201.2 448.59 L
S
GR
GS
[0.6 0 0 0.6 0 0] CT
0.149 GC
2 setlinecap
1 LJ
0.833 LW
N
309.4 454 M
309.4 448.59 L
S
GR
GS
[0.6 0 0 0.6 0 0] CT
0.149 GC
2 setlinecap
1 LJ
0.833 LW
N
417.6 454 M
417.6 448.59 L
S
GR
GS
[0.6 0 0 0.6 0 0] CT
0.149 GC
2 setlinecap
1 LJ
0.833 LW
N
525.8 454 M
525.8 448.59 L
S
GR
GS
[0.6 0 0 0.6 0 0] CT
0.149 GC
2 setlinecap
1 LJ
0.833 LW
N
634 454 M
634 448.59 L
S
GR
GS
[0.6 0 0 0.6 0 0] CT
0.149 GC
2 setlinecap
1 LJ
0.833 LW
N
93 39 M
93 44.41 L
S
GR
GS
[0.6 0 0 0.6 0 0] CT
0.149 GC
2 setlinecap
1 LJ
0.833 LW
N
201.2 39 M
201.2 44.41 L
S
GR
GS
[0.6 0 0 0.6 0 0] CT
0.149 GC
2 setlinecap
1 LJ
0.833 LW
N
309.4 39 M
309.4 44.41 L
S
GR
GS
[0.6 0 0 0.6 0 0] CT
0.149 GC
2 setlinecap
1 LJ
0.833 LW
N
417.6 39 M
417.6 44.41 L
S
GR
GS
[0.6 0 0 0.6 0 0] CT
0.149 GC
2 setlinecap
1 LJ
0.833 LW
N
525.8 39 M
525.8 44.41 L
S
GR
GS
[0.6 0 0 0.6 0 0] CT
0.149 GC
2 setlinecap
1 LJ
0.833 LW
N
634 39 M
634 44.41 L
S
GR
GS
[0.6 0 0 0.6 55.8 277.2] CT
0.149 GC
/Helvetica 23.333 F
GS
[1 0 0 1 0 0] CT
-6.5 24 moveto 
1 -1 scale
(0) t 
GR
GR
GS
[0.6 0 0 0.6 120.72 277.2] CT
0.149 GC
/Helvetica 23.333 F
GS
[1 0 0 1 0 0] CT
-19.5 24 moveto 
1 -1 scale
(200) t 
GR
GR
GS
[0.6 0 0 0.6 185.64 277.2] CT
0.149 GC
/Helvetica 23.333 F
GS
[1 0 0 1 0 0] CT
-19.5 24 moveto 
1 -1 scale
(400) t 
GR
GR
GS
[0.6 0 0 0.6 250.56 277.2] CT
0.149 GC
/Helvetica 23.333 F
GS
[1 0 0 1 0 0] CT
-19.5 24 moveto 
1 -1 scale
(600) t 
GR
GR
GS
[0.6 0 0 0.6 315.47999 277.2] CT
0.149 GC
/Helvetica 23.333 F
GS
[1 0 0 1 0 0] CT
-19.5 24 moveto 
1 -1 scale
(800) t 
GR
GR
GS
[0.6 0 0 0.6 380.4 277.2] CT
0.149 GC
/Helvetica 23.333 F
GS
[1 0 0 1 0 0] CT
-26 24 moveto 
1 -1 scale
(1000) t 
GR
GR
GS
[0.6 0 0 0.6 218.10016 295.60001] CT
0.149 GC
/Helvetica 25.667 F
GS
[1 0 0 1 0 0] CT
-28 26 moveto 
1 -1 scale
(s [m]) t 
GR
GR
GS
[0.6 0 0 0.6 0 0] CT
0.149 GC
2 setlinecap
1 LJ
0.833 LW
N
93 454 M
93 39 L
S
GR
GS
[0.6 0 0 0.6 0 0] CT
0.149 GC
2 setlinecap
1 LJ
0.833 LW
N
634 454 M
634 39 L
S
GR
GS
[0.6 0 0 0.6 0 0] CT
0.149 GC
2 setlinecap
1 LJ
0.833 LW
N
93 454 M
98.41 454 L
S
GR
GS
[0.6 0 0 0.6 0 0] CT
0.149 GC
2 setlinecap
1 LJ
0.833 LW
N
93 384.833 M
98.41 384.833 L
S
GR
GS
[0.6 0 0 0.6 0 0] CT
0.149 GC
2 setlinecap
1 LJ
0.833 LW
N
93 315.667 M
98.41 315.667 L
S
GR
GS
[0.6 0 0 0.6 0 0] CT
0.149 GC
2 setlinecap
1 LJ
0.833 LW
N
93 246.5 M
98.41 246.5 L
S
GR
GS
[0.6 0 0 0.6 0 0] CT
0.149 GC
2 setlinecap
1 LJ
0.833 LW
N
93 177.333 M
98.41 177.333 L
S
GR
GS
[0.6 0 0 0.6 0 0] CT
0.149 GC
2 setlinecap
1 LJ
0.833 LW
N
93 108.167 M
98.41 108.167 L
S
GR
GS
[0.6 0 0 0.6 0 0] CT
0.149 GC
2 setlinecap
1 LJ
0.833 LW
N
93 39 M
98.41 39 L
S
GR
GS
[0.6 0 0 0.6 0 0] CT
0.149 GC
2 setlinecap
1 LJ
0.833 LW
N
634 454 M
628.59 454 L
S
GR
GS
[0.6 0 0 0.6 0 0] CT
0.149 GC
2 setlinecap
1 LJ
0.833 LW
N
634 384.833 M
628.59 384.833 L
S
GR
GS
[0.6 0 0 0.6 0 0] CT
0.149 GC
2 setlinecap
1 LJ
0.833 LW
N
634 315.667 M
628.59 315.667 L
S
GR
GS
[0.6 0 0 0.6 0 0] CT
0.149 GC
2 setlinecap
1 LJ
0.833 LW
N
634 246.5 M
628.59 246.5 L
S
GR
GS
[0.6 0 0 0.6 0 0] CT
0.149 GC
2 setlinecap
1 LJ
0.833 LW
N
634 177.333 M
628.59 177.333 L
S
GR
GS
[0.6 0 0 0.6 0 0] CT
0.149 GC
2 setlinecap
1 LJ
0.833 LW
N
634 108.167 M
628.59 108.167 L
S
GR
GS
[0.6 0 0 0.6 0 0] CT
0.149 GC
2 setlinecap
1 LJ
0.833 LW
N
634 39 M
628.59 39 L
S
GR
GS
[0.6 0 0 0.6 51 272.4] CT
0.149 GC
/Helvetica 23.333 F
GS
[1 0 0 1 0 0] CT
-41 9 moveto 
1 -1 scale
(-0.2) t 
GR
GR
GS
[0.6 0 0 0.6 51 230.90001] CT
0.149 GC
/Helvetica 23.333 F
GS
[1 0 0 1 0 0] CT
-13 9 moveto 
1 -1 scale
(0) t 
GR
GR
GS
[0.6 0 0 0.6 51 189.39999] CT
0.149 GC
/Helvetica 23.333 F
GS
[1 0 0 1 0 0] CT
-33 9 moveto 
1 -1 scale
(0.2) t 
GR
GR
GS
[0.6 0 0 0.6 51 147.9] CT
0.149 GC
/Helvetica 23.333 F
GS
[1 0 0 1 0 0] CT
-33 9 moveto 
1 -1 scale
(0.4) t 
GR
GR
GS
[0.6 0 0 0.6 51 106.4] CT
0.149 GC
/Helvetica 23.333 F
GS
[1 0 0 1 0 0] CT
-33 9 moveto 
1 -1 scale
(0.6) t 
GR
GR
GS
[0.6 0 0 0.6 51 64.9] CT
0.149 GC
/Helvetica 23.333 F
GS
[1 0 0 1 0 0] CT
-33 9 moveto 
1 -1 scale
(0.8) t 
GR
GR
GS
[0.6 0 0 0.6 51 23.4] CT
0.149 GC
/Helvetica 23.333 F
GS
[1 0 0 1 0 0] CT
-13 9 moveto 
1 -1 scale
(1) t 
GR
GR
GS
[0 -0.6 0.6 0 19.8 174.6] CT
0.149 GC
/Helvetica 25.667 F
GS
[1 0 0 1 0 0] CT
0 0 moveto 
1 -1 scale
(a [m/s) t 
GR
GR
GS
[0 -0.6 0.6 0 12.6 132.6] CT
0.149 GC
/Helvetica 20.533 F
GS
[1 0 0 1 0 0] CT
0 0 moveto 
1 -1 scale
(2) t 
GR
GR
GS
[0 -0.6 0.6 0 19.8 125.4] CT
0.149 GC
/Helvetica 25.667 F
GS
[1 0 0 1 0 0] CT
0 0 moveto 
1 -1 scale
(]) t 
GR
GR
GS
[0.6 0 0 0.6 0 0] CT
0 0 1 RC
1 LJ
3.333 LW
N
93 384.833 M
93.027 361.653 L
93.054 346.101 L
93.076 319.857 L
93.114 297.106 L
93.146 277.467 L
93.173 266.378 L
93.2 257.272 L
93.238 245.507 L
93.265 238.151 L
93.298 231.91 L
93.33 226.459 L
93.357 223.72 L
93.39 219.16 L
93.427 215.206 L
93.465 215.206 L
93.503 211.48 L
93.541 207.955 L
93.584 207.955 L
93.617 206.403 L
93.66 204.279 L
93.692 203.416 L
93.747 201.665 L
93.779 201.206 L
93.812 200.448 L
93.839 199.919 L
93.866 199.365 L
93.898 199.018 L
93.931 198.694 L
93.963 198.345 L
94.001 198.032 L
94.033 197.837 L
94.066 197.281 L
94.098 197.192 L
94.136 197.484 L
94.169 197.35 L
94.212 197.145 L
94.255 197.034 L
94.288 197.055 L
94.331 196.949 L
94.38 196.871 L
94.423 196.786 L
94.466 196.96 L
94.536 196.96 L
94.618 196.741 L
94.645 196.58 L
94.699 196.746 L
94.774 196.879 L
94.802 197.459 L
94.85 196.745 L
94.91 196.127 L
94.996 196.363 L
95.04 196.296 L
95.094 196.527 L
95.126 196.496 L
95.191 196.276 L
95.224 195.83 L
95.283 196.065 L
95.337 195.988 L
95.38 196.238 L
95.429 196.031 L
95.467 196.22 L
95.51 196.503 L
95.564 196.517 L
95.608 196.398 L
95.656 196.697 L
95.705 196.501 L
95.748 196.719 L
95.802 196.815 L
95.856 196.858 L
95.9 196.74 L
95.943 196.347 L
96.003 195.455 L
96.051 195.434 L
96.111 194.38 L
96.154 193.539 L
96.219 192.448 L
96.262 191.541 L
96.322 189.891 L
96.376 189.153 L
96.435 188.628 L
96.495 188.137 L
96.554 187.575 L
96.603 187.066 L
96.663 186.399 L
96.722 185.635 L
96.776 184.702 L
96.836 183.655 L
96.89 182.66 L
96.949 181.714 L
97.014 179.694 L
97.079 177.654 L
97.139 167.604 L
97.193 157.155 L
97.236 143.617 L
97.312 143.084 L
97.388 142.909 L
97.463 143.755 L
97.539 142.836 L
97.615 142.438 L
97.696 141.83 L
97.772 141.865 L
97.847 141.311 L
97.923 140.633 L
98.004 141.995 L
98.091 141.752 L
98.172 141.755 L
98.248 141.801 L
98.329 141.839 L
98.421 141.816 L
98.497 141.748 L
98.578 141.692 L
98.659 141.696 L
98.745 141.489 L
98.832 141.279 L
98.919 141.488 L
99 141.434 L
99.092 141.416 L
99.173 141.53 L
99.259 141.441 L
99.357 141.354 L
99.432 141.294 L
99.53 141.305 L
99.622 141.352 L
99.714 141.34 L
99.806 141.434 L
99.898 141.368 L
99.99 141.215 L
100.087 141.261 L
100.179 141.39 L
100.271 141.436 L
100.368 141.558 L
100.455 141.584 L
100.552 141.691 L
100.65 141.842 L
100.747 141.779 L
100.844 141.734 L
100.942 141.8 L
101.045 141.843 L
101.142 141.906 L
101.245 142.057 L
101.342 142.09 L
101.445 141.924 L
101.559 141.88 L
101.645 141.784 L
101.753 141.754 L
101.856 141.845 L
101.964 141.835 L
102.078 141.892 L
102.165 141.949 L
102.267 142.063 L
102.376 142.169 L
102.484 142.292 L
102.592 142.396 L
102.7 142.058 L
102.808 142.188 L
102.927 142.363 L
103.041 142.51 L
103.155 142.694 L
103.257 142.754 L
103.371 142.787 L
103.479 142.888 L
103.604 142.794 L
103.712 142.874 L
103.831 142.757 L
103.955 142.884 L
104.069 142.893 L
104.188 142.898 L
104.301 142.932 L
104.426 142.922 L
104.55 143.069 L
104.669 143.025 L
104.783 143.236 L
104.907 143.106 L
105.032 143.189 L
105.151 143.096 L
105.275 143.111 L
105.394 143.117 L
105.513 143.252 L
105.638 143.479 L
105.762 143.417 L
105.887 143.546 L
106.022 143.569 L
106.152 143.701 L
106.271 143.842 L
106.395 143.865 L
106.536 143.905 L
106.66 143.961 L
106.796 143.943 L
106.925 143.91 L
107.061 143.843 L
107.201 143.705 L
107.315 143.583 L
107.45 143.53 L
107.585 143.422 L
107.726 143.278 L
107.856 143.221 L
107.991 143.213 L
108.132 143.216 L
108.278 143.207 L
108.413 143.216 L
108.548 143.379 L
108.678 143.385 L
108.819 143.488 L
108.96 143.503 L
109.106 143.722 L
109.246 143.721 L
109.392 143.916 L
109.528 143.973 L
109.679 143.927 L
109.825 143.857 L
109.96 143.874 L
110.117 143.708 L
110.252 143.584 L
110.399 143.499 L
111.004 143.478 L
111.156 143.404 L
111.286 143.445 L
111.437 143.418 L
111.589 143.486 L
111.74 143.434 L
111.897 143.316 L
112.049 143.417 L
112.205 143.474 L
112.357 143.416 L
112.503 143.283 L
112.655 143.206 L
112.822 143.07 L
112.979 142.732 L
113.12 142.561 L
113.282 142.314 L
113.439 142.311 L
113.596 142.286 L
113.742 142.296 L
113.904 142.351 L
114.077 142.514 L
114.234 142.725 L
114.386 142.831 L
114.548 142.949 L
114.71 143.236 L
114.878 143.198 L
115.035 143.291 L
115.213 143.418 L
115.37 143.349 L
115.527 143.234 L
115.684 143.195 L
115.857 143.402 L
116.03 143.313 L
116.187 143.461 L
116.36 143.663 L
116.528 143.793 L
116.685 143.589 L
116.858 143.545 L
117.026 143.445 L
117.194 143.567 L
117.361 143.569 L
117.54 143.811 L
117.718 143.562 L
117.805 144.616 L
117.973 144.61 L
118.157 144.697 L
118.335 144.731 L
118.524 144.722 L
118.692 144.506 L
118.876 144.391 L
119.055 144.23 L
119.222 144.177 L
119.412 143.989 L
119.585 143.865 L
119.763 143.82 L
119.953 143.982 L
120.131 143.888 L
120.304 143.949 L
120.494 143.897 L
120.683 143.973 L
120.872 143.689 L
121.04 143.603 L
121.229 143.505 L
121.413 143.369 L
121.603 143.22 L
121.792 143.288 L
121.981 143.638 L
122.171 143.946 L
122.355 144.284 L
122.544 144.511 L
122.75 144.756 L
122.944 144.936 L
123.123 145.075 L
123.318 144.772 L
123.507 144.694 L
123.696 144.646 L
123.902 144.693 L
124.097 144.585 L
124.286 144.47 L
124.475 144.319 L
124.676 144.277 L
124.881 144.19 L
125.07 143.903 L
125.271 143.929 L
125.476 143.521 L
125.666 143.781 L
125.866 143.838 L
126.055 143.97 L
126.266 143.994 L
126.466 144.098 L
126.677 144.152 L
126.888 144.019 L
127.094 143.706 L
127.299 143.449 L
127.489 143.289 L
127.7 143.862 L
127.922 144.569 L
128.111 145.383 L
128.316 145.177 L
128.533 145.669 L
128.744 145.431 L
128.944 145.092 L
129.166 142.969 L
129.366 144.456 L
129.577 143.703 L
129.804 145.698 L
129.999 145.693 L
130.226 145.977 L
130.426 146.415 L
130.643 146.354 L
130.865 146.879 L
131.076 147.039 L
131.292 146.994 L
131.508 147.24 L
131.725 147.569 L
131.952 147.495 L
132.163 147.189 L
132.385 147.078 L
132.607 146.849 L
132.818 146.97 L
133.045 146.993 L
133.267 147.131 L
133.494 147.278 L
133.71 147.339 L
133.927 147.555 L
134.154 147.45 L
134.381 147.305 L
134.592 147.018 L
134.819 146.992 L
135.047 146.72 L
135.274 146.687 L
135.506 146.618 L
135.734 146.399 L
135.966 146.525 L
136.199 146.741 L
136.415 146.675 L
136.648 146.503 L
136.886 146.414 L
137.119 146.27 L
137.357 146.191 L
137.595 146.132 L
137.811 146.253 L
138.049 146.014 L
138.287 145.957 L
138.514 145.996 L
138.752 146.02 L
138.98 145.871 L
139.223 145.789 L
139.461 145.792 L
139.699 145.697 L
139.948 145.777 L
140.181 145.741 L
140.419 146.482 L
140.662 147.034 L
140.911 147.209 L
141.144 148.626 L
141.387 149.487 L
141.641 148.692 L
141.879 148.697 L
142.134 147.418 L
142.35 147.865 L
142.599 147.942 L
142.853 147.08 L
143.086 147.437 L
143.351 146.085 L
143.594 145.877 L
143.838 144.999 L
144.384 145.098 L
144.628 143.876 L
144.882 144.131 L
145.115 143.897 L
145.369 144.107 L
145.628 144.342 L
145.867 144.323 L
146.132 144.479 L
146.386 144.655 L
146.635 145.076 L
146.905 145.14 L
147.138 145.068 L
147.392 145.022 L
147.657 144.754 L
147.922 144.669 L
148.182 144.443 L
148.436 143.983 L
148.701 143.93 L
148.961 144.096 L
149.226 144.239 L
149.497 144.469 L
149.756 144.871 L
150 145.162 L
150.286 145.41 L
150.519 145.896 L
150.8 146.383 L
151.076 146.553 L
151.331 146.91 L
151.579 146.921 L
151.861 146.931 L
152.386 147.197 L
152.645 147.754 L
152.927 147.928 L
153.186 148.239 L
153.451 148.497 L
153.722 149.053 L
153.982 149.476 L
154.252 149.816 L
154.528 151.313 L
154.82 152.345 L
155.085 153.853 L
155.35 154.916 L
155.615 153.551 L
155.891 153.091 L
156.183 152.28 L
156.448 151.747 L
156.719 152.006 L
157 152.54 L
157.282 156.047 L
157.552 155.794 L
157.839 153.435 L
158.126 154.366 L
158.391 153.302 L
158.585 154.853 L
158.867 155.954 L
159.153 155.284 L
159.419 155.053 L
159.722 154.535 L
159.987 153.647 L
160.273 153.161 L
160.56 151.933 L
160.858 152.831 L
161.139 150.35 L
161.431 150.729 L
161.707 149.286 L
161.977 148.189 L
162.286 149.629 L
162.578 149.102 L
162.849 152.492 L
163.157 154.178 L
163.433 155.68 L
163.73 158.748 L
164.179 157.587 L
164.466 156.921 L
164.742 155.371 L
165.045 154.292 L
165.337 155.267 L
165.624 150.948 L
165.927 146.734 L
166.23 148.148 L
166.538 151.448 L
166.819 154.462 L
167.128 151.057 L
167.42 153.571 L
167.712 162.08 L
168.015 158.57 L
168.318 160.711 L
168.621 159.711 L
168.929 153.581 L
169.232 159.515 L
169.535 159.083 L
169.844 158.765 L
170.125 158.549 L
170.417 159.161 L
170.731 158.387 L
171.034 158.745 L
171.348 157.442 L
171.645 157.55 L
171.964 157.883 L
172.646 158.087 L
172.954 157.369 L
173.274 156.814 L
173.577 154.02 L
173.89 152.302 L
174.193 149.9 L
174.507 151.674 L
174.826 151.969 L
175.135 151.938 L
175.438 152.575 L
175.751 152.61 L
176.071 152.189 L
176.39 152.209 L
176.698 152.218 L
177.034 152.218 L
177.347 152.891 L
177.645 153.049 L
177.964 153.201 L
178.278 153.335 L
178.597 152.964 L
178.922 152.89 L
179.252 152.842 L
179.56 152.931 L
179.901 152.89 L
180.204 152.382 L
180.534 152.553 L
180.848 151.907 L
181.183 152.419 L
181.475 154.176 L
181.816 155.342 L
182.141 155.24 L
182.471 156.222 L
182.79 155.572 L
183.131 155.312 L
183.45 155.335 L
183.596 155.538 L
183.91 156.183 L
184.229 158.75 L
184.564 156.548 L
184.91 158.479 L
185.235 158.054 L
185.554 157.204 L
185.895 157.417 L
186.236 157.679 L
186.555 157.433 L
186.88 157.327 L
187.237 157.088 L
187.567 156.627 L
187.908 156.938 L
188.243 157.572 L
188.562 157.837 L
188.887 159.033 L
189.222 158.538 L
189.563 156.604 L
189.899 156.21 L
190.256 155.501 L
190.586 155.266 L
190.921 156.675 L
191.262 156.677 L
191.597 156.074 L
191.965 155.415 L
192.295 154.677 L
192.641 154.151 L
192.982 154.247 L
193.339 154.678 L
193.837 155.218 L
194.167 154.897 L
194.535 154.496 L
194.887 154.564 L
195.227 155.263 L
195.568 155.462 L
195.909 157.874 L
196.25 157.295 L
196.612 157.285 L
196.959 155.546 L
197.305 156.37 L
197.667 158.627 L
198.008 158.17 L
198.376 156.081 L
198.717 155.598 L
199.085 156.314 L
199.436 155.927 L
199.804 157.224 L
200.145 157.432 L
200.518 157.496 L
200.859 157.88 L
201.211 158.129 L
201.552 158.648 L
201.92 159.23 L
202.266 159.121 L
202.639 158.919 L
203.007 158.597 L
203.348 158.854 L
203.732 159.251 L
204.067 159.321 L
204.451 158.861 L
204.825 158.98 L
205.176 159.028 L
205.544 157.711 L
205.918 157.368 L
206.269 155.533 L
206.648 155.358 L
207.005 156.423 L
207.384 156.953 L
207.735 156.523 L
208.114 156.162 L
208.466 155.283 L
208.85 154.582 L
209.223 154.917 L
209.602 155.779 L
209.937 155.487 L
210.305 154.327 L
210.684 154.494 L
211.052 154.593 L
211.436 154.88 L
211.809 154.33 L
212.182 153.033 L
212.561 152.251 L
212.945 151.7 L
213.302 152.791 L
213.859 152.268 L
214.238 152.109 L
214.617 151.849 L
214.995 151.552 L
215.38 151.655 L
215.758 152.129 L
216.142 152.355 L
216.527 152.496 L
216.894 152.422 L
217.273 152.499 L
217.663 153.429 L
218.041 154.091 L
218.415 154.302 L
218.793 154.234 L
219.177 154.302 L
219.572 153.932 L
219.951 154.006 L
220.341 153.85 L
220.725 153.935 L
221.125 154.122 L
221.515 153.928 L
221.904 153.971 L
222.294 153.938 L
222.667 153.626 L
223.035 153.798 L
223.435 153.442 L
223.83 153.376 L
224.23 153.204 L
224.631 153.696 L
225.02 154.712 L
225.404 154.351 L
225.799 154.207 L
226.2 153.72 L
226.589 152.88 L
226.984 152.97 L
227.39 152.299 L
227.785 152.035 L
228.19 151.404 L
228.591 151.899 L
228.97 152.541 L
229.37 151.449 L
229.754 151.549 L
230.16 149.976 L
230.565 151.22 L
230.982 151.577 L
231.361 152.773 L
231.766 154.203 L
232.178 155.982 L
232.946 155.042 L
233.352 152.67 L
233.763 151.202 L
234.179 150.458 L
234.569 149.335 L
234.948 149.139 L
235.364 149.238 L
235.786 149.088 L
236.203 152.091 L
236.614 150.954 L
237.036 152.707 L
237.431 153.197 L
237.82 153.392 L
238.237 150.807 L
238.648 152.605 L
238.967 156.312 L
239.378 154.983 L
239.79 153.826 L
240.212 154.13 L
240.633 154.091 L
241.061 154.038 L
241.472 153.777 L
241.883 153.111 L
242.284 153.382 L
242.716 153.304 L
243.138 153.562 L
243.549 153.159 L
243.982 153.222 L
244.404 152.876 L
244.81 153.001 L
245.248 152.851 L
245.659 152.858 L
246.081 152.99 L
246.509 153.079 L
246.909 153.245 L
247.331 153.072 L
247.764 153.501 L
248.191 153.492 L
248.619 153.394 L
249.057 152.795 L
249.473 152.935 L
249.928 153.608 L
250.334 153.865 L
250.788 154.012 L
251.183 153.698 L
251.632 153.907 L
252.049 154.084 L
252.487 154.085 L
252.93 154.149 L
253.358 153.446 L
253.785 154.724 L
254.245 154.374 L
254.667 154.186 L
255.094 152.423 L
255.522 153.179 L
255.976 152.953 L
256.766 151.034 L
257.194 147.845 L
257.648 147.303 L
258.102 148.4 L
258.524 149.732 L
258.952 150.565 L
259.406 151.01 L
259.861 151.286 L
260.288 151.835 L
260.742 153.151 L
261.17 153.85 L
261.624 154.342 L
262.046 154.759 L
262.506 154.695 L
262.961 154.24 L
263.383 154.031 L
263.837 155.654 L
264.297 156.477 L
264.746 155.695 L
265.173 156.762 L
265.73 159.891 L
266.185 161.902 L
266.639 162.672 L
267.067 160.934 L
267.521 158.833 L
267.981 160.02 L
268.435 160.587 L
268.884 161.921 L
269.344 161.501 L
269.793 163.947 L
270.264 163.992 L
270.719 166.543 L
271.178 165.149 L
271.617 166.114 L
272.071 164.388 L
272.536 164.905 L
272.969 164.686 L
273.44 164.543 L
273.9 164.188 L
274.37 164.482 L
274.987 164.42 L
275.452 164.108 L
275.901 164.278 L
276.372 164.263 L
276.805 164.331 L
277.281 164.187 L
277.751 163.721 L
278.195 163.602 L
278.666 163.619 L
279.147 163.798 L
279.607 164.361 L
280.067 164.553 L
280.527 164.603 L
281.003 164.083 L
281.484 163.296 L
281.96 162.554 L
282.388 162.372 L
282.869 162.535 L
283.351 162.668 L
283.822 162.951 L
284.303 163.097 L
284.784 162.98 L
285.201 163.486 L
285.536 163.867 L
286.023 164.429 L
286.505 164.25 L
286.948 164.467 L
287.435 164.497 L
287.933 164.583 L
288.393 164.298 L
288.853 164.73 L
289.345 165.119 L
289.843 165.797 L
290.324 165.933 L
290.773 166.519 L
291.244 167.248 L
291.747 167.903 L
292.223 168.577 L
292.721 170.509 L
293.148 172.129 L
293.646 172.964 L
294.133 173.74 L
294.625 175.525 L
295.118 177.221 L
295.572 174.872 L
296.308 178.161 L
296.784 179.847 L
297.26 181.449 L
297.768 175.954 L
298.245 175.42 L
298.721 182.336 L
299.191 189.253 L
299.689 196.17 L
300.181 202.576 L
300.647 207.067 L
301.134 213.983 L
301.653 220.9 L
302.124 227.817 L
302.578 234.733 L
303.087 241.65 L
303.563 234.733 L
304.044 241.65 L
304.558 248.567 L
305.034 242.451 L
305.516 247.461 L
306.019 251.26 L
306.495 258.177 L
307.009 265.093 L
307.409 272.01 L
307.847 270.492 L
308.356 277.409 L
308.837 284.325 L
309.351 291.242 L
309.827 296.457 L
310.309 303.374 L
310.828 297.551 L
311.31 303.655 L
311.759 310.572 L
312.273 310.184 L
312.76 314.754 L
313.252 321.67 L
313.766 327.603 L
314.226 327.656 L
314.999 332.578 L
315.47 332.4 L
315.989 332.246 L
316.465 339.162 L
316.942 345.395 L
317.461 338.478 L
317.937 345.395 L
318.451 346.156 L
318.927 346.266 L
319.403 353.182 L
319.912 349.349 L
320.366 352.239 L
320.815 345.322 L
321.345 338.406 L
321.805 335.536 L
322.308 341.181 L
322.79 339.454 L
323.309 341.025 L
323.769 345.577 L
324.245 352.494 L
324.759 354.048 L
325.235 360.965 L
325.717 362.345 L
326.23 369.262 L
326.712 375.194 L
327.166 370.569 L
327.686 363.653 L
328.211 356.736 L
328.66 363.653 L
329.141 364.005 L
329.65 370.922 L
330.142 377.838 L
330.634 370.922 L
331.099 377.838 L
331.597 384.755 L
332.084 391.672 L
332.582 397.29 L
333.074 397.513 L
333.55 398.829 L
334.053 399.441 L
334.881 399.499 L
335.395 399.178 L
335.871 399.175 L
336.353 398.838 L
336.834 399.044 L
337.299 398.493 L
337.797 397.719 L
338.306 397.651 L
338.782 398.107 L
339.258 398.029 L
339.745 398.671 L
340.221 399.193 L
340.74 399.976 L
341.2 400.501 L
341.736 400.666 L
342.19 401.328 L
342.672 400.865 L
343.175 400.437 L
343.651 400.029 L
344.159 399.802 L
344.641 399.49 L
345.122 399.178 L
345.631 398.406 L
346.064 398.451 L
346.578 398.426 L
347.059 398.801 L
347.551 399.808 L
348.06 400.732 L
348.541 400.884 L
349.039 400.552 L
349.342 400.138 L
349.78 400.596 L
350.278 401.556 L
350.77 401.763 L
351.252 402.003 L
351.766 402.453 L
352.242 403.303 L
352.74 403.032 L
353.216 403.261 L
353.708 403.137 L
354.206 403.123 L
354.687 402.97 L
355.585 403.372 L
356.088 402.936 L
356.548 402.812 L
357.046 402.267 L
357.511 402.212 L
358.009 401.587 L
358.496 401.802 L
358.977 401.196 L
359.459 400.992 L
359.962 400.85 L
360.438 400.909 L
360.93 400.278 L
361.423 400.41 L
361.915 400.677 L
362.402 400.442 L
362.878 400.572 L
363.359 400.284 L
363.841 400.074 L
364.306 399.815 L
364.815 399.411 L
365.302 399.715 L
365.788 399.533 L
366.281 398.545 L
366.714 398.456 L
367.249 398.034 L
367.682 397.85 L
368.163 397.675 L
368.661 398.019 L
369.159 398.279 L
369.635 398.336 L
370.106 398.327 L
370.603 398.193 L
371.09 398.029 L
371.566 397.819 L
372.048 397.809 L
372.529 397.633 L
373.011 396.969 L
373.503 396.643 L
374.001 396.056 L
374.455 395.523 L
375.391 395.406 L
375.846 395.948 L
376.322 396.48 L
376.83 395.703 L
377.312 395.149 L
377.793 394.724 L
378.302 394.654 L
378.762 394.724 L
379.265 395.61 L
379.752 396.186 L
380.239 396.123 L
380.731 395.229 L
381.196 394.342 L
381.651 392.922 L
382.148 393.907 L
382.619 395.334 L
383.122 394.662 L
383.62 393.431 L
384.112 393.412 L
384.599 393.646 L
385.032 395.07 L
385.524 395.428 L
386.011 395.396 L
386.503 395.777 L
387.001 395.922 L
387.477 395.637 L
387.986 395.847 L
388.462 396.079 L
388.943 397.078 L
389.419 396.873 L
389.89 396.588 L
390.366 396.249 L
390.875 396.633 L
391.362 396.261 L
391.854 396.145 L
392.308 395.982 L
392.801 396.205 L
393.309 395.907 L
393.758 395.91 L
394.294 396.292 L
394.754 395.527 L
395.219 395.302 L
395.749 395.676 L
396.209 395.152 L
396.658 394.479 L
397.172 393.813 L
397.653 394.168 L
398.4 393.81 L
398.876 393.633 L
399.385 392.92 L
399.861 392.795 L
400.342 392.775 L
400.824 392.788 L
401.316 391.177 L
401.781 390.853 L
402.273 390.47 L
402.739 390.587 L
403.242 389.778 L
403.729 388.487 L
404.232 388.193 L
404.697 387.906 L
405.189 387.372 L
405.66 387.541 L
406.152 387.202 L
406.612 387.779 L
406.937 388.154 L
407.408 387.921 L
407.884 387.222 L
408.365 387.56 L
408.879 387.366 L
409.328 387.353 L
409.831 387.202 L
410.313 386.7 L
410.789 386.922 L
411.287 386.639 L
411.784 386.96 L
412.244 387.214 L
412.747 386.681 L
413.234 386.665 L
413.705 387.076 L
414.203 387.417 L
414.7 387.172 L
415.88 387.532 L
416.372 387.922 L
416.859 388.753 L
417.329 388.843 L
417.833 389.512 L
418.298 389.063 L
418.79 388.86 L
419.25 388.031 L
419.759 388.397 L
420.245 388.381 L
420.722 388.773 L
421.198 388.857 L
421.701 388.948 L
422.177 388.768 L
422.658 388.477 L
423.167 388.523 L
423.621 388.153 L
424.103 387.79 L
424.601 387.408 L
425.082 388.017 L
425.596 388.259 L
426.077 388.849 L
426.554 388.791 L
427.035 388.301 L
427.506 388.202 L
427.993 388.496 L
428.463 388.246 L
428.977 387.565 L
429.443 388.385 L
429.924 388.182 L
430.432 388.706 L
430.914 388.126 L
431.379 387.541 L
431.872 387.096 L
432.342 386.694 L
432.656 386.155 L
433.165 386.529 L
433.646 385.95 L
434.122 385.785 L
434.604 385.821 L
435.107 385.895 L
435.556 386.163 L
436.07 386.855 L
436.546 388.038 L
437.038 388.426 L
437.498 389.747 L
438.007 388.847 L
438.483 388.444 L
438.986 387.673 L
439.451 387.601 L
439.9 388.383 L
440.36 388.047 L
440.847 388.178 L
441.345 388.446 L
441.815 388.225 L
442.313 387.633 L
442.811 387.209 L
443.297 386.991 L
443.757 386.72 L
444.26 386.945 L
444.726 387.304 L
445.191 386.962 L
445.7 386.491 L
446.181 385.622 L
446.679 386.043 L
447.171 386.698 L
447.642 386.855 L
448.437 386.959 L
448.94 387.313 L
449.422 388.322 L
449.903 387.869 L
450.374 387.636 L
450.85 387.474 L
451.369 387.523 L
451.845 387.376 L
452.327 388.042 L
452.803 387.908 L
453.279 387.891 L
453.771 387.579 L
454.264 387.299 L
454.756 387.137 L
455.243 387.014 L
456.233 386.172 L
456.703 385.627 L
457.18 385.891 L
457.672 386.673 L
458.159 386.81 L
458.656 387.005 L
459.138 387.015 L
459.63 387.248 L
460.096 386.475 L
460.572 386.731 L
461.053 386.865 L
461.54 387.248 L
462.032 387.854 L
462.33 387.423 L
462.784 387.349 L
463.277 386.956 L
463.764 386.686 L
464.256 386.375 L
464.743 386.571 L
465.235 386.53 L
465.722 386.441 L
466.209 387.098 L
466.707 387.832 L
467.161 387.894 L
467.989 387.294 L
468.481 387.353 L
468.973 387.427 L
469.46 386.985 L
469.953 386.131 L
470.445 386.475 L
470.932 386.578 L
471.365 386.573 L
471.852 386.941 L
472.344 386.414 L
472.836 386.175 L
473.323 385.19 L
473.815 385.106 L
474.308 385.158 L
474.794 385.745 L
475.227 385.946 L
475.72 386.567 L
476.207 386.567 L
476.704 386.655 L
477.191 386.393 L
477.802 386.77 L
478.295 386.97 L
478.728 387.165 L
479.215 387.28 L
479.707 387.629 L
480.221 387.539 L
480.686 387.99 L
481.168 387.668 L
481.676 387.418 L
482.163 387.46 L
482.634 388.059 L
483.104 386.88 L
483.586 386.341 L
484.062 385.449 L
484.543 386.008 L
485.052 386.387 L
485.523 386.251 L
486.004 386.457 L
486.496 386.308 L
486.983 385.861 L
487.443 385.526 L
487.93 386.061 L
488.439 386.245 L
488.893 386.331 L
489.401 387.005 L
489.899 387.267 L
490.04 388.082 L
490.511 388.724 L
491.041 389.353 L
491.479 389.919 L
491.955 389.175 L
492.464 388.542 L
492.951 388.543 L
493.427 388.579 L
493.908 388.724 L
494.417 388.61 L
494.887 388.921 L
495.342 388.591 L
495.969 387.974 L
496.326 387.584 L
496.808 387.05 L
497.311 387.478 L
497.782 387.822 L
498.263 388.797 L
498.734 389.551 L
499.675 389.522 L
500.135 389.438 L
500.649 388.731 L
501.125 388.076 L
501.601 387.623 L
502.072 387.398 L
502.58 387.176 L
503.046 387.262 L
503.505 387.086 L
504.036 387.209 L
504.506 387.455 L
504.966 387.433 L
505.464 387.707 L
505.962 387.745 L
506.438 388.108 L
506.903 388.207 L
507.411 388.836 L
507.893 389.152 L
508.364 388.896 L
508.845 388.213 L
509.473 387.486 L
509.943 387.467 L
510.43 386.979 L
510.917 386.497 L
511.404 387.177 L
511.896 386.909 L
512.362 387.36 L
512.854 387.278 L
513.319 387.868 L
513.806 387.422 L
514.298 387.09 L
514.791 386.883 L
515.288 387.09 L
515.775 386.646 L
516.262 386.872 L
517.176 387.175 L
517.636 386.721 L
518.129 385.803 L
518.615 385.76 L
519.108 386.189 L
519.589 386.727 L
520.071 387.325 L
520.563 388.124 L
521.028 388.543 L
521.483 388.156 L
521.981 388.897 L
522.462 388.114 L
522.949 387.653 L
523.436 387.111 L
523.939 386.593 L
524.426 385.634 L
524.924 386.724 L
525.373 388.515 L
525.854 389.548 L
526.341 389.261 L
S
GR
GS
[0.6 0 0 0.6 0 0] CT
1 0 0 RC
[12 12] 0 setdash
2 LJ
3.333 LW
N
93 54.816 M
93.027 56.514 L
93.054 56.516 L
93.076 56.518 L
93.114 56.521 L
93.146 56.523 L
93.173 56.525 L
93.2 56.527 L
93.238 56.53 L
93.265 56.532 L
93.298 56.534 L
93.33 56.537 L
93.357 56.539 L
93.39 56.541 L
93.427 56.544 L
93.465 56.547 L
93.503 56.55 L
93.541 56.552 L
93.584 56.556 L
93.617 56.558 L
93.66 56.561 L
93.692 56.564 L
93.747 56.568 L
93.779 56.57 L
93.812 56.572 L
93.839 56.574 L
93.866 56.576 L
93.898 56.579 L
93.931 56.581 L
93.963 56.584 L
94.001 56.586 L
94.033 56.589 L
94.066 56.591 L
94.098 56.594 L
94.136 56.596 L
94.169 56.599 L
94.212 56.602 L
94.255 56.605 L
94.288 56.608 L
94.331 56.611 L
94.38 56.614 L
94.423 56.618 L
94.466 56.621 L
94.536 56.626 L
94.618 56.632 L
94.645 56.634 L
94.699 56.638 L
94.774 56.644 L
94.802 56.646 L
94.85 56.649 L
94.91 56.654 L
94.996 56.66 L
95.04 56.663 L
95.094 56.667 L
95.126 56.67 L
95.191 56.674 L
95.224 56.677 L
95.283 56.681 L
95.337 56.685 L
95.38 56.688 L
95.429 56.692 L
95.467 56.695 L
95.51 56.698 L
95.564 56.702 L
95.608 56.705 L
95.656 56.709 L
95.705 56.712 L
95.748 56.715 L
95.802 56.719 L
95.856 56.723 L
95.9 56.727 L
95.943 56.73 L
96.003 56.734 L
96.051 56.738 L
96.111 56.742 L
96.154 56.745 L
96.219 56.75 L
96.262 56.753 L
96.322 56.758 L
96.376 56.762 L
96.435 56.766 L
96.495 56.771 L
96.554 56.775 L
96.603 56.779 L
96.663 56.783 L
96.722 56.787 L
96.776 56.791 L
96.836 56.796 L
96.89 56.8 L
96.949 56.804 L
97.014 56.809 L
97.079 56.814 L
97.139 56.818 L
97.193 56.822 L
97.236 56.825 L
97.312 56.831 L
97.388 56.837 L
97.463 56.842 L
97.539 56.848 L
97.615 56.853 L
97.696 56.859 L
97.772 56.865 L
97.847 56.87 L
97.923 56.876 L
98.004 56.882 L
98.091 56.888 L
98.172 56.894 L
98.248 56.9 L
98.329 56.906 L
98.421 56.913 L
98.497 56.918 L
98.578 56.924 L
98.659 56.93 L
98.745 56.937 L
98.832 56.943 L
98.919 56.95 L
99 56.955 L
99.092 56.962 L
99.173 56.968 L
99.259 56.975 L
99.357 56.982 L
99.432 56.987 L
99.53 56.995 L
99.622 57.001 L
99.714 57.008 L
99.806 57.015 L
99.898 57.022 L
99.99 57.029 L
100.087 57.036 L
100.179 57.043 L
100.271 57.049 L
100.368 57.056 L
100.455 57.063 L
100.552 57.07 L
100.65 57.077 L
100.747 57.084 L
100.844 57.092 L
100.942 57.099 L
101.045 57.106 L
101.142 57.114 L
101.245 57.121 L
101.342 57.128 L
101.445 57.136 L
101.559 57.144 L
101.645 57.151 L
101.753 57.159 L
101.856 57.166 L
101.964 57.174 L
102.078 57.183 L
102.165 57.189 L
102.267 57.197 L
102.376 57.205 L
102.484 57.213 L
102.592 57.22 L
102.7 57.228 L
102.808 57.236 L
102.927 57.245 L
103.041 57.254 L
103.155 57.262 L
103.257 57.27 L
103.371 57.278 L
103.479 57.286 L
103.604 57.295 L
103.712 57.303 L
103.831 57.312 L
103.955 57.321 L
104.069 57.329 L
104.188 57.338 L
104.301 57.347 L
104.426 57.356 L
104.55 57.365 L
104.669 57.374 L
104.783 57.382 L
104.907 57.391 L
105.032 57.4 L
105.151 57.409 L
105.275 57.418 L
105.394 57.427 L
105.513 57.436 L
105.638 57.445 L
105.762 57.454 L
105.887 57.463 L
106.022 57.473 L
106.152 57.483 L
106.271 57.492 L
106.395 57.501 L
106.536 57.511 L
106.66 57.52 L
106.796 57.53 L
106.925 57.54 L
107.061 57.55 L
107.201 57.56 L
107.315 57.569 L
107.45 57.579 L
107.585 57.588 L
107.726 57.599 L
107.856 57.608 L
107.991 57.618 L
108.132 57.629 L
108.278 57.639 L
108.413 57.649 L
108.548 57.659 L
108.678 57.669 L
108.819 57.679 L
108.96 57.69 L
109.106 57.7 L
109.246 57.711 L
109.392 57.722 L
109.528 57.732 L
109.679 57.743 L
109.825 57.753 L
109.96 57.763 L
110.117 57.775 L
110.252 57.785 L
110.399 57.796 L
111.004 57.84 L
111.156 57.851 L
111.286 57.861 L
111.437 57.872 L
111.589 57.883 L
111.74 57.894 L
111.897 57.906 L
112.049 57.917 L
112.205 57.929 L
112.357 57.94 L
112.503 57.951 L
112.655 57.962 L
112.822 57.974 L
112.979 57.986 L
113.12 57.996 L
113.282 58.008 L
113.439 58.019 L
113.596 58.031 L
113.742 58.042 L
113.904 58.054 L
114.077 58.066 L
114.234 58.078 L
114.386 58.089 L
114.548 58.101 L
114.71 58.113 L
114.878 58.125 L
115.035 58.137 L
115.213 58.15 L
115.37 58.161 L
115.527 58.173 L
115.684 58.184 L
115.857 58.197 L
116.03 58.21 L
116.187 58.221 L
116.36 58.234 L
116.528 58.246 L
116.685 58.258 L
116.858 58.271 L
117.026 58.283 L
117.194 58.295 L
117.361 58.308 L
117.54 58.321 L
117.718 58.334 L
117.805 58.34 L
117.973 58.353 L
118.157 58.366 L
118.335 58.379 L
118.524 58.393 L
118.692 58.406 L
118.876 58.419 L
119.055 58.432 L
119.222 58.444 L
119.412 58.458 L
119.585 58.471 L
119.763 58.484 L
119.953 58.498 L
120.131 58.511 L
120.304 58.524 L
120.494 58.538 L
120.683 58.552 L
120.872 58.566 L
121.04 58.578 L
121.229 58.592 L
121.413 58.605 L
121.603 58.619 L
121.792 58.633 L
121.981 58.647 L
122.171 58.661 L
122.355 58.675 L
122.544 58.688 L
122.75 58.704 L
122.944 58.718 L
123.123 58.731 L
123.318 58.745 L
123.507 58.759 L
123.696 58.773 L
123.902 58.788 L
124.097 58.802 L
124.286 58.816 L
124.475 58.83 L
124.676 58.845 L
124.881 58.86 L
125.07 58.874 L
125.271 58.889 L
125.476 58.904 L
125.666 58.917 L
125.866 58.932 L
126.055 58.946 L
126.266 58.962 L
126.466 58.976 L
126.677 58.992 L
126.888 59.007 L
127.094 59.022 L
127.299 59.037 L
127.489 59.051 L
127.7 59.067 L
127.922 59.083 L
128.111 59.097 L
128.316 59.112 L
128.533 59.128 L
128.744 59.143 L
128.944 59.158 L
129.166 59.174 L
129.366 59.189 L
129.577 59.204 L
129.804 59.221 L
129.999 59.235 L
130.226 59.252 L
130.426 59.267 L
130.643 59.282 L
130.865 59.299 L
131.076 59.314 L
131.292 59.33 L
131.508 59.346 L
131.725 59.362 L
131.952 59.378 L
132.163 59.394 L
132.385 59.41 L
132.607 59.426 L
132.818 59.442 L
133.045 59.458 L
133.267 59.475 L
133.494 59.491 L
133.71 59.507 L
133.927 59.523 L
134.154 59.54 L
134.381 59.556 L
134.592 59.572 L
134.819 59.588 L
135.047 59.605 L
135.274 59.622 L
135.506 59.639 L
135.734 59.655 L
135.966 59.672 L
136.199 59.689 L
136.415 59.705 L
136.648 59.722 L
136.886 59.74 L
137.119 59.757 L
137.357 59.774 L
137.595 59.791 L
137.811 59.807 L
138.049 59.825 L
138.287 59.842 L
138.514 59.859 L
138.752 59.876 L
138.98 59.893 L
139.223 59.91 L
139.461 59.928 L
139.699 59.945 L
139.948 59.964 L
140.181 59.981 L
140.419 59.998 L
140.662 60.016 L
140.911 60.034 L
141.144 60.051 L
141.387 60.069 L
141.641 60.087 L
141.879 60.105 L
142.134 60.123 L
142.35 60.139 L
142.599 60.157 L
142.853 60.176 L
143.086 60.193 L
143.351 60.212 L
143.594 60.23 L
143.838 60.248 L
144.384 60.288 L
144.628 60.306 L
144.882 60.324 L
145.115 60.341 L
145.369 60.36 L
145.628 60.379 L
145.867 60.396 L
146.132 60.415 L
146.386 60.434 L
146.635 60.452 L
146.905 60.472 L
147.138 60.489 L
147.392 60.507 L
147.657 60.527 L
147.922 60.546 L
148.182 60.565 L
148.436 60.584 L
148.701 60.603 L
148.961 60.622 L
149.226 60.641 L
149.497 60.661 L
149.756 60.68 L
150 60.698 L
150.286 60.719 L
150.519 60.736 L
150.8 60.756 L
151.076 60.776 L
151.331 60.795 L
151.579 60.813 L
151.861 60.833 L
152.386 60.872 L
152.645 60.891 L
152.927 60.911 L
153.186 60.93 L
153.451 60.949 L
153.722 60.969 L
153.982 60.988 L
154.252 61.008 L
154.528 61.028 L
154.82 61.049 L
155.085 61.068 L
155.35 61.088 L
155.615 61.107 L
155.891 61.127 L
156.183 61.148 L
156.448 61.168 L
156.719 61.188 L
157 61.208 L
157.282 61.228 L
157.552 61.248 L
157.839 61.269 L
158.126 61.29 L
158.391 61.309 L
158.585 61.323 L
158.867 61.344 L
159.153 61.365 L
159.419 61.384 L
159.722 61.406 L
159.987 61.425 L
160.273 61.446 L
160.56 61.467 L
160.858 61.489 L
161.139 61.509 L
161.431 61.531 L
161.707 61.551 L
161.977 61.57 L
162.286 61.593 L
162.578 61.614 L
162.849 61.634 L
163.157 61.656 L
163.433 61.676 L
163.73 61.698 L
164.179 61.731 L
164.466 61.751 L
164.742 61.771 L
165.045 61.793 L
165.337 61.815 L
165.624 61.836 L
165.927 61.858 L
166.23 61.88 L
166.538 61.902 L
166.819 61.922 L
167.128 61.945 L
167.42 61.966 L
167.712 61.987 L
168.015 62.009 L
168.318 62.031 L
168.621 62.053 L
168.929 62.076 L
169.232 62.098 L
169.535 62.12 L
169.844 62.142 L
170.125 62.163 L
170.417 62.184 L
170.731 62.207 L
171.034 62.229 L
171.348 62.251 L
171.645 62.273 L
171.964 62.296 L
172.646 62.346 L
172.954 62.368 L
173.274 62.391 L
173.577 62.413 L
173.89 62.436 L
174.193 62.458 L
174.507 62.481 L
174.826 62.504 L
175.135 62.526 L
175.438 62.548 L
175.751 62.571 L
176.071 62.594 L
176.39 62.617 L
176.698 62.64 L
177.034 62.664 L
177.347 62.687 L
177.645 62.708 L
177.964 62.731 L
178.278 62.754 L
178.597 62.777 L
178.922 62.801 L
179.252 62.825 L
179.56 62.847 L
179.901 62.872 L
180.204 62.894 L
180.534 62.918 L
180.848 62.94 L
181.183 62.965 L
181.475 62.986 L
181.816 63.011 L
182.141 63.034 L
182.471 63.058 L
182.79 63.081 L
183.131 63.106 L
183.45 63.129 L
183.596 63.139 L
183.91 63.162 L
184.229 63.185 L
184.564 63.21 L
184.91 63.235 L
185.235 63.258 L
185.554 63.281 L
185.895 63.306 L
186.236 63.331 L
186.555 63.354 L
186.88 63.377 L
187.237 63.403 L
187.567 63.427 L
187.908 63.452 L
188.243 63.476 L
188.562 63.499 L
188.887 63.522 L
189.222 63.547 L
189.563 63.571 L
189.899 63.595 L
190.256 63.621 L
190.586 63.645 L
190.921 63.669 L
191.262 63.694 L
191.597 63.718 L
191.965 63.745 L
192.295 63.769 L
192.641 63.794 L
192.982 63.818 L
193.339 63.844 L
193.837 63.88 L
194.167 63.904 L
194.535 63.931 L
194.887 63.956 L
195.227 63.981 L
195.568 64.005 L
195.909 64.03 L
196.25 64.054 L
196.612 64.081 L
196.959 64.106 L
197.305 64.131 L
197.667 64.157 L
198.008 64.181 L
198.376 64.208 L
198.717 64.232 L
199.085 64.259 L
199.436 64.284 L
199.804 64.311 L
200.145 64.335 L
200.518 64.362 L
200.859 64.387 L
201.211 64.412 L
201.552 64.437 L
201.92 64.463 L
202.266 64.488 L
202.639 64.515 L
203.007 64.542 L
203.348 64.566 L
203.732 64.594 L
204.067 64.618 L
204.451 64.646 L
204.825 64.673 L
205.176 64.698 L
205.544 64.725 L
205.918 64.752 L
206.269 64.777 L
206.648 64.804 L
207.005 64.83 L
207.384 64.857 L
207.735 64.883 L
208.114 64.91 L
208.466 64.935 L
208.85 64.963 L
209.223 64.99 L
209.602 65.017 L
209.937 65.041 L
210.305 65.068 L
210.684 65.095 L
211.052 65.121 L
211.436 65.149 L
211.809 65.176 L
212.182 65.203 L
212.561 65.23 L
212.945 65.258 L
213.302 65.283 L
213.859 65.323 L
214.238 65.351 L
214.617 65.378 L
214.995 65.405 L
215.38 65.433 L
215.758 65.46 L
216.142 65.487 L
216.527 65.515 L
216.894 65.541 L
217.273 65.569 L
217.663 65.597 L
218.041 65.624 L
218.415 65.651 L
218.793 65.678 L
219.177 65.705 L
219.572 65.734 L
219.951 65.761 L
220.341 65.789 L
220.725 65.817 L
221.125 65.845 L
221.515 65.873 L
221.904 65.901 L
222.294 65.929 L
222.667 65.956 L
223.035 65.982 L
223.435 66.011 L
223.83 66.04 L
224.23 66.068 L
224.631 66.097 L
225.02 66.125 L
225.404 66.152 L
225.799 66.181 L
226.2 66.209 L
226.589 66.237 L
226.984 66.266 L
227.39 66.295 L
227.785 66.323 L
228.19 66.352 L
228.591 66.381 L
228.97 66.408 L
229.37 66.437 L
229.754 66.464 L
230.16 66.493 L
230.565 66.522 L
230.982 66.552 L
231.361 66.579 L
231.766 66.608 L
232.178 66.638 L
232.946 66.693 L
233.352 66.722 L
233.763 66.751 L
234.179 66.781 L
234.569 66.809 L
234.948 66.836 L
235.364 66.866 L
235.786 66.896 L
236.203 66.926 L
236.614 66.955 L
237.036 66.986 L
237.431 67.014 L
237.82 67.042 L
238.237 67.072 L
238.648 67.101 L
238.967 67.124 L
239.378 67.153 L
239.79 67.183 L
240.212 67.213 L
240.633 67.243 L
241.061 67.273 L
241.472 67.303 L
241.883 67.332 L
242.284 67.361 L
242.716 67.392 L
243.138 67.422 L
243.549 67.451 L
243.982 67.482 L
244.404 67.512 L
244.81 67.541 L
245.248 67.573 L
245.659 67.602 L
246.081 67.632 L
246.509 67.663 L
246.909 67.691 L
247.331 67.721 L
247.764 67.752 L
248.191 67.783 L
248.619 67.813 L
249.057 67.844 L
249.473 67.874 L
249.928 67.907 L
250.334 67.936 L
250.788 67.968 L
251.183 67.996 L
251.632 68.028 L
252.049 68.058 L
252.487 68.089 L
252.93 68.121 L
253.358 68.151 L
253.785 68.182 L
254.245 68.214 L
254.667 68.245 L
255.094 68.275 L
255.522 68.305 L
255.976 68.338 L
256.766 68.394 L
257.194 68.424 L
257.648 68.457 L
258.102 68.489 L
258.524 68.519 L
258.952 68.55 L
259.406 68.582 L
259.861 68.614 L
260.288 68.645 L
260.742 68.677 L
261.17 68.708 L
261.624 68.74 L
262.046 68.77 L
262.506 68.803 L
262.961 68.835 L
263.383 68.865 L
263.837 68.897 L
264.297 68.93 L
264.746 68.962 L
265.173 68.992 L
265.73 69.032 L
266.185 69.064 L
266.639 69.096 L
267.067 69.127 L
267.521 69.159 L
267.981 69.192 L
268.435 69.224 L
268.884 69.256 L
269.344 69.289 L
269.793 69.321 L
270.264 69.354 L
270.719 69.386 L
271.178 69.419 L
271.617 69.45 L
272.071 69.482 L
272.536 69.515 L
272.969 69.546 L
273.44 69.579 L
273.9 69.612 L
274.37 69.645 L
274.987 328.389 L
275.452 404.866 L
275.901 394.335 L
276.372 387.187 L
276.805 385.241 L
277.281 384.944 L
277.751 384.888 L
278.195 384.85 L
278.666 384.851 L
279.147 384.865 L
279.607 384.865 L
280.067 384.848 L
280.527 384.811 L
281.003 384.771 L
281.484 384.894 L
281.96 384.762 L
282.388 384.878 L
282.869 384.84 L
283.351 384.762 L
283.822 384.858 L
284.303 384.843 L
284.784 384.774 L
285.201 384.864 L
285.536 384.819 L
286.023 384.86 L
286.505 384.888 L
286.948 384.817 L
287.435 384.862 L
287.933 384.797 L
288.393 384.879 L
288.853 384.78 L
289.345 384.798 L
289.843 384.837 L
290.324 384.892 L
290.773 384.738 L
291.244 384.833 L
291.747 384.846 L
292.223 384.867 L
292.721 384.829 L
293.148 384.827 L
293.646 384.811 L
294.133 384.837 L
294.625 384.855 L
295.118 384.89 L
295.572 384.781 L
296.308 384.769 L
296.784 384.8 L
297.26 384.878 L
297.768 384.819 L
298.245 384.812 L
298.721 384.858 L
299.191 384.803 L
299.689 384.837 L
300.181 384.897 L
300.647 384.833 L
301.134 384.839 L
301.653 384.782 L
302.124 384.85 L
302.578 384.786 L
303.087 384.981 L
303.563 384.793 L
304.044 384.836 L
304.558 384.82 L
305.034 384.834 L
305.516 384.877 L
306.019 384.868 L
306.495 384.822 L
307.009 384.826 L
307.409 384.846 L
307.847 384.851 L
308.356 384.723 L
308.837 384.824 L
309.351 384.889 L
309.827 384.772 L
310.309 384.816 L
310.828 384.875 L
311.31 384.798 L
311.759 384.865 L
312.273 384.827 L
312.76 384.831 L
313.252 384.846 L
313.766 384.845 L
314.226 384.82 L
314.999 384.824 L
315.47 384.841 L
315.989 384.806 L
316.465 384.805 L
316.942 384.82 L
317.461 384.823 L
317.937 384.806 L
318.451 384.855 L
318.927 384.817 L
319.403 384.882 L
319.912 384.845 L
320.366 384.902 L
320.815 384.839 L
321.345 384.8 L
321.805 384.847 L
322.308 384.851 L
322.79 384.929 L
323.309 384.843 L
323.769 384.844 L
324.245 384.866 L
324.759 384.727 L
325.235 384.864 L
325.717 384.87 L
326.23 384.772 L
326.712 384.868 L
327.166 384.846 L
327.686 384.82 L
328.211 384.764 L
328.66 384.956 L
329.141 384.836 L
329.65 384.808 L
330.142 384.888 L
330.634 384.752 L
331.099 384.874 L
331.597 384.842 L
332.084 384.761 L
332.582 384.856 L
333.074 384.835 L
333.55 384.851 L
334.053 384.837 L
334.881 384.821 L
335.395 384.939 L
335.871 384.84 L
336.353 384.752 L
336.834 384.885 L
337.299 384.851 L
337.797 384.803 L
338.306 384.861 L
338.782 384.785 L
339.258 384.829 L
339.745 384.82 L
340.221 384.851 L
340.74 384.849 L
341.2 384.839 L
341.736 384.862 L
342.19 384.783 L
342.672 384.832 L
343.175 384.845 L
343.651 384.866 L
344.159 384.821 L
344.641 384.842 L
345.122 384.806 L
345.631 384.948 L
346.064 384.82 L
346.578 384.832 L
347.059 384.936 L
347.551 384.836 L
348.06 384.843 L
348.541 384.871 L
349.039 384.807 L
349.342 384.828 L
349.78 384.791 L
350.278 384.825 L
350.77 384.845 L
351.252 384.86 L
351.766 384.852 L
352.242 384.81 L
352.74 384.87 L
353.216 384.783 L
353.708 384.891 L
354.206 384.824 L
354.687 384.834 L
355.585 384.866 L
356.088 384.801 L
356.548 384.806 L
357.046 384.914 L
357.511 384.843 L
358.009 384.738 L
358.496 384.895 L
358.977 384.876 L
359.459 384.72 L
359.962 384.876 L
360.438 384.844 L
360.93 384.816 L
361.423 384.9 L
361.915 384.848 L
362.402 384.737 L
362.878 384.846 L
363.359 384.897 L
363.841 384.74 L
364.306 384.815 L
364.815 384.945 L
365.302 384.771 L
365.788 384.793 L
366.281 384.961 L
366.714 384.821 L
367.249 384.794 L
367.682 384.863 L
368.163 384.827 L
368.661 384.877 L
369.159 384.819 L
369.635 384.83 L
370.106 384.831 L
370.603 384.778 L
371.09 384.855 L
371.566 384.847 L
372.048 384.855 L
372.529 384.815 L
373.011 384.833 L
373.503 384.798 L
374.001 384.849 L
374.455 384.857 L
375.391 384.877 L
375.846 384.801 L
376.322 384.847 L
376.83 384.844 L
377.312 384.762 L
377.793 384.836 L
378.302 384.787 L
378.762 384.935 L
379.265 384.851 L
379.752 384.783 L
380.239 384.893 L
380.731 384.798 L
381.196 384.867 L
381.651 384.832 L
382.148 384.812 L
382.619 384.853 L
383.122 384.826 L
383.62 384.837 L
384.112 384.877 L
384.599 384.859 L
385.032 384.834 L
385.524 384.86 L
386.011 384.859 L
386.503 384.824 L
387.001 384.848 L
387.477 384.809 L
387.986 384.865 L
388.462 384.807 L
388.943 384.809 L
389.419 384.816 L
389.89 384.831 L
390.366 384.809 L
390.875 384.85 L
391.362 384.878 L
391.854 384.791 L
392.308 384.839 L
392.801 384.894 L
393.309 384.79 L
393.758 384.835 L
394.294 384.879 L
394.754 384.823 L
395.219 384.873 L
395.749 384.832 L
396.209 384.806 L
396.658 384.837 L
397.172 384.851 L
397.653 384.769 L
398.4 384.851 L
398.876 384.803 L
399.385 384.831 L
399.861 384.822 L
400.342 384.832 L
400.824 384.852 L
401.316 384.798 L
401.781 384.863 L
402.273 384.897 L
402.739 384.747 L
403.242 384.829 L
403.729 384.86 L
404.232 384.824 L
404.697 384.838 L
405.189 384.837 L
405.66 384.838 L
406.152 384.835 L
406.612 384.809 L
406.937 384.781 L
407.408 384.859 L
407.884 384.829 L
408.365 384.778 L
408.879 384.835 L
409.328 384.825 L
409.831 384.878 L
410.313 384.803 L
410.789 384.945 L
411.287 384.775 L
411.784 384.792 L
412.244 384.975 L
412.747 384.832 L
413.234 384.806 L
413.705 384.858 L
414.203 384.826 L
414.7 384.829 L
415.88 384.795 L
416.372 384.875 L
416.859 384.822 L
417.329 384.854 L
417.833 384.792 L
418.298 384.833 L
418.79 384.847 L
419.25 384.864 L
419.759 384.846 L
420.245 384.785 L
420.722 384.892 L
421.198 384.81 L
421.701 384.844 L
422.177 384.813 L
422.658 384.899 L
423.167 384.802 L
423.621 384.834 L
424.103 384.803 L
424.601 384.823 L
425.082 384.833 L
425.596 384.869 L
426.077 384.773 L
426.554 384.839 L
427.035 384.825 L
427.506 384.856 L
427.993 384.77 L
428.463 384.853 L
428.977 384.858 L
429.443 384.81 L
429.924 384.869 L
430.432 384.825 L
430.914 384.841 L
431.379 384.861 L
431.872 384.834 L
432.342 384.83 L
432.656 384.803 L
433.165 384.831 L
433.646 384.786 L
434.122 384.821 L
434.604 384.828 L
435.107 384.816 L
435.556 384.859 L
436.07 384.876 L
436.546 384.793 L
437.038 384.839 L
437.498 384.863 L
438.007 384.805 L
438.483 384.849 L
438.986 384.789 L
439.451 384.832 L
439.9 384.833 L
440.36 384.814 L
440.847 384.855 L
441.345 384.834 L
441.815 384.783 L
442.313 384.919 L
442.811 384.866 L
443.297 384.705 L
443.757 384.856 L
444.26 384.877 L
444.726 384.798 L
445.191 384.84 L
445.7 384.853 L
446.181 384.787 L
446.679 384.866 L
447.171 384.838 L
447.642 384.785 L
448.437 384.799 L
448.94 384.775 L
449.422 384.843 L
449.903 384.888 L
450.374 384.71 L
450.85 384.825 L
451.369 384.886 L
451.845 384.749 L
452.327 384.85 L
452.803 384.801 L
453.279 384.88 L
453.771 384.786 L
454.264 384.877 L
454.756 384.799 L
455.243 384.825 L
456.233 384.838 L
456.703 384.799 L
457.18 384.927 L
457.672 384.839 L
458.159 384.813 L
458.656 384.908 L
459.138 384.797 L
459.63 384.792 L
460.096 384.897 L
460.572 384.795 L
461.053 384.806 L
461.54 384.865 L
462.032 384.869 L
462.33 384.869 L
462.784 384.84 L
463.277 384.822 L
463.764 384.809 L
464.256 384.833 L
464.743 384.824 L
465.235 384.775 L
465.722 384.857 L
466.209 384.711 L
466.707 384.855 L
467.161 384.887 L
467.989 384.924 L
468.481 384.864 L
468.973 384.713 L
469.46 384.896 L
469.953 384.862 L
470.445 384.817 L
470.932 384.85 L
471.365 384.769 L
471.852 384.854 L
472.344 384.833 L
472.836 384.805 L
473.323 384.863 L
473.815 384.859 L
474.308 384.827 L
474.794 384.842 L
475.227 384.873 L
475.72 384.841 L
476.207 384.84 L
476.704 384.863 L
477.191 384.856 L
477.802 384.833 L
478.295 384.801 L
478.728 384.812 L
479.215 384.817 L
479.707 384.795 L
480.221 384.817 L
480.686 384.829 L
481.168 384.822 L
481.676 384.913 L
482.163 384.821 L
482.634 384.792 L
483.104 384.857 L
483.586 384.795 L
484.062 384.826 L
484.543 384.834 L
485.052 384.817 L
485.523 384.818 L
486.004 384.844 L
486.496 384.825 L
486.983 384.89 L
487.443 384.799 L
487.93 384.911 L
488.439 384.787 L
488.893 384.828 L
489.401 384.863 L
489.899 384.784 L
490.04 384.836 L
490.511 384.781 L
491.041 384.892 L
491.479 384.862 L
491.955 384.718 L
492.464 384.935 L
492.951 384.809 L
493.427 384.865 L
493.908 384.802 L
494.417 384.843 L
494.887 384.874 L
495.342 384.86 L
495.969 384.856 L
496.326 384.741 L
496.808 384.833 L
497.311 384.853 L
497.782 384.893 L
498.263 384.761 L
498.734 384.872 L
499.675 384.775 L
500.135 384.871 L
500.649 384.838 L
501.125 384.81 L
501.601 384.829 L
502.072 384.834 L
502.58 384.835 L
503.046 384.868 L
503.505 384.838 L
504.036 384.858 L
504.506 384.858 L
504.966 384.838 L
505.464 384.844 L
505.962 384.805 L
506.438 384.83 L
506.903 384.847 L
507.411 384.845 L
507.893 384.804 L
508.364 384.86 L
508.845 384.796 L
509.473 384.753 L
509.943 384.904 L
510.43 384.863 L
510.917 384.777 L
511.404 384.853 L
511.896 384.873 L
512.362 384.802 L
512.854 384.835 L
513.319 384.832 L
513.806 384.848 L
514.298 384.839 L
514.791 384.788 L
515.288 384.819 L
515.775 384.817 L
516.262 384.85 L
517.176 384.867 L
517.636 384.895 L
518.129 384.846 L
518.615 384.804 L
519.108 384.79 L
519.589 384.822 L
520.071 384.904 L
520.563 384.817 L
521.028 384.834 L
521.483 384.861 L
521.981 384.797 L
522.462 384.823 L
522.949 384.807 L
523.436 384.816 L
523.939 384.79 L
524.426 384.833 L
524.924 384.828 L
525.373 384.811 L
525.854 384.803 L
526.341 384.824 L
S
GR
GS
[0.6 0 0 0.6 0 0] CT
1 GC
N
621 118 M
621 52 L
383 52 L
383 118 L
cp
f
GR
GS
[0.6 0 0 0.6 265.08706 41.76] CT
N
1.75 9 M
1.75 -7.469 L
3.984 -7.469 L
12.641 5.469 L
12.641 -7.469 L
14.719 -7.469 L
14.719 9 L
12.484 9 L
3.844 -3.938 L
3.844 9 L
1.75 9 L
cp
26.132 7.531 M
25.007 8.484 23.968 8.875 QT
22.929 9.266 21.742 9.266 QT
19.773 9.266 18.718 8.305 QT
17.664 7.344 17.664 5.859 QT
17.664 4.984 18.062 4.258 QT
18.461 3.531 19.109 3.094 QT
19.757 2.656 20.57 2.438 QT
21.164 2.266 22.367 2.125 QT
24.804 1.828 25.961 1.438 QT
25.976 1.016 25.976 0.906 QT
25.976 -0.328 25.398 -0.844 QT
24.632 -1.516 23.101 -1.516 QT
21.679 -1.516 21 -1.023 QT
20.32 -0.531 19.992 0.75 QT
18.007 0.469 L
18.289 -0.797 18.906 -1.578 QT
19.523 -2.359 20.687 -2.781 QT
21.851 -3.203 23.398 -3.203 QT
24.929 -3.203 25.882 -2.844 QT
26.836 -2.484 27.281 -1.938 QT
27.726 -1.391 27.914 -0.563 QT
28.007 -0.047 28.007 1.313 QT
28.007 4 L
28.007 6.828 28.14 7.57 QT
28.273 8.313 28.648 9 QT
26.539 9 L
26.226 8.375 26.132 7.531 QT
cp
25.961 3.016 M
24.867 3.469 22.664 3.781 QT
21.414 3.953 20.898 4.18 QT
20.382 4.406 20.101 4.836 QT
19.82 5.266 19.82 5.797 QT
19.82 6.609 20.437 7.148 QT
21.054 7.688 22.226 7.688 QT
23.398 7.688 24.304 7.172 QT
25.211 6.656 25.648 5.781 QT
25.961 5.094 25.961 3.75 QT
25.961 3.016 L
cp
31.316 9 M
31.316 -2.922 L
33.129 -2.922 L
33.129 -1.25 L
33.691 -2.125 34.621 -2.664 QT
35.551 -3.203 36.738 -3.203 QT
38.066 -3.203 38.918 -2.648 QT
39.77 -2.094 40.113 -1.109 QT
41.52 -3.203 43.801 -3.203 QT
45.566 -3.203 46.52 -2.219 QT
47.473 -1.234 47.473 0.813 QT
47.473 9 L
45.473 9 L
45.473 1.484 L
45.473 0.281 45.277 -0.258 QT
45.082 -0.797 44.559 -1.117 QT
44.035 -1.438 43.348 -1.438 QT
42.082 -1.438 41.254 -0.602 QT
40.426 0.234 40.426 2.078 QT
40.426 9 L
38.41 9 L
38.41 1.25 L
38.41 -0.094 37.91 -0.766 QT
37.41 -1.438 36.285 -1.438 QT
35.441 -1.438 34.715 -0.992 QT
33.988 -0.547 33.66 0.32 QT
33.332 1.188 33.332 2.813 QT
33.332 9 L
31.316 9 L
cp
58.908 5.156 M
60.986 5.422 L
60.502 7.25 59.166 8.258 QT
57.83 9.266 55.752 9.266 QT
53.127 9.266 51.595 7.656 QT
50.064 6.047 50.064 3.141 QT
50.064 0.125 51.611 -1.539 QT
53.158 -3.203 55.627 -3.203 QT
58.033 -3.203 59.548 -1.57 QT
61.064 0.063 61.064 3.016 QT
61.064 3.188 61.048 3.547 QT
52.158 3.547 L
52.267 5.516 53.267 6.563 QT
54.267 7.609 55.752 7.609 QT
56.861 7.609 57.65 7.023 QT
58.439 6.438 58.908 5.156 QT
cp
52.267 1.891 M
58.923 1.891 L
58.783 0.391 58.158 -0.359 QT
57.189 -1.531 55.658 -1.531 QT
54.267 -1.531 53.314 -0.602 QT
52.361 0.328 52.267 1.891 QT
cp
55.22 -6.234 M
56.455 -8.141 L
58.752 -8.141 L
56.22 -5 L
54.064 -5 L
51.642 -8.141 L
53.955 -8.141 L
55.22 -6.234 L
cp
63.686 9 M
63.686 -2.922 L
65.498 -2.922 L
65.498 -1.125 L
66.201 -2.391 66.787 -2.797 QT
67.373 -3.203 68.076 -3.203 QT
69.108 -3.203 70.154 -2.547 QT
69.467 -0.672 L
68.717 -1.109 67.983 -1.109 QT
67.311 -1.109 66.787 -0.711 QT
66.264 -0.313 66.045 0.391 QT
65.701 1.469 65.701 2.75 QT
65.701 9 L
63.686 9 L
cp
67.186 -6.234 M
68.42 -8.141 L
70.717 -8.141 L
68.186 -5 L
66.029 -5 L
63.608 -8.141 L
65.92 -8.141 L
67.186 -6.234 L
cp
79.636 5.156 M
81.715 5.422 L
81.23 7.25 79.894 8.258 QT
78.558 9.266 76.48 9.266 QT
73.855 9.266 72.324 7.656 QT
70.793 6.047 70.793 3.141 QT
70.793 0.125 72.34 -1.539 QT
73.886 -3.203 76.355 -3.203 QT
78.761 -3.203 80.277 -1.57 QT
81.793 0.063 81.793 3.016 QT
81.793 3.188 81.777 3.547 QT
72.886 3.547 L
72.996 5.516 73.996 6.563 QT
74.996 7.609 76.48 7.609 QT
77.59 7.609 78.379 7.023 QT
79.168 6.438 79.636 5.156 QT
cp
72.996 1.891 M
79.652 1.891 L
79.511 0.391 78.886 -0.359 QT
77.918 -1.531 76.386 -1.531 QT
74.996 -1.531 74.043 -0.602 QT
73.09 0.328 72.996 1.891 QT
cp
84.43 9 M
84.43 -2.922 L
86.242 -2.922 L
86.242 -1.234 L
87.57 -3.203 90.039 -3.203 QT
91.117 -3.203 92.024 -2.813 QT
92.93 -2.422 93.383 -1.789 QT
93.836 -1.156 94.008 -0.297 QT
94.117 0.266 94.117 1.672 QT
94.117 9 L
92.102 9 L
92.102 1.75 L
92.102 0.516 91.867 -0.102 QT
91.633 -0.719 91.031 -1.078 QT
90.43 -1.438 89.617 -1.438 QT
88.32 -1.438 87.383 -0.625 QT
86.445 0.188 86.445 2.484 QT
86.445 9 L
84.43 9 L
cp
105.176 7.531 M
104.051 8.484 103.012 8.875 QT
101.973 9.266 100.786 9.266 QT
98.817 9.266 97.762 8.305 QT
96.708 7.344 96.708 5.859 QT
96.708 4.984 97.106 4.258 QT
97.504 3.531 98.153 3.094 QT
98.801 2.656 99.614 2.438 QT
100.208 2.266 101.411 2.125 QT
103.848 1.828 105.004 1.438 QT
105.02 1.016 105.02 0.906 QT
105.02 -0.328 104.442 -0.844 QT
103.676 -1.516 102.145 -1.516 QT
100.723 -1.516 100.044 -1.023 QT
99.364 -0.531 99.036 0.75 QT
97.051 0.469 L
97.333 -0.797 97.95 -1.578 QT
98.567 -2.359 99.731 -2.781 QT
100.895 -3.203 102.442 -3.203 QT
103.973 -3.203 104.926 -2.844 QT
105.879 -2.484 106.325 -1.938 QT
106.77 -1.391 106.958 -0.563 QT
107.051 -0.047 107.051 1.313 QT
107.051 4 L
107.051 6.828 107.184 7.57 QT
107.317 8.313 107.692 9 QT
105.583 9 L
105.27 8.375 105.176 7.531 QT
cp
105.004 3.016 M
103.911 3.469 101.708 3.781 QT
100.458 3.953 99.942 4.18 QT
99.426 4.406 99.145 4.836 QT
98.864 5.266 98.864 5.797 QT
98.864 6.609 99.481 7.148 QT
100.098 7.688 101.27 7.688 QT
102.442 7.688 103.348 7.172 QT
104.254 6.656 104.692 5.781 QT
105.004 5.094 105.004 3.75 QT
105.004 3.016 L
cp
101.208 -5 M
102.692 -8.141 L
105.348 -8.141 L
102.879 -5 L
101.208 -5 L
cp
124.572 9 M
124.572 7.5 L
123.447 9.266 121.244 9.266 QT
119.822 9.266 118.619 8.484 QT
117.415 7.703 116.759 6.289 QT
116.103 4.875 116.103 3.047 QT
116.103 1.266 116.705 -0.188 QT
117.306 -1.641 118.494 -2.422 QT
119.681 -3.203 121.15 -3.203 QT
122.228 -3.203 123.072 -2.742 QT
123.915 -2.281 124.447 -1.563 QT
124.447 -7.469 L
126.447 -7.469 L
126.447 9 L
124.572 9 L
cp
118.181 3.047 M
118.181 5.344 119.15 6.477 QT
120.119 7.609 121.431 7.609 QT
122.759 7.609 123.681 6.523 QT
124.603 5.438 124.603 3.219 QT
124.603 0.766 123.665 -0.375 QT
122.728 -1.516 121.337 -1.516 QT
119.994 -1.516 119.087 -0.422 QT
118.181 0.672 118.181 3.047 QT
cp
137.584 7.531 M
136.459 8.484 135.42 8.875 QT
134.381 9.266 133.193 9.266 QT
131.225 9.266 130.17 8.305 QT
129.115 7.344 129.115 5.859 QT
129.115 4.984 129.514 4.258 QT
129.912 3.531 130.56 3.094 QT
131.209 2.656 132.021 2.438 QT
132.615 2.266 133.818 2.125 QT
136.256 1.828 137.412 1.438 QT
137.428 1.016 137.428 0.906 QT
137.428 -0.328 136.85 -0.844 QT
136.084 -1.516 134.553 -1.516 QT
133.131 -1.516 132.451 -1.023 QT
131.771 -0.531 131.443 0.75 QT
129.459 0.469 L
129.74 -0.797 130.357 -1.578 QT
130.975 -2.359 132.139 -2.781 QT
133.303 -3.203 134.85 -3.203 QT
136.381 -3.203 137.334 -2.844 QT
138.287 -2.484 138.732 -1.938 QT
139.178 -1.391 139.365 -0.563 QT
139.459 -0.047 139.459 1.313 QT
139.459 4 L
139.459 6.828 139.592 7.57 QT
139.725 8.313 140.1 9 QT
137.99 9 L
137.678 8.375 137.584 7.531 QT
cp
137.412 3.016 M
136.318 3.469 134.115 3.781 QT
132.865 3.953 132.35 4.18 QT
131.834 4.406 131.553 4.836 QT
131.271 5.266 131.271 5.797 QT
131.271 6.609 131.889 7.148 QT
132.506 7.688 133.678 7.688 QT
134.85 7.688 135.756 7.172 QT
136.662 6.656 137.1 5.781 QT
137.412 5.094 137.412 3.75 QT
137.412 3.016 L
cp
147.19 7.188 M
147.471 8.984 L
146.627 9.156 145.94 9.156 QT
144.846 9.156 144.237 8.805 QT
143.627 8.453 143.385 7.891 QT
143.143 7.328 143.143 5.5 QT
143.143 -1.359 L
141.659 -1.359 L
141.659 -2.922 L
143.143 -2.922 L
143.143 -5.875 L
145.143 -7.094 L
145.143 -2.922 L
147.19 -2.922 L
147.19 -1.359 L
145.143 -1.359 L
145.143 5.625 L
145.143 6.484 145.252 6.734 QT
145.362 6.984 145.604 7.125 QT
145.846 7.266 146.299 7.266 QT
146.627 7.266 147.19 7.188 QT
cp
157.026 7.531 M
155.901 8.484 154.862 8.875 QT
153.823 9.266 152.636 9.266 QT
150.667 9.266 149.612 8.305 QT
148.557 7.344 148.557 5.859 QT
148.557 4.984 148.956 4.258 QT
149.354 3.531 150.003 3.094 QT
150.651 2.656 151.464 2.438 QT
152.057 2.266 153.261 2.125 QT
155.698 1.828 156.854 1.438 QT
156.87 1.016 156.87 0.906 QT
156.87 -0.328 156.292 -0.844 QT
155.526 -1.516 153.995 -1.516 QT
152.573 -1.516 151.893 -1.023 QT
151.214 -0.531 150.886 0.75 QT
148.901 0.469 L
149.182 -0.797 149.8 -1.578 QT
150.417 -2.359 151.581 -2.781 QT
152.745 -3.203 154.292 -3.203 QT
155.823 -3.203 156.776 -2.844 QT
157.729 -2.484 158.175 -1.938 QT
158.62 -1.391 158.807 -0.563 QT
158.901 -0.047 158.901 1.313 QT
158.901 4 L
158.901 6.828 159.034 7.57 QT
159.167 8.313 159.542 9 QT
157.432 9 L
157.12 8.375 157.026 7.531 QT
cp
156.854 3.016 M
155.761 3.469 153.557 3.781 QT
152.307 3.953 151.792 4.18 QT
151.276 4.406 150.995 4.836 QT
150.714 5.266 150.714 5.797 QT
150.714 6.609 151.331 7.148 QT
151.948 7.688 153.12 7.688 QT
154.292 7.688 155.198 7.172 QT
156.104 6.656 156.542 5.781 QT
156.854 5.094 156.854 3.75 QT
156.854 3.016 L
cp
f
GR
GS
[0.6 0 0 0.6 0 0] CT
0 0 1 RC
1 LJ
3.333 LW
N
388.005 69.6 M
438.058 69.6 L
S
GR
GS
[0.6 0 0 0.6 265.08706 60.24] CT
/Helvetica 23.333 F
GS
[1 0 0 1 0 0] CT
0 9 moveto 
1 -1 scale
(Simulovan\341 data) t 
GR
GR
GS
[0.6 0 0 0.6 0 0] CT
1 0 0 RC
[12 12] 0 setdash
2 LJ
3.333 LW
N
388.005 100.4 M
438.058 100.4 L
S
GR
GS
[0.6 0 0 0.6 0 0] CT
0.149 GC
10.0 ML
0.833 LW
N
383 118 M
383 52 L
621 52 L
621 118 L
cp
S
GR
%%Trailer
%%Pages: 1
%%EOF
