%!PS-Adobe-3.0 EPSF-3.0
%%Creator: (MATLAB, The Mathworks, Inc. Version 9.11.0.1837725 \(R2021b\) Update 2. Operating System: Windows 10)
%%Title: C:/Users/radac/Downloads/ato-g1_aru-rec_20230316-155745_ARU/data_in_csv/model_v.eps
%%CreationDate: 2023-04-02T15:05:41
%%Pages: (atend)
%%BoundingBox:     0     0   420   315
%%LanguageLevel: 3
%%EndComments
%%BeginProlog
%%BeginResource: procset (Apache XML Graphics Std ProcSet) 1.2 0
%%Version: 1.2 0
%%Copyright: (Copyright 2001-2003,2010 The Apache Software Foundation. License terms: http://www.apache.org/licenses/LICENSE-2.0)
/bd{bind def}bind def
/ld{load def}bd
/GR/grestore ld
/GS/gsave ld
/RM/rmoveto ld
/C/curveto ld
/t/show ld
/L/lineto ld
/ML/setmiterlimit ld
/CT/concat ld
/f/fill ld
/N/newpath ld
/S/stroke ld
/CC/setcmykcolor ld
/A/ashow ld
/cp/closepath ld
/RC/setrgbcolor ld
/LJ/setlinejoin ld
/GC/setgray ld
/LW/setlinewidth ld
/M/moveto ld
/re {4 2 roll M
1 index 0 rlineto
0 exch rlineto
neg 0 rlineto
cp } bd
/_ctm matrix def
/_tm matrix def
/BT { _ctm currentmatrix pop matrix _tm copy pop 0 0 moveto } bd
/ET { _ctm setmatrix } bd
/iTm { _ctm setmatrix _tm concat } bd
/Tm { _tm astore pop iTm 0 0 moveto } bd
/ux 0.0 def
/uy 0.0 def
/F {
  /Tp exch def
  /Tf exch def
  Tf findfont Tp scalefont setfont
  /cf Tf def  /cs Tp def
} bd
/ULS {currentpoint /uy exch def /ux exch def} bd
/ULE {
  /Tcx currentpoint pop def
  gsave
  newpath
  cf findfont cs scalefont dup
  /FontMatrix get 0 get /Ts exch def /FontInfo get dup
  /UnderlinePosition get Ts mul /To exch def
  /UnderlineThickness get Ts mul /Tt exch def
  ux uy To add moveto  Tcx uy To add lineto
  Tt setlinewidth stroke
  grestore
} bd
/OLE {
  /Tcx currentpoint pop def
  gsave
  newpath
  cf findfont cs scalefont dup
  /FontMatrix get 0 get /Ts exch def /FontInfo get dup
  /UnderlinePosition get Ts mul /To exch def
  /UnderlineThickness get Ts mul /Tt exch def
  ux uy To add cs add moveto Tcx uy To add cs add lineto
  Tt setlinewidth stroke
  grestore
} bd
/SOE {
  /Tcx currentpoint pop def
  gsave
  newpath
  cf findfont cs scalefont dup
  /FontMatrix get 0 get /Ts exch def /FontInfo get dup
  /UnderlinePosition get Ts mul /To exch def
  /UnderlineThickness get Ts mul /Tt exch def
  ux uy To add cs 10 mul 26 idiv add moveto Tcx uy To add cs 10 mul 26 idiv add lineto
  Tt setlinewidth stroke
  grestore
} bd
/QT {
/Y22 exch store
/X22 exch store
/Y21 exch store
/X21 exch store
currentpoint
/Y21 load 2 mul add 3 div exch
/X21 load 2 mul add 3 div exch
/X21 load 2 mul /X22 load add 3 div
/Y21 load 2 mul /Y22 load add 3 div
/X22 load /Y22 load curveto
} bd
/SSPD {
dup length /d exch dict def
{
/v exch def
/k exch def
currentpagedevice k known {
/cpdv currentpagedevice k get def
v cpdv ne {
/upd false def
/nullv v type /nulltype eq def
/nullcpdv cpdv type /nulltype eq def
nullv nullcpdv or
{
/upd true def
} {
/sametype v type cpdv type eq def
sametype {
v type /arraytype eq {
/vlen v length def
/cpdvlen cpdv length def
vlen cpdvlen eq {
0 1 vlen 1 sub {
/i exch def
/obj v i get def
/cpdobj cpdv i get def
obj cpdobj ne {
/upd true def
exit
} if
} for
} {
/upd true def
} ifelse
} {
v type /dicttype eq {
v {
/dv exch def
/dk exch def
/cpddv cpdv dk get def
dv cpddv ne {
/upd true def
exit
} if
} forall
} {
/upd true def
} ifelse
} ifelse
} if
} ifelse
upd true eq {
d k v put
} if
} if
} if
} forall
d length 0 gt {
d setpagedevice
} if
} bd
/RE { % /NewFontName [NewEncodingArray] /FontName RE -
  findfont dup length dict begin
  {
    1 index /FID ne
    {def} {pop pop} ifelse
  } forall
  /Encoding exch def
  /FontName 1 index def
  currentdict definefont pop
  end
} bind def
%%EndResource
%%BeginResource: procset (Apache XML Graphics EPS ProcSet) 1.0 0
%%Version: 1.0 0
%%Copyright: (Copyright 2002-2003 The Apache Software Foundation. License terms: http://www.apache.org/licenses/LICENSE-2.0)
/BeginEPSF { %def
/b4_Inc_state save def         % Save state for cleanup
/dict_count countdictstack def % Count objects on dict stack
/op_count count 1 sub def      % Count objects on operand stack
userdict begin                 % Push userdict on dict stack
/showpage { } def              % Redefine showpage, { } = null proc
0 setgray 0 setlinecap         % Prepare graphics state
1 setlinewidth 0 setlinejoin
10 setmiterlimit [ ] 0 setdash newpath
/languagelevel where           % If level not equal to 1 then
{pop languagelevel             % set strokeadjust and
1 ne                           % overprint to their defaults.
{false setstrokeadjust false setoverprint
} if
} if
} bd
/EndEPSF { %def
count op_count sub {pop} repeat            % Clean up stacks
countdictstack dict_count sub {end} repeat
b4_Inc_state restore
} bd
%%EndResource
%FOPBeginFontDict
%%IncludeResource: font Courier-Oblique
%%IncludeResource: font Courier-BoldOblique
%%IncludeResource: font Courier-Bold
%%IncludeResource: font ZapfDingbats
%%IncludeResource: font Symbol
%%IncludeResource: font Helvetica
%%IncludeResource: font Helvetica-Oblique
%%IncludeResource: font Helvetica-Bold
%%IncludeResource: font Helvetica-BoldOblique
%%IncludeResource: font Times-Roman
%%IncludeResource: font Times-Italic
%%IncludeResource: font Times-Bold
%%IncludeResource: font Times-BoldItalic
%%IncludeResource: font Courier
%FOPEndFontDict
%%BeginResource: encoding WinAnsiEncoding
/WinAnsiEncoding [
/.notdef /.notdef /.notdef /.notdef /.notdef
/.notdef /.notdef /.notdef /.notdef /.notdef
/.notdef /.notdef /.notdef /.notdef /.notdef
/.notdef /.notdef /.notdef /.notdef /.notdef
/.notdef /.notdef /.notdef /.notdef /.notdef
/.notdef /.notdef /.notdef /.notdef /.notdef
/.notdef /.notdef /space /exclam /quotedbl
/numbersign /dollar /percent /ampersand /quotesingle
/parenleft /parenright /asterisk /plus /comma
/hyphen /period /slash /zero /one
/two /three /four /five /six
/seven /eight /nine /colon /semicolon
/less /equal /greater /question /at
/A /B /C /D /E
/F /G /H /I /J
/K /L /M /N /O
/P /Q /R /S /T
/U /V /W /X /Y
/Z /bracketleft /backslash /bracketright /asciicircum
/underscore /quoteleft /a /b /c
/d /e /f /g /h
/i /j /k /l /m
/n /o /p /q /r
/s /t /u /v /w
/x /y /z /braceleft /bar
/braceright /asciitilde /bullet /Euro /bullet
/quotesinglbase /florin /quotedblbase /ellipsis /dagger
/daggerdbl /circumflex /perthousand /Scaron /guilsinglleft
/OE /bullet /Zcaron /bullet /bullet
/quoteleft /quoteright /quotedblleft /quotedblright /bullet
/endash /emdash /asciitilde /trademark /scaron
/guilsinglright /oe /bullet /zcaron /Ydieresis
/space /exclamdown /cent /sterling /currency
/yen /brokenbar /section /dieresis /copyright
/ordfeminine /guillemotleft /logicalnot /sfthyphen /registered
/macron /degree /plusminus /twosuperior /threesuperior
/acute /mu /paragraph /middot /cedilla
/onesuperior /ordmasculine /guillemotright /onequarter /onehalf
/threequarters /questiondown /Agrave /Aacute /Acircumflex
/Atilde /Adieresis /Aring /AE /Ccedilla
/Egrave /Eacute /Ecircumflex /Edieresis /Igrave
/Iacute /Icircumflex /Idieresis /Eth /Ntilde
/Ograve /Oacute /Ocircumflex /Otilde /Odieresis
/multiply /Oslash /Ugrave /Uacute /Ucircumflex
/Udieresis /Yacute /Thorn /germandbls /agrave
/aacute /acircumflex /atilde /adieresis /aring
/ae /ccedilla /egrave /eacute /ecircumflex
/edieresis /igrave /iacute /icircumflex /idieresis
/eth /ntilde /ograve /oacute /ocircumflex
/otilde /odieresis /divide /oslash /ugrave
/uacute /ucircumflex /udieresis /yacute /thorn
/ydieresis
] def
%%EndResource
%FOPBeginFontReencode
/Courier-Oblique findfont
dup length dict begin
  {1 index /FID ne {def} {pop pop} ifelse} forall
  /Encoding WinAnsiEncoding def
  currentdict
end
/Courier-Oblique exch definefont pop
/Courier-BoldOblique findfont
dup length dict begin
  {1 index /FID ne {def} {pop pop} ifelse} forall
  /Encoding WinAnsiEncoding def
  currentdict
end
/Courier-BoldOblique exch definefont pop
/Courier-Bold findfont
dup length dict begin
  {1 index /FID ne {def} {pop pop} ifelse} forall
  /Encoding WinAnsiEncoding def
  currentdict
end
/Courier-Bold exch definefont pop
/Helvetica findfont
dup length dict begin
  {1 index /FID ne {def} {pop pop} ifelse} forall
  /Encoding WinAnsiEncoding def
  currentdict
end
/Helvetica exch definefont pop
/Helvetica-Oblique findfont
dup length dict begin
  {1 index /FID ne {def} {pop pop} ifelse} forall
  /Encoding WinAnsiEncoding def
  currentdict
end
/Helvetica-Oblique exch definefont pop
/Helvetica-Bold findfont
dup length dict begin
  {1 index /FID ne {def} {pop pop} ifelse} forall
  /Encoding WinAnsiEncoding def
  currentdict
end
/Helvetica-Bold exch definefont pop
/Helvetica-BoldOblique findfont
dup length dict begin
  {1 index /FID ne {def} {pop pop} ifelse} forall
  /Encoding WinAnsiEncoding def
  currentdict
end
/Helvetica-BoldOblique exch definefont pop
/Times-Roman findfont
dup length dict begin
  {1 index /FID ne {def} {pop pop} ifelse} forall
  /Encoding WinAnsiEncoding def
  currentdict
end
/Times-Roman exch definefont pop
/Times-Italic findfont
dup length dict begin
  {1 index /FID ne {def} {pop pop} ifelse} forall
  /Encoding WinAnsiEncoding def
  currentdict
end
/Times-Italic exch definefont pop
/Times-Bold findfont
dup length dict begin
  {1 index /FID ne {def} {pop pop} ifelse} forall
  /Encoding WinAnsiEncoding def
  currentdict
end
/Times-Bold exch definefont pop
/Times-BoldItalic findfont
dup length dict begin
  {1 index /FID ne {def} {pop pop} ifelse} forall
  /Encoding WinAnsiEncoding def
  currentdict
end
/Times-BoldItalic exch definefont pop
/Courier findfont
dup length dict begin
  {1 index /FID ne {def} {pop pop} ifelse} forall
  /Encoding WinAnsiEncoding def
  currentdict
end
/Courier exch definefont pop
%FOPEndFontReencode
%%EndProlog
%%Page: 1 1
%%PageBoundingBox: 0 0 420 315
%%BeginPageSetup
[1 0 0 -1 0 315] CT
%%EndPageSetup
GS
[0.6 0 0 0.6 0 0] CT
1 GC
N
0 0 700 525 re
f
GR
GS
[0.6 0 0 0.6 0 0] CT
1 GC
N
0 0 700 525 re
f
GR
GS
[0.6 0 0 0.6 0 0] CT
1 GC
N
91 467 M
634 467 L
634 39 L
91 39 L
cp
f
GR
GS
[0.6 0 0 0.6 0 0] CT
0.149 GC
2 setlinecap
1 LJ
0.833 LW
N
91 467 M
634 467 L
S
GR
GS
[0.6 0 0 0.6 0 0] CT
0.149 GC
2 setlinecap
1 LJ
0.833 LW
N
91 39 M
634 39 L
S
GR
GS
[0.6 0 0 0.6 0 0] CT
0.149 GC
2 setlinecap
1 LJ
0.833 LW
N
91 467 M
91 461.57 L
S
GR
GS
[0.6 0 0 0.6 0 0] CT
0.149 GC
2 setlinecap
1 LJ
0.833 LW
N
151.333 467 M
151.333 461.57 L
S
GR
GS
[0.6 0 0 0.6 0 0] CT
0.149 GC
2 setlinecap
1 LJ
0.833 LW
N
211.667 467 M
211.667 461.57 L
S
GR
GS
[0.6 0 0 0.6 0 0] CT
0.149 GC
2 setlinecap
1 LJ
0.833 LW
N
272 467 M
272 461.57 L
S
GR
GS
[0.6 0 0 0.6 0 0] CT
0.149 GC
2 setlinecap
1 LJ
0.833 LW
N
332.333 467 M
332.333 461.57 L
S
GR
GS
[0.6 0 0 0.6 0 0] CT
0.149 GC
2 setlinecap
1 LJ
0.833 LW
N
392.667 467 M
392.667 461.57 L
S
GR
GS
[0.6 0 0 0.6 0 0] CT
0.149 GC
2 setlinecap
1 LJ
0.833 LW
N
453 467 M
453 461.57 L
S
GR
GS
[0.6 0 0 0.6 0 0] CT
0.149 GC
2 setlinecap
1 LJ
0.833 LW
N
513.333 467 M
513.333 461.57 L
S
GR
GS
[0.6 0 0 0.6 0 0] CT
0.149 GC
2 setlinecap
1 LJ
0.833 LW
N
573.667 467 M
573.667 461.57 L
S
GR
GS
[0.6 0 0 0.6 0 0] CT
0.149 GC
2 setlinecap
1 LJ
0.833 LW
N
634 467 M
634 461.57 L
S
GR
GS
[0.6 0 0 0.6 0 0] CT
0.149 GC
2 setlinecap
1 LJ
0.833 LW
N
91 39 M
91 44.43 L
S
GR
GS
[0.6 0 0 0.6 0 0] CT
0.149 GC
2 setlinecap
1 LJ
0.833 LW
N
151.333 39 M
151.333 44.43 L
S
GR
GS
[0.6 0 0 0.6 0 0] CT
0.149 GC
2 setlinecap
1 LJ
0.833 LW
N
211.667 39 M
211.667 44.43 L
S
GR
GS
[0.6 0 0 0.6 0 0] CT
0.149 GC
2 setlinecap
1 LJ
0.833 LW
N
272 39 M
272 44.43 L
S
GR
GS
[0.6 0 0 0.6 0 0] CT
0.149 GC
2 setlinecap
1 LJ
0.833 LW
N
332.333 39 M
332.333 44.43 L
S
GR
GS
[0.6 0 0 0.6 0 0] CT
0.149 GC
2 setlinecap
1 LJ
0.833 LW
N
392.667 39 M
392.667 44.43 L
S
GR
GS
[0.6 0 0 0.6 0 0] CT
0.149 GC
2 setlinecap
1 LJ
0.833 LW
N
453 39 M
453 44.43 L
S
GR
GS
[0.6 0 0 0.6 0 0] CT
0.149 GC
2 setlinecap
1 LJ
0.833 LW
N
513.333 39 M
513.333 44.43 L
S
GR
GS
[0.6 0 0 0.6 0 0] CT
0.149 GC
2 setlinecap
1 LJ
0.833 LW
N
573.667 39 M
573.667 44.43 L
S
GR
GS
[0.6 0 0 0.6 0 0] CT
0.149 GC
2 setlinecap
1 LJ
0.833 LW
N
634 39 M
634 44.43 L
S
GR
GS
[0.6 0 0 0.6 54.6 284.19999] CT
0.149 GC
/Helvetica 16.667 F
GS
[1 0 0 1 0 0] CT
-16.5 17 moveto 
1 -1 scale
(7.53) t 
GR
GR
GS
[0.6 0 0 0.6 90.8 284.19999] CT
0.149 GC
/Helvetica 16.667 F
GS
[1 0 0 1 0 0] CT
-16.5 17 moveto 
1 -1 scale
(7.54) t 
GR
GR
GS
[0.6 0 0 0.6 127 284.19999] CT
0.149 GC
/Helvetica 16.667 F
GS
[1 0 0 1 0 0] CT
-16.5 17 moveto 
1 -1 scale
(7.55) t 
GR
GR
GS
[0.6 0 0 0.6 163.2 284.19999] CT
0.149 GC
/Helvetica 16.667 F
GS
[1 0 0 1 0 0] CT
-16.5 17 moveto 
1 -1 scale
(7.56) t 
GR
GR
GS
[0.6 0 0 0.6 199.40001 284.19999] CT
0.149 GC
/Helvetica 16.667 F
GS
[1 0 0 1 0 0] CT
-16.5 17 moveto 
1 -1 scale
(7.57) t 
GR
GR
GS
[0.6 0 0 0.6 235.59999 284.19999] CT
0.149 GC
/Helvetica 16.667 F
GS
[1 0 0 1 0 0] CT
-16.5 17 moveto 
1 -1 scale
(7.58) t 
GR
GR
GS
[0.6 0 0 0.6 271.8 284.19999] CT
0.149 GC
/Helvetica 16.667 F
GS
[1 0 0 1 0 0] CT
-16.5 17 moveto 
1 -1 scale
(7.59) t 
GR
GR
GS
[0.6 0 0 0.6 307.99999 284.19999] CT
0.149 GC
/Helvetica 16.667 F
GS
[1 0 0 1 0 0] CT
-12 17 moveto 
1 -1 scale
(7.6) t 
GR
GR
GS
[0.6 0 0 0.6 344.20001 284.19999] CT
0.149 GC
/Helvetica 16.667 F
GS
[1 0 0 1 0 0] CT
-16.5 17 moveto 
1 -1 scale
(7.61) t 
GR
GR
GS
[0.6 0 0 0.6 380.4 284.19999] CT
0.149 GC
/Helvetica 16.667 F
GS
[1 0 0 1 0 0] CT
-16.5 17 moveto 
1 -1 scale
(7.62) t 
GR
GR
GS
[0.6 0 0 0.6 217.5 297.80001] CT
0.149 GC
/Helvetica 18.333 F
GS
[1 0 0 1 0 0] CT
-20 19 moveto 
1 -1 scale
(s [m]) t 
GR
GR
GS
[0.6 0 0 0.6 356.4 310.8] CT
0.149 GC
N
2.5 -0.484 M
2.5 -0.625 2.578 -0.734 QT
6.125 -4.25 L
2.578 -7.781 L
2.5 -7.875 2.5 -8.016 QT
2.5 -8.141 2.602 -8.242 QT
2.703 -8.344 2.844 -8.344 QT
2.953 -8.344 3.094 -8.25 QT
6.609 -4.719 L
10.125 -8.25 L
10.266 -8.344 10.375 -8.344 QT
10.516 -8.344 10.609 -8.25 QT
10.703 -8.156 10.703 -8.016 QT
10.703 -7.875 10.625 -7.781 QT
7.094 -4.25 L
10.625 -0.734 L
10.703 -0.625 10.703 -0.484 QT
10.703 -0.344 10.609 -0.25 QT
10.516 -0.156 10.375 -0.156 QT
10.25 -0.156 10.125 -0.281 QT
6.609 -3.781 L
3.094 -0.281 L
2.969 -0.156 2.844 -0.156 QT
2.703 -0.156 2.602 -0.258 QT
2.5 -0.359 2.5 -0.484 QT
cp
f
GR
GS
[0.6 0 0 0.6 364.2 310.8] CT
0.149 GC
/Helvetica 16.667 F
GS
[1 0 0 1 0 0] CT
0 0 moveto 
1 -1 scale
(10) t 
GR
GR
GS
[0.6 0 0 0.6 375.6 306] CT
0.149 GC
/Helvetica 13.333 F
GS
[1 0 0 1 0 0] CT
0 0 moveto 
1 -1 scale
(4) t 
GR
GR
GS
[0.6 0 0 0.6 0 0] CT
0.149 GC
2 setlinecap
1 LJ
0.833 LW
N
91 467 M
91 39 L
S
GR
GS
[0.6 0 0 0.6 0 0] CT
0.149 GC
2 setlinecap
1 LJ
0.833 LW
N
634 467 M
634 39 L
S
GR
GS
[0.6 0 0 0.6 0 0] CT
0.149 GC
2 setlinecap
1 LJ
0.833 LW
N
91 467 M
96.43 467 L
S
GR
GS
[0.6 0 0 0.6 0 0] CT
0.149 GC
2 setlinecap
1 LJ
0.833 LW
N
91 381.4 M
96.43 381.4 L
S
GR
GS
[0.6 0 0 0.6 0 0] CT
0.149 GC
2 setlinecap
1 LJ
0.833 LW
N
91 295.8 M
96.43 295.8 L
S
GR
GS
[0.6 0 0 0.6 0 0] CT
0.149 GC
2 setlinecap
1 LJ
0.833 LW
N
91 210.2 M
96.43 210.2 L
S
GR
GS
[0.6 0 0 0.6 0 0] CT
0.149 GC
2 setlinecap
1 LJ
0.833 LW
N
91 124.6 M
96.43 124.6 L
S
GR
GS
[0.6 0 0 0.6 0 0] CT
0.149 GC
2 setlinecap
1 LJ
0.833 LW
N
91 39 M
96.43 39 L
S
GR
GS
[0.6 0 0 0.6 0 0] CT
0.149 GC
2 setlinecap
1 LJ
0.833 LW
N
634 467 M
628.57 467 L
S
GR
GS
[0.6 0 0 0.6 0 0] CT
0.149 GC
2 setlinecap
1 LJ
0.833 LW
N
634 381.4 M
628.57 381.4 L
S
GR
GS
[0.6 0 0 0.6 0 0] CT
0.149 GC
2 setlinecap
1 LJ
0.833 LW
N
634 295.8 M
628.57 295.8 L
S
GR
GS
[0.6 0 0 0.6 0 0] CT
0.149 GC
2 setlinecap
1 LJ
0.833 LW
N
634 210.2 M
628.57 210.2 L
S
GR
GS
[0.6 0 0 0.6 0 0] CT
0.149 GC
2 setlinecap
1 LJ
0.833 LW
N
634 124.6 M
628.57 124.6 L
S
GR
GS
[0.6 0 0 0.6 0 0] CT
0.149 GC
2 setlinecap
1 LJ
0.833 LW
N
634 39 M
628.57 39 L
S
GR
GS
[0.6 0 0 0.6 50.60103 280.2] CT
0.149 GC
/Helvetica 16.667 F
GS
[1 0 0 1 0 0] CT
-10 6.5 moveto 
1 -1 scale
(0) t 
GR
GR
GS
[0.6 0 0 0.6 50.60103 228.84] CT
0.149 GC
/Helvetica 16.667 F
GS
[1 0 0 1 0 0] CT
-10 6.5 moveto 
1 -1 scale
(5) t 
GR
GR
GS
[0.6 0 0 0.6 50.60103 177.47999] CT
0.149 GC
/Helvetica 16.667 F
GS
[1 0 0 1 0 0] CT
-19 6.5 moveto 
1 -1 scale
(10) t 
GR
GR
GS
[0.6 0 0 0.6 50.60103 126.12] CT
0.149 GC
/Helvetica 16.667 F
GS
[1 0 0 1 0 0] CT
-19 6.5 moveto 
1 -1 scale
(15) t 
GR
GR
GS
[0.6 0 0 0.6 50.60103 74.76] CT
0.149 GC
/Helvetica 16.667 F
GS
[1 0 0 1 0 0] CT
-19 6.5 moveto 
1 -1 scale
(20) t 
GR
GR
GS
[0.6 0 0 0.6 50.60103 23.4] CT
0.149 GC
/Helvetica 16.667 F
GS
[1 0 0 1 0 0] CT
-19 6.5 moveto 
1 -1 scale
(25) t 
GR
GR
GS
[0 -0.6 0.6 0 36.20022 151.79987] CT
0.149 GC
/Helvetica 18.333 F
GS
[1 0 0 1 0 0] CT
-27 -5 moveto 
1 -1 scale
(v [m/s]) t 
GR
GR
GS
[0.6 0 0 0.6 0 0] CT
0 0.447 0.741 RC
1 LJ
3.333 LW
N
147.836 467 M
147.836 467 L
147.836 467 L
147.836 467 L
147.836 467 L
147.836 467 L
147.836 467 L
147.836 466.999 L
147.836 466.997 L
147.836 466.987 L
147.836 466.937 L
147.836 466.83 L
147.836 466.703 L
147.836 466.552 L
147.836 466.374 L
147.836 466.159 L
147.836 465.894 L
147.836 465.555 L
147.836 465.103 L
147.841 464.487 L
147.845 463.783 L
147.85 463.364 L
147.85 462.945 L
147.859 462.377 L
147.864 461.679 L
147.869 461.227 L
147.878 460.776 L
147.883 460.202 L
147.897 459.536 L
147.902 459.08 L
147.911 458.623 L
147.921 458.055 L
147.935 457.402 L
147.944 456.938 L
147.954 456.473 L
147.968 455.907 L
147.987 455.267 L
148.001 454.685 L
148.015 454.215 L
148.024 453.778 L
148.039 453.267 L
148.057 452.647 L
148.081 452.017 L
148.095 451.497 L
148.114 451.061 L
148.128 450.599 L
148.147 450.029 L
148.175 449.38 L
148.189 448.916 L
148.208 448.452 L
148.232 447.887 L
148.26 447.246 L
148.288 446.664 L
148.307 446.193 L
148.326 445.757 L
148.35 445.247 L
148.383 444.627 L
148.411 443.997 L
148.439 443.476 L
148.463 443.04 L
148.486 442.578 L
148.519 442.009 L
148.552 441.36 L
148.581 440.896 L
148.604 440.431 L
148.637 439.866 L
148.68 439.227 L
148.713 438.645 L
148.741 438.174 L
148.769 437.736 L
148.802 437.226 L
148.845 436.607 L
148.887 435.977 L
148.92 435.457 L
148.953 435.02 L
148.986 434.559 L
149.024 433.989 L
149.076 433.341 L
149.109 432.876 L
149.142 432.411 L
149.184 431.847 L
149.236 431.208 L
149.283 430.626 L
149.321 430.155 L
149.354 429.717 L
149.396 429.207 L
149.448 428.589 L
149.5 427.959 L
149.547 427.438 L
149.585 427.001 L
149.627 426.54 L
149.674 425.97 L
149.735 425.323 L
149.778 424.858 L
149.82 424.393 L
149.872 423.829 L
149.933 423.19 L
149.99 422.608 L
150.037 422.137 L
150.08 421.699 L
150.131 421.189 L
150.193 420.571 L
150.259 419.941 L
150.311 419.421 L
150.358 418.984 L
150.405 418.522 L
150.466 417.953 L
150.537 417.306 L
150.589 416.841 L
150.636 416.376 L
150.702 415.812 L
150.772 415.173 L
150.838 414.591 L
150.895 414.12 L
150.942 413.683 L
151.003 413.173 L
151.079 412.554 L
151.154 411.925 L
151.215 411.405 L
151.267 410.968 L
151.324 410.506 L
151.395 409.937 L
151.479 409.29 L
151.536 408.825 L
151.597 408.361 L
151.668 407.796 L
151.753 407.158 L
151.828 406.576 L
151.89 406.105 L
151.951 405.668 L
152.017 405.158 L
152.102 404.54 L
152.191 403.911 L
152.262 403.39 L
152.323 402.954 L
152.389 402.492 L
152.469 401.923 L
152.559 401.276 L
152.63 400.811 L
152.696 400.347 L
152.776 399.783 L
152.875 399.144 L
152.96 398.563 L
153.03 398.092 L
153.096 397.655 L
153.172 397.145 L
153.271 396.527 L
153.365 395.898 L
153.45 395.378 L
153.516 394.941 L
153.591 394.48 L
153.681 393.911 L
153.784 393.264 L
153.86 392.799 L
153.935 392.335 L
154.029 391.771 L
154.133 391.132 L
154.232 390.551 L
154.308 390.081 L
154.383 389.643 L
154.468 389.134 L
154.576 388.516 L
154.685 387.887 L
154.774 387.367 L
154.85 386.93 L
154.93 386.469 L
155.033 385.9 L
155.147 385.253 L
155.231 384.789 L
155.316 384.325 L
155.415 383.761 L
155.533 383.123 L
155.642 382.542 L
155.731 382.071 L
155.811 381.634 L
155.905 381.125 L
156.023 380.507 L
156.141 379.878 L
156.24 379.358 L
156.325 378.922 L
156.415 378.461 L
156.528 377.892 L
156.65 377.246 L
156.744 376.781 L
156.834 376.317 L
156.947 375.754 L
157.074 375.116 L
157.192 374.535 L
157.291 374.065 L
157.376 373.628 L
157.485 373.118 L
157.612 372.501 L
157.739 371.872 L
157.847 371.353 L
157.942 370.916 L
158.041 370.455 L
158.159 369.887 L
158.295 369.24 L
158.399 368.776 L
158.498 368.312 L
158.62 367.749 L
158.757 367.111 L
158.884 366.531 L
158.988 366.06 L
159.087 365.624 L
159.2 365.114 L
159.337 364.497 L
159.478 363.869 L
159.596 363.349 L
159.695 362.913 L
159.804 362.452 L
159.931 361.884 L
160.082 361.238 L
160.19 360.774 L
160.298 360.31 L
160.43 359.747 L
160.581 359.109 L
160.718 358.529 L
160.831 358.059 L
160.935 357.622 L
161.057 357.113 L
161.208 356.496 L
161.359 355.868 L
161.486 355.349 L
161.595 354.913 L
161.708 354.452 L
161.849 353.884 L
162.01 353.238 L
162.123 352.775 L
162.24 352.311 L
162.382 351.748 L
162.542 351.111 L
162.693 350.531 L
162.811 350.061 L
162.924 349.624 L
163.056 349.116 L
163.216 348.499 L
163.381 347.871 L
163.518 347.352 L
163.631 346.916 L
163.754 346.456 L
163.904 345.888 L
164.074 345.242 L
164.197 344.779 L
164.324 344.315 L
164.475 343.753 L
164.649 343.115 L
164.805 342.536 L
164.932 342.066 L
165.054 341.63 L
165.196 341.121 L
165.366 340.504 L
165.54 339.877 L
165.686 339.358 L
165.809 338.923 L
165.936 338.462 L
166.096 337.895 L
166.28 337.249 L
166.412 336.786 L
166.544 336.323 L
166.709 335.76 L
166.893 335.124 L
167.058 334.544 L
167.194 334.075 L
167.322 333.638 L
167.473 333.13 L
167.656 332.514 L
167.84 331.887 L
167.996 331.368 L
168.123 330.933 L
168.26 330.473 L
168.434 329.905 L
168.627 329.26 L
168.769 328.797 L
168.91 328.334 L
169.08 327.772 L
169.273 327.135 L
169.452 326.556 L
169.598 326.087 L
169.735 325.651 L
169.891 325.143 L
170.084 324.527 L
170.282 323.9 L
170.442 323.382 L
170.583 322.947 L
170.73 322.487 L
170.909 321.92 L
171.111 321.275 L
171.262 320.812 L
171.413 320.349 L
171.592 319.787 L
171.8 319.151 L
171.988 318.572 L
172.139 318.103 L
172.285 317.668 L
172.45 317.16 L
172.653 316.544 L
172.86 315.918 L
173.034 315.399 L
173.181 314.965 L
173.331 314.505 L
173.525 313.938 L
173.742 313.294 L
173.897 312.831 L
174.053 312.369 L
174.246 311.807 L
174.463 311.171 L
174.661 310.593 L
174.821 310.124 L
174.972 309.688 L
175.151 309.181 L
175.363 308.566 L
175.58 307.939 L
175.764 307.422 L
175.914 306.987 L
176.079 306.528 L
176.277 305.961 L
176.508 305.317 L
176.673 304.855 L
176.838 304.393 L
177.036 303.831 L
177.267 303.196 L
177.475 302.617 L
177.644 302.149 L
177.805 301.714 L
177.988 301.206 L
178.215 300.591 L
178.441 299.966 L
178.634 299.448 L
178.794 299.014 L
178.964 298.555 L
179.172 297.989 L
179.412 297.345 L
179.586 296.883 L
179.761 296.421 L
179.973 295.86 L
180.208 295.225 L
180.43 294.647 L
180.609 294.179 L
180.774 293.744 L
180.967 293.237 L
181.203 292.622 L
181.443 291.997 L
181.641 291.479 L
181.811 291.045 L
181.99 290.587 L
182.207 290.021 L
182.462 289.378 L
182.641 288.916 L
182.825 288.454 L
183.041 287.893 L
183.296 287.259 L
183.522 286.681 L
183.711 286.213 L
183.88 285.778 L
184.083 285.272 L
184.333 284.658 L
184.583 284.033 L
184.79 283.516 L
184.969 283.082 L
185.153 282.623 L
185.384 282.058 L
185.648 281.415 L
185.836 280.954 L
186.025 280.492 L
186.256 279.932 L
186.515 279.298 L
186.756 278.72 L
186.949 278.253 L
187.133 277.818 L
187.345 277.312 L
187.599 276.698 L
187.863 276.074 L
188.08 275.557 L
188.264 275.123 L
188.457 274.665 L
188.698 274.1 L
188.971 273.458 L
189.169 272.997 L
189.367 272.536 L
189.607 271.976 L
189.881 271.342 L
190.13 270.765 L
190.333 270.298 L
190.522 269.864 L
190.743 269.358 L
191.007 268.744 L
191.281 268.12 L
191.512 267.604 L
191.7 267.171 L
191.903 266.713 L
192.153 266.148 L
192.435 265.506 L
192.643 265.045 L
192.85 264.585 L
193.1 264.025 L
193.383 263.392 L
193.642 262.815 L
193.854 262.348 L
194.047 261.914 L
194.278 261.409 L
194.557 260.796 L
194.839 260.172 L
195.075 259.656 L
195.278 259.223 L
195.485 258.766 L
195.744 258.202 L
196.041 257.56 L
196.253 257.1 L
196.47 256.639 L
196.729 256.08 L
197.026 255.447 L
197.295 254.871 L
197.512 254.404 L
197.715 253.971 L
197.955 253.466 L
198.242 252.853 L
198.539 252.23 L
198.785 251.715 L
198.992 251.282 L
199.209 250.825 L
199.477 250.261 L
199.784 249.62 L
200.005 249.16 L
200.232 248.7 L
200.5 248.141 L
200.807 247.508 L
201.085 246.933 L
201.311 246.467 L
201.523 246.034 L
201.773 245.529 L
202.07 244.917 L
202.376 244.294 L
202.631 243.779 L
202.843 243.347 L
203.069 242.89 L
203.352 242.326 L
203.668 241.686 L
203.899 241.226 L
204.13 240.766 L
204.408 240.208 L
204.728 239.576 L
205.016 239.001 L
205.252 238.535 L
205.468 238.102 L
205.728 237.598 L
206.039 236.986 L
206.355 236.364 L
206.618 235.849 L
206.84 235.417 L
207.071 234.961 L
207.363 234.398 L
207.693 233.758 L
207.929 233.299 L
208.169 232.839 L
208.457 232.282 L
208.787 231.65 L
209.084 231.075 L
209.329 230.61 L
209.555 230.178 L
209.819 229.673 L
210.144 229.062 L
210.469 228.441 L
210.743 227.926 L
210.969 227.495 L
211.214 227.039 L
211.511 226.476 L
211.855 225.837 L
212.1 225.378 L
212.345 224.919 L
212.642 224.362 L
212.986 223.731 L
213.293 223.156 L
213.547 222.691 L
213.778 222.259 L
214.052 221.756 L
214.386 221.145 L
214.726 220.524 L
215.004 220.01 L
215.244 219.579 L
215.494 219.123 L
215.8 218.562 L
216.154 217.923 L
216.408 217.464 L
216.663 217.005 L
216.969 216.448 L
217.323 215.818 L
217.643 215.244 L
217.903 214.78 L
218.143 214.348 L
218.426 213.845 L
218.77 213.235 L
219.119 212.614 L
219.406 212.101 L
219.651 211.67 L
219.911 211.215 L
220.231 210.653 L
220.594 210.015 L
220.853 209.557 L
221.117 209.099 L
221.438 208.542 L
221.796 207.912 L
222.126 207.339 L
222.395 206.875 L
222.645 206.444 L
222.937 205.941 L
223.29 205.332 L
223.653 204.712 L
223.95 204.199 L
224.2 203.768 L
224.469 203.313 L
224.799 202.753 L
225.171 202.115 L
225.44 201.657 L
225.713 201.199 L
226.038 200.643 L
226.411 200.014 L
226.755 199.442 L
227.028 198.978 L
227.287 198.547 L
227.584 198.045 L
227.952 197.436 L
228.32 196.816 L
228.631 196.304 L
228.89 195.874 L
229.163 195.419 L
229.503 194.859 L
229.889 194.222 L
230.167 193.765 L
230.445 193.307 L
230.78 192.752 L
231.167 192.123 L
231.515 191.551 L
231.798 191.088 L
232.067 190.657 L
232.373 190.156 L
232.75 189.547 L
233.132 188.929 L
233.448 188.417 L
233.717 187.987 L
233.995 187.533 L
234.344 186.973 L
234.744 186.337 L
235.027 185.88 L
235.314 185.423 L
235.663 184.868 L
236.059 184.24 L
236.417 183.669 L
236.71 183.206 L
236.983 182.776 L
237.299 182.274 L
237.685 181.667 L
238.077 181.049 L
238.407 180.537 L
238.68 180.108 L
238.967 179.654 L
239.326 179.095 L
239.736 178.459 L
240.028 178.003 L
240.325 177.546 L
240.683 176.992 L
241.089 176.365 L
241.456 175.794 L
241.758 175.332 L
242.036 174.902 L
242.366 174.401 L
242.762 173.794 L
243.163 173.176 L
243.502 172.666 L
243.78 172.237 L
244.082 171.784 L
244.449 171.225 L
244.869 170.59 L
245.171 170.134 L
245.472 169.678 L
245.84 169.124 L
246.255 168.498 L
246.636 167.927 L
246.943 167.465 L
247.23 167.036 L
247.565 166.536 L
247.975 165.93 L
248.39 165.313 L
248.734 164.802 L
249.021 164.374 L
249.328 163.922 L
249.705 163.363 L
250.139 162.729 L
250.445 162.273 L
250.756 161.818 L
251.133 161.265 L
251.562 160.639 L
251.953 160.069 L
252.269 159.608 L
252.561 159.179 L
252.905 158.679 L
253.325 158.074 L
253.749 157.457 L
254.103 156.947 L
254.4 156.52 L
254.715 156.068 L
255.102 155.51 L
255.545 154.876 L
255.861 154.421 L
256.181 153.966 L
256.568 153.414 L
257.006 152.784 L
257.407 152.207 L
257.732 151.74 L
258.034 151.306 L
258.387 150.8 L
258.812 150.187 L
259.25 149.563 L
259.613 149.046 L
259.914 148.613 L
260.24 148.155 L
260.636 147.591 L
261.088 146.949 L
261.413 146.488 L
261.743 146.027 L
262.139 145.468 L
262.587 144.835 L
262.997 144.259 L
263.332 143.792 L
263.643 143.358 L
264.001 142.853 L
264.439 142.24 L
264.887 141.617 L
265.26 141.101 L
265.571 140.668 L
265.901 140.211 L
266.311 139.647 L
266.773 139.006 L
267.107 138.546 L
267.442 138.085 L
267.847 137.527 L
268.309 136.894 L
268.729 136.319 L
269.073 135.852 L
269.389 135.419 L
269.761 134.914 L
270.209 134.302 L
270.666 133.68 L
271.048 133.165 L
271.368 132.732 L
271.703 132.276 L
272.123 131.713 L
272.599 131.072 L
272.938 130.612 L
273.282 130.153 L
273.697 129.595 L
274.173 128.963 L
274.602 128.388 L
274.951 127.922 L
275.276 127.49 L
275.653 126.985 L
276.115 126.374 L
276.586 125.752 L
276.973 125.238 L
277.303 124.806 L
277.647 124.35 L
278.076 123.787 L
278.561 123.148 L
278.91 122.689 L
279.264 122.229 L
279.688 121.672 L
280.173 121.041 L
280.612 120.467 L
280.97 120.002 L
281.3 119.57 L
281.691 119.066 L
282.162 118.455 L
282.643 117.834 L
283.039 117.32 L
283.374 116.889 L
283.727 116.434 L
284.166 115.872 L
284.665 115.233 L
285.024 114.774 L
285.382 114.316 L
285.815 113.759 L
286.31 113.129 L
286.763 112.555 L
287.126 112.091 L
287.465 111.659 L
287.866 111.156 L
288.347 110.546 L
288.837 109.926 L
289.242 109.413 L
289.586 108.982 L
289.949 108.527 L
290.397 107.966 L
290.906 107.328 L
291.269 106.87 L
291.637 106.412 L
292.084 105.856 L
292.589 105.227 L
293.051 104.654 L
293.423 104.19 L
293.772 103.759 L
294.177 103.256 L
294.667 102.647 L
295.172 102.028 L
295.587 101.515 L
295.935 101.085 L
296.308 100.631 L
296.765 100.07 L
297.283 99.433 L
297.656 98.976 L
298.033 98.518 L
298.485 97.963 L
299.004 97.334 L
299.475 96.762 L
299.857 96.299 L
300.211 95.869 L
300.625 95.367 L
301.13 94.759 L
301.643 94.14 L
302.068 93.628 L
302.426 93.198 L
302.803 92.745 L
303.27 92.185 L
303.802 91.549 L
304.184 91.092 L
304.566 90.635 L
305.033 90.08 L
305.56 89.453 L
306.041 88.881 L
306.428 88.419 L
306.791 87.989 L
307.215 87.488 L
307.729 86.88 L
308.252 86.262 L
308.69 85.751 L
309.053 85.322 L
309.44 84.869 L
309.916 84.31 L
310.458 83.674 L
310.849 83.218 L
311.24 82.762 L
311.712 82.208 L
312.254 81.581 L
312.744 81.011 L
313.14 80.549 L
313.512 80.119 L
313.941 79.619 L
314.469 79.013 L
315.002 78.395 L
315.445 77.885 L
315.817 77.456 L
316.213 77.004 L
316.699 76.446 L
317.25 75.811 L
317.651 75.355 L
318.047 74.9 L
318.532 74.347 L
319.084 73.721 L
319.583 73.151 L
319.989 72.69 L
320.366 72.261 L
320.809 71.761 L
321.346 71.156 L
321.888 70.539 L
322.341 70.029 L
322.722 69.602 L
323.123 69.15 L
323.618 68.592 L
324.184 67.958 L
324.589 67.504 L
324.994 67.049 L
325.489 66.496 L
326.05 65.871 L
326.564 65.302 L
326.979 64.841 L
327.361 64.413 L
327.813 63.914 L
328.36 63.309 L
328.916 62.694 L
329.373 62.185 L
329.76 61.758 L
330.17 61.307 L
330.679 60.75 L
331.254 60.117 L
331.669 59.663 L
332.084 59.208 L
332.588 58.657 L
333.158 58.033 L
333.677 57.465 L
334.101 57.004 L
334.492 56.577 L
334.954 56.079 L
335.51 55.475 L
336.076 54.86 L
336.547 54.352 L
336.938 53.925 L
337.358 53.475 L
337.872 52.919 L
338.461 52.287 L
338.885 51.833 L
339.305 51.38 L
339.818 50.829 L
340.403 50.206 L
340.931 49.638 L
341.364 49.179 L
341.765 48.752 L
342.232 48.254 L
342.797 47.651 L
343.377 47.038 L
343.853 46.53 L
344.254 46.104 L
344.683 45.654 L
345.206 45.099 L
345.805 44.468 L
346.234 44.015 L
346.667 43.562 L
347.19 43.012 L
347.784 42.39 L
348.322 41.823 L
348.76 41.365 L
349.17 40.939 L
349.646 40.442 L
350.221 39.84 L
350.636 39.408 L
350.636 39.408 L
351.225 39.102 L
351.763 39.038 L
352.201 39.023 L
352.616 39.019 L
353.101 39.017 L
353.681 39.017 L
354.261 39.014 L
354.742 39.005 L
355.152 39.003 L
355.595 39.002 L
356.132 39.002 L
356.735 39.002 L
357.273 39.002 L
357.702 39.002 L
358.112 39.002 L
358.597 39.002 L
359.186 39.002 L
359.776 39.002 L
360.252 39.002 L
360.657 39.002 L
361.091 39.002 L
361.637 39.002 L
362.245 39.002 L
362.674 39.002 L
363.099 39.002 L
363.631 39.002 L
364.239 39.002 L
364.678 39.002 L
365.111 39.002 L
365.644 39.002 L
366.238 39.002 L
366.78 39.002 L
367.223 39.002 L
367.633 39.002 L
368.114 39.002 L
368.694 39.002 L
369.278 39.002 L
369.768 39.002 L
370.178 39.002 L
370.612 39.002 L
371.145 39.002 L
371.748 39.002 L
372.295 39.002 L
372.728 39.002 L
373.134 39.002 L
373.615 39.002 L
374.199 39.002 L
374.793 39.002 L
375.274 39.002 L
375.679 39.002 L
376.113 39.002 L
376.65 39.002 L
377.258 39.002 L
377.692 39.002 L
378.121 39.002 L
378.649 39.002 L
379.257 39.002 L
379.695 39.002 L
380.133 39.002 L
380.661 39.002 L
381.255 39.002 L
381.797 39.002 L
382.24 39.002 L
382.655 39.002 L
383.131 39.002 L
383.711 39.002 L
384.295 39.002 L
384.781 39.002 L
385.196 39.002 L
385.629 39.002 L
386.162 39.002 L
386.765 39.002 L
387.307 39.002 L
387.746 39.002 L
388.151 39.002 L
388.632 39.002 L
389.216 39.002 L
389.806 39.002 L
390.291 39.002 L
390.696 39.002 L
391.13 39.002 L
391.667 39.002 L
392.275 39.002 L
392.709 39.002 L
393.138 39.002 L
393.666 39.002 L
394.274 39.002 L
394.821 39.002 L
395.259 39.002 L
395.664 39.002 L
396.141 39.002 L
396.72 39.002 L
397.314 39.002 L
397.804 39.002 L
398.21 39.002 L
398.639 39.002 L
399.171 39.002 L
399.784 39.002 L
400.218 39.002 L
400.651 39.002 L
401.179 39.002 L
401.783 39.002 L
402.325 39.002 L
402.768 39.002 L
403.173 39.002 L
403.654 39.002 L
404.234 39.002 L
404.823 39.002 L
405.308 39.002 L
405.718 39.002 L
406.152 39.002 L
406.685 39.002 L
407.293 39.002 L
407.726 39.002 L
408.16 39.002 L
408.688 39.002 L
409.287 39.002 L
409.833 39.002 L
410.276 39.002 L
410.682 39.002 L
411.163 39.002 L
411.742 39.002 L
412.332 39.002 L
412.817 39.002 L
413.227 39.002 L
413.661 39.002 L
414.193 39.002 L
414.797 39.002 L
415.235 39.002 L
415.669 39.002 L
416.197 39.002 L
416.795 39.002 L
417.342 39.002 L
417.78 39.002 L
418.19 39.002 L
418.671 39.002 L
419.251 39.002 L
419.84 39.002 L
420.326 39.002 L
420.736 39.002 L
421.169 39.002 L
421.702 39.002 L
422.305 39.002 L
422.744 39.002 L
423.177 39.002 L
423.705 39.002 L
424.304 39.002 L
424.851 39.002 L
425.289 39.002 L
425.699 39.002 L
426.18 39.002 L
426.755 39.002 L
427.349 39.002 L
427.834 39.002 L
428.244 39.002 L
428.673 39.002 L
429.211 39.002 L
429.814 39.002 L
430.252 39.002 L
430.686 39.002 L
431.214 39.002 L
431.813 39.002 L
432.359 39.002 L
432.798 39.002 L
433.208 39.002 L
433.684 39.002 L
434.264 39.002 L
434.853 39.002 L
435.343 39.002 L
435.753 39.002 L
436.182 39.002 L
436.715 39.002 L
437.323 39.002 L
437.761 39.002 L
438.195 39.002 L
438.723 39.002 L
439.321 39.002 L
439.868 39.002 L
440.306 39.002 L
440.717 39.002 L
441.193 39.002 L
441.772 39.002 L
442.362 39.002 L
442.852 39.002 L
443.262 39.002 L
443.691 39.002 L
444.223 39.002 L
444.831 39.002 L
445.265 39.002 L
445.703 39.002 L
446.231 39.002 L
446.83 39.002 L
447.372 39.002 L
447.815 39.002 L
448.225 39.002 L
448.701 39.002 L
449.281 39.002 L
449.87 39.002 L
450.36 39.002 L
450.766 39.002 L
451.199 39.002 L
451.732 39.002 L
452.34 39.002 L
452.774 39.002 L
453.212 39.002 L
453.74 39.002 L
454.339 39.002 L
454.881 39.002 L
455.324 39.002 L
455.734 39.002 L
456.21 39.002 L
456.79 39.002 L
457.379 39.002 L
457.869 39.002 L
458.274 39.002 L
458.708 39.002 L
459.241 39.002 L
459.849 39.002 L
460.282 39.002 L
460.721 39.002 L
461.249 39.002 L
461.847 39.002 L
462.389 39.002 L
462.832 39.002 L
463.243 39.002 L
463.719 39.002 L
464.298 39.002 L
464.888 39.002 L
465.373 39.002 L
465.783 39.002 L
466.217 39.002 L
466.749 39.002 L
467.357 39.002 L
467.791 39.002 L
468.225 39.002 L
468.757 39.002 L
469.351 39.002 L
469.898 39.002 L
470.341 39.002 L
470.751 39.002 L
471.227 39.002 L
471.807 39.002 L
472.396 39.002 L
472.882 39.002 L
473.292 39.002 L
473.725 39.002 L
474.258 39.002 L
474.866 39.002 L
475.3 39.002 L
475.733 39.002 L
476.261 39.002 L
476.86 39.002 L
477.407 39.002 L
477.85 39.002 L
478.255 39.002 L
478.736 39.002 L
479.316 39.002 L
479.905 39.002 L
480.39 39.002 L
480.8 39.002 L
481.234 39.002 L
481.767 39.002 L
482.37 39.002 L
482.808 39.002 L
483.242 39.002 L
483.77 39.002 L
484.369 39.002 L
484.915 39.002 L
485.354 39.002 L
485.764 39.002 L
486.245 39.002 L
486.824 39.002 L
487.414 39.002 L
487.899 39.002 L
488.309 39.002 L
488.743 39.002 L
489.275 39.002 L
489.879 39.002 L
490.317 39.002 L
490.751 39.002 L
491.279 39.002 L
491.877 39.002 L
492.424 39.002 L
492.862 39.002 L
493.272 39.002 L
493.753 39.002 L
494.328 39.002 L
494.918 39.002 L
495.408 39.002 L
495.818 39.002 L
496.247 39.002 L
496.784 39.002 L
497.387 39.002 L
497.826 39.002 L
498.259 39.002 L
498.787 39.002 L
499.386 39.002 L
499.933 39.002 L
500.371 39.002 L
500.781 39.002 L
501.257 39.002 L
501.837 39.002 L
502.426 39.002 L
502.916 39.002 L
503.326 39.002 L
503.755 39.002 L
504.288 39.002 L
504.896 39.002 L
505.33 39.002 L
505.768 39.002 L
506.296 39.002 L
506.895 39.002 L
507.437 39.002 L
507.88 39.002 L
508.29 39.002 L
508.766 39.002 L
509.346 39.002 L
509.935 39.002 L
510.425 39.002 L
510.83 39.002 L
511.264 39.002 L
511.797 39.002 L
512.405 39.002 L
512.838 39.002 L
513.277 39.002 L
513.805 39.002 L
514.403 39.002 L
514.945 39.002 L
515.388 39.002 L
515.799 39.002 L
516.275 39.002 L
516.854 39.002 L
517.444 39.002 L
517.934 39.002 L
518.339 39.002 L
518.773 39.002 L
519.305 39.002 L
519.913 39.002 L
520.347 39.002 L
520.785 39.002 L
521.313 39.002 L
521.912 39.002 L
522.454 39.002 L
522.897 39.002 L
523.307 39.002 L
523.783 39.002 L
524.363 39.002 L
524.952 39.002 L
525.438 39.002 L
525.848 39.002 L
526.281 39.002 L
526.814 39.002 L
527.422 39.002 L
527.856 39.002 L
528.289 39.002 L
528.822 39.002 L
529.421 39.002 L
529.963 39.002 L
530.406 39.002 L
530.816 39.002 L
531.292 39.002 L
531.872 39.002 L
532.461 39.002 L
532.946 39.002 L
533.356 39.002 L
533.79 39.002 L
534.323 39.002 L
534.931 39.002 L
535.364 39.002 L
535.798 39.002 L
536.326 39.002 L
536.925 39.002 L
537.471 39.002 L
537.914 39.002 L
538.325 39.002 L
538.801 39.002 L
539.38 39.002 L
539.97 39.002 L
540.455 39.002 L
540.865 39.002 L
541.299 39.002 L
541.831 39.002 L
542.439 39.002 L
542.873 39.002 L
543.307 39.002 L
543.835 39.002 L
544.433 39.002 L
544.98 39.002 L
545.418 39.002 L
545.828 39.002 L
546.309 39.002 L
546.889 39.002 L
547.478 39.002 L
547.964 39.002 L
548.374 39.002 L
548.807 39.002 L
549.34 39.002 L
549.943 39.002 L
550.382 39.002 L
550.815 39.002 L
551.343 39.002 L
551.942 39.002 L
552.489 39.002 L
552.927 39.002 L
553.337 39.002 L
553.818 39.002 L
554.398 39.002 L
554.987 39.002 L
555.472 39.002 L
555.882 39.002 L
556.316 39.002 L
556.849 39.002 L
557.452 39.002 L
557.89 39.002 L
558.324 39.002 L
558.852 39.002 L
559.451 39.002 L
559.997 39.002 L
560.436 39.002 L
560.846 39.002 L
561.327 39.002 L
561.902 39.002 L
562.491 39.002 L
562.981 39.002 L
563.391 39.002 L
563.82 39.002 L
564.357 39.002 L
564.961 39.002 L
565.399 39.002 L
565.833 39.002 L
566.361 39.002 L
566.959 39.002 L
567.506 39.002 L
567.944 39.002 L
568.354 39.002 L
568.831 39.002 L
569.41 39.002 L
570 39.002 L
570.49 39.002 L
570.9 39.002 L
571.329 39.002 L
571.861 39.002 L
572.469 39.002 L
572.903 39.002 L
573.341 39.002 L
573.869 39.002 L
574.468 39.002 L
575.01 39.002 L
575.453 39.002 L
575.863 39.002 L
576.339 39.002 L
576.919 39.002 L
577.508 39.002 L
577.998 39.002 L
578.404 39.002 L
578.837 39.002 L
579.37 39.002 L
579.978 39.002 L
580.412 39.002 L
580.85 39.002 L
581.378 39.002 L
581.977 39.002 L
582.519 39.002 L
582.962 39.002 L
583.372 39.002 L
583.848 39.002 L
584.428 39.002 L
585.017 39.002 L
585.507 39.002 L
585.912 39.002 L
586.346 39.002 L
586.879 39.002 L
587.487 39.002 L
587.92 39.002 L
588.359 39.002 L
588.887 39.002 L
589.485 39.002 L
590.027 39.002 L
590.47 39.002 L
590.88 39.002 L
591.357 39.002 L
591.936 39.002 L
592.526 39.002 L
593.011 39.002 L
593.421 39.002 L
593.855 39.002 L
594.387 39.002 L
594.995 39.002 L
595.429 39.002 L
595.863 39.002 L
596.395 39.002 L
596.994 39.002 L
597.536 39.002 L
597.979 39.002 L
598.389 39.002 L
598.865 39.002 L
599.445 39.002 L
600.034 39.002 L
600.52 39.002 L
600.93 39.002 L
601.363 39.002 L
601.896 39.002 L
602.504 39.002 L
602.938 39.002 L
603.371 39.002 L
603.899 39.002 L
604.498 39.002 L
605.045 39.002 L
605.488 39.002 L
605.893 39.002 L
606.374 39.002 L
606.954 39.002 L
607.543 39.002 L
608.028 39.002 L
608.438 39.002 L
608.872 39.002 L
609.405 39.002 L
610.008 39.002 L
610.446 39.002 L
610.88 39.002 L
611.408 39.002 L
612.007 39.002 L
612.553 39.002 L
612.992 39.002 L
613.402 39.002 L
613.883 39.002 L
614.462 39.002 L
615.052 39.002 L
615.537 39.002 L
615.947 39.002 L
616.381 39.002 L
616.913 39.002 L
617.517 39.002 L
617.955 39.002 L
618.389 39.002 L
618.917 39.002 L
619.515 39.002 L
620.062 39.002 L
620.5 39.002 L
620.911 39.002 L
621.391 39.002 L
621.966 39.002 L
622.56 39.002 L
623.046 39.002 L
623.456 39.002 L
623.885 39.002 L
624.422 39.002 L
625.068 39.002 L
S
GR
GS
[0.6 0 0 0.6 0 0] CT
0.851 0.325 0.098 RC
1 LJ
3.333 LW
N
147.836 467 M
147.864 466.09 L
147.892 464.378 L
147.921 463.003 L
147.958 461.577 L
147.996 460.118 L
148.029 459.035 L
148.057 458.028 L
148.1 457.029 L
148.128 456.268 L
148.166 455.144 L
148.204 454.219 L
148.232 453.859 L
148.27 452.928 L
148.312 452.03 L
148.354 451.662 L
148.397 450.833 L
148.439 450.13 L
148.486 449.748 L
148.524 449.366 L
148.571 448.58 L
148.604 448.184 L
148.665 447.364 L
148.703 446.961 L
148.741 446.555 L
148.769 446.143 L
148.797 445.74 L
148.835 445.322 L
148.873 444.931 L
148.906 444.525 L
148.948 444.126 L
148.986 443.721 L
149.024 443.325 L
149.057 442.923 L
149.099 442.531 L
149.137 442.135 L
149.184 441.746 L
149.236 441.35 L
149.269 440.965 L
149.316 440.572 L
149.372 440.183 L
149.42 439.784 L
149.467 439.395 L
149.547 438.989 L
149.636 438.219 L
149.669 437.832 L
149.731 437.443 L
149.811 436.671 L
149.844 436.294 L
149.896 435.913 L
149.962 435.53 L
150.061 434.776 L
150.108 434.394 L
150.169 434.011 L
150.207 433.634 L
150.277 433.251 L
150.315 432.87 L
150.381 432.49 L
150.442 432.113 L
150.49 431.736 L
150.541 431.357 L
150.584 430.979 L
150.636 430.604 L
150.692 430.229 L
150.744 429.854 L
150.796 429.479 L
150.853 429.101 L
150.9 428.724 L
150.961 428.349 L
151.018 427.961 L
151.069 427.594 L
151.117 427.22 L
151.182 426.845 L
151.239 426.466 L
151.305 426.074 L
151.352 425.7 L
151.423 425.31 L
151.47 424.916 L
151.541 424.519 L
151.597 424.116 L
151.663 423.708 L
151.729 423.296 L
151.8 422.88 L
151.852 422.464 L
151.918 422.043 L
151.984 421.617 L
152.045 421.186 L
152.111 420.75 L
152.172 420.312 L
152.238 419.871 L
152.309 419.425 L
152.384 418.919 L
152.45 418.4 L
152.512 417.969 L
152.559 409.302 L
152.644 408.908 L
152.729 408.495 L
152.813 408.068 L
152.898 407.633 L
152.978 407.182 L
153.073 406.711 L
153.157 406.216 L
153.238 405.721 L
153.322 405.226 L
153.417 404.73 L
153.511 404.236 L
153.601 403.742 L
153.685 403.251 L
153.775 402.758 L
153.879 402.266 L
153.963 401.776 L
154.053 401.285 L
154.143 400.794 L
154.242 400.302 L
154.336 399.808 L
154.435 399.318 L
154.524 398.829 L
154.628 398.338 L
154.718 397.85 L
154.817 397.363 L
154.925 396.862 L
155.01 396.387 L
155.118 395.899 L
155.217 395.412 L
155.321 394.922 L
155.425 394.435 L
155.528 393.947 L
155.627 393.46 L
155.736 392.974 L
155.839 392.488 L
155.943 392.003 L
156.052 391.518 L
156.146 391.035 L
156.254 390.553 L
156.367 390.06 L
156.476 389.589 L
156.584 389.105 L
156.693 388.622 L
156.806 388.139 L
156.914 387.655 L
157.027 387.174 L
157.136 386.693 L
157.254 386.197 L
157.381 385.725 L
157.475 385.244 L
157.598 384.762 L
157.711 384.277 L
157.833 383.794 L
157.956 383.311 L
158.055 382.347 L
158.168 381.867 L
158.291 381.388 L
158.408 380.91 L
158.531 380.434 L
158.653 379.955 L
158.771 379.476 L
158.903 378.996 L
159.031 378.516 L
159.158 378.037 L
159.271 377.561 L
159.398 377.085 L
159.521 376.609 L
159.657 376.131 L
159.78 375.654 L
159.912 375.176 L
160.053 374.698 L
160.176 374.22 L
160.313 373.742 L
160.44 373.265 L
160.577 372.786 L
160.713 372.309 L
160.85 371.832 L
160.973 371.356 L
161.114 370.876 L
161.251 370.4 L
161.383 369.922 L
161.524 369.443 L
161.656 368.965 L
161.788 368.478 L
161.929 368.016 L
162.066 367.54 L
162.207 367.066 L
162.358 366.59 L
162.5 366.114 L
162.632 365.639 L
162.773 365.165 L
162.929 364.689 L
163.07 364.201 L
163.221 363.734 L
163.362 363.256 L
163.513 362.778 L
163.673 362.297 L
163.796 361.82 L
163.947 361.342 L
164.098 360.863 L
164.258 360.382 L
164.399 359.902 L
164.55 359.422 L
164.71 358.942 L
164.871 358.46 L
165.021 357.98 L
165.172 357.501 L
165.318 357.025 L
165.474 356.539 L
165.634 356.074 L
165.794 355.598 L
165.95 355.121 L
166.115 354.644 L
166.266 354.168 L
166.436 353.69 L
166.596 353.213 L
166.747 352.736 L
166.926 352.257 L
167.077 351.778 L
167.237 351.299 L
167.911 350.819 L
168.081 350.339 L
168.227 349.861 L
168.396 349.373 L
168.566 348.908 L
168.736 348.43 L
168.91 347.95 L
169.075 347.472 L
169.254 346.992 L
169.419 346.513 L
169.584 346.033 L
169.754 345.551 L
169.942 345.068 L
170.117 344.572 L
170.272 344.099 L
170.451 343.614 L
170.626 343.134 L
170.805 342.654 L
170.965 342.162 L
171.149 341.696 L
171.338 341.217 L
171.517 340.738 L
171.682 340.258 L
171.866 339.767 L
172.045 339.302 L
172.233 338.822 L
172.408 338.345 L
172.606 337.868 L
172.78 337.392 L
172.959 336.915 L
173.133 336.426 L
173.327 335.961 L
173.52 335.479 L
173.694 335.002 L
173.888 334.526 L
174.071 334.052 L
174.246 333.576 L
174.439 333.096 L
174.628 332.618 L
174.816 332.14 L
175 331.66 L
175.203 331.186 L
175.401 330.707 L
175.495 328.821 L
175.683 328.351 L
175.891 327.868 L
176.089 327.408 L
176.301 326.934 L
176.485 326.459 L
176.692 325.983 L
176.89 325.507 L
177.079 325.035 L
177.291 324.558 L
177.484 324.081 L
177.682 323.604 L
177.894 323.13 L
178.092 322.653 L
178.285 322.178 L
178.497 321.7 L
178.705 321.223 L
178.917 320.742 L
179.106 320.265 L
179.318 319.787 L
179.52 319.309 L
179.732 318.83 L
179.945 318.339 L
180.157 317.875 L
180.364 317.403 L
180.571 316.934 L
180.784 316.462 L
181.01 315.989 L
181.227 315.517 L
181.429 315.046 L
181.646 314.568 L
181.858 314.092 L
182.066 313.608 L
182.297 313.147 L
182.513 312.673 L
182.726 312.198 L
182.938 311.71 L
183.159 311.242 L
183.39 310.763 L
183.598 310.284 L
183.824 309.808 L
184.05 309.327 L
184.262 308.855 L
184.488 308.38 L
184.696 307.908 L
184.931 307.432 L
185.158 306.957 L
185.393 306.47 L
185.629 305.954 L
185.855 305.525 L
186.086 305.047 L
186.298 304.57 L
186.534 304.041 L
186.779 303.615 L
186.991 303.141 L
187.218 302.667 L
187.463 302.192 L
187.698 301.716 L
187.92 301.24 L
188.165 300.762 L
188.391 300.285 L
188.627 299.811 L
188.877 299.336 L
189.098 298.865 L
189.348 298.393 L
189.574 297.925 L
189.815 297.456 L
190.06 296.989 L
190.295 296.521 L
190.536 296.052 L
190.781 295.587 L
191.021 295.121 L
191.276 294.653 L
191.512 294.182 L
191.757 293.713 L
192.002 293.24 L
192.237 292.773 L
192.492 292.307 L
192.742 291.842 L
192.992 291.373 L
193.237 290.902 L
193.477 290.437 L
193.732 289.969 L
193.981 289.501 L
194.217 289.029 L
194.472 288.556 L
194.726 288.081 L
194.981 287.606 L
195.24 287.133 L
195.49 286.66 L
195.749 286.184 L
196.008 285.709 L
196.253 285.225 L
196.513 284.764 L
196.777 284.291 L
197.036 283.816 L
197.3 283.34 L
197.568 282.851 L
197.809 282.388 L
198.073 281.911 L
198.337 281.431 L
198.591 280.954 L
198.86 280.478 L
199.11 280.004 L
199.383 279.53 L
199.647 279.054 L
199.916 278.577 L
200.189 278.047 L
200.448 277.62 L
200.717 277.096 L
200.986 276.676 L
201.264 276.208 L
201.523 275.744 L
201.797 275.283 L
202.079 274.817 L
202.343 274.35 L
202.631 273.88 L
202.871 273.408 L
203.149 272.942 L
203.432 272.473 L
203.691 272.004 L
203.988 271.528 L
204.257 271.049 L
204.53 270.568 L
205.138 270.079 L
205.412 269.608 L
205.695 269.128 L
205.954 268.642 L
206.237 268.179 L
206.524 267.699 L
206.793 267.224 L
207.085 266.747 L
207.373 266.269 L
207.651 265.795 L
207.952 265.32 L
208.212 264.847 L
208.494 264.371 L
208.787 263.891 L
209.084 263.408 L
209.376 262.929 L
209.659 262.449 L
209.951 261.973 L
210.243 261.496 L
210.54 261.018 L
210.842 260.54 L
211.129 260.068 L
211.403 259.6 L
211.723 259.13 L
211.982 258.665 L
212.294 258.187 L
212.6 257.73 L
212.887 257.262 L
213.161 256.786 L
213.477 256.33 L
214.061 255.864 L
214.353 255.406 L
214.664 254.942 L
214.957 254.481 L
215.249 254.018 L
215.551 253.507 L
215.843 253.098 L
216.145 252.643 L
216.451 252.192 L
216.776 251.688 L
217.073 251.285 L
217.37 250.836 L
217.662 250.387 L
217.973 249.926 L
218.299 249.482 L
218.591 249.018 L
218.893 248.573 L
219.208 248.119 L
219.524 247.614 L
219.826 247.208 L
220.142 246.749 L
220.462 246.294 L
220.759 245.843 L
220.976 244.928 L
221.292 244.428 L
221.608 244.025 L
221.904 243.57 L
222.244 243.062 L
222.541 242.653 L
222.857 242.194 L
223.177 241.736 L
223.512 241.276 L
223.823 240.799 L
224.148 240.34 L
224.459 239.819 L
224.761 239.401 L
225.105 238.935 L
225.43 238.468 L
225.732 238.009 L
226.076 237.559 L
226.382 237.114 L
226.712 236.674 L
227.217 236.231 L
227.532 235.782 L
227.844 235.285 L
228.178 234.878 L
228.503 234.422 L
228.824 233.965 L
229.163 233.444 L
229.503 233.02 L
229.847 232.553 L
230.158 232.094 L
230.502 231.626 L
230.827 231.174 L
231.152 230.719 L
231.492 230.267 L
231.831 229.832 L
232.166 229.388 L
232.51 228.938 L
232.849 228.478 L
233.189 228.027 L
233.533 227.577 L
233.844 227.13 L
234.169 226.69 L
234.523 226.228 L
234.857 225.742 L
235.211 225.334 L
235.541 224.869 L
235.894 224.426 L
236.658 223.977 L
237.002 223.525 L
237.355 223.066 L
237.695 222.604 L
238.044 222.137 L
238.383 221.67 L
238.732 221.205 L
239.09 220.743 L
239.434 220.275 L
239.769 219.81 L
240.118 219.347 L
240.476 218.881 L
240.834 218.418 L
241.173 217.949 L
241.551 217.48 L
241.899 217.022 L
242.229 216.561 L
242.587 216.105 L
242.936 215.646 L
243.295 215.183 L
243.657 214.725 L
244.025 214.267 L
244.369 213.805 L
244.746 213.343 L
245.086 212.827 L
245.453 212.412 L
245.802 211.897 L
246.179 211.482 L
246.504 210.968 L
246.882 210.561 L
247.244 210.111 L
247.612 209.661 L
247.97 209.198 L
248.347 208.757 L
248.706 208.298 L
248.866 207.843 L
249.219 207.393 L
249.573 206.954 L
249.95 206.507 L
250.337 206.06 L
250.695 205.617 L
251.053 205.165 L
251.43 204.714 L
251.812 204.262 L
252.17 203.814 L
252.528 203.366 L
252.929 202.909 L
253.297 202.45 L
253.678 201.946 L
254.051 201.546 L
254.409 201.097 L
254.767 200.64 L
255.144 200.201 L
255.521 199.7 L
255.899 199.298 L
256.294 198.835 L
256.662 198.394 L
257.039 197.942 L
257.416 197.491 L
257.793 197.037 L
258.203 196.581 L
258.571 196.127 L
258.958 195.672 L
259.335 195.213 L
259.735 194.749 L
260.292 194.293 L
260.659 193.837 L
261.069 193.378 L
261.461 192.869 L
261.838 192.46 L
262.219 192.009 L
262.601 191.559 L
262.978 191.108 L
263.384 190.655 L
263.77 190.199 L
264.157 189.738 L
264.562 189.3 L
264.939 188.848 L
265.349 188.39 L
265.731 187.922 L
266.141 187.482 L
266.532 187.022 L
266.942 186.573 L
267.324 186.121 L
267.739 185.668 L
268.121 185.22 L
268.512 184.771 L
268.894 184.327 L
269.304 183.886 L
269.69 183.438 L
270.105 182.984 L
270.515 182.531 L
270.897 182.084 L
271.326 181.639 L
271.698 181.181 L
272.127 180.74 L
272.542 180.242 L
272.933 179.836 L
273.343 179.397 L
273.763 178.897 L
274.154 178.492 L
274.578 177.99 L
274.974 177.586 L
275.398 177.133 L
275.79 176.624 L
276.209 176.231 L
276.605 175.783 L
277.034 175.326 L
277.449 174.871 L
277.868 174.42 L
278.245 173.969 L
278.656 173.507 L
279.075 173.054 L
279.485 172.604 L
279.914 172.152 L
280.334 171.69 L
280.748 171.222 L
281.173 170.76 L
281.597 170.29 L
281.997 169.837 L
282.62 169.374 L
283.039 168.914 L
283.463 168.45 L
283.888 167.982 L
284.312 167.518 L
284.736 167.062 L
285.165 166.604 L
285.594 166.139 L
286.004 165.675 L
286.423 165.219 L
286.862 164.759 L
287.281 164.304 L
287.701 163.846 L
288.12 163.388 L
288.549 162.933 L
288.988 162.473 L
289.412 162.02 L
289.845 161.566 L
290.274 161.104 L
290.722 160.646 L
291.156 160.188 L
291.589 159.735 L
292.023 159.278 L
292.443 158.812 L
292.853 158.356 L
293.296 157.894 L
293.739 157.434 L
294.187 156.974 L
294.63 156.512 L
295.063 156.084 L
295.492 155.626 L
295.935 155.154 L
296.378 154.694 L
296.817 154.229 L
297.255 153.766 L
297.708 153.287 L
298.151 152.837 L
298.603 152.368 L
299.046 151.847 L
299.471 151.433 L
299.918 150.919 L
300.343 150.508 L
300.795 150.039 L
301.248 149.526 L
301.714 149.114 L
302.138 148.602 L
302.591 148.193 L
303.048 147.735 L
303.906 147.281 L
304.358 146.827 L
304.816 146.363 L
305.278 145.9 L
305.716 145.436 L
306.135 144.963 L
306.602 144.496 L
307.073 144.03 L
307.535 143.509 L
307.993 143.095 L
308.464 142.637 L
308.907 142.183 L
309.341 141.724 L
309.803 141.258 L
310.265 140.802 L
310.618 139.889 L
311.08 139.428 L
311.537 138.979 L
312.009 138.521 L
312.48 138.055 L
312.956 137.592 L
313.413 137.14 L
313.87 136.676 L
314.318 136.222 L
314.799 135.767 L
315.27 135.314 L
315.728 134.836 L
316.213 134.392 L
316.684 133.936 L
317.137 133.48 L
317.622 133.016 L
318.084 132.556 L
318.551 132.098 L
319.032 131.638 L
319.475 131.186 L
319.946 130.734 L
320.432 130.281 L
320.908 129.822 L
321.384 129.366 L
321.869 128.905 L
322.336 128.444 L
322.845 127.991 L
323.297 127.538 L
323.802 127.081 L
324.245 126.615 L
324.745 126.161 L
325.206 125.707 L
325.697 125.251 L
326.192 124.794 L
326.668 124.288 L
327.144 123.882 L
327.658 123.414 L
328.129 122.975 L
328.605 122.521 L
329.081 122.059 L
329.59 121.595 L
330.467 121.136 L
330.948 120.667 L
331.452 120.196 L
331.961 119.726 L
332.428 119.266 L
332.908 118.799 L
333.413 118.333 L
333.922 117.88 L
334.398 117.417 L
334.902 116.981 L
335.378 116.537 L
335.887 116.09 L
336.359 115.642 L
336.872 115.192 L
337.377 114.695 L
337.848 114.195 L
338.353 113.805 L
338.866 113.41 L
339.366 112.962 L
339.847 112.459 L
340.464 112.073 L
340.973 111.596 L
341.478 111.204 L
341.958 110.777 L
342.463 110.295 L
342.977 109.895 L
343.481 109.451 L
343.985 109.014 L
344.494 108.574 L
344.999 108.137 L
345.522 107.701 L
346.031 107.273 L
346.54 106.846 L
347.03 106.416 L
347.539 105.993 L
348.058 105.561 L
348.538 105.116 L
349.062 104.675 L
349.575 104.239 L
350.103 103.799 L
350.792 103.365 L
351.31 102.928 L
351.81 102.493 L
352.333 102.057 L
352.818 101.62 L
353.346 101.183 L
353.874 100.739 L
354.369 100.302 L
354.892 99.86 L
355.43 99.425 L
355.943 98.994 L
356.453 98.564 L
356.966 98.13 L
357.499 97.69 L
358.036 97.248 L
358.564 96.799 L
359.045 96.357 L
359.578 95.924 L
360.115 95.483 L
360.643 95.045 L
361.18 94.606 L
361.718 94.163 L
362.179 93.727 L
362.557 93.291 L
363.099 92.861 L
363.636 92.422 L
364.131 91.992 L
364.673 91.563 L
365.229 91.129 L
365.738 90.692 L
366.252 90.268 L
366.803 89.834 L
367.355 89.404 L
367.892 88.976 L
368.397 88.552 L
368.92 88.12 L
369.481 87.699 L
370.013 87.28 L
370.565 86.877 L
371.041 86.481 L
371.597 86.085 L
372.139 85.692 L
372.691 85.314 L
373.237 84.932 L
373.747 84.558 L
374.567 84.184 L
375.099 83.818 L
375.627 83.469 L
376.198 83.122 L
376.725 82.726 L
377.258 82.346 L
377.781 81.985 L
378.337 81.663 L
378.884 81.368 L
379.407 81.123 L
379.95 80.99 L
380.529 80.875 L
381.052 80.781 L
381.562 80.594 L
382.127 80.499 L
382.655 80.378 L
383.192 80.258 L
383.767 80.18 L
384.3 79.979 L
384.837 79.863 L
385.398 79.741 L
385.926 79.648 L
386.501 79.565 L
386.949 79.392 L
387.435 79.322 L
388.005 79.232 L
388.538 79.143 L
389.113 79.072 L
389.645 79.022 L
390.183 79.019 L
390.762 78.981 L
391.295 78.928 L
391.799 78.883 L
392.37 78.849 L
392.912 78.808 L
393.463 78.806 L
394.038 78.822 L
394.547 78.834 L
395.41 78.866 L
395.938 78.877 L
396.518 78.895 L
397.046 78.908 L
397.578 78.944 L
398.158 78.952 L
398.686 78.999 L
399.261 79.048 L
399.794 79.079 L
400.321 79.107 L
400.892 79.143 L
401.396 79.199 L
401.896 79.245 L
402.49 79.29 L
403.003 79.292 L
403.564 79.291 L
404.102 79.321 L
404.677 79.331 L
405.191 79.373 L
405.723 79.43 L
406.298 79.491 L
406.826 79.594 L
407.363 79.656 L
407.939 79.661 L
408.476 79.696 L
408.98 79.726 L
409.56 79.771 L
410.144 79.811 L
410.644 79.803 L
411.181 79.788 L
411.752 79.775 L
412.299 79.798 L
412.85 79.836 L
413.369 79.852 L
413.92 79.894 L
414.467 79.933 L
415.018 79.966 L
415.57 80.036 L
416.102 80.117 L
416.663 80.179 L
417.582 80.25 L
418.158 80.315 L
418.69 80.371 L
419.227 80.428 L
419.76 80.486 L
420.283 80.524 L
420.835 80.568 L
421.405 80.621 L
421.933 80.664 L
422.466 80.707 L
423.008 80.761 L
423.54 80.807 L
424.12 80.863 L
424.629 80.917 L
425.228 80.967 L
425.737 81.032 L
426.274 81.084 L
426.835 81.129 L
427.363 81.168 L
427.933 81.212 L
428.471 81.254 L
429.003 81.292 L
429.574 81.324 L
430.054 81.363 L
430.63 81.394 L
431.167 81.424 L
431.714 81.463 L
432.279 81.502 L
432.817 81.537 L
433.373 81.575 L
433.712 81.608 L
434.202 81.641 L
434.754 81.683 L
435.305 81.716 L
435.843 81.753 L
436.413 81.785 L
436.946 81.826 L
437.502 81.861 L
438.03 81.906 L
438.581 81.942 L
439.137 81.983 L
439.67 82.019 L
440.674 82.063 L
441.235 82.094 L
441.749 82.125 L
442.305 82.156 L
442.823 82.188 L
443.375 82.22 L
443.922 82.253 L
444.459 82.271 L
444.992 82.302 L
445.553 82.331 L
446.085 82.358 L
446.637 82.381 L
447.184 82.406 L
447.735 82.435 L
448.277 82.459 L
448.805 82.482 L
449.342 82.503 L
449.88 82.527 L
450.398 82.55 L
450.968 82.572 L
451.511 82.602 L
452.053 82.624 L
452.604 82.638 L
453.085 82.663 L
453.683 82.683 L
454.164 82.697 L
454.702 82.717 L
455.258 82.743 L
455.809 82.765 L
456.342 82.787 L
456.865 82.81 L
457.421 82.832 L
457.963 82.857 L
458.496 82.879 L
459.033 82.901 L
459.571 82.918 L
460.108 82.939 L
460.655 82.951 L
461.211 82.959 L
461.72 82.975 L
462.762 82.991 L
463.271 83.018 L
463.799 83.038 L
464.369 83.049 L
464.902 83.063 L
465.439 83.074 L
466.009 83.087 L
466.518 83.098 L
467.084 83.127 L
467.626 83.149 L
468.168 83.165 L
468.715 83.178 L
469.233 83.189 L
469.742 83.201 L
470.299 83.212 L
470.822 83.243 L
471.383 83.252 L
471.939 83.256 L
472.486 83.27 L
473.033 83.289 L
473.513 83.316 L
474.06 83.339 L
474.607 83.355 L
475.154 83.391 L
475.71 83.41 L
476.242 83.435 L
476.808 83.452 L
477.341 83.467 L
477.873 83.485 L
478.406 83.513 L
478.929 83.528 L
479.462 83.542 L
480.027 83.567 L
480.574 83.577 L
481.121 83.588 L
481.63 83.608 L
482.177 83.624 L
482.742 83.636 L
483.247 83.661 L
483.841 83.684 L
484.354 83.695 L
484.873 83.708 L
485.467 83.728 L
485.976 83.738 L
486.48 83.748 L
487.051 83.756 L
487.588 83.766 L
488.422 83.773 L
488.955 83.788 L
489.521 83.792 L
490.048 83.8 L
490.586 83.816 L
491.123 83.825 L
491.675 83.813 L
492.193 83.827 L
492.74 83.837 L
493.258 83.838 L
493.819 83.84 L
494.366 83.834 L
494.927 83.83 L
495.445 83.833 L
495.992 83.828 L
496.52 83.825 L
497.067 83.825 L
497.581 83.834 L
497.944 83.836 L
498.467 83.84 L
498.999 83.844 L
499.537 83.848 L
500.107 83.851 L
500.607 83.855 L
501.172 83.859 L
501.705 83.853 L
502.238 83.856 L
502.794 83.851 L
503.35 83.856 L
503.859 83.861 L
504.42 83.858 L
504.967 83.854 L
505.49 83.863 L
506.046 83.863 L
506.602 83.858 L
507.917 83.868 L
508.464 83.877 L
509.006 83.885 L
509.534 83.894 L
510.095 83.909 L
510.614 83.909 L
511.16 83.911 L
511.674 83.908 L
512.24 83.915 L
512.787 83.92 L
513.314 83.927 L
513.847 83.929 L
514.408 83.936 L
514.936 83.944 L
515.473 83.948 L
516.044 83.951 L
516.548 83.957 L
517.085 83.96 L
517.642 83.957 L
518.179 83.967 L
518.749 83.974 L
519.287 83.983 L
519.819 83.997 L
520.357 83.997 L
520.88 83.996 L
521.422 84.01 L
521.95 84.014 L
522.52 84.005 L
523.043 84.017 L
523.576 84.029 L
524.146 84.035 L
524.684 84.037 L
525.202 84.042 L
525.749 84.038 L
526.277 84.041 L
526.626 84.039 L
527.191 84.034 L
527.729 84.027 L
528.261 84.029 L
528.798 84.025 L
529.359 84.026 L
529.859 84.025 L
530.434 84.029 L
530.962 84.049 L
531.513 84.06 L
532.023 84.081 L
532.593 84.079 L
533.121 84.074 L
533.682 84.071 L
534.205 84.068 L
534.705 84.081 L
535.218 84.084 L
535.76 84.085 L
536.317 84.088 L
536.84 84.095 L
537.396 84.089 L
537.947 84.087 L
538.494 84.093 L
539.003 84.096 L
539.564 84.097 L
540.087 84.107 L
540.606 84.106 L
541.172 84.1 L
541.709 84.098 L
542.265 84.093 L
542.812 84.093 L
543.335 84.102 L
544.226 84.112 L
544.787 84.118 L
545.324 84.131 L
545.857 84.135 L
546.385 84.139 L
546.913 84.149 L
547.492 84.157 L
548.025 84.156 L
548.562 84.164 L
549.095 84.173 L
549.623 84.177 L
550.174 84.18 L
550.721 84.186 L
551.273 84.186 L
551.815 84.194 L
552.918 84.189 L
553.441 84.182 L
553.974 84.19 L
554.525 84.199 L
555.067 84.195 L
555.623 84.199 L
556.156 84.205 L
556.707 84.21 L
557.226 84.206 L
557.758 84.212 L
558.296 84.218 L
558.838 84.229 L
559.385 84.244 L
559.719 84.256 L
560.224 84.265 L
560.775 84.271 L
561.317 84.27 L
561.864 84.278 L
562.411 84.283 L
562.958 84.279 L
563.5 84.283 L
564.042 84.294 L
564.598 84.308 L
565.107 84.309 L
566.031 84.312 L
566.578 84.312 L
567.124 84.309 L
567.671 84.307 L
568.218 84.297 L
568.769 84.303 L
569.311 84.311 L
569.792 84.317 L
570.334 84.325 L
570.886 84.334 L
571.432 84.332 L
571.979 84.321 L
572.526 84.325 L
573.077 84.324 L
573.62 84.324 L
574.1 84.329 L
574.652 84.338 L
575.194 84.337 L
575.75 84.343 L
576.292 84.344 L
576.971 84.347 L
577.522 84.355 L
578.003 84.365 L
578.55 84.37 L
579.097 84.38 L
579.672 84.387 L
580.19 84.396 L
580.728 84.401 L
581.293 84.405 L
581.835 84.41 L
582.358 84.427 L
582.886 84.427 L
583.424 84.425 L
583.952 84.422 L
584.489 84.43 L
585.059 84.433 L
585.583 84.439 L
586.12 84.446 L
586.667 84.452 L
587.213 84.45 L
587.722 84.449 L
588.269 84.454 L
588.835 84.454 L
589.339 84.459 L
589.91 84.467 L
590.466 84.469 L
590.621 84.485 L
591.144 84.5 L
591.738 84.515 L
592.224 84.527 L
592.757 84.533 L
593.322 84.531 L
593.864 84.547 L
594.397 84.553 L
594.934 84.565 L
595.5 84.575 L
596.028 84.58 L
596.532 84.579 L
597.234 84.579 L
597.63 84.583 L
598.168 84.577 L
598.729 84.578 L
599.252 84.589 L
599.789 84.603 L
600.317 84.613 L
601.363 84.624 L
601.877 84.631 L
602.452 84.632 L
602.985 84.633 L
603.513 84.637 L
604.041 84.638 L
604.606 84.637 L
605.125 84.641 L
605.639 84.642 L
606.228 84.647 L
606.756 84.656 L
607.265 84.66 L
607.821 84.671 L
608.377 84.682 L
608.905 84.692 L
609.428 84.7 L
609.994 84.719 L
610.531 84.733 L
611.055 84.738 L
611.592 84.742 L
612.294 84.741 L
612.817 84.744 L
613.359 84.747 L
613.901 84.747 L
614.448 84.758 L
614.995 84.761 L
615.513 84.771 L
616.065 84.78 L
616.583 84.79 L
617.126 84.785 L
617.672 84.789 L
618.224 84.793 L
618.78 84.792 L
619.322 84.788 L
619.864 84.799 L
620.882 84.804 L
621.396 84.802 L
621.947 84.801 L
622.49 84.805 L
623.036 84.805 L
623.574 84.812 L
624.111 84.821 L
624.662 84.833 L
625.181 84.841 L
S
GR
GS
[0.6 0 0 0.6 0 0] CT
1 GC
N
634 153 M
634 107 L
458 107 L
458 153 L
cp
f
GR
GS
[0.6 0 0 0.6 310.10013 71.76164] CT
/Helvetica 15 F
GS
[1 0 0 1 0 0] CT
0 6 moveto 
1 -1 scale
(Simulovan\341 data) t 
GR
GR
GS
[0.6 0 0 0.6 0 0] CT
0 0.447 0.741 RC
1 LJ
3.333 LW
N
463.007 119.603 M
513.078 119.603 L
S
GR
GS
[0.6 0 0 0.6 310.10013 84.23836] CT
N
1.141 6 M
1.141 -4.734 L
2.594 -4.734 L
8.234 3.688 L
8.234 -4.734 L
9.609 -4.734 L
9.609 6 L
8.141 6 L
2.5 -2.438 L
2.5 6 L
1.141 6 L
cp
16.895 5.047 M
16.161 5.656 15.489 5.914 QT
14.817 6.172 14.036 6.172 QT
12.754 6.172 12.067 5.547 QT
11.379 4.922 11.379 3.953 QT
11.379 3.375 11.637 2.906 QT
11.895 2.438 12.317 2.148 QT
12.739 1.859 13.27 1.719 QT
13.645 1.609 14.442 1.516 QT
16.036 1.328 16.786 1.063 QT
16.801 0.797 16.801 0.719 QT
16.801 -0.094 16.426 -0.422 QT
15.911 -0.859 14.926 -0.859 QT
13.989 -0.859 13.543 -0.539 QT
13.098 -0.219 12.895 0.609 QT
11.598 0.438 L
11.77 -0.391 12.176 -0.898 QT
12.583 -1.406 13.348 -1.68 QT
14.114 -1.953 15.114 -1.953 QT
16.114 -1.953 16.731 -1.719 QT
17.348 -1.484 17.645 -1.133 QT
17.942 -0.781 18.051 -0.234 QT
18.114 0.109 18.114 0.984 QT
18.114 2.734 L
18.114 4.578 18.2 5.063 QT
18.286 5.547 18.536 6 QT
17.161 6 L
16.958 5.594 16.895 5.047 QT
cp
16.786 2.094 M
16.067 2.391 14.629 2.594 QT
13.817 2.719 13.481 2.859 QT
13.145 3 12.965 3.281 QT
12.786 3.563 12.786 3.906 QT
12.786 4.438 13.184 4.789 QT
13.583 5.141 14.348 5.141 QT
15.114 5.141 15.708 4.805 QT
16.301 4.469 16.583 3.891 QT
16.786 3.453 16.786 2.578 QT
16.786 2.094 L
cp
20.159 6 M
20.159 -1.781 L
21.347 -1.781 L
21.347 -0.688 L
21.706 -1.266 22.315 -1.609 QT
22.925 -1.953 23.706 -1.953 QT
24.565 -1.953 25.12 -1.594 QT
25.675 -1.234 25.894 -0.594 QT
26.815 -1.953 28.3 -1.953 QT
29.456 -1.953 30.081 -1.313 QT
30.706 -0.672 30.706 0.656 QT
30.706 6 L
29.394 6 L
29.394 1.094 L
29.394 0.313 29.269 -0.039 QT
29.144 -0.391 28.8 -0.602 QT
28.456 -0.813 28.003 -0.813 QT
27.19 -0.813 26.644 -0.266 QT
26.097 0.281 26.097 1.484 QT
26.097 6 L
24.784 6 L
24.784 0.953 L
24.784 0.063 24.464 -0.375 QT
24.144 -0.813 23.409 -0.813 QT
22.847 -0.813 22.378 -0.516 QT
21.909 -0.219 21.698 0.344 QT
21.487 0.906 21.487 1.969 QT
21.487 6 L
20.159 6 L
cp
37.982 3.5 M
39.342 3.656 L
39.029 4.859 38.154 5.516 QT
37.279 6.172 35.92 6.172 QT
34.217 6.172 33.217 5.125 QT
32.217 4.078 32.217 2.172 QT
32.217 0.219 33.232 -0.867 QT
34.248 -1.953 35.857 -1.953 QT
37.42 -1.953 38.404 -0.891 QT
39.389 0.172 39.389 2.094 QT
39.389 2.219 39.389 2.453 QT
33.576 2.453 L
33.654 3.734 34.303 4.414 QT
34.951 5.094 35.936 5.094 QT
36.654 5.094 37.17 4.711 QT
37.686 4.328 37.982 3.5 QT
cp
33.654 1.359 M
37.998 1.359 L
37.904 0.375 37.498 -0.109 QT
36.873 -0.875 35.873 -0.875 QT
34.951 -0.875 34.334 -0.266 QT
33.717 0.344 33.654 1.359 QT
cp
35.67 -3.797 M
36.482 -5.047 L
37.967 -5.047 L
36.326 -3 L
34.92 -3 L
33.342 -5.047 L
34.842 -5.047 L
35.67 -3.797 L
cp
40.981 6 M
40.981 -1.781 L
42.168 -1.781 L
42.168 -0.594 L
42.622 -1.422 43.012 -1.688 QT
43.403 -1.953 43.856 -1.953 QT
44.528 -1.953 45.215 -1.531 QT
44.762 -0.313 L
44.278 -0.594 43.793 -0.594 QT
43.356 -0.594 43.012 -0.336 QT
42.668 -0.078 42.528 0.391 QT
42.309 1.094 42.309 1.922 QT
42.309 6 L
40.981 6 L
cp
43.012 -3.797 M
43.825 -5.047 L
45.309 -5.047 L
43.668 -3 L
42.262 -3 L
40.684 -5.047 L
42.184 -5.047 L
43.012 -3.797 L
cp
51.32 3.5 M
52.679 3.656 L
52.367 4.859 51.492 5.516 QT
50.617 6.172 49.257 6.172 QT
47.554 6.172 46.554 5.125 QT
45.554 4.078 45.554 2.172 QT
45.554 0.219 46.57 -0.867 QT
47.585 -1.953 49.195 -1.953 QT
50.757 -1.953 51.742 -0.891 QT
52.726 0.172 52.726 2.094 QT
52.726 2.219 52.726 2.453 QT
46.914 2.453 L
46.992 3.734 47.64 4.414 QT
48.289 5.094 49.273 5.094 QT
49.992 5.094 50.507 4.711 QT
51.023 4.328 51.32 3.5 QT
cp
46.992 1.359 M
51.335 1.359 L
51.242 0.375 50.835 -0.109 QT
50.21 -0.875 49.21 -0.875 QT
48.289 -0.875 47.671 -0.266 QT
47.054 0.344 46.992 1.359 QT
cp
54.334 6 M
54.334 -1.781 L
55.521 -1.781 L
55.521 -0.672 L
56.381 -1.953 58.006 -1.953 QT
58.709 -1.953 59.295 -1.703 QT
59.881 -1.453 60.178 -1.039 QT
60.475 -0.625 60.584 -0.063 QT
60.662 0.297 60.662 1.219 QT
60.662 6 L
59.334 6 L
59.334 1.266 L
59.334 0.469 59.186 0.07 QT
59.037 -0.328 58.646 -0.57 QT
58.256 -0.813 57.725 -0.813 QT
56.881 -0.813 56.271 -0.281 QT
55.662 0.25 55.662 1.75 QT
55.662 6 L
54.334 6 L
cp
67.754 5.047 M
67.02 5.656 66.348 5.914 QT
65.676 6.172 64.895 6.172 QT
63.614 6.172 62.926 5.547 QT
62.239 4.922 62.239 3.953 QT
62.239 3.375 62.497 2.906 QT
62.754 2.438 63.176 2.148 QT
63.598 1.859 64.129 1.719 QT
64.504 1.609 65.301 1.516 QT
66.895 1.328 67.645 1.063 QT
67.661 0.797 67.661 0.719 QT
67.661 -0.094 67.286 -0.422 QT
66.77 -0.859 65.786 -0.859 QT
64.848 -0.859 64.403 -0.539 QT
63.958 -0.219 63.754 0.609 QT
62.458 0.438 L
62.629 -0.391 63.036 -0.898 QT
63.442 -1.406 64.208 -1.68 QT
64.973 -1.953 65.973 -1.953 QT
66.973 -1.953 67.59 -1.719 QT
68.208 -1.484 68.504 -1.133 QT
68.801 -0.781 68.911 -0.234 QT
68.973 0.109 68.973 0.984 QT
68.973 2.734 L
68.973 4.578 69.059 5.063 QT
69.145 5.547 69.395 6 QT
68.02 6 L
67.817 5.594 67.754 5.047 QT
cp
67.645 2.094 M
66.926 2.391 65.489 2.594 QT
64.676 2.719 64.34 2.859 QT
64.004 3 63.825 3.281 QT
63.645 3.563 63.645 3.906 QT
63.645 4.438 64.043 4.789 QT
64.442 5.141 65.208 5.141 QT
65.973 5.141 66.567 4.805 QT
67.161 4.469 67.442 3.891 QT
67.645 3.453 67.645 2.578 QT
67.645 2.094 L
cp
64.598 -3 M
65.567 -5.047 L
67.301 -5.047 L
65.692 -3 L
64.598 -3 L
cp
80.233 6 M
80.233 5.016 L
79.499 6.172 78.061 6.172 QT
77.139 6.172 76.358 5.664 QT
75.577 5.156 75.147 4.234 QT
74.717 3.313 74.717 2.125 QT
74.717 0.953 75.108 0.008 QT
75.499 -0.938 76.272 -1.445 QT
77.045 -1.953 77.999 -1.953 QT
78.702 -1.953 79.256 -1.656 QT
79.811 -1.359 80.155 -0.891 QT
80.155 -4.734 L
81.467 -4.734 L
81.467 6 L
80.233 6 L
cp
76.077 2.125 M
76.077 3.609 76.702 4.352 QT
77.327 5.094 78.186 5.094 QT
79.045 5.094 79.655 4.383 QT
80.264 3.672 80.264 2.234 QT
80.264 0.625 79.647 -0.117 QT
79.03 -0.859 78.124 -0.859 QT
77.249 -0.859 76.663 -0.141 QT
76.077 0.578 76.077 2.125 QT
cp
88.606 5.047 M
87.872 5.656 87.2 5.914 QT
86.528 6.172 85.747 6.172 QT
84.466 6.172 83.778 5.547 QT
83.091 4.922 83.091 3.953 QT
83.091 3.375 83.349 2.906 QT
83.606 2.438 84.028 2.148 QT
84.45 1.859 84.981 1.719 QT
85.356 1.609 86.153 1.516 QT
87.747 1.328 88.497 1.063 QT
88.513 0.797 88.513 0.719 QT
88.513 -0.094 88.138 -0.422 QT
87.622 -0.859 86.638 -0.859 QT
85.7 -0.859 85.255 -0.539 QT
84.81 -0.219 84.606 0.609 QT
83.31 0.438 L
83.481 -0.391 83.888 -0.898 QT
84.294 -1.406 85.06 -1.68 QT
85.825 -1.953 86.825 -1.953 QT
87.825 -1.953 88.442 -1.719 QT
89.06 -1.484 89.356 -1.133 QT
89.653 -0.781 89.763 -0.234 QT
89.825 0.109 89.825 0.984 QT
89.825 2.734 L
89.825 4.578 89.911 5.063 QT
89.997 5.547 90.247 6 QT
88.872 6 L
88.669 5.594 88.606 5.047 QT
cp
88.497 2.094 M
87.778 2.391 86.341 2.594 QT
85.528 2.719 85.192 2.859 QT
84.856 3 84.677 3.281 QT
84.497 3.563 84.497 3.906 QT
84.497 4.438 84.896 4.789 QT
85.294 5.141 86.06 5.141 QT
86.825 5.141 87.419 4.805 QT
88.013 4.469 88.294 3.891 QT
88.497 3.453 88.497 2.578 QT
88.497 2.094 L
cp
94.761 4.828 M
94.949 5.984 L
94.386 6.109 93.949 6.109 QT
93.23 6.109 92.832 5.875 QT
92.433 5.641 92.277 5.273 QT
92.121 4.906 92.121 3.719 QT
92.121 -0.75 L
91.152 -0.75 L
91.152 -1.781 L
92.121 -1.781 L
92.121 -3.703 L
93.433 -4.5 L
93.433 -1.781 L
94.761 -1.781 L
94.761 -0.75 L
93.433 -0.75 L
93.433 3.797 L
93.433 4.359 93.503 4.523 QT
93.574 4.688 93.73 4.781 QT
93.886 4.875 94.167 4.875 QT
94.402 4.875 94.761 4.828 QT
cp
101.116 5.047 M
100.382 5.656 99.71 5.914 QT
99.038 6.172 98.257 6.172 QT
96.976 6.172 96.288 5.547 QT
95.601 4.922 95.601 3.953 QT
95.601 3.375 95.858 2.906 QT
96.116 2.438 96.538 2.148 QT
96.96 1.859 97.491 1.719 QT
97.866 1.609 98.663 1.516 QT
100.257 1.328 101.007 1.063 QT
101.022 0.797 101.022 0.719 QT
101.022 -0.094 100.647 -0.422 QT
100.132 -0.859 99.147 -0.859 QT
98.21 -0.859 97.765 -0.539 QT
97.319 -0.219 97.116 0.609 QT
95.819 0.438 L
95.991 -0.391 96.397 -0.898 QT
96.804 -1.406 97.569 -1.68 QT
98.335 -1.953 99.335 -1.953 QT
100.335 -1.953 100.952 -1.719 QT
101.569 -1.484 101.866 -1.133 QT
102.163 -0.781 102.272 -0.234 QT
102.335 0.109 102.335 0.984 QT
102.335 2.734 L
102.335 4.578 102.421 5.063 QT
102.507 5.547 102.757 6 QT
101.382 6 L
101.179 5.594 101.116 5.047 QT
cp
101.007 2.094 M
100.288 2.391 98.851 2.594 QT
98.038 2.719 97.702 2.859 QT
97.366 3 97.187 3.281 QT
97.007 3.563 97.007 3.906 QT
97.007 4.438 97.405 4.789 QT
97.804 5.141 98.569 5.141 QT
99.335 5.141 99.929 4.805 QT
100.522 4.469 100.804 3.891 QT
101.007 3.453 101.007 2.578 QT
101.007 2.094 L
cp
f
GR
GS
[0.6 0 0 0.6 0 0] CT
0.851 0.325 0.098 RC
1 LJ
3.333 LW
N
463.007 140.397 M
513.078 140.397 L
S
GR
GS
[0.6 0 0 0.6 0 0] CT
0.149 GC
10.0 ML
0.833 LW
N
458 153 M
458 107 L
634 107 L
634 153 L
cp
S
GR
%%Trailer
%%Pages: 1
%%EOF
