Index,X value,Y value,Evt.status
0,75394.2,0.0,
1,75394.25,0.05313282,
2,75394.3,0.1531681,
3,75394.34,0.2334567,
4,75394.41,0.3167509,
5,75394.47,0.402005,
6,75394.52,0.4652686,
7,75394.57,0.5240555,
8,75394.64,0.5824091,
9,75394.69,0.6268548,
10,75394.75,0.6925295,
11,75394.81,0.7465702,
12,75394.86,0.7675888,
13,75394.92,0.8219463,
14,75394.99,0.874388,
15,75395.06,0.8959343,
16,75395.13,0.9443545,
17,75395.2,0.9853787,
18,75395.28,1.007721,
19,75395.34,1.029997,
20,75395.42,1.075925,
21,75395.48,1.099052,
22,75395.58,1.146974,
23,75395.64,1.170504,
24,75395.7,1.194237,
25,75395.75,1.218269,
26,75395.8,1.241842,
27,75395.86,1.26624,
28,75395.92,1.289066,
29,75395.98,1.312807,
30,75396.05,1.336123,
31,75396.11,1.35977,
32,75396.17,1.382905,
33,75396.23,1.406381,
34,75396.3,1.429279,
35,75396.36,1.452411,
36,75396.44,1.475105,
37,75396.52,1.498237,
38,75396.58,1.520739,
39,75396.66,1.543712,
40,75396.75,1.56643,
41,75396.83,1.589713,
42,75396.91,1.612435,
43,75397.04,1.636144,
44,75397.19,1.681149,
45,75397.24,1.703712,
46,75397.34,1.726482,
47,75397.48,1.771527,
48,75397.53,1.793579,
49,75397.62,1.815812,
50,75397.73,1.838199,
51,75397.89,1.882248,
52,75397.97,1.904536,
53,75398.07,1.926929,
54,75398.13,1.948936,
55,75398.25,1.971306,
56,75398.31,1.993575,
57,75398.42,2.015748,
58,75398.52,2.037774,
59,75398.6,2.059833,
60,75398.69,2.081965,
61,75398.76,2.104027,
62,75398.84,2.125927,
63,75398.94,2.147838,
64,75399.02,2.169721,
65,75399.11,2.191672,
66,75399.2,2.213741,
67,75399.28,2.235721,
68,75399.38,2.257681,
69,75399.48,2.28033,
70,75399.56,2.301778,
71,75399.64,2.323571,
72,75399.75,2.345497,
73,75399.84,2.36764,
74,75399.95,2.390553,
75,75400.03,2.412408,
76,75400.15,2.435146,
77,75400.23,2.458155,
78,75400.34,2.481354,
79,75400.44,2.504926,
80,75400.55,2.528766,
81,75400.66,2.552822,
82,75400.77,2.5771,
83,75400.86,2.601395,
84,75400.97,2.62599,
85,75401.08,2.650902,
86,75401.18,2.676063,
87,75401.29,2.701507,
88,75401.39,2.727128,
89,75401.5,2.752887,
90,75401.62,2.778925,
91,75401.74,2.808484,
92,75401.85,2.838804,
93,75401.95,2.863943,
94,75402.03,3.370212,
95,75402.17,3.393204,
96,75402.31,3.417377,
97,75402.45,3.44231,
98,75402.59,3.467674,
99,75402.73,3.494019,
100,75402.88,3.521557,
101,75403.02,3.550483,
102,75403.16,3.579367,
103,75403.3,3.608267,
104,75403.45,3.637249,
105,75403.61,3.666125,
106,75403.76,3.694962,
107,75403.9,3.723681,
108,75404.05,3.752425,
109,75404.22,3.7812,
110,75404.36,3.80984,
111,75404.51,3.838492,
112,75404.66,3.867187,
113,75404.82,3.895924,
114,75404.98,3.924739,
115,75405.14,3.953398,
116,75405.29,3.981969,
117,75405.46,4.010629,
118,75405.61,4.039118,
119,75405.77,4.067607,
120,75405.95,4.096841,
121,75406.09,4.124612,
122,75406.27,4.153119,
123,75406.44,4.181569,
124,75406.61,4.210137,
125,75406.78,4.238586,
126,75406.95,4.267099,
127,75407.12,4.295536,
128,75407.3,4.323973,
129,75407.47,4.352339,
130,75407.64,4.380681,
131,75407.82,4.408978,
132,75407.98,4.437234,
133,75408.16,4.465367,
134,75408.34,4.494181,
135,75408.52,4.5217,
136,75408.7,4.549934,
137,75408.88,4.578128,
138,75409.07,4.606358,
139,75409.25,4.634636,
140,75409.44,4.662749,
141,75409.62,4.690838,
142,75409.81,4.719775,
143,75410.02,4.747348,
144,75410.18,4.775479,
145,75410.38,4.803634,
146,75410.57,4.831928,
147,75410.77,4.86014,
148,75410.98,4.888397,
149,75411.14,4.944693,
150,75411.33,4.972697,
151,75411.53,5.00071,
152,75411.73,5.0286,
153,75411.93,5.056422,
154,75412.13,5.084426,
155,75412.33,5.112386,
156,75412.55,5.140418,
157,75412.76,5.16847,
158,75412.97,5.19645,
159,75413.16,5.224253,
160,75413.37,5.252067,
161,75413.57,5.279825,
162,75413.8,5.307779,
163,75414.0,5.33562,
164,75414.22,5.363561,
165,75414.45,5.391498,
166,75414.66,5.41937,
167,75414.88,5.447291,
168,75415.09,5.475177,
169,75415.32,5.503133,
170,75415.55,5.531,
171,75415.77,5.558864,
172,75415.98,5.586662,
173,75416.21,5.614702,
174,75416.44,5.642543,
175,75416.66,5.670418,
176,75416.89,5.698421,
177,75417.11,5.72632,
178,75417.33,5.754769,
179,75417.56,5.781799,
180,75417.79,5.809608,
181,75418.02,5.837286,
182,75418.27,5.865095,
183,75418.51,5.892868,
184,75418.73,5.920594,
185,75418.96,5.94833,
186,75419.22,5.976136,
187,75419.45,6.004635,
188,75419.7,6.031887,
189,75419.94,6.059819,
190,75420.19,6.087761,
191,75420.45,6.115829,
192,75420.66,6.143677,
193,75420.91,6.171584,
194,75421.16,6.199604,
195,75421.42,6.227701,
196,75421.66,6.255751,
197,75421.91,6.283762,
198,75422.17,6.311821,
199,75422.44,6.339966,
200,75422.69,6.368012,
201,75422.94,6.395945,
202,75423.18,6.423758,
203,75423.44,6.452183,
204,75423.7,6.479311,
205,75423.97,6.507125,
206,75424.23,6.535006,
207,75424.5,6.562875,
208,75424.75,6.590637,
209,75425.03,6.618547,
210,75425.3,6.646464,
211,75425.55,6.6743,
212,75425.84,6.702281,
213,75426.09,6.730235,
214,75426.36,6.758243,
215,75427.48,6.78625,
216,75427.76,6.814309,
217,75428.0,6.842204,
218,75428.28,6.87075,
219,75428.56,6.897891,
220,75428.84,6.925804,
221,75429.13,6.953847,
222,75429.41,6.981795,
223,75429.7,7.009784,
224,75429.98,7.037785,
225,75430.25,7.065852,
226,75430.53,7.093999,
227,75430.84,7.122192,
228,75431.13,7.151176,
229,75431.39,7.178797,
230,75431.69,7.207135,
231,75431.98,7.235187,
232,75432.27,7.263225,
233,75432.54,7.291939,
234,75432.84,7.319182,
235,75433.16,7.347128,
236,75433.45,7.375134,
237,75433.73,7.403152,
238,75434.03,7.431815,
239,75434.33,7.458998,
240,75434.64,7.487005,
241,75434.93,7.514895,
242,75435.26,7.542741,
243,75435.55,7.570574,
244,75435.84,7.598446,
245,75436.13,7.626986,
246,75436.45,7.654173,
247,75436.77,7.682275,
248,75437.06,7.710176,
249,75437.38,7.737949,
250,75437.69,7.765658,
251,75437.98,7.793467,
252,75438.3,7.821473,
253,75438.61,7.849426,
254,75438.92,7.877362,
255,75439.23,7.905359,
256,75439.56,7.933051,
257,75439.89,7.961036,
258,75440.05,8.071205,
259,75440.36,8.098634,
260,75440.7,8.126852,
261,75441.03,8.153766,
262,75441.38,8.181429,
263,75441.69,8.209164,
264,75442.03,8.236992,
265,75442.36,8.264766,
266,75442.67,8.292373,
267,75443.02,8.320189,
268,75443.34,8.348094,
269,75443.67,8.375932,
270,75444.02,8.40363,
271,75444.35,8.431503,
272,75444.67,8.459253,
273,75445.02,8.48713,
274,75445.37,8.515038,
275,75445.72,8.543111,
276,75446.03,8.570985,
277,75446.38,8.598871,
278,75446.72,8.626788,
279,75447.07,8.654792,
280,75447.42,8.683496,
281,75447.77,8.710544,
282,75448.12,8.738134,
283,75448.46,8.765566,
284,75448.81,8.793098,
285,75449.19,8.820728,
286,75449.55,8.848313,
287,75449.88,8.875845,
288,75450.24,8.903761,
289,75450.59,8.931548,
290,75450.94,8.959838,
291,75451.32,8.986769,
292,75451.68,9.014442,
293,75452.03,9.042177,
294,75452.38,9.070684,
295,75452.75,9.098027,
296,75453.13,9.125977,
297,75453.48,9.153958,
298,75453.85,9.181765,
299,75454.23,9.20989,
300,75454.58,9.237451,
301,75454.95,9.265163,
302,75455.3,9.292763,
303,75455.69,9.320539,
304,75456.06,9.348289,
305,75456.45,9.376771,
306,75456.84,9.406885,
307,75457.22,9.431971,
308,75457.6,9.459894,
309,75457.95,9.487733,
310,75458.34,9.518649,
311,75458.75,9.543516,
312,75459.1,9.571208,
313,75459.48,9.598871,
314,75459.88,9.626629,
315,75460.27,9.654419,
316,75460.64,9.682262,
317,75461.05,9.710164,
318,75461.42,9.738008,
319,75461.81,9.765722,
320,75462.23,9.793468,
321,75462.59,9.820963,
322,75463.01,9.848526,
323,75463.38,9.875895,
324,75463.78,9.903277,
325,75464.19,9.930574,
326,75464.58,9.957892,
327,75464.98,9.985299,
328,75465.38,10.01242,
329,75465.78,10.03964,
330,75466.2,10.06701,
331,75466.59,10.09452,
332,75467.0,10.12191,
333,75467.41,10.14954,
334,75467.8,10.1768,
335,75468.22,10.20403,
336,75468.63,10.23121,
337,75469.05,10.25859,
338,75469.45,10.28609,
339,75469.85,10.31327,
340,75470.27,10.34061,
341,75470.69,10.36796,
342,75471.08,10.39548,
343,75471.5,10.42314,
344,75471.92,10.45087,
345,75472.34,10.4786,
346,75472.77,10.50624,
347,75473.19,10.5339,
348,75473.62,10.56166,
349,75474.05,10.58942,
350,75474.45,10.6177,
351,75474.88,10.64461,
352,75475.32,10.67223,
353,75475.75,10.7,
354,75476.19,10.72783,
355,75476.63,10.75637,
356,75477.03,10.78343,
357,75477.47,10.8113,
358,75477.91,10.83929,
359,75478.33,10.8672,
360,75478.77,10.89495,
361,75479.19,10.92264,
362,75479.64,10.95036,
363,75480.08,10.97818,
364,75480.52,11.00602,
365,75480.98,11.03695,
366,75481.41,11.06192,
367,75481.85,11.09255,
368,75482.3,11.11707,
369,75482.76,11.14439,
370,75483.19,11.17152,
371,75483.64,11.19844,
372,75484.11,11.22563,
373,75484.55,11.25291,
374,75485.02,11.28036,
375,75485.42,11.30796,
376,75485.88,11.33515,
377,75486.35,11.36257,
378,75486.78,11.38993,
379,75487.27,11.41774,
380,75487.72,11.44575,
381,75488.17,11.47385,
382,75489.18,11.50238,
383,75489.63,11.52991,
384,75490.1,11.55793,
385,75490.53,11.58636,
386,75491.0,11.61339,
387,75491.48,11.6414,
388,75491.92,11.66917,
389,75492.41,11.69703,
390,75492.88,11.72493,
391,75493.34,11.75264,
392,75493.84,11.78035,
393,75494.27,11.808,
394,75494.74,11.83579,
395,75495.23,11.86386,
396,75495.72,11.89207,
397,75496.2,11.92006,
398,75496.67,11.94805,
399,75497.16,11.9759,
400,75497.64,12.00375,
401,75498.13,12.03165,
402,75498.63,12.05957,
403,75499.11,12.08716,
404,75499.56,12.11446,
405,75500.09,12.14195,
406,75500.52,12.16912,
407,75501.04,12.19702,
408,75501.55,12.22371,
409,75502.02,12.25104,
410,75502.48,12.27888,
411,75503.0,12.3055,
412,75503.97,12.33269,
413,75504.45,12.35948,
414,75504.97,12.38654,
415,75505.45,12.4135,
416,75505.94,12.44052,
417,75506.44,12.47038,
418,75506.92,12.49426,
419,75507.42,12.52083,
420,75507.93,12.54718,
421,75508.47,12.57665,
422,75508.96,12.60019,
423,75509.45,12.6264,
424,75509.94,12.65264,
425,75510.45,12.67958,
426,75510.99,12.70552,
427,75511.48,12.73259,
428,75511.98,12.75857,
429,75512.5,12.78511,
430,75513.02,12.8146,
431,75513.52,12.8383,
432,75514.05,12.86515,
433,75514.58,12.89172,
434,75515.07,12.91807,
435,75515.43,12.97147,
436,75515.95,13.00069,
437,75516.48,13.02425,
438,75516.97,13.05084,
439,75517.53,13.08049,
440,75518.02,13.10436,
441,75518.55,13.13117,
442,75519.08,13.15796,
443,75519.63,13.18482,
444,75520.15,13.21267,
445,75520.69,13.23948,
446,75521.2,13.2699,
447,75521.7,13.29431,
448,75522.27,13.32157,
449,75522.81,13.34883,
450,75523.31,13.37562,
451,75523.88,13.40192,
452,75524.39,13.42792,
453,75524.94,13.45362,
454,75525.77,13.47949,
455,75526.3,13.50574,
456,75526.81,13.53477,
457,75527.37,13.5585,
458,75527.91,13.58519,
459,75528.44,13.61184,
460,75529.0,13.6423,
461,75529.56,13.66705,
462,75530.13,13.69433,
463,75530.65,13.72114,
464,75531.22,13.74847,
465,75531.76,13.7749,
466,75532.3,13.80147,
467,75532.86,13.82785,
468,75533.42,13.85326,
469,75533.98,13.87922,
470,75534.55,13.90548,
471,75535.11,13.93235,
472,75535.67,13.95873,
473,75536.24,13.985,
474,75536.76,14.0111,
475,75537.3,14.0368,
476,75537.88,14.06379,
477,75538.44,14.09217,
478,75539.02,14.11599,
479,75539.57,14.14314,
480,75540.16,14.16902,
481,75541.42,14.19527,
482,75541.99,14.22168,
483,75542.58,14.24846,
484,75543.14,14.27548,
485,75543.72,14.30273,
486,75544.28,14.33004,
487,75544.86,14.35721,
488,75545.45,14.38416,
489,75546.02,14.41149,
490,75546.58,14.43867,
491,75547.16,14.46574,
492,75547.75,14.49295,
493,75548.34,14.52,
494,75548.91,14.54739,
495,75549.53,14.57474,
496,75550.11,14.60152,
497,75550.66,14.62846,
498,75551.25,14.65509,
499,75551.83,14.68191,
500,75552.42,14.70894,
501,75553.02,14.73568,
502,75553.63,14.76242,
503,75554.2,14.78941,
504,75554.83,14.81643,
505,75555.39,14.84658,
506,75556.0,14.87079,
507,75556.58,14.90087,
508,75557.2,14.92514,
509,75557.74,14.95515,
510,75558.37,14.97889,
511,75558.97,15.00521,
512,75559.58,15.03146,
513,75560.17,15.05852,
514,75560.8,15.08428,
515,75561.39,15.11109,
516,75561.66,15.13765,
517,75562.24,15.16398,
518,75562.83,15.18963,
519,75563.45,15.21571,
520,75564.09,15.24184,
521,75564.69,15.26768,
522,75565.28,15.29411,
523,75565.91,15.32047,
524,75566.54,15.34685,
525,75567.13,15.37301,
526,75567.73,15.39921,
527,75568.39,15.42585,
528,75569.0,15.45266,
529,75569.63,15.48215,
530,75570.25,15.5055,
531,75570.84,15.53173,
532,75571.44,15.55843,
533,75572.06,15.58404,
534,75572.69,15.61331,
535,75573.31,15.63678,
536,75573.97,15.66383,
537,75574.58,15.68962,
538,75575.2,15.71602,
539,75575.83,15.74235,
540,75576.45,15.76886,
541,75577.13,15.79548,
542,75577.74,15.82202,
543,75578.38,15.84857,
544,75579.01,15.87543,
545,75579.67,15.9025,
546,75580.59,15.92916,
547,75581.2,15.95581,
548,75581.88,15.98257,
549,75582.53,16.01232,
550,75583.16,16.0362,
551,75583.79,16.06253,
552,75584.42,16.08886,
553,75585.05,16.11521,
554,75585.72,16.14162,
555,75586.36,16.16829,
556,75587.0,16.19519,
557,75587.67,16.22077,
558,75588.3,16.24722,
559,75588.98,16.27396,
560,75589.61,16.30129,
561,75590.29,16.32701,
562,75590.94,16.35384,
563,75591.62,16.38009,
564,75592.25,16.40651,
565,75592.94,16.43295,
566,75593.57,16.45912,
567,75594.22,16.48534,
568,75594.85,16.51126,
569,75595.53,16.53705,
570,75596.17,16.56323,
571,75596.86,16.58971,
572,75597.54,16.61619,
573,75598.17,16.64227,
574,75598.88,16.6683,
575,75599.5,16.69505,
576,75600.21,16.72079,
577,75600.9,16.7499,
578,75601.55,16.77361,
579,75602.23,16.79923,
580,75602.92,16.82842,
581,75603.57,16.85213,
582,75604.27,16.88145,
583,75604.93,16.90501,
584,75605.63,16.93146,
585,75606.28,16.96124,
586,75606.98,16.98416,
587,75607.63,17.01034,
588,75608.34,17.03704,
589,75609.03,17.06359,
590,75609.73,17.08994,
591,75610.35,17.11632,
592,75611.03,17.14326,
593,75611.73,17.16972,
594,75612.41,17.19604,
595,75613.12,17.22242,
596,75613.81,17.24944,
597,75614.5,17.27677,
598,75615.2,17.30371,
599,75615.91,17.33119,
600,75616.57,17.35763,
601,75617.6,17.38467,
602,75618.3,17.41158,
603,75619.0,17.43869,
604,75619.7,17.46603,
605,75620.41,17.49311,
606,75621.11,17.51974,
607,75621.82,17.54652,
608,75622.53,17.57368,
609,75623.21,17.60076,
610,75623.91,17.6274,
611,75624.63,17.65429,
612,75625.33,17.68082,
613,75626.02,17.70761,
614,75626.72,17.73434,
615,75627.43,17.7609,
616,75628.16,17.7878,
617,75628.86,17.81428,
618,75629.58,17.8408,
619,75630.29,17.86773,
620,75631.03,17.89449,
621,75631.75,17.92129,
622,75632.47,17.94773,
623,75633.19,17.97443,
624,75633.88,18.00163,
625,75634.56,18.02827,
626,75635.3,18.05527,
627,75636.03,18.08213,
628,75636.77,18.10898,
629,75637.51,18.13596,
630,75638.23,18.16098,
631,75638.94,18.18771,
632,75639.67,18.21533,
633,75640.41,18.24217,
634,75641.13,18.26936,
635,75641.86,18.29636,
636,75642.61,18.32434,
637,75643.34,18.35067,
638,75644.09,18.37805,
639,75644.83,18.40849,
640,75645.53,18.43263,
641,75646.27,18.46267,
642,75646.98,18.48671,
643,75647.73,18.51409,
644,75648.48,18.54407,
645,75649.25,18.56812,
646,75649.95,18.598,
647,75650.7,18.62191,
648,75651.46,18.64864,
649,75652.88,18.67516,
650,75653.63,18.70171,
651,75654.39,18.72878,
652,75655.16,18.75583,
653,75655.88,18.78295,
654,75656.58,18.81058,
655,75657.35,18.83784,
656,75658.13,18.86507,
657,75658.9,18.89552,
658,75659.66,18.9197,
659,75660.44,18.94645,
660,75661.17,18.97298,
661,75661.89,18.99975,
662,75662.66,19.02698,
663,75663.42,19.05363,
664,75664.01,19.10694,
665,75664.77,19.13385,
666,75665.53,19.16008,
667,75666.31,19.18686,
668,75667.09,19.21409,
669,75667.88,19.24114,
670,75668.64,19.26755,
671,75669.4,19.29461,
672,75670.14,19.32115,
673,75670.94,19.34775,
674,75671.72,19.3742,
675,75672.48,19.40211,
676,75673.28,19.42804,
677,75674.06,19.45467,
678,75674.81,19.4813,
679,75675.62,19.50839,
680,75676.38,19.53526,
681,75677.16,19.56204,
682,75677.95,19.58889,
683,75678.69,19.61531,
684,75679.47,19.64173,
685,75680.27,19.66817,
686,75681.06,19.69498,
687,75681.85,19.7216,
688,75682.66,19.74852,
689,75683.43,19.77544,
690,75684.27,19.80194,
691,75685.02,19.82837,
692,75685.86,19.8551,
693,75686.59,19.88228,
694,75687.42,19.90884,
695,75688.19,19.93534,
696,75689.0,19.96199,
697,75689.82,19.98868,
698,75690.61,20.01821,
699,75691.4,20.04196,
700,75692.25,20.06929,
701,75693.03,20.09494,
702,75693.82,20.12146,
703,75694.61,20.14845,
704,75695.45,20.17553,
705,75696.91,20.20234,
706,75697.7,20.22974,
707,75698.54,20.25723,
708,75699.38,20.28469,
709,75700.16,20.31157,
710,75700.95,20.33883,
711,75701.79,20.36604,
712,75702.63,20.3925,
713,75703.42,20.41957,
714,75704.26,20.44503,
715,75705.05,20.47096,
716,75705.89,20.49709,
717,75706.67,20.52324,
718,75707.52,20.54955,
719,75708.36,20.57859,
720,75709.14,20.60777,
721,75709.98,20.63052,
722,75710.83,20.65365,
723,75711.66,20.67977,
724,75712.45,20.70916,
725,75713.48,20.7317,
726,75714.32,20.75956,
727,75715.16,20.7825,
728,75715.95,20.80743,
729,75716.79,20.83558,
730,75717.64,20.85896,
731,75718.48,20.88486,
732,75719.31,20.91037,
733,75720.16,20.93612,
734,75720.99,20.96164,
735,75721.86,20.98708,
736,75722.7,21.01207,
737,75723.55,21.03702,
738,75724.36,21.06216,
739,75725.2,21.08683,
740,75726.06,21.11207,
741,75726.86,21.1381,
742,75727.73,21.16387,
743,75728.58,21.18933,
744,75729.45,21.215,
745,75730.59,21.24038,
746,75731.45,21.26587,
747,75732.28,21.29128,
748,75733.15,21.31674,
749,75733.95,21.34231,
750,75734.83,21.36779,
751,75735.7,21.39374,
752,75736.52,21.41928,
753,75737.39,21.44508,
754,75738.28,21.47052,
755,75739.13,21.49567,
756,75739.98,21.52079,
757,75740.83,21.54615,
758,75741.71,21.57182,
759,75742.6,21.59769,
760,75743.48,21.62387,
761,75744.27,21.64968,
762,75745.16,21.675,
763,75746.05,21.70078,
764,75746.92,21.72637,
765,75747.81,21.75201,
766,75748.7,21.77786,
767,75749.47,21.80331,
768,75750.09,21.82879,
769,75750.99,21.85393,
770,75751.88,21.87958,
771,75752.7,21.90467,
772,75753.6,21.92975,
773,75754.52,21.95506,
774,75755.37,21.98058,
775,75756.22,22.00537,
776,75757.13,22.0307,
777,75758.05,22.05585,
778,75758.94,22.08085,
779,75759.77,22.10563,
780,75760.64,22.13083,
781,75761.57,22.15544,
782,75762.45,22.17992,
783,75763.37,22.20342,
784,75764.16,22.22659,
785,75765.08,22.24973,
786,75765.98,22.27267,
787,75766.89,22.29474,
788,75767.8,22.31704,
789,75768.64,22.3389,
790,75770.0,22.36073,
791,75770.88,22.38214,
792,75771.76,22.40254,
793,75772.7,22.42278,
794,75773.58,22.4459,
795,75774.46,22.46812,
796,75775.33,22.48917,
797,75776.25,22.50803,
798,75777.16,22.52522,
799,75778.02,22.53956,
800,75778.92,22.5473,
801,75779.88,22.55405,
802,75780.75,22.55955,
803,75781.59,22.57043,
804,75782.53,22.57598,
805,75783.41,22.58304,
806,75784.3,22.59008,
807,75785.25,22.59464,
808,75786.13,22.60637,
809,75787.02,22.61316,
810,75787.95,22.62025,
811,75788.83,22.6257,
812,75789.78,22.63056,
813,75790.52,22.64068,
814,75791.33,22.64472,
815,75792.27,22.64998,
816,75793.16,22.65521,
817,75794.11,22.65936,
818,75794.99,22.66224,
819,75795.88,22.66245,
820,75796.84,22.66465,
821,75797.73,22.66773,
822,75798.56,22.6704,
823,75799.51,22.67235,
824,75800.41,22.67474,
825,75801.32,22.67489,
826,75802.27,22.67392,
827,75803.12,22.67323,
828,75804.55,22.67139,
829,75805.42,22.67076,
830,75806.38,22.6697,
831,75807.26,22.66894,
832,75808.14,22.66683,
833,75809.1,22.66635,
834,75809.98,22.6636,
835,75810.93,22.66076,
836,75811.81,22.65892,
837,75812.69,22.65729,
838,75813.63,22.65522,
839,75814.47,22.65193,
840,75815.3,22.64924,
841,75816.28,22.64659,
842,75817.13,22.64652,
843,75818.06,22.64654,
844,75818.95,22.6448,
845,75819.91,22.64419,
846,75820.76,22.64176,
847,75821.64,22.63845,
848,75822.59,22.63489,
849,75823.47,22.62883,
850,75824.36,22.62524,
851,75825.31,22.62493,
852,75826.2,22.6229,
853,75827.04,22.62117,
854,75828.0,22.61853,
855,75828.97,22.61619,
856,75829.8,22.61664,
857,75830.69,22.61752,
858,75831.63,22.61831,
859,75832.54,22.61696,
860,75833.45,22.61471,
861,75834.31,22.61377,
862,75835.23,22.61131,
863,75836.13,22.60905,
864,75837.05,22.60712,
865,75837.96,22.60306,
866,75838.84,22.59832,
867,75839.77,22.59469,
868,75841.3,22.59056,
869,75842.25,22.58676,
870,75843.13,22.58344,
871,75844.02,22.58016,
872,75844.91,22.57678,
873,75845.77,22.57452,
874,75846.69,22.57195,
875,75847.63,22.56889,
876,75848.51,22.56634,
877,75849.39,22.56382,
878,75850.29,22.5607,
879,75851.17,22.55798,
880,75852.13,22.55476,
881,75852.98,22.55157,
882,75853.97,22.54864,
883,75854.81,22.54488,
884,75855.7,22.5418,
885,75856.63,22.53919,
886,75857.51,22.53694,
887,75858.45,22.53432,
888,75859.34,22.53191,
889,75860.23,22.52965,
890,75861.17,22.52783,
891,75861.97,22.52555,
892,75862.92,22.52372,
893,75863.81,22.52199,
894,75864.72,22.51969,
895,75865.66,22.51739,
896,75866.55,22.51537,
897,75867.47,22.51313,
898,75868.03,22.51119,
899,75868.84,22.50927,
900,75869.76,22.50683,
901,75870.67,22.50492,
902,75871.56,22.50276,
903,75872.51,22.50087,
904,75873.39,22.49848,
905,75874.31,22.49641,
906,75875.19,22.49379,
907,75876.1,22.49168,
908,75877.02,22.48931,
909,75877.91,22.48722,
910,75879.57,22.48463,
911,75880.5,22.48285,
912,75881.35,22.48103,
913,75882.27,22.4792,
914,75883.13,22.47735,
915,75884.05,22.47546,
916,75884.95,22.47356,
917,75885.84,22.47247,
918,75886.73,22.47069,
919,75887.66,22.469,
920,75888.54,22.4674,
921,75889.45,22.46608,
922,75890.36,22.4646,
923,75891.27,22.46289,
924,75892.17,22.46152,
925,75893.05,22.46016,
926,75893.94,22.45893,
927,75894.83,22.45756,
928,75895.69,22.4562,
929,75896.63,22.4549,
930,75897.53,22.45317,
931,75898.43,22.45187,
932,75899.34,22.45107,
933,75900.14,22.4496,
934,75901.13,22.44843,
935,75901.93,22.44761,
936,75902.82,22.44643,
937,75903.74,22.44489,
938,75904.66,22.44361,
939,75905.54,22.44234,
940,75906.41,22.44099,
941,75907.33,22.4397,
942,75908.23,22.43825,
943,75909.11,22.43695,
944,75910.0,22.43571,
945,75910.89,22.43467,
946,75911.78,22.43349,
947,75912.69,22.43279,
948,75913.61,22.43233,
949,75914.45,22.43135,
950,75916.18,22.43043,
951,75917.02,22.42888,
952,75917.9,22.42768,
953,75918.84,22.42702,
954,75919.73,22.42625,
955,75920.62,22.4256,
956,75921.56,22.42482,
957,75922.41,22.42421,
958,75923.34,22.42251,
959,75924.24,22.42118,
960,75925.14,22.42027,
961,75926.05,22.41949,
962,75926.91,22.41887,
963,75927.75,22.41816,
964,75928.67,22.41752,
965,75929.54,22.41572,
966,75930.47,22.4152,
967,75931.39,22.41495,
968,75932.3,22.41413,
969,75933.2,22.41302,
970,75934.0,22.41147,
971,75934.91,22.41008,
972,75935.81,22.40915,
973,75936.72,22.40704,
974,75937.64,22.40598,
975,75938.52,22.40451,
976,75939.46,22.40349,
977,75940.34,22.40265,
978,75941.23,22.40158,
979,75942.11,22.39993,
980,75942.98,22.39909,
981,75943.86,22.39825,
982,75944.8,22.39677,
983,75945.7,22.39618,
984,75946.61,22.39556,
985,75947.45,22.39437,
986,75948.36,22.39347,
987,75949.3,22.39278,
988,75950.13,22.39129,
989,75951.12,22.38993,
990,75951.97,22.38929,
991,75952.83,22.38857,
992,75953.81,22.3874,
993,75954.66,22.38677,
994,75955.49,22.38623,
995,75956.44,22.38573,
996,75957.33,22.38519,
997,75958.71,22.38475,
998,75959.59,22.38387,
999,75960.53,22.38363,
1000,75961.41,22.3832,
1001,75962.3,22.38227,
1002,75963.19,22.38169,
1003,75964.1,22.38242,
1004,75964.96,22.38159,
1005,75965.87,22.38102,
1006,75966.73,22.38098,
1007,75967.66,22.38084,
1008,75968.56,22.38119,
1009,75969.49,22.38143,
1010,75970.35,22.38125,
1011,75971.26,22.38152,
1012,75972.13,22.38169,
1013,75973.04,22.38173,
1014,75973.89,22.38121,
1015,75974.49,22.38105,
1016,75975.36,22.38082,
1017,75976.24,22.38063,
1018,75977.13,22.38036,
1019,75978.08,22.38017,
1020,75978.91,22.37996,
1021,75979.84,22.37974,
1022,75980.73,22.38006,
1023,75981.61,22.37988,
1024,75982.53,22.38017,
1025,75983.45,22.37988,
1026,75984.3,22.37963,
1027,75985.23,22.37978,
1028,75986.13,22.38002,
1029,75987.0,22.37948,
1030,75987.92,22.37947,
1031,75988.84,22.37979,
1032,75991.02,22.37921,
1033,75991.93,22.3787,
1034,75992.83,22.37819,
1035,75993.7,22.37766,
1036,75994.63,22.37679,
1037,75995.49,22.37682,
1038,75996.4,22.37671,
1039,75997.25,22.37687,
1040,75998.19,22.37646,
1041,75999.09,22.37618,
1042,75999.97,22.37577,
1043,76000.85,22.37563,
1044,76001.78,22.37521,
1045,76002.66,22.37477,
1046,76003.55,22.37451,
1047,76004.49,22.37437,
1048,76005.33,22.37401,
1049,76006.22,22.37385,
1050,76007.14,22.37402,
1051,76008.03,22.37342,
1052,76008.98,22.373,
1053,76009.87,22.37248,
1054,76010.75,22.37168,
1055,76011.64,22.37169,
1056,76012.51,22.3717,
1057,76013.41,22.3709,
1058,76014.28,22.3707,
1059,76015.23,22.37122,
1060,76016.09,22.37051,
1061,76016.98,22.36983,
1062,76017.92,22.36948,
1063,76018.81,22.36934,
1064,76019.67,22.36907,
1065,76020.58,22.3693,
1066,76021.45,22.36911,
1067,76022.03,22.36922,
1068,76022.97,22.36949,
1069,76023.86,22.36989,
1070,76024.74,22.36979,
1071,76025.63,22.37003,
1072,76026.56,22.36997,
1073,76027.39,22.37002,
1074,76028.34,22.3698,
1075,76029.22,22.36864,
1076,76030.13,22.36797,
1077,76030.98,22.36677,
1078,76031.92,22.3669,
1079,76032.8,22.36718,
1080,76033.73,22.36733,
1081,76034.59,22.36751,
1082,76035.42,22.36677,
1083,76036.27,22.36657,
1084,76037.17,22.36653,
1085,76038.09,22.36633,
1086,76038.96,22.36594,
1087,76039.88,22.36629,
1088,76040.8,22.36642,
1089,76041.7,22.36606,
1090,76042.55,22.36587,
1091,76043.48,22.3658,
1092,76044.34,22.36522,
1093,76045.2,22.36529,
1094,76046.14,22.36566,
1095,76047.03,22.36578,
1096,76047.95,22.36605,
1097,76048.86,22.36606,
1098,76049.73,22.36551,
1099,76051.2,22.36497,
1100,76052.13,22.3646,
1101,76053.02,22.36384,
1102,76053.91,22.36359,
1103,76054.78,22.36336,
1104,76055.66,22.36279,
1105,76056.62,22.3623,
1106,76057.5,22.3624,
1107,76058.39,22.3619,
1108,76059.27,22.36139,
1109,76060.15,22.36115,
1110,76061.06,22.361,
1111,76061.97,22.36065,
1112,76062.88,22.36065,
1113,76063.78,22.36014,
1114,76065.61,22.36048,
1115,76066.48,22.36085,
1116,76067.36,22.36039,
1117,76068.27,22.35989,
1118,76069.17,22.36013,
1119,76070.09,22.3599,
1120,76070.98,22.35954,
1121,76071.89,22.35921,
1122,76072.75,22.35947,
1123,76073.63,22.35909,
1124,76074.52,22.35875,
1125,76075.42,22.35812,
1126,76076.33,22.35727,
1127,76076.88,22.35656,
1128,76077.72,22.35599,
1129,76078.63,22.35565,
1130,76079.53,22.35571,
1131,76080.44,22.35527,
1132,76081.34,22.35494,
1133,76082.25,22.35518,
1134,76083.15,22.35498,
1135,76084.05,22.35432,
1136,76084.97,22.3535,
1137,76085.81,22.35345,
1138,76087.34,22.35328,
1139,76088.25,22.35326,
1140,76089.16,22.35347,
1141,76090.06,22.35356,
1142,76090.97,22.35417,
1143,76091.88,22.35382,
1144,76092.78,22.35335,
1145,76093.58,22.35296,
1146,76094.48,22.35249,
1147,76095.39,22.35198,
1148,76096.3,22.3521,
1149,76097.2,22.35276,
1150,76098.11,22.35252,
1151,76099.02,22.35258,
1152,76099.92,22.35257,
1153,76100.72,22.35228,
1154,76101.63,22.35174,
1155,76102.53,22.35184,
1156,76103.45,22.35147,
1157,76104.35,22.35138,
1158,76105.48,22.35123,
1159,76106.39,22.35073,
1160,76107.19,22.35019,
1161,76108.09,22.3499,
1162,76109.0,22.34928,
1163,76109.95,22.34887,
1164,76110.81,22.34835,
1165,76111.7,22.34805,
1166,76112.64,22.34784,
1167,76113.54,22.34752,
1168,76114.41,22.34654,
1169,76115.28,22.34657,
1170,76116.17,22.34667,
1171,76117.05,22.34684,
1172,76117.94,22.34639,
1173,76118.88,22.34621,
1174,76119.75,22.34588,
1175,76120.64,22.34543,
1176,76121.55,22.34509,
1177,76122.45,22.34524,
1178,76123.3,22.34527,
1179,76124.2,22.34498,
1180,76125.14,22.34496,
1181,76125.98,22.34466,
1182,76126.92,22.34421,
1183,76127.84,22.34409,
1184,76128.1,22.34318,
1185,76128.97,22.34229,
1186,76129.95,22.34142,
1187,76130.76,22.34071,
1188,76131.64,22.34038,
1189,76132.58,22.34049,
1190,76133.48,22.33957,
1191,76134.36,22.33917,
1192,76135.25,22.33851,
1193,76136.19,22.33793,
1194,76137.06,22.33759,
1195,76137.9,22.33765,
1196,76139.06,22.33769,
1197,76139.72,22.33746,
1198,76140.61,22.33779,
1199,76141.54,22.33776,
1200,76142.41,22.33707,
1201,76143.3,22.33626,
1202,76144.17,22.33566,
1203,76145.91,22.33505,
1204,76146.76,22.33465,
1205,76147.71,22.33459,
1206,76148.59,22.33453,
1207,76149.47,22.33429,
1208,76150.34,22.33422,
1209,76151.28,22.3343,
1210,76152.14,22.33406,
1211,76152.99,22.334,
1212,76153.97,22.3337,
1213,76154.84,22.33319,
1214,76155.69,22.33294,
1215,76156.61,22.33228,
1216,76157.53,22.33164,
1217,76158.41,22.33108,
1218,76159.27,22.33058,
1219,76160.21,22.32948,
1220,76161.1,22.32866,
1221,76161.97,22.3284,
1222,76162.86,22.32816,
1223,76164.02,22.32824,
1224,76164.89,22.32803,
1225,76165.79,22.32789,
1226,76166.69,22.32785,
1227,76167.59,22.3272,
1228,76168.5,22.32702,
1229,76169.36,22.32644,
1230,76170.27,22.32596,
1231,76171.13,22.32536,
1232,76172.03,22.32565,
1233,76172.94,22.32541,
1234,76173.85,22.32519,
1235,76174.77,22.32522,
1236,76175.67,22.32548,
1237,76176.57,22.32483,
1238,76178.26,22.32452,
1239,76179.11,22.32465,
1240,76180.02,22.3247,
1241,76180.92,22.32446,
1242,76181.83,22.32446,
1243,76182.72,22.32406,
1244,76183.61,22.32352,
1245,76184.52,22.32284,
1246,76185.38,22.32236,
1247,76186.22,22.32139,
1248,76187.14,22.32034,
1249,76188.03,22.32029,
1250,76188.93,22.31991,
1251,76189.83,22.31942,
1252,76190.76,22.31935,
1253,76191.66,22.31966,
1254,76192.58,22.31922,
1255,76193.41,22.3177,
1256,76194.3,22.3171,
1257,76195.2,22.31673,
1258,76196.11,22.31601,
1259,76197.02,22.31625,
1260,76197.92,22.31597,
1261,76198.83,22.31531,
1262,76199.61,22.31437,
1263,76200.53,22.3138,
1264,76201.44,22.31334,
1265,76202.33,22.31255,
1266,76203.24,22.31246,
1267,76204.14,22.31228,
1268,76205.05,22.31167,
1269,76205.89,22.31113,
1270,76206.8,22.31079,
1271,76207.7,22.31038,
1272,76208.61,22.30951,
1273,76209.45,22.30918,
1274,76210.36,22.30843,
1275,76211.27,22.30791,
1276,76212.13,22.30809,
1277,76214.85,22.30762,
1278,76215.77,22.30711,
1279,76216.67,22.30705,
1280,76217.47,22.30655,
1281,76218.38,22.30667,
1282,76219.29,22.30643,
1283,76220.19,22.30576,
1284,76221.09,22.30464,
1285,76222.0,22.30358,
1286,76222.86,22.30316,
1287,76223.77,22.30285,
1288,76224.66,22.30287,
1289,76225.57,22.30321,
1290,76226.47,22.3031,
1291,76227.35,22.30276,
1292,76228.2,22.30279,
1293,76229.08,22.30188,
1294,76230.04,22.30138,
1295,76230.86,22.30114,
1296,76231.77,22.30042,
1297,76232.71,22.29971,
1298,76233.58,22.29947,
1299,76234.44,22.29845,
1300,76235.33,22.29758,
1301,76236.25,22.2969,
1302,76237.13,22.29627,
1303,76238.06,22.29521,
1304,76238.94,22.29512,
1305,76239.45,22.29415,
1306,76240.39,22.29366,
1307,76241.27,22.29382,
1308,76242.14,22.29351,
1309,76243.02,22.29305,
1310,76243.92,22.29224,
1311,76244.78,22.2908,
1312,76245.68,22.29015,
1313,76246.63,22.28977,
1314,76247.5,22.28908,
1315,76248.39,22.28868,
1316,76249.21,22.28869,
1317,76250.15,22.28866,
1318,76251.02,22.28876,
1319,76251.89,22.28914,
1320,76252.84,22.28897,
1321,76253.73,22.28904,
1322,76254.6,22.28885,
1323,76255.5,22.28886,
1324,76256.4,22.28848,
1325,76257.31,22.28827,
1326,76258.18,22.28824,
1327,76259.1,22.28791,
1328,76259.99,22.28719,
1329,76260.84,22.2865,
1330,76261.78,22.28576,
1331,76262.85,22.28545,
1332,76263.75,22.28491,
1333,76264.61,22.28407,
1334,76265.52,22.28366,
1335,76266.41,22.28385,
1336,76267.28,22.28333,
1337,76268.17,22.28294,
1338,76269.08,22.28246,
1339,76269.98,22.28175,
1340,76270.86,22.28103,
1341,76271.75,22.28108,
1342,76272.69,22.28105,
1343,76273.59,22.28058,
1344,76274.41,22.28047,
1345,76275.3,22.28019,
1346,76276.22,22.27951,
1347,76277.13,22.27843,
1348,76278.01,22.27695,
1349,76278.89,22.27526,
1350,76279.77,22.27331,
1351,76280.67,22.27099,
1352,76281.57,22.26803,
1353,76282.42,22.2649,
1354,76283.37,22.26123,
1355,76284.23,22.25692,
1356,76285.11,22.25261,
1357,76286.02,22.24797,
1358,76286.91,22.24221,
1359,76287.77,22.23592,
1360,76288.67,22.23072,
1361,76290.82,22.22295,
1362,76291.67,22.21228,
1363,76292.58,22.20184,
1364,76293.43,22.18957,
1365,76294.33,22.175,
1366,76295.2,22.16063,
1367,76296.14,22.14373,
1368,76296.98,22.12244,
1369,76297.83,22.10372,
1370,76298.7,22.08659,
1371,76299.61,22.06797,
1372,76300.52,22.04911,
1373,76301.34,22.03454,
1374,76302.0,21.99353,
1375,76302.91,21.97293,
1376,76303.7,21.9537,
1377,76304.62,21.93451,
1378,76305.53,21.91467,
1379,76306.39,21.89686,
1380,76307.23,21.86708,
1381,76308.13,21.84231,
1382,76309.0,21.81827,
1383,76309.86,21.79381,
1384,76310.74,21.77266,
1385,76312.39,21.75034,
1386,76313.27,21.72889,
1387,76314.11,21.70635,
1388,76314.97,21.68451,
1389,76315.84,21.66076,
1390,76316.67,21.63789,
1391,76317.56,21.61605,
1392,76318.45,21.59729,
1393,76319.27,21.56801,
1394,76320.16,21.54438,
1395,76321.03,21.51869,
1396,76321.88,21.49717,
1397,76322.77,21.47517,
1398,76323.63,21.45207,
1399,76324.45,21.43258,
1400,76325.3,21.40109,
1401,76326.18,21.37699,
1402,76327.0,21.35555,
1403,76327.88,21.32354,
1404,76328.75,21.29759,
1405,76329.57,21.27211,
1406,76330.45,21.25205,
1407,76330.88,21.19785,
1408,76331.7,21.16553,
1409,76332.5,21.14623,
1410,76333.36,21.12402,
1411,76334.24,21.10074,
1412,76335.09,21.06922,
1413,76335.95,21.03792,
1414,76336.75,21.00399,
1415,76337.61,20.97813,
1416,76338.45,20.95834,
1417,76339.3,20.93514,
1418,76340.09,20.89989,
1419,76340.94,20.87875,
1420,76341.79,20.85669,
1421,76342.65,20.83297,
1422,76343.48,20.79991,
1423,76344.27,20.76754,
1424,76345.05,20.73387,
1425,76345.89,20.71133,
1426,76346.73,20.68884,
1427,76347.57,20.65683,
1428,76348.41,20.63483,
1429,76349.25,20.6114,
1430,76350.09,20.58783,
1431,76350.92,20.5639,
1432,76351.69,20.53734,
1433,76352.49,20.50798,
1434,76353.34,20.48483,
1435,76354.16,20.4586,
1436,76355.0,20.43328,
1437,76355.83,20.40508,
1438,76356.61,20.38189,
1439,76357.44,20.35638,
1440,76358.27,20.32862,
1441,76359.1,20.30665,
1442,76359.88,20.27987,
1443,76360.7,20.25888,
1444,76364.67,20.23548,
1445,76365.47,20.21129,
1446,76366.23,20.18781,
1447,76367.06,20.16528,
1448,76367.89,20.14026,
1449,76368.66,20.11984,
1450,76369.48,20.09819,
1451,76370.3,20.07633,
1452,76371.13,20.05094,
1453,76371.91,20.03007,
1454,76372.72,20.00602,
1455,76373.5,19.98186,
1456,76374.32,19.95844,
1457,76375.14,19.9333,
1458,76375.85,19.90888,
1459,76376.68,19.88977,
1460,76377.5,19.87041,
1461,76378.27,19.84886,
1462,76379.03,19.78131,
1463,76379.81,19.7631,
1464,76380.6,19.74244,
1465,76381.38,19.72039,
1466,76382.16,19.70287,
1467,76382.99,19.67965,
1468,76383.75,19.66051,
1469,76384.56,19.63952,
1470,76385.34,19.61891,
1471,76386.09,19.59587,
1472,76386.88,19.57665,
1473,76387.63,19.55322,
1474,76388.42,19.53452,
1475,76389.25,19.51357,
1476,76390.0,19.49286,
1477,76390.77,19.47262,
1478,76391.57,19.45155,
1479,76392.34,19.43085,
1480,76393.14,19.40856,
1481,76393.94,19.38917,
1482,76394.71,19.36634,
1483,76395.45,19.3449,
1484,76396.24,19.32379,
1485,76397.02,19.30219,
1486,76397.75,19.28129,
1487,76398.54,19.2603,
1488,76399.33,19.23839,
1489,76400.05,19.21609,
1490,76402.72,19.19395,
1491,76403.48,19.17242,
1492,76404.27,19.15057,
1493,76405.05,19.12905,
1494,76405.81,19.10769,
1495,76406.56,19.08639,
1496,76407.3,19.06514,
1497,76408.07,19.04391,
1498,76408.84,19.0225,
1499,76409.6,19.00137,
1500,76410.33,18.97721,
1501,76411.09,18.95835,
1502,76411.86,18.9367,
1503,76412.63,18.91538,
1504,76413.39,18.89454,
1505,76413.56,18.85309,
1506,76414.33,18.83156,
1507,76415.05,18.81166,
1508,76415.81,18.79145,
1509,76416.59,18.77045,
1510,76417.36,18.74963,
1511,76418.08,18.72897,
1512,76418.84,18.70768,
1513,76419.6,18.68598,
1514,76420.36,18.6642,
1515,76421.09,18.64282,
1516,76421.84,18.62084,
1517,76422.6,18.59943,
1518,76423.36,18.57792,
1519,76424.12,18.5568,
1520,76424.78,18.53547,
1521,76425.53,18.51162,
1522,76426.28,18.49213,
1523,76427.03,18.47013,
1524,76427.77,18.4474,
1525,76428.52,18.42478,
1526,76429.23,18.40236,
1527,76429.95,18.3801,
1528,76430.7,18.35762,
1529,76431.44,18.33541,
1530,76432.18,18.31346,
1531,76432.94,18.29115,
1532,76433.67,18.26862,
1533,76434.4,18.24603,
1534,76435.16,18.22366,
1535,76435.84,18.20102,
1536,76436.53,18.17829,
1537,76437.31,18.15598,
1538,76438.01,18.13345,
1539,76438.74,18.11094,
1540,76439.52,18.08837,
1541,76441.52,18.06618,
1542,76442.25,18.04409,
1543,76442.98,18.02111,
1544,76443.7,17.99842,
1545,76444.42,17.97619,
1546,76445.13,17.95222,
1547,76445.83,17.93237,
1548,76446.58,17.91012,
1549,76447.27,17.8878,
1550,76448.0,17.86501,
1551,76448.72,17.84192,
1552,76449.45,17.81869,
1553,76450.13,17.7957,
1554,76450.84,17.77252,
1555,76451.56,17.74956,
1556,76452.28,17.72663,
1557,76452.98,17.70343,
1558,76453.7,17.67987,
1559,76454.25,17.63239,
1560,76454.95,17.60873,
1561,76455.66,17.58501,
1562,76456.36,17.56136,
1563,76457.08,17.53761,
1564,76457.75,17.51424,
1565,76458.48,17.48832,
1566,76459.17,17.46722,
1567,76459.89,17.44366,
1568,76460.55,17.4179,
1569,76461.25,17.39746,
1570,76461.95,17.37451,
1571,76462.65,17.35089,
1572,76463.34,17.3288,
1573,76464.04,17.3061,
1574,76464.73,17.28317,
1575,76465.44,17.26012,
1576,76466.13,17.23731,
1577,76466.79,17.2142,
1578,76467.48,17.19043,
1579,76468.18,17.16686,
1580,76468.83,17.14382,
1581,76469.53,17.12056,
1582,76470.23,17.09668,
1583,76470.92,17.073,
1584,76471.63,17.04657,
1585,76472.28,17.02495,
1586,76472.94,17.00122,
1587,76473.63,16.9776,
1588,76474.31,16.9545,
1589,76475.0,16.93105,
1590,76475.66,16.90693,
1591,76476.34,16.88377,
1592,76477.03,16.85991,
1593,76477.66,16.83625,
1594,76478.35,16.81229,
1595,76479.05,16.78803,
1596,76479.72,16.76368,
1597,76480.34,16.73963,
1598,76481.66,16.71545,
1599,76482.33,16.69123,
1600,76482.98,16.66426,
1601,76483.69,16.64233,
1602,76484.29,16.61761,
1603,76484.98,16.5896,
1604,76485.69,16.56679,
1605,76486.31,16.54161,
1606,76487.02,16.51636,
1607,76487.61,16.49157,
1608,76488.32,16.46697,
1609,76488.94,16.44265,
1610,76489.64,16.41834,
1611,76490.27,16.39339,
1612,76490.92,16.36976,
1613,76491.58,16.34326,
1614,76492.24,16.32163,
1615,76492.84,16.29708,
1616,76493.55,16.27218,
1617,76494.17,16.24666,
1618,76494.86,16.21857,
1619,76495.45,16.19531,
1620,76496.16,16.16968,
1621,76496.78,16.14418,
1622,76497.42,16.11871,
1623,76498.05,16.091,
1624,76498.69,16.06889,
1625,76499.89,16.04396,
1626,76500.53,16.01918,
1627,76501.18,15.99428,
1628,76501.82,15.96927,
1629,76502.48,15.9441,
1630,76503.09,15.91917,
1631,76503.77,15.89443,
1632,76504.39,15.86929,
1633,76505.02,15.84107,
1634,76505.63,15.81806,
1635,76506.28,15.79223,
1636,76506.94,15.76653,
1637,76507.53,15.74074,
1638,76508.16,15.71465,
1639,76508.78,15.68882,
1640,76509.42,15.66317,
1641,76510.08,15.63784,
1642,76510.67,15.61143,
1643,76511.29,15.58574,
1644,76511.91,15.5607,
1645,76512.52,15.53598,
1646,76513.19,15.51108,
1647,76513.81,15.48612,
1648,76514.41,15.45834,
1649,76515.03,15.43541,
1650,76515.64,15.40953,
1651,76516.24,15.38327,
1652,76516.87,15.35692,
1653,76517.58,15.33097,
1654,76518.19,15.30495,
1655,76518.78,15.27911,
1656,76519.41,15.25279,
1657,76520.02,15.22739,
1658,76520.63,15.20214,
1659,76521.23,15.17639,
1660,76521.88,15.14747,
1661,76522.46,15.12369,
1662,76523.07,15.09689,
1663,76523.69,15.07,
1664,76524.28,15.04336,
1665,76524.88,15.01706,
1666,76525.46,14.99104,
1667,76526.07,14.9648,
1668,76526.67,14.93845,
1669,76527.27,14.91165,
1670,76527.84,14.88178,
1671,76528.45,14.85769,
1672,76529.02,14.83042,
1673,76529.61,14.79999,
1674,76530.21,14.77522,
1675,76530.8,14.74761,
1676,76531.39,14.72007,
1677,76532.0,14.69264,
1678,76532.58,14.66529,
1679,76533.16,14.63809,
1680,76533.7,14.61099,
1681,76534.33,14.58361,
1682,76534.91,14.55598,
1683,76535.48,14.52505,
1684,76536.09,14.4999,
1685,76536.67,14.47174,
1686,76537.26,14.44365,
1687,76537.83,14.41578,
1688,76538.41,14.38787,
1689,76538.97,14.3568,
1690,76539.55,14.3322,
1691,76540.11,14.30472,
1692,76540.67,14.27679,
1693,76541.26,14.24919,
1694,76541.82,14.22173,
1695,76542.39,14.1944,
1696,76542.97,14.16662,
1697,76543.52,14.13992,
1698,76544.09,14.11145,
1699,76544.64,14.07962,
1700,76545.22,14.05488,
1701,76545.78,14.02687,
1702,76546.35,14.00007,
1703,76546.9,13.97315,
1704,76547.47,13.94522,
1705,76548.02,13.9139,
1706,76548.58,13.88927,
1707,76549.14,13.86181,
1708,76549.7,13.83132,
1709,76550.27,13.80687,
1710,76550.79,13.77971,
1711,76551.34,13.7531,
1712,76551.91,13.72697,
1713,76552.47,13.70095,
1714,76553.01,13.6752,
1715,76553.55,13.64634,
1716,76554.09,13.62313,
1717,76554.62,13.5967,
1718,76555.17,13.56993,
1719,76555.73,13.54276,
1720,76556.26,13.51584,
1721,76556.81,13.48855,
1722,76557.38,13.46188,
1723,76557.88,13.43472,
1724,76558.42,13.40827,
1725,76559.42,13.38211,
1726,76559.95,13.35644,
1727,76560.45,13.33071,
1728,76561.0,13.30464,
1729,76561.54,13.27833,
1730,76562.05,13.24957,
1731,76562.61,13.22657,
1732,76563.11,13.20067,
1733,76563.66,13.17476,
1734,76564.17,13.14883,
1735,76564.73,13.1226,
1736,76565.23,13.09626,
1737,76565.77,13.06997,
1738,76566.31,13.04408,
1739,76566.78,13.01848,
1740,76567.28,12.99266,
1741,76567.83,12.96709,
1742,76568.34,12.94134,
1743,76568.88,12.91573,
1744,76569.38,12.88671,
1745,76569.92,12.86364,
1746,76570.42,12.83822,
1747,76570.92,12.81312,
1748,76571.44,12.7883,
1749,76571.95,12.7633,
1750,76572.47,12.73779,
1751,76572.98,12.71201,
1752,76573.48,12.68666,
1753,76573.98,12.66163,
1754,76574.48,12.6366,
1755,76575.02,12.61157,
1756,76575.51,12.5865,
1757,76576.02,12.56144,
1758,76576.47,12.53652,
1759,76576.98,12.51178,
1760,76577.52,12.48698,
1761,76578.0,12.46192,
1762,76578.51,12.43675,
1763,76579.36,12.41175,
1764,76579.86,12.38676,
1765,76580.33,12.36187,
1766,76580.81,12.33322,
1767,76581.34,12.31121,
1768,76581.8,12.28588,
1769,76582.3,12.26053,
1770,76582.82,12.23536,
1771,76583.31,12.21009,
1772,76583.77,12.18472,
1773,76584.27,12.15943,
1774,76584.77,12.13409,
1775,76585.25,12.10898,
1776,76585.7,12.08374,
1777,76586.2,12.05834,
1778,76586.67,12.03288,
1779,76587.16,12.0074,
1780,76587.66,11.98207,
1781,76588.13,11.95672,
1782,76588.63,11.93135,
1783,76589.05,11.9063,
1784,76589.53,11.88124,
1785,76591.03,11.85618,
1786,76591.51,11.83104,
1787,76591.98,11.80606,
1788,76592.44,11.78122,
1789,76592.91,11.75623,
1790,76593.39,11.73128,
1791,76593.84,11.70627,
1792,76594.33,11.68125,
1793,76594.81,11.65638,
1794,76595.22,11.63153,
1795,76595.7,11.60647,
1796,76596.17,11.58136,
1797,76596.64,11.55581,
1798,76597.09,11.53064,
1799,76597.56,11.50541,
1800,76598.0,11.48047,
1801,76598.48,11.45533,
1802,76598.91,11.43031,
1803,76599.38,11.40247,
1804,76599.83,11.38016,
1805,76600.3,11.35526,
1806,76600.73,11.33027,
1807,76601.2,11.3051,
1808,76601.64,11.27976,
1809,76602.11,11.25449,
1810,76602.56,11.22948,
1811,76602.98,11.20463,
1812,76603.45,11.17963,
1813,76603.88,11.15485,
1814,76604.36,11.13016,
1815,76604.8,11.10282,
1816,76605.25,11.08102,
1817,76605.69,11.05648,
1818,76606.09,11.02931,
1819,76606.56,11.00728,
1820,76606.98,10.98265,
1821,76607.42,10.95807,
1822,76607.88,10.93346,
1823,76608.31,10.9092,
1824,76608.77,10.88494,
1825,76609.17,10.85752,
1826,76609.61,10.8363,
1827,76610.05,10.81196,
1828,76610.48,10.78478,
1829,76610.91,10.76278,
1830,76611.36,10.73816,
1831,76611.78,10.71361,
1832,76612.22,10.68898,
1833,76612.61,10.66446,
1834,76613.06,10.63928,
1835,76613.48,10.61272,
1836,76613.92,10.5909,
1837,76614.34,10.56672,
1838,76614.78,10.51845,
1839,76615.18,10.4941,
1840,76615.59,10.46958,
1841,76616.02,10.44481,
1842,76616.41,10.42013,
1843,76616.83,10.39536,
1844,76617.25,10.37048,
1845,76617.67,10.34555,
1846,76618.09,10.32069,
1847,76618.52,10.29605,
1848,76618.94,10.27162,
1849,76619.34,10.24714,
1850,76619.76,10.2226,
1851,76620.16,10.19816,
1852,76620.58,10.17383,
1853,76621.0,10.14944,
1854,76621.41,10.125,
1855,76621.77,10.10073,
1856,76622.19,10.07644,
1857,76622.61,10.052,
1858,76622.98,10.0277,
1859,76623.41,10.00327,
1860,76623.83,9.978591,
1861,76624.17,9.954341,
1862,76624.59,9.929975,
1863,76624.98,9.905997,
1864,76625.4,9.88168,
1865,76625.8,9.857629,
1866,76626.16,9.833528,
1867,76626.56,9.809031,
1868,76626.97,9.784461,
1869,76627.38,9.760061,
1870,76627.73,9.735594,
1871,76628.12,9.711148,
1872,76628.53,9.686604,
1873,76628.88,9.662213,
1874,76629.28,9.637929,
1875,76629.67,9.613668,
1876,76630.02,9.589764,
1877,76630.44,9.56567,
1878,76630.81,9.541556,
1879,76631.2,9.517399,
1880,76631.57,9.493051,
1881,76631.97,9.468587,
1882,76632.31,9.444221,
1883,76632.7,9.420014,
1884,76633.29,9.39606,
1885,76633.66,9.372096,
1886,76634.05,9.348107,
1887,76634.4,9.324012,
1888,76634.8,9.299672,
1889,76635.15,9.275414,
1890,76635.53,9.25125,
1891,76635.88,9.227144,
1892,76636.27,9.202986,
1893,76636.64,9.178875,
1894,76636.99,9.155004,
1895,76637.34,9.131039,
1896,76637.73,9.107095,
1897,76638.1,9.083293,
1898,76638.45,9.059402,
1899,76638.81,9.035446,
1900,76639.17,9.011423,
1901,76639.52,8.98749,
1902,76639.91,8.96069,
1903,76640.22,8.939228,
1904,76640.63,8.914992,
1905,76640.95,8.890665,
1906,76641.3,8.866482,
1907,76641.66,8.842406,
1908,76642.02,8.818271,
1909,76642.34,8.794251,
1910,76642.73,8.770144,
1911,76643.05,8.746415,
1912,76643.44,8.722674,
1913,76643.77,8.698661,
1914,76644.1,8.674197,
1915,76644.47,8.648115,
1916,76644.8,8.626353,
1917,76645.16,8.602234,
1918,76645.5,8.578283,
1919,76645.83,8.551775,
1920,76646.16,8.5307,
1921,76646.5,8.506784,
1922,76646.86,8.480452,
1923,76647.2,8.459486,
1924,76647.52,8.435838,
1925,76647.85,8.412409,
1926,76648.2,8.388617,
1927,76648.55,8.361986,
1928,76648.87,8.340734,
1929,76649.19,8.316953,
1930,76649.52,8.29279,
1931,76649.84,8.268686,
1932,76650.59,8.244556,
1933,76650.91,8.220683,
1934,76651.23,8.19673,
1935,76651.56,8.172678,
1936,76651.88,8.148347,
1937,76652.2,8.124033,
1938,76652.53,8.097234,
1939,76652.84,8.075731,
1940,76653.2,8.051662,
1941,76653.5,8.027935,
1942,76653.81,8.003997,
1943,76654.16,7.979945,
1944,76654.47,7.955779,
1945,76654.77,7.931763,
1946,76655.11,7.907747,
1947,76655.41,7.883699,
1948,76655.75,7.859683,
1949,76656.05,7.835747,
1950,76656.35,7.811826,
1951,76656.7,7.787748,
1952,76656.98,7.763806,
1953,76657.32,7.739691,
1954,76657.59,7.715636,
1955,76657.91,7.691602,
1956,76658.2,7.667674,
1957,76658.52,7.641176,
1958,76658.83,7.61968,
1959,76659.16,7.595776,
1960,76659.44,7.569135,
1961,76659.73,7.547695,
1962,76660.03,7.523599,
1963,76660.33,7.499283,
1964,76660.64,7.474965,
1965,76660.92,7.450695,
1966,76661.23,7.426249,
1967,76661.52,7.401772,
1968,76661.8,7.377077,
1969,76662.1,7.351151,
1970,76662.4,7.329637,
1971,76662.67,7.305537,
1972,76662.98,7.28132,
1973,76663.27,7.256541,
1974,76663.56,7.232829,
1975,76665.09,7.208574,
1976,76665.38,7.184243,
1977,76665.66,7.159833,
1978,76665.97,7.135384,
1979,76666.23,7.111195,
1980,76666.52,7.086841,
1981,76666.8,7.062524,
1982,76667.09,7.038219,
1983,76667.38,7.014004,
1984,76667.64,6.989943,
1985,76667.92,6.965888,
1986,76668.2,6.941891,
1987,76668.48,6.917914,
1988,76668.77,6.893331,
1989,76669.05,6.869984,
1990,76669.33,6.845967,
1991,76669.61,6.821936,
1992,76669.88,6.797729,
1993,76670.14,6.773601,
1994,76706.09,6.749358,
1995,76706.38,6.724945,
1996,76706.64,6.700619,
1997,76706.91,6.676429,
1998,76707.19,6.652318,
1999,76707.42,6.625689,
2000,76707.7,6.604101,
2001,76707.98,6.579944,
2002,76708.23,6.555973,
2003,76708.51,6.529274,
2004,76708.75,6.50771,
2005,76709.01,6.483366,
2006,76709.27,6.45908,
2007,76709.52,6.431964,
2008,76709.79,6.409976,
2009,76710.03,6.385589,
2010,76710.28,6.361239,
2011,76710.56,6.33675,
2012,76710.81,6.312334,
2013,76711.05,6.287901,
2014,76711.3,6.263583,
2015,76711.57,6.236506,
2016,76711.81,6.214818,
2017,76712.06,6.190515,
2018,76712.3,6.166276,
2019,76712.53,6.139423,
2020,76712.78,6.117963,
2021,76713.03,6.093872,
2022,76713.27,6.069646,
2023,76713.5,6.045554,
2024,76713.75,6.018834,
2025,76713.98,5.997332,
2026,76714.22,5.973245,
2027,76714.46,5.949236,
2028,76714.69,5.925424,
2029,76714.94,5.901701,
2030,76715.16,5.877968,
2031,76715.41,5.854105,
2032,76715.63,5.830399,
2033,76715.86,5.80685,
2034,76716.11,5.783319,
2035,76716.33,5.75993,
2036,76716.55,5.736599,
2037,76716.77,5.713378,
2038,76717.02,5.690341,
2039,76717.25,5.667568,
2040,76717.47,5.645076,
2041,76717.69,5.622985,
2042,76717.91,5.601041,
2043,76718.14,5.579626,
2044,76718.37,5.558481,
2045,76718.59,5.537621,
2046,76718.81,5.517204,
2047,76719.05,5.49673,
2048,76719.27,5.477733,
2049,76719.47,5.458869,
2050,76719.7,5.440541,
2051,76719.91,5.422807,
2052,76721.28,5.403827,
2053,76721.48,5.386367,
2054,76721.71,5.371255,
2055,76721.94,5.358467,
2056,76722.15,5.348044,
2057,76722.37,5.340821,
2058,76722.59,5.338608,
2059,76722.8,5.337524,
2060,76723.02,5.336099,
2061,76723.23,5.334744,
2062,76723.45,5.329828,
2063,76723.67,5.328786,
2064,76723.9,5.328004,
2065,76724.11,5.32724,
2066,76724.31,5.326646,
2067,76724.52,5.326326,
2068,76724.75,5.326125,
2069,76724.96,5.3262,
2070,76725.17,5.326624,
2071,76725.39,5.327173,
2072,76725.6,5.326749,
2073,76725.81,5.328306,
2074,76726.04,5.330166,
2075,76726.26,5.332327,
2076,76726.47,5.33473,
2077,76726.69,5.337299,
2078,76726.89,5.340025,
2079,76727.12,5.343011,
2080,76727.33,5.346014,
2081,76727.54,5.348569,
2082,76727.77,5.351412,
2083,76727.97,5.354313,
2084,76728.18,5.356903,
2085,76728.41,5.359237,
2086,76728.62,5.361381,
2087,76728.84,5.363528,
2088,76729.05,5.365951,
2089,76729.27,5.368576,
2090,76729.48,5.371312,
2091,76729.69,5.373723,
2092,76729.91,5.375833,
2093,76730.13,5.378696,
2094,76730.34,5.381313,
2095,76730.57,5.383454,
2096,76730.77,5.385219,
2097,76730.99,5.387524,
2098,76731.21,5.389184,
2099,76731.42,5.390676,
2100,76731.64,5.392037,
2101,76731.86,5.393251,
2102,76732.08,5.394321,
2103,76732.28,5.395516,
2104,76732.52,5.404334,
2105,76732.72,5.406131,
2106,76732.93,5.407899,
2107,76733.16,5.409558,
2108,76733.38,5.411073,
2109,76733.59,5.412486,
2110,76733.8,5.413848,
2111,76734.03,5.415228,
2112,76734.25,5.416502,
2113,76734.46,5.417713,
2114,76734.68,5.41885,
2115,76734.9,5.419888,
2116,76735.12,5.420884,
2117,76735.34,5.42178,
2118,76735.55,5.422832,
2119,76735.76,5.423844,
2120,76735.98,5.42507,
2121,76736.2,5.426315,
2122,76736.41,5.427592,
2123,76736.64,5.428728,
2124,76736.85,5.429693,
2125,76737.08,5.430719,
2126,76737.29,5.431606,
2127,76737.52,5.432604,
2128,76737.73,5.433358,
2129,76737.94,5.434321,
2130,76738.14,5.435258,
2131,76738.37,5.436303,
2132,76738.59,5.437363,
2133,76738.8,5.438336,
2134,76739.02,5.439188,
2135,76739.24,5.440268,
2136,76739.47,5.441212,
2137,76739.68,5.442214,
2138,76739.9,5.443204,
2139,76740.1,5.444143,
2140,76740.33,5.44522,
2141,76740.55,5.44626,
2142,76740.77,5.447266,
2143,76740.99,5.448359,
2144,76741.21,5.449423,
2145,76741.44,5.450518,
2146,76741.63,5.451583,
2147,76741.87,5.452628,
2148,76742.09,5.45364,
2149,76742.3,5.454638,
2150,76742.52,5.455619,
2151,76742.75,5.456636,
2152,76742.97,5.457649,
2153,76743.19,5.458817,
2154,76743.39,5.459859,
2155,76743.6,5.460924,
2156,76743.82,5.461967,
2157,76744.05,5.463023,
2158,76744.27,5.464139,
2159,76744.48,5.465145,
2160,76744.69,5.466161,
2161,76744.92,5.467086,
2162,76745.14,5.467998,
2163,76745.36,5.468981,
2164,76745.58,5.469908,
2165,76745.79,5.470976,
2166,76746.0,5.471978,
2167,76746.23,5.472893,
2168,76746.45,5.473779,
2169,76746.67,5.474644,
2170,76746.89,5.475516,
2171,76747.1,5.476367,
2172,76747.31,5.477192,
2173,76747.54,5.47807,
2174,76747.77,5.47893,
2175,76747.99,5.479855,
2176,76748.21,5.480778,
2177,76748.42,5.481671,
2178,76748.64,5.482718,
2179,76748.86,5.483653,
2180,76749.08,5.484664,
2181,76749.3,5.48561,
2182,76749.52,5.486693,
2183,76749.72,5.487684,
2184,76749.94,5.488667,
2185,76750.17,5.489652,
2186,76750.39,5.490619,
2187,76750.59,5.491536,
2188,76750.83,5.492405,
2189,76751.03,5.49325,
2190,76751.26,5.494231,
2191,76751.48,5.49512,
2192,76751.7,5.496037,
2193,76751.92,5.496974,
2194,76752.15,5.497871,
2195,76752.38,5.498955,
2196,76752.6,5.499957,
2197,76752.8,5.500925,
2198,76753.02,5.501964,
2199,76753.24,5.50294,
2200,76753.47,5.504011,
2201,76753.7,5.505059,
2202,76753.92,5.506153,
2203,76754.14,5.50719,
2204,76754.34,5.508316,
2205,76754.55,5.509346,
2206,76754.78,5.510308,
2207,76755.01,5.511298,
2208,76755.23,5.51227,
2209,76755.46,5.513304,
2210,76755.69,5.514212,
2211,76755.91,5.515125,
2212,76756.13,5.516045,
2213,76756.34,5.516985,
2214,76756.56,5.517906,
2215,76756.78,5.518837,
2216,76757.0,5.519798,
2217,76757.23,5.520765,
2218,76757.45,5.521695,
2219,76757.67,5.522609,
2220,76757.89,5.52357,
2221,76758.12,5.524497,
2222,76758.33,5.525528,
2223,76758.55,5.526433,
2224,76758.77,5.52739,
2225,76758.98,5.528433,
2226,76759.21,5.529538,
2227,76759.44,5.5305,
2228,76759.66,5.531475,
2229,76759.88,5.532547,
2230,76760.11,5.533359,
2231,76760.32,5.534313,
2232,76760.55,5.535238,
2233,76760.76,5.536149,
2234,76761.0,5.537127,
2235,76761.21,5.538014,
2236,76761.42,5.53897,
2237,76761.66,5.540049,
2238,76761.88,5.541179,
2239,76762.09,5.542174,
2240,76762.32,5.54319,
2241,76762.55,5.544103,
2242,76762.77,5.545158,
2243,76762.98,5.546032,
2244,76763.2,5.546982,
2245,76763.44,5.547898,
2246,76763.66,5.548849,
2247,76763.88,5.549699,
2248,76764.09,5.550575,
2249,76764.3,5.551446,
2250,76764.5,5.552305,
2251,76764.72,5.553217,
2252,76764.95,5.554134,
2253,76765.16,5.555041,
2254,76765.38,5.556249,
2255,76765.61,5.557373,
2256,76765.83,5.558444,
2257,76766.06,5.559515,
2258,76766.28,5.560611,
2259,76766.5,5.561801,
2260,76766.72,5.562859,
2261,76766.95,5.5639,
2262,76767.17,5.564823,
2263,76767.39,5.565843,
2264,76767.61,5.56686,
2265,76767.84,5.567837,
2266,76768.06,5.568975,
2267,76768.29,5.569971,
2268,76768.51,5.571006,
2269,76768.73,5.5721,
2270,76768.95,5.573158,
2271,76769.18,5.574246,
2272,76769.41,5.575303,
2273,76769.61,5.576384,
2274,76769.83,5.577507,
2275,76770.05,5.578624,
2276,76770.27,5.579744,
2277,76770.5,5.58076,
2278,76770.72,5.581724,
2279,76770.95,5.582587,
2280,76771.19,5.583476,
2281,76771.41,5.584423,
2282,76771.63,5.585229,
2283,76771.84,5.586029,
2284,76772.07,5.586911,
2285,76772.3,5.587596,
2286,76772.52,5.588223,
2287,76772.74,5.588917,
2288,76772.96,5.589572,
2289,76773.19,5.590332,
2290,76773.41,5.591122,
2291,76773.63,5.592043,
2292,76773.86,5.593005,
2293,76774.06,5.593992,
2294,76774.3,5.595006,
2295,76774.52,5.595939,
2296,76774.75,5.596947,
2297,76774.97,5.597878,
2298,76775.2,5.598924,
2299,76775.42,5.59991,
2300,76775.64,5.600874,
2301,76775.86,5.601785,
2302,76776.08,5.60271,
2303,76776.3,5.603649,
2304,76776.53,5.604567,
2305,76776.76,5.605592,
2306,76776.98,5.606654,
2307,76777.2,5.607641,
2308,76777.44,5.608688,
2309,76777.66,5.609601,
2310,76777.89,5.610517,
2311,76778.11,5.611265,
2312,76778.33,5.611886,
2313,76778.58,5.612422,
2314,76778.79,5.61279,
2315,76779.01,5.612977,
2316,76779.24,5.613085,
2317,76779.47,5.612764,
2318,76779.7,5.612225,
2319,76779.92,5.611283,
2320,76780.14,5.609973,
2321,76780.36,5.608235,
2322,76780.58,5.606088,
2323,76780.8,5.603154,
2324,76781.03,5.599335,
2325,76781.25,5.595012,
2326,76781.46,5.589883,
2327,76781.68,5.584142,
2328,76781.91,5.57778,
2329,76782.13,5.570016,
2330,76782.36,5.562614,
2331,76782.56,5.553666,
2332,76782.79,5.541979,
2333,76783.0,5.528658,
2334,76783.22,5.513556,
2335,76783.44,5.496044,
2336,76783.64,5.476503,
2337,76783.85,5.454268,
2338,76784.08,5.433891,
2339,76784.28,5.414476,
2340,76784.49,5.395326,
2341,76784.7,5.377017,
2342,76784.93,5.359457,
2343,76785.15,5.341964,
2344,76785.34,5.326022,
2345,76785.56,5.310455,
2346,76785.79,5.296043,
2347,76785.98,5.28198,
2348,76786.2,5.268706,
2349,76786.41,5.25592,
2350,76786.63,5.24412,
2351,76786.83,5.235334,
2352,76787.04,5.220962,
2353,76787.23,5.21049,
2354,76787.45,5.202586,
2355,76787.66,5.19453,
2356,76787.88,5.187415,
2357,76788.09,5.180791,
2358,76788.3,5.174971,
2359,76788.5,5.168136,
2360,76788.72,5.164396,
2361,76788.92,5.16074,
2362,76789.13,5.156742,
2363,76789.34,5.153807,
2364,76789.55,5.152087,
2365,76789.75,5.151873,
2366,76789.95,5.152761,
2367,76790.16,5.153651,
2368,76790.38,5.155679,
2369,76790.58,5.159356,
2370,76790.8,5.16343,
2371,76791.0,5.1675,
2372,76791.2,5.171368,
2373,76791.41,5.175138,
2374,76791.63,5.179029,
2375,76791.84,5.182403,
2376,76792.03,5.185752,
2377,76792.24,5.189045,
2378,76792.45,5.192457,
2379,76792.67,5.195441,
2380,76792.88,5.198522,
2381,76793.08,5.2008,
2382,76793.28,5.203657,
2383,76793.49,5.20602,
2384,76793.7,5.208552,
2385,76793.91,5.210919,
2386,76794.12,5.212778,
2387,76794.33,5.21454,
2388,76794.53,5.21616,
2389,76794.73,5.21755,
2390,76794.95,5.218741,
2391,76795.16,5.219898,
2392,76795.36,5.221163,
2393,76795.58,5.222473,
2394,76795.78,5.223711,
2395,76795.97,5.224885,
2396,76796.19,5.226055,
2397,76796.39,5.227138,
2398,76796.62,5.228178,
2399,76796.83,5.229192,
2400,76797.03,5.230166,
2401,76797.26,5.23118,
2402,76797.45,5.232213,
2403,76797.67,5.233331,
2404,76797.86,5.234507,
2405,76798.08,5.235714,
2406,76798.3,5.236825,
2407,76798.5,5.237955,
2408,76798.72,5.239118,
2409,76798.92,5.240264,
2410,76799.13,5.241399,
2411,76799.34,5.242598,
2412,76799.55,5.243752,
2413,76799.75,5.245068,
2414,76799.98,5.246185,
2415,76800.19,5.247272,
2416,76800.38,5.24831,
2417,76800.6,5.249361,
2418,76800.8,5.250457,
2419,76801.02,5.251455,
2420,76801.23,5.252308,
2421,76801.45,5.253199,
2422,76801.64,5.254088,
2423,76801.86,5.255027,
