%!PS-Adobe-3.0 EPSF-3.0
%%Creator: (MATLAB, The Mathworks, Inc. Version 9.14.0.2206163 \(R2023a\). Operating System: Linux)
%%Title: /home/radek/Desktop/school/bachelor_brigada/src/altitude.eps
%%CreationDate: 2023-09-30T20:50:50
%%Pages: (atend)
%%BoundingBox:     0     0   428   315
%%LanguageLevel: 3
%%EndComments
%%BeginProlog
%%BeginResource: procset (Apache XML Graphics Std ProcSet) 1.2 0
%%Version: 1.2 0
%%Copyright: (Copyright 2001-2003,2010 The Apache Software Foundation. License terms: http://www.apache.org/licenses/LICENSE-2.0)
/bd{bind def}bind def
/ld{load def}bd
/GR/grestore ld
/GS/gsave ld
/RM/rmoveto ld
/C/curveto ld
/t/show ld
/L/lineto ld
/ML/setmiterlimit ld
/CT/concat ld
/f/fill ld
/N/newpath ld
/S/stroke ld
/CC/setcmykcolor ld
/A/ashow ld
/cp/closepath ld
/RC/setrgbcolor ld
/LJ/setlinejoin ld
/GC/setgray ld
/LW/setlinewidth ld
/M/moveto ld
/re {4 2 roll M
1 index 0 rlineto
0 exch rlineto
neg 0 rlineto
cp } bd
/_ctm matrix def
/_tm matrix def
/BT { _ctm currentmatrix pop matrix _tm copy pop 0 0 moveto } bd
/ET { _ctm setmatrix } bd
/iTm { _ctm setmatrix _tm concat } bd
/Tm { _tm astore pop iTm 0 0 moveto } bd
/ux 0.0 def
/uy 0.0 def
/F {
  /Tp exch def
  /Tf exch def
  Tf findfont Tp scalefont setfont
  /cf Tf def  /cs Tp def
} bd
/ULS {currentpoint /uy exch def /ux exch def} bd
/ULE {
  /Tcx currentpoint pop def
  gsave
  newpath
  cf findfont cs scalefont dup
  /FontMatrix get 0 get /Ts exch def /FontInfo get dup
  /UnderlinePosition get Ts mul /To exch def
  /UnderlineThickness get Ts mul /Tt exch def
  ux uy To add moveto  Tcx uy To add lineto
  Tt setlinewidth stroke
  grestore
} bd
/OLE {
  /Tcx currentpoint pop def
  gsave
  newpath
  cf findfont cs scalefont dup
  /FontMatrix get 0 get /Ts exch def /FontInfo get dup
  /UnderlinePosition get Ts mul /To exch def
  /UnderlineThickness get Ts mul /Tt exch def
  ux uy To add cs add moveto Tcx uy To add cs add lineto
  Tt setlinewidth stroke
  grestore
} bd
/SOE {
  /Tcx currentpoint pop def
  gsave
  newpath
  cf findfont cs scalefont dup
  /FontMatrix get 0 get /Ts exch def /FontInfo get dup
  /UnderlinePosition get Ts mul /To exch def
  /UnderlineThickness get Ts mul /Tt exch def
  ux uy To add cs 10 mul 26 idiv add moveto Tcx uy To add cs 10 mul 26 idiv add lineto
  Tt setlinewidth stroke
  grestore
} bd
/QT {
/Y22 exch store
/X22 exch store
/Y21 exch store
/X21 exch store
currentpoint
/Y21 load 2 mul add 3 div exch
/X21 load 2 mul add 3 div exch
/X21 load 2 mul /X22 load add 3 div
/Y21 load 2 mul /Y22 load add 3 div
/X22 load /Y22 load curveto
} bd
/SSPD {
dup length /d exch dict def
{
/v exch def
/k exch def
currentpagedevice k known {
/cpdv currentpagedevice k get def
v cpdv ne {
/upd false def
/nullv v type /nulltype eq def
/nullcpdv cpdv type /nulltype eq def
nullv nullcpdv or
{
/upd true def
} {
/sametype v type cpdv type eq def
sametype {
v type /arraytype eq {
/vlen v length def
/cpdvlen cpdv length def
vlen cpdvlen eq {
0 1 vlen 1 sub {
/i exch def
/obj v i get def
/cpdobj cpdv i get def
obj cpdobj ne {
/upd true def
exit
} if
} for
} {
/upd true def
} ifelse
} {
v type /dicttype eq {
v {
/dv exch def
/dk exch def
/cpddv cpdv dk get def
dv cpddv ne {
/upd true def
exit
} if
} forall
} {
/upd true def
} ifelse
} ifelse
} if
} ifelse
upd true eq {
d k v put
} if
} if
} if
} forall
d length 0 gt {
d setpagedevice
} if
} bd
/RE { % /NewFontName [NewEncodingArray] /FontName RE -
  findfont dup length dict begin
  {
    1 index /FID ne
    {def} {pop pop} ifelse
  } forall
  /Encoding exch def
  /FontName 1 index def
  currentdict definefont pop
  end
} bind def
%%EndResource
%%BeginResource: procset (Apache XML Graphics EPS ProcSet) 1.0 0
%%Version: 1.0 0
%%Copyright: (Copyright 2002-2003 The Apache Software Foundation. License terms: http://www.apache.org/licenses/LICENSE-2.0)
/BeginEPSF { %def
/b4_Inc_state save def         % Save state for cleanup
/dict_count countdictstack def % Count objects on dict stack
/op_count count 1 sub def      % Count objects on operand stack
userdict begin                 % Push userdict on dict stack
/showpage { } def              % Redefine showpage, { } = null proc
0 setgray 0 setlinecap         % Prepare graphics state
1 setlinewidth 0 setlinejoin
10 setmiterlimit [ ] 0 setdash newpath
/languagelevel where           % If level not equal to 1 then
{pop languagelevel             % set strokeadjust and
1 ne                           % overprint to their defaults.
{false setstrokeadjust false setoverprint
} if
} if
} bd
/EndEPSF { %def
count op_count sub {pop} repeat            % Clean up stacks
countdictstack dict_count sub {end} repeat
b4_Inc_state restore
} bd
%%EndResource
%FOPBeginFontDict
%%IncludeResource: font Courier-Oblique
%%IncludeResource: font Courier-BoldOblique
%%IncludeResource: font Courier-Bold
%%IncludeResource: font ZapfDingbats
%%IncludeResource: font Symbol
%%IncludeResource: font Helvetica
%%IncludeResource: font Helvetica-Oblique
%%IncludeResource: font Helvetica-Bold
%%IncludeResource: font Helvetica-BoldOblique
%%IncludeResource: font Times-Roman
%%IncludeResource: font Times-Italic
%%IncludeResource: font Times-Bold
%%IncludeResource: font Times-BoldItalic
%%IncludeResource: font Courier
%FOPEndFontDict
%%BeginResource: encoding WinAnsiEncoding
/WinAnsiEncoding [
/.notdef /.notdef /.notdef /.notdef /.notdef
/.notdef /.notdef /.notdef /.notdef /.notdef
/.notdef /.notdef /.notdef /.notdef /.notdef
/.notdef /.notdef /.notdef /.notdef /.notdef
/.notdef /.notdef /.notdef /.notdef /.notdef
/.notdef /.notdef /.notdef /.notdef /.notdef
/.notdef /.notdef /space /exclam /quotedbl
/numbersign /dollar /percent /ampersand /quotesingle
/parenleft /parenright /asterisk /plus /comma
/hyphen /period /slash /zero /one
/two /three /four /five /six
/seven /eight /nine /colon /semicolon
/less /equal /greater /question /at
/A /B /C /D /E
/F /G /H /I /J
/K /L /M /N /O
/P /Q /R /S /T
/U /V /W /X /Y
/Z /bracketleft /backslash /bracketright /asciicircum
/underscore /quoteleft /a /b /c
/d /e /f /g /h
/i /j /k /l /m
/n /o /p /q /r
/s /t /u /v /w
/x /y /z /braceleft /bar
/braceright /asciitilde /bullet /Euro /bullet
/quotesinglbase /florin /quotedblbase /ellipsis /dagger
/daggerdbl /circumflex /perthousand /Scaron /guilsinglleft
/OE /bullet /Zcaron /bullet /bullet
/quoteleft /quoteright /quotedblleft /quotedblright /bullet
/endash /emdash /asciitilde /trademark /scaron
/guilsinglright /oe /bullet /zcaron /Ydieresis
/space /exclamdown /cent /sterling /currency
/yen /brokenbar /section /dieresis /copyright
/ordfeminine /guillemotleft /logicalnot /sfthyphen /registered
/macron /degree /plusminus /twosuperior /threesuperior
/acute /mu /paragraph /middot /cedilla
/onesuperior /ordmasculine /guillemotright /onequarter /onehalf
/threequarters /questiondown /Agrave /Aacute /Acircumflex
/Atilde /Adieresis /Aring /AE /Ccedilla
/Egrave /Eacute /Ecircumflex /Edieresis /Igrave
/Iacute /Icircumflex /Idieresis /Eth /Ntilde
/Ograve /Oacute /Ocircumflex /Otilde /Odieresis
/multiply /Oslash /Ugrave /Uacute /Ucircumflex
/Udieresis /Yacute /Thorn /germandbls /agrave
/aacute /acircumflex /atilde /adieresis /aring
/ae /ccedilla /egrave /eacute /ecircumflex
/edieresis /igrave /iacute /icircumflex /idieresis
/eth /ntilde /ograve /oacute /ocircumflex
/otilde /odieresis /divide /oslash /ugrave
/uacute /ucircumflex /udieresis /yacute /thorn
/ydieresis
] def
%%EndResource
%FOPBeginFontReencode
/Courier-Oblique findfont
dup length dict begin
  {1 index /FID ne {def} {pop pop} ifelse} forall
  /Encoding WinAnsiEncoding def
  currentdict
end
/Courier-Oblique exch definefont pop
/Courier-BoldOblique findfont
dup length dict begin
  {1 index /FID ne {def} {pop pop} ifelse} forall
  /Encoding WinAnsiEncoding def
  currentdict
end
/Courier-BoldOblique exch definefont pop
/Courier-Bold findfont
dup length dict begin
  {1 index /FID ne {def} {pop pop} ifelse} forall
  /Encoding WinAnsiEncoding def
  currentdict
end
/Courier-Bold exch definefont pop
/Helvetica findfont
dup length dict begin
  {1 index /FID ne {def} {pop pop} ifelse} forall
  /Encoding WinAnsiEncoding def
  currentdict
end
/Helvetica exch definefont pop
/Helvetica-Oblique findfont
dup length dict begin
  {1 index /FID ne {def} {pop pop} ifelse} forall
  /Encoding WinAnsiEncoding def
  currentdict
end
/Helvetica-Oblique exch definefont pop
/Helvetica-Bold findfont
dup length dict begin
  {1 index /FID ne {def} {pop pop} ifelse} forall
  /Encoding WinAnsiEncoding def
  currentdict
end
/Helvetica-Bold exch definefont pop
/Helvetica-BoldOblique findfont
dup length dict begin
  {1 index /FID ne {def} {pop pop} ifelse} forall
  /Encoding WinAnsiEncoding def
  currentdict
end
/Helvetica-BoldOblique exch definefont pop
/Times-Roman findfont
dup length dict begin
  {1 index /FID ne {def} {pop pop} ifelse} forall
  /Encoding WinAnsiEncoding def
  currentdict
end
/Times-Roman exch definefont pop
/Times-Italic findfont
dup length dict begin
  {1 index /FID ne {def} {pop pop} ifelse} forall
  /Encoding WinAnsiEncoding def
  currentdict
end
/Times-Italic exch definefont pop
/Times-Bold findfont
dup length dict begin
  {1 index /FID ne {def} {pop pop} ifelse} forall
  /Encoding WinAnsiEncoding def
  currentdict
end
/Times-Bold exch definefont pop
/Times-BoldItalic findfont
dup length dict begin
  {1 index /FID ne {def} {pop pop} ifelse} forall
  /Encoding WinAnsiEncoding def
  currentdict
end
/Times-BoldItalic exch definefont pop
/Courier findfont
dup length dict begin
  {1 index /FID ne {def} {pop pop} ifelse} forall
  /Encoding WinAnsiEncoding def
  currentdict
end
/Courier exch definefont pop
%FOPEndFontReencode
%%EndProlog
%%Page: 1 1
%%PageBoundingBox: 0 0 428 315
%%BeginPageSetup
[1 0 0 -1 0 315] CT
%%EndPageSetup
GS
[0.75 0 0 0.75 0 0] CT
1 GC
N
0 0 570 420 re
f
GR
GS
[0.75 0 0 0.75 0 0] CT
1 GC
N
0 0 570 420 re
f
GR
GS
[0.75 0 0 0.75 0 0] CT
1 GC
N
74 373 M
516 373 L
516 31 L
74 31 L
cp
f
GR
GS
[0.75 0 0 0.75 0 0] CT
0.873 GC
1 LJ
0.667 LW
N
74 373 M
74 31 L
S
GR
GS
[0.75 0 0 0.75 0 0] CT
0.873 GC
1 LJ
0.667 LW
N
137.143 373 M
137.143 31 L
S
GR
GS
[0.75 0 0 0.75 0 0] CT
0.873 GC
1 LJ
0.667 LW
N
200.286 373 M
200.286 31 L
S
GR
GS
[0.75 0 0 0.75 0 0] CT
0.873 GC
1 LJ
0.667 LW
N
263.429 373 M
263.429 31 L
S
GR
GS
[0.75 0 0 0.75 0 0] CT
0.873 GC
1 LJ
0.667 LW
N
326.571 373 M
326.571 31 L
S
GR
GS
[0.75 0 0 0.75 0 0] CT
0.873 GC
1 LJ
0.667 LW
N
389.714 373 M
389.714 31 L
S
GR
GS
[0.75 0 0 0.75 0 0] CT
0.873 GC
1 LJ
0.667 LW
N
452.857 373 M
452.857 31 L
S
GR
GS
[0.75 0 0 0.75 0 0] CT
0.873 GC
1 LJ
0.667 LW
N
516 373 M
516 31 L
S
GR
GS
[0.75 0 0 0.75 0 0] CT
0.873 GC
1 LJ
0.667 LW
N
516 373 M
74 373 L
S
GR
GS
[0.75 0 0 0.75 0 0] CT
0.873 GC
1 LJ
0.667 LW
N
516 316 M
74 316 L
S
GR
GS
[0.75 0 0 0.75 0 0] CT
0.873 GC
1 LJ
0.667 LW
N
516 259 M
74 259 L
S
GR
GS
[0.75 0 0 0.75 0 0] CT
0.873 GC
1 LJ
0.667 LW
N
516 202 M
74 202 L
S
GR
GS
[0.75 0 0 0.75 0 0] CT
0.873 GC
1 LJ
0.667 LW
N
516 145 M
74 145 L
S
GR
GS
[0.75 0 0 0.75 0 0] CT
0.873 GC
1 LJ
0.667 LW
N
516 88 M
74 88 L
S
GR
GS
[0.75 0 0 0.75 0 0] CT
0.873 GC
1 LJ
0.667 LW
N
516 31 M
74 31 L
S
GR
GS
[0.75 0 0 0.75 0 0] CT
0.149 GC
2 setlinecap
1 LJ
0.667 LW
N
74 373 M
516 373 L
S
GR
GS
[0.75 0 0 0.75 0 0] CT
0.149 GC
2 setlinecap
1 LJ
0.667 LW
N
74 31 M
516 31 L
S
GR
GS
[0.75 0 0 0.75 0 0] CT
0.149 GC
2 setlinecap
1 LJ
0.667 LW
N
74 373 M
74 368.58 L
S
GR
GS
[0.75 0 0 0.75 0 0] CT
0.149 GC
2 setlinecap
1 LJ
0.667 LW
N
137.143 373 M
137.143 368.58 L
S
GR
GS
[0.75 0 0 0.75 0 0] CT
0.149 GC
2 setlinecap
1 LJ
0.667 LW
N
200.286 373 M
200.286 368.58 L
S
GR
GS
[0.75 0 0 0.75 0 0] CT
0.149 GC
2 setlinecap
1 LJ
0.667 LW
N
263.429 373 M
263.429 368.58 L
S
GR
GS
[0.75 0 0 0.75 0 0] CT
0.149 GC
2 setlinecap
1 LJ
0.667 LW
N
326.571 373 M
326.571 368.58 L
S
GR
GS
[0.75 0 0 0.75 0 0] CT
0.149 GC
2 setlinecap
1 LJ
0.667 LW
N
389.714 373 M
389.714 368.58 L
S
GR
GS
[0.75 0 0 0.75 0 0] CT
0.149 GC
2 setlinecap
1 LJ
0.667 LW
N
452.857 373 M
452.857 368.58 L
S
GR
GS
[0.75 0 0 0.75 0 0] CT
0.149 GC
2 setlinecap
1 LJ
0.667 LW
N
516 373 M
516 368.58 L
S
GR
GS
[0.75 0 0 0.75 0 0] CT
0.149 GC
2 setlinecap
1 LJ
0.667 LW
N
74 31 M
74 35.42 L
S
GR
GS
[0.75 0 0 0.75 0 0] CT
0.149 GC
2 setlinecap
1 LJ
0.667 LW
N
137.143 31 M
137.143 35.42 L
S
GR
GS
[0.75 0 0 0.75 0 0] CT
0.149 GC
2 setlinecap
1 LJ
0.667 LW
N
200.286 31 M
200.286 35.42 L
S
GR
GS
[0.75 0 0 0.75 0 0] CT
0.149 GC
2 setlinecap
1 LJ
0.667 LW
N
263.429 31 M
263.429 35.42 L
S
GR
GS
[0.75 0 0 0.75 0 0] CT
0.149 GC
2 setlinecap
1 LJ
0.667 LW
N
326.571 31 M
326.571 35.42 L
S
GR
GS
[0.75 0 0 0.75 0 0] CT
0.149 GC
2 setlinecap
1 LJ
0.667 LW
N
389.714 31 M
389.714 35.42 L
S
GR
GS
[0.75 0 0 0.75 0 0] CT
0.149 GC
2 setlinecap
1 LJ
0.667 LW
N
452.857 31 M
452.857 35.42 L
S
GR
GS
[0.75 0 0 0.75 0 0] CT
0.149 GC
2 setlinecap
1 LJ
0.667 LW
N
516 31 M
516 35.42 L
S
GR
GS
[0.75 0 0 0.75 55.5 283.74998] CT
0.149 GC
/Helvetica 13.333 F
GS
[1 0 0 1 0 0] CT
-4.5 13 moveto 
1 -1 scale
(0) t 
GR
GR
GS
[0.75 0 0 0.75 102.85714 283.74998] CT
0.149 GC
/Helvetica 13.333 F
GS
[1 0 0 1 0 0] CT
-13 13 moveto 
1 -1 scale
(100) t 
GR
GR
GS
[0.75 0 0 0.75 150.21429 283.74998] CT
0.149 GC
/Helvetica 13.333 F
GS
[1 0 0 1 0 0] CT
-13 13 moveto 
1 -1 scale
(200) t 
GR
GR
GS
[0.75 0 0 0.75 197.57142 283.74998] CT
0.149 GC
/Helvetica 13.333 F
GS
[1 0 0 1 0 0] CT
-13 13 moveto 
1 -1 scale
(300) t 
GR
GR
GS
[0.75 0 0 0.75 244.92858 283.74998] CT
0.149 GC
/Helvetica 13.333 F
GS
[1 0 0 1 0 0] CT
-13 13 moveto 
1 -1 scale
(400) t 
GR
GR
GS
[0.75 0 0 0.75 292.28572 283.74998] CT
0.149 GC
/Helvetica 13.333 F
GS
[1 0 0 1 0 0] CT
-13 13 moveto 
1 -1 scale
(500) t 
GR
GR
GS
[0.75 0 0 0.75 339.64286 283.74998] CT
0.149 GC
/Helvetica 13.333 F
GS
[1 0 0 1 0 0] CT
-13 13 moveto 
1 -1 scale
(600) t 
GR
GR
GS
[0.75 0 0 0.75 387 283.74998] CT
0.149 GC
/Helvetica 13.333 F
GS
[1 0 0 1 0 0] CT
-13 13 moveto 
1 -1 scale
(700) t 
GR
GR
GS
[0.75 0 0 0.75 221.25016 297.75] CT
0.149 GC
/Helvetica 18.667 F
GS
[1 0 0 1 0 0] CT
-24.5 18 moveto 
1 -1 scale
(s [m]) t 
GR
GR
GS
[0.75 0 0 0.75 0 0] CT
0.149 GC
2 setlinecap
1 LJ
0.667 LW
N
74 373 M
74 31 L
S
GR
GS
[0.75 0 0 0.75 0 0] CT
0.149 GC
2 setlinecap
1 LJ
0.667 LW
N
516 373 M
516 31 L
S
GR
GS
[0.75 0 0 0.75 0 0] CT
0.149 GC
2 setlinecap
1 LJ
0.667 LW
N
74 373 M
78.42 373 L
S
GR
GS
[0.75 0 0 0.75 0 0] CT
0.149 GC
2 setlinecap
1 LJ
0.667 LW
N
74 316 M
78.42 316 L
S
GR
GS
[0.75 0 0 0.75 0 0] CT
0.149 GC
2 setlinecap
1 LJ
0.667 LW
N
74 259 M
78.42 259 L
S
GR
GS
[0.75 0 0 0.75 0 0] CT
0.149 GC
2 setlinecap
1 LJ
0.667 LW
N
74 202 M
78.42 202 L
S
GR
GS
[0.75 0 0 0.75 0 0] CT
0.149 GC
2 setlinecap
1 LJ
0.667 LW
N
74 145 M
78.42 145 L
S
GR
GS
[0.75 0 0 0.75 0 0] CT
0.149 GC
2 setlinecap
1 LJ
0.667 LW
N
74 88 M
78.42 88 L
S
GR
GS
[0.75 0 0 0.75 0 0] CT
0.149 GC
2 setlinecap
1 LJ
0.667 LW
N
74 31 M
78.42 31 L
S
GR
GS
[0.75 0 0 0.75 0 0] CT
0.149 GC
2 setlinecap
1 LJ
0.667 LW
N
516 373 M
511.58 373 L
S
GR
GS
[0.75 0 0 0.75 0 0] CT
0.149 GC
2 setlinecap
1 LJ
0.667 LW
N
516 316 M
511.58 316 L
S
GR
GS
[0.75 0 0 0.75 0 0] CT
0.149 GC
2 setlinecap
1 LJ
0.667 LW
N
516 259 M
511.58 259 L
S
GR
GS
[0.75 0 0 0.75 0 0] CT
0.149 GC
2 setlinecap
1 LJ
0.667 LW
N
516 202 M
511.58 202 L
S
GR
GS
[0.75 0 0 0.75 0 0] CT
0.149 GC
2 setlinecap
1 LJ
0.667 LW
N
516 145 M
511.58 145 L
S
GR
GS
[0.75 0 0 0.75 0 0] CT
0.149 GC
2 setlinecap
1 LJ
0.667 LW
N
516 88 M
511.58 88 L
S
GR
GS
[0.75 0 0 0.75 0 0] CT
0.149 GC
2 setlinecap
1 LJ
0.667 LW
N
516 31 M
511.58 31 L
S
GR
GS
[0.75 0 0 0.75 51.5 279.75] CT
0.149 GC
/Helvetica 13.333 F
GS
[1 0 0 1 0 0] CT
-26 4.5 moveto 
1 -1 scale
(190) t 
GR
GR
GS
[0.75 0 0 0.75 51.5 237] CT
0.149 GC
/Helvetica 13.333 F
GS
[1 0 0 1 0 0] CT
-26 4.5 moveto 
1 -1 scale
(200) t 
GR
GR
GS
[0.75 0 0 0.75 51.5 194.25] CT
0.149 GC
/Helvetica 13.333 F
GS
[1 0 0 1 0 0] CT
-26 4.5 moveto 
1 -1 scale
(210) t 
GR
GR
GS
[0.75 0 0 0.75 51.5 151.5] CT
0.149 GC
/Helvetica 13.333 F
GS
[1 0 0 1 0 0] CT
-26 4.5 moveto 
1 -1 scale
(220) t 
GR
GR
GS
[0.75 0 0 0.75 51.5 108.75] CT
0.149 GC
/Helvetica 13.333 F
GS
[1 0 0 1 0 0] CT
-26 4.5 moveto 
1 -1 scale
(230) t 
GR
GR
GS
[0.75 0 0 0.75 51.5 66] CT
0.149 GC
/Helvetica 13.333 F
GS
[1 0 0 1 0 0] CT
-26 4.5 moveto 
1 -1 scale
(240) t 
GR
GR
GS
[0.75 0 0 0.75 51.5 23.25] CT
0.149 GC
/Helvetica 13.333 F
GS
[1 0 0 1 0 0] CT
-26 4.5 moveto 
1 -1 scale
(250) t 
GR
GR
GS
[0 -0.75 0.75 0 29 151.49987] CT
0.149 GC
N
-45.938 -15.391 M
-44.125 -15.391 L
-40.875 -6.672 L
-37.625 -15.391 L
-35.828 -15.391 L
-39.719 -5 L
-42.031 -5 L
-45.938 -15.391 L
cp
-29.35 -4.031 M
-30.069 -2.172 -30.756 -1.609 QT
-31.444 -1.047 -32.6 -1.047 QT
-33.959 -1.047 L
-33.959 -2.469 L
-32.959 -2.469 L
-32.256 -2.469 -31.866 -2.805 QT
-31.475 -3.141 -30.991 -4.391 QT
-30.694 -5.172 L
-34.897 -15.391 L
-33.084 -15.391 L
-29.834 -7.266 L
-26.584 -15.391 L
-24.787 -15.391 L
-29.35 -4.031 L
cp
-28.412 -20.203 M
-26.569 -20.203 L
-29.6 -16.703 L
-31.022 -16.703 L
-28.412 -20.203 L
cp
-15.997 -15.078 M
-15.997 -13.469 L
-16.731 -13.844 -17.512 -14.031 QT
-18.294 -14.219 -19.122 -14.219 QT
-20.387 -14.219 -21.028 -13.828 QT
-21.669 -13.438 -21.669 -12.656 QT
-21.669 -12.063 -21.208 -11.727 QT
-20.747 -11.391 -19.387 -11.078 QT
-18.794 -10.953 L
-16.981 -10.563 -16.215 -9.852 QT
-15.45 -9.141 -15.45 -7.859 QT
-15.45 -6.422 -16.59 -5.578 QT
-17.731 -4.734 -19.747 -4.734 QT
-20.575 -4.734 -21.481 -4.898 QT
-22.387 -5.063 -23.387 -5.375 QT
-23.387 -7.141 L
-22.45 -6.656 -21.528 -6.406 QT
-20.606 -6.156 -19.7 -6.156 QT
-18.497 -6.156 -17.848 -6.57 QT
-17.2 -6.984 -17.2 -7.734 QT
-17.2 -8.438 -17.669 -8.805 QT
-18.137 -9.172 -19.731 -9.516 QT
-20.325 -9.656 L
-21.903 -9.984 -22.606 -10.68 QT
-23.309 -11.375 -23.309 -12.578 QT
-23.309 -14.047 -22.27 -14.844 QT
-21.231 -15.641 -19.325 -15.641 QT
-18.372 -15.641 -17.544 -15.5 QT
-16.715 -15.359 -15.997 -15.078 QT
cp
-20.059 -16.703 M
-22.325 -20.203 L
-21.044 -20.203 L
-19.372 -17.922 L
-17.7 -20.203 L
-16.403 -20.203 L
-18.684 -16.703 L
-20.059 -16.703 L
cp
-12.98 -19.438 M
-11.261 -19.438 L
-11.261 -10.906 L
-6.167 -15.391 L
-3.98 -15.391 L
-9.496 -10.531 L
-3.746 -5 L
-5.98 -5 L
-11.261 -10.078 L
-11.261 -5 L
-12.98 -5 L
-12.98 -19.438 L
cp
2.621 -10.219 M
0.543 -10.219 -0.254 -9.75 QT
-1.051 -9.281 -1.051 -8.141 QT
-1.051 -7.234 -0.45 -6.695 QT
0.152 -6.156 1.183 -6.156 QT
2.605 -6.156 3.457 -7.164 QT
4.308 -8.172 4.308 -9.844 QT
4.308 -10.219 L
2.621 -10.219 L
cp
6.027 -10.922 M
6.027 -5 L
4.308 -5 L
4.308 -6.578 L
3.73 -5.625 2.855 -5.18 QT
1.98 -4.734 0.73 -4.734 QT
-0.864 -4.734 -1.809 -5.625 QT
-2.754 -6.516 -2.754 -8.031 QT
-2.754 -9.781 -1.582 -10.672 QT
-0.411 -11.563 1.918 -11.563 QT
4.308 -11.563 L
4.308 -11.719 L
4.308 -12.906 3.535 -13.547 QT
2.761 -14.188 1.371 -14.188 QT
0.48 -14.188 -0.364 -13.977 QT
-1.207 -13.766 -1.989 -13.344 QT
-1.989 -14.922 L
-1.051 -15.281 -0.168 -15.461 QT
0.714 -15.641 1.543 -15.641 QT
3.793 -15.641 4.91 -14.469 QT
6.027 -13.297 6.027 -10.922 QT
cp
15.108 -19.438 M
19.03 -19.438 L
19.03 -18.109 L
16.812 -18.109 L
16.812 -3.828 L
19.03 -3.828 L
19.03 -2.5 L
15.108 -2.5 L
15.108 -19.438 L
cp
30.621 -13.391 M
31.262 -14.547 32.153 -15.094 QT
33.043 -15.641 34.262 -15.641 QT
35.871 -15.641 36.754 -14.508 QT
37.637 -13.375 37.637 -11.266 QT
37.637 -5 L
35.918 -5 L
35.918 -11.219 L
35.918 -12.703 35.395 -13.43 QT
34.871 -14.156 33.778 -14.156 QT
32.449 -14.156 31.684 -13.273 QT
30.918 -12.391 30.918 -10.875 QT
30.918 -5 L
29.199 -5 L
29.199 -11.219 L
29.199 -12.719 28.668 -13.438 QT
28.137 -14.156 27.043 -14.156 QT
25.731 -14.156 24.957 -13.273 QT
24.184 -12.391 24.184 -10.875 QT
24.184 -5 L
22.465 -5 L
22.465 -15.391 L
24.184 -15.391 L
24.184 -13.781 L
24.778 -14.734 25.59 -15.188 QT
26.403 -15.641 27.528 -15.641 QT
28.653 -15.641 29.449 -15.063 QT
30.246 -14.484 30.621 -13.391 QT
cp
44.701 -19.438 M
44.701 -2.5 L
40.764 -2.5 L
40.764 -3.828 L
42.982 -3.828 L
42.982 -18.109 L
40.764 -18.109 L
40.764 -19.438 L
44.701 -19.438 L
cp
f
GR
GS
[0.75 0 0 0.75 0 0] CT
0 0 1 RC
1 LJ
2 LW
N
74.631 56.901 M
75.263 64.687 L
75.894 67.298 L
76.526 65.474 L
77.157 68.859 L
77.789 68.096 L
78.42 64.436 L
79.051 64.921 L
79.683 65.947 L
80.314 66.169 L
80.946 65.884 L
81.577 68.637 L
82.209 67.611 L
82.84 66.938 L
83.471 66.511 L
84.103 70.376 L
84.734 69.013 L
85.366 124.355 L
85.997 113.342 L
86.629 109.649 L
87.26 102.472 L
87.891 92.007 L
88.523 98.927 L
89.154 125.113 L
89.786 105.419 L
90.417 106.023 L
91.049 95.917 L
91.68 208.122 L
92.311 207.586 L
92.943 201.493 L
93.574 200.364 L
94.206 197.736 L
94.837 194.829 L
95.469 190.537 L
96.1 187.773 L
96.731 182.05 L
97.363 173.62 L
97.994 161.496 L
98.626 143.353 L
99.257 137.288 L
99.889 302.024 L
100.52 322.777 L
101.151 297.31 L
101.783 277.639 L
102.414 269.898 L
103.046 268.377 L
103.677 263.919 L
104.309 263.566 L
104.94 249.857 L
105.571 240.988 L
106.203 239.324 L
106.834 232.9 L
107.466 224.224 L
108.097 222.799 L
108.729 210.607 L
109.36 298.022 L
109.991 301.089 L
110.623 300.604 L
111.254 301.174 L
111.886 302.115 L
112.517 302.594 L
113.149 304.446 L
113.78 314.073 L
114.411 316.701 L
115.043 318.576 L
115.674 300.752 L
116.306 297.982 L
116.937 271.244 L
117.569 291.809 L
118.2 301.157 L
118.831 301.676 L
119.463 301.402 L
120.094 300.855 L
120.726 310.254 L
121.357 303.141 L
121.989 301.858 L
122.62 296.358 L
123.251 322.521 L
123.883 317.265 L
124.514 317.283 L
125.146 317.34 L
125.777 317.505 L
126.409 315.84 L
127.04 322.983 L
127.671 323.211 L
128.303 323.273 L
128.934 323.114 L
129.566 323.165 L
130.197 322.886 L
130.829 322.897 L
131.46 300.861 L
132.091 300.621 L
132.723 301.391 L
133.354 301.847 L
133.986 302.229 L
134.617 302.816 L
135.249 319.694 L
135.88 241.558 L
136.511 297.401 L
137.143 295.406 L
137.774 296.438 L
138.406 316.998 L
139.037 306.458 L
139.669 305.797 L
140.3 306.971 L
140.931 312.124 L
141.563 322.851 L
142.194 330.039 L
142.826 331.624 L
143.457 332.986 L
144.089 347.726 L
144.72 338.697 L
145.351 347.202 L
145.983 347.721 L
146.614 347.749 L
147.246 348.177 L
147.877 340.715 L
148.509 347.897 L
149.14 347.481 L
149.771 321.079 L
150.403 316.923 L
151.034 346.102 L
151.666 348.501 L
152.297 319.602 L
152.929 338.492 L
153.56 320.241 L
154.191 321.016 L
154.823 306.048 L
155.454 306.059 L
156.086 317.06 L
156.717 330.096 L
157.349 332.37 L
157.98 330.398 L
158.611 330.558 L
159.243 335.34 L
159.874 333.294 L
160.506 332.268 L
161.137 332.199 L
161.769 330.831 L
162.4 318.371 L
163.031 306.84 L
163.663 329.446 L
164.294 316.872 L
164.926 347.709 L
165.557 346.979 L
166.189 348.365 L
166.82 348.131 L
167.451 348.205 L
168.083 347.487 L
168.714 346.495 L
169.346 348.883 L
169.977 348.365 L
170.609 320.987 L
171.24 322.498 L
171.871 337.911 L
172.503 338.68 L
173.134 338.583 L
173.766 330.723 L
174.397 331.857 L
175.029 348.239 L
175.66 334.029 L
176.291 336.184 L
176.923 319.032 L
177.554 321.164 L
178.186 298.678 L
178.817 298.683 L
179.449 299.516 L
180.08 300.268 L
180.711 299.151 L
181.343 300.661 L
181.974 299.852 L
182.606 299.618 L
183.237 299.065 L
183.869 298.467 L
184.5 347.988 L
185.131 345.811 L
185.763 347.293 L
186.394 344.597 L
187.026 327.902 L
187.657 357.507 L
188.289 358.442 L
188.92 339.518 L
189.551 330.723 L
190.183 362.073 L
190.814 362.187 L
191.446 361.754 L
192.077 361.03 L
192.709 361.902 L
193.34 362.005 L
193.971 361.668 L
194.603 361.577 L
195.234 361.589 L
195.866 361.463 L
196.497 360.107 L
197.129 358.727 L
197.76 357.998 L
198.391 355.017 L
199.023 351.232 L
199.654 359.143 L
200.286 359.331 L
200.917 361.999 L
201.549 361.845 L
202.18 361.241 L
202.811 359.89 L
203.443 355.461 L
204.074 361.366 L
204.706 362.033 L
205.337 352.531 L
205.969 361.742 L
206.6 361.948 L
207.231 361.463 L
207.863 337.221 L
208.494 362.142 L
209.126 336.742 L
209.757 327.645 L
210.389 328.346 L
211.02 328.683 L
211.651 328.99 L
212.283 329.344 L
212.914 329.726 L
213.546 329.954 L
214.177 330.792 L
214.809 329.452 L
215.44 328.683 L
216.071 328.551 L
216.703 328.711 L
217.334 344.534 L
217.966 344.796 L
218.597 345.532 L
219.229 347.954 L
219.86 325.747 L
220.491 345.936 L
221.123 345.116 L
221.754 346.506 L
222.386 344.318 L
223.017 344.705 L
223.649 345.765 L
224.28 342.784 L
224.911 343.2 L
225.543 321.592 L
226.174 340.425 L
226.806 343.52 L
227.437 343.451 L
228.069 343.542 L
228.7 343.388 L
229.331 343.406 L
229.963 338.315 L
230.594 338.823 L
231.226 338.002 L
231.857 342.841 L
232.489 343.582 L
233.12 340.145 L
233.751 337.985 L
234.383 339.017 L
235.014 350.622 L
235.646 350.434 L
236.277 350.918 L
236.909 351.22 L
237.54 350.593 L
238.171 349.995 L
238.803 349.658 L
239.434 349.704 L
240.066 349.408 L
240.697 349.499 L
241.329 349.607 L
241.96 349.088 L
242.591 348.781 L
243.223 349.054 L
243.854 349.413 L
244.486 350.491 L
245.117 349.305 L
245.749 349.624 L
246.38 349.18 L
247.011 351.614 L
247.643 350.627 L
248.274 349.436 L
248.906 354.213 L
249.537 349.658 L
250.169 349.527 L
250.8 349.197 L
251.431 349.499 L
252.063 349.584 L
252.694 349.704 L
253.326 349.63 L
253.957 349.59 L
254.589 349.533 L
255.22 349.55 L
255.851 349.647 L
256.483 349.083 L
257.114 350.36 L
257.746 350.046 L
258.377 349.795 L
259.009 349.522 L
259.64 349.636 L
260.271 351.015 L
260.903 350.713 L
261.534 350.627 L
262.166 351.163 L
262.797 350.764 L
263.429 350.878 L
264.06 351.106 L
264.691 350.998 L
265.323 351.614 L
265.954 350.548 L
266.586 333.134 L
267.217 341.433 L
267.849 340.692 L
268.48 340.065 L
269.111 339.569 L
269.743 338.429 L
270.374 338.019 L
271.006 337.255 L
271.637 334.291 L
272.269 335.163 L
272.9 338.994 L
273.531 306.139 L
274.163 306.025 L
274.794 342.972 L
275.426 342.562 L
276.057 341.901 L
276.689 315.647 L
277.32 342.938 L
277.951 341.148 L
278.583 339.575 L
279.214 341.445 L
279.846 340.738 L
280.477 338.829 L
281.109 334.451 L
281.74 333.317 L
282.371 333.089 L
283.003 335.448 L
283.634 334.086 L
284.266 337.432 L
284.897 339.854 L
285.529 341.462 L
286.16 342.26 L
286.791 343.953 L
287.423 333.305 L
288.054 333.522 L
288.686 334.177 L
289.317 334.947 L
289.949 334.753 L
290.58 334.405 L
291.211 334.354 L
291.843 340.938 L
292.474 335.027 L
293.106 342.813 L
293.737 332.621 L
294.369 332.365 L
295 334.645 L
295.631 336.611 L
296.263 332.752 L
296.894 332.735 L
297.526 334.063 L
298.157 333.203 L
298.789 333.966 L
299.42 334.063 L
300.051 334.269 L
300.683 332.245 L
301.314 333.14 L
301.946 332.342 L
302.577 332.633 L
303.209 332.655 L
303.84 332.279 L
304.471 333.944 L
305.103 334.023 L
305.734 334.115 L
306.366 332.564 L
306.997 332.365 L
307.629 332.439 L
308.26 332.667 L
308.891 332.695 L
309.523 332.735 L
310.154 302.109 L
310.786 338.008 L
311.417 331.988 L
312.049 333.431 L
312.68 334.776 L
313.311 335.927 L
313.943 338.008 L
314.574 338.184 L
315.206 331.202 L
315.837 337.284 L
316.469 307.974 L
317.1 307.969 L
317.731 307.085 L
318.363 306.048 L
318.994 305.666 L
319.626 308.128 L
320.257 312.363 L
320.889 314.108 L
321.52 311.024 L
322.151 312.979 L
322.783 315.208 L
323.414 306.641 L
324.046 308.106 L
324.677 311.645 L
325.309 305.643 L
325.94 305.181 L
326.571 305.045 L
327.203 304.383 L
327.834 302.941 L
328.466 298.484 L
329.097 297.458 L
329.729 303.255 L
330.36 305.102 L
330.991 302.189 L
331.623 300.867 L
332.254 300 L
332.886 299.117 L
333.517 297.179 L
334.149 324.408 L
334.78 329.583 L
335.411 321.911 L
336.043 328.34 L
336.674 296.626 L
337.306 296.221 L
337.937 295.571 L
338.569 290.082 L
339.2 288.982 L
339.831 286.873 L
340.463 290.669 L
341.094 289.455 L
341.726 286.349 L
342.357 287.836 L
342.989 296.717 L
343.62 280.746 L
344.251 280.768 L
344.883 274.572 L
345.514 259.154 L
346.146 256.959 L
346.777 275.348 L
347.409 275.587 L
348.04 276.716 L
348.671 274.242 L
349.303 259.952 L
349.934 269.938 L
350.566 276.294 L
351.197 281.407 L
351.829 281.241 L
352.46 233.96 L
353.091 233.407 L
353.723 232.66 L
354.354 232.233 L
354.986 232.09 L
355.617 231.834 L
356.249 236.548 L
356.88 231.338 L
357.511 226.675 L
358.143 219.032 L
358.774 217.812 L
359.406 199.047 L
360.037 211.701 L
360.669 229.588 L
361.3 198.329 L
361.931 223.022 L
362.563 226.567 L
363.194 224.806 L
363.826 216.239 L
364.457 197.93 L
365.089 198.728 L
365.72 216.626 L
366.351 198.95 L
366.983 220.747 L
367.614 216.854 L
368.246 217.27 L
368.877 217.664 L
369.509 219.294 L
370.14 223.193 L
370.771 227 L
371.403 229.388 L
372.034 232.957 L
372.666 232.66 L
373.297 230.95 L
373.929 217.407 L
374.56 216.86 L
375.191 218.393 L
375.823 223.489 L
376.454 226.345 L
377.086 223.54 L
377.717 223.17 L
378.349 223.187 L
378.98 222.201 L
379.611 221.996 L
380.243 216.7 L
380.874 215.19 L
381.506 213.805 L
382.137 214.221 L
382.769 212.961 L
383.4 211.559 L
384.031 208.846 L
384.663 204.337 L
385.294 203.619 L
385.926 217.39 L
386.557 215.959 L
387.189 214.762 L
387.82 222.44 L
388.451 217.248 L
389.083 209.826 L
389.714 207.643 L
390.346 206.566 L
390.977 199.714 L
391.609 198.797 L
392.24 198.016 L
392.871 197.366 L
393.503 197.315 L
394.134 195.61 L
394.766 193.319 L
395.397 187.494 L
396.029 194.567 L
396.66 196.471 L
397.291 196.785 L
397.923 196.032 L
398.554 195.097 L
399.186 194.624 L
399.817 193.741 L
400.449 192.413 L
401.08 191.187 L
401.711 191.9 L
402.343 135.27 L
402.974 121.328 L
403.606 128.954 L
404.237 128.082 L
404.869 127.871 L
405.5 127.49 L
406.131 127.205 L
406.763 126.714 L
407.394 126.635 L
408.026 122.046 L
408.657 129.661 L
409.289 126.874 L
409.92 138.434 L
410.551 128.453 L
411.183 137.316 L
411.814 135.612 L
412.446 126.8 L
413.077 132.397 L
413.709 130.608 L
414.34 136.558 L
414.971 133.566 L
415.603 132.927 L
416.234 127.82 L
416.866 127.644 L
417.497 129.24 L
418.129 132.648 L
418.76 139.431 L
419.391 138.439 L
420.023 134.723 L
420.654 138.912 L
421.286 127.353 L
421.917 127.302 L
422.549 143.746 L
423.18 167.6 L
423.811 165.195 L
424.443 163.742 L
425.074 163.023 L
425.706 161.513 L
426.337 159.119 L
426.969 149.97 L
427.6 146.311 L
428.231 143.706 L
428.863 143.427 L
429.494 142.652 L
430.126 162.242 L
430.757 160.419 L
431.389 151.293 L
432.02 144.253 L
432.651 148.317 L
433.283 149.229 L
433.914 145.952 L
434.546 147.873 L
435.177 148.973 L
435.809 147.725 L
436.44 146.254 L
437.071 136.484 L
437.703 126.902 L
438.334 136.843 L
438.966 133.896 L
439.597 124.503 L
440.229 139.021 L
440.86 136.866 L
441.491 132.682 L
442.123 133.047 L
442.754 133.087 L
443.386 124.805 L
444.017 121.744 L
444.649 101.435 L
445.28 84.346 L
445.911 83.571 L
446.543 109.05 L
447.174 107.859 L
447.806 119.618 L
448.437 98.693 L
449.069 86.689 L
449.7 86.13 L
450.331 123.619 L
450.963 120.826 L
451.594 122.679 L
452.226 104.655 L
452.857 96.721 L
453.489 91.568 L
454.12 108.224 L
454.751 107.916 L
455.383 108.269 L
456.014 109.044 L
456.646 108.429 L
457.277 108.708 L
457.909 108.754 L
458.54 108.537 L
459.171 108.56 L
459.803 96.966 L
460.434 97.929 L
461.066 105.744 L
461.697 110.384 L
462.329 107.272 L
462.96 108.526 L
463.591 107.574 L
464.223 109.375 L
464.854 108.492 L
465.486 107.984 L
466.117 102.005 L
466.749 98.505 L
467.38 98.511 L
468.011 97.986 L
468.643 98.648 L
469.274 102.056 L
469.906 97.764 L
470.537 97.878 L
471.169 97.508 L
471.8 98.169 L
472.431 98.915 L
473.063 100.318 L
473.694 98.078 L
474.326 107.175 L
474.957 106.303 L
475.589 104.638 L
476.22 102.871 L
476.851 109.928 L
477.483 109.489 L
478.114 107.448 L
478.746 107.716 L
S
GR
GS
[0.75 0 0 0.75 0 0] CT
1 0 0 RC
1 LJ
2 LW
N
74.631 56.901 M
75.263 56.615 L
75.894 57.075 L
76.526 58.233 L
77.157 60.636 L
77.789 62.035 L
78.42 61.559 L
79.051 60.208 L
79.683 60.077 L
80.314 60.32 L
80.946 60.503 L
81.577 61.994 L
82.209 61.957 L
82.84 61.645 L
83.471 61.455 L
84.103 64.688 L
84.734 65.606 L
85.366 68.289 L
85.997 76.173 L
86.629 82.559 L
87.26 87.273 L
87.891 91.402 L
88.523 94.048 L
89.154 92.7 L
89.786 96.363 L
90.417 98.027 L
91.049 99.101 L
91.68 111.165 L
92.311 120.769 L
92.943 133.862 L
93.574 144.95 L
94.206 154.856 L
94.837 163.344 L
95.469 170.899 L
96.1 177.539 L
96.731 181.734 L
97.363 185.123 L
97.994 185.088 L
98.626 179.369 L
99.257 167.962 L
99.889 182.26 L
100.52 209.202 L
101.151 219.641 L
101.783 228.574 L
102.414 232.876 L
103.046 238.185 L
103.677 237.438 L
104.309 235.411 L
104.94 233.665 L
105.571 229.28 L
106.203 227.004 L
106.834 228.086 L
107.466 228.775 L
108.097 228.649 L
108.729 219.83 L
109.36 228.194 L
109.991 233.876 L
110.623 240.386 L
111.254 249.384 L
111.886 257.047 L
112.517 262.387 L
113.149 267.273 L
113.78 276.896 L
114.411 285.129 L
115.043 292.458 L
115.674 288.568 L
116.306 284.31 L
116.937 282.173 L
117.569 276.81 L
118.2 270.75 L
118.831 270.56 L
119.463 271.262 L
120.094 275.289 L
120.726 281.963 L
121.357 283.85 L
121.989 285.502 L
122.62 284.41 L
123.251 293.579 L
123.883 300.031 L
124.514 305.529 L
125.146 308.952 L
125.777 312.206 L
126.409 311.152 L
127.04 312.894 L
127.671 313.762 L
128.303 314.136 L
128.934 314.377 L
129.566 314.576 L
130.197 314.683 L
130.829 314.809 L
131.46 302.824 L
132.091 294.636 L
132.723 295.307 L
133.354 295.969 L
133.986 296.646 L
134.617 297.53 L
135.249 304.762 L
135.88 293.652 L
136.511 292.511 L
137.143 291.855 L
137.774 292.141 L
138.406 299.288 L
139.037 300.646 L
139.669 303.281 L
140.3 304.757 L
140.931 307.012 L
141.563 311.539 L
142.194 310.062 L
142.826 308.743 L
143.457 308.864 L
144.089 311.094 L
144.72 312.509 L
145.351 313.413 L
145.983 315.675 L
146.614 318.183 L
147.246 320.812 L
147.877 318.61 L
148.509 322.561 L
149.14 325.226 L
149.771 325.142 L
150.403 324.283 L
151.034 324.241 L
151.666 326.851 L
152.297 326.8 L
152.929 328.238 L
153.56 327.95 L
154.191 327.779 L
154.823 328.406 L
155.454 328.159 L
156.086 331.26 L
156.717 328.089 L
157.349 325.836 L
157.98 323.321 L
158.611 322.174 L
159.243 321.269 L
159.874 322.923 L
160.506 323.911 L
161.137 324.714 L
161.769 325.208 L
162.4 325.212 L
163.031 324.292 L
163.663 323.757 L
164.294 328.483 L
164.926 329.124 L
165.557 329.427 L
166.189 330.157 L
166.82 330.591 L
167.451 331.148 L
168.083 331.91 L
168.714 330.781 L
169.346 332.758 L
169.977 333.985 L
170.609 331.126 L
171.24 334.951 L
171.871 333.359 L
172.503 333.566 L
173.134 333.479 L
173.766 331.856 L
174.397 331.105 L
175.029 332.757 L
175.66 332.945 L
176.291 332.165 L
176.923 331.514 L
177.554 330.455 L
178.186 328.214 L
178.817 326.211 L
179.449 324.233 L
180.08 321.909 L
180.711 321.117 L
181.343 318.977 L
181.974 318.826 L
182.606 318.681 L
183.237 318.411 L
183.869 317.791 L
184.5 317.862 L
185.131 323.74 L
185.763 325.369 L
186.394 330.229 L
187.026 330.728 L
187.657 332.611 L
188.289 334.511 L
188.92 331.988 L
189.551 332.596 L
190.183 333.024 L
190.814 333.68 L
191.446 333.272 L
192.077 334.136 L
192.709 335.581 L
193.34 336.99 L
193.971 338.647 L
194.603 340.261 L
195.234 341.696 L
195.866 343.106 L
196.497 348.882 L
197.129 354.367 L
197.76 358.325 L
198.391 358.44 L
199.023 352.562 L
199.654 355.532 L
200.286 357.129 L
200.917 361.434 L
201.549 359.686 L
202.18 360.228 L
202.811 365.541 L
203.443 361.586 L
204.074 351.286 L
204.706 351.159 L
205.337 350.178 L
205.969 351.099 L
206.6 347.723 L
207.231 345.5 L
207.863 342.524 L
208.494 345.38 L
209.126 342.627 L
209.757 339.536 L
210.389 334.953 L
211.02 333.943 L
211.651 333.268 L
212.283 332.77 L
212.914 332.481 L
213.546 332.314 L
214.177 332.422 L
214.809 332.226 L
215.44 331.89 L
216.071 330.416 L
216.703 329.885 L
217.334 336.313 L
217.966 340.62 L
218.597 344.257 L
219.229 349.083 L
219.86 342.989 L
220.491 345.736 L
221.123 346.968 L
221.754 350.273 L
222.386 346.983 L
223.017 346.276 L
223.649 347.663 L
224.28 340.808 L
224.911 335.937 L
225.543 330.364 L
226.174 333.923 L
226.806 332.971 L
227.437 332.795 L
228.069 332.573 L
228.7 332.901 L
229.331 333.679 L
229.963 337.134 L
230.594 342.386 L
231.226 346.251 L
231.857 342.802 L
232.489 339.634 L
233.12 337.004 L
233.751 342.388 L
234.383 338.53 L
235.014 345.229 L
235.646 349.955 L
236.277 353.337 L
236.909 353.326 L
237.54 356.088 L
238.171 357.613 L
238.803 356.24 L
239.434 353.082 L
240.066 341.25 L
240.697 337.344 L
241.329 334.523 L
241.96 332.586 L
242.591 332.283 L
243.223 332.873 L
243.854 333.91 L
244.486 335.487 L
245.117 336.604 L
245.749 337.78 L
246.38 339.1 L
247.011 340.855 L
247.643 348.753 L
248.274 348.607 L
248.906 356.986 L
249.537 358.378 L
250.169 356.752 L
250.8 350.505 L
251.431 343.682 L
252.063 352.406 L
252.694 354.769 L
253.326 354.072 L
253.957 351.278 L
254.589 346.092 L
255.22 345.339 L
255.851 344.512 L
256.483 344.509 L
257.114 345.21 L
257.746 345.734 L
258.377 345.962 L
259.009 346.091 L
259.64 351.479 L
260.271 357.162 L
260.903 361.011 L
261.534 363.581 L
262.166 365.215 L
262.797 365.658 L
263.429 365.184 L
264.06 362.284 L
264.691 359.969 L
265.323 352.134 L
265.954 351.382 L
266.586 341.711 L
267.217 342.955 L
267.849 343.559 L
268.48 343.626 L
269.111 339.803 L
269.743 340.389 L
270.374 340.617 L
271.006 337.955 L
271.637 335.547 L
272.269 329.89 L
272.9 334.64 L
273.531 326.544 L
274.163 320.897 L
274.794 321.417 L
275.426 320.982 L
276.057 324.399 L
276.689 322.92 L
277.32 324.535 L
277.951 327.634 L
278.583 329.897 L
279.214 331.87 L
279.846 333.729 L
280.477 334.533 L
281.109 334.022 L
281.74 333.521 L
282.371 333.072 L
283.003 332.97 L
283.634 332.76 L
284.266 338.822 L
284.897 338.445 L
285.529 336.281 L
286.16 331.458 L
286.791 332.124 L
287.423 332.991 L
288.054 333.445 L
288.686 333.817 L
289.317 334.188 L
289.949 335.629 L
290.58 336.933 L
291.211 337.52 L
291.843 342.637 L
292.474 338.177 L
293.106 340.785 L
293.737 334.964 L
294.369 329.827 L
295 328.584 L
295.631 330.289 L
296.263 327.942 L
296.894 326.384 L
297.526 326.69 L
298.157 326.279 L
298.789 329.366 L
299.42 331.425 L
300.051 332.843 L
300.683 330.31 L
301.314 329.269 L
301.946 327.553 L
302.577 327.083 L
303.209 327.148 L
303.84 327.274 L
304.471 330.72 L
305.103 333.009 L
305.734 334.283 L
306.366 332.141 L
306.997 329.722 L
307.629 328.257 L
308.26 328.141 L
308.891 327.293 L
309.523 327.269 L
310.154 324.069 L
310.786 334.425 L
311.417 341.291 L
312.049 346.216 L
312.68 349.959 L
313.311 352.728 L
313.943 354.464 L
314.574 352.148 L
315.206 350.593 L
315.837 349.877 L
316.469 333.676 L
317.1 324.117 L
317.731 314.096 L
318.363 309.857 L
318.994 308.415 L
319.626 304.557 L
320.257 302.116 L
320.889 301.948 L
321.52 299.858 L
322.151 301.37 L
322.783 304.17 L
323.414 304.204 L
324.046 305.35 L
324.677 305.44 L
325.309 307.921 L
325.94 311.138 L
326.571 312.911 L
327.203 313.708 L
327.834 313.174 L
328.466 309.943 L
329.097 306.563 L
329.729 300.183 L
330.36 304.186 L
330.991 305.559 L
331.623 305.92 L
332.254 305.533 L
332.886 304.613 L
333.517 302.669 L
334.149 312.668 L
334.78 321.676 L
335.411 324.653 L
336.043 329.638 L
336.674 321.629 L
337.306 313.093 L
337.937 304.879 L
338.569 293.92 L
339.2 286.615 L
339.831 282.321 L
340.463 280.853 L
341.094 279.862 L
341.726 279.438 L
342.357 279.6 L
342.989 284.405 L
343.62 285.586 L
344.251 286.336 L
344.883 283.411 L
345.514 277.212 L
346.146 272.11 L
346.777 271 L
347.409 270.664 L
348.04 270.846 L
348.671 273.163 L
349.303 271.108 L
349.934 271.246 L
350.566 270.61 L
351.197 275.452 L
351.829 278.796 L
352.46 274.784 L
353.091 269.947 L
353.723 260.53 L
354.354 257.655 L
354.986 255.943 L
355.617 254.319 L
356.249 256.246 L
356.88 252.052 L
357.511 249.704 L
358.143 246.408 L
358.774 240.932 L
359.406 230.441 L
360.037 227.48 L
360.669 227.639 L
361.3 222.529 L
361.931 228.523 L
362.563 228.938 L
363.194 230.791 L
363.826 224.574 L
364.457 214.499 L
365.089 205.059 L
365.72 205.098 L
366.351 203.485 L
366.983 208.641 L
367.614 205.003 L
368.246 205.767 L
368.877 207.215 L
369.509 209.346 L
370.14 219.462 L
370.771 228.285 L
371.403 234.604 L
372.034 239.836 L
372.666 243.754 L
373.297 246.356 L
373.929 239.194 L
374.56 226.799 L
375.191 215.494 L
375.823 217.999 L
376.454 215.995 L
377.086 214.245 L
377.717 213.209 L
378.349 213.052 L
378.98 213.446 L
379.611 214.1 L
380.243 206.004 L
380.874 204.003 L
381.506 203.791 L
382.137 204.121 L
382.769 204.395 L
383.4 205.013 L
384.031 208.391 L
384.663 214.913 L
385.294 219.467 L
385.926 214.403 L
386.557 210.499 L
387.189 206.638 L
387.82 209.19 L
388.451 203.419 L
389.083 203.389 L
389.714 208.255 L
390.346 212.425 L
390.977 214.449 L
391.609 214.034 L
392.24 211.751 L
392.871 208.372 L
393.503 205.041 L
394.134 198.515 L
394.766 196.098 L
395.397 194.941 L
396.029 192.814 L
396.66 192.588 L
397.291 194.012 L
397.923 193.69 L
398.554 193.356 L
399.186 193.387 L
399.817 193.929 L
400.449 194.596 L
401.08 195.24 L
401.711 195.116 L
402.343 183.089 L
402.974 171.747 L
403.606 165.001 L
404.237 161.404 L
404.869 157.215 L
405.5 153.203 L
406.131 149.642 L
406.763 146.487 L
407.394 143.873 L
408.026 141.347 L
408.657 138.266 L
409.289 138.074 L
409.92 137.857 L
410.551 136.804 L
411.183 136.995 L
411.814 136.808 L
412.446 135.509 L
413.077 132.743 L
413.709 133.521 L
414.34 134.359 L
414.971 134.04 L
415.603 133.489 L
416.234 133.398 L
416.866 135.325 L
417.497 140.112 L
418.129 143.795 L
418.76 143.354 L
419.391 139.001 L
420.023 140.539 L
420.654 135.76 L
421.286 133.869 L
421.917 132.636 L
422.549 139.527 L
423.18 139.108 L
423.811 140.213 L
424.443 141.16 L
425.074 142.021 L
425.706 142.667 L
426.337 144.205 L
426.969 150.724 L
427.6 151.834 L
428.231 150.699 L
428.863 149.026 L
429.494 146.232 L
430.126 145.321 L
430.757 144.489 L
431.389 151.423 L
432.02 153.981 L
432.651 154.42 L
433.283 156.738 L
433.914 156.685 L
434.546 147.524 L
435.177 150.833 L
435.809 141.589 L
436.44 146.117 L
437.071 141.286 L
437.703 135.648 L
438.334 131.844 L
438.966 129.383 L
439.597 130.626 L
440.229 134.939 L
440.86 131.628 L
441.491 134.778 L
442.123 134.799 L
442.754 132.459 L
443.386 128.667 L
444.017 128.363 L
444.649 126.935 L
445.28 128.113 L
445.911 126.613 L
446.543 118.074 L
447.174 111.881 L
447.806 113.775 L
448.437 114.877 L
449.069 111.507 L
449.7 110.004 L
450.331 109.679 L
450.963 111.549 L
451.594 111.969 L
452.226 109.35 L
452.857 111.057 L
453.489 111.675 L
454.12 104.665 L
454.751 99.008 L
455.383 95.531 L
456.014 94.286 L
456.646 93.877 L
457.277 94.417 L
457.909 95.413 L
458.54 96.494 L
459.171 97.664 L
459.803 96.316 L
460.434 96.217 L
461.066 97.552 L
461.697 99.121 L
462.329 99.872 L
462.96 100.97 L
463.591 101.403 L
464.223 102.297 L
464.854 102.943 L
465.486 103.555 L
466.117 102.876 L
466.749 101.959 L
467.38 101.178 L
468.011 100.381 L
468.643 100.124 L
469.274 96.973 L
469.906 98.691 L
470.537 98.779 L
471.169 98.796 L
471.8 99.208 L
472.431 99.477 L
473.063 99.899 L
473.694 99.943 L
474.326 101.291 L
474.957 102.163 L
475.589 102.451 L
476.22 102.348 L
476.851 103.146 L
477.483 103.83 L
478.114 103.831 L
478.746 103.917 L
S
GR
GS
[0.75 0 0 0.75 55.97357 42.67563] CT
0.929 0.694 0.125 RC
N
4 0 M
4 -2.209 2.209 -4 0 -4 C
-2.209 -4 -4 -2.209 -4 0 C
-4 2.209 -2.209 4 0 4 C
2.209 4 4 2.209 4 0 C
cp
f
GR
GS
[0.75 0 0 0.75 59.28857 45.15611] CT
0.929 0.694 0.125 RC
N
/f351177404{4 0 M
4 -2.209 2.209 -4 0 -4 C
-2.209 -4 -4 -2.209 -4 0 C
-4 2.209 -2.209 4 0 4 C
2.209 4 4 2.209 4 0 C
cp}def
f351177404
f
GR
GS
[0.75 0 0 0.75 64.02429 51.21656] CT
0.929 0.694 0.125 RC
N
f351177404
f
GR
GS
[0.75 0 0 0.75 64.49786 57.13004] CT
0.929 0.694 0.125 RC
N
f351177404
f
GR
GS
[0.75 0 0 0.75 64.97143 61.919] CT
0.929 0.694 0.125 RC
N
f351177404
f
GR
GS
[0.75 0 0 0.75 65.445 65.4544] CT
0.929 0.694 0.125 RC
N
f351177404
f
GR
GS
[0.75 0 0 0.75 65.91857 68.55133] CT
0.929 0.694 0.125 RC
N
f351177404
f
GR
GS
[0.75 0 0 0.75 66.39214 70.53567] CT
0.929 0.694 0.125 RC
N
f351177404
f
GR
GS
[0.75 0 0 0.75 67.33928 72.27199] CT
0.929 0.694 0.125 RC
N
f351177404
f
GR
GS
[0.75 0 0 0.75 67.81286 73.52039] CT
0.929 0.694 0.125 RC
N
f351177404
f
GR
GS
[0.75 0 0 0.75 68.28643 74.32541] CT
0.929 0.694 0.125 RC
N
f351177404
f
GR
GS
[0.75 0 0 0.75 69.70714 100.3966] CT
0.929 0.694 0.125 RC
N
f351177404
f
GR
GS
[0.75 0 0 0.75 70.18072 108.71255] CT
0.929 0.694 0.125 RC
N
f351177404
f
GR
GS
[0.75 0 0 0.75 70.65428 116.14228] CT
0.929 0.694 0.125 RC
N
f351177404
f
GR
GS
[0.75 0 0 0.75 71.12786 122.50774] CT
0.929 0.694 0.125 RC
N
f351177404
f
GR
GS
[0.75 0 0 0.75 71.60143 128.17406] CT
0.929 0.694 0.125 RC
N
f351177404
f
GR
GS
[0.75 0 0 0.75 72.075 133.15395] CT
0.929 0.694 0.125 RC
N
f351177404
f
GR
GS
[0.75 0 0 0.75 72.54857 136.30084] CT
0.929 0.694 0.125 RC
N
f351177404
f
GR
GS
[0.75 0 0 0.75 73.02214 138.84251] CT
0.929 0.694 0.125 RC
N
f351177404
f
GR
GS
[0.75 0 0 0.75 73.49571 138.8157] CT
0.929 0.694 0.125 RC
N
f351177404
f
GR
GS
[0.75 0 0 0.75 74.91643 136.69522] CT
0.929 0.694 0.125 RC
N
f351177404
f
GR
GS
[0.75 0 0 0.75 75.86357 164.73094] CT
0.929 0.694 0.125 RC
N
f351177404
f
GR
GS
[0.75 0 0 0.75 76.33714 171.43058] CT
0.929 0.694 0.125 RC
N
f351177404
f
GR
GS
[0.75 0 0 0.75 76.81071 174.65666] CT
0.929 0.694 0.125 RC
N
f351177404
f
GR
GS
[0.75 0 0 0.75 78.705 175.24838] CT
0.929 0.694 0.125 RC
N
f351177404
f
GR
GS
[0.75 0 0 0.75 79.65214 170.25263] CT
0.929 0.694 0.125 RC
N
f351177404
f
GR
GS
[0.75 0 0 0.75 80.12571 171.06483] CT
0.929 0.694 0.125 RC
N
f351177404
f
GR
GS
[0.75 0 0 0.75 82.02 171.14579] CT
0.929 0.694 0.125 RC
N
f351177404
f
GR
GS
[0.75 0 0 0.75 87.22929 213.23284] CT
0.929 0.694 0.125 RC
N
f351177404
f
GR
GS
[0.75 0 0 0.75 88.17643 207.60761] CT
0.929 0.694 0.125 RC
N
f351177404
f
GR
GS
[0.75 0 0 0.75 88.65 203.06282] CT
0.929 0.694 0.125 RC
N
f351177404
f
GR
GS
[0.75 0 0 0.75 91.965 213.30759] CT
0.929 0.694 0.125 RC
N
f351177404
f
GR
GS
[0.75 0 0 0.75 92.43857 220.18446] CT
0.929 0.694 0.125 RC
N
f351177404
f
GR
GS
[0.75 0 0 0.75 95.28 234.67072] CT
0.929 0.694 0.125 RC
N
f351177404
f
GR
GS
[0.75 0 0 0.75 95.75357 235.32172] CT
0.929 0.694 0.125 RC
N
f351177404
f
GR
GS
[0.75 0 0 0.75 96.22714 235.60236] CT
0.929 0.694 0.125 RC
N
f351177404
f
GR
GS
[0.75 0 0 0.75 99.06857 220.97729] CT
0.929 0.694 0.125 RC
N
f351177404
f
GR
GS
[0.75 0 0 0.75 101.91 220.23901] CT
0.929 0.694 0.125 RC
N
f351177404
f
GR
GS
[0.75 0 0 0.75 102.38357 219.38292] CT
0.929 0.694 0.125 RC
N
f351177404
f
GR
GS
[0.75 0 0 0.75 102.85714 218.89119] CT
0.929 0.694 0.125 RC
N
f351177404
f
GR
GS
[0.75 0 0 0.75 103.33072 219.10581] CT
0.929 0.694 0.125 RC
N
f351177404
f
GR
GS
[0.75 0 0 0.75 103.80429 224.46579] CT
0.929 0.694 0.125 RC
N
f351177404
f
GR
GS
[0.75 0 0 0.75 106.17214 233.65416] CT
0.929 0.694 0.125 RC
N
f351177404
f
GR
GS
[0.75 0 0 0.75 110.90785 238.95726] CT
0.929 0.694 0.125 RC
N
f351177404
f
GR
GS
[0.75 0 0 0.75 119.43214 240.95197] CT
0.929 0.694 0.125 RC
N
f351177404
f
GR
GS
[0.75 0 0 0.75 133.63929 246.1607] CT
0.929 0.694 0.125 RC
N
f351177404
f
GR
GS
[0.75 0 0 0.75 134.11285 244.65829] CT
0.929 0.694 0.125 RC
N
f351177404
f
GR
GS
[0.75 0 0 0.75 134.58643 243.17441] CT
0.929 0.694 0.125 RC
N
f351177404
f
GR
GS
[0.75 0 0 0.75 135.06 241.4315] CT
0.929 0.694 0.125 RC
N
f351177404
f
GR
GS
[0.75 0 0 0.75 135.53357 240.8375] CT
0.929 0.694 0.125 RC
N
f351177404
f
GR
GS
[0.75 0 0 0.75 136.00714 239.2326] CT
0.929 0.694 0.125 RC
N
f351177404
f
GR
GS
[0.75 0 0 0.75 136.48072 239.11977] CT
0.929 0.694 0.125 RC
N
f351177404
f
GR
GS
[0.75 0 0 0.75 136.95428 239.01068] CT
0.929 0.694 0.125 RC
N
f351177404
f
GR
GS
[0.75 0 0 0.75 137.42785 238.80796] CT
0.929 0.694 0.125 RC
N
f351177404
f
GR
GS
[0.75 0 0 0.75 137.90143 238.34299] CT
0.929 0.694 0.125 RC
N
f351177404
f
GR
GS
[0.75 0 0 0.75 147.37286 261.66167] CT
0.929 0.694 0.125 RC
N
f351177404
f
GR
GS
[0.75 0 0 0.75 147.84643 265.77505] CT
0.929 0.694 0.125 RC
N
f351177404
f
GR
GS
[0.75 0 0 0.75 149.26714 264.42149] CT
0.929 0.694 0.125 RC
N
f351177404
f
GR
GS
[0.75 0 0 0.75 149.74071 266.64915] CT
0.929 0.694 0.125 RC
N
f351177404
f
GR
GS
[0.75 0 0 0.75 150.21429 267.84645] CT
0.929 0.694 0.125 RC
N
f351177404
f
GR
GS
[0.75 0 0 0.75 157.31786 254.6518] CT
0.929 0.694 0.125 RC
N
f351177404
f
GR
GS
[0.75 0 0 0.75 163.00072 252.23444] CT
0.929 0.694 0.125 RC
N
f351177404
f
GR
GS
[0.75 0 0 0.75 163.47429 255.46509] CT
0.929 0.694 0.125 RC
N
f351177404
f
GR
GS
[0.75 0 0 0.75 163.94785 258.19274] CT
0.929 0.694 0.125 RC
N
f351177404
f
GR
GS
[0.75 0 0 0.75 165.36857 259.30227] CT
0.929 0.694 0.125 RC
N
f351177404
f
GR
GS
[0.75 0 0 0.75 165.84215 260.22567] CT
0.929 0.694 0.125 RC
N
f351177404
f
GR
GS
[0.75 0 0 0.75 166.31572 262.70439] CT
0.929 0.694 0.125 RC
N
f351177404
f
GR
GS
[0.75 0 0 0.75 166.78928 260.23741] CT
0.929 0.694 0.125 RC
N
f351177404
f
GR
GS
[0.75 0 0 0.75 167.26285 259.7067] CT
0.929 0.694 0.125 RC
N
f351177404
f
GR
GS
[0.75 0 0 0.75 167.73643 260.74688] CT
0.929 0.694 0.125 RC
N
f351177404
f
GR
GS
[0.75 0 0 0.75 169.15715 247.77308] CT
0.929 0.694 0.125 RC
N
f351177404
f
GR
GS
[0.75 0 0 0.75 169.63071 250.44196] CT
0.929 0.694 0.125 RC
N
f351177404
f
GR
GS
[0.75 0 0 0.75 179.10214 267.17986] CT
0.929 0.694 0.125 RC
N
f351177404
f
GR
GS
[0.75 0 0 0.75 179.57571 264.81132] CT
0.929 0.694 0.125 RC
N
f351177404
f
GR
GS
[0.75 0 0 0.75 180.04929 255.9375] CT
0.929 0.694 0.125 RC
N
f351177404
f
GR
GS
[0.75 0 0 0.75 180.52286 253.00816] CT
0.929 0.694 0.125 RC
N
f351177404
f
GR
GS
[0.75 0 0 0.75 180.99643 250.89205] CT
0.929 0.694 0.125 RC
N
f351177404
f
GR
GS
[0.75 0 0 0.75 184.31142 253.33484] CT
0.929 0.694 0.125 RC
N
f351177404
f
GR
GS
[0.75 0 0 0.75 187.15285 268.78363] CT
0.929 0.694 0.125 RC
N
f351177404
f
GR
GS
[0.75 0 0 0.75 187.62642 267.56394] CT
0.929 0.694 0.125 RC
N
f351177404
f
GR
GS
[0.75 0 0 0.75 188.57357 257.76137] CT
0.929 0.694 0.125 RC
N
f351177404
f
GR
GS
[0.75 0 0 0.75 189.04714 264.30421] CT
0.929 0.694 0.125 RC
N
f351177404
f
GR
GS
[0.75 0 0 0.75 189.52072 266.07653] CT
0.929 0.694 0.125 RC
N
f351177404
f
GR
GS
[0.75 0 0 0.75 189.99429 265.55383] CT
0.929 0.694 0.125 RC
N
f351177404
f
GR
GS
[0.75 0 0 0.75 190.46785 263.45842] CT
0.929 0.694 0.125 RC
N
f351177404
f
GR
GS
[0.75 0 0 0.75 190.94143 259.56887] CT
0.929 0.694 0.125 RC
N
f351177404
f
GR
GS
[0.75 0 0 0.75 191.415 259.00443] CT
0.929 0.694 0.125 RC
N
f351177404
f
GR
GS
[0.75 0 0 0.75 191.88857 258.38413] CT
0.929 0.694 0.125 RC
N
f351177404
f
GR
GS
[0.75 0 0 0.75 194.73001 263.60891] CT
0.929 0.694 0.125 RC
N
f351177404
f
GR
GS
[0.75 0 0 0.75 199.93929 256.28362] CT
0.929 0.694 0.125 RC
N
f351177404
f
GR
GS
[0.75 0 0 0.75 200.88643 257.66933] CT
0.929 0.694 0.125 RC
N
f351177404
f
GR
GS
[0.75 0 0 0.75 207.04285 243.29913] CT
0.929 0.694 0.125 RC
N
f351177404
f
GR
GS
[0.75 0 0 0.75 208.46356 245.72566] CT
0.929 0.694 0.125 RC
N
f351177404
f
GR
GS
[0.75 0 0 0.75 209.41072 248.90243] CT
0.929 0.694 0.125 RC
N
f351177404
f
GR
GS
[0.75 0 0 0.75 209.88428 250.297] CT
0.929 0.694 0.125 RC
N
f351177404
f
GR
GS
[0.75 0 0 0.75 214.14642 252.21078] CT
0.929 0.694 0.125 RC
N
f351177404
f
GR
GS
[0.75 0 0 0.75 218.88215 256.97742] CT
0.929 0.694 0.125 RC
N
f351177404
f
GR
GS
[0.75 0 0 0.75 225.51215 247.7327] CT
0.929 0.694 0.125 RC
N
f351177404
f
GR
GS
[0.75 0 0 0.75 235.93071 264.11105] CT
0.929 0.694 0.125 RC
N
f351177404
f
GR
GS
[0.75 0 0 0.75 237.825 243.08752] CT
0.929 0.694 0.125 RC
N
f351177404
f
GR
GS
[0.75 0 0 0.75 241.13999 224.89366] CT
0.929 0.694 0.125 RC
N
f351177404
f
GR
GS
[0.75 0 0 0.75 243.50787 229.07982] CT
0.929 0.694 0.125 RC
N
f351177404
f
GR
GS
[0.75 0 0 0.75 247.29643 225.1371] CT
0.929 0.694 0.125 RC
N
f351177404
f
GR
GS
[0.75 0 0 0.75 251.55858 243.48981] CT
0.929 0.694 0.125 RC
N
f351177404
f
GR
GS
[0.75 0 0 0.75 253.45285 228.65939] CT
0.929 0.694 0.125 RC
N
f351177404
f
GR
GS
[0.75 0 0 0.75 261.03001 203.13451] CT
0.929 0.694 0.125 RC
N
f351177404
f
GR
GS
[0.75 0 0 0.75 262.45072 203.43418] CT
0.929 0.694 0.125 RC
N
f351177404
f
GR
GS
[0.75 0 0 0.75 264.34499 206.08772] CT
0.929 0.694 0.125 RC
N
f351177404
f
GR
GS
[0.75 0 0 0.75 264.81857 202.45988] CT
0.929 0.694 0.125 RC
N
f351177404
f
GR
GS
[0.75 0 0 0.75 267.66 189.03932] CT
0.929 0.694 0.125 RC
N
f351177404
f
GR
GS
[0.75 0 0 0.75 268.60714 184.80593] CT
0.929 0.694 0.125 RC
N
f351177404
f
GR
GS
[0.75 0 0 0.75 269.08072 180.69917] CT
0.929 0.694 0.125 RC
N
f351177404
f
GR
GS
[0.75 0 0 0.75 269.55428 172.83038] CT
0.929 0.694 0.125 RC
N
f351177404
f
GR
GS
[0.75 0 0 0.75 270.02785 170.61024] CT
0.929 0.694 0.125 RC
N
f351177404
f
GR
GS
[0.75 0 0 0.75 273.81642 153.79452] CT
0.929 0.694 0.125 RC
N
f351177404
f
GR
GS
[0.75 0 0 0.75 274.76358 152.61369] CT
0.929 0.694 0.125 RC
N
f351177404
f
GR
GS
[0.75 0 0 0.75 275.23714 156.48094] CT
0.929 0.694 0.125 RC
N
f351177404
f
GR
GS
[0.75 0 0 0.75 275.71072 153.75256] CT
0.929 0.694 0.125 RC
N
f351177404
f
GR
GS
[0.75 0 0 0.75 282.34071 161.99598] CT
0.929 0.694 0.125 RC
N
f351177404
f
GR
GS
[0.75 0 0 0.75 282.81429 160.68346] CT
0.929 0.694 0.125 RC
N
f351177404
f
GR
GS
[0.75 0 0 0.75 289.44429 160.80251] CT
0.929 0.694 0.125 RC
N
f351177404
f
GR
GS
[0.75 0 0 0.75 293.23286 160.83675] CT
0.929 0.694 0.125 RC
N
f351177404
f
GR
GS
[0.75 0 0 0.75 293.70644 160.52573] CT
0.929 0.694 0.125 RC
N
f351177404
f
GR
GS
[0.75 0 0 0.75 294.17999 158.81347] CT
0.929 0.694 0.125 RC
N
f351177404
f
GR
GS
[0.75 0 0 0.75 294.65357 156.27872] CT
0.929 0.694 0.125 RC
N
f351177404
f
GR
GS
[0.75 0 0 0.75 295.12715 153.78094] CT
0.929 0.694 0.125 RC
N
f351177404
f
GR
GS
[0.75 0 0 0.75 297.495 144.44086] CT
0.929 0.694 0.125 RC
N
f351177404
f
GR
GS
[0.75 0 0 0.75 297.96858 145.50928] CT
0.929 0.694 0.125 RC
N
f351177404
f
GR
GS
[0.75 0 0 0.75 298.44214 145.26747] CT
0.929 0.694 0.125 RC
N
f351177404
f
GR
GS
[0.75 0 0 0.75 306.49285 103.69921] CT
0.929 0.694 0.125 RC
N
f351177404
f
GR
GS
[0.75 0 0 0.75 309.80786 99.55695] CT
0.929 0.694 0.125 RC
N
f351177404
f
GR
GS
[0.75 0 0 0.75 314.54356 104.25112] CT
0.929 0.694 0.125 RC
N
f351177404
f
GR
GS
[0.75 0 0 0.75 315.01714 105.40395] CT
0.929 0.694 0.125 RC
N
f351177404
f
GR
GS
[0.75 0 0 0.75 321.17356 113.02415] CT
0.929 0.694 0.125 RC
N
f351177404
f
GR
GS
[0.75 0 0 0.75 321.64714 111.76943] CT
0.929 0.694 0.125 RC
N
f351177404
f
GR
GS
[0.75 0 0 0.75 322.12072 109.67413] CT
0.929 0.694 0.125 RC
N
f351177404
f
GR
GS
[0.75 0 0 0.75 324.48857 115.81508] CT
0.929 0.694 0.125 RC
N
f351177404
f
GR
GS
[0.75 0 0 0.75 325.90929 110.64294] CT
0.929 0.694 0.125 RC
N
f351177404
f
GR
GS
[0.75 0 0 0.75 326.38287 113.12448] CT
0.929 0.694 0.125 RC
N
f351177404
f
GR
GS
[0.75 0 0 0.75 328.75072 98.88324] CT
0.929 0.694 0.125 RC
N
f351177404
f
GR
GS
[0.75 0 0 0.75 330.17143 101.20404] CT
0.929 0.694 0.125 RC
N
f351177404
f
GR
GS
[0.75 0 0 0.75 334.43358 94.9601] CT
0.929 0.694 0.125 RC
N
f351177404
f
GR
GS
[0.75 0 0 0.75 336.80143 83.62988] CT
0.929 0.694 0.125 RC
N
f351177404
f
GR
GS
[0.75 0 0 0.75 337.27501 82.50287] CT
0.929 0.694 0.125 RC
N
f351177404
f
GR
GS
[0.75 0 0 0.75 351.95572 72.72972] CT
0.929 0.694 0.125 RC
N
f351177404
f
GR
GS
[0.75 0 0 0.75 354.79715 74.92449] CT
0.929 0.694 0.125 RC
N
f351177404
f
GR
GS
[0.75 0 0 0.75 64.02429 51.21656] CT
0.494 0.184 0.557 RC
N
f351177404
f
GR
GS
[0.75 0 0 0.75 64.49786 57.13004] CT
0.494 0.184 0.557 RC
N
f351177404
f
GR
GS
[0.75 0 0 0.75 66.86572 69.52497] CT
0.494 0.184 0.557 RC
N
f351177404
f
GR
GS
[0.75 0 0 0.75 68.76 83.37377] CT
0.494 0.184 0.557 RC
N
f351177404
f
GR
GS
[0.75 0 0 0.75 69.23357 90.57662] CT
0.494 0.184 0.557 RC
N
f351177404
f
GR
GS
[0.75 0 0 0.75 69.70714 100.3966] CT
0.494 0.184 0.557 RC
N
f351177404
f
GR
GS
[0.75 0 0 0.75 70.18072 108.71255] CT
0.494 0.184 0.557 RC
N
f351177404
f
GR
GS
[0.75 0 0 0.75 70.65428 116.14228] CT
0.494 0.184 0.557 RC
N
f351177404
f
GR
GS
[0.75 0 0 0.75 71.12786 122.50774] CT
0.494 0.184 0.557 RC
N
f351177404
f
GR
GS
[0.75 0 0 0.75 73.96929 134.52668] CT
0.494 0.184 0.557 RC
N
f351177404
f
GR
GS
[0.75 0 0 0.75 74.44286 125.97165] CT
0.494 0.184 0.557 RC
N
f351177404
f
GR
GS
[0.75 0 0 0.75 74.91643 136.69522] CT
0.494 0.184 0.557 RC
N
f351177404
f
GR
GS
[0.75 0 0 0.75 75.39 156.90128] CT
0.494 0.184 0.557 RC
N
f351177404
f
GR
GS
[0.75 0 0 0.75 75.86357 164.73094] CT
0.494 0.184 0.557 RC
N
f351177404
f
GR
GS
[0.75 0 0 0.75 76.33714 171.43058] CT
0.494 0.184 0.557 RC
N
f351177404
f
GR
GS
[0.75 0 0 0.75 76.81071 174.65666] CT
0.494 0.184 0.557 RC
N
f351177404
f
GR
GS
[0.75 0 0 0.75 77.28429 178.6391] CT
0.494 0.184 0.557 RC
N
f351177404
f
GR
GS
[0.75 0 0 0.75 82.02 171.14579] CT
0.494 0.184 0.557 RC
N
f351177404
f
GR
GS
[0.75 0 0 0.75 82.49357 175.40696] CT
0.494 0.184 0.557 RC
N
f351177404
f
GR
GS
[0.75 0 0 0.75 82.96714 180.28984] CT
0.494 0.184 0.557 RC
N
f351177404
f
GR
GS
[0.75 0 0 0.75 83.44072 187.03764] CT
0.494 0.184 0.557 RC
N
f351177404
f
GR
GS
[0.75 0 0 0.75 83.91428 192.78497] CT
0.494 0.184 0.557 RC
N
f351177404
f
GR
GS
[0.75 0 0 0.75 84.38786 196.79036] CT
0.494 0.184 0.557 RC
N
f351177404
f
GR
GS
[0.75 0 0 0.75 84.86143 200.4546] CT
0.494 0.184 0.557 RC
N
f351177404
f
GR
GS
[0.75 0 0 0.75 85.335 207.672] CT
0.494 0.184 0.557 RC
N
f351177404
f
GR
GS
[0.75 0 0 0.75 85.80857 213.84673] CT
0.494 0.184 0.557 RC
N
f351177404
f
GR
GS
[0.75 0 0 0.75 88.65 203.06282] CT
0.494 0.184 0.557 RC
N
f351177404
f
GR
GS
[0.75 0 0 0.75 89.12357 202.91963] CT
0.494 0.184 0.557 RC
N
f351177404
f
GR
GS
[0.75 0 0 0.75 89.59715 203.44631] CT
0.494 0.184 0.557 RC
N
f351177404
f
GR
GS
[0.75 0 0 0.75 92.43857 220.18446] CT
0.494 0.184 0.557 RC
N
f351177404
f
GR
GS
[0.75 0 0 0.75 101.91 220.23901] CT
0.494 0.184 0.557 RC
N
f351177404
f
GR
GS
[0.75 0 0 0.75 108.06643 233.3205] CT
0.494 0.184 0.557 RC
N
f351177404
f
GR
GS
[0.75 0 0 0.75 109.01357 235.0597] CT
0.494 0.184 0.557 RC
N
f351177404
f
GR
GS
[0.75 0 0 0.75 109.48715 236.7559] CT
0.494 0.184 0.557 RC
N
f351177404
f
GR
GS
[0.75 0 0 0.75 109.96072 238.63731] CT
0.494 0.184 0.557 RC
N
f351177404
f
GR
GS
[0.75 0 0 0.75 133.63929 246.1607] CT
0.494 0.184 0.557 RC
N
f351177404
f
GR
GS
[0.75 0 0 0.75 138.375 238.39673] CT
0.494 0.184 0.557 RC
N
f351177404
f
GR
GS
[0.75 0 0 0.75 142.63715 249.76767] CT
0.494 0.184 0.557 RC
N
f351177404
f
GR
GS
[0.75 0 0 0.75 143.11071 250.2599] CT
0.494 0.184 0.557 RC
N
f351177404
f
GR
GS
[0.75 0 0 0.75 264.34499 206.08772] CT
0.494 0.184 0.557 RC
N
f351177404
f
GR
GS
[0.75 0 0 0.75 264.81857 202.45988] CT
0.494 0.184 0.557 RC
N
f351177404
f
GR
GS
[0.75 0 0 0.75 269.55428 172.83038] CT
0.494 0.184 0.557 RC
N
f351177404
f
GR
GS
[0.75 0 0 0.75 301.75715 137.31702] CT
0.494 0.184 0.557 RC
N
f351177404
f
GR
GS
[0.75 0 0 0.75 302.23071 128.81006] CT
0.494 0.184 0.557 RC
N
f351177404
f
GR
GS
[0.75 0 0 0.75 302.70428 123.75053] CT
0.494 0.184 0.557 RC
N
f351177404
f
GR
GS
[0.75 0 0 0.75 303.17786 121.05315] CT
0.494 0.184 0.557 RC
N
f351177404
f
GR
GS
[0.75 0 0 0.75 303.65142 117.91161] CT
0.494 0.184 0.557 RC
N
f351177404
f
GR
GS
[0.75 0 0 0.75 333.96 96.08501] CT
0.494 0.184 0.557 RC
N
f351177404
f
GR
GS
[0.75 0 0 0.75 334.43358 94.9601] CT
0.494 0.184 0.557 RC
N
f351177404
f
GR
GS
[0.75 0 0 0.75 0 0] CT
1 GC
N
/f-1155447242{392 140 M
392 43 L
174 43 L
174 140 L
cp}def
f-1155447242
f
GR
GS
[0.75 0 0 0.75 165.75 42.32308] CT
N
1.859 -7.344 M
4.391 -7.344 L
10.531 4.234 L
10.531 -7.344 L
12.344 -7.344 L
12.344 6.5 L
9.828 6.5 L
3.688 -5.094 L
3.688 6.5 L
1.859 6.5 L
1.859 -7.344 L
cp
20.471 1.281 M
18.393 1.281 17.596 1.75 QT
16.799 2.219 16.799 3.359 QT
16.799 4.266 17.401 4.805 QT
18.003 5.344 19.034 5.344 QT
20.456 5.344 21.307 4.336 QT
22.159 3.328 22.159 1.656 QT
22.159 1.281 L
20.471 1.281 L
cp
23.878 0.578 M
23.878 6.5 L
22.159 6.5 L
22.159 4.922 L
21.581 5.875 20.706 6.32 QT
19.831 6.766 18.581 6.766 QT
16.987 6.766 16.042 5.875 QT
15.096 4.984 15.096 3.469 QT
15.096 1.719 16.268 0.828 QT
17.44 -0.063 19.768 -0.063 QT
22.159 -0.063 L
22.159 -0.219 L
22.159 -1.406 21.385 -2.047 QT
20.612 -2.688 19.221 -2.688 QT
18.331 -2.688 17.487 -2.477 QT
16.643 -2.266 15.862 -1.844 QT
15.862 -3.422 L
16.799 -3.781 17.682 -3.961 QT
18.565 -4.141 19.393 -4.141 QT
21.643 -4.141 22.76 -2.969 QT
23.878 -1.797 23.878 0.578 QT
cp
35.263 -1.891 M
35.904 -3.047 36.794 -3.594 QT
37.685 -4.141 38.904 -4.141 QT
40.513 -4.141 41.396 -3.008 QT
42.279 -1.875 42.279 0.234 QT
42.279 6.5 L
40.56 6.5 L
40.56 0.281 L
40.56 -1.203 40.037 -1.93 QT
39.513 -2.656 38.419 -2.656 QT
37.091 -2.656 36.326 -1.773 QT
35.56 -0.891 35.56 0.625 QT
35.56 6.5 L
33.841 6.5 L
33.841 0.281 L
33.841 -1.219 33.31 -1.938 QT
32.779 -2.656 31.685 -2.656 QT
30.373 -2.656 29.599 -1.773 QT
28.826 -0.891 28.826 0.625 QT
28.826 6.5 L
27.107 6.5 L
27.107 -3.891 L
28.826 -3.891 L
28.826 -2.281 L
29.419 -3.234 30.232 -3.688 QT
31.044 -4.141 32.169 -4.141 QT
33.294 -4.141 34.091 -3.563 QT
34.888 -2.984 35.263 -1.891 QT
cp
54.233 0.875 M
54.233 1.719 L
46.39 1.719 L
46.499 3.469 47.452 4.398 QT
48.405 5.328 50.108 5.328 QT
51.093 5.328 52.015 5.086 QT
52.937 4.844 53.843 4.359 QT
53.843 5.969 L
52.921 6.359 51.96 6.563 QT
50.999 6.766 49.999 6.766 QT
47.515 6.766 46.062 5.32 QT
44.608 3.875 44.608 1.406 QT
44.608 -1.141 45.983 -2.641 QT
47.358 -4.141 49.702 -4.141 QT
51.796 -4.141 53.015 -2.789 QT
54.233 -1.438 54.233 0.875 QT
cp
52.53 0.375 M
52.515 -1.031 51.749 -1.859 QT
50.983 -2.688 49.718 -2.688 QT
48.296 -2.688 47.437 -1.883 QT
46.577 -1.078 46.452 0.391 QT
52.53 0.375 L
cp
48.765 -5.203 M
46.608 -8.703 L
47.827 -8.703 L
49.421 -6.422 L
51.015 -8.703 L
52.233 -8.703 L
50.077 -5.203 L
48.765 -5.203 L
cp
62.852 -2.297 M
62.571 -2.469 62.227 -2.547 QT
61.883 -2.625 61.477 -2.625 QT
60.024 -2.625 59.251 -1.68 QT
58.477 -0.734 58.477 1.031 QT
58.477 6.5 L
56.758 6.5 L
56.758 -3.891 L
58.477 -3.891 L
58.477 -2.281 L
59.024 -3.219 59.883 -3.68 QT
60.743 -4.141 61.977 -4.141 QT
62.149 -4.141 62.368 -4.117 QT
62.586 -4.094 62.836 -4.047 QT
62.852 -2.297 L
cp
59.086 -5.203 M
56.758 -8.703 L
58.086 -8.703 L
59.805 -6.422 L
61.508 -8.703 L
62.836 -8.703 L
60.508 -5.203 L
59.086 -5.203 L
cp
73.382 0.875 M
73.382 1.719 L
65.538 1.719 L
65.647 3.469 66.6 4.398 QT
67.554 5.328 69.257 5.328 QT
70.241 5.328 71.163 5.086 QT
72.085 4.844 72.991 4.359 QT
72.991 5.969 L
72.069 6.359 71.108 6.563 QT
70.147 6.766 69.147 6.766 QT
66.663 6.766 65.21 5.32 QT
63.757 3.875 63.757 1.406 QT
63.757 -1.141 65.132 -2.641 QT
66.507 -4.141 68.85 -4.141 QT
70.944 -4.141 72.163 -2.789 QT
73.382 -1.438 73.382 0.875 QT
cp
71.679 0.375 M
71.663 -1.031 70.897 -1.859 QT
70.132 -2.688 68.866 -2.688 QT
67.444 -2.688 66.585 -1.883 QT
65.725 -1.078 65.6 0.391 QT
71.679 0.375 L
cp
84.61 0.234 M
84.61 6.5 L
82.906 6.5 L
82.906 0.281 L
82.906 -1.188 82.336 -1.922 QT
81.766 -2.656 80.61 -2.656 QT
79.219 -2.656 78.422 -1.773 QT
77.625 -0.891 77.625 0.625 QT
77.625 6.5 L
75.906 6.5 L
75.906 -3.891 L
77.625 -3.891 L
77.625 -2.281 L
78.235 -3.219 79.071 -3.68 QT
79.906 -4.141 80.985 -4.141 QT
82.781 -4.141 83.696 -3.031 QT
84.61 -1.922 84.61 0.234 QT
cp
92.527 1.281 M
90.449 1.281 89.652 1.75 QT
88.856 2.219 88.856 3.359 QT
88.856 4.266 89.457 4.805 QT
90.059 5.344 91.09 5.344 QT
92.512 5.344 93.363 4.336 QT
94.215 3.328 94.215 1.656 QT
94.215 1.281 L
92.527 1.281 L
cp
95.934 0.578 M
95.934 6.5 L
94.215 6.5 L
94.215 4.922 L
93.637 5.875 92.762 6.32 QT
91.887 6.766 90.637 6.766 QT
89.043 6.766 88.098 5.875 QT
87.152 4.984 87.152 3.469 QT
87.152 1.719 88.324 0.828 QT
89.496 -0.063 91.824 -0.063 QT
94.215 -0.063 L
94.215 -0.219 L
94.215 -1.406 93.442 -2.047 QT
92.668 -2.688 91.277 -2.688 QT
90.387 -2.688 89.543 -2.477 QT
88.699 -2.266 87.918 -1.844 QT
87.918 -3.422 L
88.856 -3.781 89.738 -3.961 QT
90.621 -4.141 91.449 -4.141 QT
93.699 -4.141 94.817 -2.969 QT
95.934 -1.797 95.934 0.578 QT
cp
93.059 -8.703 M
94.902 -8.703 L
91.871 -5.203 L
90.449 -5.203 L
93.059 -8.703 L
cp
112 -2.313 M
112 -7.938 L
113.703 -7.938 L
113.703 6.5 L
112 6.5 L
112 4.938 L
111.468 5.875 110.648 6.32 QT
109.828 6.766 108.671 6.766 QT
106.796 6.766 105.609 5.266 QT
104.421 3.766 104.421 1.313 QT
104.421 -1.141 105.609 -2.641 QT
106.796 -4.141 108.671 -4.141 QT
109.828 -4.141 110.648 -3.688 QT
111.468 -3.234 112 -2.313 QT
cp
106.187 1.313 M
106.187 3.203 106.961 4.273 QT
107.734 5.344 109.093 5.344 QT
110.437 5.344 111.218 4.273 QT
112 3.203 112 1.313 QT
112 -0.563 111.218 -1.641 QT
110.437 -2.719 109.093 -2.719 QT
107.734 -2.719 106.961 -1.641 QT
106.187 -0.563 106.187 1.313 QT
cp
121.733 1.281 M
119.654 1.281 118.858 1.75 QT
118.061 2.219 118.061 3.359 QT
118.061 4.266 118.662 4.805 QT
119.264 5.344 120.295 5.344 QT
121.717 5.344 122.568 4.336 QT
123.42 3.328 123.42 1.656 QT
123.42 1.281 L
121.733 1.281 L
cp
125.139 0.578 M
125.139 6.5 L
123.42 6.5 L
123.42 4.922 L
122.842 5.875 121.967 6.32 QT
121.092 6.766 119.842 6.766 QT
118.248 6.766 117.303 5.875 QT
116.358 4.984 116.358 3.469 QT
116.358 1.719 117.529 0.828 QT
118.701 -0.063 121.029 -0.063 QT
123.42 -0.063 L
123.42 -0.219 L
123.42 -1.406 122.647 -2.047 QT
121.873 -2.688 120.483 -2.688 QT
119.592 -2.688 118.748 -2.477 QT
117.904 -2.266 117.123 -1.844 QT
117.123 -3.422 L
118.061 -3.781 118.943 -3.961 QT
119.826 -4.141 120.654 -4.141 QT
122.904 -4.141 124.022 -2.969 QT
125.139 -1.797 125.139 0.578 QT
cp
130.134 -6.844 M
130.134 -3.891 L
133.649 -3.891 L
133.649 -2.563 L
130.134 -2.563 L
130.134 3.078 L
130.134 4.344 130.477 4.711 QT
130.821 5.078 131.884 5.078 QT
133.649 5.078 L
133.649 6.5 L
131.884 6.5 L
129.915 6.5 129.165 5.766 QT
128.415 5.031 128.415 3.078 QT
128.415 -2.563 L
127.165 -2.563 L
127.165 -3.891 L
128.415 -3.891 L
128.415 -6.844 L
130.134 -6.844 L
cp
140.48 1.281 M
138.402 1.281 137.605 1.75 QT
136.808 2.219 136.808 3.359 QT
136.808 4.266 137.41 4.805 QT
138.011 5.344 139.042 5.344 QT
140.464 5.344 141.316 4.336 QT
142.167 3.328 142.167 1.656 QT
142.167 1.281 L
140.48 1.281 L
cp
143.886 0.578 M
143.886 6.5 L
142.167 6.5 L
142.167 4.922 L
141.589 5.875 140.714 6.32 QT
139.839 6.766 138.589 6.766 QT
136.996 6.766 136.05 5.875 QT
135.105 4.984 135.105 3.469 QT
135.105 1.719 136.277 0.828 QT
137.449 -0.063 139.777 -0.063 QT
142.167 -0.063 L
142.167 -0.219 L
142.167 -1.406 141.394 -2.047 QT
140.621 -2.688 139.23 -2.688 QT
138.339 -2.688 137.496 -2.477 QT
136.652 -2.266 135.871 -1.844 QT
135.871 -3.422 L
136.808 -3.781 137.691 -3.961 QT
138.574 -4.141 139.402 -4.141 QT
141.652 -4.141 142.769 -2.969 QT
143.886 -1.797 143.886 0.578 QT
cp
f
GR
GS
[0.75 0 0 0.75 0 0] CT
0 0 1 RC
1 LJ
2 LW
N
178 56.431 M
218 56.431 L
S
GR
GS
[0.75 0 0 0.75 165.75 59.85769] CT
/Helvetica 18.667 F
GS
[1 0 0 1 0 0] CT
0 6.5 moveto 
1 -1 scale
(Pozorovatel) t 
GR
GR
GS
[0.75 0 0 0.75 0 0] CT
1 0 0 RC
1 LJ
2 LW
N
178 79.81 M
218 79.81 L
S
GR
GS
[0.75 0 0 0.75 165.75 77.39231] CT
N
1.656 -7.344 M
3.531 -7.344 L
3.531 1.063 L
3.531 3.297 4.344 4.273 QT
5.156 5.25 6.953 5.25 QT
8.766 5.25 9.57 4.273 QT
10.375 3.297 10.375 1.063 QT
10.375 -7.344 L
12.25 -7.344 L
12.25 1.297 L
12.25 4 10.914 5.383 QT
9.578 6.766 6.953 6.766 QT
4.328 6.766 2.992 5.383 QT
1.656 4 1.656 1.297 QT
1.656 -7.344 L
cp
7.766 -10.656 M
9.469 -10.656 L
7.359 -8.203 L
5.938 -8.203 L
7.766 -10.656 L
cp
22.077 -3.578 M
22.077 -1.969 L
21.343 -2.344 20.561 -2.531 QT
19.78 -2.719 18.952 -2.719 QT
17.686 -2.719 17.046 -2.328 QT
16.405 -1.938 16.405 -1.156 QT
16.405 -0.563 16.866 -0.227 QT
17.327 0.109 18.686 0.422 QT
19.28 0.547 L
21.093 0.938 21.858 1.648 QT
22.624 2.359 22.624 3.641 QT
22.624 5.078 21.483 5.922 QT
20.343 6.766 18.327 6.766 QT
17.499 6.766 16.593 6.602 QT
15.686 6.438 14.686 6.125 QT
14.686 4.359 L
15.624 4.844 16.546 5.094 QT
17.468 5.344 18.374 5.344 QT
19.577 5.344 20.225 4.93 QT
20.874 4.516 20.874 3.766 QT
20.874 3.063 20.405 2.695 QT
19.936 2.328 18.343 1.984 QT
17.749 1.844 L
16.171 1.516 15.468 0.82 QT
14.765 0.125 14.765 -1.078 QT
14.765 -2.547 15.804 -3.344 QT
16.843 -4.141 18.749 -4.141 QT
19.702 -4.141 20.53 -4 QT
21.358 -3.859 22.077 -3.578 QT
cp
34.047 0.875 M
34.047 1.719 L
26.203 1.719 L
26.312 3.469 27.266 4.398 QT
28.219 5.328 29.922 5.328 QT
30.906 5.328 31.828 5.086 QT
32.75 4.844 33.656 4.359 QT
33.656 5.969 L
32.734 6.359 31.773 6.563 QT
30.812 6.766 29.812 6.766 QT
27.328 6.766 25.875 5.32 QT
24.422 3.875 24.422 1.406 QT
24.422 -1.141 25.797 -2.641 QT
27.172 -4.141 29.516 -4.141 QT
31.609 -4.141 32.828 -2.789 QT
34.047 -1.438 34.047 0.875 QT
cp
32.344 0.375 M
32.328 -1.031 31.562 -1.859 QT
30.797 -2.688 29.531 -2.688 QT
28.109 -2.688 27.25 -1.883 QT
26.391 -1.078 26.266 0.391 QT
32.344 0.375 L
cp
36.572 -7.938 M
38.29 -7.938 L
38.29 0.594 L
43.384 -3.891 L
45.572 -3.891 L
40.056 0.969 L
45.806 6.5 L
43.572 6.5 L
38.29 1.422 L
38.29 6.5 L
36.572 6.5 L
36.572 -7.938 L
cp
51.766 7.469 M
51.047 9.328 50.36 9.891 QT
49.672 10.453 48.516 10.453 QT
47.157 10.453 L
47.157 9.031 L
48.157 9.031 L
48.86 9.031 49.251 8.695 QT
49.641 8.359 50.126 7.109 QT
50.422 6.328 L
46.219 -3.891 L
48.032 -3.891 L
51.282 4.234 L
54.532 -3.891 L
56.329 -3.891 L
51.766 7.469 L
cp
71.05 -3.578 M
71.05 -1.969 L
70.315 -2.344 69.534 -2.531 QT
68.753 -2.719 67.925 -2.719 QT
66.659 -2.719 66.018 -2.328 QT
65.378 -1.938 65.378 -1.156 QT
65.378 -0.563 65.839 -0.227 QT
66.3 0.109 67.659 0.422 QT
68.253 0.547 L
70.065 0.938 70.831 1.648 QT
71.597 2.359 71.597 3.641 QT
71.597 5.078 70.456 5.922 QT
69.315 6.766 67.3 6.766 QT
66.472 6.766 65.565 6.602 QT
64.659 6.438 63.659 6.125 QT
63.659 4.359 L
64.597 4.844 65.518 5.094 QT
66.44 5.344 67.347 5.344 QT
68.55 5.344 69.198 4.93 QT
69.847 4.516 69.847 3.766 QT
69.847 3.063 69.378 2.695 QT
68.909 2.328 67.315 1.984 QT
66.722 1.844 L
65.143 1.516 64.44 0.82 QT
63.737 0.125 63.737 -1.078 QT
63.737 -2.547 64.776 -3.344 QT
65.815 -4.141 67.722 -4.141 QT
68.675 -4.141 69.503 -4 QT
70.331 -3.859 71.05 -3.578 QT
cp
87.528 1.313 M
87.528 -0.563 86.754 -1.641 QT
85.981 -2.719 84.622 -2.719 QT
83.262 -2.719 82.489 -1.641 QT
81.715 -0.563 81.715 1.313 QT
81.715 3.203 82.489 4.273 QT
83.262 5.344 84.622 5.344 QT
85.981 5.344 86.754 4.273 QT
87.528 3.203 87.528 1.313 QT
cp
81.715 -2.313 M
82.262 -3.234 83.083 -3.688 QT
83.903 -4.141 85.044 -4.141 QT
86.934 -4.141 88.114 -2.641 QT
89.294 -1.141 89.294 1.313 QT
89.294 3.766 88.114 5.266 QT
86.934 6.766 85.044 6.766 QT
83.903 6.766 83.083 6.32 QT
82.262 5.875 81.715 4.938 QT
81.715 6.5 L
79.997 6.5 L
79.997 -7.938 L
81.715 -7.938 L
81.715 -2.313 L
cp
97.933 -2.297 M
97.652 -2.469 97.308 -2.547 QT
96.964 -2.625 96.558 -2.625 QT
95.105 -2.625 94.331 -1.68 QT
93.558 -0.734 93.558 1.031 QT
93.558 6.5 L
91.839 6.5 L
91.839 -3.891 L
93.558 -3.891 L
93.558 -2.281 L
94.105 -3.219 94.964 -3.68 QT
95.823 -4.141 97.058 -4.141 QT
97.23 -4.141 97.448 -4.117 QT
97.667 -4.094 97.917 -4.047 QT
97.933 -2.297 L
cp
98.837 -3.891 M
106.947 -3.891 L
106.947 -2.328 L
100.525 5.141 L
106.947 5.141 L
106.947 6.5 L
98.603 6.5 L
98.603 4.938 L
105.025 -2.531 L
98.837 -2.531 L
98.837 -3.891 L
cp
102.181 -5.203 M
99.837 -8.703 L
101.165 -8.703 L
102.9 -6.422 L
104.619 -8.703 L
105.947 -8.703 L
103.603 -5.203 L
102.181 -5.203 L
cp
116.208 -2.313 M
116.208 -7.938 L
117.911 -7.938 L
117.911 6.5 L
116.208 6.5 L
116.208 4.938 L
115.677 5.875 114.857 6.32 QT
114.036 6.766 112.88 6.766 QT
111.005 6.766 109.818 5.266 QT
108.63 3.766 108.63 1.313 QT
108.63 -1.141 109.818 -2.641 QT
111.005 -4.141 112.88 -4.141 QT
114.036 -4.141 114.857 -3.688 QT
115.677 -3.234 116.208 -2.313 QT
cp
110.396 1.313 M
110.396 3.203 111.169 4.273 QT
111.943 5.344 113.302 5.344 QT
114.646 5.344 115.427 4.273 QT
116.208 3.203 116.208 1.313 QT
116.208 -0.563 115.427 -1.641 QT
114.646 -2.719 113.302 -2.719 QT
111.943 -2.719 111.169 -1.641 QT
110.396 -0.563 110.396 1.313 QT
cp
130.097 0.875 M
130.097 1.719 L
122.254 1.719 L
122.363 3.469 123.316 4.398 QT
124.269 5.328 125.972 5.328 QT
126.957 5.328 127.879 5.086 QT
128.801 4.844 129.707 4.359 QT
129.707 5.969 L
128.785 6.359 127.824 6.563 QT
126.863 6.766 125.863 6.766 QT
123.379 6.766 121.926 5.32 QT
120.472 3.875 120.472 1.406 QT
120.472 -1.141 121.847 -2.641 QT
123.222 -4.141 125.566 -4.141 QT
127.66 -4.141 128.879 -2.789 QT
130.097 -1.438 130.097 0.875 QT
cp
128.394 0.375 M
128.379 -1.031 127.613 -1.859 QT
126.847 -2.688 125.582 -2.688 QT
124.16 -2.688 123.301 -1.883 QT
122.441 -1.078 122.316 0.391 QT
128.394 0.375 L
cp
124.629 -5.203 M
122.472 -8.703 L
123.691 -8.703 L
125.285 -6.422 L
126.879 -8.703 L
128.097 -8.703 L
125.941 -5.203 L
124.629 -5.203 L
cp
141.325 0.234 M
141.325 6.5 L
139.622 6.5 L
139.622 0.281 L
139.622 -1.188 139.052 -1.922 QT
138.482 -2.656 137.325 -2.656 QT
135.935 -2.656 135.138 -1.773 QT
134.341 -0.891 134.341 0.625 QT
134.341 6.5 L
132.622 6.5 L
132.622 -3.891 L
134.341 -3.891 L
134.341 -2.281 L
134.95 -3.219 135.786 -3.68 QT
136.622 -4.141 137.7 -4.141 QT
139.497 -4.141 140.411 -3.031 QT
141.325 -1.922 141.325 0.234 QT
cp
146.774 -8.703 M
148.618 -8.703 L
145.587 -5.203 L
144.165 -5.203 L
146.774 -8.703 L
cp
144.524 -3.891 M
146.228 -3.891 L
146.228 6.5 L
144.524 6.5 L
144.524 -3.891 L
cp
157.786 -1.891 M
158.427 -3.047 159.317 -3.594 QT
160.208 -4.141 161.427 -4.141 QT
163.036 -4.141 163.919 -3.008 QT
164.802 -1.875 164.802 0.234 QT
164.802 6.5 L
163.083 6.5 L
163.083 0.281 L
163.083 -1.203 162.559 -1.93 QT
162.036 -2.656 160.942 -2.656 QT
159.614 -2.656 158.848 -1.773 QT
158.083 -0.891 158.083 0.625 QT
158.083 6.5 L
156.364 6.5 L
156.364 0.281 L
156.364 -1.219 155.833 -1.938 QT
155.302 -2.656 154.208 -2.656 QT
152.895 -2.656 152.122 -1.773 QT
151.348 -0.891 151.348 0.625 QT
151.348 6.5 L
149.63 6.5 L
149.63 -3.891 L
151.348 -3.891 L
151.348 -2.281 L
151.942 -3.234 152.755 -3.688 QT
153.567 -4.141 154.692 -4.141 QT
155.817 -4.141 156.614 -3.563 QT
157.411 -2.984 157.786 -1.891 QT
cp
f
GR
GS
[0.75 0 0 0.75 148.5 77.39231] CT
0.929 0.694 0.125 RC
N
f351177404
f
GR
GS
[0.75 0 0 0.75 165.75 94.92692] CT
/Helvetica 18.667 F
GS
[1 0 0 1 0 0] CT
0 6.5 moveto 
1 -1 scale
(Divn\351 \372seky) t 
GR
GR
GS
[0.75 0 0 0.75 148.5 94.92692] CT
0.494 0.184 0.557 RC
N
f351177404
f
GR
GS
[0.75 0 0 0.75 0 0] CT
0.149 GC
10.0 ML
0.667 LW
N
174 140 M
174 43 L
392 43 L
392 140 L
cp
S
GR
%%Trailer
%%Pages: 1
%%EOF
