%!PS-Adobe-3.0 EPSF-3.0
%%Creator: (MATLAB, The Mathworks, Inc. Version 9.14.0.2206163 \(R2023a\). Operating System: Windows 10)
%%Title: C:/Users/radac/Desktop/Bachelor_thesis/thesis/Metody/fig/EKF_average/average_150_profil_h_1.eps
%%CreationDate: 2023-05-01T15:43:41
%%Pages: (atend)
%%BoundingBox:     0     0   420   315
%%LanguageLevel: 3
%%EndComments
%%BeginProlog
%%BeginResource: procset (Apache XML Graphics Std ProcSet) 1.2 0
%%Version: 1.2 0
%%Copyright: (Copyright 2001-2003,2010 The Apache Software Foundation. License terms: http://www.apache.org/licenses/LICENSE-2.0)
/bd{bind def}bind def
/ld{load def}bd
/GR/grestore ld
/GS/gsave ld
/RM/rmoveto ld
/C/curveto ld
/t/show ld
/L/lineto ld
/ML/setmiterlimit ld
/CT/concat ld
/f/fill ld
/N/newpath ld
/S/stroke ld
/CC/setcmykcolor ld
/A/ashow ld
/cp/closepath ld
/RC/setrgbcolor ld
/LJ/setlinejoin ld
/GC/setgray ld
/LW/setlinewidth ld
/M/moveto ld
/re {4 2 roll M
1 index 0 rlineto
0 exch rlineto
neg 0 rlineto
cp } bd
/_ctm matrix def
/_tm matrix def
/BT { _ctm currentmatrix pop matrix _tm copy pop 0 0 moveto } bd
/ET { _ctm setmatrix } bd
/iTm { _ctm setmatrix _tm concat } bd
/Tm { _tm astore pop iTm 0 0 moveto } bd
/ux 0.0 def
/uy 0.0 def
/F {
  /Tp exch def
  /Tf exch def
  Tf findfont Tp scalefont setfont
  /cf Tf def  /cs Tp def
} bd
/ULS {currentpoint /uy exch def /ux exch def} bd
/ULE {
  /Tcx currentpoint pop def
  gsave
  newpath
  cf findfont cs scalefont dup
  /FontMatrix get 0 get /Ts exch def /FontInfo get dup
  /UnderlinePosition get Ts mul /To exch def
  /UnderlineThickness get Ts mul /Tt exch def
  ux uy To add moveto  Tcx uy To add lineto
  Tt setlinewidth stroke
  grestore
} bd
/OLE {
  /Tcx currentpoint pop def
  gsave
  newpath
  cf findfont cs scalefont dup
  /FontMatrix get 0 get /Ts exch def /FontInfo get dup
  /UnderlinePosition get Ts mul /To exch def
  /UnderlineThickness get Ts mul /Tt exch def
  ux uy To add cs add moveto Tcx uy To add cs add lineto
  Tt setlinewidth stroke
  grestore
} bd
/SOE {
  /Tcx currentpoint pop def
  gsave
  newpath
  cf findfont cs scalefont dup
  /FontMatrix get 0 get /Ts exch def /FontInfo get dup
  /UnderlinePosition get Ts mul /To exch def
  /UnderlineThickness get Ts mul /Tt exch def
  ux uy To add cs 10 mul 26 idiv add moveto Tcx uy To add cs 10 mul 26 idiv add lineto
  Tt setlinewidth stroke
  grestore
} bd
/QT {
/Y22 exch store
/X22 exch store
/Y21 exch store
/X21 exch store
currentpoint
/Y21 load 2 mul add 3 div exch
/X21 load 2 mul add 3 div exch
/X21 load 2 mul /X22 load add 3 div
/Y21 load 2 mul /Y22 load add 3 div
/X22 load /Y22 load curveto
} bd
/SSPD {
dup length /d exch dict def
{
/v exch def
/k exch def
currentpagedevice k known {
/cpdv currentpagedevice k get def
v cpdv ne {
/upd false def
/nullv v type /nulltype eq def
/nullcpdv cpdv type /nulltype eq def
nullv nullcpdv or
{
/upd true def
} {
/sametype v type cpdv type eq def
sametype {
v type /arraytype eq {
/vlen v length def
/cpdvlen cpdv length def
vlen cpdvlen eq {
0 1 vlen 1 sub {
/i exch def
/obj v i get def
/cpdobj cpdv i get def
obj cpdobj ne {
/upd true def
exit
} if
} for
} {
/upd true def
} ifelse
} {
v type /dicttype eq {
v {
/dv exch def
/dk exch def
/cpddv cpdv dk get def
dv cpddv ne {
/upd true def
exit
} if
} forall
} {
/upd true def
} ifelse
} ifelse
} if
} ifelse
upd true eq {
d k v put
} if
} if
} if
} forall
d length 0 gt {
d setpagedevice
} if
} bd
/RE { % /NewFontName [NewEncodingArray] /FontName RE -
  findfont dup length dict begin
  {
    1 index /FID ne
    {def} {pop pop} ifelse
  } forall
  /Encoding exch def
  /FontName 1 index def
  currentdict definefont pop
  end
} bind def
%%EndResource
%%BeginResource: procset (Apache XML Graphics EPS ProcSet) 1.0 0
%%Version: 1.0 0
%%Copyright: (Copyright 2002-2003 The Apache Software Foundation. License terms: http://www.apache.org/licenses/LICENSE-2.0)
/BeginEPSF { %def
/b4_Inc_state save def         % Save state for cleanup
/dict_count countdictstack def % Count objects on dict stack
/op_count count 1 sub def      % Count objects on operand stack
userdict begin                 % Push userdict on dict stack
/showpage { } def              % Redefine showpage, { } = null proc
0 setgray 0 setlinecap         % Prepare graphics state
1 setlinewidth 0 setlinejoin
10 setmiterlimit [ ] 0 setdash newpath
/languagelevel where           % If level not equal to 1 then
{pop languagelevel             % set strokeadjust and
1 ne                           % overprint to their defaults.
{false setstrokeadjust false setoverprint
} if
} if
} bd
/EndEPSF { %def
count op_count sub {pop} repeat            % Clean up stacks
countdictstack dict_count sub {end} repeat
b4_Inc_state restore
} bd
%%EndResource
%FOPBeginFontDict
%%IncludeResource: font Courier-Oblique
%%IncludeResource: font Courier-BoldOblique
%%IncludeResource: font Courier-Bold
%%IncludeResource: font ZapfDingbats
%%IncludeResource: font Symbol
%%IncludeResource: font Helvetica
%%IncludeResource: font Helvetica-Oblique
%%IncludeResource: font Helvetica-Bold
%%IncludeResource: font Helvetica-BoldOblique
%%IncludeResource: font Times-Roman
%%IncludeResource: font Times-Italic
%%IncludeResource: font Times-Bold
%%IncludeResource: font Times-BoldItalic
%%IncludeResource: font Courier
%FOPEndFontDict
%%BeginResource: encoding WinAnsiEncoding
/WinAnsiEncoding [
/.notdef /.notdef /.notdef /.notdef /.notdef
/.notdef /.notdef /.notdef /.notdef /.notdef
/.notdef /.notdef /.notdef /.notdef /.notdef
/.notdef /.notdef /.notdef /.notdef /.notdef
/.notdef /.notdef /.notdef /.notdef /.notdef
/.notdef /.notdef /.notdef /.notdef /.notdef
/.notdef /.notdef /space /exclam /quotedbl
/numbersign /dollar /percent /ampersand /quotesingle
/parenleft /parenright /asterisk /plus /comma
/hyphen /period /slash /zero /one
/two /three /four /five /six
/seven /eight /nine /colon /semicolon
/less /equal /greater /question /at
/A /B /C /D /E
/F /G /H /I /J
/K /L /M /N /O
/P /Q /R /S /T
/U /V /W /X /Y
/Z /bracketleft /backslash /bracketright /asciicircum
/underscore /quoteleft /a /b /c
/d /e /f /g /h
/i /j /k /l /m
/n /o /p /q /r
/s /t /u /v /w
/x /y /z /braceleft /bar
/braceright /asciitilde /bullet /Euro /bullet
/quotesinglbase /florin /quotedblbase /ellipsis /dagger
/daggerdbl /circumflex /perthousand /Scaron /guilsinglleft
/OE /bullet /Zcaron /bullet /bullet
/quoteleft /quoteright /quotedblleft /quotedblright /bullet
/endash /emdash /asciitilde /trademark /scaron
/guilsinglright /oe /bullet /zcaron /Ydieresis
/space /exclamdown /cent /sterling /currency
/yen /brokenbar /section /dieresis /copyright
/ordfeminine /guillemotleft /logicalnot /sfthyphen /registered
/macron /degree /plusminus /twosuperior /threesuperior
/acute /mu /paragraph /middot /cedilla
/onesuperior /ordmasculine /guillemotright /onequarter /onehalf
/threequarters /questiondown /Agrave /Aacute /Acircumflex
/Atilde /Adieresis /Aring /AE /Ccedilla
/Egrave /Eacute /Ecircumflex /Edieresis /Igrave
/Iacute /Icircumflex /Idieresis /Eth /Ntilde
/Ograve /Oacute /Ocircumflex /Otilde /Odieresis
/multiply /Oslash /Ugrave /Uacute /Ucircumflex
/Udieresis /Yacute /Thorn /germandbls /agrave
/aacute /acircumflex /atilde /adieresis /aring
/ae /ccedilla /egrave /eacute /ecircumflex
/edieresis /igrave /iacute /icircumflex /idieresis
/eth /ntilde /ograve /oacute /ocircumflex
/otilde /odieresis /divide /oslash /ugrave
/uacute /ucircumflex /udieresis /yacute /thorn
/ydieresis
] def
%%EndResource
%FOPBeginFontReencode
/Courier-Oblique findfont
dup length dict begin
  {1 index /FID ne {def} {pop pop} ifelse} forall
  /Encoding WinAnsiEncoding def
  currentdict
end
/Courier-Oblique exch definefont pop
/Courier-BoldOblique findfont
dup length dict begin
  {1 index /FID ne {def} {pop pop} ifelse} forall
  /Encoding WinAnsiEncoding def
  currentdict
end
/Courier-BoldOblique exch definefont pop
/Courier-Bold findfont
dup length dict begin
  {1 index /FID ne {def} {pop pop} ifelse} forall
  /Encoding WinAnsiEncoding def
  currentdict
end
/Courier-Bold exch definefont pop
/Helvetica findfont
dup length dict begin
  {1 index /FID ne {def} {pop pop} ifelse} forall
  /Encoding WinAnsiEncoding def
  currentdict
end
/Helvetica exch definefont pop
/Helvetica-Oblique findfont
dup length dict begin
  {1 index /FID ne {def} {pop pop} ifelse} forall
  /Encoding WinAnsiEncoding def
  currentdict
end
/Helvetica-Oblique exch definefont pop
/Helvetica-Bold findfont
dup length dict begin
  {1 index /FID ne {def} {pop pop} ifelse} forall
  /Encoding WinAnsiEncoding def
  currentdict
end
/Helvetica-Bold exch definefont pop
/Helvetica-BoldOblique findfont
dup length dict begin
  {1 index /FID ne {def} {pop pop} ifelse} forall
  /Encoding WinAnsiEncoding def
  currentdict
end
/Helvetica-BoldOblique exch definefont pop
/Times-Roman findfont
dup length dict begin
  {1 index /FID ne {def} {pop pop} ifelse} forall
  /Encoding WinAnsiEncoding def
  currentdict
end
/Times-Roman exch definefont pop
/Times-Italic findfont
dup length dict begin
  {1 index /FID ne {def} {pop pop} ifelse} forall
  /Encoding WinAnsiEncoding def
  currentdict
end
/Times-Italic exch definefont pop
/Times-Bold findfont
dup length dict begin
  {1 index /FID ne {def} {pop pop} ifelse} forall
  /Encoding WinAnsiEncoding def
  currentdict
end
/Times-Bold exch definefont pop
/Times-BoldItalic findfont
dup length dict begin
  {1 index /FID ne {def} {pop pop} ifelse} forall
  /Encoding WinAnsiEncoding def
  currentdict
end
/Times-BoldItalic exch definefont pop
/Courier findfont
dup length dict begin
  {1 index /FID ne {def} {pop pop} ifelse} forall
  /Encoding WinAnsiEncoding def
  currentdict
end
/Courier exch definefont pop
%FOPEndFontReencode
%%EndProlog
%%Page: 1 1
%%PageBoundingBox: 0 0 420 315
%%BeginPageSetup
[1 0 0 -1 0 315] CT
%%EndPageSetup
GS
[0.6 0 0 0.6 0 0] CT
1 GC
N
0 0 700 525 re
f
GR
GS
[0.6 0 0 0.6 0 0] CT
1 GC
N
0 0 700 525 re
f
GR
GS
[0.6 0 0 0.6 0 0] CT
1 GC
N
91 467 M
634 467 L
634 39 L
91 39 L
cp
f
GR
GS
[0.6 0 0 0.6 0 0] CT
0.873 GC
1 LJ
0.833 LW
N
91 467 M
91 39 L
S
GR
GS
[0.6 0 0 0.6 0 0] CT
0.873 GC
1 LJ
0.833 LW
N
168.571 467 M
168.571 39 L
S
GR
GS
[0.6 0 0 0.6 0 0] CT
0.873 GC
1 LJ
0.833 LW
N
246.143 467 M
246.143 39 L
S
GR
GS
[0.6 0 0 0.6 0 0] CT
0.873 GC
1 LJ
0.833 LW
N
323.714 467 M
323.714 39 L
S
GR
GS
[0.6 0 0 0.6 0 0] CT
0.873 GC
1 LJ
0.833 LW
N
401.286 467 M
401.286 39 L
S
GR
GS
[0.6 0 0 0.6 0 0] CT
0.873 GC
1 LJ
0.833 LW
N
478.857 467 M
478.857 39 L
S
GR
GS
[0.6 0 0 0.6 0 0] CT
0.873 GC
1 LJ
0.833 LW
N
556.429 467 M
556.429 39 L
S
GR
GS
[0.6 0 0 0.6 0 0] CT
0.873 GC
1 LJ
0.833 LW
N
634 467 M
634 39 L
S
GR
GS
[0.6 0 0 0.6 0 0] CT
0.873 GC
1 LJ
0.833 LW
N
634 467 M
91 467 L
S
GR
GS
[0.6 0 0 0.6 0 0] CT
0.873 GC
1 LJ
0.833 LW
N
634 405.857 M
91 405.857 L
S
GR
GS
[0.6 0 0 0.6 0 0] CT
0.873 GC
1 LJ
0.833 LW
N
634 344.714 M
91 344.714 L
S
GR
GS
[0.6 0 0 0.6 0 0] CT
0.873 GC
1 LJ
0.833 LW
N
634 283.571 M
91 283.571 L
S
GR
GS
[0.6 0 0 0.6 0 0] CT
0.873 GC
1 LJ
0.833 LW
N
634 222.429 M
91 222.429 L
S
GR
GS
[0.6 0 0 0.6 0 0] CT
0.873 GC
1 LJ
0.833 LW
N
634 161.286 M
91 161.286 L
S
GR
GS
[0.6 0 0 0.6 0 0] CT
0.873 GC
1 LJ
0.833 LW
N
634 100.143 M
91 100.143 L
S
GR
GS
[0.6 0 0 0.6 0 0] CT
0.873 GC
1 LJ
0.833 LW
N
634 39 M
91 39 L
S
GR
GS
[0.6 0 0 0.6 0 0] CT
0.149 GC
2 setlinecap
1 LJ
0.833 LW
N
91 467 M
634 467 L
S
GR
GS
[0.6 0 0 0.6 0 0] CT
0.149 GC
2 setlinecap
1 LJ
0.833 LW
N
91 39 M
634 39 L
S
GR
GS
[0.6 0 0 0.6 0 0] CT
0.149 GC
2 setlinecap
1 LJ
0.833 LW
N
91 467 M
91 461.57 L
S
GR
GS
[0.6 0 0 0.6 0 0] CT
0.149 GC
2 setlinecap
1 LJ
0.833 LW
N
168.571 467 M
168.571 461.57 L
S
GR
GS
[0.6 0 0 0.6 0 0] CT
0.149 GC
2 setlinecap
1 LJ
0.833 LW
N
246.143 467 M
246.143 461.57 L
S
GR
GS
[0.6 0 0 0.6 0 0] CT
0.149 GC
2 setlinecap
1 LJ
0.833 LW
N
323.714 467 M
323.714 461.57 L
S
GR
GS
[0.6 0 0 0.6 0 0] CT
0.149 GC
2 setlinecap
1 LJ
0.833 LW
N
401.286 467 M
401.286 461.57 L
S
GR
GS
[0.6 0 0 0.6 0 0] CT
0.149 GC
2 setlinecap
1 LJ
0.833 LW
N
478.857 467 M
478.857 461.57 L
S
GR
GS
[0.6 0 0 0.6 0 0] CT
0.149 GC
2 setlinecap
1 LJ
0.833 LW
N
556.429 467 M
556.429 461.57 L
S
GR
GS
[0.6 0 0 0.6 0 0] CT
0.149 GC
2 setlinecap
1 LJ
0.833 LW
N
634 467 M
634 461.57 L
S
GR
GS
[0.6 0 0 0.6 0 0] CT
0.149 GC
2 setlinecap
1 LJ
0.833 LW
N
91 39 M
91 44.43 L
S
GR
GS
[0.6 0 0 0.6 0 0] CT
0.149 GC
2 setlinecap
1 LJ
0.833 LW
N
168.571 39 M
168.571 44.43 L
S
GR
GS
[0.6 0 0 0.6 0 0] CT
0.149 GC
2 setlinecap
1 LJ
0.833 LW
N
246.143 39 M
246.143 44.43 L
S
GR
GS
[0.6 0 0 0.6 0 0] CT
0.149 GC
2 setlinecap
1 LJ
0.833 LW
N
323.714 39 M
323.714 44.43 L
S
GR
GS
[0.6 0 0 0.6 0 0] CT
0.149 GC
2 setlinecap
1 LJ
0.833 LW
N
401.286 39 M
401.286 44.43 L
S
GR
GS
[0.6 0 0 0.6 0 0] CT
0.149 GC
2 setlinecap
1 LJ
0.833 LW
N
478.857 39 M
478.857 44.43 L
S
GR
GS
[0.6 0 0 0.6 0 0] CT
0.149 GC
2 setlinecap
1 LJ
0.833 LW
N
556.429 39 M
556.429 44.43 L
S
GR
GS
[0.6 0 0 0.6 0 0] CT
0.149 GC
2 setlinecap
1 LJ
0.833 LW
N
634 39 M
634 44.43 L
S
GR
GS
[0.6 0 0 0.6 54.6 284.19999] CT
0.149 GC
/Helvetica 16.667 F
GS
[1 0 0 1 0 0] CT
-5 17 moveto 
1 -1 scale
(0) t 
GR
GR
GS
[0.6 0 0 0.6 101.14286 284.19999] CT
0.149 GC
/Helvetica 16.667 F
GS
[1 0 0 1 0 0] CT
-14 17 moveto 
1 -1 scale
(500) t 
GR
GR
GS
[0.6 0 0 0.6 147.68571 284.19999] CT
0.149 GC
/Helvetica 16.667 F
GS
[1 0 0 1 0 0] CT
-19 17 moveto 
1 -1 scale
(1000) t 
GR
GR
GS
[0.6 0 0 0.6 194.22858 284.19999] CT
0.149 GC
/Helvetica 16.667 F
GS
[1 0 0 1 0 0] CT
-19 17 moveto 
1 -1 scale
(1500) t 
GR
GR
GS
[0.6 0 0 0.6 240.77142 284.19999] CT
0.149 GC
/Helvetica 16.667 F
GS
[1 0 0 1 0 0] CT
-19 17 moveto 
1 -1 scale
(2000) t 
GR
GR
GS
[0.6 0 0 0.6 287.31429 284.19999] CT
0.149 GC
/Helvetica 16.667 F
GS
[1 0 0 1 0 0] CT
-19 17 moveto 
1 -1 scale
(2500) t 
GR
GR
GS
[0.6 0 0 0.6 333.85715 284.19999] CT
0.149 GC
/Helvetica 16.667 F
GS
[1 0 0 1 0 0] CT
-19 17 moveto 
1 -1 scale
(3000) t 
GR
GR
GS
[0.6 0 0 0.6 380.4 284.19999] CT
0.149 GC
/Helvetica 16.667 F
GS
[1 0 0 1 0 0] CT
-19 17 moveto 
1 -1 scale
(3500) t 
GR
GR
GS
[0.6 0 0 0.6 217.50016 297.79999] CT
0.149 GC
/Helvetica 18.333 F
GS
[1 0 0 1 0 0] CT
-20 19 moveto 
1 -1 scale
(s [m]) t 
GR
GR
GS
[0.6 0 0 0.6 0 0] CT
0.149 GC
2 setlinecap
1 LJ
0.833 LW
N
91 467 M
91 39 L
S
GR
GS
[0.6 0 0 0.6 0 0] CT
0.149 GC
2 setlinecap
1 LJ
0.833 LW
N
634 467 M
634 39 L
S
GR
GS
[0.6 0 0 0.6 0 0] CT
0.149 GC
2 setlinecap
1 LJ
0.833 LW
N
91 467 M
96.43 467 L
S
GR
GS
[0.6 0 0 0.6 0 0] CT
0.149 GC
2 setlinecap
1 LJ
0.833 LW
N
91 405.857 M
96.43 405.857 L
S
GR
GS
[0.6 0 0 0.6 0 0] CT
0.149 GC
2 setlinecap
1 LJ
0.833 LW
N
91 344.714 M
96.43 344.714 L
S
GR
GS
[0.6 0 0 0.6 0 0] CT
0.149 GC
2 setlinecap
1 LJ
0.833 LW
N
91 283.571 M
96.43 283.571 L
S
GR
GS
[0.6 0 0 0.6 0 0] CT
0.149 GC
2 setlinecap
1 LJ
0.833 LW
N
91 222.429 M
96.43 222.429 L
S
GR
GS
[0.6 0 0 0.6 0 0] CT
0.149 GC
2 setlinecap
1 LJ
0.833 LW
N
91 161.286 M
96.43 161.286 L
S
GR
GS
[0.6 0 0 0.6 0 0] CT
0.149 GC
2 setlinecap
1 LJ
0.833 LW
N
91 100.143 M
96.43 100.143 L
S
GR
GS
[0.6 0 0 0.6 0 0] CT
0.149 GC
2 setlinecap
1 LJ
0.833 LW
N
91 39 M
96.43 39 L
S
GR
GS
[0.6 0 0 0.6 0 0] CT
0.149 GC
2 setlinecap
1 LJ
0.833 LW
N
634 467 M
628.57 467 L
S
GR
GS
[0.6 0 0 0.6 0 0] CT
0.149 GC
2 setlinecap
1 LJ
0.833 LW
N
634 405.857 M
628.57 405.857 L
S
GR
GS
[0.6 0 0 0.6 0 0] CT
0.149 GC
2 setlinecap
1 LJ
0.833 LW
N
634 344.714 M
628.57 344.714 L
S
GR
GS
[0.6 0 0 0.6 0 0] CT
0.149 GC
2 setlinecap
1 LJ
0.833 LW
N
634 283.571 M
628.57 283.571 L
S
GR
GS
[0.6 0 0 0.6 0 0] CT
0.149 GC
2 setlinecap
1 LJ
0.833 LW
N
634 222.429 M
628.57 222.429 L
S
GR
GS
[0.6 0 0 0.6 0 0] CT
0.149 GC
2 setlinecap
1 LJ
0.833 LW
N
634 161.286 M
628.57 161.286 L
S
GR
GS
[0.6 0 0 0.6 0 0] CT
0.149 GC
2 setlinecap
1 LJ
0.833 LW
N
634 100.143 M
628.57 100.143 L
S
GR
GS
[0.6 0 0 0.6 0 0] CT
0.149 GC
2 setlinecap
1 LJ
0.833 LW
N
634 39 M
628.57 39 L
S
GR
GS
[0.6 0 0 0.6 50.6 280.2] CT
0.149 GC
/Helvetica 16.667 F
GS
[1 0 0 1 0 0] CT
-38 6.5 moveto 
1 -1 scale
(-0.08) t 
GR
GR
GS
[0.6 0 0 0.6 50.6 243.51429] CT
0.149 GC
/Helvetica 16.667 F
GS
[1 0 0 1 0 0] CT
-38 6.5 moveto 
1 -1 scale
(-0.06) t 
GR
GR
GS
[0.6 0 0 0.6 50.6 206.82858] CT
0.149 GC
/Helvetica 16.667 F
GS
[1 0 0 1 0 0] CT
-38 6.5 moveto 
1 -1 scale
(-0.04) t 
GR
GR
GS
[0.6 0 0 0.6 50.6 170.14286] CT
0.149 GC
/Helvetica 16.667 F
GS
[1 0 0 1 0 0] CT
-38 6.5 moveto 
1 -1 scale
(-0.02) t 
GR
GR
GS
[0.6 0 0 0.6 50.6 133.45714] CT
0.149 GC
/Helvetica 16.667 F
GS
[1 0 0 1 0 0] CT
-10 6.5 moveto 
1 -1 scale
(0) t 
GR
GR
GS
[0.6 0 0 0.6 50.6 96.77143] CT
0.149 GC
/Helvetica 16.667 F
GS
[1 0 0 1 0 0] CT
-33 6.5 moveto 
1 -1 scale
(0.02) t 
GR
GR
GS
[0.6 0 0 0.6 50.6 60.08572] CT
0.149 GC
/Helvetica 16.667 F
GS
[1 0 0 1 0 0] CT
-33 6.5 moveto 
1 -1 scale
(0.04) t 
GR
GR
GS
[0.6 0 0 0.6 50.6 23.4] CT
0.149 GC
/Helvetica 16.667 F
GS
[1 0 0 1 0 0] CT
-33 6.5 moveto 
1 -1 scale
(0.06) t 
GR
GR
GS
[0 -0.6 0.6 0 24.8 151.79988] CT
0.149 GC
/Helvetica 18.333 F
GS
[1 0 0 1 0 0] CT
-33 -5 moveto 
1 -1 scale
(sklon [\260]) t 
GR
GR
GS
[0.6 0 0 0.6 0 0] CT
1 0 0 RC
[10 6] 0 setdash
2 LJ
0.833 LW
N
91 222.398 M
91.388 222.399 L
91.776 221.348 L
92.164 224.042 L
92.551 223.427 L
92.939 221.955 L
93.327 231.566 L
93.715 233.191 L
94.103 224.244 L
94.491 235.927 L
94.879 255.926 L
95.266 261.174 L
95.654 279.869 L
96.042 277.633 L
96.43 301.493 L
96.818 317.1 L
97.206 302.101 L
97.594 322.646 L
97.981 299.399 L
98.369 280.623 L
98.757 275.05 L
99.145 211.316 L
99.533 223.953 L
99.921 190.191 L
100.309 209.375 L
100.696 240.614 L
101.084 220.76 L
101.472 176.265 L
101.86 195.409 L
102.248 218.581 L
102.636 210.137 L
103.024 196.361 L
103.411 197.753 L
103.799 206.16 L
104.187 230.091 L
104.575 272.807 L
104.963 249.852 L
105.351 262.14 L
105.739 228.79 L
106.126 224.72 L
106.514 244.034 L
106.902 245.308 L
107.29 235.385 L
107.678 265.808 L
108.066 268.566 L
108.454 224.726 L
108.841 183.607 L
109.229 202.5 L
109.617 195.963 L
110.005 190.005 L
110.393 179.765 L
110.781 187.365 L
111.169 155.949 L
111.556 215.763 L
111.944 246.613 L
112.332 226.495 L
112.72 252.938 L
113.108 208.844 L
113.496 181.192 L
113.884 219.4 L
114.271 290.996 L
114.659 275.297 L
115.047 266.939 L
115.435 265.751 L
115.823 274.751 L
116.211 231.46 L
116.599 202.354 L
116.986 262.863 L
117.374 248.006 L
117.762 216.185 L
118.15 239.326 L
118.538 200.763 L
118.926 187.237 L
119.314 180.833 L
119.701 233.315 L
120.089 262.489 L
120.477 232.863 L
120.865 218.56 L
121.253 213.357 L
121.641 212.744 L
122.029 234.851 L
122.416 221.497 L
122.804 244.859 L
123.192 258.442 L
123.58 229.297 L
123.968 251.805 L
124.356 288.139 L
124.744 288.892 L
125.131 307.064 L
125.519 309.245 L
125.907 287.829 L
126.295 272.998 L
126.683 248.948 L
127.071 234.619 L
127.459 240.506 L
127.846 247.646 L
128.234 270.491 L
128.622 279.871 L
129.01 320.056 L
129.398 312.956 L
129.786 264.664 L
130.174 249.1 L
130.561 240.622 L
130.949 270.792 L
131.337 283.404 L
131.725 224.473 L
132.113 195.41 L
132.501 195.945 L
132.889 169.642 L
133.276 168.059 L
133.664 177.444 L
134.052 205.126 L
134.44 217.934 L
134.828 217.175 L
135.216 244.435 L
135.604 275.655 L
135.991 267.852 L
136.379 225 L
136.767 243.335 L
137.155 208.57 L
137.543 242.178 L
137.931 223.285 L
138.319 228.158 L
138.706 263.949 L
139.094 315.164 L
139.482 258.404 L
139.87 266.531 L
140.258 262.061 L
140.646 233.028 L
141.034 267.093 L
141.421 264.263 L
141.809 244.597 L
142.197 281.858 L
142.585 286.57 L
142.973 297.953 L
143.361 243.771 L
143.749 247.681 L
144.136 212.821 L
144.524 203.313 L
144.912 178.573 L
145.3 209.258 L
145.688 202.467 L
146.076 232.08 L
146.464 280.179 L
146.851 302.551 L
147.239 308.766 L
147.627 228.712 L
148.015 250.383 L
148.403 304.479 L
148.791 291.469 L
149.179 250.395 L
149.566 237.664 L
149.954 235.855 L
150.342 249.942 L
150.73 241.989 L
151.118 191.628 L
151.506 216.937 L
151.894 216.885 L
152.281 174.73 L
152.669 166.094 L
153.057 225.264 L
153.445 275.799 L
153.833 267.893 L
154.221 305.755 L
154.609 300.247 L
154.996 282.356 L
155.384 291.353 L
155.772 347.512 L
156.16 319.907 L
156.548 327.899 L
156.936 268.788 L
157.324 242.201 L
157.711 275.538 L
158.099 338.914 L
158.487 298.794 L
158.875 259.728 L
159.263 253.722 L
159.651 270.281 L
160.039 281.07 L
160.426 289.932 L
160.814 218.848 L
161.202 222.175 L
161.59 247.987 L
161.978 247.473 L
162.366 248.288 L
162.754 255.359 L
163.141 210.044 L
163.529 189.237 L
163.917 150.637 L
164.305 154.963 L
164.693 209.743 L
165.081 196.104 L
165.469 235.642 L
165.856 270.853 L
166.244 284.041 L
166.632 254.019 L
167.02 218.056 L
167.408 194.999 L
167.796 214.444 L
168.184 209.423 L
168.571 218.387 L
168.959 243.305 L
169.347 246.857 L
169.735 229.19 L
170.123 250.932 L
170.511 225.005 L
170.899 185.273 L
171.286 186.414 L
171.674 169.047 L
172.062 204.644 L
172.45 214.79 L
172.838 275.232 L
173.226 303.05 L
173.614 341.293 L
174.001 331.81 L
174.389 318.628 L
174.777 340.376 L
175.165 264.404 L
175.553 298.189 L
175.941 291.529 L
176.329 293.566 L
176.716 317.361 L
177.104 307.369 L
177.492 344.143 L
177.88 328.185 L
178.268 330.532 L
178.656 290.355 L
179.044 276.764 L
179.431 245.182 L
179.819 225.658 L
180.207 198.71 L
180.595 164.78 L
180.983 196.695 L
181.371 228.482 L
181.759 211.878 L
182.146 272.232 L
182.534 311.708 L
182.922 335.722 L
183.31 293.593 L
183.698 254.211 L
184.086 279.983 L
184.474 323.454 L
184.861 282.374 L
185.249 272.079 L
185.637 265.885 L
186.025 220.869 L
186.413 212.993 L
186.801 192.001 L
187.189 180.084 L
187.576 178.71 L
187.964 204.724 L
188.352 183.304 L
188.74 157.057 L
189.128 164.173 L
189.516 131.009 L
189.904 150.535 L
190.291 167.901 L
190.679 185.402 L
191.067 194.463 L
191.455 257.922 L
191.843 240.448 L
192.231 296.17 L
192.619 299.204 L
193.006 312.708 L
193.394 349.194 L
193.782 305.232 L
194.17 285.99 L
194.558 280.826 L
194.946 249.361 L
195.334 238.474 L
195.721 196.251 L
196.109 174.674 L
196.497 134.495 L
196.885 99.951 L
197.273 162.696 L
197.661 195.192 L
198.049 200.766 L
198.436 191.083 L
198.824 270.991 L
199.212 285.554 L
199.6 326.689 L
199.988 273.589 L
200.376 254.209 L
200.764 242.461 L
201.151 193.143 L
201.539 169.642 L
201.927 169.025 L
202.315 144.89 L
202.703 148.859 L
203.091 134.982 L
203.479 179.932 L
203.866 185.836 L
204.254 204 L
204.642 235.075 L
205.03 256.498 L
205.418 212.573 L
205.806 235.024 L
206.194 261.477 L
206.581 249.772 L
206.969 291.102 L
207.357 306.739 L
207.745 246.502 L
208.133 192.916 L
208.521 258.364 L
208.909 269.046 L
209.296 263.53 L
209.684 264.149 L
210.072 271.894 L
210.46 184.531 L
210.848 204.612 L
211.236 224.648 L
211.624 200.631 L
212.011 186.908 L
212.399 227.29 L
212.787 251.924 L
213.175 259.792 L
213.563 252.698 L
213.951 269.307 L
214.339 238.053 L
214.726 221.143 L
215.114 252.82 L
215.502 262.489 L
215.89 266.877 L
216.278 294.225 L
216.666 279.716 L
217.054 242.491 L
217.441 171.573 L
217.829 197.01 L
218.217 233.823 L
218.605 207.59 L
218.993 247.351 L
219.381 221.395 L
219.769 223.504 L
220.156 217.386 L
220.544 200.521 L
220.932 236.875 L
221.32 274.918 L
221.708 271.813 L
222.096 316.08 L
222.484 308.423 L
222.871 274.954 L
223.259 269.533 L
223.647 268.977 L
224.035 290.006 L
224.423 307.026 L
224.811 290.104 L
225.199 288.326 L
225.586 199.476 L
225.974 224.576 L
226.362 207.065 L
226.75 220.02 L
227.138 202.893 L
227.526 230.224 L
227.914 248.018 L
228.301 216.715 L
228.689 254.558 L
229.077 232.992 L
229.465 235.78 L
229.853 233.148 L
230.241 203.506 L
230.629 203.039 L
231.016 200.892 L
231.404 217.061 L
231.792 235.298 L
232.18 232.851 L
232.568 188.958 L
232.956 199.831 L
233.344 198.379 L
233.731 247.152 L
234.119 228.107 L
234.507 180.586 L
234.895 162.865 L
235.283 173.557 L
235.671 165.899 L
236.059 173.619 L
236.446 208.663 L
236.834 190.328 L
237.222 188.896 L
237.61 198.095 L
237.998 212.615 L
238.386 216.059 L
238.774 252.349 L
239.161 287.203 L
239.549 272.681 L
239.937 250.709 L
240.325 189.167 L
240.713 224.026 L
241.101 238.749 L
241.489 249.408 L
241.876 205.944 L
242.264 209.713 L
242.652 230.629 L
243.04 254.972 L
243.428 300.577 L
243.816 272.068 L
244.204 268.801 L
244.591 298.192 L
244.979 289.69 L
245.367 264.349 L
245.755 236.009 L
246.143 221.224 L
246.531 268.725 L
246.919 270.654 L
247.306 302.922 L
247.694 286.201 L
248.082 273.415 L
248.47 314.108 L
248.858 326.931 L
249.246 303.707 L
249.634 271.297 L
250.021 289.658 L
250.409 296.88 L
250.797 295.554 L
251.185 296.815 L
251.573 246.01 L
251.961 231.423 L
252.349 177.924 L
252.736 185.609 L
253.124 261.253 L
253.512 255.902 L
253.9 265.639 L
254.288 274.601 L
254.676 261.55 L
255.064 167.645 L
255.451 221.031 L
255.839 247.705 L
256.227 229.354 L
256.615 250.094 L
257.003 230.971 L
257.391 246.809 L
257.779 268.351 L
258.166 316.504 L
258.554 324.069 L
258.942 311.3 L
259.33 304.343 L
259.718 304.081 L
260.106 282.909 L
260.494 296.156 L
260.881 250.979 L
261.269 276.617 L
261.657 306.541 L
262.045 307.589 L
262.433 328.4 L
262.821 298.335 L
263.209 270.719 L
263.596 262.262 L
263.984 248.4 L
264.372 219.171 L
264.76 239.256 L
265.148 269.983 L
265.536 292.111 L
265.924 265.84 L
266.311 266.223 L
266.699 235.027 L
267.087 281.831 L
267.475 241.579 L
267.863 228.627 L
268.251 224.225 L
268.639 208.746 L
269.026 199.414 L
269.414 213.792 L
269.802 276.436 L
270.19 237.015 L
270.578 250.315 L
270.966 258.273 L
271.354 297.729 L
271.741 333.814 L
272.129 260.758 L
272.517 256.221 L
272.905 254.063 L
273.293 220.672 L
273.681 213.494 L
274.069 242.858 L
274.456 279.978 L
274.844 282.381 L
275.232 368.355 L
275.62 365.572 L
276.008 354.771 L
276.396 360.935 L
276.784 340.724 L
277.171 355.572 L
277.559 337.423 L
277.947 330.303 L
278.335 333.449 L
278.723 304.45 L
279.111 311.103 L
279.499 317.291 L
279.886 299 L
280.274 300.473 L
280.662 299.671 L
281.05 234.409 L
281.438 277.825 L
281.826 229.693 L
282.214 256.868 L
282.601 231.88 L
282.989 245.442 L
283.377 259.403 L
283.765 211.44 L
284.153 214.137 L
284.541 203.936 L
284.929 201.853 L
285.316 209.078 L
285.704 223.232 L
286.092 234.355 L
286.48 206.577 L
286.868 243.888 L
287.256 243.691 L
287.644 210.241 L
288.031 261.584 L
288.419 257.512 L
288.807 311.49 L
289.195 299.393 L
289.583 300.956 L
289.971 312.284 L
290.359 297.83 L
290.746 256.756 L
291.134 280.335 L
291.522 295.908 L
291.91 315.567 L
292.298 350.313 L
292.686 320.215 L
293.074 328.907 L
293.461 353.444 L
293.849 352.333 L
294.237 327.401 L
294.625 257.483 L
295.013 223.565 L
295.401 237.598 L
295.789 229.737 L
296.176 238.09 L
296.564 221.672 L
296.952 247.718 L
297.34 257.272 L
297.728 232.665 L
298.116 295.352 L
298.504 278.521 L
298.891 278.471 L
299.279 289.295 L
299.667 267.474 L
300.055 289.58 L
300.443 285.848 L
300.831 240.907 L
301.219 260.113 L
301.606 281.17 L
301.994 285.944 L
302.382 308.301 L
302.77 336.109 L
303.158 287.6 L
303.546 260.269 L
303.934 291.115 L
304.321 256.787 L
304.709 200.936 L
305.097 214.847 L
305.485 155.852 L
305.873 166.895 L
306.261 183.277 L
306.649 217.621 L
307.036 260.268 L
307.424 257.232 L
307.812 243.601 L
308.2 293.764 L
308.588 328.331 L
308.976 305.691 L
309.364 257.176 L
309.751 234.494 L
310.139 274.623 L
310.527 289.965 L
310.915 310.847 L
311.303 332.43 L
311.691 319.48 L
312.079 274.814 L
312.466 273.275 L
312.854 210.062 L
313.242 231.123 L
313.63 273.385 L
314.018 198.772 L
314.406 158.824 L
314.794 217.897 L
315.181 238.023 L
315.569 235.178 L
315.957 190.348 L
316.345 240.878 L
316.733 219.392 L
317.121 194.207 L
317.509 161.266 L
317.896 181.205 L
318.284 229.275 L
318.672 274.297 L
319.06 235.038 L
319.448 209.831 L
319.836 230.729 L
320.224 210.587 L
320.611 216.507 L
320.999 227.168 L
321.387 230.052 L
321.775 271.934 L
322.163 247.108 L
322.551 242.346 L
322.939 226.593 L
323.326 204.123 L
323.714 246.93 L
324.102 275.193 L
324.49 228.084 L
324.878 171.822 L
325.266 199.582 L
325.654 210.001 L
326.041 186.11 L
326.429 190.973 L
326.817 167.801 L
327.205 149.783 L
327.593 189.25 L
327.981 195.112 L
328.369 186.644 L
328.756 176.698 L
329.144 215.131 L
329.532 207.033 L
329.92 228.121 L
330.308 201.549 L
330.696 200.491 L
331.084 234 L
331.471 173.53 L
331.859 191.33 L
332.247 244.781 L
332.635 243.668 L
333.023 285.279 L
333.411 256.85 L
333.799 219.273 L
334.186 234.362 L
334.574 255.82 L
334.962 247.141 L
335.35 247.115 L
335.738 256.734 L
336.126 221.641 L
336.514 242.626 L
336.901 275.331 L
337.289 247.8 L
337.677 206.576 L
338.065 186.781 L
338.453 189.737 L
338.841 206.834 L
339.229 206.401 L
339.616 194.458 L
340.004 189.428 L
340.392 198.26 L
340.78 203.729 L
341.168 147.458 L
341.556 177.516 L
341.944 201.984 L
342.331 185.043 L
342.719 168.418 L
343.107 186.454 L
343.495 222.081 L
343.883 219.781 L
344.271 235.652 L
344.659 239.949 L
345.046 237.375 L
345.434 223.164 L
345.822 207.867 L
346.21 168.794 L
346.598 188.383 L
346.986 218.767 L
347.374 210.414 L
347.761 181.368 L
348.149 182.131 L
348.537 145.218 L
348.925 135.998 L
349.313 175.034 L
349.701 202.657 L
350.089 169.722 L
350.476 132.466 L
350.864 103.485 L
351.252 78.968 L
351.64 110.168 L
352.028 67.294 L
352.416 87.623 L
352.804 108.277 L
353.191 150.214 L
353.579 167.314 L
353.967 154.299 L
354.355 157.603 L
354.743 187.611 L
355.131 190.388 L
355.519 183.768 L
355.906 166.862 L
356.294 175.517 L
356.682 121.158 L
357.07 168.405 L
357.458 180.212 L
357.846 160.656 L
358.234 160.127 L
358.621 179.91 L
359.009 116.302 L
359.397 139.78 L
359.785 146.538 L
360.173 154.266 L
360.561 218.047 L
360.949 215.232 L
361.336 204.661 L
361.724 173.152 L
362.112 201.004 L
362.5 188.004 L
362.888 155.478 L
363.276 112.679 L
363.664 94.747 L
364.051 133.952 L
364.439 157.333 L
364.827 149.6 L
365.215 150.993 L
365.603 182.68 L
365.991 195.885 L
366.379 229.162 L
366.766 167.537 L
367.154 182.626 L
367.542 184.566 L
367.93 134.132 L
368.318 192.159 L
368.706 236.289 L
369.094 166.522 L
369.481 124.572 L
369.869 135.013 L
370.257 170.554 L
370.645 145.435 L
371.033 139.018 L
371.421 169.807 L
371.809 149.889 L
372.196 194.684 L
372.584 190.635 L
372.972 184.991 L
373.36 169.912 L
373.748 177.783 L
374.136 144.83 L
374.524 203.073 L
374.911 173.792 L
375.299 162.111 L
375.687 171.762 L
376.075 172.985 L
376.463 178.157 L
376.851 185.529 L
377.239 188.142 L
377.626 222.222 L
378.014 223.382 L
378.402 232.898 L
378.79 206.832 L
379.178 237.559 L
379.566 221.161 L
379.954 230.415 L
380.341 248.832 L
380.729 168.009 L
381.117 177.771 L
381.505 154.109 L
381.893 190.593 L
382.281 223.734 L
382.669 169.91 L
383.056 147.727 L
383.444 141.451 L
383.832 147.079 L
384.22 157.008 L
384.608 141.388 L
384.996 197.506 L
385.384 213.314 L
385.771 265.849 L
386.159 179.694 L
386.547 179.053 L
386.935 213.822 L
387.323 232.084 L
387.711 276.29 L
388.099 273.11 L
388.486 261.741 L
388.874 249.247 L
389.262 253.849 L
389.65 206.672 L
390.038 213.057 L
390.426 219.13 L
390.814 217.951 L
391.201 237.705 L
391.589 213.934 L
391.977 190.019 L
392.365 146.556 L
392.753 120.385 L
393.141 150.949 L
393.529 144.539 L
393.916 154.09 L
394.304 143.242 L
394.692 181.379 L
395.08 218.128 L
395.468 199.242 L
395.856 218.347 L
396.244 203.451 L
396.631 175.696 L
397.019 144.385 L
397.407 141.116 L
397.795 139.763 L
398.183 135.081 L
398.571 127.632 L
398.959 134.138 L
399.346 128.617 L
399.734 157.033 L
400.122 181.288 L
400.51 176.336 L
400.898 190.088 L
401.286 246.293 L
401.674 240.802 L
402.061 234.137 L
402.449 275.11 L
402.837 295.328 L
403.225 344.678 L
403.613 338.856 L
404.001 309.877 L
404.389 281.13 L
404.776 263.112 L
405.164 184.21 L
405.552 210.966 L
405.94 203.167 L
406.328 219.005 L
406.716 184.712 L
407.104 205.789 L
407.491 259.164 L
407.879 259.215 L
408.267 223.734 L
408.655 239.684 L
409.043 264.927 L
409.431 218.808 L
409.819 185.167 L
410.206 221.941 L
410.594 195.842 L
410.982 217.858 L
411.37 252.55 L
411.758 204.994 L
412.146 235.161 L
412.534 268.871 L
412.921 308.464 L
413.309 306.254 L
413.697 314.679 L
414.085 280.277 L
414.473 257.436 L
414.861 277.697 L
415.249 266.794 L
415.636 328.804 L
416.024 302.252 L
416.412 301.461 L
416.8 307.174 L
417.188 316.189 L
417.576 281.631 L
417.964 300.784 L
418.351 327.154 L
418.739 307.515 L
419.127 285.882 L
419.515 230.835 L
419.903 232.638 L
420.291 200.249 L
420.679 208.963 L
421.066 188.797 L
421.454 149.681 L
421.842 183.553 L
422.23 179.404 L
422.618 185.279 L
423.006 210.27 L
423.394 209.021 L
423.781 139.985 L
424.169 157.6 L
424.557 194.816 L
424.945 159.56 L
425.333 159.489 L
425.721 178.925 L
426.109 172.029 L
426.496 189.256 L
426.884 236.73 L
427.272 204.816 L
427.66 227.571 L
428.048 245.835 L
428.436 272.369 L
428.824 216.688 L
429.211 190.733 L
429.599 200.026 L
429.987 224.633 L
430.375 245.998 L
430.763 195.021 L
431.151 236.406 L
431.539 210.181 L
431.926 201.586 L
432.314 225.458 L
432.702 246.081 L
433.09 245.116 L
433.478 214.032 L
433.866 226.324 L
434.254 244.065 L
434.641 215.041 L
435.029 208.458 L
435.417 286.671 L
435.805 243.904 L
436.193 238.019 L
436.581 218.532 L
436.969 272.474 L
437.356 288.403 L
437.744 278.37 L
438.132 246.752 L
438.52 255.896 L
438.908 229.228 L
439.296 215.488 L
439.684 191.727 L
440.071 243.206 L
440.459 212.401 L
440.847 202.643 L
441.235 231.411 L
441.623 196.08 L
442.011 204.146 L
442.399 219.866 L
442.786 236.809 L
443.174 229.092 L
443.562 242.077 L
443.95 230.677 L
444.338 189.825 L
444.726 141.849 L
445.114 94.571 L
445.501 128.07 L
445.889 199.334 L
446.277 221.077 L
446.665 251.526 L
447.053 262.103 L
447.441 250.693 L
447.829 223.758 L
448.216 265.085 L
448.604 235.662 L
448.992 266.752 L
449.38 287.171 L
449.768 272.748 L
450.156 221.022 L
450.544 242.443 L
450.931 264.154 L
451.319 179.355 L
451.707 215.913 L
452.095 236.37 L
452.483 172.759 L
452.871 107.881 L
453.259 103.643 L
453.646 138.232 L
454.034 150.571 L
454.422 191.976 L
454.81 201.203 L
455.198 204.835 L
455.586 223.814 L
455.974 233.245 L
456.361 190.518 L
456.749 141.639 L
457.137 118.864 L
457.525 140.713 L
457.913 134.337 L
458.301 121.245 L
458.689 95.506 L
459.076 140.302 L
459.464 142.258 L
459.852 134.694 L
460.24 123.324 L
460.628 153.345 L
461.016 156.863 L
461.404 203.999 L
461.791 209.299 L
462.179 236.273 L
462.567 312.75 L
462.955 312.484 L
463.343 277.867 L
463.731 246.46 L
464.119 251.811 L
464.506 187.781 L
464.894 178.175 L
465.282 195.65 L
465.67 191.87 L
466.058 201.642 L
466.446 212.495 L
466.834 141.189 L
467.221 138.586 L
467.609 144.131 L
467.997 149.837 L
468.385 184.019 L
468.773 109.829 L
469.161 153.107 L
469.549 169.996 L
469.936 172.899 L
470.324 171.718 L
470.712 174.769 L
471.1 191.323 L
471.488 173.567 L
471.876 224.894 L
472.264 246.109 L
472.651 243.228 L
473.039 237.43 L
473.427 192.41 L
473.815 168.165 L
474.203 236.7 L
474.591 222.244 L
474.979 216.275 L
475.366 191.943 L
475.754 185.665 L
476.142 192.955 L
476.53 234.083 L
476.918 204.755 L
477.306 230.209 L
477.694 224.217 L
478.081 220.131 L
478.469 231.59 L
478.857 253.33 L
479.245 269.792 L
479.633 265.141 L
480.021 292.861 L
480.409 322.187 L
480.796 275.251 L
481.184 208.887 L
481.572 224.761 L
481.96 210.574 L
482.348 167.543 L
482.736 186.433 L
483.124 210.045 L
483.511 195.716 L
483.899 214.272 L
484.287 202.78 L
484.675 200.878 L
485.063 209.971 L
485.451 236.691 L
485.839 214.217 L
486.226 211.486 L
486.614 196.962 L
487.002 165.61 L
487.39 147.927 L
487.778 121.911 L
488.166 162.16 L
488.554 187.027 L
488.941 208.81 L
489.329 237.857 L
489.717 235.151 L
490.105 242.224 L
490.493 259.505 L
490.881 217.771 L
491.269 221.86 L
491.656 194.607 L
492.044 248.558 L
492.432 194.685 L
492.82 203.963 L
493.208 201.621 L
493.596 164.124 L
493.984 149.092 L
494.371 154.195 L
494.759 175.609 L
495.147 166.347 L
495.535 210.749 L
495.923 263.131 L
496.311 251.879 L
496.699 240.159 L
497.086 169.174 L
497.474 127.062 L
497.862 142.857 L
498.25 139.495 L
498.638 110.883 L
499.026 114.27 L
499.414 107.806 L
499.801 165.961 L
500.189 236.099 L
500.577 188.93 L
500.965 210.355 L
501.353 165.318 L
501.741 199.516 L
502.129 199.255 L
502.516 172.15 L
502.904 212.081 L
503.292 213.316 L
503.68 186.646 L
504.068 183.15 L
504.456 212.729 L
504.844 242.333 L
505.231 215.968 L
505.619 182.944 L
506.007 201.173 L
506.395 195.834 L
506.783 199.962 L
507.171 135.307 L
507.559 137.465 L
507.946 137.53 L
508.334 156.24 L
508.722 186.429 L
509.11 224.586 L
509.498 193.775 L
509.886 202.437 L
510.274 255.186 L
510.661 227.311 L
511.049 168.832 L
511.437 179.342 L
511.825 114.147 L
512.213 162.082 L
512.601 228.797 L
512.989 168.232 L
513.376 188.777 L
513.764 219.654 L
514.152 218.179 L
514.54 228.802 L
514.928 192.563 L
515.316 214.706 L
515.704 212.066 L
516.091 217.982 L
516.479 197.322 L
516.867 161.9 L
517.255 208.25 L
517.643 185.721 L
518.031 145.48 L
518.419 201.793 L
518.806 265.009 L
519.194 273.501 L
519.582 240.912 L
519.97 240.328 L
520.358 256.593 L
520.746 225.225 L
521.134 229.794 L
521.521 191.94 L
521.909 174.897 L
522.297 182.055 L
522.685 213.351 L
523.073 269.46 L
523.461 224.797 L
523.849 203.945 L
524.236 190.123 L
524.624 217.347 L
525.012 239.704 L
525.4 225.338 L
525.788 262.98 L
526.176 208.522 L
526.564 210.142 L
526.951 168.609 L
527.339 163.929 L
527.727 211.726 L
528.115 210.054 L
528.503 232.938 L
528.891 281.833 L
529.279 274.226 L
529.666 230.666 L
530.054 260.739 L
530.442 271.846 L
530.83 314.466 L
531.218 323.594 L
531.606 334.98 L
531.994 367.024 L
532.381 364.963 L
532.769 419.684 L
533.157 326.787 L
533.545 269.067 L
533.933 269.035 L
534.321 272.371 L
534.709 272.797 L
535.096 244.396 L
535.484 247.182 L
535.872 289.196 L
536.26 310.64 L
536.648 318.272 L
537.036 308.477 L
537.424 350.404 L
537.811 339.115 L
538.199 264.682 L
538.587 278.837 L
538.975 244.787 L
539.363 249.804 L
539.751 269.58 L
540.139 271.231 L
540.526 272.605 L
540.914 308.343 L
541.302 287.083 L
541.69 333.164 L
542.078 314.139 L
542.466 260.026 L
542.854 266.898 L
543.241 289.021 L
543.629 277.057 L
544.017 300.431 L
544.405 328.207 L
544.793 300.722 L
545.181 269.638 L
545.569 300.292 L
545.956 311.259 L
546.344 332.393 L
546.732 310.385 L
547.12 283.598 L
547.508 293.636 L
547.896 308.205 L
548.284 343.995 L
548.671 347.493 L
549.059 367.29 L
549.447 329.251 L
549.835 325.244 L
550.223 280.805 L
550.611 287.539 L
550.999 290.916 L
551.386 275.616 L
551.774 248.271 L
552.162 227.293 L
552.55 228.161 L
552.938 235.161 L
553.326 252.932 L
553.714 282.172 L
554.101 297.787 L
554.489 281.155 L
554.877 267.285 L
555.265 290.053 L
555.653 316.618 L
556.041 304.332 L
556.429 306.602 L
556.816 325.974 L
557.204 306.084 L
557.592 313.491 L
557.98 362.702 L
558.368 385.259 L
558.756 363.922 L
559.144 324.412 L
559.531 303.224 L
559.919 279.896 L
560.307 244.788 L
560.695 225.029 L
561.083 237.341 L
561.471 271.32 L
561.859 278.371 L
562.246 323.919 L
562.634 303.22 L
563.022 311.996 L
563.41 296.549 L
563.798 272.696 L
564.186 248.163 L
564.574 249.607 L
564.961 238.735 L
565.349 310.516 L
565.737 310.957 L
566.125 295.081 L
566.513 305.609 L
566.901 248.756 L
567.289 272.765 L
567.676 295.85 L
568.064 324.882 L
568.452 345.367 L
568.84 288.702 L
569.228 266.957 L
569.616 326.184 L
570.004 361.005 L
570.391 367.074 L
570.779 401.351 L
571.167 398.849 L
571.555 401.075 L
571.943 428.035 L
572.331 395.878 L
572.719 367.8 L
573.106 403.655 L
573.494 418.671 L
573.882 390.31 L
574.27 410.912 L
574.658 415.989 L
575.046 433.71 L
575.434 425.137 L
575.821 405.753 L
576.209 430.706 L
576.597 445.004 L
576.985 401.641 L
577.373 365.762 L
577.761 376.797 L
578.149 345.917 L
578.536 288.633 L
578.924 296.188 L
579.312 294.099 L
579.7 303.923 L
580.088 310.659 L
580.476 280.324 L
580.864 360.751 L
581.251 351.53 L
581.639 376.359 L
582.027 426.089 L
582.415 410.621 L
582.803 389.801 L
583.191 370.103 L
583.579 362.78 L
583.966 325.593 L
584.354 328.449 L
584.742 333.239 L
585.13 293.883 L
585.518 332.199 L
585.906 336.909 L
586.294 334.577 L
586.681 305.34 L
587.069 300.411 L
587.457 290.877 L
587.845 297.706 L
588.233 289.883 L
588.621 287.134 L
589.009 300.03 L
589.396 310.955 L
589.784 283.358 L
590.172 273.742 L
590.56 328.685 L
590.948 355.047 L
591.336 432.63 L
591.724 415.923 L
592.111 360.918 L
592.499 372.027 L
592.887 418.883 L
593.275 403.792 L
593.663 382.465 L
594.051 415.436 L
594.439 402.316 L
594.826 374.243 L
595.214 330.397 L
595.602 338.406 L
595.99 356.157 L
596.378 315.589 L
596.766 323.599 L
597.154 313.439 L
597.541 316.542 L
597.929 331.968 L
598.317 309.889 L
598.705 326.637 L
599.093 328.971 L
599.481 270.828 L
599.869 290.971 L
600.256 231.536 L
600.644 262.599 L
601.032 227.551 L
601.42 167.508 L
601.808 131.289 L
602.196 150.601 L
602.584 164.02 L
602.971 124.726 L
603.359 179.381 L
603.747 234.963 L
604.135 240.064 L
604.523 246.951 L
604.911 307.494 L
605.299 354.22 L
605.686 291.556 L
606.074 312.657 L
606.462 304.107 L
606.85 342.668 L
607.238 336.098 L
607.626 338.348 L
608.014 332.15 L
608.401 332.272 L
608.789 297.921 L
609.177 273.687 L
609.565 286.112 L
609.953 277.945 L
610.341 283.513 L
610.729 269.029 L
611.116 271.89 L
611.504 318.862 L
611.892 309.684 L
612.28 308.459 L
612.668 328.376 L
613.056 336.862 L
613.444 324.259 L
613.831 301.498 L
614.219 282.694 L
614.607 261.362 L
614.995 290.5 L
615.383 249.905 L
615.771 299.88 L
616.159 302.442 L
616.546 279.263 L
616.934 295.496 L
617.322 314.381 L
617.71 262.664 L
618.098 226.131 L
618.486 209.432 L
S
GR
GS
[0.6 0 0 0.6 0 0] CT
0 0 1 RC
1 LJ
3.333 LW
N
91 222.398 M
91.388 222.398 L
91.776 222.152 L
92.164 221.589 L
92.551 220.735 L
92.939 219.978 L
93.327 219.157 L
93.715 219.587 L
94.103 223.141 L
94.491 224.042 L
94.879 230.558 L
95.266 234.535 L
95.654 235.02 L
96.042 235.957 L
96.43 236.096 L
96.818 237.351 L
97.206 236.455 L
97.594 236.408 L
97.981 239.061 L
98.369 239.079 L
98.757 240.121 L
99.145 239.514 L
99.533 240.664 L
99.921 242.466 L
100.309 243.98 L
100.696 245.419 L
101.084 244.58 L
101.472 240.996 L
101.86 242.218 L
102.248 240.42 L
102.636 239.324 L
103.024 236.963 L
103.411 235.805 L
103.799 235.514 L
104.187 236.161 L
104.575 236.252 L
104.963 240.042 L
105.351 240.688 L
105.739 237.06 L
106.126 240.519 L
106.514 239.68 L
106.902 243.002 L
107.29 242.582 L
107.678 240.732 L
108.066 240.427 L
108.454 240.972 L
108.841 240.345 L
109.229 238.104 L
109.617 236.997 L
110.005 235.439 L
110.393 236.853 L
110.781 237.457 L
111.169 236.417 L
111.556 240.807 L
111.944 245.267 L
112.332 245.524 L
112.72 245.217 L
113.108 242.896 L
113.496 244.893 L
113.884 242.994 L
114.271 242.24 L
114.659 241.294 L
115.047 242.452 L
115.435 239.328 L
115.823 241.894 L
116.211 244.374 L
116.599 244.285 L
116.986 241.089 L
117.374 240.503 L
117.762 242.102 L
118.15 239.049 L
118.538 240.605 L
118.926 239.187 L
119.314 237.72 L
119.701 240.34 L
120.089 238.746 L
120.477 240.675 L
120.865 239.63 L
121.253 243.29 L
121.641 239.107 L
122.029 242.109 L
122.416 242.349 L
122.804 241.587 L
123.192 239.228 L
123.58 234.992 L
123.968 233.28 L
124.356 231.518 L
124.744 231.202 L
125.131 236.346 L
125.519 238.627 L
125.907 236.054 L
126.295 238.271 L
126.683 236.354 L
127.071 234.987 L
127.459 238.981 L
127.846 238.604 L
128.234 239.349 L
128.622 240.755 L
129.01 241.244 L
129.398 242.797 L
129.786 246.337 L
130.174 249.189 L
130.561 252.436 L
130.949 253.117 L
131.337 252.517 L
131.725 253.299 L
132.113 253.104 L
132.501 252.928 L
132.889 250.458 L
133.276 248.245 L
133.664 250.746 L
134.052 254.603 L
134.44 255.839 L
134.828 256.266 L
135.216 255.615 L
135.604 253.11 L
135.991 254.064 L
136.379 252.285 L
136.767 253.314 L
137.155 251.993 L
137.543 252.67 L
137.931 253.822 L
138.319 251.97 L
138.706 253.8 L
139.094 253.174 L
139.482 256.466 L
139.87 256.541 L
140.258 257.901 L
140.646 255.778 L
141.034 254.075 L
141.421 249.457 L
141.809 250.054 L
142.197 251.101 L
142.585 253.372 L
142.973 253.708 L
143.361 252.65 L
143.749 257.171 L
144.136 253.916 L
144.524 251.996 L
144.912 249.101 L
145.3 249.707 L
145.688 251.213 L
146.076 247.519 L
146.464 247.494 L
146.851 246.396 L
147.239 246.78 L
147.627 246.308 L
148.015 247.872 L
148.403 246.878 L
148.791 245.077 L
149.179 240.826 L
149.566 243.494 L
149.954 245.08 L
150.342 243.915 L
150.73 248.248 L
151.118 249.949 L
151.506 250.506 L
151.894 252.908 L
152.281 255.21 L
152.669 255.711 L
153.057 257.226 L
153.445 256.771 L
153.833 255.825 L
154.221 254.963 L
154.609 253.135 L
154.996 248.476 L
155.384 249.68 L
155.772 249.941 L
156.16 246.929 L
156.548 247.687 L
156.936 249.828 L
157.324 249.673 L
157.711 251.756 L
158.099 248.524 L
158.487 244.41 L
158.875 246.193 L
159.263 248.534 L
159.651 253.299 L
160.039 251.394 L
160.426 248.388 L
160.814 250.989 L
161.202 252.266 L
161.59 246.386 L
161.978 247.749 L
162.366 244.639 L
162.754 246.206 L
163.141 249.626 L
163.529 248.985 L
163.917 249.313 L
164.305 248.926 L
164.693 249.661 L
165.081 253.165 L
165.469 249.232 L
165.856 250.112 L
166.244 252.47 L
166.632 251.432 L
167.02 248.961 L
167.408 246.837 L
167.796 249.554 L
168.184 250.216 L
168.571 251.584 L
168.959 252.4 L
169.347 250.301 L
169.735 250.339 L
170.123 248.598 L
170.511 247.585 L
170.899 245.283 L
171.286 246.067 L
171.674 248.332 L
172.062 250.178 L
172.45 247.074 L
172.838 248.715 L
173.226 247.368 L
173.614 249.113 L
174.001 249.374 L
174.389 253.347 L
174.777 248.855 L
175.165 253.283 L
175.553 250.986 L
175.941 249.045 L
176.329 251.491 L
176.716 250.47 L
177.104 249.938 L
177.492 247.178 L
177.88 244.773 L
178.268 246.571 L
178.656 245.023 L
179.044 249.538 L
179.431 252.624 L
179.819 254.137 L
180.207 254.766 L
180.595 257.981 L
180.983 253.76 L
181.371 253.969 L
181.759 255.978 L
182.146 253.041 L
182.534 254.603 L
182.922 254.26 L
183.31 251.924 L
183.698 250.589 L
184.086 247.611 L
184.474 249.746 L
184.861 248.818 L
185.249 250.082 L
185.637 252.14 L
186.025 247.648 L
186.413 248.346 L
186.801 249.834 L
187.189 248.505 L
187.576 248.668 L
187.964 243.551 L
188.352 237.352 L
188.74 235.521 L
189.128 228.243 L
189.516 225.527 L
189.904 225.004 L
190.291 224.255 L
190.679 221.151 L
191.067 227.253 L
191.455 225.56 L
191.843 224.643 L
192.231 225.224 L
192.619 226.848 L
193.006 225.529 L
193.394 227.601 L
193.782 226.988 L
194.17 229.096 L
194.558 230.772 L
194.946 229.052 L
195.334 230.751 L
195.721 233.12 L
196.109 232.654 L
196.497 231.517 L
196.885 231.7 L
197.273 227.154 L
197.661 225.411 L
198.049 222.917 L
198.436 223.853 L
198.824 223.955 L
199.212 224.366 L
199.6 227.139 L
199.988 225.928 L
200.376 225.104 L
200.764 223.787 L
201.151 224.537 L
201.539 228.859 L
201.927 233.202 L
202.315 232.917 L
202.703 231.251 L
203.091 229.267 L
203.479 232.775 L
203.866 230.231 L
204.254 230.635 L
204.642 231.432 L
205.03 231.529 L
205.418 229.463 L
205.806 229.796 L
206.194 227.918 L
206.581 232.876 L
206.969 231.895 L
207.357 232.434 L
207.745 229.68 L
208.133 226.663 L
208.521 227.524 L
208.909 224.939 L
209.296 225.669 L
209.684 229.504 L
210.072 234.487 L
210.46 236.086 L
210.848 237.241 L
211.236 241.601 L
211.624 242.81 L
212.011 238.161 L
212.399 239.19 L
212.787 244.124 L
213.175 244.545 L
213.563 242.614 L
213.951 244.933 L
214.339 247.369 L
214.726 246.311 L
215.114 245.462 L
215.502 245.171 L
215.89 244.213 L
216.278 244.853 L
216.666 245.106 L
217.054 247.139 L
217.441 246.052 L
217.829 247.668 L
218.217 244.798 L
218.605 243.403 L
218.993 242.754 L
219.381 246.774 L
219.769 246.522 L
220.156 244.153 L
220.544 240.561 L
220.932 240.716 L
221.32 237.189 L
221.708 241.034 L
222.096 240.575 L
222.484 240.465 L
222.871 238.966 L
223.259 238.784 L
223.647 237.465 L
224.035 237.121 L
224.423 237.556 L
224.811 232.062 L
225.199 231.257 L
225.586 232.08 L
225.974 233.655 L
226.362 236.593 L
226.75 235.527 L
227.138 235.395 L
227.526 237.403 L
227.914 237.269 L
228.301 236.264 L
228.689 235.158 L
229.077 229.915 L
229.465 229.862 L
229.853 228.635 L
230.241 230.785 L
230.629 228.731 L
231.016 229.479 L
231.404 229.43 L
231.792 224.273 L
232.18 228.495 L
232.568 231.581 L
232.956 232.246 L
233.344 228.45 L
233.731 228.101 L
234.119 225.694 L
234.507 229.681 L
234.895 230.345 L
235.283 229.425 L
235.671 230.285 L
236.059 232.467 L
236.446 236.675 L
236.834 239.473 L
237.222 240.387 L
237.61 242.353 L
237.998 237.576 L
238.386 236.501 L
238.774 233.495 L
239.161 237.786 L
239.549 237.985 L
239.937 239.438 L
240.325 240.488 L
240.713 245.145 L
241.101 244.643 L
241.489 244.624 L
241.876 240.911 L
242.264 242.345 L
242.652 242.714 L
243.04 245.297 L
243.428 244.948 L
243.816 246.05 L
244.204 250.335 L
244.591 244.503 L
244.979 245.432 L
245.367 242.868 L
245.755 243.973 L
246.143 241.393 L
246.531 239.946 L
246.919 240.544 L
247.306 238.556 L
247.694 238.264 L
248.082 238.566 L
248.47 238.517 L
248.858 242.937 L
249.246 240.665 L
249.634 240.826 L
250.021 242.49 L
250.409 247.617 L
250.797 251.064 L
251.185 252.617 L
251.573 249.708 L
251.961 249.812 L
252.349 250.03 L
252.736 251.543 L
253.124 249.884 L
253.512 249.231 L
253.9 254.866 L
254.288 255.797 L
254.676 257.789 L
255.064 262.67 L
255.451 261.117 L
255.839 263.602 L
256.227 267.25 L
256.615 269.349 L
257.003 265.769 L
257.391 265.615 L
257.779 267.306 L
258.166 265.547 L
258.554 265.55 L
258.942 265.864 L
259.33 271.186 L
259.718 270.025 L
260.106 270.756 L
260.494 273.804 L
260.881 274.419 L
261.269 275.547 L
261.657 276.017 L
262.045 283.607 L
262.433 283.527 L
262.821 285.905 L
263.209 279.817 L
263.596 278.895 L
263.984 278.043 L
264.372 276.178 L
264.76 273.059 L
265.148 274.565 L
265.536 275.18 L
265.924 275.886 L
266.311 277.522 L
266.699 280.069 L
267.087 277.912 L
267.475 281.925 L
267.863 280.689 L
268.251 282.138 L
268.639 281.695 L
269.026 276 L
269.414 282.255 L
269.802 281.155 L
270.19 278.73 L
270.578 277.604 L
270.966 278.644 L
271.354 280.915 L
271.741 282.836 L
272.129 285.274 L
272.517 286.381 L
272.905 284.624 L
273.293 284.442 L
273.681 283.048 L
274.069 279.702 L
274.456 275.012 L
274.844 278.587 L
275.232 280.194 L
275.62 277.266 L
276.008 281.966 L
276.396 279.955 L
276.784 280.045 L
277.171 279.03 L
277.559 280.283 L
277.947 279.642 L
278.335 281.052 L
278.723 282.548 L
279.111 280.785 L
279.499 283.588 L
279.886 285.424 L
280.274 283.211 L
280.662 283.096 L
281.05 281.162 L
281.438 278.075 L
281.826 279.628 L
282.214 278.435 L
282.601 277.862 L
282.989 280.678 L
283.377 280.312 L
283.765 275.17 L
284.153 273.585 L
284.541 272.248 L
284.929 271.481 L
285.316 274.02 L
285.704 278.234 L
286.092 276.791 L
286.48 278.365 L
286.868 274.908 L
287.256 276.17 L
287.644 270.276 L
288.031 270.064 L
288.419 272.866 L
288.807 270.685 L
289.195 271.416 L
289.583 269.091 L
289.971 269.764 L
290.359 269.532 L
290.746 267.478 L
291.134 263.302 L
291.522 262.938 L
291.91 265.107 L
292.298 267.109 L
292.686 266.992 L
293.074 264.565 L
293.461 269.771 L
293.849 268.805 L
294.237 272.003 L
294.625 273.006 L
295.013 270.643 L
295.401 268.06 L
295.789 265.06 L
296.176 265.991 L
296.564 267.874 L
296.952 271.286 L
297.34 273.163 L
297.728 273.219 L
298.116 272.213 L
298.504 268.743 L
298.891 272.756 L
299.279 273.942 L
299.667 275.357 L
300.055 273.681 L
300.443 270.962 L
300.831 268.76 L
301.219 266.776 L
301.606 268.104 L
301.994 261.783 L
302.382 259.132 L
302.77 261.359 L
303.158 263.103 L
303.546 259.927 L
303.934 261.792 L
304.321 259.124 L
304.709 259.332 L
305.097 258.157 L
305.485 255.383 L
305.873 255.356 L
306.261 251.345 L
306.649 251.354 L
307.036 253.221 L
307.424 247.792 L
307.812 252.816 L
308.2 250.164 L
308.588 249.763 L
308.976 247.365 L
309.364 247.136 L
309.751 248.748 L
310.139 249.674 L
310.527 250.625 L
310.915 246.421 L
311.303 245.466 L
311.691 242.609 L
312.079 243.5 L
312.466 241.938 L
312.854 244.106 L
313.242 244.725 L
313.63 244.988 L
314.018 243.85 L
314.406 242.607 L
314.794 241.671 L
315.181 238.441 L
315.569 237.746 L
315.957 238.781 L
316.345 240.312 L
316.733 237.842 L
317.121 237.451 L
317.509 235.765 L
317.896 236.229 L
318.284 234.473 L
318.672 236.669 L
319.06 233.957 L
319.448 235.145 L
319.836 233.734 L
320.224 235.362 L
320.611 234.087 L
320.999 231.536 L
321.387 226.521 L
321.775 231.588 L
322.163 233.816 L
322.551 230.1 L
322.939 230.81 L
323.326 231.918 L
323.714 233.729 L
324.102 232.976 L
324.49 230.234 L
324.878 228.839 L
325.266 226.613 L
325.654 225.014 L
326.041 217.107 L
326.429 216.161 L
326.817 214.005 L
327.205 214.19 L
327.593 215.856 L
327.981 213.944 L
328.369 211.751 L
328.756 211.83 L
329.144 209.352 L
329.532 214.336 L
329.92 212.173 L
330.308 208.085 L
330.696 208.781 L
331.084 213.285 L
331.471 216.483 L
331.859 217.271 L
332.247 214.815 L
332.635 214.221 L
333.023 217.682 L
333.411 216.953 L
333.799 217.573 L
334.186 212.087 L
334.574 210.202 L
334.962 210.014 L
335.35 208.347 L
335.738 207.351 L
336.126 206.152 L
336.514 208.032 L
336.901 208.038 L
337.289 206.476 L
337.677 207.059 L
338.065 207.814 L
338.453 205.362 L
338.841 204.785 L
339.229 204.131 L
339.616 207.654 L
340.004 206.584 L
340.392 203.251 L
340.78 201.67 L
341.168 201.174 L
341.556 201.188 L
341.944 203.274 L
342.331 207.457 L
342.719 206.923 L
343.107 203.909 L
343.495 203.696 L
343.883 199.364 L
344.271 199.239 L
344.659 197.609 L
345.046 196.451 L
345.434 196.411 L
345.822 190.706 L
346.21 189.588 L
346.598 186.416 L
346.986 180.329 L
347.374 175.832 L
347.761 174.057 L
348.149 170.259 L
348.537 171.035 L
348.925 167.169 L
349.313 168.982 L
349.701 172.725 L
350.089 171.404 L
350.476 168.808 L
350.864 167.433 L
351.252 164.228 L
351.64 161.474 L
352.028 165.258 L
352.416 162.443 L
352.804 163.125 L
353.191 166.05 L
353.579 168.894 L
353.967 169.777 L
354.355 168.12 L
354.743 171.115 L
355.131 171.499 L
355.519 176.145 L
355.906 173.894 L
356.294 171.839 L
356.682 171.31 L
357.07 168.655 L
357.458 170.567 L
357.846 171.307 L
358.234 173.6 L
358.621 171.078 L
359.009 169.718 L
359.397 170.519 L
359.785 167.299 L
360.173 168.109 L
360.561 169.501 L
360.949 169.652 L
361.336 167.729 L
361.724 167.586 L
362.112 166.678 L
362.5 166.704 L
362.888 164.648 L
363.276 162.474 L
363.664 161.752 L
364.051 159.091 L
364.439 159.084 L
364.827 160.198 L
365.215 160.81 L
365.603 162.984 L
365.991 161.202 L
366.379 159.767 L
366.766 162.843 L
367.154 162.3 L
367.542 163.207 L
367.93 160.765 L
368.318 162.084 L
368.706 165.031 L
369.094 167.041 L
369.481 166.124 L
369.869 168.087 L
370.257 173.924 L
370.645 174.415 L
371.033 170.754 L
371.421 170.316 L
371.809 172.215 L
372.196 177.805 L
372.584 182.748 L
372.972 184.576 L
373.36 183.829 L
373.748 186.135 L
374.136 186.047 L
374.524 182.817 L
374.911 182.895 L
375.299 184.392 L
375.687 186.476 L
376.075 178.208 L
376.463 187.044 L
376.851 192.471 L
377.239 191.89 L
377.626 188.76 L
378.014 189.043 L
378.402 193.291 L
378.79 192.103 L
379.178 192.859 L
379.566 189.358 L
379.954 189.37 L
380.341 185.488 L
380.729 185.082 L
381.117 186.402 L
381.505 191.325 L
381.893 192.061 L
382.281 186.495 L
382.669 186.052 L
383.056 184.752 L
383.444 185.796 L
383.832 186.783 L
384.22 190.503 L
384.608 192.148 L
384.996 190.703 L
385.384 189.14 L
385.771 185.738 L
386.159 189.095 L
386.547 187.355 L
386.935 190.243 L
387.323 187.65 L
387.711 191.5 L
388.099 189.886 L
388.486 191.734 L
388.874 189.231 L
389.262 189.484 L
389.65 189.439 L
390.038 191.677 L
390.426 192.375 L
390.814 191.024 L
391.201 189.473 L
391.589 186.472 L
391.977 192.645 L
392.365 191.718 L
392.753 189.271 L
393.141 186.487 L
393.529 186.829 L
393.916 186.088 L
394.304 187.577 L
394.692 189.156 L
395.08 190.356 L
395.468 192.311 L
395.856 198.218 L
396.244 201.197 L
396.631 206.609 L
397.019 209.804 L
397.407 214.035 L
397.795 209.995 L
398.183 212.897 L
398.571 212.737 L
398.959 214.226 L
399.346 212.377 L
399.734 214.906 L
400.122 213.287 L
400.51 212.399 L
400.898 213.201 L
401.286 214.444 L
401.674 219.3 L
402.061 223.578 L
402.449 223.108 L
402.837 223.915 L
403.225 224.156 L
403.613 223.912 L
404.001 223.572 L
404.389 224.534 L
404.776 219.558 L
405.164 221.994 L
405.552 225.656 L
405.94 227.663 L
406.328 226.679 L
406.716 224.021 L
407.104 224.682 L
407.491 223.464 L
407.879 223.78 L
408.267 223.227 L
408.655 225.352 L
409.043 222.953 L
409.431 220.865 L
409.819 222.432 L
410.206 219.223 L
410.594 218.885 L
410.982 220.295 L
411.37 222.398 L
411.758 222.127 L
412.146 229.678 L
412.534 226.566 L
412.921 227.886 L
413.309 228.795 L
413.697 230.891 L
414.085 234.721 L
414.473 236.065 L
414.861 237.532 L
415.249 236.479 L
415.636 235.561 L
416.024 241.033 L
416.412 247.578 L
416.8 246.088 L
417.188 243.208 L
417.576 242.075 L
417.964 247.853 L
418.351 253.651 L
418.739 250.18 L
419.127 247.442 L
419.515 247.567 L
419.903 246.755 L
420.291 250.379 L
420.679 248.178 L
421.066 246.692 L
421.454 244.788 L
421.842 244.607 L
422.23 243.773 L
422.618 241.98 L
423.006 244.41 L
423.394 243.143 L
423.781 245.829 L
424.169 245.184 L
424.557 242.812 L
424.945 244.603 L
425.333 245.131 L
425.721 244.413 L
426.109 240.811 L
426.496 241.09 L
426.884 240.521 L
427.272 239.272 L
427.66 243.579 L
428.048 243.441 L
428.436 243.185 L
428.824 243.828 L
429.211 242.027 L
429.599 241.189 L
429.987 243.059 L
430.375 240.88 L
430.763 240.334 L
431.151 237.353 L
431.539 239.44 L
431.926 236.49 L
432.314 234.607 L
432.702 236.003 L
433.09 239.335 L
433.478 236.083 L
433.866 232.221 L
434.254 232.814 L
434.641 232.317 L
435.029 230.033 L
435.417 231.703 L
435.805 232.766 L
436.193 235.615 L
436.581 233.19 L
436.969 231.957 L
437.356 231.543 L
437.744 236.825 L
438.132 230.632 L
438.52 225.213 L
438.908 219.302 L
439.296 213.658 L
439.684 212.53 L
440.071 212.246 L
440.459 211.253 L
440.847 211.984 L
441.235 208.601 L
441.623 201.89 L
442.011 200.476 L
442.399 202.462 L
442.786 204.564 L
443.174 204.513 L
443.562 205.465 L
443.95 203.575 L
444.338 204.058 L
444.726 201.587 L
445.114 199.005 L
445.501 194.915 L
445.889 195.243 L
446.277 196.092 L
446.665 190.498 L
447.053 190.295 L
447.441 197.562 L
447.829 195.996 L
448.216 195.654 L
448.604 195.479 L
448.992 192.085 L
449.38 193.429 L
449.768 192.833 L
450.156 193.652 L
450.544 192.807 L
450.931 195.692 L
451.319 192.885 L
451.707 195.273 L
452.095 191.574 L
452.483 193.452 L
452.871 192.541 L
453.259 196.315 L
453.646 195.759 L
454.034 192.835 L
454.422 195.533 L
454.81 193.15 L
455.198 198.786 L
455.586 198.045 L
455.974 198.8 L
456.361 199.562 L
456.749 195.443 L
457.137 196.932 L
457.525 195.948 L
457.913 194.333 L
458.301 196.015 L
458.689 190.071 L
459.076 192.67 L
459.464 191.66 L
459.852 192.473 L
460.24 193.558 L
460.628 196.916 L
461.016 199.734 L
461.404 198.302 L
461.791 196.392 L
462.179 196.817 L
462.567 197.414 L
462.955 194.374 L
463.343 192.296 L
463.731 192.613 L
464.119 194.328 L
464.506 191.013 L
464.894 190.992 L
465.282 186.416 L
465.67 189.665 L
466.058 190.487 L
466.446 193.451 L
466.834 193.585 L
467.221 192.25 L
467.609 189.906 L
467.997 189.433 L
468.385 188.417 L
468.773 192.831 L
469.161 193.448 L
469.549 194.965 L
469.936 196.591 L
470.324 196.807 L
470.712 197.118 L
471.1 201.374 L
471.488 205.241 L
471.876 208.47 L
472.264 209.78 L
472.651 207.637 L
473.039 209.63 L
473.427 209.205 L
473.815 212.297 L
474.203 214.953 L
474.591 218.449 L
474.979 219.423 L
475.366 217.223 L
475.754 219.649 L
476.142 222.619 L
476.53 222.417 L
476.918 222.561 L
477.306 219.103 L
477.694 215.4 L
478.081 218.457 L
478.469 219.389 L
478.857 221.426 L
479.245 219.16 L
479.633 221.478 L
480.021 219.532 L
480.409 220.99 L
480.796 222.985 L
481.184 223.029 L
481.572 219.574 L
481.96 216.714 L
482.348 217.185 L
482.736 216.427 L
483.124 213.051 L
483.511 208.225 L
483.899 205.72 L
484.287 205.164 L
484.675 203.794 L
485.063 205.397 L
485.451 205.651 L
485.839 201.39 L
486.226 196.775 L
486.614 198.292 L
487.002 196.856 L
487.39 196.296 L
487.778 197.183 L
488.166 197.793 L
488.554 198.168 L
488.941 196.699 L
489.329 196.335 L
489.717 193.454 L
490.105 191.744 L
490.493 191.593 L
490.881 193.858 L
491.269 195.223 L
491.656 195.311 L
492.044 192.167 L
492.432 188.115 L
492.82 188.304 L
493.208 191.55 L
493.596 189.876 L
493.984 188.107 L
494.371 187.657 L
494.759 185.98 L
495.147 183.083 L
495.535 184.796 L
495.923 177.12 L
496.311 179.238 L
496.699 181.155 L
497.086 178.958 L
497.474 178.491 L
497.862 178.414 L
498.25 176.286 L
498.638 177.974 L
499.026 181.981 L
499.414 182.007 L
499.801 184.574 L
500.189 183.39 L
500.577 184.38 L
500.965 186.687 L
501.353 189.876 L
501.741 188.936 L
502.129 186.043 L
502.516 190.522 L
502.904 189.243 L
503.292 187.618 L
503.68 185.343 L
504.068 187.038 L
504.456 186.914 L
504.844 185.216 L
505.231 184.624 L
505.619 185.72 L
506.007 184.757 L
506.395 187.159 L
506.783 185.116 L
507.171 189.894 L
507.559 190.972 L
507.946 192.08 L
508.334 196.123 L
508.722 197.524 L
509.11 199.06 L
509.498 203.517 L
509.886 201.388 L
510.274 200.926 L
510.661 204.749 L
511.049 207.335 L
511.437 208.171 L
511.825 207.113 L
512.213 208.27 L
512.601 208.196 L
512.989 208.392 L
513.376 212.838 L
513.764 217.637 L
514.152 216.351 L
514.54 216.212 L
514.928 213.502 L
515.316 217.415 L
515.704 219.621 L
516.091 221 L
516.479 219.515 L
516.867 216.419 L
517.255 215.881 L
517.643 214.462 L
518.031 214.804 L
518.419 214.762 L
518.806 218.437 L
519.194 219.456 L
519.582 220.73 L
519.97 227.131 L
520.358 225.948 L
520.746 224.709 L
521.134 223.93 L
521.521 225.51 L
521.909 225.758 L
522.297 231.651 L
522.685 235.892 L
523.073 234.592 L
523.461 236.487 L
523.849 239.407 L
524.236 242.22 L
524.624 249.509 L
525.012 247.442 L
525.4 247.603 L
525.788 249.123 L
526.176 251.178 L
526.564 248.793 L
526.951 246.174 L
527.339 247.356 L
527.727 243.634 L
528.115 244.633 L
528.503 243.834 L
528.891 245.622 L
529.279 248.61 L
529.666 250.855 L
530.054 254.671 L
530.442 256.658 L
530.83 259.59 L
531.218 262.862 L
531.606 262.303 L
531.994 265.206 L
532.381 268.732 L
532.769 271.962 L
533.157 274.543 L
533.545 274.787 L
533.933 275.481 L
534.321 279.559 L
534.709 280.767 L
535.096 280.456 L
535.484 279.781 L
535.872 283.077 L
536.26 282.831 L
536.648 286.344 L
537.036 286.069 L
537.424 282.189 L
537.811 281.751 L
538.199 283.255 L
538.587 286.592 L
538.975 284.441 L
539.363 285.547 L
539.751 288.165 L
540.139 289.055 L
540.526 286.594 L
540.914 288.061 L
541.302 287.75 L
541.69 287.073 L
542.078 287.164 L
542.466 288.128 L
542.854 285.745 L
543.241 285.954 L
543.629 284.715 L
544.017 281.583 L
544.405 279.449 L
544.793 275.006 L
545.181 275.51 L
545.569 275.435 L
545.956 273.62 L
546.344 273.095 L
546.732 274.28 L
547.12 277.815 L
547.508 278.765 L
547.896 280.628 L
548.284 284.571 L
548.671 287.134 L
549.059 288.727 L
549.447 283.962 L
549.835 284.68 L
550.223 285.202 L
550.611 279.231 L
550.999 280.825 L
551.386 280.062 L
551.774 283.107 L
552.162 284.936 L
552.55 290.708 L
552.938 295.676 L
553.326 298.302 L
553.714 297.304 L
554.101 297.073 L
554.489 297.492 L
554.877 295.225 L
555.265 295.652 L
555.653 297.128 L
556.041 299.435 L
556.429 299.706 L
556.816 304.276 L
557.204 306.167 L
557.592 302.369 L
557.98 306.025 L
558.368 307.001 L
558.756 309.06 L
559.144 310.611 L
559.531 306.93 L
559.919 306.695 L
560.307 310.382 L
560.695 309.405 L
561.083 315.039 L
561.471 316.538 L
561.859 316.599 L
562.246 316.765 L
562.634 316.91 L
563.022 318.299 L
563.41 317.225 L
563.798 316.835 L
564.186 321.012 L
564.574 322.873 L
564.961 325.471 L
565.349 330.329 L
565.737 337.621 L
566.125 333.623 L
566.513 333.968 L
566.901 335.89 L
567.289 338.586 L
567.676 339.655 L
568.064 343.595 L
568.452 342.315 L
568.84 342.623 L
569.228 344.667 L
569.616 343.806 L
570.004 345.259 L
570.391 344.507 L
570.779 345.72 L
571.167 348.19 L
571.555 343.906 L
571.943 343.971 L
572.331 339.664 L
572.719 339.322 L
573.106 339.135 L
573.494 341.822 L
573.882 344.866 L
574.27 348.02 L
574.658 350.485 L
575.046 353.741 L
575.434 358.193 L
575.821 360.771 L
576.209 359.997 L
576.597 358.303 L
576.985 363.412 L
577.373 360.553 L
577.761 357.236 L
578.149 353.266 L
578.536 356.184 L
578.924 356.85 L
579.312 359.181 L
579.7 355.967 L
580.088 351.138 L
580.476 353.23 L
580.864 352.181 L
581.251 351.78 L
581.639 352.757 L
582.027 352.672 L
582.415 354.756 L
582.803 350.667 L
583.191 349.114 L
583.579 346.689 L
583.966 347.27 L
584.354 349.127 L
584.742 349.805 L
585.13 349.386 L
585.518 346.975 L
585.906 348.375 L
586.294 349.504 L
586.681 352.695 L
587.069 352.971 L
587.457 351.697 L
587.845 349.137 L
588.233 342.049 L
588.621 342.51 L
589.009 341.646 L
589.396 340.46 L
589.784 336.48 L
590.172 331.614 L
590.56 326.555 L
590.948 322.123 L
591.336 321.597 L
591.724 322.159 L
592.111 320.897 L
592.499 322.906 L
592.887 325.823 L
593.275 324.579 L
593.663 322 L
594.051 314.194 L
594.439 311.28 L
594.826 312.253 L
595.214 311.52 L
595.602 308.633 L
595.99 306.577 L
596.378 302.337 L
596.766 303.912 L
597.154 307.339 L
597.541 307.058 L
597.929 305.417 L
598.317 303.572 L
598.705 303.308 L
599.093 303.112 L
599.481 301.462 L
599.869 300.662 L
600.256 299.129 L
600.644 294.65 L
601.032 295.744 L
601.42 293.024 L
601.808 290.991 L
602.196 295.857 L
602.584 291.92 L
602.971 292.466 L
603.359 288.773 L
603.747 287.831 L
604.135 285.887 L
604.523 283.462 L
604.911 283.473 L
605.299 274.814 L
605.686 272.429 L
606.074 266.6 L
606.462 264.693 L
606.85 268.044 L
607.238 270.599 L
607.626 271.426 L
608.014 269.599 L
608.401 269.31 L
608.789 271.401 L
609.177 270.929 L
609.565 272.96 L
609.953 275.836 L
610.341 276.705 L
610.729 278.312 L
611.116 277.936 L
611.504 276.234 L
611.892 273.075 L
612.28 274.253 L
612.668 277.34 L
613.056 276.978 L
613.444 275.433 L
613.831 274.407 L
614.219 276.577 L
614.607 274.402 L
614.995 273.855 L
615.383 271.701 L
615.771 270.276 L
616.159 273.324 L
616.546 276.901 L
616.934 274.243 L
617.322 273.702 L
617.71 274.029 L
618.098 274.636 L
618.486 274.251 L
S
GR
GS
[0.6 0 0 0.6 0 0] CT
0 1 0 RC
1 LJ
3.333 LW
N
91 222.429 M
91.388 251.717 L
91.776 251.372 L
92.164 251.016 L
92.551 250.709 L
92.939 250.379 L
93.327 250.036 L
93.715 249.717 L
94.103 249.365 L
94.491 249.029 L
94.879 248.657 L
95.266 248.334 L
95.654 248.004 L
96.042 247.298 L
96.43 246.427 L
96.818 245.627 L
97.206 244.955 L
97.594 244.561 L
97.981 244.407 L
98.369 244.324 L
98.757 244.25 L
99.145 244.22 L
99.533 244.243 L
99.921 244.307 L
100.309 244.409 L
100.696 244.608 L
101.084 244.892 L
101.472 245.163 L
101.86 245.376 L
102.248 245.542 L
102.636 245.715 L
103.024 245.959 L
103.411 246.049 L
103.799 245.428 L
104.187 244.734 L
104.575 244.131 L
104.963 243.521 L
105.351 242.79 L
105.739 242.083 L
106.126 241.392 L
106.514 240.823 L
106.902 240.476 L
107.29 240.631 L
107.678 240.784 L
108.066 240.952 L
108.454 241.098 L
108.841 241.235 L
109.229 241.35 L
109.617 241.463 L
110.005 241.611 L
110.393 241.764 L
110.781 241.915 L
111.169 242.041 L
111.556 242.182 L
111.944 242.34 L
112.332 242.503 L
112.72 242.665 L
113.108 242.811 L
113.496 242.956 L
113.884 243.08 L
114.271 243.206 L
114.659 243.351 L
115.047 243.496 L
115.435 243.624 L
115.823 243.749 L
116.211 243.874 L
116.599 244.007 L
116.986 244.14 L
117.374 244.277 L
117.762 244.403 L
118.15 244.525 L
118.538 244.631 L
118.926 244.741 L
119.314 244.874 L
119.701 245.003 L
120.089 245.132 L
120.477 245.234 L
120.865 245.334 L
121.253 244.723 L
121.641 243.468 L
122.029 242.173 L
122.416 240.956 L
122.804 239.734 L
123.192 238.636 L
123.58 237.46 L
123.968 236.191 L
124.356 234.917 L
124.744 233.695 L
125.131 232.506 L
125.519 241.05 L
125.907 256.211 L
126.295 256.422 L
126.683 256.53 L
127.071 256.545 L
127.459 256.809 L
127.846 257.234 L
128.234 257.677 L
128.622 258.133 L
129.01 258.529 L
129.398 258.936 L
129.786 259.267 L
130.174 259.61 L
130.561 259.973 L
130.949 259.913 L
131.337 259.693 L
131.725 259.485 L
132.113 259.285 L
132.501 259.092 L
132.889 258.905 L
133.276 258.704 L
133.664 258.504 L
134.052 258.403 L
134.44 258.397 L
134.828 258.229 L
135.216 257.575 L
135.604 256.932 L
135.991 256.863 L
136.379 256.845 L
136.767 256.828 L
137.155 256.815 L
137.543 256.799 L
137.931 256.763 L
138.319 256.699 L
138.706 256.608 L
139.094 256.381 L
139.482 255.292 L
139.87 254.135 L
140.258 252.978 L
140.646 252.654 L
141.034 252.235 L
141.421 251.69 L
141.809 251.192 L
142.197 250.62 L
142.585 250.21 L
142.973 249.978 L
143.361 249.795 L
143.749 249.625 L
144.136 249.443 L
144.524 249.254 L
144.912 249.06 L
145.3 249.117 L
145.688 249.236 L
146.076 249.989 L
146.464 251.091 L
146.851 252.275 L
147.239 253.484 L
147.627 254.654 L
148.015 255.801 L
148.403 256.82 L
148.791 257.905 L
149.179 259.182 L
149.566 259.46 L
149.954 259.108 L
150.342 257.736 L
150.73 257.186 L
151.118 257.223 L
151.506 257.282 L
151.894 257.356 L
152.281 257.455 L
152.669 257.565 L
153.057 257.676 L
153.445 257.813 L
153.833 257.287 L
154.221 256.114 L
154.609 255.014 L
154.996 253.954 L
155.384 252.906 L
155.772 251.918 L
156.16 251.978 L
156.548 252.191 L
156.936 252.434 L
157.324 252.672 L
157.711 252.901 L
158.099 253.047 L
158.487 253.145 L
158.875 253.702 L
159.263 254.493 L
159.651 254.996 L
160.039 255.14 L
160.426 255.288 L
160.814 255.466 L
161.202 255.673 L
161.59 255.911 L
161.978 256.145 L
162.366 256.374 L
162.754 256.631 L
163.141 257.416 L
163.529 258.722 L
163.917 259.591 L
164.305 258.69 L
164.693 257.255 L
165.081 256.085 L
165.469 256.51 L
165.856 257.149 L
166.244 257.745 L
166.632 258.03 L
167.02 258.225 L
167.408 258.377 L
167.796 257.322 L
168.184 255.099 L
168.571 253.075 L
168.959 252.223 L
169.347 253.299 L
169.735 254.257 L
170.123 254.33 L
170.511 254.272 L
170.899 254.211 L
171.286 254.185 L
171.674 254.132 L
172.062 254.051 L
172.45 254.16 L
172.838 254.496 L
173.226 254.746 L
173.614 254.991 L
174.001 255.964 L
174.389 257.444 L
174.777 257.643 L
175.165 256.356 L
175.553 254.815 L
175.941 253.244 L
176.329 251.978 L
176.716 251.595 L
177.104 251.279 L
177.492 251.042 L
177.88 251.938 L
178.268 252.898 L
178.656 253.902 L
179.044 254.873 L
179.431 255.993 L
179.819 256.518 L
180.207 256.308 L
180.595 256.089 L
180.983 255.765 L
181.371 255.306 L
181.759 254.795 L
182.146 254.141 L
182.534 253.619 L
182.922 253.167 L
183.31 252.775 L
183.698 251.112 L
184.086 248.679 L
184.474 246.378 L
184.861 244.031 L
185.249 241.809 L
185.637 239.787 L
186.025 237.2 L
186.413 234.809 L
186.801 232.265 L
187.189 230.083 L
187.576 227.794 L
187.964 226.49 L
188.352 225.972 L
188.74 225.416 L
189.128 224.119 L
189.516 221.623 L
189.904 219.651 L
190.291 220.042 L
190.679 220.821 L
191.067 221.655 L
191.455 222.73 L
191.843 225.523 L
192.231 228.397 L
192.619 231.339 L
193.006 232.625 L
193.394 233.421 L
193.782 234.238 L
194.17 235.063 L
194.558 234.805 L
194.946 234.398 L
195.334 233.889 L
195.721 233.503 L
196.109 233.116 L
196.497 232.619 L
196.885 232.043 L
197.273 231.397 L
197.661 230.84 L
198.049 230.242 L
198.436 229.689 L
198.824 230.052 L
199.212 230.999 L
199.6 232.111 L
199.988 233.541 L
200.376 234.13 L
200.764 234.135 L
201.151 234.131 L
201.539 234.111 L
201.927 234.085 L
202.315 234.041 L
202.703 233.936 L
203.091 233.706 L
203.479 233.416 L
203.866 233.527 L
204.254 233.851 L
204.642 233.972 L
205.03 233.748 L
205.418 233.621 L
205.806 233.543 L
206.194 233.509 L
206.581 233.427 L
206.969 233.21 L
207.357 233.316 L
207.745 234.946 L
208.133 237.206 L
208.521 239.562 L
208.909 242.009 L
209.296 244.359 L
209.684 245.264 L
210.072 245.484 L
210.46 245.693 L
210.848 245.9 L
211.236 246.14 L
211.624 246.567 L
212.011 248.191 L
212.399 249.821 L
212.787 251.417 L
213.175 252.978 L
213.563 254.56 L
213.951 255.651 L
214.339 255.237 L
214.726 254.768 L
215.114 253.486 L
215.502 252.127 L
215.89 250.699 L
216.278 249.389 L
216.666 248.059 L
217.054 246.869 L
217.441 245.57 L
217.829 244.365 L
218.217 243.121 L
218.605 242.952 L
218.993 243.556 L
219.381 244.53 L
219.769 244.26 L
220.156 243.766 L
220.544 243.169 L
220.932 242.512 L
221.32 241.808 L
221.708 241.244 L
222.096 239.605 L
222.484 237.348 L
222.871 236.172 L
223.259 234.932 L
223.647 233.946 L
224.035 234.481 L
224.423 235.336 L
224.811 235.867 L
225.199 235.567 L
225.586 235.264 L
225.974 234.929 L
226.362 234.616 L
226.75 234.063 L
227.138 233.194 L
227.526 232.353 L
227.914 231.134 L
228.301 230.409 L
228.689 230.243 L
229.077 230.22 L
229.465 230.204 L
229.853 230.207 L
230.241 230.219 L
230.629 230.231 L
231.016 230.249 L
231.404 230.286 L
231.792 230.274 L
232.18 229.294 L
232.568 227.863 L
232.956 227.09 L
233.344 228.004 L
233.731 230.934 L
234.119 233.67 L
234.507 235.251 L
234.895 236.853 L
235.283 238.374 L
235.671 239.236 L
236.059 239.4 L
236.446 239.374 L
236.834 240.821 L
237.222 243.107 L
237.61 245.64 L
237.998 245.448 L
238.386 244.724 L
238.774 244.286 L
239.161 244.554 L
239.549 244.837 L
239.937 245.12 L
240.325 245.406 L
240.713 245.151 L
241.101 244.521 L
241.489 244.193 L
241.876 244.739 L
242.264 245.409 L
242.652 245.976 L
243.04 245.392 L
243.428 245.244 L
243.816 246.66 L
244.204 248.812 L
244.591 251.451 L
244.979 253.746 L
245.367 255.061 L
245.755 255.766 L
246.143 258.14 L
246.531 260.465 L
246.919 261.851 L
247.306 263.148 L
247.694 263.711 L
248.082 261.879 L
248.47 259.822 L
248.858 258.7 L
249.246 257.929 L
249.634 257.729 L
250.021 258.438 L
250.409 258.282 L
250.797 258.362 L
251.185 259.171 L
251.573 260.738 L
251.961 261.41 L
252.349 262.021 L
252.736 263.266 L
253.124 264.505 L
253.512 265.963 L
253.9 268.48 L
254.288 270.97 L
254.676 273.356 L
255.064 275.57 L
255.451 277.945 L
255.839 280.454 L
256.227 282.359 L
256.615 283.894 L
257.003 284.272 L
257.391 285.373 L
257.779 285.862 L
258.166 287.78 L
258.554 290.068 L
258.942 290.888 L
259.33 289.454 L
259.718 289.366 L
260.106 289.863 L
260.494 290.034 L
260.881 288.748 L
261.269 287.147 L
261.657 285.916 L
262.045 286.363 L
262.433 286.901 L
262.821 287.42 L
263.209 287.93 L
263.596 288.347 L
263.984 288.712 L
264.372 289.061 L
264.76 290.326 L
265.148 291.589 L
265.536 292.066 L
265.924 292.186 L
266.311 292.243 L
266.699 292.253 L
267.087 292.251 L
267.475 292.18 L
267.863 291.187 L
268.251 289.844 L
268.639 288.302 L
269.026 287.093 L
269.414 286.956 L
269.802 286.957 L
270.19 286.965 L
270.578 286.979 L
270.966 286.992 L
271.354 287.025 L
271.741 287.759 L
272.129 289.17 L
272.517 290.467 L
272.905 291.783 L
273.293 293.138 L
273.681 293.473 L
274.069 293.553 L
274.456 294.693 L
274.844 295.752 L
275.232 295.816 L
275.62 295.707 L
276.008 295.7 L
276.396 295.315 L
276.784 294.595 L
277.171 293.903 L
277.559 292.628 L
277.947 290.64 L
278.335 288.716 L
278.723 288.004 L
279.111 287.572 L
279.499 287.119 L
279.886 286.699 L
280.274 287.516 L
280.662 287.907 L
281.05 286.654 L
281.438 284.719 L
281.826 282.888 L
282.214 281.089 L
282.601 279.247 L
282.989 280.038 L
283.377 281.704 L
283.765 281.635 L
284.153 281.515 L
284.541 281.414 L
284.929 281.25 L
285.316 280.965 L
285.704 280.643 L
286.092 280.299 L
286.48 279.978 L
286.868 279.645 L
287.256 279.319 L
287.644 279.039 L
288.031 278.754 L
288.419 278.55 L
288.807 278.467 L
289.195 278.448 L
289.583 276.938 L
289.971 275.037 L
290.359 274.241 L
290.746 274.452 L
291.134 276.161 L
291.522 277.973 L
291.91 279.874 L
292.298 281.634 L
292.686 283.144 L
293.074 282.97 L
293.461 281.499 L
293.849 279.603 L
294.237 277.994 L
294.625 277.711 L
295.013 277.467 L
295.401 277.23 L
295.789 277.572 L
296.176 278.006 L
296.564 278.393 L
296.952 278.181 L
297.34 276.138 L
297.728 274.645 L
298.116 274.219 L
298.504 273.813 L
298.891 273.395 L
299.279 272.904 L
299.667 272.349 L
300.055 271.749 L
300.443 271.015 L
300.831 269.075 L
301.219 267.354 L
301.606 267.093 L
301.994 267.534 L
302.382 266.995 L
302.77 264.827 L
303.158 262.971 L
303.546 261.028 L
303.934 258.901 L
304.321 256.033 L
304.709 253.529 L
305.097 252.846 L
305.485 252.716 L
305.873 252.552 L
306.261 251.926 L
306.649 251.102 L
307.036 250.356 L
307.424 249.561 L
307.812 248.865 L
308.2 248.156 L
308.588 247.404 L
308.976 246.641 L
309.364 245.954 L
309.751 246.112 L
310.139 246.312 L
310.527 246.009 L
310.915 245.256 L
311.303 244.437 L
311.691 243.672 L
312.079 242.826 L
312.466 242.022 L
312.854 241.471 L
313.242 241.303 L
313.63 242.247 L
314.018 242.927 L
314.406 242.117 L
314.794 239.156 L
315.181 234.903 L
315.569 231.858 L
315.957 228.916 L
316.345 226.253 L
316.733 225.547 L
317.121 226.168 L
317.509 228.25 L
317.896 230.886 L
318.284 232.309 L
318.672 231.816 L
319.06 231.306 L
319.448 231.578 L
319.836 231.366 L
320.224 230.259 L
320.611 228.9 L
320.999 228.866 L
321.387 230.599 L
321.775 231.401 L
322.163 231.858 L
322.551 231.119 L
322.939 228.28 L
323.326 225.096 L
323.714 222.463 L
324.102 219.724 L
324.49 217.642 L
324.878 216.232 L
325.266 215.364 L
325.654 212.813 L
326.041 210.876 L
326.429 210.282 L
326.817 209.893 L
327.205 209.459 L
327.593 209.043 L
327.981 210.241 L
328.369 212.672 L
328.756 213.266 L
329.144 212.569 L
329.532 211.52 L
329.92 210.655 L
330.308 210.264 L
330.696 209.859 L
331.084 209.48 L
331.471 209.092 L
331.859 208.645 L
332.247 208.194 L
332.635 207.744 L
333.023 207.35 L
333.411 206.639 L
333.799 205.208 L
334.186 203.827 L
334.574 203.295 L
334.962 202.884 L
335.35 202.475 L
335.738 202.089 L
336.126 201.672 L
336.514 201.076 L
336.901 200.168 L
337.289 199.677 L
337.677 199.245 L
338.065 198.786 L
338.453 199.137 L
338.841 200.241 L
339.229 200.676 L
339.616 199.889 L
340.004 199.107 L
340.392 198.235 L
340.78 196.522 L
341.168 194.336 L
341.556 192.187 L
341.944 190.132 L
342.331 188.53 L
342.719 188.013 L
343.107 185.286 L
343.495 180.351 L
343.883 175.753 L
344.271 172.323 L
344.659 168.934 L
345.046 165.833 L
345.434 161.393 L
345.822 156.606 L
346.21 152.24 L
346.598 152.717 L
346.986 154.727 L
347.374 156.804 L
347.761 158.993 L
348.149 160.957 L
348.537 163.171 L
348.925 164.674 L
349.313 165.323 L
349.701 166.036 L
350.089 165.759 L
350.476 165.354 L
350.864 164.93 L
351.252 163.404 L
351.64 161.581 L
352.028 157.8 L
352.416 155.871 L
352.804 155.603 L
353.191 155.354 L
353.579 155.122 L
353.967 154.9 L
354.355 154.693 L
354.743 154.121 L
355.131 153.684 L
355.519 153.555 L
355.906 153.468 L
356.294 153.392 L
356.682 152.835 L
357.07 151.084 L
357.458 149.437 L
357.846 149.117 L
358.234 149.597 L
358.621 151.265 L
359.009 152.72 L
359.397 152.668 L
359.785 152.408 L
360.173 152.139 L
360.561 151.923 L
360.949 151.727 L
361.336 151.526 L
361.724 151.34 L
362.112 151.304 L
362.5 152.858 L
362.888 154.334 L
363.276 154.875 L
363.664 154.72 L
364.051 154.863 L
364.439 155.06 L
364.827 155.294 L
365.215 155.492 L
365.603 155.676 L
365.991 156.377 L
366.379 158.267 L
366.766 158.91 L
367.154 161.666 L
367.542 164.642 L
367.93 167.748 L
368.318 170.63 L
368.706 173.872 L
369.094 176.506 L
369.481 179.047 L
369.869 181.947 L
370.257 184.189 L
370.645 182.715 L
371.033 181.192 L
371.421 179.75 L
371.809 178.89 L
372.196 179.117 L
372.584 179.105 L
372.972 179.287 L
373.36 181.017 L
373.748 182.343 L
374.136 182.658 L
374.524 182.961 L
374.911 182.223 L
375.299 182.609 L
375.687 182.948 L
376.075 183.191 L
376.463 182.099 L
376.851 181.511 L
377.239 181.764 L
377.626 182.015 L
378.014 182.121 L
378.402 181.284 L
378.79 180.652 L
379.178 180.726 L
379.566 180.754 L
379.954 180.715 L
380.341 180.55 L
380.729 181.628 L
381.117 182.978 L
381.505 184.064 L
381.893 184.287 L
382.281 183.17 L
382.669 181.364 L
383.056 180.439 L
383.444 181.771 L
383.832 183.518 L
384.22 185.104 L
384.608 185.593 L
384.996 186.074 L
385.384 186.463 L
385.771 186.792 L
386.159 186.413 L
386.547 184.971 L
386.935 183.879 L
387.323 184.277 L
387.711 184.695 L
388.099 184.963 L
388.486 185.221 L
388.874 184.422 L
389.262 183.4 L
389.65 183.247 L
390.038 182.256 L
390.426 181.378 L
390.814 181.775 L
391.201 182.238 L
391.589 184.075 L
391.977 186.711 L
392.365 189.42 L
392.753 192.294 L
393.141 195.948 L
393.529 198.579 L
393.916 201.561 L
394.304 205.46 L
394.692 210.097 L
395.08 211.957 L
395.468 213.531 L
395.856 214.418 L
396.244 214.726 L
396.631 215.069 L
397.019 214.769 L
397.407 213.418 L
397.795 213.453 L
398.183 213.68 L
398.571 214.357 L
398.959 216.003 L
399.346 217.837 L
399.734 219.433 L
400.122 220.466 L
400.51 220.285 L
400.898 219.215 L
401.286 219.286 L
401.674 219.477 L
402.061 220.416 L
402.449 221.723 L
402.837 222.77 L
403.225 222.953 L
403.613 223.142 L
404.001 223.428 L
404.389 223.638 L
404.776 223.972 L
405.164 224.183 L
405.552 224.262 L
405.94 224.387 L
406.328 224.724 L
406.716 225.465 L
407.104 226.272 L
407.491 226.034 L
407.879 224.423 L
408.267 223.755 L
408.655 223.942 L
409.043 224.389 L
409.431 225.918 L
409.819 227.52 L
410.206 229.094 L
410.594 230.856 L
410.982 232.514 L
411.37 233.748 L
411.758 234.705 L
412.146 237.578 L
412.534 242.028 L
412.921 247.293 L
413.309 252.104 L
413.697 255.56 L
414.085 258.93 L
414.473 262.388 L
414.861 265.951 L
415.249 268.283 L
415.636 266.352 L
416.024 264.13 L
416.412 261.855 L
416.8 259.352 L
417.188 257.043 L
417.576 254.174 L
417.964 251.478 L
418.351 248.81 L
418.739 246.88 L
419.127 246.501 L
419.515 246.085 L
419.903 245.909 L
420.291 246.845 L
420.679 247.681 L
421.066 248.368 L
421.454 247.832 L
421.842 246.976 L
422.23 246.132 L
422.618 245.341 L
423.006 244.524 L
423.394 243.826 L
423.781 243.297 L
424.169 243.726 L
424.557 244.621 L
424.945 244.545 L
425.333 243.58 L
425.721 243.826 L
426.109 244.494 L
426.496 244.705 L
426.884 243.888 L
427.272 243.061 L
427.66 242.436 L
428.048 241.833 L
428.436 241.293 L
428.824 240.711 L
429.211 240.042 L
429.599 239.4 L
429.987 238.691 L
430.375 237.783 L
430.763 236.475 L
431.151 234.727 L
431.539 233.788 L
431.926 233.538 L
432.314 233.496 L
432.702 233.243 L
433.09 232.148 L
433.478 230.615 L
433.866 229.107 L
434.254 227.803 L
434.641 226.559 L
435.029 225.48 L
435.417 225.063 L
435.805 223.649 L
436.193 220.262 L
436.581 216.516 L
436.969 213.254 L
437.356 209.793 L
437.744 205.904 L
438.132 203.056 L
438.52 200.6 L
438.908 198.246 L
439.296 197.559 L
439.684 198.134 L
440.071 198.701 L
440.459 199.157 L
440.847 198.65 L
441.235 197.796 L
441.623 196.975 L
442.011 195.857 L
442.399 194.662 L
442.786 193.51 L
443.174 192.372 L
443.562 191.796 L
443.95 191.23 L
444.338 190.259 L
444.726 189.395 L
445.114 189.035 L
445.501 189.672 L
445.889 189.154 L
446.277 188.437 L
446.665 187.656 L
447.053 187.545 L
447.441 187.85 L
447.829 188.051 L
448.216 187.864 L
448.604 187.842 L
448.992 187.99 L
449.38 188.086 L
449.768 186.981 L
450.156 185.761 L
450.544 185.789 L
450.931 186.263 L
451.319 186.928 L
451.707 187.643 L
452.095 188.337 L
452.483 189.031 L
452.871 189.661 L
453.259 190.222 L
453.646 190.823 L
454.034 191.442 L
454.422 192.234 L
454.81 192.21 L
455.198 191.86 L
455.586 190.97 L
455.974 189.91 L
456.361 189.354 L
456.749 189.458 L
457.137 188.919 L
457.525 188.72 L
457.913 189.21 L
458.301 189.931 L
458.689 189.832 L
459.076 189.644 L
459.464 189.493 L
459.852 189.382 L
460.24 189.321 L
460.628 189.458 L
461.016 189.798 L
461.404 190.376 L
461.791 190.684 L
462.179 189.554 L
462.567 188.783 L
462.955 188.146 L
463.343 187.494 L
463.731 186.957 L
464.119 186.635 L
464.506 186.691 L
464.894 188.004 L
465.282 189.457 L
465.67 191.069 L
466.058 192.28 L
466.446 193.271 L
466.834 194.34 L
467.221 195.754 L
467.609 196.536 L
467.997 197.131 L
468.385 198.192 L
468.773 199.355 L
469.161 201.748 L
469.549 204.677 L
469.936 208.16 L
470.324 210.224 L
470.712 212.224 L
471.1 212.968 L
471.488 213.544 L
471.876 214.634 L
472.264 215.959 L
472.651 217.367 L
473.039 218.469 L
473.427 219.553 L
473.815 220.222 L
474.203 220.912 L
474.591 221.48 L
474.979 221.825 L
475.366 221.609 L
475.754 220.706 L
476.142 219.421 L
476.53 218.554 L
476.918 218.373 L
477.306 218.284 L
477.694 217.921 L
478.081 216.667 L
478.469 215.185 L
478.857 214.559 L
479.245 213.945 L
479.633 212.726 L
480.021 210.48 L
480.409 207.961 L
480.796 205.911 L
481.184 204.065 L
481.572 202.456 L
481.96 200.649 L
482.348 198.963 L
482.736 197.816 L
483.124 196.804 L
483.511 195.814 L
483.899 194.805 L
484.287 193.79 L
484.675 192.677 L
485.063 190.926 L
485.451 190.085 L
485.839 189.536 L
486.226 188.974 L
486.614 188.33 L
487.002 187.22 L
487.39 185.157 L
487.778 183.624 L
488.166 182.459 L
488.554 182.14 L
488.941 181.32 L
489.329 179.92 L
489.717 179.042 L
490.105 178.936 L
490.493 179.564 L
490.881 180.752 L
491.269 181.474 L
491.656 182.087 L
492.044 182.232 L
492.432 182.031 L
492.82 181.598 L
493.208 179.158 L
493.596 176.557 L
493.984 175.723 L
494.371 175.491 L
494.759 175.263 L
495.147 175.024 L
495.535 174.805 L
495.923 174.767 L
496.311 174.707 L
496.699 174.703 L
497.086 174.605 L
497.474 174.546 L
497.862 174.627 L
498.25 174.825 L
498.638 175.139 L
499.026 175.586 L
499.414 176.522 L
499.801 178.124 L
500.189 180.004 L
500.577 180.978 L
500.965 181.48 L
501.353 181.932 L
501.741 182.254 L
502.129 182.453 L
502.516 183.389 L
502.904 183.046 L
503.292 184.111 L
503.68 186.581 L
504.068 189.059 L
504.456 191.059 L
504.844 192.968 L
505.231 195.021 L
505.619 195.624 L
506.007 196.372 L
506.395 197.162 L
506.783 198.013 L
507.171 198.175 L
507.559 199.393 L
507.946 200.527 L
508.334 201.726 L
508.722 203.231 L
509.11 204.179 L
509.498 203.745 L
509.886 203.727 L
510.274 204.825 L
510.661 205.934 L
511.049 208.027 L
511.437 210.201 L
511.825 210.958 L
512.213 211.697 L
512.601 212.803 L
512.989 214.896 L
513.376 217.047 L
513.764 219.061 L
514.152 220.883 L
514.54 221.695 L
514.928 222.314 L
515.316 222.962 L
515.704 223.542 L
516.091 224.202 L
516.479 225.019 L
516.867 225.892 L
517.255 227.002 L
517.643 228.251 L
518.031 229.579 L
518.419 230.974 L
518.806 232.318 L
519.194 233.699 L
519.582 234.879 L
519.97 235.897 L
520.358 236.681 L
520.746 236.611 L
521.134 236.352 L
521.521 236.085 L
521.909 236.843 L
522.297 237.887 L
522.685 238.9 L
523.073 239.993 L
523.461 241.131 L
523.849 243.574 L
524.236 245.958 L
524.624 248.656 L
525.012 251.252 L
525.4 252.98 L
525.788 254.972 L
526.176 258.259 L
526.564 262.86 L
526.951 266.582 L
527.339 268.367 L
527.727 270.688 L
528.115 272.834 L
528.503 275.153 L
528.891 277.17 L
529.279 279.115 L
529.666 280.873 L
530.054 282.5 L
530.442 284.135 L
530.83 286.742 L
531.218 288.41 L
531.606 289.588 L
531.994 290.657 L
532.381 291.719 L
532.769 292.74 L
533.157 295.075 L
533.545 297.036 L
533.933 297.516 L
534.321 297.434 L
534.709 297.441 L
535.096 298.142 L
535.484 299.828 L
535.872 302.07 L
536.26 302.227 L
536.648 301.941 L
537.036 301.014 L
537.424 299.802 L
537.811 298.28 L
538.199 296.672 L
538.587 294.979 L
538.975 293.902 L
539.363 293.064 L
539.751 292.566 L
540.139 292.125 L
540.526 291.789 L
540.914 291.555 L
541.302 291.155 L
541.69 290.788 L
542.078 290.441 L
542.466 290.167 L
542.854 290.03 L
543.241 290.008 L
543.629 290.089 L
544.017 290.288 L
544.405 291.203 L
544.793 293.175 L
545.181 295.279 L
545.569 296.941 L
545.956 297.647 L
546.344 298.343 L
546.732 299.038 L
547.12 299.706 L
547.508 299.765 L
547.896 299.127 L
548.284 298.509 L
548.671 299.122 L
549.059 300.729 L
549.447 303.541 L
549.835 305.886 L
550.223 306.995 L
550.611 306.943 L
550.999 307.676 L
551.386 308.606 L
551.774 308.74 L
552.162 308.812 L
552.55 308.95 L
552.938 309.32 L
553.326 309.969 L
553.714 311.494 L
554.101 312.747 L
554.489 314.204 L
554.877 315.196 L
555.265 315.475 L
555.653 316.46 L
556.041 319.067 L
556.429 321.963 L
556.816 324.53 L
557.204 326.424 L
557.592 328.073 L
557.98 331.084 L
558.368 334.374 L
558.756 337.025 L
559.144 338.68 L
559.531 339.227 L
559.919 339.944 L
560.307 341.204 L
560.695 342.554 L
561.083 344.551 L
561.471 346.695 L
561.859 349.464 L
562.246 351.394 L
562.634 353.291 L
563.022 354.631 L
563.41 356.388 L
563.798 358.273 L
564.186 360.094 L
564.574 362.101 L
564.961 363.539 L
565.349 364.309 L
565.737 364.914 L
566.125 366.072 L
566.513 367.824 L
566.901 369.188 L
567.289 370.683 L
567.676 371.205 L
568.064 371.585 L
568.452 371.532 L
568.84 371.245 L
569.228 370.871 L
569.616 370.483 L
570.004 370.259 L
570.391 369.763 L
570.779 369.872 L
571.167 370.93 L
571.555 373.088 L
571.943 375.698 L
572.331 376.18 L
572.719 375.362 L
573.106 374.457 L
573.494 373.843 L
573.882 373.135 L
574.27 373.007 L
574.658 373.724 L
575.046 374.369 L
575.434 375.169 L
575.821 376.943 L
576.209 378.123 L
576.597 379.023 L
576.985 380.209 L
577.373 380.978 L
577.761 379.471 L
578.149 379.991 L
578.536 379.622 L
578.924 380.214 L
579.312 381.583 L
579.7 381.636 L
580.088 380.466 L
580.476 380.189 L
580.864 380.948 L
581.251 379.657 L
581.639 377.602 L
582.027 374.44 L
582.415 371.774 L
582.803 369.373 L
583.191 366.815 L
583.579 365.18 L
583.966 363.413 L
584.354 361.747 L
584.742 360.021 L
585.13 358.154 L
585.518 356.183 L
585.906 353.835 L
586.294 352.242 L
586.681 350.508 L
587.069 348.841 L
587.457 346.285 L
587.845 344.675 L
588.233 342.967 L
588.621 341.236 L
589.009 340.672 L
589.396 340.588 L
589.784 341.144 L
590.172 340.893 L
590.56 340.064 L
590.948 338.2 L
591.336 336.737 L
591.724 335.918 L
592.111 335.111 L
592.499 334.172 L
592.887 333.34 L
593.275 332.4 L
593.663 331.491 L
594.051 330.519 L
594.439 330.308 L
594.826 329.336 L
595.214 326.549 L
595.602 322.349 L
595.99 319.769 L
596.378 317.707 L
596.766 315.515 L
597.154 313.224 L
597.541 310.898 L
597.929 308.597 L
598.317 306.504 L
598.705 304.198 L
599.093 301.861 L
599.481 299.777 L
599.869 296.655 L
600.256 295.046 L
600.644 293.078 L
601.032 291.193 L
601.42 289.466 L
601.808 288.46 L
602.196 286.786 L
602.584 285.397 L
602.971 284.071 L
603.359 282.69 L
603.747 281.172 L
604.135 279.576 L
604.523 276.118 L
604.911 273.981 L
605.299 274.248 L
605.686 274.691 L
606.074 275.286 L
606.462 275.996 L
606.85 276.96 L
607.238 278.228 L
607.626 279.372 L
608.014 280.477 L
608.401 281.43 L
608.789 282.131 L
609.177 282.946 L
609.565 283.795 L
609.953 284.881 L
610.341 286.013 L
610.729 287.185 L
611.116 288.51 L
611.504 289.043 L
611.892 288.863 L
612.28 288.856 L
612.668 288.873 L
613.056 288.944 L
613.444 288.28 L
613.831 287.136 L
614.219 286.148 L
614.607 285.983 L
614.995 286.37 L
615.383 286.826 L
615.771 287.413 L
616.159 287.992 L
616.546 288.733 L
616.934 289.344 L
617.322 289.897 L
617.71 290.325 L
618.098 290.733 L
618.486 290.33 L
S
GR
GS
[0.6 0 0 0.6 0 0] CT
1 GC
N
621 119 M
621 52 L
481 52 L
481 119 L
cp
f
GR
GS
[0.6 0 0 0.6 323.91306 38.78491] CT
/Helvetica 15 F
GS
[1 0 0 1 0 0] CT
0 6 moveto 
1 -1 scale
(1.iterace) t 
GR
GR
GS
[0.6 0 0 0.6 0 0] CT
1 0 0 RC
[10 6] 0 setdash
2 LJ
0.833 LW
N
486.009 64.642 M
536.098 64.642 L
S
GR
GS
[0.6 0 0 0.6 323.91306 51.3] CT
/Helvetica 15 F
GS
[1 0 0 1 0 0] CT
0 6 moveto 
1 -1 scale
(20. iterace) t 
GR
GR
GS
[0.6 0 0 0.6 0 0] CT
0 0 1 RC
1 LJ
3.333 LW
N
486.009 85.5 M
536.098 85.5 L
S
GR
GS
[0.6 0 0 0.6 323.91306 63.81509] CT
/Helvetica 15 F
GS
[1 0 0 1 0 0] CT
0 6 moveto 
1 -1 scale
(Prav\375 profil) t 
GR
GR
GS
[0.6 0 0 0.6 0 0] CT
0 1 0 RC
1 LJ
3.333 LW
N
486.009 106.358 M
536.098 106.358 L
S
GR
GS
[0.6 0 0 0.6 0 0] CT
0.149 GC
10.0 ML
0.833 LW
N
481 119 M
481 52 L
621 52 L
621 119 L
cp
S
GR
%%Trailer
%%Pages: 1
%%EOF
