%!PS-Adobe-3.0 EPSF-3.0
%%Creator: (MATLAB, The Mathworks, Inc. Version 9.14.0.2206163 \(R2023a\). Operating System: Windows 10)
%%Title: C:/Users/radac/Desktop/Bachelor_thesis/thesis/Metody/fig/random_walk.eps
%%CreationDate: 2023-04-25T16:31:07
%%Pages: (atend)
%%BoundingBox:     0     0   420   315
%%LanguageLevel: 3
%%EndComments
%%BeginProlog
%%BeginResource: procset (Apache XML Graphics Std ProcSet) 1.2 0
%%Version: 1.2 0
%%Copyright: (Copyright 2001-2003,2010 The Apache Software Foundation. License terms: http://www.apache.org/licenses/LICENSE-2.0)
/bd{bind def}bind def
/ld{load def}bd
/GR/grestore ld
/GS/gsave ld
/RM/rmoveto ld
/C/curveto ld
/t/show ld
/L/lineto ld
/ML/setmiterlimit ld
/CT/concat ld
/f/fill ld
/N/newpath ld
/S/stroke ld
/CC/setcmykcolor ld
/A/ashow ld
/cp/closepath ld
/RC/setrgbcolor ld
/LJ/setlinejoin ld
/GC/setgray ld
/LW/setlinewidth ld
/M/moveto ld
/re {4 2 roll M
1 index 0 rlineto
0 exch rlineto
neg 0 rlineto
cp } bd
/_ctm matrix def
/_tm matrix def
/BT { _ctm currentmatrix pop matrix _tm copy pop 0 0 moveto } bd
/ET { _ctm setmatrix } bd
/iTm { _ctm setmatrix _tm concat } bd
/Tm { _tm astore pop iTm 0 0 moveto } bd
/ux 0.0 def
/uy 0.0 def
/F {
  /Tp exch def
  /Tf exch def
  Tf findfont Tp scalefont setfont
  /cf Tf def  /cs Tp def
} bd
/ULS {currentpoint /uy exch def /ux exch def} bd
/ULE {
  /Tcx currentpoint pop def
  gsave
  newpath
  cf findfont cs scalefont dup
  /FontMatrix get 0 get /Ts exch def /FontInfo get dup
  /UnderlinePosition get Ts mul /To exch def
  /UnderlineThickness get Ts mul /Tt exch def
  ux uy To add moveto  Tcx uy To add lineto
  Tt setlinewidth stroke
  grestore
} bd
/OLE {
  /Tcx currentpoint pop def
  gsave
  newpath
  cf findfont cs scalefont dup
  /FontMatrix get 0 get /Ts exch def /FontInfo get dup
  /UnderlinePosition get Ts mul /To exch def
  /UnderlineThickness get Ts mul /Tt exch def
  ux uy To add cs add moveto Tcx uy To add cs add lineto
  Tt setlinewidth stroke
  grestore
} bd
/SOE {
  /Tcx currentpoint pop def
  gsave
  newpath
  cf findfont cs scalefont dup
  /FontMatrix get 0 get /Ts exch def /FontInfo get dup
  /UnderlinePosition get Ts mul /To exch def
  /UnderlineThickness get Ts mul /Tt exch def
  ux uy To add cs 10 mul 26 idiv add moveto Tcx uy To add cs 10 mul 26 idiv add lineto
  Tt setlinewidth stroke
  grestore
} bd
/QT {
/Y22 exch store
/X22 exch store
/Y21 exch store
/X21 exch store
currentpoint
/Y21 load 2 mul add 3 div exch
/X21 load 2 mul add 3 div exch
/X21 load 2 mul /X22 load add 3 div
/Y21 load 2 mul /Y22 load add 3 div
/X22 load /Y22 load curveto
} bd
/SSPD {
dup length /d exch dict def
{
/v exch def
/k exch def
currentpagedevice k known {
/cpdv currentpagedevice k get def
v cpdv ne {
/upd false def
/nullv v type /nulltype eq def
/nullcpdv cpdv type /nulltype eq def
nullv nullcpdv or
{
/upd true def
} {
/sametype v type cpdv type eq def
sametype {
v type /arraytype eq {
/vlen v length def
/cpdvlen cpdv length def
vlen cpdvlen eq {
0 1 vlen 1 sub {
/i exch def
/obj v i get def
/cpdobj cpdv i get def
obj cpdobj ne {
/upd true def
exit
} if
} for
} {
/upd true def
} ifelse
} {
v type /dicttype eq {
v {
/dv exch def
/dk exch def
/cpddv cpdv dk get def
dv cpddv ne {
/upd true def
exit
} if
} forall
} {
/upd true def
} ifelse
} ifelse
} if
} ifelse
upd true eq {
d k v put
} if
} if
} if
} forall
d length 0 gt {
d setpagedevice
} if
} bd
/RE { % /NewFontName [NewEncodingArray] /FontName RE -
  findfont dup length dict begin
  {
    1 index /FID ne
    {def} {pop pop} ifelse
  } forall
  /Encoding exch def
  /FontName 1 index def
  currentdict definefont pop
  end
} bind def
%%EndResource
%%BeginResource: procset (Apache XML Graphics EPS ProcSet) 1.0 0
%%Version: 1.0 0
%%Copyright: (Copyright 2002-2003 The Apache Software Foundation. License terms: http://www.apache.org/licenses/LICENSE-2.0)
/BeginEPSF { %def
/b4_Inc_state save def         % Save state for cleanup
/dict_count countdictstack def % Count objects on dict stack
/op_count count 1 sub def      % Count objects on operand stack
userdict begin                 % Push userdict on dict stack
/showpage { } def              % Redefine showpage, { } = null proc
0 setgray 0 setlinecap         % Prepare graphics state
1 setlinewidth 0 setlinejoin
10 setmiterlimit [ ] 0 setdash newpath
/languagelevel where           % If level not equal to 1 then
{pop languagelevel             % set strokeadjust and
1 ne                           % overprint to their defaults.
{false setstrokeadjust false setoverprint
} if
} if
} bd
/EndEPSF { %def
count op_count sub {pop} repeat            % Clean up stacks
countdictstack dict_count sub {end} repeat
b4_Inc_state restore
} bd
%%EndResource
%FOPBeginFontDict
%%IncludeResource: font Courier-Oblique
%%IncludeResource: font Courier-BoldOblique
%%IncludeResource: font Courier-Bold
%%IncludeResource: font ZapfDingbats
%%IncludeResource: font Symbol
%%IncludeResource: font Helvetica
%%IncludeResource: font Helvetica-Oblique
%%IncludeResource: font Helvetica-Bold
%%IncludeResource: font Helvetica-BoldOblique
%%IncludeResource: font Times-Roman
%%IncludeResource: font Times-Italic
%%IncludeResource: font Times-Bold
%%IncludeResource: font Times-BoldItalic
%%IncludeResource: font Courier
%FOPEndFontDict
%%BeginResource: encoding WinAnsiEncoding
/WinAnsiEncoding [
/.notdef /.notdef /.notdef /.notdef /.notdef
/.notdef /.notdef /.notdef /.notdef /.notdef
/.notdef /.notdef /.notdef /.notdef /.notdef
/.notdef /.notdef /.notdef /.notdef /.notdef
/.notdef /.notdef /.notdef /.notdef /.notdef
/.notdef /.notdef /.notdef /.notdef /.notdef
/.notdef /.notdef /space /exclam /quotedbl
/numbersign /dollar /percent /ampersand /quotesingle
/parenleft /parenright /asterisk /plus /comma
/hyphen /period /slash /zero /one
/two /three /four /five /six
/seven /eight /nine /colon /semicolon
/less /equal /greater /question /at
/A /B /C /D /E
/F /G /H /I /J
/K /L /M /N /O
/P /Q /R /S /T
/U /V /W /X /Y
/Z /bracketleft /backslash /bracketright /asciicircum
/underscore /quoteleft /a /b /c
/d /e /f /g /h
/i /j /k /l /m
/n /o /p /q /r
/s /t /u /v /w
/x /y /z /braceleft /bar
/braceright /asciitilde /bullet /Euro /bullet
/quotesinglbase /florin /quotedblbase /ellipsis /dagger
/daggerdbl /circumflex /perthousand /Scaron /guilsinglleft
/OE /bullet /Zcaron /bullet /bullet
/quoteleft /quoteright /quotedblleft /quotedblright /bullet
/endash /emdash /asciitilde /trademark /scaron
/guilsinglright /oe /bullet /zcaron /Ydieresis
/space /exclamdown /cent /sterling /currency
/yen /brokenbar /section /dieresis /copyright
/ordfeminine /guillemotleft /logicalnot /sfthyphen /registered
/macron /degree /plusminus /twosuperior /threesuperior
/acute /mu /paragraph /middot /cedilla
/onesuperior /ordmasculine /guillemotright /onequarter /onehalf
/threequarters /questiondown /Agrave /Aacute /Acircumflex
/Atilde /Adieresis /Aring /AE /Ccedilla
/Egrave /Eacute /Ecircumflex /Edieresis /Igrave
/Iacute /Icircumflex /Idieresis /Eth /Ntilde
/Ograve /Oacute /Ocircumflex /Otilde /Odieresis
/multiply /Oslash /Ugrave /Uacute /Ucircumflex
/Udieresis /Yacute /Thorn /germandbls /agrave
/aacute /acircumflex /atilde /adieresis /aring
/ae /ccedilla /egrave /eacute /ecircumflex
/edieresis /igrave /iacute /icircumflex /idieresis
/eth /ntilde /ograve /oacute /ocircumflex
/otilde /odieresis /divide /oslash /ugrave
/uacute /ucircumflex /udieresis /yacute /thorn
/ydieresis
] def
%%EndResource
%FOPBeginFontReencode
/Courier-Oblique findfont
dup length dict begin
  {1 index /FID ne {def} {pop pop} ifelse} forall
  /Encoding WinAnsiEncoding def
  currentdict
end
/Courier-Oblique exch definefont pop
/Courier-BoldOblique findfont
dup length dict begin
  {1 index /FID ne {def} {pop pop} ifelse} forall
  /Encoding WinAnsiEncoding def
  currentdict
end
/Courier-BoldOblique exch definefont pop
/Courier-Bold findfont
dup length dict begin
  {1 index /FID ne {def} {pop pop} ifelse} forall
  /Encoding WinAnsiEncoding def
  currentdict
end
/Courier-Bold exch definefont pop
/Helvetica findfont
dup length dict begin
  {1 index /FID ne {def} {pop pop} ifelse} forall
  /Encoding WinAnsiEncoding def
  currentdict
end
/Helvetica exch definefont pop
/Helvetica-Oblique findfont
dup length dict begin
  {1 index /FID ne {def} {pop pop} ifelse} forall
  /Encoding WinAnsiEncoding def
  currentdict
end
/Helvetica-Oblique exch definefont pop
/Helvetica-Bold findfont
dup length dict begin
  {1 index /FID ne {def} {pop pop} ifelse} forall
  /Encoding WinAnsiEncoding def
  currentdict
end
/Helvetica-Bold exch definefont pop
/Helvetica-BoldOblique findfont
dup length dict begin
  {1 index /FID ne {def} {pop pop} ifelse} forall
  /Encoding WinAnsiEncoding def
  currentdict
end
/Helvetica-BoldOblique exch definefont pop
/Times-Roman findfont
dup length dict begin
  {1 index /FID ne {def} {pop pop} ifelse} forall
  /Encoding WinAnsiEncoding def
  currentdict
end
/Times-Roman exch definefont pop
/Times-Italic findfont
dup length dict begin
  {1 index /FID ne {def} {pop pop} ifelse} forall
  /Encoding WinAnsiEncoding def
  currentdict
end
/Times-Italic exch definefont pop
/Times-Bold findfont
dup length dict begin
  {1 index /FID ne {def} {pop pop} ifelse} forall
  /Encoding WinAnsiEncoding def
  currentdict
end
/Times-Bold exch definefont pop
/Times-BoldItalic findfont
dup length dict begin
  {1 index /FID ne {def} {pop pop} ifelse} forall
  /Encoding WinAnsiEncoding def
  currentdict
end
/Times-BoldItalic exch definefont pop
/Courier findfont
dup length dict begin
  {1 index /FID ne {def} {pop pop} ifelse} forall
  /Encoding WinAnsiEncoding def
  currentdict
end
/Courier exch definefont pop
%FOPEndFontReencode
%%EndProlog
%%Page: 1 1
%%PageBoundingBox: 0 0 420 315
%%BeginPageSetup
[1 0 0 -1 0 315] CT
%%EndPageSetup
GS
[0.6 0 0 0.6 0 0] CT
1 GC
N
0 0 700 525 re
f
GR
GS
[0.6 0 0 0.6 0 0] CT
1 GC
N
0 0 700 525 re
f
GR
GS
[0.6 0 0 0.6 0 0] CT
1 GC
N
91 467 M
634 467 L
634 39 L
91 39 L
cp
f
GR
GS
[0.6 0 0 0.6 0 0] CT
0.873 GC
1 LJ
0.833 LW
N
91 467 M
91 39 L
S
GR
GS
[0.6 0 0 0.6 0 0] CT
0.873 GC
1 LJ
0.833 LW
N
145.3 467 M
145.3 39 L
S
GR
GS
[0.6 0 0 0.6 0 0] CT
0.873 GC
1 LJ
0.833 LW
N
199.6 467 M
199.6 39 L
S
GR
GS
[0.6 0 0 0.6 0 0] CT
0.873 GC
1 LJ
0.833 LW
N
253.9 467 M
253.9 39 L
S
GR
GS
[0.6 0 0 0.6 0 0] CT
0.873 GC
1 LJ
0.833 LW
N
308.2 467 M
308.2 39 L
S
GR
GS
[0.6 0 0 0.6 0 0] CT
0.873 GC
1 LJ
0.833 LW
N
362.5 467 M
362.5 39 L
S
GR
GS
[0.6 0 0 0.6 0 0] CT
0.873 GC
1 LJ
0.833 LW
N
416.8 467 M
416.8 39 L
S
GR
GS
[0.6 0 0 0.6 0 0] CT
0.873 GC
1 LJ
0.833 LW
N
471.1 467 M
471.1 39 L
S
GR
GS
[0.6 0 0 0.6 0 0] CT
0.873 GC
1 LJ
0.833 LW
N
525.4 467 M
525.4 39 L
S
GR
GS
[0.6 0 0 0.6 0 0] CT
0.873 GC
1 LJ
0.833 LW
N
579.7 467 M
579.7 39 L
S
GR
GS
[0.6 0 0 0.6 0 0] CT
0.873 GC
1 LJ
0.833 LW
N
634 467 M
634 39 L
S
GR
GS
[0.6 0 0 0.6 0 0] CT
0.873 GC
1 LJ
0.833 LW
N
634 467 M
91 467 L
S
GR
GS
[0.6 0 0 0.6 0 0] CT
0.873 GC
1 LJ
0.833 LW
N
634 381.4 M
91 381.4 L
S
GR
GS
[0.6 0 0 0.6 0 0] CT
0.873 GC
1 LJ
0.833 LW
N
634 295.8 M
91 295.8 L
S
GR
GS
[0.6 0 0 0.6 0 0] CT
0.873 GC
1 LJ
0.833 LW
N
634 210.2 M
91 210.2 L
S
GR
GS
[0.6 0 0 0.6 0 0] CT
0.873 GC
1 LJ
0.833 LW
N
634 124.6 M
91 124.6 L
S
GR
GS
[0.6 0 0 0.6 0 0] CT
0.873 GC
1 LJ
0.833 LW
N
634 39 M
91 39 L
S
GR
GS
[0.6 0 0 0.6 0 0] CT
0.149 GC
2 setlinecap
1 LJ
0.833 LW
N
91 467 M
634 467 L
S
GR
GS
[0.6 0 0 0.6 0 0] CT
0.149 GC
2 setlinecap
1 LJ
0.833 LW
N
91 39 M
634 39 L
S
GR
GS
[0.6 0 0 0.6 0 0] CT
0.149 GC
2 setlinecap
1 LJ
0.833 LW
N
91 467 M
91 461.57 L
S
GR
GS
[0.6 0 0 0.6 0 0] CT
0.149 GC
2 setlinecap
1 LJ
0.833 LW
N
145.3 467 M
145.3 461.57 L
S
GR
GS
[0.6 0 0 0.6 0 0] CT
0.149 GC
2 setlinecap
1 LJ
0.833 LW
N
199.6 467 M
199.6 461.57 L
S
GR
GS
[0.6 0 0 0.6 0 0] CT
0.149 GC
2 setlinecap
1 LJ
0.833 LW
N
253.9 467 M
253.9 461.57 L
S
GR
GS
[0.6 0 0 0.6 0 0] CT
0.149 GC
2 setlinecap
1 LJ
0.833 LW
N
308.2 467 M
308.2 461.57 L
S
GR
GS
[0.6 0 0 0.6 0 0] CT
0.149 GC
2 setlinecap
1 LJ
0.833 LW
N
362.5 467 M
362.5 461.57 L
S
GR
GS
[0.6 0 0 0.6 0 0] CT
0.149 GC
2 setlinecap
1 LJ
0.833 LW
N
416.8 467 M
416.8 461.57 L
S
GR
GS
[0.6 0 0 0.6 0 0] CT
0.149 GC
2 setlinecap
1 LJ
0.833 LW
N
471.1 467 M
471.1 461.57 L
S
GR
GS
[0.6 0 0 0.6 0 0] CT
0.149 GC
2 setlinecap
1 LJ
0.833 LW
N
525.4 467 M
525.4 461.57 L
S
GR
GS
[0.6 0 0 0.6 0 0] CT
0.149 GC
2 setlinecap
1 LJ
0.833 LW
N
579.7 467 M
579.7 461.57 L
S
GR
GS
[0.6 0 0 0.6 0 0] CT
0.149 GC
2 setlinecap
1 LJ
0.833 LW
N
634 467 M
634 461.57 L
S
GR
GS
[0.6 0 0 0.6 0 0] CT
0.149 GC
2 setlinecap
1 LJ
0.833 LW
N
91 39 M
91 44.43 L
S
GR
GS
[0.6 0 0 0.6 0 0] CT
0.149 GC
2 setlinecap
1 LJ
0.833 LW
N
145.3 39 M
145.3 44.43 L
S
GR
GS
[0.6 0 0 0.6 0 0] CT
0.149 GC
2 setlinecap
1 LJ
0.833 LW
N
199.6 39 M
199.6 44.43 L
S
GR
GS
[0.6 0 0 0.6 0 0] CT
0.149 GC
2 setlinecap
1 LJ
0.833 LW
N
253.9 39 M
253.9 44.43 L
S
GR
GS
[0.6 0 0 0.6 0 0] CT
0.149 GC
2 setlinecap
1 LJ
0.833 LW
N
308.2 39 M
308.2 44.43 L
S
GR
GS
[0.6 0 0 0.6 0 0] CT
0.149 GC
2 setlinecap
1 LJ
0.833 LW
N
362.5 39 M
362.5 44.43 L
S
GR
GS
[0.6 0 0 0.6 0 0] CT
0.149 GC
2 setlinecap
1 LJ
0.833 LW
N
416.8 39 M
416.8 44.43 L
S
GR
GS
[0.6 0 0 0.6 0 0] CT
0.149 GC
2 setlinecap
1 LJ
0.833 LW
N
471.1 39 M
471.1 44.43 L
S
GR
GS
[0.6 0 0 0.6 0 0] CT
0.149 GC
2 setlinecap
1 LJ
0.833 LW
N
525.4 39 M
525.4 44.43 L
S
GR
GS
[0.6 0 0 0.6 0 0] CT
0.149 GC
2 setlinecap
1 LJ
0.833 LW
N
579.7 39 M
579.7 44.43 L
S
GR
GS
[0.6 0 0 0.6 0 0] CT
0.149 GC
2 setlinecap
1 LJ
0.833 LW
N
634 39 M
634 44.43 L
S
GR
GS
[0.6 0 0 0.6 54.6 284.20001] CT
0.149 GC
/Helvetica 16.667 F
GS
[1 0 0 1 0 0] CT
-5 17 moveto 
1 -1 scale
(0) t 
GR
GR
GS
[0.6 0 0 0.6 87.18 284.20001] CT
0.149 GC
/Helvetica 16.667 F
GS
[1 0 0 1 0 0] CT
-14 17 moveto 
1 -1 scale
(100) t 
GR
GR
GS
[0.6 0 0 0.6 119.76 284.20001] CT
0.149 GC
/Helvetica 16.667 F
GS
[1 0 0 1 0 0] CT
-14 17 moveto 
1 -1 scale
(200) t 
GR
GR
GS
[0.6 0 0 0.6 152.34 284.20001] CT
0.149 GC
/Helvetica 16.667 F
GS
[1 0 0 1 0 0] CT
-14 17 moveto 
1 -1 scale
(300) t 
GR
GR
GS
[0.6 0 0 0.6 184.92001 284.20001] CT
0.149 GC
/Helvetica 16.667 F
GS
[1 0 0 1 0 0] CT
-14 17 moveto 
1 -1 scale
(400) t 
GR
GR
GS
[0.6 0 0 0.6 217.5 284.20001] CT
0.149 GC
/Helvetica 16.667 F
GS
[1 0 0 1 0 0] CT
-14 17 moveto 
1 -1 scale
(500) t 
GR
GR
GS
[0.6 0 0 0.6 250.07999 284.20001] CT
0.149 GC
/Helvetica 16.667 F
GS
[1 0 0 1 0 0] CT
-14 17 moveto 
1 -1 scale
(600) t 
GR
GR
GS
[0.6 0 0 0.6 282.66 284.20001] CT
0.149 GC
/Helvetica 16.667 F
GS
[1 0 0 1 0 0] CT
-14 17 moveto 
1 -1 scale
(700) t 
GR
GR
GS
[0.6 0 0 0.6 315.24001 284.20001] CT
0.149 GC
/Helvetica 16.667 F
GS
[1 0 0 1 0 0] CT
-14 17 moveto 
1 -1 scale
(800) t 
GR
GR
GS
[0.6 0 0 0.6 347.82001 284.20001] CT
0.149 GC
/Helvetica 16.667 F
GS
[1 0 0 1 0 0] CT
-14 17 moveto 
1 -1 scale
(900) t 
GR
GR
GS
[0.6 0 0 0.6 380.4 284.20001] CT
0.149 GC
/Helvetica 16.667 F
GS
[1 0 0 1 0 0] CT
-19 17 moveto 
1 -1 scale
(1000) t 
GR
GR
GS
[0.6 0 0 0.6 0 0] CT
0.149 GC
2 setlinecap
1 LJ
0.833 LW
N
91 467 M
91 39 L
S
GR
GS
[0.6 0 0 0.6 0 0] CT
0.149 GC
2 setlinecap
1 LJ
0.833 LW
N
634 467 M
634 39 L
S
GR
GS
[0.6 0 0 0.6 0 0] CT
0.149 GC
2 setlinecap
1 LJ
0.833 LW
N
91 467 M
96.43 467 L
S
GR
GS
[0.6 0 0 0.6 0 0] CT
0.149 GC
2 setlinecap
1 LJ
0.833 LW
N
91 381.4 M
96.43 381.4 L
S
GR
GS
[0.6 0 0 0.6 0 0] CT
0.149 GC
2 setlinecap
1 LJ
0.833 LW
N
91 295.8 M
96.43 295.8 L
S
GR
GS
[0.6 0 0 0.6 0 0] CT
0.149 GC
2 setlinecap
1 LJ
0.833 LW
N
91 210.2 M
96.43 210.2 L
S
GR
GS
[0.6 0 0 0.6 0 0] CT
0.149 GC
2 setlinecap
1 LJ
0.833 LW
N
91 124.6 M
96.43 124.6 L
S
GR
GS
[0.6 0 0 0.6 0 0] CT
0.149 GC
2 setlinecap
1 LJ
0.833 LW
N
91 39 M
96.43 39 L
S
GR
GS
[0.6 0 0 0.6 0 0] CT
0.149 GC
2 setlinecap
1 LJ
0.833 LW
N
634 467 M
628.57 467 L
S
GR
GS
[0.6 0 0 0.6 0 0] CT
0.149 GC
2 setlinecap
1 LJ
0.833 LW
N
634 381.4 M
628.57 381.4 L
S
GR
GS
[0.6 0 0 0.6 0 0] CT
0.149 GC
2 setlinecap
1 LJ
0.833 LW
N
634 295.8 M
628.57 295.8 L
S
GR
GS
[0.6 0 0 0.6 0 0] CT
0.149 GC
2 setlinecap
1 LJ
0.833 LW
N
634 210.2 M
628.57 210.2 L
S
GR
GS
[0.6 0 0 0.6 0 0] CT
0.149 GC
2 setlinecap
1 LJ
0.833 LW
N
634 124.6 M
628.57 124.6 L
S
GR
GS
[0.6 0 0 0.6 0 0] CT
0.149 GC
2 setlinecap
1 LJ
0.833 LW
N
634 39 M
628.57 39 L
S
GR
GS
[0.6 0 0 0.6 50.6 280.2] CT
0.149 GC
/Helvetica 16.667 F
GS
[1 0 0 1 0 0] CT
-15 6.5 moveto 
1 -1 scale
(-2) t 
GR
GR
GS
[0.6 0 0 0.6 50.6 228.84] CT
0.149 GC
/Helvetica 16.667 F
GS
[1 0 0 1 0 0] CT
-29 6.5 moveto 
1 -1 scale
(-1.5) t 
GR
GR
GS
[0.6 0 0 0.6 50.6 177.47999] CT
0.149 GC
/Helvetica 16.667 F
GS
[1 0 0 1 0 0] CT
-15 6.5 moveto 
1 -1 scale
(-1) t 
GR
GR
GS
[0.6 0 0 0.6 50.6 126.12] CT
0.149 GC
/Helvetica 16.667 F
GS
[1 0 0 1 0 0] CT
-29 6.5 moveto 
1 -1 scale
(-0.5) t 
GR
GR
GS
[0.6 0 0 0.6 50.6 74.76] CT
0.149 GC
/Helvetica 16.667 F
GS
[1 0 0 1 0 0] CT
-10 6.5 moveto 
1 -1 scale
(0) t 
GR
GR
GS
[0.6 0 0 0.6 50.6 23.4] CT
0.149 GC
/Helvetica 16.667 F
GS
[1 0 0 1 0 0] CT
-24 6.5 moveto 
1 -1 scale
(0.5) t 
GR
GR
GS
[0.6 0 0 0.6 0 0] CT
0 0 1 RC
1 LJ
3.333 LW
N
91.543 119.072 M
92.086 131.613 L
92.629 128.316 L
93.172 118.743 L
93.715 118.786 L
94.258 120.971 L
94.801 130.981 L
95.344 125.96 L
95.887 132.337 L
96.43 138.622 L
96.973 132.636 L
97.516 115.468 L
98.059 126.165 L
98.602 125.648 L
99.145 120.322 L
99.688 119.383 L
100.231 110.229 L
100.774 117.285 L
101.317 105.764 L
101.86 102.662 L
102.403 101.652 L
102.946 114.538 L
103.489 118.198 L
104.032 115.33 L
104.575 117.556 L
105.118 118.428 L
105.661 116.086 L
106.204 115.94 L
106.747 114.352 L
107.29 110.782 L
107.833 108.822 L
108.376 108.177 L
108.919 99.462 L
109.462 104.554 L
110.005 113.337 L
110.548 118.072 L
111.091 122.617 L
111.634 109.538 L
112.177 120.666 L
112.72 118.883 L
113.263 117.263 L
113.806 112.541 L
114.349 123.228 L
114.892 109.498 L
115.435 112.574 L
115.978 105.12 L
116.521 113.489 L
117.064 92.294 L
117.607 96.719 L
118.15 110.546 L
118.693 112.723 L
119.236 118.6 L
119.779 106.04 L
120.322 116.971 L
120.865 120.363 L
121.408 109.503 L
121.951 98.704 L
122.494 99.973 L
123.037 94.993 L
123.58 98.979 L
124.123 96.71 L
124.666 84.354 L
125.209 83.573 L
125.752 83.241 L
126.295 85.281 L
126.838 90.324 L
127.381 93.899 L
127.924 99.204 L
128.467 94.351 L
129.01 102.253 L
129.553 103.871 L
130.096 107.2 L
130.639 105.322 L
131.182 109.763 L
131.725 118.101 L
132.268 107.443 L
132.811 100.308 L
133.354 92.023 L
133.897 94.746 L
134.44 90.727 L
134.983 90.53 L
135.526 87.642 L
136.069 92.371 L
136.612 97.651 L
137.155 101.957 L
137.698 106.18 L
138.241 107.131 L
138.784 105.642 L
139.327 106.505 L
139.87 109.569 L
140.413 119.621 L
140.956 100.224 L
141.499 108.065 L
142.042 108.193 L
142.585 101.801 L
143.128 103.085 L
143.671 110.115 L
144.214 109.613 L
144.757 108.627 L
145.3 94.543 L
145.843 103.856 L
146.386 104.908 L
146.929 101.078 L
147.472 95.024 L
148.015 92.134 L
148.558 110.886 L
149.101 113.143 L
149.644 112.308 L
150.187 117.526 L
150.73 117.423 L
151.273 112.345 L
151.816 118.245 L
152.359 125.966 L
152.902 132.346 L
153.445 136.587 L
153.988 145.027 L
154.531 137.787 L
155.074 140.643 L
155.617 162.989 L
156.16 158.462 L
156.703 159.49 L
157.246 154.554 L
157.789 167.828 L
158.332 178.121 L
158.875 175.59 L
159.418 187.717 L
159.961 199.866 L
160.504 198.478 L
161.047 210.313 L
161.59 213.982 L
162.133 204.778 L
162.676 200.069 L
163.219 198.877 L
163.762 198.382 L
164.305 215.13 L
164.848 204.713 L
165.391 202.62 L
165.934 197.943 L
166.477 197.385 L
167.02 183.097 L
167.563 179.942 L
168.106 176.442 L
168.649 184.388 L
169.192 186.858 L
169.735 183.637 L
170.278 193.03 L
170.821 194.133 L
171.364 204.547 L
171.907 204.301 L
172.45 191.959 L
172.993 199.167 L
173.536 184.093 L
174.079 182.846 L
174.622 179.226 L
175.165 183.54 L
175.708 184.977 L
176.251 191.483 L
176.794 212.906 L
177.337 226.128 L
177.88 227.623 L
178.423 224.74 L
178.966 223.664 L
179.509 226.209 L
180.052 228.695 L
180.595 213.025 L
181.138 211.296 L
181.681 203.194 L
182.224 193.164 L
182.767 191.282 L
183.31 184.024 L
183.853 180.805 L
184.396 200.444 L
184.939 187.862 L
185.482 192.958 L
186.025 193.248 L
186.568 193.157 L
187.111 193.429 L
187.654 178.621 L
188.197 190.446 L
188.74 206.12 L
189.283 198.723 L
189.826 192.985 L
190.369 194.221 L
190.912 194.527 L
191.455 200.148 L
191.998 209.452 L
192.541 204.573 L
193.084 221.115 L
193.627 231.456 L
194.17 230.284 L
194.713 237.501 L
195.256 232.942 L
195.799 219.137 L
196.342 222.689 L
196.885 227.903 L
197.428 214.527 L
197.971 205.083 L
198.514 207.652 L
199.057 200.269 L
199.6 202.163 L
200.143 213.199 L
200.686 206.688 L
201.229 200.829 L
201.772 200.603 L
202.315 197.39 L
202.858 204.466 L
203.401 200.623 L
203.944 191.879 L
204.487 196.52 L
205.03 181.233 L
205.573 184.358 L
206.116 194.871 L
206.659 204.165 L
207.202 214.808 L
207.745 223.167 L
208.288 228.453 L
208.831 219.342 L
209.374 220.154 L
209.917 230.351 L
210.46 224.457 L
211.003 226.447 L
211.546 232.639 L
212.089 219.056 L
212.632 224.418 L
213.175 219.474 L
213.718 223.434 L
214.261 214.709 L
214.804 204.916 L
215.347 204.459 L
215.89 201.1 L
216.433 209.548 L
216.976 212.07 L
217.519 213.738 L
218.062 213.637 L
218.605 209.605 L
219.148 213.091 L
219.691 215.1 L
220.234 212.903 L
220.777 214.987 L
221.32 223.677 L
221.863 212.194 L
222.406 209.298 L
222.949 216.084 L
223.492 203.796 L
224.035 217.855 L
224.578 215.463 L
225.121 221.701 L
225.664 215.791 L
226.207 214.515 L
226.75 204.745 L
227.293 209.557 L
227.836 213.637 L
228.379 211.78 L
228.922 203.607 L
229.465 197.084 L
230.008 202.269 L
230.551 210.938 L
231.094 212.509 L
231.637 192.239 L
232.18 188.715 L
232.723 201.376 L
233.266 220.085 L
233.809 203.625 L
234.352 201.868 L
234.895 195.673 L
235.438 187.835 L
235.981 185.484 L
236.524 174.803 L
237.067 187.775 L
237.61 200.803 L
238.153 201.275 L
238.696 208.156 L
239.239 207.647 L
239.782 206.2 L
240.325 209.641 L
240.868 200.048 L
241.411 189.477 L
241.954 194.2 L
242.497 195.592 L
243.04 184.255 L
243.583 197.28 L
244.126 198.373 L
244.669 205.953 L
245.212 216.475 L
245.755 209.599 L
246.298 216.504 L
246.841 214.948 L
247.384 203.916 L
247.927 197.168 L
248.47 195.015 L
249.013 193.372 L
249.556 208.335 L
250.099 214.365 L
250.642 211.725 L
251.185 221.768 L
251.728 217.189 L
252.271 216.448 L
252.814 207.227 L
253.357 221.183 L
253.9 236.287 L
254.443 236.764 L
254.986 236.347 L
255.529 232.791 L
256.072 241.618 L
256.615 235.535 L
257.158 227.483 L
257.701 237.791 L
258.244 223.083 L
258.787 211.844 L
259.33 210.722 L
259.873 225.146 L
260.416 229.488 L
260.959 261.288 L
261.502 271.168 L
262.045 266.236 L
262.588 275.242 L
263.131 282.489 L
263.674 282.17 L
264.217 261.983 L
264.76 272.331 L
265.303 273.101 L
265.846 269.26 L
266.389 275.596 L
266.932 282.244 L
267.475 278.64 L
268.018 277.328 L
268.561 266.053 L
269.104 263.979 L
269.647 268.694 L
270.19 264.761 L
270.733 250.26 L
271.276 249.694 L
271.819 245.69 L
272.362 245.592 L
272.905 237.545 L
273.448 240.936 L
273.991 239.983 L
274.534 246.005 L
275.077 257.271 L
275.62 252.781 L
276.163 236.109 L
276.706 232.499 L
277.249 221.334 L
277.792 226.371 L
278.335 209.035 L
278.878 216.122 L
279.421 220.04 L
279.964 225.715 L
280.507 216.832 L
281.05 214.474 L
281.593 213.302 L
282.136 227.224 L
282.679 241.964 L
283.222 240.224 L
283.765 237.59 L
284.308 243.198 L
284.851 246.085 L
285.394 242.089 L
285.937 253.736 L
286.48 252.943 L
287.023 247.54 L
287.566 251.119 L
288.109 250.382 L
288.652 251.184 L
289.195 249.306 L
289.738 250.85 L
290.281 243.049 L
290.824 237.262 L
291.367 229.915 L
291.91 238.656 L
292.453 233.052 L
292.996 233.76 L
293.539 238.187 L
294.082 237.151 L
294.625 226.653 L
295.168 221.692 L
295.711 229.602 L
296.254 243.558 L
296.797 257.217 L
297.34 254.202 L
297.883 267.395 L
298.426 274.545 L
298.969 279.571 L
299.512 289.992 L
300.055 296.572 L
300.598 305.899 L
301.141 284.179 L
301.684 287.055 L
302.227 277.807 L
302.77 279.781 L
303.313 288.845 L
303.856 291.142 L
304.399 286.302 L
304.942 280.624 L
305.485 274.376 L
306.028 268.458 L
306.571 267.679 L
307.114 270.122 L
307.657 268.416 L
308.2 265.703 L
308.743 258.616 L
309.286 247.47 L
309.829 250.063 L
310.372 259.981 L
310.915 256.667 L
311.458 256.443 L
312.001 249.906 L
312.544 252.293 L
313.087 247.394 L
313.63 246.494 L
314.173 251.934 L
314.716 262.363 L
315.259 267.905 L
315.802 277.362 L
316.345 280.298 L
316.888 274.463 L
317.431 262.449 L
317.974 260.475 L
318.517 262.735 L
319.06 255.11 L
319.603 253.314 L
320.146 253.226 L
320.689 236.931 L
321.232 230.682 L
321.775 220.403 L
322.318 215.946 L
322.861 202.712 L
323.404 190.844 L
323.947 207.652 L
324.49 211.377 L
325.033 206.164 L
325.576 208.074 L
326.119 219.01 L
326.662 233.236 L
327.205 222.016 L
327.748 219.966 L
328.291 219.891 L
328.834 227.573 L
329.377 223.868 L
329.92 228.012 L
330.463 227.018 L
331.006 217.971 L
331.549 209.037 L
332.092 218.014 L
332.635 217.905 L
333.178 212.764 L
333.721 216.026 L
334.264 206.742 L
334.807 210.296 L
335.35 221.748 L
335.893 229.338 L
336.436 230.055 L
336.979 219.933 L
337.522 210.551 L
338.065 215.77 L
338.608 218.316 L
339.151 207.848 L
339.694 209.288 L
340.237 202.467 L
340.78 195.208 L
341.323 188.137 L
341.866 173.374 L
342.409 181.285 L
342.952 177.816 L
343.495 173.388 L
344.038 162.275 L
344.581 159.474 L
345.124 162.701 L
345.667 164.887 L
346.21 173.667 L
346.753 179.799 L
347.296 189.84 L
347.839 184.706 L
348.382 176.708 L
348.925 171.115 L
349.468 168.735 L
350.011 175.739 L
350.554 174.874 L
351.097 169.085 L
351.64 171.403 L
352.183 181.901 L
352.726 201.986 L
353.269 190.921 L
353.812 206.228 L
354.355 208.852 L
354.898 203.577 L
355.441 210.851 L
355.984 210.767 L
356.527 212.136 L
357.07 229.074 L
357.613 250.236 L
358.156 256.177 L
358.699 272.364 L
359.242 270.678 L
359.785 259.138 L
360.328 263.552 L
360.871 276.898 L
361.414 291.707 L
361.957 306.41 L
362.5 296.674 L
363.043 284.014 L
363.586 296.155 L
364.129 286.951 L
364.672 274.335 L
365.215 278.088 L
365.758 285.217 L
366.301 280.685 L
366.844 274.506 L
367.387 285.914 L
367.93 295.235 L
368.473 282.503 L
369.016 266.7 L
369.559 269.728 L
370.102 265.618 L
370.645 264.524 L
371.188 261.519 L
371.731 260.902 L
372.274 259.29 L
372.817 269.668 L
373.36 279.409 L
373.903 273.191 L
374.446 279.098 L
374.989 274.491 L
375.532 282.538 L
376.075 294.077 L
376.618 292.747 L
377.161 297.41 L
377.704 300.913 L
378.247 286.589 L
378.79 298.08 L
379.333 302.741 L
379.876 313.149 L
380.419 315.427 L
380.962 336.92 L
381.505 336.762 L
382.048 333.8 L
382.591 340.696 L
383.134 349.304 L
383.677 340.882 L
384.22 329.124 L
384.763 328.612 L
385.306 337.366 L
385.849 327.021 L
386.392 322.456 L
386.935 316.028 L
387.478 315.546 L
388.021 308.997 L
388.564 314.218 L
389.107 323.14 L
389.65 315.967 L
390.193 321.804 L
390.736 329.341 L
391.279 316.342 L
391.822 319.939 L
392.365 323.439 L
392.908 334.652 L
393.451 344.529 L
393.994 349.62 L
394.537 335.167 L
395.08 329.855 L
395.623 341.512 L
396.166 346.999 L
396.709 347.082 L
397.252 342.404 L
397.795 339.466 L
398.338 330.346 L
398.881 332.171 L
399.424 334.713 L
399.967 330.946 L
400.51 335.178 L
401.053 334.4 L
401.596 352.71 L
402.139 350.437 L
402.682 352.425 L
403.225 348.328 L
403.768 353.038 L
404.311 345.239 L
404.854 351.928 L
405.397 358.083 L
405.94 361.103 L
406.483 370.322 L
407.026 369.793 L
407.569 384.582 L
408.112 378.382 L
408.655 378.737 L
409.198 372.343 L
409.741 379.894 L
410.284 372.6 L
410.827 367.038 L
411.37 372.919 L
411.913 367.17 L
412.456 377.706 L
412.999 361.954 L
413.542 371.967 L
414.085 356.259 L
414.628 354.708 L
415.171 356.301 L
415.714 359.809 L
416.257 356.34 L
416.8 353.822 L
417.343 358.041 L
417.886 346.124 L
418.429 348.158 L
418.972 332.607 L
419.515 339.687 L
420.058 327.981 L
420.601 317.846 L
421.144 318.956 L
421.687 326.314 L
422.23 331.745 L
422.773 333.532 L
423.316 342.965 L
423.859 364.912 L
424.402 361.461 L
424.945 373.5 L
425.488 376.183 L
426.031 383.825 L
426.574 391.619 L
427.117 373.402 L
427.66 353.303 L
428.203 342.293 L
428.746 332.115 L
429.289 343.337 L
429.832 339.1 L
430.375 340.488 L
430.918 353.038 L
431.461 350.323 L
432.004 368.148 L
432.547 361.396 L
433.09 350.509 L
433.633 360.307 L
434.176 362.915 L
434.719 346.164 L
435.262 353.334 L
435.805 371.721 L
436.348 364.037 L
436.891 367.207 L
437.434 377.839 L
437.977 390.328 L
438.52 394.296 L
439.063 396.288 L
439.606 403.3 L
440.149 405.962 L
440.692 412.878 L
441.235 419.01 L
441.778 420.724 L
442.321 424.926 L
442.864 430.014 L
443.407 422.351 L
443.95 408.623 L
444.493 395.235 L
445.036 398.187 L
445.579 394.203 L
446.122 401.986 L
446.665 396.013 L
447.208 385.394 L
447.751 379.795 L
448.294 392.792 L
448.837 379.673 L
449.38 370.022 L
449.923 359.721 L
450.466 361.27 L
451.009 375.215 L
451.552 378.881 L
452.095 371.881 L
452.638 368.714 L
453.181 377.622 L
453.724 368.558 L
454.267 355.338 L
454.81 348.171 L
455.353 334.875 L
455.896 334.269 L
456.439 330.12 L
456.982 347.379 L
457.525 339.206 L
458.068 331.541 L
458.611 334.695 L
459.154 317.225 L
459.697 323.369 L
460.24 340.463 L
460.783 365.413 L
461.326 364.619 L
461.869 366.936 L
462.412 378.042 L
462.955 380.073 L
463.498 382.425 L
464.041 385.206 L
464.584 371.824 L
465.127 373.896 L
465.67 383.636 L
466.213 358.879 L
466.756 356.498 L
467.299 347.039 L
467.842 343.15 L
468.385 336.848 L
468.928 333.962 L
469.471 337.49 L
470.014 346.508 L
470.557 342.216 L
471.1 344.856 L
471.643 339.183 L
472.186 336.926 L
472.729 341.028 L
473.272 350.301 L
473.815 360.636 L
474.358 364.418 L
474.901 363.181 L
475.444 356.155 L
475.987 358.286 L
476.53 358.218 L
477.073 357.049 L
477.616 365.07 L
478.159 357.442 L
478.702 357.926 L
479.245 354.064 L
479.788 353.998 L
480.331 355.232 L
480.874 348.524 L
481.417 356.966 L
481.96 369.201 L
482.503 367.878 L
483.046 362.114 L
483.589 360.546 L
484.132 359.198 L
484.675 363.997 L
485.218 352.428 L
485.761 356.428 L
486.304 352.966 L
486.847 357.549 L
487.39 364.138 L
487.933 354.08 L
488.476 367.762 L
489.019 357.477 L
489.562 357.779 L
490.105 342.111 L
490.648 340.072 L
491.191 339.575 L
491.734 330.014 L
492.277 327.394 L
492.82 334.737 L
493.363 358.683 L
493.906 365.065 L
494.449 362.612 L
494.992 353.148 L
495.535 350.634 L
496.078 349.665 L
496.621 336.183 L
497.164 328.5 L
497.707 329.068 L
498.25 321.045 L
498.793 314.588 L
499.336 330.269 L
499.879 323.242 L
500.422 319.599 L
500.965 321.173 L
501.508 320.119 L
502.051 326.775 L
502.594 306.734 L
503.137 303.879 L
503.68 310.509 L
504.223 293.431 L
504.766 280.061 L
505.309 283.256 L
505.852 279.687 L
506.395 255.78 L
506.938 254.179 L
507.481 251.343 L
508.024 252.176 L
508.567 261.148 L
509.11 262.738 L
509.653 266.76 L
510.196 270.963 L
510.739 273.414 L
511.282 267.979 L
511.825 268.304 L
512.368 275.68 L
512.911 269.138 L
513.454 265.39 L
513.997 275.734 L
514.54 266.818 L
515.083 267.445 L
515.626 259.471 L
516.169 258.56 L
516.712 255.64 L
517.255 240.842 L
517.798 223.622 L
518.341 221.687 L
518.884 224.81 L
519.427 224.869 L
519.97 228.669 L
520.513 231.862 L
521.056 229.824 L
521.599 255.18 L
522.142 257.389 L
522.685 239.878 L
523.228 229.9 L
523.771 233.041 L
524.314 212.513 L
524.857 207.629 L
525.4 202.73 L
525.943 207.76 L
526.486 196.093 L
527.029 191.363 L
527.572 186.659 L
528.115 190.9 L
528.658 199.153 L
529.201 201.209 L
529.744 200.093 L
530.287 216.133 L
530.83 219.448 L
531.373 210.706 L
531.916 224.449 L
532.459 218.711 L
533.002 204.568 L
533.545 209.371 L
534.088 220.678 L
534.631 226.047 L
535.174 237.01 L
535.717 240.985 L
536.26 241.813 L
536.803 240.427 L
537.346 258.832 L
537.889 246.581 L
538.432 259.032 L
538.975 258.065 L
539.518 249.001 L
540.061 254.229 L
540.604 260.008 L
541.147 251.161 L
541.69 261.968 L
542.233 262.219 L
542.776 251.636 L
543.319 249.641 L
543.862 244.535 L
544.405 239.945 L
544.948 244.507 L
545.491 250.079 L
546.034 239.036 L
546.577 235.444 L
547.12 223.996 L
547.663 234.286 L
548.206 240.703 L
548.749 250.606 L
549.292 251.599 L
549.835 255.379 L
550.378 244.823 L
550.921 245.177 L
551.464 238.545 L
552.007 228.196 L
552.55 229.888 L
553.093 240.707 L
553.636 259.466 L
554.179 260.412 L
554.722 255.343 L
555.265 265.941 L
555.808 280.025 L
556.351 272.663 L
556.894 264.182 L
557.437 254.04 L
557.98 248.597 L
558.523 233.521 L
559.066 230.159 L
559.609 224.308 L
560.152 216.997 L
560.695 224.443 L
561.238 226.934 L
561.781 229.033 L
562.324 234.425 L
562.867 247.59 L
563.41 249.99 L
563.953 243.955 L
564.496 237.574 L
565.039 244.799 L
565.582 236.466 L
566.125 223.629 L
566.668 223.958 L
567.211 227.935 L
567.754 228.301 L
568.297 232.234 L
568.84 211.852 L
569.383 215.538 L
569.926 225.448 L
570.469 225.296 L
571.012 232.015 L
571.555 236.439 L
572.098 227.997 L
572.641 223.294 L
573.184 204.556 L
573.727 193.964 L
574.27 188.878 L
574.813 183.93 L
575.356 188.915 L
575.899 184.34 L
576.442 192.087 L
576.985 179.627 L
577.528 164.106 L
578.071 170.239 L
578.614 184.577 L
579.157 177.539 L
579.7 169.983 L
580.243 152.965 L
580.786 167.219 L
581.329 168.972 L
581.872 173.729 L
582.415 175.1 L
582.958 186.668 L
583.501 169.178 L
584.044 163.802 L
584.587 160.078 L
585.13 153.462 L
585.673 144.57 L
586.216 153.337 L
586.759 147.09 L
587.302 133.082 L
587.845 141.089 L
588.388 140.364 L
588.931 133.183 L
589.474 140.553 L
590.017 144.446 L
590.56 135.454 L
591.103 134.372 L
591.646 130.056 L
592.189 134.059 L
592.732 129.831 L
593.275 129.856 L
593.818 127.535 L
594.361 133.442 L
594.904 140.795 L
595.447 137.066 L
595.99 142.103 L
596.533 158.439 L
597.076 159.281 L
597.619 163.553 L
598.162 146.226 L
598.705 148.842 L
599.248 155.856 L
599.791 158.146 L
600.334 167.448 L
600.877 160.513 L
601.42 169.351 L
601.963 164.299 L
602.506 186.151 L
603.049 194.433 L
603.592 206.836 L
604.135 204.382 L
604.678 210.62 L
605.221 207.03 L
605.764 207.665 L
606.307 198.835 L
606.85 211.719 L
607.393 212.385 L
607.936 224.406 L
608.479 238.317 L
609.022 248.837 L
609.565 252.31 L
610.108 247.74 L
610.651 259.479 L
611.194 261.319 L
611.737 276.842 L
612.28 281.374 L
612.823 271.15 L
613.366 270.512 L
613.909 247.221 L
614.452 242.398 L
614.995 254.906 L
615.538 266.368 L
616.081 268.795 L
616.624 278.171 L
617.167 284.142 L
617.71 294.091 L
618.253 296.465 L
618.796 296.007 L
619.339 299.068 L
619.882 303.157 L
620.425 301.829 L
620.968 314.405 L
621.511 318.113 L
622.054 313.916 L
622.597 314.332 L
623.14 310.463 L
623.683 324.785 L
624.226 351.99 L
624.769 330.168 L
625.312 331.324 L
625.855 328.253 L
626.398 334.231 L
626.941 326.868 L
627.484 325.583 L
628.027 325.1 L
628.57 314.308 L
629.113 334.998 L
629.656 328.973 L
630.199 335.406 L
630.742 332.032 L
631.285 325.055 L
631.828 326.573 L
632.371 335.473 L
632.914 336.305 L
633.457 339.005 L
634 343.567 L
S
GR
%%Trailer
%%Pages: 1
%%EOF
