\relax 
\abx@aux@refcontext{none/global//global/global}
\providecommand\babel@aux[2]{}
\@nameuse{bbl@beforestart}
\catcode `"\active 
\catcode `-\active 
\providecommand\hyper@newdestlabel[2]{}
\providecommand\HyperFirstAtBeginDocument{\AtBeginDocument}
\HyperFirstAtBeginDocument{\ifx\hyper@anchor\@undefined
\global\let\oldnewlabel\newlabel
\gdef\newlabel#1#2{\newlabelxx{#1}#2}
\gdef\newlabelxx#1#2#3#4#5#6{\oldnewlabel{#1}{{#2}{#3}}}
\AtEndDocument{\ifx\hyper@anchor\@undefined
\let\newlabel\oldnewlabel
\fi}
\fi}
\global\let\hyper@last\relax 
\gdef\HyperFirstAtBeginDocument#1{#1}
\providecommand\HyField@AuxAddToFields[1]{}
\providecommand\HyField@AuxAddToCoFields[2]{}
\babel@aux{czech}{}
\babel@aux{czech}{}
\babel@aux{czech}{}
\babel@aux{czech}{}
\babel@aux{czech}{}
\babel@aux{czech}{}
\@writefile{toc}{\contentsline {paragraph}{Kl\'i\v cov\'a\ slova:}{vi}{paragraph*.1}\protected@file@percent }
\@writefile{toc}{\contentsline {paragraph}{Vedoucí:}{vi}{paragraph*.2}\protected@file@percent }
\babel@aux{english}{}
\@writefile{toc}{\contentsline {paragraph}{Keywords:}{vi}{paragraph*.3}\protected@file@percent }
\@writefile{toc}{\contentsline {paragraph}{Title\ translation:}{vi}{paragraph*.4}\protected@file@percent }
\babel@aux{czech}{}
\babel@aux{czech}{}
\babel@aux{czech}{}
\abx@aux@cite{0}{Loi_braking}
\abx@aux@segm{0}{0}{Loi_braking}
\babel@aux{czech}{}
\babel@aux{czech}{}
\babel@aux{english}{}
\babel@aux{czech}{}
\babel@aux{czech}{}
\babel@aux{czech}{}
\babel@aux{czech}{}
\@writefile{toc}{\contentsline {chapter}{\numberline {1}Úvod}{1}{chapter.1}\protected@file@percent }
\@writefile{lof}{\addvspace {10\p@ }}
\@writefile{lot}{\addvspace {10\p@ }}
\@writefile{toc}{\contentsline {section}{\numberline {1.1}Cíl}{1}{section.1.1}\protected@file@percent }
\@writefile{toc}{\contentsline {section}{\numberline {1.2}Motivace}{1}{section.1.2}\protected@file@percent }
\@writefile{toc}{\contentsline {section}{\numberline {1.3}Osnova}{2}{section.1.3}\protected@file@percent }
\abx@aux@cite{0}{bae_hs}
\abx@aux@segm{0}{0}{bae_hs}
\abx@aux@cite{0}{improved_road_grade}
\abx@aux@segm{0}{0}{improved_road_grade}
\@writefile{toc}{\contentsline {chapter}{\numberline {2}Související práce v oblasti odhadu sklonu vozovky}{3}{chapter.2}\protected@file@percent }
\@writefile{lof}{\addvspace {10\p@ }}
\@writefile{lot}{\addvspace {10\p@ }}
\newlabel{sec:related_work}{{2}{3}{Související práce v oblasti odhadu sklonu vozovky}{chapter.2}{}}
\@writefile{toc}{\contentsline {section}{\numberline {2.1}S GNSS}{3}{section.2.1}\protected@file@percent }
\@writefile{toc}{\contentsline {section}{\numberline {2.2}S barometrem a GNSS}{3}{section.2.2}\protected@file@percent }
\abx@aux@cite{0}{OHNISHI2000235}
\abx@aux@segm{0}{0}{OHNISHI2000235}
\abx@aux@cite{0}{OHNISHI2000235}
\abx@aux@segm{0}{0}{OHNISHI2000235}
\abx@aux@cite{0}{automotive}
\abx@aux@segm{0}{0}{automotive}
\abx@aux@cite{0}{johansson}
\abx@aux@segm{0}{0}{johansson}
\abx@aux@cite{0}{Gustafsson2000AdaptiveFA}
\abx@aux@segm{0}{0}{Gustafsson2000AdaptiveFA}
\abx@aux@cite{0}{geoportal}
\abx@aux@segm{0}{0}{geoportal}
\@writefile{toc}{\contentsline {section}{\numberline {2.3}S akcelerometrem a odhadem rychlosti z odometrie}{4}{section.2.3}\protected@file@percent }
\@writefile{lof}{\contentsline {figure}{\numberline {2.1}{\ignorespaces Komplementární filtr pro odhad sklonu vozovky\relax }}{4}{figure.2.1}\protected@file@percent }
\providecommand*\caption@xref[2]{\@setref\relax\@undefined{#1}}
\newlabel{fig:complementary_accel}{{2.1}{4}{Komplementární filtr pro odhad sklonu vozovky\relax }{figure.2.1}{}}
\@writefile{toc}{\contentsline {section}{\numberline {2.4}S GNSS a více měřením ze stejné trasy}{4}{section.2.4}\protected@file@percent }
\newlabel{sec:related_EKF}{{2.4}{4}{S GNSS a více měřením ze stejné trasy}{section.2.4}{}}
\@writefile{toc}{\contentsline {section}{\numberline {2.5}S výškovými údaji z map}{5}{section.2.5}\protected@file@percent }
\@writefile{lof}{\contentsline {figure}{\numberline {2.2}{\ignorespaces Příklad vizualizace výškových dat z mapy Prahy\relax }}{5}{figure.2.2}\protected@file@percent }
\newlabel{fig:height_prague}{{2.2}{5}{Příklad vizualizace výškových dat z mapy Prahy\relax }{figure.2.2}{}}
\@writefile{toc}{\contentsline {section}{\numberline {2.6}Shrnutí nejvýznamějších metod}{5}{section.2.6}\protected@file@percent }
\abx@aux@cite{0}{johansson}
\abx@aux@segm{0}{0}{johansson}
\abx@aux@cite{0}{automotive}
\abx@aux@segm{0}{0}{automotive}
\abx@aux@cite{0}{bae_hs}
\abx@aux@segm{0}{0}{bae_hs}
\abx@aux@cite{0}{improved_road_grade}
\abx@aux@segm{0}{0}{improved_road_grade}
\abx@aux@cite{0}{johansson}
\abx@aux@segm{0}{0}{johansson}
\abx@aux@cite{0}{SAHLHOLM200755}
\abx@aux@segm{0}{0}{SAHLHOLM200755}
\abx@aux@cite{0}{OHNISHI2000235}
\abx@aux@segm{0}{0}{OHNISHI2000235}
\abx@aux@cite{0}{OHNISHI2000235}
\abx@aux@segm{0}{0}{OHNISHI2000235}
\abx@aux@cite{0}{automotive}
\abx@aux@segm{0}{0}{automotive}
\abx@aux@cite{0}{automotive}
\abx@aux@segm{0}{0}{automotive}
\@writefile{lot}{\contentsline {table}{\numberline {2.1}{\ignorespaces Porovnání studovaných metod v tabulce\relax }}{6}{table.2.1}\protected@file@percent }
\newlabel{tab:porovnani_metod}{{2.1}{6}{Porovnání studovaných metod v tabulce\relax }{table.2.1}{}}
\abx@aux@cite{0}{improved_road_grade}
\abx@aux@segm{0}{0}{improved_road_grade}
\abx@aux@cite{0}{automotive}
\abx@aux@segm{0}{0}{automotive}
\abx@aux@cite{0}{johansson}
\abx@aux@segm{0}{0}{johansson}
\abx@aux@cite{0}{SAHLHOLM200755}
\abx@aux@segm{0}{0}{SAHLHOLM200755}
\abx@aux@cite{0}{methods_in_vehicle}
\abx@aux@segm{0}{0}{methods_in_vehicle}
\abx@aux@cite{0}{johansson}
\abx@aux@segm{0}{0}{johansson}
\@writefile{toc}{\contentsline {chapter}{\numberline {3}Model podélné dynamiky kolejového vozidla}{7}{chapter.3}\protected@file@percent }
\@writefile{lof}{\addvspace {10\p@ }}
\@writefile{lot}{\addvspace {10\p@ }}
\newlabel{sec:model}{{3}{7}{Model podélné dynamiky kolejového vozidla}{chapter.3}{}}
\@writefile{toc}{\contentsline {section}{\numberline {3.1}Matematický model kolejového vozidla}{7}{section.3.1}\protected@file@percent }
\@writefile{lof}{\contentsline {figure}{\numberline {3.1}{\ignorespaces Podélné síly působící na kolejové vozidlo\relax }}{7}{figure.3.1}\protected@file@percent }
\newlabel{fig:tram_forces}{{3.1}{7}{Podélné síly působící na kolejové vozidlo\relax }{figure.3.1}{}}
\newlabel{eq:model}{{3.1}{7}{Matematický model kolejového vozidla}{equation.3.1.1}{}}
\abx@aux@cite{0}{johansson}
\abx@aux@segm{0}{0}{johansson}
\abx@aux@cite{0}{hrych}
\abx@aux@segm{0}{0}{hrych}
\@writefile{toc}{\contentsline {section}{\numberline {3.2}Profily dráhy}{8}{section.3.2}\protected@file@percent }
\newlabel{sec:altitudes}{{3.2}{8}{Profily dráhy}{section.3.2}{}}
\newlabel{fig:vysky_kaspar}{{3.2a}{9}{Vyfiltrovaný výškový profil tramvaje číslo 7\relax }{subfigure.3.2.1}{}}
\newlabel{sub@fig:vysky_kaspar}{{a}{9}{Vyfiltrovaný výškový profil tramvaje číslo 7\relax }{subfigure.3.2.1}{}}
\newlabel{fig:vysky_hrych}{{3.2b}{9}{Vyfiltrovaný výškový profil tramvaje číslo 20\relax }{subfigure.3.2.2}{}}
\newlabel{sub@fig:vysky_hrych}{{b}{9}{Vyfiltrovaný výškový profil tramvaje číslo 20\relax }{subfigure.3.2.2}{}}
\newlabel{fig:uhly_kaspar}{{3.2c}{9}{Úhlový profil odpovídající výškovému profilu linky číslo 7\relax }{subfigure.3.2.3}{}}
\newlabel{sub@fig:uhly_kaspar}{{c}{9}{Úhlový profil odpovídající výškovému profilu linky číslo 7\relax }{subfigure.3.2.3}{}}
\newlabel{fig:uhly_hrych}{{3.2d}{9}{Úhlový profil odpovídající výškovému profilu linky číslo 20\relax }{subfigure.3.2.4}{}}
\newlabel{sub@fig:uhly_hrych}{{d}{9}{Úhlový profil odpovídající výškovému profilu linky číslo 20\relax }{subfigure.3.2.4}{}}
\@writefile{lof}{\contentsline {figure}{\numberline {3.2}{\ignorespaces Výškové a úhlové profily pro simulaci dat\relax }}{9}{figure.3.2}\protected@file@percent }
\newlabel{fig:profiles_of_trams}{{3.2}{9}{Výškové a úhlové profily pro simulaci dat\relax }{figure.3.2}{}}
\@writefile{toc}{\contentsline {section}{\numberline {3.3}Model v prostředí \textit  {Simulink}}{10}{section.3.3}\protected@file@percent }
\@writefile{lof}{\contentsline {figure}{\numberline {3.3}{\ignorespaces Výsledné simulinkové schéma pro podélný pohyb kolejového vozidla\relax }}{10}{figure.3.3}\protected@file@percent }
\newlabel{fig:simulink_scheme_finish}{{3.3}{10}{Výsledné simulinkové schéma pro podélný pohyb kolejového vozidla\relax }{figure.3.3}{}}
\@writefile{lof}{\contentsline {figure}{\numberline {3.4}{\ignorespaces Simulinkové schéma mechanického systému kolejového vozidla\relax }}{10}{figure.3.4}\protected@file@percent }
\newlabel{fig:simulink_scheme_mechanic}{{3.4}{10}{Simulinkové schéma mechanického systému kolejového vozidla\relax }{figure.3.4}{}}
\@writefile{toc}{\contentsline {section}{\numberline {3.4}Identifikace parametrů modelu}{10}{section.3.4}\protected@file@percent }
\@writefile{lof}{\contentsline {figure}{\numberline {3.5}{\ignorespaces Experiment prováděný v tramvajové lince 7\relax }}{11}{figure.3.5}\protected@file@percent }
\newlabel{fig:experiment}{{3.5}{11}{Experiment prováděný v tramvajové lince 7\relax }{figure.3.5}{}}
\@writefile{lot}{\contentsline {table}{\numberline {3.1}{\ignorespaces Naměřená data z elektrického vlaku 16EV\relax }}{11}{table.3.1}\protected@file@percent }
\newlabel{tab:data_16Ev}{{3.1}{11}{Naměřená data z elektrického vlaku 16EV\relax }{table.3.1}{}}
\@writefile{lot}{\contentsline {table}{\numberline {3.2}{\ignorespaces Parametry pro navržený model\relax }}{12}{table.3.2}\protected@file@percent }
\newlabel{tab:const_model}{{3.2}{12}{Parametry pro navržený model\relax }{table.3.2}{}}
\@writefile{toc}{\contentsline {section}{\numberline {3.5}Simulační ověření}{13}{section.3.5}\protected@file@percent }
\newlabel{fig:model_real_fm}{{3.6a}{13}{Porovnání nasimulované a reálné používané síle motoru\relax }{subfigure.3.6.1}{}}
\newlabel{sub@fig:model_real_fm}{{a}{13}{Porovnání nasimulované a reálné používané síle motoru\relax }{subfigure.3.6.1}{}}
\newlabel{fig:model_real_a}{{3.6b}{13}{Porovnání simulovaného a reálného zrychlení vozidla\relax }{subfigure.3.6.2}{}}
\newlabel{sub@fig:model_real_a}{{b}{13}{Porovnání simulovaného a reálného zrychlení vozidla\relax }{subfigure.3.6.2}{}}
\newlabel{fig:model_real_v}{{3.6c}{13}{Porovnání nasimulované a reálné rychlosti vozidla\relax }{subfigure.3.6.3}{}}
\newlabel{sub@fig:model_real_v}{{c}{13}{Porovnání nasimulované a reálné rychlosti vozidla\relax }{subfigure.3.6.3}{}}
\newlabel{fig:odpor}{{3.6d}{13}{Odporové síly působící na model kolejového vozidla\relax }{subfigure.3.6.4}{}}
\newlabel{sub@fig:odpor}{{d}{13}{Odporové síly působící na model kolejového vozidla\relax }{subfigure.3.6.4}{}}
\@writefile{lof}{\contentsline {figure}{\numberline {3.6}{\ignorespaces Porovnání simulovaného modelu a reálného vozidla\relax }}{13}{figure.3.6}\protected@file@percent }
\newlabel{fig:porovnani_model_16Ev}{{3.6}{13}{Porovnání simulovaného modelu a reálného vozidla\relax }{figure.3.6}{}}
\@writefile{toc}{\contentsline {section}{\numberline {3.6}Přidání nejistot měření}{14}{section.3.6}\protected@file@percent }
\newlabel{sec:noise}{{3.6}{14}{Přidání nejistot měření}{section.3.6}{}}
\newlabel{}{{3.7a}{14}{Příklad náhodné procházky\relax }{subfigure.3.7.1}{}}
\newlabel{sub@}{{a}{14}{Příklad náhodné procházky\relax }{subfigure.3.7.1}{}}
\newlabel{}{{3.7b}{14}{Vliv na rychlost modelu\relax }{subfigure.3.7.2}{}}
\newlabel{sub@}{{b}{14}{Vliv na rychlost modelu\relax }{subfigure.3.7.2}{}}
\@writefile{lof}{\contentsline {figure}{\numberline {3.7}{\ignorespaces Použitá náhodná procházka\relax }}{14}{figure.3.7}\protected@file@percent }
\newlabel{fig:random_walk}{{3.7}{14}{Použitá náhodná procházka\relax }{figure.3.7}{}}
\abx@aux@cite{0}{automotive}
\abx@aux@segm{0}{0}{automotive}
\@writefile{toc}{\contentsline {chapter}{\numberline {4}Použité metody na odhad sklonu}{15}{chapter.4}\protected@file@percent }
\@writefile{lof}{\addvspace {10\p@ }}
\@writefile{lot}{\addvspace {10\p@ }}
\newlabel{sec:metody}{{4}{15}{Použité metody na odhad sklonu}{chapter.4}{}}
\@writefile{toc}{\contentsline {section}{\numberline {4.1}Luenbergerův pozorovatel}{15}{section.4.1}\protected@file@percent }
\newlabel{sec:Luenberg}{{4.1}{15}{Luenbergerův pozorovatel}{section.4.1}{}}
\@writefile{toc}{\contentsline {subsection}{\numberline {4.1.1}Linearizace modelu}{15}{subsection.4.1.1}\protected@file@percent }
\@writefile{lof}{\contentsline {figure}{\numberline {4.1}{\ignorespaces Struktura Luenbergerova pozorovatele\relax }}{16}{figure.4.1}\protected@file@percent }
\newlabel{fig:Luenberger_scheme}{{4.1}{16}{Struktura Luenbergerova pozorovatele\relax }{figure.4.1}{}}
\newlabel{eq:Luenberger_model}{{4.1}{16}{Linearizace modelu}{equation.4.1.1}{}}
\newlabel{eq:SSmodel_liearized}{{4.4}{16}{Linearizace modelu}{equation.4.1.4}{}}
\@writefile{toc}{\contentsline {subsection}{\numberline {4.1.2}Návrh pozorovatele}{16}{subsection.4.1.2}\protected@file@percent }
\newlabel{eq:Luenberger_observer}{{4.6}{17}{Návrh pozorovatele}{equation.4.1.6}{}}
\abx@aux@cite{0}{johansson}
\abx@aux@segm{0}{0}{johansson}
\@writefile{toc}{\contentsline {subsection}{\numberline {4.1.3}Výsledky}{18}{subsection.4.1.3}\protected@file@percent }
\newlabel{}{{4.2a}{18}{Požadovaná referenční rychlost pro 1. profil\relax }{subfigure.4.2.1}{}}
\newlabel{sub@}{{a}{18}{Požadovaná referenční rychlost pro 1. profil\relax }{subfigure.4.2.1}{}}
\newlabel{}{{4.2b}{18}{Požadovaná referenční rychlost pro 2. profil\relax }{subfigure.4.2.2}{}}
\newlabel{sub@}{{b}{18}{Požadovaná referenční rychlost pro 2. profil\relax }{subfigure.4.2.2}{}}
\newlabel{}{{4.2c}{18}{Rychlost modelu s/bez nejistoty měření pro 1. profil\relax }{subfigure.4.2.3}{}}
\newlabel{sub@}{{c}{18}{Rychlost modelu s/bez nejistoty měření pro 1. profil\relax }{subfigure.4.2.3}{}}
\newlabel{}{{4.2d}{18}{Rychlost modelu s/bez nejistoty měření pro 2. profil\relax }{subfigure.4.2.4}{}}
\newlabel{sub@}{{d}{18}{Rychlost modelu s/bez nejistoty měření pro 2. profil\relax }{subfigure.4.2.4}{}}
\@writefile{lof}{\contentsline {figure}{\numberline {4.2}{\ignorespaces Požadovaná referenční rychlost simulující reálný provoz\relax }}{18}{figure.4.2}\protected@file@percent }
\newlabel{fig:v_ref}{{4.2}{18}{Požadovaná referenční rychlost simulující reálný provoz\relax }{figure.4.2}{}}
\abx@aux@cite{0}{Albrecht}
\abx@aux@segm{0}{0}{Albrecht}
\newlabel{fig:Luenberger_noinitial}{{4.3a}{19}{Odhad Luenbergerova pozorovatele 1. profil bez nejistoty měření rychlosti\relax }{subfigure.4.3.1}{}}
\newlabel{sub@fig:Luenberger_noinitial}{{a}{19}{Odhad Luenbergerova pozorovatele 1. profil bez nejistoty měření rychlosti\relax }{subfigure.4.3.1}{}}
\newlabel{fig:Luenberger_initial}{{4.3b}{19}{Odhad Luenbergerova pozorovatele 2. profil bez nejistoty měření rychlosti\relax }{subfigure.4.3.2}{}}
\newlabel{sub@fig:Luenberger_initial}{{b}{19}{Odhad Luenbergerova pozorovatele 2. profil bez nejistoty měření rychlosti\relax }{subfigure.4.3.2}{}}
\@writefile{lof}{\contentsline {figure}{\numberline {4.3}{\ignorespaces Luenbergerův pozorovatel: porovnání odhadu sklonu s reálným sklonem při měření bez šumu\relax }}{19}{figure.4.3}\protected@file@percent }
\newlabel{fig:Luenberger_estimates}{{4.3}{19}{Luenbergerův pozorovatel: porovnání odhadu sklonu s reálným sklonem při měření bez šumu\relax }{figure.4.3}{}}
\newlabel{fig:Luenberger_noise_alpha}{{4.4a}{19}{Odhad Luenbergerova pozorovatele 1. profil s nejistotou měření rychlosti\relax }{subfigure.4.4.1}{}}
\newlabel{sub@fig:Luenberger_noise_alpha}{{a}{19}{Odhad Luenbergerova pozorovatele 1. profil s nejistotou měření rychlosti\relax }{subfigure.4.4.1}{}}
\newlabel{fig:Luenberger_noise_velocity}{{4.4b}{19}{Odhad Luenbergerova pozorovatele 2. profil s nejistotou měření rychlosti\relax }{subfigure.4.4.2}{}}
\newlabel{sub@fig:Luenberger_noise_velocity}{{b}{19}{Odhad Luenbergerova pozorovatele 2. profil s nejistotou měření rychlosti\relax }{subfigure.4.4.2}{}}
\@writefile{lof}{\contentsline {figure}{\numberline {4.4}{\ignorespaces Luenbergerův pozorovatel: porovnání odhadu sklonu s reálným sklonem při měření se šumem\relax }}{19}{figure.4.4}\protected@file@percent }
\newlabel{fig:Luenberger_estimates_noise}{{4.4}{19}{Luenbergerův pozorovatel: porovnání odhadu sklonu s reálným sklonem při měření se šumem\relax }{figure.4.4}{}}
\@writefile{toc}{\contentsline {section}{\numberline {4.2}Diskrétní rozšířený (nelineární) Kalmanův filtr}{19}{section.4.2}\protected@file@percent }
\newlabel{sec:EKF}{{4.2}{19}{Diskrétní rozšířený (nelineární) Kalmanův filtr}{section.4.2}{}}
\@writefile{toc}{\contentsline {subsection}{\numberline {4.2.1}Změna nezávislé jednotky}{19}{subsection.4.2.1}\protected@file@percent }
\abx@aux@cite{0}{johansson}
\abx@aux@segm{0}{0}{johansson}
\abx@aux@cite{0}{Simon}
\abx@aux@segm{0}{0}{Simon}
\newlabel{eq:model_EKF}{{4.11}{20}{Změna nezávislé jednotky}{equation.4.2.11}{}}
\@writefile{toc}{\contentsline {subsection}{\numberline {4.2.2}Návrh EKF}{20}{subsection.4.2.2}\protected@file@percent }
\newlabel{eq:prediction_EKF}{{4.12}{20}{Návrh EKF}{equation.4.2.12}{}}
\newlabel{eq:correction_EKF}{{4.13}{20}{Návrh EKF}{equation.4.2.13}{}}
\@writefile{toc}{\contentsline {subsection}{\numberline {4.2.3}Výsledky}{21}{subsection.4.2.3}\protected@file@percent }
\newlabel{eq:Q_R_EKF}{{4.16}{21}{Výsledky}{equation.4.2.16}{}}
\newlabel{fig:EKF_h}{{4.5a}{21}{Odhad EKF 1. profil s nejistotou měření rychlosti a nadmořské výšky\relax }{subfigure.4.5.1}{}}
\newlabel{sub@fig:EKF_h}{{a}{21}{Odhad EKF 1. profil s nejistotou měření rychlosti a nadmořské výšky\relax }{subfigure.4.5.1}{}}
\newlabel{fig:EKF_a}{{4.5b}{21}{Odhad EKF 2. profil s nejistotou měření rychlosti a nadmořské výšky\relax }{subfigure.4.5.2}{}}
\newlabel{sub@fig:EKF_a}{{b}{21}{Odhad EKF 2. profil s nejistotou měření rychlosti a nadmořské výšky\relax }{subfigure.4.5.2}{}}
\@writefile{lof}{\contentsline {figure}{\numberline {4.5}{\ignorespaces Porovnání odhadu EKF s reálnou odezvou systému s vstupem se šumem\relax }}{21}{figure.4.5}\protected@file@percent }
\newlabel{fig:EKF}{{4.5}{21}{Porovnání odhadu EKF s reálnou odezvou systému s vstupem se šumem\relax }{figure.4.5}{}}
\@writefile{toc}{\contentsline {section}{\numberline {4.3}EKF s průměrováním více dat z jedné trasy}{22}{section.4.3}\protected@file@percent }
\newlabel{sec:EKF_average}{{4.3}{22}{EKF s průměrováním více dat z jedné trasy}{section.4.3}{}}
\@writefile{lof}{\contentsline {figure}{\numberline {4.6}{\ignorespaces Struktura EKF s průměrováním více dat z jedné trasy\relax }}{22}{figure.4.6}\protected@file@percent }
\newlabel{fig:EKF_average_scheme}{{4.6}{22}{Struktura EKF s průměrováním více dat z jedné trasy\relax }{figure.4.6}{}}
\@writefile{toc}{\contentsline {subsection}{\numberline {4.3.1}Implementace}{22}{subsection.4.3.1}\protected@file@percent }
\@writefile{toc}{\contentsline {subsection}{\numberline {4.3.2}Výsledky}{22}{subsection.4.3.2}\protected@file@percent }
\newlabel{fig:EKF_average_h}{{4.7a}{23}{Odhad EKF s průměrováním z 300 iterací prvního profilu s nejistotou měření rychlosti a nadmořské výšky\relax }{subfigure.4.7.1}{}}
\newlabel{sub@fig:EKF_average_h}{{a}{23}{Odhad EKF s průměrováním z 300 iterací prvního profilu s nejistotou měření rychlosti a nadmořské výšky\relax }{subfigure.4.7.1}{}}
\newlabel{fig:EKF_average_a}{{4.7b}{23}{Odhad EKF s průměrováním z 300 iterací druhého profilu s nejistotou měření rychlosti a nadmořské výšky\relax }{subfigure.4.7.2}{}}
\newlabel{sub@fig:EKF_average_a}{{b}{23}{Odhad EKF s průměrováním z 300 iterací druhého profilu s nejistotou měření rychlosti a nadmořské výšky\relax }{subfigure.4.7.2}{}}
\@writefile{lof}{\contentsline {figure}{\numberline {4.7}{\ignorespaces Porovnání odhadu EKF průměrování 1. a 2. profil\relax }}{23}{figure.4.7}\protected@file@percent }
\newlabel{fig:EKF_average}{{4.7}{23}{Porovnání odhadu EKF průměrování 1. a 2. profil\relax }{figure.4.7}{}}
\@writefile{lof}{\contentsline {figure}{\numberline {4.8}{\ignorespaces RMSE hodnoty závislé na počtu opakování EKF s průměrováním\relax }}{23}{figure.4.8}\protected@file@percent }
\newlabel{fig:EKF_average_RMSE}{{4.8}{23}{RMSE hodnoty závislé na počtu opakování EKF s průměrováním\relax }{figure.4.8}{}}
\@writefile{toc}{\contentsline {chapter}{\numberline {5}Závěr}{25}{chapter.5}\protected@file@percent }
\@writefile{lof}{\addvspace {10\p@ }}
\@writefile{lot}{\addvspace {10\p@ }}
\newlabel{sec:conclusion}{{5}{25}{Závěr}{chapter.5}{}}
\@writefile{toc}{\contentsline {section}{\numberline {5.1}Shrnutí}{25}{section.5.1}\protected@file@percent }
\abx@aux@cite{0}{johansson}
\abx@aux@segm{0}{0}{johansson}
\abx@aux@cite{0}{Gustafsson2000AdaptiveFA}
\abx@aux@segm{0}{0}{Gustafsson2000AdaptiveFA}
\abx@aux@cite{0}{improved_road_grade}
\abx@aux@segm{0}{0}{improved_road_grade}
\newlabel{}{{5.1a}{26}{Porovnání všech implementovaných metod na 1. profilu\relax }{subfigure.5.1.1}{}}
\newlabel{sub@}{{a}{26}{Porovnání všech implementovaných metod na 1. profilu\relax }{subfigure.5.1.1}{}}
\newlabel{}{{5.1b}{26}{Porovnání všech implementovaných metod na 2. profilu\relax }{subfigure.5.1.2}{}}
\newlabel{sub@}{{b}{26}{Porovnání všech implementovaných metod na 2. profilu\relax }{subfigure.5.1.2}{}}
\@writefile{lof}{\contentsline {figure}{\numberline {5.1}{\ignorespaces Porovnání všech implementovaných metod\relax }}{26}{figure.5.1}\protected@file@percent }
\newlabel{fig:all_methods}{{5.1}{26}{Porovnání všech implementovaných metod\relax }{figure.5.1}{}}
\@writefile{lot}{\contentsline {table}{\numberline {5.1}{\ignorespaces Porovnání dosažených RMSE hodnot pro implementované metody\relax }}{26}{table.5.1}\protected@file@percent }
\newlabel{tab:RMSE_conclusion}{{5.1}{26}{Porovnání dosažených RMSE hodnot pro implementované metody\relax }{table.5.1}{}}
\@writefile{toc}{\contentsline {section}{\numberline {5.2}Budoucí vývoj}{26}{section.5.2}\protected@file@percent }
\@writefile{toc}{\contentsline {chapter}{Bibliografie}{29}{chapter*.5}\protected@file@percent }
\abx@aux@read@bbl@mdfivesum{485821190398D3F567BC22789C4A7EC9}
\abx@aux@defaultrefcontext{0}{Loi_braking}{none/global//global/global}
\abx@aux@defaultrefcontext{0}{bae_hs}{none/global//global/global}
\abx@aux@defaultrefcontext{0}{improved_road_grade}{none/global//global/global}
\abx@aux@defaultrefcontext{0}{OHNISHI2000235}{none/global//global/global}
\abx@aux@defaultrefcontext{0}{automotive}{none/global//global/global}
\abx@aux@defaultrefcontext{0}{johansson}{none/global//global/global}
\abx@aux@defaultrefcontext{0}{Gustafsson2000AdaptiveFA}{none/global//global/global}
\abx@aux@defaultrefcontext{0}{geoportal}{none/global//global/global}
\abx@aux@defaultrefcontext{0}{SAHLHOLM200755}{none/global//global/global}
\abx@aux@defaultrefcontext{0}{methods_in_vehicle}{none/global//global/global}
\abx@aux@defaultrefcontext{0}{hrych}{none/global//global/global}
\abx@aux@defaultrefcontext{0}{Albrecht}{none/global//global/global}
\abx@aux@defaultrefcontext{0}{Simon}{none/global//global/global}
\gdef \@abspage@last{38}
