%!PS-Adobe-3.0 EPSF-3.0
%%Creator: (MATLAB, The Mathworks, Inc. Version 9.14.0.2206163 \(R2023a\). Operating System: Windows 10)
%%Title: C:/Users/radac/Desktop/Bachelor_thesis/thesis/Model/figs/uhlovy_profil_kaspar.eps
%%CreationDate: 2023-05-20T19:20:01
%%Pages: (atend)
%%BoundingBox:     0     0   420   315
%%LanguageLevel: 3
%%EndComments
%%BeginProlog
%%BeginResource: procset (Apache XML Graphics Std ProcSet) 1.2 0
%%Version: 1.2 0
%%Copyright: (Copyright 2001-2003,2010 The Apache Software Foundation. License terms: http://www.apache.org/licenses/LICENSE-2.0)
/bd{bind def}bind def
/ld{load def}bd
/GR/grestore ld
/GS/gsave ld
/RM/rmoveto ld
/C/curveto ld
/t/show ld
/L/lineto ld
/ML/setmiterlimit ld
/CT/concat ld
/f/fill ld
/N/newpath ld
/S/stroke ld
/CC/setcmykcolor ld
/A/ashow ld
/cp/closepath ld
/RC/setrgbcolor ld
/LJ/setlinejoin ld
/GC/setgray ld
/LW/setlinewidth ld
/M/moveto ld
/re {4 2 roll M
1 index 0 rlineto
0 exch rlineto
neg 0 rlineto
cp } bd
/_ctm matrix def
/_tm matrix def
/BT { _ctm currentmatrix pop matrix _tm copy pop 0 0 moveto } bd
/ET { _ctm setmatrix } bd
/iTm { _ctm setmatrix _tm concat } bd
/Tm { _tm astore pop iTm 0 0 moveto } bd
/ux 0.0 def
/uy 0.0 def
/F {
  /Tp exch def
  /Tf exch def
  Tf findfont Tp scalefont setfont
  /cf Tf def  /cs Tp def
} bd
/ULS {currentpoint /uy exch def /ux exch def} bd
/ULE {
  /Tcx currentpoint pop def
  gsave
  newpath
  cf findfont cs scalefont dup
  /FontMatrix get 0 get /Ts exch def /FontInfo get dup
  /UnderlinePosition get Ts mul /To exch def
  /UnderlineThickness get Ts mul /Tt exch def
  ux uy To add moveto  Tcx uy To add lineto
  Tt setlinewidth stroke
  grestore
} bd
/OLE {
  /Tcx currentpoint pop def
  gsave
  newpath
  cf findfont cs scalefont dup
  /FontMatrix get 0 get /Ts exch def /FontInfo get dup
  /UnderlinePosition get Ts mul /To exch def
  /UnderlineThickness get Ts mul /Tt exch def
  ux uy To add cs add moveto Tcx uy To add cs add lineto
  Tt setlinewidth stroke
  grestore
} bd
/SOE {
  /Tcx currentpoint pop def
  gsave
  newpath
  cf findfont cs scalefont dup
  /FontMatrix get 0 get /Ts exch def /FontInfo get dup
  /UnderlinePosition get Ts mul /To exch def
  /UnderlineThickness get Ts mul /Tt exch def
  ux uy To add cs 10 mul 26 idiv add moveto Tcx uy To add cs 10 mul 26 idiv add lineto
  Tt setlinewidth stroke
  grestore
} bd
/QT {
/Y22 exch store
/X22 exch store
/Y21 exch store
/X21 exch store
currentpoint
/Y21 load 2 mul add 3 div exch
/X21 load 2 mul add 3 div exch
/X21 load 2 mul /X22 load add 3 div
/Y21 load 2 mul /Y22 load add 3 div
/X22 load /Y22 load curveto
} bd
/SSPD {
dup length /d exch dict def
{
/v exch def
/k exch def
currentpagedevice k known {
/cpdv currentpagedevice k get def
v cpdv ne {
/upd false def
/nullv v type /nulltype eq def
/nullcpdv cpdv type /nulltype eq def
nullv nullcpdv or
{
/upd true def
} {
/sametype v type cpdv type eq def
sametype {
v type /arraytype eq {
/vlen v length def
/cpdvlen cpdv length def
vlen cpdvlen eq {
0 1 vlen 1 sub {
/i exch def
/obj v i get def
/cpdobj cpdv i get def
obj cpdobj ne {
/upd true def
exit
} if
} for
} {
/upd true def
} ifelse
} {
v type /dicttype eq {
v {
/dv exch def
/dk exch def
/cpddv cpdv dk get def
dv cpddv ne {
/upd true def
exit
} if
} forall
} {
/upd true def
} ifelse
} ifelse
} if
} ifelse
upd true eq {
d k v put
} if
} if
} if
} forall
d length 0 gt {
d setpagedevice
} if
} bd
/RE { % /NewFontName [NewEncodingArray] /FontName RE -
  findfont dup length dict begin
  {
    1 index /FID ne
    {def} {pop pop} ifelse
  } forall
  /Encoding exch def
  /FontName 1 index def
  currentdict definefont pop
  end
} bind def
%%EndResource
%%BeginResource: procset (Apache XML Graphics EPS ProcSet) 1.0 0
%%Version: 1.0 0
%%Copyright: (Copyright 2002-2003 The Apache Software Foundation. License terms: http://www.apache.org/licenses/LICENSE-2.0)
/BeginEPSF { %def
/b4_Inc_state save def         % Save state for cleanup
/dict_count countdictstack def % Count objects on dict stack
/op_count count 1 sub def      % Count objects on operand stack
userdict begin                 % Push userdict on dict stack
/showpage { } def              % Redefine showpage, { } = null proc
0 setgray 0 setlinecap         % Prepare graphics state
1 setlinewidth 0 setlinejoin
10 setmiterlimit [ ] 0 setdash newpath
/languagelevel where           % If level not equal to 1 then
{pop languagelevel             % set strokeadjust and
1 ne                           % overprint to their defaults.
{false setstrokeadjust false setoverprint
} if
} if
} bd
/EndEPSF { %def
count op_count sub {pop} repeat            % Clean up stacks
countdictstack dict_count sub {end} repeat
b4_Inc_state restore
} bd
%%EndResource
%FOPBeginFontDict
%%IncludeResource: font Courier-Oblique
%%IncludeResource: font Courier-BoldOblique
%%IncludeResource: font Courier-Bold
%%IncludeResource: font ZapfDingbats
%%IncludeResource: font Symbol
%%IncludeResource: font Helvetica
%%IncludeResource: font Helvetica-Oblique
%%IncludeResource: font Helvetica-Bold
%%IncludeResource: font Helvetica-BoldOblique
%%IncludeResource: font Times-Roman
%%IncludeResource: font Times-Italic
%%IncludeResource: font Times-Bold
%%IncludeResource: font Times-BoldItalic
%%IncludeResource: font Courier
%FOPEndFontDict
%%BeginResource: encoding WinAnsiEncoding
/WinAnsiEncoding [
/.notdef /.notdef /.notdef /.notdef /.notdef
/.notdef /.notdef /.notdef /.notdef /.notdef
/.notdef /.notdef /.notdef /.notdef /.notdef
/.notdef /.notdef /.notdef /.notdef /.notdef
/.notdef /.notdef /.notdef /.notdef /.notdef
/.notdef /.notdef /.notdef /.notdef /.notdef
/.notdef /.notdef /space /exclam /quotedbl
/numbersign /dollar /percent /ampersand /quotesingle
/parenleft /parenright /asterisk /plus /comma
/hyphen /period /slash /zero /one
/two /three /four /five /six
/seven /eight /nine /colon /semicolon
/less /equal /greater /question /at
/A /B /C /D /E
/F /G /H /I /J
/K /L /M /N /O
/P /Q /R /S /T
/U /V /W /X /Y
/Z /bracketleft /backslash /bracketright /asciicircum
/underscore /quoteleft /a /b /c
/d /e /f /g /h
/i /j /k /l /m
/n /o /p /q /r
/s /t /u /v /w
/x /y /z /braceleft /bar
/braceright /asciitilde /bullet /Euro /bullet
/quotesinglbase /florin /quotedblbase /ellipsis /dagger
/daggerdbl /circumflex /perthousand /Scaron /guilsinglleft
/OE /bullet /Zcaron /bullet /bullet
/quoteleft /quoteright /quotedblleft /quotedblright /bullet
/endash /emdash /asciitilde /trademark /scaron
/guilsinglright /oe /bullet /zcaron /Ydieresis
/space /exclamdown /cent /sterling /currency
/yen /brokenbar /section /dieresis /copyright
/ordfeminine /guillemotleft /logicalnot /sfthyphen /registered
/macron /degree /plusminus /twosuperior /threesuperior
/acute /mu /paragraph /middot /cedilla
/onesuperior /ordmasculine /guillemotright /onequarter /onehalf
/threequarters /questiondown /Agrave /Aacute /Acircumflex
/Atilde /Adieresis /Aring /AE /Ccedilla
/Egrave /Eacute /Ecircumflex /Edieresis /Igrave
/Iacute /Icircumflex /Idieresis /Eth /Ntilde
/Ograve /Oacute /Ocircumflex /Otilde /Odieresis
/multiply /Oslash /Ugrave /Uacute /Ucircumflex
/Udieresis /Yacute /Thorn /germandbls /agrave
/aacute /acircumflex /atilde /adieresis /aring
/ae /ccedilla /egrave /eacute /ecircumflex
/edieresis /igrave /iacute /icircumflex /idieresis
/eth /ntilde /ograve /oacute /ocircumflex
/otilde /odieresis /divide /oslash /ugrave
/uacute /ucircumflex /udieresis /yacute /thorn
/ydieresis
] def
%%EndResource
%FOPBeginFontReencode
/Courier-Oblique findfont
dup length dict begin
  {1 index /FID ne {def} {pop pop} ifelse} forall
  /Encoding WinAnsiEncoding def
  currentdict
end
/Courier-Oblique exch definefont pop
/Courier-BoldOblique findfont
dup length dict begin
  {1 index /FID ne {def} {pop pop} ifelse} forall
  /Encoding WinAnsiEncoding def
  currentdict
end
/Courier-BoldOblique exch definefont pop
/Courier-Bold findfont
dup length dict begin
  {1 index /FID ne {def} {pop pop} ifelse} forall
  /Encoding WinAnsiEncoding def
  currentdict
end
/Courier-Bold exch definefont pop
/Helvetica findfont
dup length dict begin
  {1 index /FID ne {def} {pop pop} ifelse} forall
  /Encoding WinAnsiEncoding def
  currentdict
end
/Helvetica exch definefont pop
/Helvetica-Oblique findfont
dup length dict begin
  {1 index /FID ne {def} {pop pop} ifelse} forall
  /Encoding WinAnsiEncoding def
  currentdict
end
/Helvetica-Oblique exch definefont pop
/Helvetica-Bold findfont
dup length dict begin
  {1 index /FID ne {def} {pop pop} ifelse} forall
  /Encoding WinAnsiEncoding def
  currentdict
end
/Helvetica-Bold exch definefont pop
/Helvetica-BoldOblique findfont
dup length dict begin
  {1 index /FID ne {def} {pop pop} ifelse} forall
  /Encoding WinAnsiEncoding def
  currentdict
end
/Helvetica-BoldOblique exch definefont pop
/Times-Roman findfont
dup length dict begin
  {1 index /FID ne {def} {pop pop} ifelse} forall
  /Encoding WinAnsiEncoding def
  currentdict
end
/Times-Roman exch definefont pop
/Times-Italic findfont
dup length dict begin
  {1 index /FID ne {def} {pop pop} ifelse} forall
  /Encoding WinAnsiEncoding def
  currentdict
end
/Times-Italic exch definefont pop
/Times-Bold findfont
dup length dict begin
  {1 index /FID ne {def} {pop pop} ifelse} forall
  /Encoding WinAnsiEncoding def
  currentdict
end
/Times-Bold exch definefont pop
/Times-BoldItalic findfont
dup length dict begin
  {1 index /FID ne {def} {pop pop} ifelse} forall
  /Encoding WinAnsiEncoding def
  currentdict
end
/Times-BoldItalic exch definefont pop
/Courier findfont
dup length dict begin
  {1 index /FID ne {def} {pop pop} ifelse} forall
  /Encoding WinAnsiEncoding def
  currentdict
end
/Courier exch definefont pop
%FOPEndFontReencode
%%EndProlog
%%Page: 1 1
%%PageBoundingBox: 0 0 420 315
%%BeginPageSetup
[1 0 0 -1 0 315] CT
%%EndPageSetup
GS
[0.6 0 0 0.6 0 0] CT
1 GC
N
0 0 700 525 re
f
GR
GS
[0.6 0 0 0.6 0 0] CT
1 GC
N
0 0 700 525 re
f
GR
GS
[0.6 0 0 0.6 0 0] CT
1 GC
N
91 454 M
634 454 L
634 39 L
91 39 L
cp
f
GR
GS
[0.6 0 0 0.6 0 0] CT
0.873 GC
1 LJ
0.833 LW
N
91 454 M
91 39 L
S
GR
GS
[0.6 0 0 0.6 0 0] CT
0.873 GC
1 LJ
0.833 LW
N
199.6 454 M
199.6 39 L
S
GR
GS
[0.6 0 0 0.6 0 0] CT
0.873 GC
1 LJ
0.833 LW
N
308.2 454 M
308.2 39 L
S
GR
GS
[0.6 0 0 0.6 0 0] CT
0.873 GC
1 LJ
0.833 LW
N
416.8 454 M
416.8 39 L
S
GR
GS
[0.6 0 0 0.6 0 0] CT
0.873 GC
1 LJ
0.833 LW
N
525.4 454 M
525.4 39 L
S
GR
GS
[0.6 0 0 0.6 0 0] CT
0.873 GC
1 LJ
0.833 LW
N
634 454 M
634 39 L
S
GR
GS
[0.6 0 0 0.6 0 0] CT
0.873 GC
1 LJ
0.833 LW
N
634 454 M
91 454 L
S
GR
GS
[0.6 0 0 0.6 0 0] CT
0.873 GC
1 LJ
0.833 LW
N
634 371 M
91 371 L
S
GR
GS
[0.6 0 0 0.6 0 0] CT
0.873 GC
1 LJ
0.833 LW
N
634 288 M
91 288 L
S
GR
GS
[0.6 0 0 0.6 0 0] CT
0.873 GC
1 LJ
0.833 LW
N
634 205 M
91 205 L
S
GR
GS
[0.6 0 0 0.6 0 0] CT
0.873 GC
1 LJ
0.833 LW
N
634 122 M
91 122 L
S
GR
GS
[0.6 0 0 0.6 0 0] CT
0.873 GC
1 LJ
0.833 LW
N
634 39 M
91 39 L
S
GR
GS
[0.6 0 0 0.6 0 0] CT
0.149 GC
2 setlinecap
1 LJ
0.833 LW
N
91 454 M
634 454 L
S
GR
GS
[0.6 0 0 0.6 0 0] CT
0.149 GC
2 setlinecap
1 LJ
0.833 LW
N
91 39 M
634 39 L
S
GR
GS
[0.6 0 0 0.6 0 0] CT
0.149 GC
2 setlinecap
1 LJ
0.833 LW
N
91 454 M
91 448.57 L
S
GR
GS
[0.6 0 0 0.6 0 0] CT
0.149 GC
2 setlinecap
1 LJ
0.833 LW
N
199.6 454 M
199.6 448.57 L
S
GR
GS
[0.6 0 0 0.6 0 0] CT
0.149 GC
2 setlinecap
1 LJ
0.833 LW
N
308.2 454 M
308.2 448.57 L
S
GR
GS
[0.6 0 0 0.6 0 0] CT
0.149 GC
2 setlinecap
1 LJ
0.833 LW
N
416.8 454 M
416.8 448.57 L
S
GR
GS
[0.6 0 0 0.6 0 0] CT
0.149 GC
2 setlinecap
1 LJ
0.833 LW
N
525.4 454 M
525.4 448.57 L
S
GR
GS
[0.6 0 0 0.6 0 0] CT
0.149 GC
2 setlinecap
1 LJ
0.833 LW
N
634 454 M
634 448.57 L
S
GR
GS
[0.6 0 0 0.6 0 0] CT
0.149 GC
2 setlinecap
1 LJ
0.833 LW
N
91 39 M
91 44.43 L
S
GR
GS
[0.6 0 0 0.6 0 0] CT
0.149 GC
2 setlinecap
1 LJ
0.833 LW
N
199.6 39 M
199.6 44.43 L
S
GR
GS
[0.6 0 0 0.6 0 0] CT
0.149 GC
2 setlinecap
1 LJ
0.833 LW
N
308.2 39 M
308.2 44.43 L
S
GR
GS
[0.6 0 0 0.6 0 0] CT
0.149 GC
2 setlinecap
1 LJ
0.833 LW
N
416.8 39 M
416.8 44.43 L
S
GR
GS
[0.6 0 0 0.6 0 0] CT
0.149 GC
2 setlinecap
1 LJ
0.833 LW
N
525.4 39 M
525.4 44.43 L
S
GR
GS
[0.6 0 0 0.6 0 0] CT
0.149 GC
2 setlinecap
1 LJ
0.833 LW
N
634 39 M
634 44.43 L
S
GR
GS
[0.6 0 0 0.6 54.6 277.2] CT
0.149 GC
/Helvetica 23.333 F
GS
[1 0 0 1 0 0] CT
-6.5 24 moveto 
1 -1 scale
(0) t 
GR
GR
GS
[0.6 0 0 0.6 119.76 277.2] CT
0.149 GC
/Helvetica 23.333 F
GS
[1 0 0 1 0 0] CT
-26 24 moveto 
1 -1 scale
(1000) t 
GR
GR
GS
[0.6 0 0 0.6 184.92001 277.2] CT
0.149 GC
/Helvetica 23.333 F
GS
[1 0 0 1 0 0] CT
-26 24 moveto 
1 -1 scale
(2000) t 
GR
GR
GS
[0.6 0 0 0.6 250.07999 277.2] CT
0.149 GC
/Helvetica 23.333 F
GS
[1 0 0 1 0 0] CT
-26 24 moveto 
1 -1 scale
(3000) t 
GR
GR
GS
[0.6 0 0 0.6 315.24001 277.2] CT
0.149 GC
/Helvetica 23.333 F
GS
[1 0 0 1 0 0] CT
-26 24 moveto 
1 -1 scale
(4000) t 
GR
GR
GS
[0.6 0 0 0.6 380.4 277.2] CT
0.149 GC
/Helvetica 23.333 F
GS
[1 0 0 1 0 0] CT
-26 24 moveto 
1 -1 scale
(5000) t 
GR
GR
GS
[0.6 0 0 0.6 217.50016 295.59999] CT
0.149 GC
/Helvetica 25.667 F
GS
[1 0 0 1 0 0] CT
-28 26 moveto 
1 -1 scale
(s [m]) t 
GR
GR
GS
[0.6 0 0 0.6 0 0] CT
0.149 GC
2 setlinecap
1 LJ
0.833 LW
N
91 454 M
91 39 L
S
GR
GS
[0.6 0 0 0.6 0 0] CT
0.149 GC
2 setlinecap
1 LJ
0.833 LW
N
634 454 M
634 39 L
S
GR
GS
[0.6 0 0 0.6 0 0] CT
0.149 GC
2 setlinecap
1 LJ
0.833 LW
N
91 454 M
96.43 454 L
S
GR
GS
[0.6 0 0 0.6 0 0] CT
0.149 GC
2 setlinecap
1 LJ
0.833 LW
N
91 371 M
96.43 371 L
S
GR
GS
[0.6 0 0 0.6 0 0] CT
0.149 GC
2 setlinecap
1 LJ
0.833 LW
N
91 288 M
96.43 288 L
S
GR
GS
[0.6 0 0 0.6 0 0] CT
0.149 GC
2 setlinecap
1 LJ
0.833 LW
N
91 205 M
96.43 205 L
S
GR
GS
[0.6 0 0 0.6 0 0] CT
0.149 GC
2 setlinecap
1 LJ
0.833 LW
N
91 122 M
96.43 122 L
S
GR
GS
[0.6 0 0 0.6 0 0] CT
0.149 GC
2 setlinecap
1 LJ
0.833 LW
N
91 39 M
96.43 39 L
S
GR
GS
[0.6 0 0 0.6 0 0] CT
0.149 GC
2 setlinecap
1 LJ
0.833 LW
N
634 454 M
628.57 454 L
S
GR
GS
[0.6 0 0 0.6 0 0] CT
0.149 GC
2 setlinecap
1 LJ
0.833 LW
N
634 371 M
628.57 371 L
S
GR
GS
[0.6 0 0 0.6 0 0] CT
0.149 GC
2 setlinecap
1 LJ
0.833 LW
N
634 288 M
628.57 288 L
S
GR
GS
[0.6 0 0 0.6 0 0] CT
0.149 GC
2 setlinecap
1 LJ
0.833 LW
N
634 205 M
628.57 205 L
S
GR
GS
[0.6 0 0 0.6 0 0] CT
0.149 GC
2 setlinecap
1 LJ
0.833 LW
N
634 122 M
628.57 122 L
S
GR
GS
[0.6 0 0 0.6 0 0] CT
0.149 GC
2 setlinecap
1 LJ
0.833 LW
N
634 39 M
628.57 39 L
S
GR
GS
[0.6 0 0 0.6 49.8 272.4] CT
0.149 GC
/Helvetica 23.333 F
GS
[1 0 0 1 0 0] CT
-21 9 moveto 
1 -1 scale
(-4) t 
GR
GR
GS
[0.6 0 0 0.6 49.8 222.6] CT
0.149 GC
/Helvetica 23.333 F
GS
[1 0 0 1 0 0] CT
-21 9 moveto 
1 -1 scale
(-2) t 
GR
GR
GS
[0.6 0 0 0.6 49.8 172.8] CT
0.149 GC
/Helvetica 23.333 F
GS
[1 0 0 1 0 0] CT
-13 9 moveto 
1 -1 scale
(0) t 
GR
GR
GS
[0.6 0 0 0.6 49.8 123] CT
0.149 GC
/Helvetica 23.333 F
GS
[1 0 0 1 0 0] CT
-13 9 moveto 
1 -1 scale
(2) t 
GR
GR
GS
[0.6 0 0 0.6 49.8 73.2] CT
0.149 GC
/Helvetica 23.333 F
GS
[1 0 0 1 0 0] CT
-13 9 moveto 
1 -1 scale
(4) t 
GR
GR
GS
[0.6 0 0 0.6 49.8 23.4] CT
0.149 GC
/Helvetica 23.333 F
GS
[1 0 0 1 0 0] CT
-13 9 moveto 
1 -1 scale
(6) t 
GR
GR
GS
[0 -0.6 0.6 0 34.2 147.89988] CT
0.149 GC
/Helvetica 25.667 F
GS
[1 0 0 1 0 0] CT
-46 -6 moveto 
1 -1 scale
(sklon [\260]) t 
GR
GR
GS
[0.6 0 0 0.6 0 0] CT
0 0 1 RC
1 LJ
3.333 LW
N
91 288 M
91.13 310.858 L
91.261 310.791 L
91.391 310.657 L
91.522 310.523 L
91.652 310.455 L
91.782 310.252 L
91.913 310.182 L
92.043 310.043 L
92.174 309.899 L
92.304 309.827 L
92.434 309.612 L
92.565 309.541 L
92.695 309.402 L
92.826 309.263 L
92.956 309.195 L
93.086 308.996 L
93.217 308.927 L
93.347 308.796 L
93.478 308.651 L
93.608 308.58 L
93.738 308.36 L
93.869 308.282 L
93.999 308.134 L
94.13 307.974 L
94.26 307.894 L
94.39 307.542 L
94.521 307.365 L
94.651 307.036 L
94.782 306.69 L
94.912 306.522 L
95.042 306.083 L
95.173 305.909 L
95.303 305.589 L
95.434 305.37 L
95.564 305.266 L
95.694 305.135 L
95.825 305.113 L
95.955 305.074 L
96.086 305.039 L
96.216 305.023 L
96.346 304.979 L
96.477 304.968 L
96.607 304.949 L
96.738 304.949 L
96.868 304.949 L
96.998 304.971 L
97.129 304.989 L
97.259 305.019 L
97.39 305.068 L
97.52 305.093 L
97.65 305.183 L
97.781 305.243 L
97.911 305.348 L
98.042 305.464 L
98.172 305.519 L
98.302 305.671 L
98.433 305.727 L
98.563 305.823 L
98.693 305.906 L
98.824 305.945 L
98.954 306.029 L
99.085 306.075 L
99.215 306.153 L
99.345 306.272 L
99.476 306.327 L
99.606 306.455 L
99.737 306.322 L
99.867 306.098 L
99.997 305.803 L
100.128 305.663 L
100.258 305.265 L
100.389 305.108 L
100.519 304.847 L
100.649 304.55 L
100.78 304.41 L
100.91 304.011 L
101.041 303.853 L
101.171 303.595 L
101.301 303.301 L
101.432 303.164 L
101.562 302.78 L
101.693 302.629 L
101.823 302.386 L
101.953 302.109 L
102.084 302.004 L
102.214 302.094 L
102.345 302.131 L
102.475 302.19 L
102.605 302.259 L
102.736 302.291 L
102.866 302.385 L
102.997 302.421 L
103.127 302.478 L
103.257 302.54 L
103.388 302.568 L
103.518 302.644 L
103.649 302.675 L
103.779 302.724 L
103.909 302.779 L
104.04 302.805 L
104.17 302.883 L
104.301 302.918 L
104.431 302.972 L
104.561 303.038 L
104.692 303.068 L
104.822 303.149 L
104.953 303.184 L
105.083 303.237 L
105.213 303.303 L
105.344 303.333 L
105.474 303.421 L
105.605 303.461 L
105.735 303.521 L
105.865 303.594 L
105.996 303.628 L
106.126 303.717 L
106.257 303.754 L
106.387 303.809 L
106.517 303.874 L
106.648 303.904 L
106.778 303.985 L
106.909 304.019 L
107.039 304.07 L
107.169 304.132 L
107.3 304.16 L
107.43 304.237 L
107.561 304.272 L
107.691 304.321 L
107.821 304.383 L
107.952 304.411 L
108.082 304.487 L
108.213 304.52 L
108.343 304.568 L
108.473 304.628 L
108.604 304.655 L
108.734 304.729 L
108.865 304.763 L
108.995 304.811 L
109.125 304.873 L
109.256 304.9 L
109.386 304.974 L
109.517 305.007 L
109.647 305.052 L
109.777 305.11 L
109.908 305.136 L
110.038 305.203 L
110.169 305.234 L
110.299 305.275 L
110.429 305.331 L
110.56 305.356 L
110.69 305.425 L
110.821 305.458 L
110.951 305.502 L
111.081 305.561 L
111.212 305.587 L
111.342 305.654 L
111.473 305.684 L
111.603 305.726 L
111.733 305.776 L
111.864 305.797 L
111.994 305.854 L
112.125 305.519 L
112.255 305.075 L
112.385 304.488 L
112.516 304.232 L
112.646 303.544 L
112.777 303.216 L
112.907 302.786 L
113.037 302.206 L
113.168 301.954 L
113.298 301.278 L
113.428 300.95 L
113.559 300.526 L
113.689 299.949 L
113.82 299.699 L
113.95 299.029 L
114.08 298.701 L
114.211 298.283 L
114.341 297.709 L
114.472 297.461 L
114.602 296.802 L
114.732 296.432 L
114.863 295.965 L
114.993 295.397 L
115.124 297.338 L
115.254 314.187 L
115.384 314.246 L
115.515 314.32 L
115.645 314.426 L
115.776 314.463 L
115.906 314.519 L
116.036 314.526 L
116.167 314.535 L
116.297 314.535 L
116.428 314.567 L
116.558 314.808 L
116.688 314.94 L
116.819 315.1 L
116.949 315.322 L
117.08 315.415 L
117.21 315.654 L
117.34 315.771 L
117.471 315.911 L
117.601 316.104 L
117.732 316.184 L
117.862 316.39 L
117.992 316.493 L
118.123 316.614 L
118.253 316.789 L
118.384 316.863 L
118.514 317.056 L
118.644 317.157 L
118.775 317.276 L
118.905 317.174 L
119.036 317.131 L
119.166 317.017 L
119.296 316.955 L
119.427 316.884 L
119.557 316.779 L
119.688 316.735 L
119.818 316.623 L
119.948 316.566 L
120.079 316.502 L
120.209 316.409 L
120.34 316.37 L
120.47 316.267 L
120.6 316.212 L
120.731 316.15 L
120.861 316.055 L
120.992 316.024 L
121.122 315.976 L
121.252 315.976 L
121.383 315.976 L
121.513 315.975 L
121.644 315.926 L
121.774 315.631 L
121.904 315.419 L
122.035 315.186 L
122.165 314.869 L
122.296 314.793 L
122.426 314.785 L
122.556 314.78 L
122.687 314.774 L
122.817 314.765 L
122.948 314.761 L
123.078 314.752 L
123.208 314.748 L
123.339 314.744 L
123.469 314.736 L
123.6 314.732 L
123.73 314.717 L
123.86 314.704 L
123.991 314.69 L
124.121 314.653 L
124.252 314.636 L
124.382 314.587 L
124.512 314.553 L
124.643 314.517 L
124.773 313.957 L
124.904 313.726 L
125.034 313.135 L
125.164 312.785 L
125.295 312.421 L
125.425 311.824 L
125.556 311.675 L
125.686 311.563 L
125.816 311.455 L
125.947 311.343 L
126.077 311.071 L
126.208 310.957 L
126.338 310.662 L
126.468 310.497 L
126.599 310.33 L
126.729 310.018 L
126.86 309.909 L
126.99 309.681 L
127.12 309.601 L
127.251 309.521 L
127.381 309.424 L
127.512 309.385 L
127.642 309.29 L
127.772 309.23 L
127.903 309.171 L
128.033 309.072 L
128.163 309.034 L
128.294 308.942 L
128.424 308.883 L
128.555 308.825 L
128.685 308.718 L
128.815 308.706 L
128.946 308.743 L
129.076 308.773 L
129.207 308.801 L
129.337 308.886 L
129.467 309.034 L
129.598 309.647 L
129.728 310.026 L
129.859 310.388 L
129.989 311.011 L
130.119 311.252 L
130.25 311.832 L
130.38 312.191 L
130.511 312.53 L
130.641 313.122 L
130.771 313.36 L
130.902 313.954 L
131.032 314.318 L
131.163 314.658 L
131.293 315.219 L
131.423 315.454 L
131.554 316.056 L
131.684 316.469 L
131.815 316.85 L
131.945 316.809 L
132.075 316.792 L
132.206 316.748 L
132.336 316.287 L
132.467 315.867 L
132.597 315.142 L
132.727 315.025 L
132.858 315.038 L
132.988 315.053 L
133.119 315.066 L
133.249 315.097 L
133.379 315.11 L
133.51 315.143 L
133.64 315.169 L
133.771 315.192 L
133.901 315.247 L
134.031 315.27 L
134.162 315.327 L
134.292 315.369 L
134.423 315.406 L
134.553 315.474 L
134.683 315.503 L
134.814 315.578 L
134.944 315.207 L
135.075 314.886 L
135.205 314.287 L
135.335 314.057 L
135.466 313.512 L
135.596 313.148 L
135.727 312.836 L
135.857 312.254 L
135.987 312.032 L
136.118 311.509 L
136.248 311.151 L
136.379 310.847 L
136.509 310.951 L
136.639 310.991 L
136.77 311.088 L
136.9 311.158 L
137.031 311.216 L
137.161 311.349 L
137.291 311.401 L
137.422 311.525 L
137.552 311.614 L
137.683 311.689 L
137.813 311.781 L
137.943 311.806 L
138.074 311.85 L
138.204 311.883 L
138.335 311.909 L
138.465 312.266 L
138.595 312.425 L
138.726 312.824 L
138.856 313.081 L
138.987 313.289 L
139.117 313.367 L
139.247 313.398 L
139.378 313.471 L
139.508 313.526 L
139.639 313.571 L
139.769 313.666 L
139.899 313.703 L
140.03 313.793 L
140.16 313.867 L
140.291 313.925 L
140.421 314.055 L
140.551 314.106 L
140.682 314.225 L
140.812 314.314 L
140.943 314.383 L
141.073 314.525 L
141.203 314.578 L
141.334 314.699 L
141.464 315.125 L
141.595 315.452 L
141.725 316.139 L
141.855 316.396 L
141.986 316.988 L
142.116 316.794 L
142.247 316.648 L
142.377 315.783 L
142.507 315.483 L
142.638 314.819 L
142.768 314.39 L
142.898 314.068 L
143.029 314.413 L
143.159 314.536 L
143.29 314.813 L
143.42 315.046 L
143.55 315.219 L
143.681 315.493 L
143.811 315.565 L
143.942 315.704 L
144.072 315.774 L
144.202 315.825 L
144.333 315.912 L
144.463 315.944 L
144.594 316.016 L
144.724 315.274 L
144.854 314.738 L
144.985 313.554 L
145.115 313.122 L
145.246 312.151 L
145.376 311.396 L
145.506 310.857 L
145.637 311.491 L
145.767 311.718 L
145.898 312.221 L
146.028 312.587 L
146.158 312.845 L
146.289 312.82 L
146.419 312.81 L
146.55 312.786 L
146.68 312.763 L
146.81 312.746 L
146.941 312.717 L
147.071 312.711 L
147.202 312.702 L
147.332 312.683 L
147.462 312.669 L
147.593 312.614 L
147.723 312.6 L
147.854 312.571 L
147.984 312.666 L
148.114 312.731 L
148.245 312.923 L
148.375 312.98 L
148.506 313.098 L
148.636 313.192 L
148.766 313.256 L
148.897 313.402 L
149.027 313.675 L
149.158 314.396 L
149.288 314.989 L
149.418 315.382 L
149.549 315.53 L
149.679 315.337 L
149.81 314.788 L
149.94 314.277 L
150.07 313.943 L
150.201 313.101 L
150.331 312.74 L
150.462 311.924 L
150.592 311.346 L
150.722 310.972 L
150.853 310.779 L
150.983 310.712 L
151.114 310.568 L
151.244 310.454 L
151.374 310.381 L
151.505 310.206 L
151.635 310.366 L
151.766 310.807 L
151.896 311.182 L
152.026 311.419 L
152.157 312.014 L
152.287 312.227 L
152.418 312.685 L
152.548 313.074 L
152.678 313.316 L
152.809 313.918 L
152.939 314.131 L
153.07 314.587 L
153.2 314.504 L
153.33 314.453 L
153.461 314.322 L
153.591 314.276 L
153.722 314.178 L
153.852 314.048 L
153.982 313.969 L
154.113 313.706 L
154.243 313.603 L
154.374 313.381 L
154.504 313.18 L
154.634 313.06 L
154.765 312.699 L
154.895 312.581 L
155.026 312.335 L
155.156 312.128 L
155.286 312.006 L
155.417 311.786 L
155.547 311.7 L
155.678 311.518 L
155.808 310.63 L
155.938 310.111 L
156.069 308.748 L
156.199 308.275 L
156.33 307.285 L
156.46 306.385 L
156.59 305.867 L
156.721 304.485 L
156.851 304.005 L
156.982 303.003 L
157.112 302.079 L
157.242 301.554 L
157.373 300.138 L
157.503 299.65 L
157.633 298.639 L
157.764 297.707 L
157.894 297.184 L
158.025 295.768 L
158.155 295.284 L
158.285 294.283 L
158.416 293.351 L
158.546 292.835 L
158.677 291.416 L
158.807 291.278 L
158.937 291.046 L
159.068 290.839 L
159.198 290.726 L
159.329 290.403 L
159.459 290.286 L
159.589 290.046 L
159.72 289.092 L
159.85 288.577 L
159.981 287.129 L
160.111 286.635 L
160.241 285.629 L
160.372 285.931 L
160.502 286.092 L
160.633 286.553 L
160.763 286.717 L
160.893 287.05 L
161.024 287.385 L
161.154 287.561 L
161.285 288.072 L
161.415 288.695 L
161.545 289.983 L
161.676 291.224 L
161.806 291.868 L
161.937 293.695 L
162.067 294.307 L
162.197 295.539 L
162.328 295.84 L
162.458 295.994 L
162.589 296.448 L
162.719 296.6 L
162.849 296.905 L
162.98 297.277 L
163.11 297.465 L
163.241 297.935 L
163.371 297.825 L
163.501 297.605 L
163.632 297.409 L
163.762 297.311 L
163.893 297.019 L
164.023 296.936 L
164.153 296.771 L
164.284 296.622 L
164.414 296.548 L
164.545 296.341 L
164.675 296.226 L
164.805 296.003 L
164.936 295.768 L
165.066 295.65 L
165.197 295.229 L
165.327 295.098 L
165.457 294.848 L
165.588 294.61 L
165.718 294.492 L
165.849 294.156 L
165.979 294.039 L
166.109 293.816 L
166.24 293.586 L
166.37 293.485 L
166.501 294.045 L
166.631 294.274 L
166.761 294.703 L
166.892 295.187 L
167.022 295.428 L
167.153 296.344 L
167.283 296.608 L
167.413 297.097 L
167.544 297.101 L
167.674 297.103 L
167.805 297.106 L
167.935 297.105 L
168.065 297.105 L
168.196 297.097 L
168.326 297.093 L
168.457 297.078 L
168.587 297.072 L
168.717 297.062 L
168.848 297.038 L
168.978 297.026 L
169.109 296.977 L
169.239 296.935 L
169.369 296.861 L
169.5 296.737 L
169.63 296.677 L
169.761 296.495 L
169.891 296.546 L
170.021 296.636 L
170.152 296.801 L
170.282 296.878 L
170.413 297.043 L
170.543 296.983 L
170.673 296.879 L
170.804 296.807 L
170.934 296.774 L
171.065 296.71 L
171.195 296.687 L
171.325 296.647 L
171.456 296.638 L
171.586 296.632 L
171.717 296.594 L
171.847 296.572 L
171.977 296.535 L
172.108 296.416 L
172.238 296.361 L
172.368 296.226 L
172.499 296.603 L
172.629 297.23 L
172.76 297.946 L
172.89 298.309 L
173.02 299.842 L
173.151 300.448 L
173.281 301.445 L
173.412 302.587 L
173.542 303.122 L
173.672 304.652 L
173.803 305.033 L
173.933 305.652 L
174.064 305.764 L
174.194 305.815 L
174.324 305.923 L
174.455 305.979 L
174.585 306.069 L
174.716 306.16 L
174.846 306.203 L
174.976 306.347 L
175.107 306.403 L
175.237 306.492 L
175.368 306.702 L
175.498 306.839 L
175.628 307.793 L
175.759 308.186 L
175.889 308.799 L
176.02 309.531 L
176.15 309.869 L
176.28 310.825 L
176.411 311.226 L
176.541 311.845 L
176.672 312.601 L
176.802 312.949 L
176.932 313.945 L
177.063 313.849 L
177.193 313.702 L
177.324 313.526 L
177.454 313.445 L
177.584 313.22 L
177.715 312.866 L
177.845 312.333 L
177.976 311.685 L
178.106 311.389 L
178.236 310.556 L
178.367 310.211 L
178.497 309.698 L
178.628 309.109 L
178.758 308.842 L
178.888 308.117 L
179.019 307.806 L
179.149 307.349 L
179.28 306.785 L
179.41 306.531 L
179.54 305.83 L
179.671 305.484 L
179.801 304.982 L
179.932 304.314 L
180.062 304.076 L
180.192 304.002 L
180.323 303.964 L
180.453 303.909 L
180.584 304.45 L
180.714 304.688 L
180.844 305.304 L
180.975 305.194 L
181.105 305.039 L
181.236 304.804 L
181.366 304.698 L
181.496 304.393 L
181.627 304.227 L
181.757 303.996 L
181.888 303.687 L
182.018 303.548 L
182.148 303.159 L
182.279 303.014 L
182.409 302.814 L
182.54 302.541 L
182.67 302.32 L
182.8 300.955 L
182.931 300.32 L
183.061 299.454 L
183.192 298.916 L
183.322 298.679 L
183.452 298.038 L
183.583 297.738 L
183.713 297.334 L
183.844 296.898 L
183.974 296.816 L
184.104 297.343 L
184.235 297.596 L
184.365 297.932 L
184.496 298.383 L
184.626 298.505 L
184.756 298.339 L
184.887 298.26 L
185.017 298.157 L
185.148 298.014 L
185.278 297.95 L
185.408 297.771 L
185.539 297.686 L
185.669 297.575 L
185.8 297.428 L
185.93 297.331 L
186.06 296.87 L
186.191 296.63 L
186.321 296.322 L
186.452 295.918 L
186.582 295.712 L
186.712 294.984 L
186.843 294.774 L
186.973 294.508 L
187.104 294.19 L
187.234 294.096 L
187.364 294.078 L
187.495 294.071 L
187.625 294.062 L
187.755 294.051 L
187.886 294.048 L
188.016 294.046 L
188.147 294.049 L
188.277 294.052 L
188.407 294.058 L
188.538 294.06 L
188.668 294.067 L
188.799 294.071 L
188.929 294.076 L
189.059 294.086 L
189.19 294.092 L
189.32 294.118 L
189.451 294.155 L
189.581 294.2 L
189.711 293.638 L
189.842 293.391 L
189.972 292.701 L
190.103 292.224 L
190.233 291.655 L
190.363 291.62 L
190.494 291.682 L
190.624 292.188 L
190.755 293.144 L
190.885 294.27 L
191.015 295.94 L
191.146 296.497 L
191.276 297.331 L
191.407 297.78 L
191.537 298.302 L
191.667 299.052 L
191.798 299.369 L
191.928 300.199 L
192.059 300.579 L
192.189 301.015 L
192.319 301.113 L
192.45 301.158 L
192.58 301.292 L
192.711 301.201 L
192.841 301.096 L
192.971 301.976 L
193.102 302.358 L
193.232 303.398 L
193.363 304.113 L
193.493 304.915 L
193.623 306.124 L
193.754 306.347 L
193.884 305.918 L
194.015 305.682 L
194.145 305.42 L
194.275 305.028 L
194.406 304.958 L
194.536 305.099 L
194.667 305.178 L
194.797 305.264 L
194.927 305.403 L
195.058 305.461 L
195.188 305.61 L
195.319 305.694 L
195.449 305.785 L
195.579 305.928 L
195.71 305.899 L
195.84 305.548 L
195.971 305.349 L
196.101 305.136 L
196.231 304.907 L
196.362 304.905 L
196.492 305.181 L
196.623 305.365 L
196.753 305.56 L
196.883 305.881 L
197.014 306.013 L
197.144 306.349 L
197.275 306.141 L
197.405 305.923 L
197.535 305.599 L
197.666 305.612 L
197.796 306.049 L
197.927 306.639 L
198.057 307.248 L
198.187 308.313 L
198.318 308.803 L
198.448 310.193 L
198.579 310.945 L
198.709 311.713 L
198.839 312.812 L
198.97 313.116 L
199.1 313.512 L
199.231 313.749 L
199.361 313.989 L
199.491 315.327 L
199.622 315.866 L
199.752 317.208 L
199.883 317.619 L
200.013 318.028 L
200.143 318.719 L
200.274 318.996 L
200.404 319.683 L
200.535 320.034 L
200.665 320.38 L
200.795 319.346 L
200.926 318.934 L
201.056 317.911 L
201.187 317.283 L
201.317 316.671 L
201.447 316.275 L
201.578 316.118 L
201.708 315.73 L
201.839 315.489 L
201.969 315.257 L
202.099 315.605 L
202.23 315.755 L
202.36 316.15 L
202.49 315.988 L
202.621 315.835 L
202.751 315.904 L
202.882 315.958 L
203.012 316.145 L
203.142 316.629 L
203.273 317.083 L
203.403 317.831 L
203.534 318.027 L
203.664 318.313 L
203.794 318.513 L
203.925 318.698 L
204.055 319.349 L
204.186 319.603 L
204.316 320.219 L
204.446 320.614 L
204.577 320.975 L
204.707 321.729 L
204.838 322.155 L
204.968 323.425 L
205.098 324.251 L
205.229 324.999 L
205.359 326.354 L
205.49 326.863 L
205.62 328.056 L
205.75 328.832 L
205.881 329.526 L
206.011 330.78 L
206.142 331.257 L
206.272 332.384 L
206.402 333.238 L
206.533 333.991 L
206.663 334.686 L
206.794 335.006 L
206.924 335.858 L
207.054 335.892 L
207.185 335.921 L
207.315 336.73 L
207.446 336.908 L
207.576 337.125 L
207.706 337.282 L
207.837 337.418 L
207.967 338.649 L
208.098 339.124 L
208.228 340.254 L
208.358 341.025 L
208.489 341.682 L
208.619 340.879 L
208.75 340.57 L
208.88 339.838 L
209.01 339.978 L
209.141 340.096 L
209.271 340.303 L
209.402 340.457 L
209.532 340.92 L
209.662 340.527 L
209.793 340.2 L
209.923 339.498 L
210.054 339.172 L
210.184 338.329 L
210.314 337.752 L
210.445 337.277 L
210.575 337.566 L
210.706 337.676 L
210.836 337.932 L
210.966 338.106 L
211.097 338.247 L
211.227 338.53 L
211.358 338.635 L
211.488 338.877 L
211.618 339.032 L
211.749 339.155 L
211.879 339.372 L
212.01 339.449 L
212.14 339.621 L
212.27 339.747 L
212.401 339.846 L
212.531 340.591 L
212.662 340.864 L
212.792 341.487 L
212.922 341.853 L
213.053 342.139 L
213.183 342.164 L
213.314 342.188 L
213.444 342.259 L
213.574 342.282 L
213.705 342.299 L
213.835 342.308 L
213.966 342.308 L
214.096 342.307 L
214.226 342.306 L
214.357 342.306 L
214.487 342.304 L
214.618 342.152 L
214.748 341.659 L
214.878 341.239 L
215.009 340.923 L
215.139 339.972 L
215.27 339.649 L
215.4 338.942 L
215.53 338.511 L
215.661 338.19 L
215.791 338.188 L
215.922 338.188 L
216.052 338.188 L
216.182 338.189 L
216.313 338.189 L
216.443 338.195 L
216.574 338.198 L
216.704 338.206 L
216.834 338.211 L
216.965 338.215 L
217.095 338.23 L
217.225 338.238 L
217.356 338.257 L
217.486 338.728 L
217.617 339.066 L
217.747 339.818 L
217.877 340.095 L
218.008 340.716 L
218.138 341.209 L
218.269 341.559 L
218.399 342.338 L
218.529 342.625 L
218.66 343.267 L
218.79 343.26 L
218.921 343.255 L
219.051 343.174 L
219.181 343.348 L
219.312 343.871 L
219.442 344.282 L
219.573 344.566 L
219.703 345.159 L
219.833 345.171 L
219.964 345.068 L
220.094 345.02 L
220.225 344.987 L
220.355 344.998 L
220.485 344.992 L
220.616 344.973 L
220.746 344.728 L
220.877 344.563 L
221.007 344.174 L
221.137 344.034 L
221.268 343.725 L
221.398 343.391 L
221.529 343.168 L
221.659 341.995 L
221.789 341.573 L
221.92 340.648 L
222.05 339.883 L
222.181 339.379 L
222.311 339.08 L
222.441 338.99 L
222.572 338.803 L
222.702 338.632 L
222.833 338.521 L
222.963 338.28 L
223.093 338.187 L
223.224 337.983 L
223.354 338.348 L
223.485 338.583 L
223.615 339.006 L
223.745 338.957 L
223.876 338.762 L
224.006 338.056 L
224.137 337.608 L
224.267 336.515 L
224.397 336.129 L
224.528 335.298 L
224.658 334.586 L
224.789 334.14 L
224.919 333.036 L
225.049 332.645 L
225.18 331.807 L
225.31 332.527 L
225.441 332.971 L
225.571 334.075 L
225.701 334.114 L
225.832 334.076 L
225.962 334.039 L
226.093 334.016 L
226.223 333.948 L
226.353 333.925 L
226.484 333.878 L
226.614 333.811 L
226.745 333.772 L
226.875 333.613 L
227.005 333.551 L
227.136 333.417 L
227.266 333.292 L
227.397 333.218 L
227.527 333.024 L
227.657 332.955 L
227.788 332.81 L
227.918 332.675 L
228.049 332.596 L
228.179 332.387 L
228.309 332.321 L
228.44 332.183 L
228.57 332.07 L
228.701 332.005 L
228.831 331.843 L
228.961 331.794 L
229.092 331.694 L
229.222 331.637 L
229.353 331.605 L
229.483 331.581 L
229.613 331.579 L
229.744 331.576 L
229.874 330.888 L
230.005 330.5 L
230.135 329.37 L
230.265 329.015 L
230.396 328.286 L
230.526 328.297 L
230.657 328.304 L
230.787 328.342 L
230.917 328.709 L
231.048 329.522 L
231.178 330.281 L
231.309 330.699 L
231.439 331.849 L
231.569 332.24 L
231.7 333.043 L
231.83 333.801 L
231.96 334.213 L
232.091 335.239 L
232.221 335.222 L
232.352 335.145 L
232.482 335.066 L
232.612 335.024 L
232.743 333.749 L
232.873 333.307 L
233.004 332.405 L
233.134 331.605 L
233.264 331.182 L
233.395 331.057 L
233.525 331.011 L
233.656 330.918 L
233.786 330.817 L
233.916 330.764 L
234.047 330.604 L
234.177 330.672 L
234.308 330.817 L
234.438 331.012 L
234.568 331.113 L
234.699 331.382 L
234.829 331.454 L
234.96 331.6 L
235.09 331.449 L
235.22 331.373 L
235.351 330.071 L
235.481 329.627 L
235.612 328.74 L
235.742 328.571 L
235.872 328.486 L
236.003 328.228 L
236.133 328.135 L
236.264 327.95 L
236.394 327.751 L
236.524 327.652 L
236.655 327.386 L
236.785 327.276 L
236.916 327.06 L
237.046 326.834 L
237.176 326.722 L
237.307 326.386 L
237.437 326.28 L
237.568 326.074 L
237.698 325.196 L
237.828 324.763 L
237.959 323.613 L
238.089 323.262 L
238.22 322.591 L
238.35 322.699 L
238.48 322.753 L
238.611 323.02 L
238.741 323.113 L
238.872 323.288 L
239.002 322.437 L
239.132 322.019 L
239.263 320.734 L
239.393 320.286 L
239.524 319.452 L
239.654 318.556 L
239.784 318.118 L
239.915 316.867 L
240.045 316.419 L
240.176 315.598 L
240.306 314.159 L
240.436 313.474 L
240.567 312.133 L
240.697 311.972 L
240.828 311.681 L
240.958 311.607 L
241.088 311.572 L
241.219 311.533 L
241.349 311.477 L
241.48 311.377 L
241.61 311.042 L
241.74 310.88 L
241.871 310.413 L
242.001 310.241 L
242.132 309.938 L
242.262 309.614 L
242.392 309.458 L
242.523 308.998 L
242.653 308.827 L
242.784 308.528 L
242.914 308.206 L
243.044 308.052 L
243.175 307.611 L
243.305 307.448 L
243.436 307.166 L
243.566 306.852 L
243.696 306.702 L
243.827 306.265 L
243.957 306.313 L
244.088 306.394 L
244.218 306.485 L
244.348 306.528 L
244.479 306.655 L
244.609 306.477 L
244.74 306.179 L
244.87 305.841 L
245 305.681 L
245.131 305.219 L
245.261 305.039 L
245.392 304.74 L
245.522 304.402 L
245.652 304.242 L
245.783 303.763 L
245.913 303.543 L
246.044 303.183 L
246.174 302.933 L
246.304 302.816 L
246.435 302.486 L
246.565 302.67 L
246.695 302.965 L
246.826 303.391 L
246.956 303.587 L
247.087 304.096 L
247.217 303.9 L
247.347 303.589 L
247.478 302.493 L
247.608 301.922 L
247.739 299.404 L
247.869 298.402 L
247.999 296.826 L
248.13 295.614 L
248.26 295.053 L
248.391 293.465 L
248.521 292.8 L
248.651 291.767 L
248.782 290.619 L
248.912 290.207 L
249.043 290.534 L
249.173 290.673 L
249.303 290.886 L
249.434 292.001 L
249.564 292.514 L
249.695 293.977 L
249.825 294.556 L
249.955 295.433 L
250.086 295.692 L
250.216 295.756 L
250.347 295.32 L
250.477 295.129 L
250.607 294.844 L
250.738 295.072 L
250.868 295.149 L
250.999 295.079 L
251.129 295.011 L
251.259 294.91 L
251.39 294.243 L
251.52 293.943 L
251.651 293.139 L
251.781 292.961 L
251.911 292.701 L
252.042 293.155 L
252.172 293.417 L
252.303 294.699 L
252.433 294.825 L
252.563 295.007 L
252.694 295.236 L
252.824 295.329 L
252.955 295.501 L
253.085 294.778 L
253.215 293.749 L
253.346 292.452 L
253.476 291.859 L
253.607 290.131 L
253.737 289.394 L
253.867 288.358 L
253.998 287.033 L
254.128 286.441 L
254.259 284.802 L
254.389 284.469 L
254.519 284.007 L
254.65 283.304 L
254.78 283.056 L
254.911 282.881 L
255.041 282.232 L
255.171 281.343 L
255.302 280.098 L
255.432 279.614 L
255.563 278.781 L
255.693 278.675 L
255.823 278.53 L
255.954 278.339 L
256.084 278.254 L
256.215 278.023 L
256.345 277.911 L
256.475 277.762 L
256.606 277.55 L
256.736 277.572 L
256.867 278.397 L
256.997 279.212 L
257.127 280.29 L
257.258 280.81 L
257.388 280.945 L
257.519 280.723 L
257.649 280.465 L
257.779 280.129 L
257.91 279.618 L
258.04 279.406 L
258.171 278.902 L
258.301 278.797 L
258.431 278.663 L
258.562 278.47 L
258.692 278.386 L
258.823 278.16 L
258.953 278.047 L
259.083 277.903 L
259.214 277.71 L
259.344 277.625 L
259.475 277.394 L
259.605 277.277 L
259.735 277.13 L
259.866 276.921 L
259.996 276.831 L
260.126 276.589 L
260.257 276.469 L
260.387 276.32 L
260.518 276.112 L
260.648 275.954 L
260.779 275.177 L
260.909 274.79 L
261.039 274.313 L
261.17 273.634 L
261.3 273.415 L
261.43 273.182 L
261.561 273.066 L
261.691 272.924 L
261.822 272.726 L
261.952 272.641 L
262.082 272.415 L
262.213 272.297 L
262.343 272.154 L
262.474 271.947 L
262.604 271.859 L
262.734 271.627 L
262.865 271.386 L
262.995 271.101 L
263.126 270.683 L
263.256 270.539 L
263.386 270.303 L
263.517 270.176 L
263.647 270.028 L
263.778 269.79 L
263.908 269.689 L
264.038 269.417 L
264.169 269.738 L
264.299 270.109 L
264.43 270.655 L
264.56 270.847 L
264.69 271.204 L
264.821 270.974 L
264.951 270.711 L
265.082 270.318 L
265.212 270.154 L
265.342 269.733 L
265.473 269.507 L
265.603 269.252 L
265.734 268.236 L
265.864 267.812 L
265.994 266.72 L
266.125 266.121 L
266.255 265.454 L
266.386 264.434 L
266.516 264.011 L
266.646 262.929 L
266.777 262.33 L
266.907 261.669 L
267.038 261.413 L
267.168 261.311 L
267.298 261.056 L
267.429 259.658 L
267.559 258.135 L
267.69 255.765 L
267.82 254.781 L
267.95 252.242 L
268.081 251.198 L
268.211 250.074 L
268.342 248.333 L
268.472 247.622 L
268.602 245.822 L
268.733 244.807 L
268.863 243.727 L
268.994 241.402 L
269.124 240.456 L
269.254 238.067 L
269.385 236.697 L
269.515 235.258 L
269.646 233.071 L
269.776 232.785 L
269.906 233.798 L
270.037 234.402 L
270.167 235.029 L
270.298 236.195 L
270.428 236.654 L
270.558 237.772 L
270.689 238.432 L
270.819 239.109 L
270.95 240.016 L
271.08 240.426 L
271.21 241.571 L
271.341 242.246 L
271.471 242.929 L
271.602 243.186 L
271.732 243.317 L
271.862 243.717 L
271.993 243.958 L
272.123 244.2 L
272.254 243.999 L
272.384 243.919 L
272.514 243.72 L
272.645 243.598 L
272.775 243.477 L
272.906 243.283 L
273.036 243.051 L
273.166 242.113 L
273.297 241.544 L
273.427 240.987 L
273.558 239.036 L
273.688 238.26 L
273.818 236.344 L
273.949 236.259 L
274.079 236.177 L
274.21 236.045 L
274.34 235.994 L
274.47 235.868 L
274.601 235.792 L
274.731 235.719 L
274.862 235.599 L
274.992 235.552 L
275.122 235.437 L
275.253 235.369 L
275.383 235.304 L
275.514 234.97 L
275.644 234.85 L
275.774 234.579 L
275.905 234.526 L
276.035 234.478 L
276.165 234.426 L
276.296 234.407 L
276.426 234.365 L
276.557 234.338 L
276.687 234.313 L
276.818 234.272 L
276.948 234.066 L
277.078 233.212 L
277.209 232.664 L
277.339 232.166 L
277.469 231.295 L
277.6 231.125 L
277.73 231.014 L
277.861 230.942 L
277.991 230.877 L
278.121 231.734 L
278.252 232.085 L
278.382 232.959 L
278.513 233.48 L
278.643 233.944 L
278.773 233.794 L
278.904 233.739 L
279.034 233.611 L
279.165 233.528 L
279.295 233.456 L
279.425 233.326 L
279.556 233.277 L
279.686 233.161 L
279.817 233.089 L
279.947 233.026 L
280.077 232.917 L
280.208 232.876 L
280.338 232.78 L
280.469 232.723 L
280.599 232.674 L
280.729 232.595 L
280.86 232.808 L
280.99 233.668 L
281.121 234.151 L
281.251 234.56 L
281.381 235.416 L
281.512 235.512 L
281.642 235.419 L
281.773 235.36 L
281.903 235.31 L
282.033 235.413 L
282.164 235.451 L
282.294 235.542 L
282.425 235.612 L
282.555 235.67 L
282.685 235.791 L
282.816 235.835 L
282.946 235.938 L
283.077 236.008 L
283.207 236.065 L
283.337 236.172 L
283.468 236.445 L
283.598 237.367 L
283.729 237.964 L
283.859 238.445 L
283.989 238.445 L
284.12 238.854 L
284.25 240.284 L
284.381 241.313 L
284.511 242.133 L
284.641 243.888 L
284.772 244.54 L
284.902 246.043 L
285.033 247.125 L
285.163 247.977 L
285.293 249.706 L
285.424 250.351 L
285.554 251.837 L
285.685 252.362 L
285.815 252.769 L
285.945 254.394 L
286.076 255.032 L
286.206 256.533 L
286.337 257.605 L
286.467 258.428 L
286.597 257.572 L
286.728 257.256 L
286.858 256.533 L
286.989 256.022 L
287.119 255.634 L
287.249 254.893 L
287.38 254.639 L
287.51 254.078 L
287.641 254.216 L
287.771 254.319 L
287.901 254.309 L
288.032 254.306 L
288.162 254.301 L
288.293 254.397 L
288.423 254.468 L
288.553 255.505 L
288.684 255.882 L
288.814 256.732 L
288.945 256.84 L
289.075 256.918 L
289.205 257.088 L
289.336 257.154 L
289.466 257.305 L
289.597 256.957 L
289.727 256.706 L
289.857 256.925 L
289.988 256.999 L
290.118 257.162 L
290.249 257.273 L
290.379 257.353 L
290.509 257.556 L
290.64 257.38 L
290.77 256.802 L
290.901 256.392 L
291.031 256.103 L
291.161 256.249 L
291.292 256.303 L
291.422 256.423 L
291.552 256.522 L
291.683 256.591 L
291.813 256.754 L
291.944 256.619 L
292.074 256.193 L
292.204 255.956 L
292.335 255.792 L
292.465 255.452 L
292.596 255.464 L
292.726 255.574 L
292.856 255.581 L
292.987 255.585 L
293.117 255.592 L
293.248 255.567 L
293.378 255.496 L
293.508 255.437 L
293.639 255.397 L
293.769 256.179 L
293.9 256.459 L
294.03 257.07 L
294.16 257.689 L
294.291 258.098 L
294.421 258.229 L
294.552 258.276 L
294.682 258.38 L
294.812 257.764 L
294.943 257.361 L
295.073 256.325 L
295.204 255.984 L
295.334 255.256 L
295.464 255.361 L
295.595 255.43 L
295.725 256.532 L
295.856 256.923 L
295.986 257.768 L
296.116 258.497 L
296.247 258.961 L
296.377 259.228 L
296.508 259.317 L
296.638 259.507 L
296.768 259.698 L
296.899 259.818 L
297.029 260.018 L
297.16 260.088 L
297.29 260.238 L
297.42 260.355 L
297.551 260.429 L
297.681 259.481 L
297.812 259.206 L
297.942 258.638 L
298.072 258.189 L
298.203 257.914 L
298.333 258.247 L
298.464 258.359 L
298.594 258.596 L
298.724 258.67 L
298.855 258.715 L
298.985 258.889 L
299.116 258.954 L
299.246 259.092 L
299.376 258.698 L
299.507 258.463 L
299.637 257.873 L
299.768 257.702 L
299.898 257.351 L
300.028 257.507 L
300.159 257.599 L
300.289 256.833 L
300.42 256.56 L
300.55 255.984 L
300.68 256.156 L
300.811 256.256 L
300.941 256.533 L
301.072 256.631 L
301.202 256.836 L
301.332 257.796 L
301.463 258.35 L
301.593 259.808 L
301.724 260.355 L
301.854 261.505 L
301.984 262.56 L
302.115 263.159 L
302.245 264.789 L
302.376 265.655 L
302.506 267.51 L
302.636 268.664 L
302.767 269.311 L
302.897 270.969 L
303.028 271.554 L
303.158 272.766 L
303.288 274.609 L
303.419 275.629 L
303.549 278.398 L
303.68 278.82 L
303.81 279.614 L
303.94 280.298 L
304.071 280.673 L
304.201 281.607 L
304.332 281.693 L
304.462 281.841 L
304.592 281.967 L
304.723 282.036 L
304.853 282.232 L
304.984 282.297 L
305.114 282.428 L
305.244 281.912 L
305.375 281.637 L
305.505 280.874 L
305.635 280.917 L
305.766 281.028 L
305.896 281.134 L
306.027 281.189 L
306.157 281.343 L
306.287 281.653 L
306.418 282.295 L
306.548 282.966 L
306.679 283.314 L
306.809 284.356 L
306.939 284.715 L
307.07 285.437 L
307.2 286.126 L
307.331 286.479 L
307.461 286.467 L
307.591 286.403 L
307.722 286.274 L
307.852 285.677 L
307.983 285.376 L
308.113 285.523 L
308.243 285.566 L
308.374 285.651 L
308.504 285.722 L
308.635 285.759 L
308.765 286.6 L
308.895 286.904 L
309.026 287.504 L
309.156 288.032 L
309.287 288.291 L
309.417 288.359 L
309.547 288.401 L
309.678 288.483 L
309.808 288.552 L
309.939 288.587 L
310.069 288.774 L
310.199 288.817 L
310.33 288.899 L
310.46 289.038 L
310.591 289.107 L
310.721 289.332 L
310.851 289.349 L
310.982 289.381 L
311.112 289.416 L
311.243 289.434 L
311.373 289.491 L
311.503 289.537 L
311.634 289.624 L
311.764 289.844 L
311.895 289.955 L
312.025 290.455 L
312.155 290.679 L
312.286 291.093 L
312.416 290.932 L
312.547 290.839 L
312.677 289.914 L
312.807 289.609 L
312.938 289.055 L
313.068 289.032 L
313.199 289.025 L
313.329 289.166 L
313.459 289.218 L
313.59 289.313 L
313.72 289.999 L
313.851 290.331 L
313.981 291.297 L
314.111 291.658 L
314.242 292.298 L
314.372 292.998 L
314.503 293.334 L
314.633 294.307 L
314.763 294.681 L
314.894 295.337 L
315.024 296.068 L
315.155 296.402 L
315.285 296.904 L
315.415 297.086 L
315.546 297.399 L
315.676 299.033 L
315.807 299.81 L
315.937 301.991 L
316.067 303.142 L
316.198 305.108 L
316.328 307.293 L
316.459 308.324 L
316.589 311.122 L
316.719 311.936 L
316.85 313.309 L
316.98 314.843 L
317.111 315.569 L
317.241 317.655 L
317.371 318.461 L
317.502 319.802 L
317.632 321.288 L
317.763 321.986 L
317.893 323.937 L
318.023 323.499 L
318.154 322.781 L
318.284 321.902 L
318.415 321.479 L
318.545 320.092 L
318.675 319.515 L
318.806 318.578 L
318.936 317.44 L
319.067 316.919 L
319.197 315.6 L
319.327 314.958 L
319.458 313.929 L
319.588 312.691 L
319.719 312.123 L
319.849 310.636 L
319.979 309.959 L
320.11 308.888 L
320.24 307.596 L
320.37 307.086 L
320.501 306.881 L
320.631 306.787 L
320.762 306.641 L
320.892 306.453 L
321.022 306.365 L
321.153 306.1 L
321.283 306.338 L
321.414 306.703 L
321.544 307.122 L
321.674 307.309 L
321.805 307.758 L
321.935 307.951 L
322.066 308.245 L
322.196 307.905 L
322.326 307.748 L
322.457 307.299 L
322.587 307.106 L
322.718 306.814 L
322.848 306.449 L
322.978 306.282 L
323.109 305.806 L
323.239 305.598 L
323.37 305.289 L
323.5 304.897 L
323.63 304.737 L
323.761 304.47 L
323.891 304.323 L
324.022 304.107 L
324.152 304.478 L
324.282 304.649 L
324.413 305.165 L
324.543 305.327 L
324.674 305.563 L
324.804 305.084 L
324.934 304.869 L
325.065 304.285 L
325.195 304.447 L
325.326 304.68 L
325.456 304.988 L
325.586 305.128 L
325.717 305.527 L
325.847 305.346 L
325.978 305.092 L
326.108 304.688 L
326.238 304.513 L
326.369 304.077 L
326.499 303.894 L
326.63 303.638 L
326.76 303.331 L
326.89 303.201 L
327.021 302.901 L
327.151 302.756 L
327.282 302.557 L
327.412 302.278 L
327.542 302.153 L
327.673 301.798 L
327.803 301.631 L
327.934 301.403 L
328.064 301.093 L
328.194 300.952 L
328.325 300.537 L
328.455 300.259 L
328.586 299.885 L
328.716 299.245 L
328.846 298.949 L
328.977 298.055 L
329.107 297.571 L
329.238 296.928 L
329.368 296.837 L
329.498 296.792 L
329.629 296.636 L
329.759 296.632 L
329.89 296.626 L
330.02 296.547 L
330.15 296.494 L
330.281 296.232 L
330.411 295.8 L
330.542 295.239 L
330.672 294.515 L
330.802 294.205 L
330.933 293.401 L
331.063 293.036 L
331.194 292.568 L
331.324 291.966 L
331.454 291.707 L
331.585 291.025 L
331.715 290.694 L
331.846 290.275 L
331.976 290.118 L
332.106 290.051 L
332.237 289.875 L
332.367 288.939 L
332.498 287.768 L
332.628 286.154 L
332.758 285.448 L
332.889 283.513 L
333.019 282.514 L
333.15 281.279 L
333.28 279.54 L
333.41 278.786 L
333.541 276.742 L
333.671 275.655 L
333.802 274.329 L
333.932 273.161 L
334.062 272.668 L
334.193 271.396 L
334.323 270.712 L
334.454 269.888 L
334.584 268.689 L
334.714 268.413 L
334.845 268.757 L
334.975 268.935 L
335.105 269.148 L
335.236 269.43 L
335.366 269.541 L
335.497 269.796 L
335.627 269.903 L
335.757 270.029 L
335.888 269.452 L
336.018 269.239 L
336.149 268.815 L
336.279 268.587 L
336.409 268.323 L
336.54 267.757 L
336.67 267.516 L
336.801 266.876 L
336.931 266.545 L
337.061 266.164 L
337.192 265.611 L
337.322 265.382 L
337.453 264.792 L
337.583 264.473 L
337.713 264.112 L
337.844 264.214 L
337.974 264.144 L
338.105 263.545 L
338.235 263.245 L
338.365 262.909 L
338.496 262.492 L
338.626 262.313 L
338.757 261.831 L
338.887 262.038 L
339.017 262.267 L
339.148 262.559 L
339.278 262.558 L
339.409 262.133 L
339.539 261.896 L
339.669 261.637 L
339.8 261.239 L
339.93 261.077 L
340.061 260.671 L
340.191 260.814 L
340.321 260.968 L
340.452 261.085 L
340.582 261.141 L
340.713 261.308 L
340.843 261.221 L
340.973 261.127 L
341.104 261.108 L
341.234 261.102 L
341.365 261.094 L
341.495 261.161 L
341.625 261.231 L
341.756 261.385 L
341.886 261.311 L
342.017 260.719 L
342.147 260.407 L
342.277 260.081 L
342.408 259.441 L
342.538 259.332 L
342.669 259.479 L
342.799 259.643 L
342.929 259.811 L
343.06 260.15 L
343.19 260.291 L
343.321 260.654 L
343.451 260.87 L
343.581 261.09 L
343.712 261.427 L
343.842 261.565 L
343.973 261.915 L
344.103 262.133 L
344.233 262.351 L
344.364 262.631 L
344.494 262.748 L
344.625 263.052 L
344.755 263.254 L
344.885 263.456 L
345.016 263.765 L
345.146 263.906 L
345.277 264.298 L
345.407 264.536 L
345.537 264.771 L
345.668 264.485 L
345.798 264.399 L
345.929 264.251 L
346.059 263.935 L
346.189 263.629 L
346.32 263.083 L
346.45 262.856 L
346.581 262.277 L
346.711 262.276 L
346.841 262.275 L
346.972 262.384 L
347.102 262.34 L
347.233 262.044 L
347.363 261.824 L
347.493 261.614 L
347.624 261.909 L
347.754 262.014 L
347.885 262.244 L
348.015 262.529 L
348.145 262.795 L
348.276 262.683 L
348.406 262.642 L
348.537 262.546 L
348.667 262.496 L
348.797 262.449 L
348.928 262.379 L
349.058 262.354 L
349.189 262.297 L
349.319 262.268 L
349.449 262.242 L
349.58 262.295 L
349.71 262.328 L
349.841 262.43 L
349.971 262.579 L
350.101 262.714 L
350.232 263.016 L
350.362 263.154 L
350.492 263.522 L
350.623 263.078 L
350.753 262.682 L
350.884 262.23 L
351.014 262.067 L
351.145 261.696 L
351.275 261.477 L
351.405 261.284 L
351.536 260.934 L
351.666 260.81 L
351.796 260.532 L
351.927 260.394 L
352.057 260.274 L
352.188 260.152 L
352.318 260.143 L
352.448 260.182 L
352.579 260.658 L
352.709 261.068 L
352.84 261.877 L
352.97 262.19 L
353.1 262.934 L
353.231 263.475 L
353.361 263.935 L
353.492 264.473 L
353.622 264.682 L
353.752 265.18 L
353.883 265.53 L
354.013 265.823 L
354.144 266.402 L
354.274 266.716 L
354.404 267.581 L
354.535 267.756 L
354.665 267.901 L
354.796 268.169 L
354.926 268.345 L
355.056 268.854 L
355.187 269.203 L
355.317 269.489 L
355.448 270.088 L
355.578 270.547 L
355.708 271.908 L
355.839 272.975 L
355.969 273.839 L
356.1 276.143 L
356.23 276.712 L
356.36 277.684 L
356.491 278.361 L
356.621 278.904 L
356.752 279.98 L
356.882 280.211 L
357.012 280.553 L
357.143 280.755 L
357.273 280.915 L
357.404 281.249 L
357.534 281.502 L
357.664 282.225 L
357.795 282.708 L
357.925 283.086 L
358.056 283.852 L
358.186 284.089 L
358.316 284.585 L
358.447 284.995 L
358.577 285.311 L
358.708 285.795 L
358.838 285.951 L
358.968 286.285 L
359.099 286.564 L
359.229 286.777 L
359.36 287.122 L
359.49 287.224 L
359.62 287.435 L
359.751 287.515 L
359.881 287.576 L
360.012 287.414 L
360.142 287.264 L
360.272 286.841 L
360.403 286.417 L
360.533 286.102 L
360.664 285.238 L
360.794 285.091 L
360.924 284.905 L
361.055 284.865 L
361.185 284.836 L
361.316 284.821 L
361.446 284.768 L
361.576 284.608 L
361.707 284.467 L
361.837 284.366 L
361.968 283.375 L
362.098 283.013 L
362.228 282.198 L
362.359 282.044 L
362.489 281.933 L
362.62 281.555 L
362.75 281.453 L
362.88 281.253 L
363.011 280.573 L
363.141 280.091 L
363.272 278.882 L
363.402 278.351 L
363.532 277.099 L
363.663 276.231 L
363.793 275.624 L
363.924 274.644 L
364.054 274.245 L
364.184 273.328 L
364.315 272.741 L
364.445 272.335 L
364.576 271.42 L
364.706 271.01 L
364.836 270.053 L
364.967 269.67 L
365.097 269.408 L
365.227 268.791 L
365.358 268.561 L
365.488 268.052 L
365.619 267.649 L
365.749 267.377 L
365.879 266.784 L
366.01 266.581 L
366.14 266.143 L
366.271 265.771 L
366.401 265.523 L
366.531 264.98 L
366.662 264.58 L
366.792 263.596 L
366.923 263.252 L
367.053 263.026 L
367.183 262.531 L
367.314 262.466 L
367.444 262.378 L
367.575 262.097 L
367.705 261.915 L
367.835 261.562 L
367.966 261.447 L
368.096 261.203 L
368.227 260.46 L
368.357 259.983 L
368.487 258.871 L
368.618 258.516 L
368.748 257.766 L
368.879 257.238 L
369.009 256.903 L
369.139 256.721 L
369.27 256.677 L
369.4 256.59 L
369.531 256.081 L
369.661 255.762 L
369.791 255.006 L
369.922 254.769 L
370.052 254.272 L
370.183 254.227 L
370.313 254.2 L
370.443 254.141 L
370.574 254.36 L
370.704 254.912 L
370.835 255.398 L
370.965 255.695 L
371.095 256.056 L
371.226 256.184 L
371.356 256.455 L
371.487 256.67 L
371.617 256.799 L
371.747 256.727 L
371.878 256.681 L
372.008 256.578 L
372.139 256.439 L
372.269 256.357 L
372.399 255.006 L
372.53 254.48 L
372.66 253.358 L
372.791 252.411 L
372.921 251.856 L
373.051 251.684 L
373.182 251.633 L
373.312 251.528 L
373.443 251.433 L
373.573 251.378 L
373.703 251.239 L
373.834 251.188 L
373.964 251.08 L
374.095 250.99 L
374.225 250.939 L
374.355 250.94 L
374.486 250.928 L
374.616 250.902 L
374.747 250.878 L
374.877 250.864 L
375.007 250.889 L
375.138 250.858 L
375.268 250.787 L
375.399 250.766 L
375.529 250.754 L
375.659 250.767 L
375.79 250.8 L
375.92 250.872 L
376.051 250.972 L
376.181 251.027 L
376.311 251.207 L
376.442 251.283 L
376.572 251.439 L
376.703 251.769 L
376.833 251.947 L
376.963 252.808 L
377.094 253.164 L
377.224 253.896 L
377.355 254.735 L
377.485 255.183 L
377.615 255.676 L
377.746 255.8 L
377.876 256.049 L
378.007 256.183 L
378.137 256.254 L
378.267 256.55 L
378.398 256.647 L
378.528 256.843 L
378.659 256.798 L
378.789 256.774 L
378.919 257.707 L
379.05 257.657 L
379.18 257.538 L
379.311 257.376 L
379.441 257.293 L
379.571 258.077 L
379.702 258.622 L
379.832 259.724 L
379.962 260.892 L
380.093 261.485 L
380.223 262.825 L
380.354 263.213 L
380.484 263.986 L
380.614 264.789 L
380.745 265.192 L
380.875 266.595 L
381.006 266.718 L
381.136 266.961 L
381.266 267.23 L
381.397 267.364 L
381.527 267.821 L
381.658 268.01 L
381.788 268.381 L
381.918 268.831 L
382.049 269.048 L
382.179 268.838 L
382.31 269.086 L
382.44 269.564 L
382.57 270.046 L
382.701 270.284 L
382.831 271.001 L
382.962 271.255 L
383.092 271.739 L
383.222 272.235 L
383.353 272.488 L
383.483 273.925 L
383.614 273.863 L
383.744 273.746 L
383.874 273.528 L
384.005 273.424 L
384.135 273.298 L
384.266 273.539 L
384.396 273.985 L
384.526 274.426 L
384.657 274.642 L
384.787 275.291 L
384.918 275.853 L
385.048 276.885 L
385.178 277.987 L
385.309 278.5 L
385.439 279.019 L
385.57 279.069 L
385.7 279.16 L
385.83 279.623 L
385.961 279.845 L
386.091 280.399 L
386.222 280.914 L
386.352 281.835 L
386.482 282.831 L
386.613 283.308 L
386.743 284.61 L
386.874 285.031 L
387.004 285.774 L
387.134 286.594 L
387.265 286.963 L
387.395 287.34 L
387.526 287.481 L
387.656 287.725 L
387.786 287.992 L
387.917 288.119 L
388.047 288.489 L
388.178 288.633 L
388.308 288.881 L
388.438 289.184 L
388.569 289.331 L
388.699 289.811 L
388.83 290 L
388.96 290.322 L
389.09 290.672 L
389.221 290.845 L
389.351 291.51 L
389.482 291.822 L
389.612 292.344 L
389.742 292.961 L
389.873 293.252 L
390.003 294.08 L
390.134 294.403 L
390.264 294.937 L
390.394 295.536 L
390.525 295.815 L
390.655 296.578 L
390.786 296.881 L
390.916 297.376 L
391.046 297.827 L
391.177 298.036 L
391.307 298.599 L
391.438 298.821 L
391.568 299.178 L
391.698 299.079 L
391.829 299.032 L
391.959 298.896 L
392.09 298.836 L
392.22 298.741 L
392.35 298.616 L
392.481 298.604 L
392.611 299.229 L
392.742 299.487 L
392.872 299.892 L
393.002 300.367 L
393.133 300.587 L
393.263 301.211 L
393.394 301.477 L
393.524 301.89 L
393.654 302.395 L
393.785 302.679 L
393.915 304.123 L
394.046 304.675 L
394.176 305.521 L
394.306 306.7 L
394.437 307.245 L
394.567 308.827 L
394.697 309.537 L
394.828 310.612 L
394.958 311.435 L
395.089 311.777 L
395.219 312.366 L
395.349 313.226 L
395.48 314.512 L
395.61 315.836 L
395.741 316.516 L
395.871 319.23 L
396.001 320.434 L
396.132 322.21 L
396.262 322.917 L
396.393 323.272 L
396.523 324.603 L
396.653 325.176 L
396.784 326.012 L
396.914 326.979 L
397.045 327.422 L
397.175 328.7 L
397.305 329.221 L
397.436 329.97 L
397.566 330.872 L
397.697 331.275 L
397.827 332.355 L
397.957 332.858 L
398.088 333.574 L
398.218 334.367 L
398.349 334.716 L
398.479 335.614 L
398.609 335.968 L
398.74 336.465 L
398.87 338.037 L
399.001 338.626 L
399.131 339.344 L
399.261 339.661 L
399.392 340.1 L
399.522 340.632 L
399.653 340.865 L
399.783 341.478 L
399.913 341.743 L
400.044 342.106 L
400.174 342.551 L
400.305 342.826 L
400.435 344.143 L
400.565 344.768 L
400.696 345.614 L
400.826 346.244 L
400.957 346.438 L
401.087 346.386 L
401.217 346.364 L
401.348 346.333 L
401.478 346.296 L
401.609 346.322 L
401.739 346.673 L
401.869 346.877 L
402 347.147 L
402.13 348.227 L
402.261 348.72 L
402.391 350.185 L
402.521 350.143 L
402.652 350.087 L
402.782 349.998 L
402.913 349.937 L
403.043 349.639 L
403.173 349.297 L
403.304 348.856 L
403.434 348.285 L
403.565 348.022 L
403.695 347.23 L
403.825 346.812 L
403.956 346.28 L
404.086 345.447 L
404.217 345.092 L
404.347 344.175 L
404.477 343.885 L
404.608 343.52 L
404.738 343.086 L
404.869 342.928 L
404.999 342.667 L
405.129 342.55 L
405.26 342.404 L
405.39 342.197 L
405.521 342.116 L
405.651 341.945 L
405.781 341.885 L
405.912 341.811 L
406.042 341.612 L
406.173 341.525 L
406.303 341.288 L
406.433 341.206 L
406.564 341.108 L
406.694 340.924 L
406.825 340.855 L
406.955 340.714 L
407.085 340.658 L
407.216 340.59 L
407.346 340.571 L
407.477 340.565 L
407.607 340.555 L
407.737 340.591 L
407.868 340.633 L
407.998 340.732 L
408.129 340.786 L
408.259 340.983 L
408.389 341.504 L
408.52 342.113 L
408.65 343.063 L
408.781 343.474 L
408.911 344.589 L
409.041 345.189 L
409.172 345.882 L
409.302 346.243 L
409.432 346.392 L
409.563 346.772 L
409.693 346.964 L
409.824 347.184 L
409.954 347.523 L
410.084 347.663 L
410.215 348.015 L
410.345 348.192 L
410.476 348.391 L
410.606 347.998 L
410.736 347.852 L
410.867 347.546 L
410.997 347.321 L
411.128 347.07 L
411.258 347.484 L
411.388 347.678 L
411.519 348.256 L
411.649 348.931 L
411.78 349.675 L
411.91 351.145 L
412.04 351.689 L
412.171 352.868 L
412.301 353.327 L
412.432 353.826 L
412.562 353.767 L
412.692 353.744 L
412.823 353.689 L
412.953 354.135 L
413.084 354.615 L
413.214 354.992 L
413.344 355.082 L
413.475 355.113 L
413.605 355.148 L
413.736 355.185 L
413.866 355.188 L
413.996 355.211 L
414.127 355.334 L
414.257 355.468 L
414.388 355.609 L
414.518 355.91 L
414.648 356.074 L
414.779 356.608 L
414.909 357.321 L
415.04 358.06 L
415.17 358.243 L
415.3 358.459 L
415.431 359.392 L
415.561 359.759 L
415.692 360.134 L
415.822 360.242 L
415.952 360.31 L
416.083 360.546 L
416.213 360.986 L
416.344 361.43 L
416.474 362.912 L
416.604 363.509 L
416.735 365 L
416.865 365.845 L
416.996 366.69 L
417.126 367.978 L
417.256 368.386 L
417.387 369.137 L
417.517 369.731 L
417.648 370.317 L
417.778 371.965 L
417.908 372.622 L
418.039 374.248 L
418.169 375.214 L
418.3 376.157 L
418.43 377.19 L
418.56 377.579 L
418.691 378.49 L
418.821 378.647 L
418.952 378.797 L
419.082 379.062 L
419.212 379.249 L
419.343 379.886 L
419.473 380.265 L
419.604 380.626 L
419.734 381.29 L
419.864 381.639 L
419.995 382.675 L
420.125 383.354 L
420.256 383.993 L
420.386 385.339 L
420.516 385.894 L
420.647 387.298 L
420.777 387.898 L
420.908 388.456 L
421.038 389.505 L
421.168 389.835 L
421.299 390.481 L
421.429 390.865 L
421.56 391.218 L
421.69 392.287 L
421.82 392.699 L
421.951 393.691 L
422.081 394.332 L
422.212 394.915 L
422.342 395.958 L
422.472 396.371 L
422.603 397.38 L
422.733 397.673 L
422.864 397.935 L
422.994 398.303 L
423.124 398.428 L
423.255 398.701 L
423.385 398.959 L
423.516 399.188 L
423.646 400.156 L
423.776 400.524 L
423.907 401.395 L
424.037 401.857 L
424.168 402.261 L
424.298 403.149 L
424.428 403.346 L
424.559 403.587 L
424.689 403.732 L
424.819 403.858 L
424.95 404.016 L
425.08 404.031 L
425.211 403.994 L
425.341 403.874 L
425.471 403.771 L
425.602 403.575 L
425.732 403.498 L
425.863 403.312 L
425.993 403.184 L
426.123 403.077 L
426.254 403.008 L
426.384 402.931 L
426.515 402.681 L
426.645 402.488 L
426.775 402.327 L
426.906 402.967 L
427.036 403.19 L
427.167 403.687 L
427.297 404.632 L
427.427 405.412 L
427.558 406.944 L
427.688 407.283 L
427.819 407.767 L
427.949 407.552 L
428.079 407.376 L
428.21 406.87 L
428.34 406.676 L
428.471 406.222 L
428.601 406 L
428.731 405.821 L
428.862 405.487 L
428.992 405.309 L
429.123 404.832 L
429.253 405.065 L
429.383 405.251 L
429.514 405.625 L
429.644 405.763 L
429.775 406.079 L
429.905 406.3 L
430.035 406.474 L
430.166 407.095 L
430.296 407.504 L
430.427 408.636 L
430.557 408.931 L
430.687 409.16 L
430.818 409.587 L
430.948 409.811 L
431.079 410.392 L
431.209 410.776 L
431.339 411.071 L
431.47 411.368 L
431.6 411.075 L
431.731 410.013 L
431.861 410.327 L
431.991 410.566 L
432.122 410.383 L
432.252 410.299 L
432.383 410.093 L
432.513 410.63 L
432.643 411.032 L
432.774 411.746 L
432.904 411.864 L
433.035 412.005 L
433.165 411.584 L
433.295 411.273 L
433.426 410.577 L
433.556 410.576 L
433.687 410.791 L
433.817 411.171 L
433.947 411.449 L
434.078 410.545 L
434.208 410.236 L
434.339 409.56 L
434.469 408.519 L
434.599 407.769 L
434.73 406.092 L
434.86 405.477 L
434.991 404.094 L
435.121 403.115 L
435.251 402.418 L
435.382 400.847 L
435.512 400.46 L
435.643 399.727 L
435.773 399.132 L
435.903 398.713 L
436.034 397.77 L
436.164 397.417 L
436.295 396.624 L
436.425 395.978 L
436.555 395.528 L
436.686 394.488 L
436.816 394.091 L
436.947 393.198 L
437.077 392.394 L
437.207 391.841 L
437.338 390.492 L
437.468 390.15 L
437.599 389.486 L
437.729 388.848 L
437.859 388.416 L
437.99 387.465 L
438.12 387.108 L
438.251 386.315 L
438.381 385.171 L
438.511 384.404 L
438.642 383.511 L
438.772 383.187 L
438.903 382.475 L
439.033 381.847 L
439.163 381.433 L
439.294 380.456 L
439.424 380.293 L
439.554 380.032 L
439.685 379.857 L
439.815 379.743 L
439.946 380.124 L
440.076 380.235 L
440.206 380.464 L
440.337 380.234 L
440.467 380.085 L
440.598 379.733 L
440.728 379.418 L
440.858 378.648 L
440.989 377.876 L
441.119 377.384 L
441.25 376.846 L
441.38 376.658 L
441.51 376.254 L
441.641 375.895 L
441.771 375.67 L
441.902 375.137 L
442.032 374.978 L
442.162 374.648 L
442.293 374.31 L
442.423 374.1 L
442.554 373.58 L
442.684 373.395 L
442.814 372.998 L
442.945 372.555 L
443.075 372.284 L
443.206 371.839 L
443.336 371.856 L
443.466 371.948 L
443.597 371.37 L
443.727 371.019 L
443.858 369.599 L
443.988 368.792 L
444.118 366.984 L
444.249 365.38 L
444.379 364.421 L
444.51 363.534 L
444.64 363.068 L
444.77 362.039 L
444.901 361.128 L
445.031 360.591 L
445.162 359.289 L
445.292 358.808 L
445.422 357.789 L
445.553 356.93 L
445.683 356.429 L
445.814 355.149 L
445.944 354.692 L
446.074 353.735 L
446.205 352.794 L
446.335 352.253 L
446.466 350.817 L
446.596 350.324 L
446.726 349.297 L
446.857 348.451 L
446.987 347.971 L
447.118 346.002 L
447.248 345.64 L
447.378 344.947 L
447.509 344.345 L
447.639 344.007 L
447.77 342.739 L
447.9 342.307 L
448.03 341.417 L
448.161 340.589 L
448.291 340.131 L
448.422 339.839 L
448.552 339.52 L
448.682 338.832 L
448.813 338.114 L
448.943 337.723 L
449.074 337.034 L
449.204 336.744 L
449.334 336.144 L
449.465 335.572 L
449.595 335.264 L
449.726 334.352 L
449.856 334.029 L
449.986 333.369 L
450.117 332.669 L
450.247 332.297 L
450.378 330.301 L
450.508 329.551 L
450.638 328.023 L
450.769 328.12 L
450.899 328.171 L
451.03 328.329 L
451.16 328.438 L
451.29 328.663 L
451.421 328.939 L
451.551 329.082 L
451.682 329.457 L
451.812 329.632 L
451.942 329.987 L
452.073 330.387 L
452.203 330.592 L
452.334 331.344 L
452.464 331.605 L
452.594 332.129 L
452.725 332.609 L
452.855 332.851 L
452.986 333.558 L
453.116 333.718 L
453.246 334.039 L
453.377 334.346 L
453.507 334.501 L
453.638 334.953 L
453.768 335.12 L
453.898 335.447 L
454.029 335.826 L
454.159 336.015 L
454.289 336.727 L
454.42 336.99 L
454.55 337.501 L
454.681 338.027 L
454.811 338.289 L
454.941 339.072 L
455.072 339.356 L
455.202 339.901 L
455.333 339.815 L
455.463 339.773 L
455.593 339.672 L
455.724 339.669 L
455.854 339.665 L
455.985 339.667 L
456.115 339.668 L
456.245 339.694 L
456.376 339.715 L
456.506 339.755 L
456.637 339.325 L
456.767 339.114 L
456.897 338.498 L
457.028 338.277 L
457.158 337.871 L
457.289 337.444 L
457.419 337.253 L
457.549 337.478 L
457.68 337.573 L
457.81 337.745 L
457.941 337.963 L
458.071 338.069 L
458.201 338.392 L
458.332 338.516 L
458.462 338.74 L
458.593 339.002 L
458.723 339.13 L
458.853 339.536 L
458.984 339.689 L
459.114 339.959 L
459.245 340.239 L
459.375 340.37 L
459.505 340.642 L
459.636 340.734 L
459.766 340.893 L
459.897 341.085 L
460.027 341.159 L
460.157 340.871 L
460.288 340.755 L
460.418 340.554 L
460.549 340.797 L
460.679 340.912 L
460.809 341.244 L
460.94 341.368 L
461.07 341.581 L
461.201 341.426 L
461.331 341.373 L
461.461 341.68 L
461.592 341.968 L
461.722 342.453 L
461.853 342.982 L
461.983 343.236 L
462.113 344.024 L
462.244 344.282 L
462.374 344.71 L
462.505 345.112 L
462.635 345.3 L
462.765 345.809 L
462.896 345.915 L
463.026 346.091 L
463.157 346.286 L
463.287 346.401 L
463.417 347.134 L
463.548 347.097 L
463.678 347.037 L
463.809 346.967 L
463.939 346.978 L
464.069 347.705 L
464.2 347.907 L
464.33 348.232 L
464.461 348.164 L
464.591 348.131 L
464.721 348.028 L
464.852 347.981 L
464.982 347.907 L
465.113 347.815 L
465.243 347.772 L
465.373 347.64 L
465.504 347.583 L
465.634 347.494 L
465.765 347.143 L
465.895 346.977 L
466.025 346.461 L
466.156 346.245 L
466.286 345.913 L
466.417 345.549 L
466.547 345.385 L
466.677 344.966 L
466.808 344.838 L
466.938 344.643 L
467.069 344.384 L
467.199 344.265 L
467.329 343.924 L
467.46 343.749 L
467.59 343.486 L
467.721 343.179 L
467.851 343.04 L
467.981 342.648 L
468.112 342.455 L
468.242 342.169 L
468.372 341.741 L
468.503 341.532 L
468.633 340.816 L
468.764 340.483 L
468.894 339.995 L
469.024 339.873 L
469.155 339.817 L
469.285 339.647 L
469.416 339.634 L
469.546 339.616 L
469.676 339.602 L
469.807 339.555 L
469.937 339.042 L
470.068 338.811 L
470.198 338.48 L
470.328 338.051 L
470.459 337.858 L
470.589 337.309 L
470.72 337.035 L
470.85 336.649 L
470.98 336.635 L
471.111 336.637 L
471.241 336.704 L
471.372 336.74 L
471.502 336.789 L
471.632 336.791 L
471.763 336.731 L
471.893 336.092 L
472.024 335.799 L
472.154 335.396 L
472.284 334.981 L
472.415 334.779 L
472.545 334.088 L
472.676 334.059 L
472.806 334.021 L
472.936 333.986 L
473.067 333.971 L
473.197 333.924 L
473.328 333.918 L
473.458 333.911 L
473.588 333.986 L
473.719 334.012 L
473.849 334.028 L
473.98 333.871 L
474.11 333.663 L
474.24 333.385 L
474.371 333.248 L
474.501 332.777 L
474.632 332.821 L
474.762 332.879 L
474.892 332.974 L
475.023 333.014 L
475.153 333.109 L
475.284 332.732 L
475.414 332.244 L
475.544 331.015 L
475.675 330.472 L
475.805 328.955 L
475.936 328.277 L
476.066 327.41 L
476.196 326.336 L
476.327 325.88 L
476.457 324.708 L
476.588 324.137 L
476.718 323.415 L
476.848 322.409 L
476.979 321.961 L
477.109 320.699 L
477.24 320.078 L
477.37 319.303 L
477.5 318.216 L
477.631 317.828 L
477.761 317.211 L
477.892 316.901 L
478.022 316.519 L
478.152 315.982 L
478.283 315.717 L
478.413 314.841 L
478.544 314.454 L
478.674 313.983 L
478.804 313.326 L
478.935 313.052 L
479.065 312.353 L
479.196 311.863 L
479.326 311.274 L
479.456 310.482 L
479.587 310.19 L
479.717 309.621 L
479.848 309.775 L
479.978 309.959 L
480.108 309.717 L
480.239 309.725 L
480.369 310.222 L
480.5 310.421 L
480.63 310.655 L
480.76 309.402 L
480.891 308.897 L
481.021 307.681 L
481.152 307.324 L
481.282 306.909 L
481.412 306.302 L
481.543 306.049 L
481.673 305.398 L
481.804 305.191 L
481.934 304.955 L
482.064 303.963 L
482.195 303.693 L
482.325 303.555 L
482.456 303.469 L
482.586 303.372 L
482.716 303.277 L
482.847 303.35 L
482.977 303.949 L
483.108 304.21 L
483.238 304.502 L
483.368 305.052 L
483.499 305.24 L
483.629 305.578 L
483.759 305.922 L
483.89 306.302 L
484.02 306.912 L
484.151 307.168 L
484.281 307.839 L
484.411 308.228 L
484.542 308.653 L
484.672 309.306 L
484.803 309.485 L
484.933 309.651 L
485.063 309.754 L
485.194 309.866 L
485.324 310.154 L
485.455 310.355 L
485.585 311.125 L
485.715 311.191 L
485.846 311.262 L
485.976 311.389 L
486.107 311.422 L
486.237 311.444 L
486.367 311.461 L
486.498 311.478 L
486.628 311.399 L
486.759 311.183 L
486.889 310.103 L
487.019 309.531 L
487.15 308.936 L
487.28 307.971 L
487.411 307.735 L
487.541 307.573 L
487.671 306.629 L
487.802 305.657 L
487.932 303.988 L
488.063 303.312 L
488.193 301.612 L
488.323 301.16 L
488.454 300.7 L
488.584 300.173 L
488.715 299.958 L
488.845 299.413 L
488.975 299.025 L
489.106 298.634 L
489.236 298.426 L
489.367 298.218 L
489.497 297.394 L
489.627 296.885 L
489.758 296.378 L
489.888 295.535 L
490.019 295.192 L
490.149 294.322 L
490.279 293.734 L
490.41 293.156 L
490.54 292.126 L
490.671 291.806 L
490.801 291.219 L
490.931 290.857 L
491.062 290.507 L
491.192 290.03 L
491.323 289.725 L
491.453 288.72 L
491.583 288.014 L
491.714 287.337 L
491.844 286.308 L
491.975 285.938 L
492.105 285.107 L
492.235 284.948 L
492.366 284.797 L
492.496 284.599 L
492.627 284.495 L
492.757 284.187 L
492.887 283.95 L
493.018 283.728 L
493.148 283.387 L
493.279 283.394 L
493.409 283.686 L
493.539 283.871 L
493.67 284.043 L
493.8 284.449 L
493.931 284.603 L
494.061 284.97 L
494.191 284.815 L
494.322 284.673 L
494.452 283.794 L
494.583 283.445 L
494.713 282.589 L
494.843 282.034 L
494.974 281.533 L
495.104 280.526 L
495.235 280.109 L
495.365 279.058 L
495.495 278.317 L
495.626 277.657 L
495.756 276.305 L
495.887 275.861 L
496.017 274.928 L
496.147 274.311 L
496.278 273.768 L
496.408 273.395 L
496.539 273.054 L
496.669 271.926 L
496.799 271.247 L
496.93 270.656 L
497.06 269.55 L
497.191 269.152 L
497.321 268.242 L
497.451 268.187 L
497.582 268.14 L
497.712 268.047 L
497.842 268.009 L
497.973 267.917 L
498.103 267.851 L
498.234 267.795 L
498.364 267.68 L
498.495 267.572 L
498.625 267.224 L
498.755 267.418 L
498.886 267.582 L
499.016 266.945 L
499.146 266.707 L
499.277 266.151 L
499.407 265.729 L
499.538 265.38 L
499.668 263.987 L
499.798 263.302 L
499.929 261.49 L
500.059 260.067 L
500.19 258.902 L
500.32 256.875 L
500.45 256.042 L
500.581 254.014 L
500.711 252.656 L
500.842 251.557 L
500.972 249.384 L
501.102 248.561 L
501.233 246.639 L
501.363 245.276 L
501.494 244.185 L
501.624 242.552 L
501.754 241.968 L
501.885 240.646 L
502.015 239.65 L
502.146 238.863 L
502.276 236.783 L
502.406 236.002 L
502.537 234.195 L
502.667 232.875 L
502.798 231.845 L
502.928 229.77 L
503.058 229.004 L
503.189 227.25 L
503.319 226.482 L
503.45 225.89 L
503.58 225.731 L
503.71 225.645 L
503.841 225.421 L
503.971 225.254 L
504.102 225.126 L
504.232 223.978 L
504.362 223.793 L
504.493 223.597 L
504.623 223.451 L
504.754 223.341 L
504.884 223.107 L
505.014 222.775 L
505.145 221.795 L
505.275 221.211 L
505.406 220.777 L
505.536 219.868 L
505.666 219.526 L
505.797 218.746 L
505.927 217.952 L
506.058 217.369 L
506.188 216.145 L
506.318 215.697 L
506.449 214.686 L
506.579 213.907 L
506.71 213.343 L
506.84 212.115 L
506.97 211.667 L
507.101 210.659 L
507.231 209.962 L
507.362 209.463 L
507.492 208.239 L
507.622 207.792 L
507.753 206.792 L
507.883 206.004 L
508.014 205.446 L
508.144 204.206 L
508.274 203.793 L
508.405 202.898 L
508.535 202.108 L
508.666 201.557 L
508.796 201.156 L
508.926 201.012 L
509.057 200.693 L
509.187 200.454 L
509.318 200.29 L
509.448 199.941 L
509.578 199.83 L
509.709 199.596 L
509.839 199.354 L
509.97 199.19 L
510.1 198.904 L
510.23 198.801 L
510.361 198.574 L
510.491 198.39 L
510.622 198.266 L
510.752 197.979 L
510.882 198.075 L
511.013 198.399 L
511.143 198.683 L
511.274 198.872 L
511.404 199.345 L
511.534 199.513 L
511.665 199.879 L
511.795 200.159 L
511.926 200.343 L
512.056 200.704 L
512.186 200.859 L
512.317 201.21 L
512.447 201.604 L
512.578 201.859 L
512.708 202.436 L
512.838 202.64 L
512.969 203.083 L
513.099 203.014 L
513.229 202.97 L
513.36 202.867 L
513.49 202.833 L
513.621 202.761 L
513.751 202.703 L
513.881 202.666 L
514.012 202.583 L
514.142 202.554 L
514.273 202.494 L
514.403 202.446 L
514.533 202.415 L
514.664 202.346 L
514.794 202.322 L
514.925 202.27 L
515.055 202.229 L
515.185 202.204 L
515.316 202.148 L
515.446 202.13 L
515.577 202.093 L
515.707 202.082 L
515.837 202.076 L
515.968 202.078 L
516.098 202.081 L
516.229 202.089 L
516.359 202.102 L
516.489 202.11 L
516.62 203.097 L
516.75 203.489 L
516.881 204.334 L
517.011 205.081 L
517.141 205.524 L
517.272 206.67 L
517.402 207.023 L
517.533 207.753 L
517.663 208.409 L
517.793 208.793 L
517.924 209.796 L
518.054 210.144 L
518.185 210.874 L
518.315 211.534 L
518.445 211.916 L
518.576 212.922 L
518.706 213.267 L
518.837 213.986 L
518.967 214.636 L
519.097 215.007 L
519.228 216.035 L
519.358 216.392 L
519.489 217.134 L
519.619 217.81 L
519.749 218.191 L
519.88 219.216 L
520.01 219.57 L
520.141 220.301 L
520.271 220.982 L
520.401 221.361 L
520.532 222.399 L
520.662 222.755 L
520.793 223.489 L
520.923 224.182 L
521.053 224.562 L
521.184 225.619 L
521.314 225.981 L
521.445 226.723 L
521.575 227.425 L
521.705 227.806 L
521.836 228.873 L
521.966 229.288 L
522.097 230.141 L
522.227 231.211 L
522.357 231.782 L
522.488 233.403 L
522.618 233.953 L
522.749 235.07 L
522.879 235.894 L
523.009 236.328 L
523.14 237.572 L
523.27 237.993 L
523.401 238.844 L
523.531 239.674 L
523.661 240.106 L
523.792 242.061 L
523.922 242.514 L
524.053 243.417 L
524.183 244.227 L
524.313 244.642 L
524.444 245.846 L
524.574 246.246 L
524.705 247.046 L
524.835 247.821 L
524.965 248.213 L
525.096 249.342 L
525.226 249.757 L
525.357 250.586 L
525.487 251.385 L
525.617 251.786 L
525.748 252.982 L
525.878 253.141 L
526.009 253.457 L
526.139 253.774 L
526.269 253.932 L
526.4 254.397 L
526.53 254.555 L
526.661 254.862 L
526.791 254.581 L
526.921 254.442 L
527.052 254.007 L
527.182 253.839 L
527.313 253.516 L
527.443 253.184 L
527.573 253.019 L
527.704 252.53 L
527.834 252.358 L
527.965 252.033 L
528.095 251.679 L
528.225 251.51 L
528.356 251.314 L
528.486 251.244 L
528.616 251.113 L
528.747 250.972 L
528.877 250.904 L
529.008 250.737 L
529.138 250.677 L
529.268 250.565 L
529.399 250.444 L
529.529 250.385 L
529.66 250.175 L
529.79 250.107 L
529.92 249.982 L
530.051 249.676 L
530.181 249.546 L
530.312 249.945 L
530.442 250.11 L
530.572 250.407 L
530.703 251.213 L
530.833 251.602 L
530.964 252.685 L
531.094 252.793 L
531.224 252.985 L
531.355 253.301 L
531.485 253.45 L
531.616 253.778 L
531.746 254.011 L
531.876 254.421 L
532.007 254.677 L
532.137 254.8 L
532.268 255.162 L
532.398 255.29 L
532.528 255.513 L
532.659 255.754 L
532.789 255.845 L
532.92 255.482 L
533.05 255.538 L
533.18 255.634 L
533.311 255.702 L
533.441 255.729 L
533.572 255.687 L
533.702 255.447 L
533.832 255.042 L
533.963 254.612 L
534.093 254.409 L
534.224 253.853 L
534.354 253.638 L
534.484 253.278 L
534.615 252.874 L
534.745 252.724 L
534.876 253.079 L
535.006 253.289 L
535.136 253.634 L
535.267 253.949 L
535.397 254.098 L
535.528 254.53 L
535.658 254.333 L
535.788 254.012 L
535.919 254.388 L
536.049 254.564 L
536.18 255.067 L
536.31 255.274 L
536.44 255.608 L
536.571 255.262 L
536.701 255.162 L
536.832 255.818 L
536.962 256.091 L
537.092 256.525 L
537.223 257.012 L
537.353 257.218 L
537.484 257.525 L
537.614 257.605 L
537.744 257.731 L
537.875 257.88 L
538.005 257.956 L
538.136 258.277 L
538.266 258.41 L
538.396 258.615 L
538.527 258.86 L
538.657 258.981 L
538.788 259.427 L
538.918 259.404 L
539.048 259.37 L
539.179 259.327 L
539.309 259.298 L
539.44 259.11 L
539.57 259.183 L
539.7 259.295 L
539.831 259.534 L
539.961 259.643 L
540.092 259.947 L
540.222 260.378 L
540.352 261.022 L
540.483 261.295 L
540.613 261.466 L
540.744 262.421 L
540.874 262.893 L
541.004 263.589 L
541.135 264.508 L
541.265 264.919 L
541.396 266.012 L
541.526 266.187 L
541.656 266.44 L
541.787 266.782 L
541.917 266.928 L
542.047 267.249 L
542.178 267.348 L
542.308 267.489 L
542.439 268.226 L
542.569 268.617 L
542.699 270.224 L
542.83 270.962 L
542.96 272.009 L
543.091 273.343 L
543.221 273.938 L
543.352 275.553 L
543.482 276.254 L
543.612 277.237 L
543.743 278.513 L
543.873 279.095 L
544.003 280.798 L
544.134 281.564 L
544.264 282.623 L
544.395 283.995 L
544.525 284.54 L
544.655 285.543 L
544.786 286.021 L
544.916 286.674 L
545.047 287.292 L
545.177 287.566 L
545.307 288.32 L
545.438 288.688 L
545.568 289.184 L
545.699 289.857 L
545.829 290.119 L
545.959 290.591 L
546.09 290.803 L
546.22 291.087 L
546.351 291.488 L
546.481 291.66 L
546.611 292.105 L
546.742 292.428 L
546.872 292.855 L
547.003 292.779 L
547.133 292.741 L
547.263 292.612 L
547.394 292.253 L
547.524 291.785 L
547.655 291.504 L
547.785 291.456 L
547.915 291.779 L
548.046 292.249 L
548.176 292.854 L
548.307 293.89 L
548.437 294.307 L
548.567 295.237 L
548.698 295.817 L
548.828 296.554 L
548.959 297.444 L
549.089 297.812 L
549.219 298.702 L
549.35 299.141 L
549.48 299.691 L
549.611 301.124 L
549.741 301.679 L
549.871 302.839 L
550.002 303.389 L
550.132 304.071 L
550.263 305.134 L
550.393 305.643 L
550.523 307.259 L
550.654 308.127 L
550.784 309.192 L
550.915 310.681 L
551.045 311.227 L
551.175 312.233 L
551.306 312.734 L
551.436 313.341 L
551.567 313.468 L
551.697 313.496 L
551.827 313.453 L
551.958 313.45 L
552.088 313.446 L
552.219 313.52 L
552.349 313.769 L
552.479 315.39 L
552.61 315.759 L
552.74 316.196 L
552.871 316.832 L
553.001 317.099 L
553.131 317.796 L
553.262 318.315 L
553.392 318.921 L
553.523 318.925 L
553.653 318.926 L
553.783 318.928 L
553.914 318.925 L
554.044 318.922 L
554.175 319.2 L
554.305 319.335 L
554.435 319.756 L
554.566 320.018 L
554.696 320.316 L
554.827 320.66 L
554.957 320.807 L
555.087 321.201 L
555.218 321.368 L
555.348 321.556 L
555.479 321.733 L
555.609 321.927 L
555.739 322.863 L
555.87 323.376 L
556 323.946 L
556.13 324.938 L
556.261 325.347 L
556.391 326.397 L
556.522 326.909 L
556.652 327.471 L
556.782 328.335 L
556.913 328.56 L
557.043 328.692 L
557.174 328.762 L
557.304 328.838 L
557.435 328.934 L
557.565 328.969 L
557.695 329.046 L
557.826 329.059 L
557.956 329.072 L
558.086 329.162 L
558.217 329.183 L
558.347 329.188 L
558.478 329.189 L
558.608 329.19 L
558.739 329.187 L
558.869 329.185 L
558.999 329.177 L
559.13 328.807 L
559.26 328.42 L
559.391 327.048 L
559.521 326.484 L
559.651 325.048 L
559.782 324.138 L
559.912 323.195 L
560.042 321.689 L
560.173 321.117 L
560.303 319.783 L
560.434 319.001 L
560.564 318.201 L
560.694 316.8 L
560.825 316.24 L
560.955 314.856 L
561.086 314.037 L
561.216 313.21 L
561.346 312.441 L
561.477 312.13 L
561.607 311.352 L
561.738 310.882 L
561.868 310.412 L
561.998 309.734 L
562.129 309.569 L
562.259 309.423 L
562.39 309.297 L
562.52 309.173 L
562.65 309.257 L
562.781 309.291 L
562.911 309.376 L
563.042 309.041 L
563.172 308.715 L
563.302 308.104 L
563.433 307.87 L
563.563 307.313 L
563.694 306.986 L
563.824 306.671 L
563.954 306.682 L
564.085 306.68 L
564.215 306.667 L
564.346 306.449 L
564.476 306.241 L
564.606 305.951 L
564.737 305.514 L
564.867 303.777 L
564.998 302.603 L
565.128 301.5 L
565.258 299.66 L
565.389 299.082 L
565.519 297.959 L
565.65 297.326 L
565.78 296.738 L
565.91 295.822 L
566.041 295.455 L
566.171 294.547 L
566.302 293.751 L
566.432 293.02 L
566.562 291.642 L
566.693 291.074 L
566.823 289.644 L
566.954 288.659 L
567.084 287.766 L
567.214 286.145 L
567.345 285.457 L
567.475 283.696 L
567.606 282.52 L
567.736 281.466 L
567.866 280.192 L
567.997 279.702 L
568.127 278.53 L
568.258 277.732 L
568.388 277.024 L
568.518 275.639 L
568.649 275.116 L
568.779 273.884 L
568.91 273.006 L
569.04 272.237 L
569.17 270.112 L
569.301 269.286 L
569.431 267.301 L
569.562 265.941 L
569.692 264.766 L
569.822 262.497 L
569.953 261.759 L
570.083 260.207 L
570.214 259.117 L
570.344 258.186 L
570.474 256.386 L
570.605 255.698 L
570.735 254.071 L
570.866 252.927 L
570.996 251.961 L
571.126 250.031 L
571.257 249.273 L
571.387 247.454 L
571.518 246.185 L
571.648 245.126 L
571.778 243.029 L
571.909 242.246 L
572.039 240.423 L
572.169 239.522 L
572.3 238.781 L
572.43 236.678 L
572.561 235.87 L
572.691 233.964 L
572.822 232.594 L
572.952 231.48 L
573.082 229.217 L
573.213 228.359 L
573.343 226.351 L
573.473 224.928 L
573.604 223.783 L
573.734 221.525 L
573.865 220.678 L
573.995 218.709 L
574.125 217.308 L
574.256 216.195 L
574.386 213.959 L
574.517 213.106 L
574.647 211.115 L
574.777 209.664 L
574.908 208.526 L
575.038 207.002 L
575.169 206.46 L
575.299 205.239 L
575.429 204.378 L
575.56 203.71 L
575.69 202.33 L
575.821 201.733 L
575.951 200.277 L
576.081 199.716 L
576.212 199.286 L
576.342 198.417 L
576.473 198.13 L
576.603 197.511 L
576.733 197.159 L
576.864 196.893 L
576.994 196.197 L
577.125 195.931 L
577.255 195.316 L
577.385 194.864 L
577.516 194.526 L
577.646 193.854 L
577.777 193.618 L
577.907 193.09 L
578.037 192.69 L
578.168 192.396 L
578.298 191.212 L
578.429 190.765 L
578.559 189.745 L
578.689 188.87 L
578.82 188.233 L
578.95 185.653 L
579.081 184.698 L
579.211 182.538 L
579.341 180.913 L
579.472 179.742 L
579.602 177.204 L
579.733 176.599 L
579.863 175.484 L
579.993 174.672 L
580.124 174.094 L
580.254 172.805 L
580.385 172.326 L
580.515 171.247 L
580.645 170.019 L
580.776 169.156 L
580.906 167.313 L
581.037 166.848 L
581.167 165.953 L
581.297 165.33 L
581.428 164.898 L
581.558 164.851 L
581.689 164.873 L
581.819 164.944 L
581.949 164.977 L
582.08 164.999 L
582.21 164.266 L
582.341 164.018 L
582.471 163.482 L
582.601 163.053 L
582.732 162.763 L
582.862 162.112 L
582.993 161.941 L
583.123 161.604 L
583.253 161.385 L
583.384 161.239 L
583.514 161.047 L
583.645 161.012 L
583.775 160.953 L
583.905 160.999 L
584.036 161.029 L
584.166 161.2 L
584.297 161.268 L
584.427 161.419 L
584.557 161.543 L
584.688 161.624 L
584.818 161.814 L
584.949 161.681 L
585.079 161.299 L
585.209 161.018 L
585.34 160.837 L
585.47 160.376 L
585.601 160.204 L
585.731 159.831 L
585.861 159.602 L
585.992 159.456 L
586.122 159.117 L
586.253 158.968 L
586.383 158.637 L
586.513 158.395 L
586.644 158.242 L
586.774 157.863 L
586.904 157.729 L
587.035 157.441 L
587.165 157.201 L
587.296 157.052 L
587.426 156.697 L
587.556 156.623 L
587.687 156.484 L
587.817 156.394 L
587.948 156.339 L
588.078 156.214 L
588.208 156.129 L
588.339 155.935 L
588.469 155.706 L
588.6 155.568 L
588.73 154.953 L
588.86 154.539 L
588.991 153.6 L
589.121 152.777 L
589.252 152.287 L
589.382 150.96 L
589.512 150.651 L
589.643 150.041 L
589.773 149.523 L
589.904 149.218 L
590.034 148.444 L
590.164 148.171 L
590.295 147.597 L
590.425 146.837 L
590.556 146.396 L
590.686 145.361 L
590.816 145.099 L
590.947 144.574 L
591.077 144.082 L
591.208 143.799 L
591.338 143.089 L
591.468 142.847 L
591.599 142.344 L
591.729 141.877 L
591.86 141.613 L
591.99 140.77 L
592.12 140.46 L
592.251 139.814 L
592.381 139.209 L
592.512 138.87 L
592.642 138.288 L
592.772 138.08 L
592.903 137.648 L
593.033 137.227 L
593.164 136.994 L
593.294 136.336 L
593.424 136.046 L
593.555 135.442 L
593.685 134.847 L
593.816 134.523 L
593.946 133.596 L
594.076 133.384 L
594.207 132.963 L
594.337 132.548 L
594.468 132.325 L
594.598 131.66 L
594.728 131.434 L
594.859 130.975 L
594.989 130.922 L
595.12 130.894 L
595.25 130.852 L
595.38 130.842 L
595.511 130.822 L
595.641 131.213 L
595.772 131.418 L
595.902 131.664 L
596.032 131.754 L
596.163 131.936 L
596.293 132.115 L
596.424 132.207 L
596.554 131.96 L
596.684 131.867 L
596.815 131.682 L
596.945 131.463 L
597.076 131.352 L
597.206 131.019 L
597.336 130.948 L
597.467 130.806 L
597.597 130.604 L
597.728 130.502 L
597.858 129.258 L
597.988 128.794 L
598.119 127.871 L
598.249 126.879 L
598.38 126.382 L
598.51 124.747 L
598.64 124.217 L
598.771 123.175 L
598.901 122.058 L
599.032 121.502 L
599.162 119.788 L
599.292 119.295 L
599.423 118.339 L
599.553 117.339 L
599.684 116.844 L
599.814 115.407 L
599.944 114.915 L
600.075 113.974 L
600.205 113.406 L
600.336 113.124 L
600.466 112.183 L
600.596 111.39 L
600.727 109.892 L
600.857 108.344 L
600.987 107.583 L
601.118 105.336 L
601.248 104.565 L
601.379 103.126 L
601.509 102.124 L
601.639 101.662 L
601.77 101.76 L
601.9 101.805 L
602.031 101.886 L
602.161 102.011 L
602.292 102.073 L
602.422 102.263 L
602.552 102.275 L
602.683 102.296 L
602.813 102.27 L
602.943 102.26 L
603.074 102.348 L
603.204 102.368 L
603.335 102.404 L
603.465 102.539 L
603.596 102.605 L
603.726 102.783 L
603.856 102.585 L
603.987 102.234 L
604.117 101.854 L
604.247 101.668 L
604.378 101.004 L
604.508 100.756 L
604.639 100.322 L
604.769 99.846 L
604.899 99.623 L
605.03 99.103 L
605.16 98.958 L
605.291 98.707 L
605.421 98.703 L
605.551 98.701 L
605.682 98.694 L
605.812 98.691 L
605.943 98.686 L
606.073 98.801 L
606.203 98.83 L
606.334 98.362 L
606.464 98.192 L
606.595 97.907 L
606.725 97.582 L
606.855 97.428 L
606.986 96.993 L
607.116 97.107 L
607.247 97.297 L
607.377 97.37 L
607.507 97.42 L
607.638 97.853 L
607.768 98.026 L
607.899 98.311 L
608.029 98.765 L
608.159 98.977 L
608.29 99.581 L
608.42 99.76 L
608.551 100.049 L
608.681 100.389 L
608.811 100.547 L
608.942 100.998 L
609.072 101.188 L
609.203 101.492 L
609.333 101.844 L
609.463 102.005 L
609.594 102.443 L
609.724 102.615 L
609.855 102.885 L
609.985 157.384 L
610.115 178.326 L
610.246 178.194 L
610.376 177.884 L
610.507 177.402 L
610.637 176.872 L
610.767 176.605 L
610.898 175.568 L
611.028 175.124 L
611.159 174.441 L
611.289 174.183 L
611.419 174.068 L
611.55 173.79 L
611.68 173.647 L
611.811 173.43 L
611.941 173.133 L
612.071 172.951 L
612.202 171.917 L
612.332 171.478 L
612.463 170.82 L
612.593 170.318 L
612.723 170.083 L
612.854 169.355 L
612.984 169.425 L
613.115 169.528 L
613.245 169.656 L
613.375 169.705 L
613.506 169.755 L
613.636 169.428 L
613.767 168.95 L
613.897 168.345 L
614.027 168.058 L
614.158 167.141 L
614.288 166.749 L
614.419 166.181 L
614.549 165.794 L
614.679 165.626 L
614.81 165.225 L
614.94 165.115 L
615.07 164.957 L
615.201 164.847 L
615.331 164.798 L
615.462 164.669 L
615.592 164.749 L
615.723 164.862 L
615.853 165.048 L
615.983 165.059 L
616.114 164.498 L
616.244 164.227 L
616.375 163.849 L
616.505 163.395 L
616.635 163.203 L
616.766 162.744 L
616.896 162.498 L
617.026 162.159 L
617.157 161.806 L
617.287 161.734 L
617.418 162.166 L
617.548 162.389 L
617.679 162.693 L
617.809 163.14 L
617.939 163.346 L
618.07 163.966 L
618.2 163.923 L
618.33 163.866 L
618.461 163.704 L
618.591 163.637 L
618.722 163.484 L
618.852 163.405 L
618.982 163.301 L
619.113 163.212 L
619.243 163.183 L
619.374 163.176 L
619.504 163.228 L
619.634 163.297 L
619.765 163.412 L
619.895 163.469 L
620.026 163.668 L
620.156 163.729 L
620.286 163.808 L
620.417 163.969 L
620.547 164.139 L
620.678 165.189 L
620.808 165.743 L
620.938 166.452 L
621.069 167.49 L
621.199 167.951 L
621.33 169.255 L
621.46 169.945 L
621.59 170.815 L
621.721 172.05 L
621.851 172.583 L
621.982 174.014 L
622.112 174.74 L
622.242 175.645 L
622.373 176.944 L
622.503 177.503 L
622.634 179.002 L
622.764 179.815 L
622.894 180.817 L
623.025 182.282 L
623.155 182.912 L
623.286 184.595 L
623.416 185.408 L
623.546 186.397 L
623.677 187.837 L
623.807 188.456 L
623.938 190.114 L
624.068 191.218 L
624.198 192.545 L
624.329 193.479 L
624.459 193.878 L
624.59 194.937 L
624.72 195.397 L
624.85 195.944 L
624.981 196.537 L
625.111 196.818 L
625.242 197.682 L
625.372 198.147 L
625.502 198.693 L
625.633 199.491 L
625.763 199.821 L
625.894 200.651 L
626.024 201.097 L
626.154 201.614 L
626.285 202.365 L
626.415 202.796 L
626.546 204.376 L
626.676 205.242 L
626.806 206.234 L
626.937 207.923 L
627.067 208.77 L
627.198 211.501 L
627.328 213.043 L
627.458 214.789 L
627.589 217.395 L
627.719 218.484 L
627.85 221.307 L
627.98 221.909 L
628.11 222.583 L
628.241 223.507 L
628.371 223.897 L
628.502 224.92 L
628.632 225.532 L
628.762 226.207 L
628.893 228.142 L
629.023 228.927 L
629.154 230.892 L
629.284 231.958 L
629.414 233.123 L
629.545 234.847 L
629.675 235.319 L
629.806 235.747 L
629.936 235.915 L
630.066 236.097 L
630.197 236.487 L
630.327 236.86 L
630.458 238.477 L
630.588 239.338 L
630.718 240.256 L
630.849 241.735 L
630.979 242.34 L
631.109 243.879 L
631.24 244.553 L
631.37 245.263 L
631.501 246.285 L
631.631 246.661 L
631.761 247.49 L
631.892 247.869 L
632.022 248.264 L
632.153 248.68 L
632.283 248.811 L
632.413 249.038 L
632.544 249.152 L
632.674 249.269 L
632.805 249.468 L
632.935 249.551 L
633.065 249.762 L
633.196 249.87 L
633.326 249.98 L
633.457 250.06 L
633.587 250.103 L
633.717 250.236 L
S
GR
%%Trailer
%%Pages: 1
%%EOF
