%!PS-Adobe-3.0 EPSF-3.0
%%Creator: (MATLAB, The Mathworks, Inc. Version 9.11.0.1837725 \(R2021b\) Update 2. Operating System: Windows 10)
%%Title: C:/Users/radac/Downloads/ato-g1_aru-rec_20230316-155745_ARU/data_in_csv/model_slope.eps
%%CreationDate: 2023-04-02T15:05:21
%%Pages: (atend)
%%BoundingBox:     0     0   420   315
%%LanguageLevel: 3
%%EndComments
%%BeginProlog
%%BeginResource: procset (Apache XML Graphics Std ProcSet) 1.2 0
%%Version: 1.2 0
%%Copyright: (Copyright 2001-2003,2010 The Apache Software Foundation. License terms: http://www.apache.org/licenses/LICENSE-2.0)
/bd{bind def}bind def
/ld{load def}bd
/GR/grestore ld
/GS/gsave ld
/RM/rmoveto ld
/C/curveto ld
/t/show ld
/L/lineto ld
/ML/setmiterlimit ld
/CT/concat ld
/f/fill ld
/N/newpath ld
/S/stroke ld
/CC/setcmykcolor ld
/A/ashow ld
/cp/closepath ld
/RC/setrgbcolor ld
/LJ/setlinejoin ld
/GC/setgray ld
/LW/setlinewidth ld
/M/moveto ld
/re {4 2 roll M
1 index 0 rlineto
0 exch rlineto
neg 0 rlineto
cp } bd
/_ctm matrix def
/_tm matrix def
/BT { _ctm currentmatrix pop matrix _tm copy pop 0 0 moveto } bd
/ET { _ctm setmatrix } bd
/iTm { _ctm setmatrix _tm concat } bd
/Tm { _tm astore pop iTm 0 0 moveto } bd
/ux 0.0 def
/uy 0.0 def
/F {
  /Tp exch def
  /Tf exch def
  Tf findfont Tp scalefont setfont
  /cf Tf def  /cs Tp def
} bd
/ULS {currentpoint /uy exch def /ux exch def} bd
/ULE {
  /Tcx currentpoint pop def
  gsave
  newpath
  cf findfont cs scalefont dup
  /FontMatrix get 0 get /Ts exch def /FontInfo get dup
  /UnderlinePosition get Ts mul /To exch def
  /UnderlineThickness get Ts mul /Tt exch def
  ux uy To add moveto  Tcx uy To add lineto
  Tt setlinewidth stroke
  grestore
} bd
/OLE {
  /Tcx currentpoint pop def
  gsave
  newpath
  cf findfont cs scalefont dup
  /FontMatrix get 0 get /Ts exch def /FontInfo get dup
  /UnderlinePosition get Ts mul /To exch def
  /UnderlineThickness get Ts mul /Tt exch def
  ux uy To add cs add moveto Tcx uy To add cs add lineto
  Tt setlinewidth stroke
  grestore
} bd
/SOE {
  /Tcx currentpoint pop def
  gsave
  newpath
  cf findfont cs scalefont dup
  /FontMatrix get 0 get /Ts exch def /FontInfo get dup
  /UnderlinePosition get Ts mul /To exch def
  /UnderlineThickness get Ts mul /Tt exch def
  ux uy To add cs 10 mul 26 idiv add moveto Tcx uy To add cs 10 mul 26 idiv add lineto
  Tt setlinewidth stroke
  grestore
} bd
/QT {
/Y22 exch store
/X22 exch store
/Y21 exch store
/X21 exch store
currentpoint
/Y21 load 2 mul add 3 div exch
/X21 load 2 mul add 3 div exch
/X21 load 2 mul /X22 load add 3 div
/Y21 load 2 mul /Y22 load add 3 div
/X22 load /Y22 load curveto
} bd
/SSPD {
dup length /d exch dict def
{
/v exch def
/k exch def
currentpagedevice k known {
/cpdv currentpagedevice k get def
v cpdv ne {
/upd false def
/nullv v type /nulltype eq def
/nullcpdv cpdv type /nulltype eq def
nullv nullcpdv or
{
/upd true def
} {
/sametype v type cpdv type eq def
sametype {
v type /arraytype eq {
/vlen v length def
/cpdvlen cpdv length def
vlen cpdvlen eq {
0 1 vlen 1 sub {
/i exch def
/obj v i get def
/cpdobj cpdv i get def
obj cpdobj ne {
/upd true def
exit
} if
} for
} {
/upd true def
} ifelse
} {
v type /dicttype eq {
v {
/dv exch def
/dk exch def
/cpddv cpdv dk get def
dv cpddv ne {
/upd true def
exit
} if
} forall
} {
/upd true def
} ifelse
} ifelse
} if
} ifelse
upd true eq {
d k v put
} if
} if
} if
} forall
d length 0 gt {
d setpagedevice
} if
} bd
/RE { % /NewFontName [NewEncodingArray] /FontName RE -
  findfont dup length dict begin
  {
    1 index /FID ne
    {def} {pop pop} ifelse
  } forall
  /Encoding exch def
  /FontName 1 index def
  currentdict definefont pop
  end
} bind def
%%EndResource
%%BeginResource: procset (Apache XML Graphics EPS ProcSet) 1.0 0
%%Version: 1.0 0
%%Copyright: (Copyright 2002-2003 The Apache Software Foundation. License terms: http://www.apache.org/licenses/LICENSE-2.0)
/BeginEPSF { %def
/b4_Inc_state save def         % Save state for cleanup
/dict_count countdictstack def % Count objects on dict stack
/op_count count 1 sub def      % Count objects on operand stack
userdict begin                 % Push userdict on dict stack
/showpage { } def              % Redefine showpage, { } = null proc
0 setgray 0 setlinecap         % Prepare graphics state
1 setlinewidth 0 setlinejoin
10 setmiterlimit [ ] 0 setdash newpath
/languagelevel where           % If level not equal to 1 then
{pop languagelevel             % set strokeadjust and
1 ne                           % overprint to their defaults.
{false setstrokeadjust false setoverprint
} if
} if
} bd
/EndEPSF { %def
count op_count sub {pop} repeat            % Clean up stacks
countdictstack dict_count sub {end} repeat
b4_Inc_state restore
} bd
%%EndResource
%FOPBeginFontDict
%%IncludeResource: font Courier-Oblique
%%IncludeResource: font Courier-BoldOblique
%%IncludeResource: font Courier-Bold
%%IncludeResource: font ZapfDingbats
%%IncludeResource: font Symbol
%%IncludeResource: font Helvetica
%%IncludeResource: font Helvetica-Oblique
%%IncludeResource: font Helvetica-Bold
%%IncludeResource: font Helvetica-BoldOblique
%%IncludeResource: font Times-Roman
%%IncludeResource: font Times-Italic
%%IncludeResource: font Times-Bold
%%IncludeResource: font Times-BoldItalic
%%IncludeResource: font Courier
%FOPEndFontDict
%%BeginResource: encoding WinAnsiEncoding
/WinAnsiEncoding [
/.notdef /.notdef /.notdef /.notdef /.notdef
/.notdef /.notdef /.notdef /.notdef /.notdef
/.notdef /.notdef /.notdef /.notdef /.notdef
/.notdef /.notdef /.notdef /.notdef /.notdef
/.notdef /.notdef /.notdef /.notdef /.notdef
/.notdef /.notdef /.notdef /.notdef /.notdef
/.notdef /.notdef /space /exclam /quotedbl
/numbersign /dollar /percent /ampersand /quotesingle
/parenleft /parenright /asterisk /plus /comma
/hyphen /period /slash /zero /one
/two /three /four /five /six
/seven /eight /nine /colon /semicolon
/less /equal /greater /question /at
/A /B /C /D /E
/F /G /H /I /J
/K /L /M /N /O
/P /Q /R /S /T
/U /V /W /X /Y
/Z /bracketleft /backslash /bracketright /asciicircum
/underscore /quoteleft /a /b /c
/d /e /f /g /h
/i /j /k /l /m
/n /o /p /q /r
/s /t /u /v /w
/x /y /z /braceleft /bar
/braceright /asciitilde /bullet /Euro /bullet
/quotesinglbase /florin /quotedblbase /ellipsis /dagger
/daggerdbl /circumflex /perthousand /Scaron /guilsinglleft
/OE /bullet /Zcaron /bullet /bullet
/quoteleft /quoteright /quotedblleft /quotedblright /bullet
/endash /emdash /asciitilde /trademark /scaron
/guilsinglright /oe /bullet /zcaron /Ydieresis
/space /exclamdown /cent /sterling /currency
/yen /brokenbar /section /dieresis /copyright
/ordfeminine /guillemotleft /logicalnot /sfthyphen /registered
/macron /degree /plusminus /twosuperior /threesuperior
/acute /mu /paragraph /middot /cedilla
/onesuperior /ordmasculine /guillemotright /onequarter /onehalf
/threequarters /questiondown /Agrave /Aacute /Acircumflex
/Atilde /Adieresis /Aring /AE /Ccedilla
/Egrave /Eacute /Ecircumflex /Edieresis /Igrave
/Iacute /Icircumflex /Idieresis /Eth /Ntilde
/Ograve /Oacute /Ocircumflex /Otilde /Odieresis
/multiply /Oslash /Ugrave /Uacute /Ucircumflex
/Udieresis /Yacute /Thorn /germandbls /agrave
/aacute /acircumflex /atilde /adieresis /aring
/ae /ccedilla /egrave /eacute /ecircumflex
/edieresis /igrave /iacute /icircumflex /idieresis
/eth /ntilde /ograve /oacute /ocircumflex
/otilde /odieresis /divide /oslash /ugrave
/uacute /ucircumflex /udieresis /yacute /thorn
/ydieresis
] def
%%EndResource
%FOPBeginFontReencode
/Courier-Oblique findfont
dup length dict begin
  {1 index /FID ne {def} {pop pop} ifelse} forall
  /Encoding WinAnsiEncoding def
  currentdict
end
/Courier-Oblique exch definefont pop
/Courier-BoldOblique findfont
dup length dict begin
  {1 index /FID ne {def} {pop pop} ifelse} forall
  /Encoding WinAnsiEncoding def
  currentdict
end
/Courier-BoldOblique exch definefont pop
/Courier-Bold findfont
dup length dict begin
  {1 index /FID ne {def} {pop pop} ifelse} forall
  /Encoding WinAnsiEncoding def
  currentdict
end
/Courier-Bold exch definefont pop
/Helvetica findfont
dup length dict begin
  {1 index /FID ne {def} {pop pop} ifelse} forall
  /Encoding WinAnsiEncoding def
  currentdict
end
/Helvetica exch definefont pop
/Helvetica-Oblique findfont
dup length dict begin
  {1 index /FID ne {def} {pop pop} ifelse} forall
  /Encoding WinAnsiEncoding def
  currentdict
end
/Helvetica-Oblique exch definefont pop
/Helvetica-Bold findfont
dup length dict begin
  {1 index /FID ne {def} {pop pop} ifelse} forall
  /Encoding WinAnsiEncoding def
  currentdict
end
/Helvetica-Bold exch definefont pop
/Helvetica-BoldOblique findfont
dup length dict begin
  {1 index /FID ne {def} {pop pop} ifelse} forall
  /Encoding WinAnsiEncoding def
  currentdict
end
/Helvetica-BoldOblique exch definefont pop
/Times-Roman findfont
dup length dict begin
  {1 index /FID ne {def} {pop pop} ifelse} forall
  /Encoding WinAnsiEncoding def
  currentdict
end
/Times-Roman exch definefont pop
/Times-Italic findfont
dup length dict begin
  {1 index /FID ne {def} {pop pop} ifelse} forall
  /Encoding WinAnsiEncoding def
  currentdict
end
/Times-Italic exch definefont pop
/Times-Bold findfont
dup length dict begin
  {1 index /FID ne {def} {pop pop} ifelse} forall
  /Encoding WinAnsiEncoding def
  currentdict
end
/Times-Bold exch definefont pop
/Times-BoldItalic findfont
dup length dict begin
  {1 index /FID ne {def} {pop pop} ifelse} forall
  /Encoding WinAnsiEncoding def
  currentdict
end
/Times-BoldItalic exch definefont pop
/Courier findfont
dup length dict begin
  {1 index /FID ne {def} {pop pop} ifelse} forall
  /Encoding WinAnsiEncoding def
  currentdict
end
/Courier exch definefont pop
%FOPEndFontReencode
%%EndProlog
%%Page: 1 1
%%PageBoundingBox: 0 0 420 315
%%BeginPageSetup
[1 0 0 -1 0 315] CT
%%EndPageSetup
GS
[0.6 0 0 0.6 0 0] CT
1 GC
N
0 0 700 525 re
f
GR
GS
[0.6 0 0 0.6 0 0] CT
1 GC
N
0 0 700 525 re
f
GR
GS
[0.6 0 0 0.6 0 0] CT
1 GC
N
91 467 M
634 467 L
634 39 L
91 39 L
cp
f
GR
GS
[0.6 0 0 0.6 0 0] CT
0.149 GC
2 setlinecap
1 LJ
0.833 LW
N
91 467 M
634 467 L
S
GR
GS
[0.6 0 0 0.6 0 0] CT
0.149 GC
2 setlinecap
1 LJ
0.833 LW
N
91 39 M
634 39 L
S
GR
GS
[0.6 0 0 0.6 0 0] CT
0.149 GC
2 setlinecap
1 LJ
0.833 LW
N
91 467 M
91 461.57 L
S
GR
GS
[0.6 0 0 0.6 0 0] CT
0.149 GC
2 setlinecap
1 LJ
0.833 LW
N
151.333 467 M
151.333 461.57 L
S
GR
GS
[0.6 0 0 0.6 0 0] CT
0.149 GC
2 setlinecap
1 LJ
0.833 LW
N
211.667 467 M
211.667 461.57 L
S
GR
GS
[0.6 0 0 0.6 0 0] CT
0.149 GC
2 setlinecap
1 LJ
0.833 LW
N
272 467 M
272 461.57 L
S
GR
GS
[0.6 0 0 0.6 0 0] CT
0.149 GC
2 setlinecap
1 LJ
0.833 LW
N
332.333 467 M
332.333 461.57 L
S
GR
GS
[0.6 0 0 0.6 0 0] CT
0.149 GC
2 setlinecap
1 LJ
0.833 LW
N
392.667 467 M
392.667 461.57 L
S
GR
GS
[0.6 0 0 0.6 0 0] CT
0.149 GC
2 setlinecap
1 LJ
0.833 LW
N
453 467 M
453 461.57 L
S
GR
GS
[0.6 0 0 0.6 0 0] CT
0.149 GC
2 setlinecap
1 LJ
0.833 LW
N
513.333 467 M
513.333 461.57 L
S
GR
GS
[0.6 0 0 0.6 0 0] CT
0.149 GC
2 setlinecap
1 LJ
0.833 LW
N
573.667 467 M
573.667 461.57 L
S
GR
GS
[0.6 0 0 0.6 0 0] CT
0.149 GC
2 setlinecap
1 LJ
0.833 LW
N
634 467 M
634 461.57 L
S
GR
GS
[0.6 0 0 0.6 0 0] CT
0.149 GC
2 setlinecap
1 LJ
0.833 LW
N
91 39 M
91 44.43 L
S
GR
GS
[0.6 0 0 0.6 0 0] CT
0.149 GC
2 setlinecap
1 LJ
0.833 LW
N
151.333 39 M
151.333 44.43 L
S
GR
GS
[0.6 0 0 0.6 0 0] CT
0.149 GC
2 setlinecap
1 LJ
0.833 LW
N
211.667 39 M
211.667 44.43 L
S
GR
GS
[0.6 0 0 0.6 0 0] CT
0.149 GC
2 setlinecap
1 LJ
0.833 LW
N
272 39 M
272 44.43 L
S
GR
GS
[0.6 0 0 0.6 0 0] CT
0.149 GC
2 setlinecap
1 LJ
0.833 LW
N
332.333 39 M
332.333 44.43 L
S
GR
GS
[0.6 0 0 0.6 0 0] CT
0.149 GC
2 setlinecap
1 LJ
0.833 LW
N
392.667 39 M
392.667 44.43 L
S
GR
GS
[0.6 0 0 0.6 0 0] CT
0.149 GC
2 setlinecap
1 LJ
0.833 LW
N
453 39 M
453 44.43 L
S
GR
GS
[0.6 0 0 0.6 0 0] CT
0.149 GC
2 setlinecap
1 LJ
0.833 LW
N
513.333 39 M
513.333 44.43 L
S
GR
GS
[0.6 0 0 0.6 0 0] CT
0.149 GC
2 setlinecap
1 LJ
0.833 LW
N
573.667 39 M
573.667 44.43 L
S
GR
GS
[0.6 0 0 0.6 0 0] CT
0.149 GC
2 setlinecap
1 LJ
0.833 LW
N
634 39 M
634 44.43 L
S
GR
GS
[0.6 0 0 0.6 54.6 284.19999] CT
0.149 GC
/Helvetica 16.667 F
GS
[1 0 0 1 0 0] CT
-16.5 17 moveto 
1 -1 scale
(7.52) t 
GR
GR
GS
[0.6 0 0 0.6 90.8 284.19999] CT
0.149 GC
/Helvetica 16.667 F
GS
[1 0 0 1 0 0] CT
-16.5 17 moveto 
1 -1 scale
(7.54) t 
GR
GR
GS
[0.6 0 0 0.6 127 284.19999] CT
0.149 GC
/Helvetica 16.667 F
GS
[1 0 0 1 0 0] CT
-16.5 17 moveto 
1 -1 scale
(7.56) t 
GR
GR
GS
[0.6 0 0 0.6 163.2 284.19999] CT
0.149 GC
/Helvetica 16.667 F
GS
[1 0 0 1 0 0] CT
-16.5 17 moveto 
1 -1 scale
(7.58) t 
GR
GR
GS
[0.6 0 0 0.6 199.40001 284.19999] CT
0.149 GC
/Helvetica 16.667 F
GS
[1 0 0 1 0 0] CT
-12 17 moveto 
1 -1 scale
(7.6) t 
GR
GR
GS
[0.6 0 0 0.6 235.59999 284.19999] CT
0.149 GC
/Helvetica 16.667 F
GS
[1 0 0 1 0 0] CT
-16.5 17 moveto 
1 -1 scale
(7.62) t 
GR
GR
GS
[0.6 0 0 0.6 271.8 284.19999] CT
0.149 GC
/Helvetica 16.667 F
GS
[1 0 0 1 0 0] CT
-16.5 17 moveto 
1 -1 scale
(7.64) t 
GR
GR
GS
[0.6 0 0 0.6 307.99999 284.19999] CT
0.149 GC
/Helvetica 16.667 F
GS
[1 0 0 1 0 0] CT
-16.5 17 moveto 
1 -1 scale
(7.66) t 
GR
GR
GS
[0.6 0 0 0.6 344.20001 284.19999] CT
0.149 GC
/Helvetica 16.667 F
GS
[1 0 0 1 0 0] CT
-16.5 17 moveto 
1 -1 scale
(7.68) t 
GR
GR
GS
[0.6 0 0 0.6 380.4 284.19999] CT
0.149 GC
/Helvetica 16.667 F
GS
[1 0 0 1 0 0] CT
-12 17 moveto 
1 -1 scale
(7.7) t 
GR
GR
GS
[0.6 0 0 0.6 217.5 297.79999] CT
0.149 GC
/Helvetica 18.333 F
GS
[1 0 0 1 0 0] CT
-35 19 moveto 
1 -1 scale
(index [~]) t 
GR
GR
GS
[0.6 0 0 0.6 356.4 310.8] CT
0.149 GC
N
2.5 -0.484 M
2.5 -0.625 2.578 -0.734 QT
6.125 -4.25 L
2.578 -7.781 L
2.5 -7.875 2.5 -8.016 QT
2.5 -8.141 2.602 -8.242 QT
2.703 -8.344 2.844 -8.344 QT
2.953 -8.344 3.094 -8.25 QT
6.609 -4.719 L
10.125 -8.25 L
10.266 -8.344 10.375 -8.344 QT
10.516 -8.344 10.609 -8.25 QT
10.703 -8.156 10.703 -8.016 QT
10.703 -7.875 10.625 -7.781 QT
7.094 -4.25 L
10.625 -0.734 L
10.703 -0.625 10.703 -0.484 QT
10.703 -0.344 10.609 -0.25 QT
10.516 -0.156 10.375 -0.156 QT
10.25 -0.156 10.125 -0.281 QT
6.609 -3.781 L
3.094 -0.281 L
2.969 -0.156 2.844 -0.156 QT
2.703 -0.156 2.602 -0.258 QT
2.5 -0.359 2.5 -0.484 QT
cp
f
GR
GS
[0.6 0 0 0.6 364.2 310.8] CT
0.149 GC
/Helvetica 16.667 F
GS
[1 0 0 1 0 0] CT
0 0 moveto 
1 -1 scale
(10) t 
GR
GR
GS
[0.6 0 0 0.6 375.6 306] CT
0.149 GC
/Helvetica 13.333 F
GS
[1 0 0 1 0 0] CT
0 0 moveto 
1 -1 scale
(4) t 
GR
GR
GS
[0.6 0 0 0.6 0 0] CT
0.149 GC
2 setlinecap
1 LJ
0.833 LW
N
91 467 M
91 39 L
S
GR
GS
[0.6 0 0 0.6 0 0] CT
0.149 GC
2 setlinecap
1 LJ
0.833 LW
N
634 467 M
634 39 L
S
GR
GS
[0.6 0 0 0.6 0 0] CT
0.149 GC
2 setlinecap
1 LJ
0.833 LW
N
91 467 M
96.43 467 L
S
GR
GS
[0.6 0 0 0.6 0 0] CT
0.149 GC
2 setlinecap
1 LJ
0.833 LW
N
91 405.857 M
96.43 405.857 L
S
GR
GS
[0.6 0 0 0.6 0 0] CT
0.149 GC
2 setlinecap
1 LJ
0.833 LW
N
91 344.714 M
96.43 344.714 L
S
GR
GS
[0.6 0 0 0.6 0 0] CT
0.149 GC
2 setlinecap
1 LJ
0.833 LW
N
91 283.571 M
96.43 283.571 L
S
GR
GS
[0.6 0 0 0.6 0 0] CT
0.149 GC
2 setlinecap
1 LJ
0.833 LW
N
91 222.429 M
96.43 222.429 L
S
GR
GS
[0.6 0 0 0.6 0 0] CT
0.149 GC
2 setlinecap
1 LJ
0.833 LW
N
91 161.286 M
96.43 161.286 L
S
GR
GS
[0.6 0 0 0.6 0 0] CT
0.149 GC
2 setlinecap
1 LJ
0.833 LW
N
91 100.143 M
96.43 100.143 L
S
GR
GS
[0.6 0 0 0.6 0 0] CT
0.149 GC
2 setlinecap
1 LJ
0.833 LW
N
91 39 M
96.43 39 L
S
GR
GS
[0.6 0 0 0.6 0 0] CT
0.149 GC
2 setlinecap
1 LJ
0.833 LW
N
634 467 M
628.57 467 L
S
GR
GS
[0.6 0 0 0.6 0 0] CT
0.149 GC
2 setlinecap
1 LJ
0.833 LW
N
634 405.857 M
628.57 405.857 L
S
GR
GS
[0.6 0 0 0.6 0 0] CT
0.149 GC
2 setlinecap
1 LJ
0.833 LW
N
634 344.714 M
628.57 344.714 L
S
GR
GS
[0.6 0 0 0.6 0 0] CT
0.149 GC
2 setlinecap
1 LJ
0.833 LW
N
634 283.571 M
628.57 283.571 L
S
GR
GS
[0.6 0 0 0.6 0 0] CT
0.149 GC
2 setlinecap
1 LJ
0.833 LW
N
634 222.429 M
628.57 222.429 L
S
GR
GS
[0.6 0 0 0.6 0 0] CT
0.149 GC
2 setlinecap
1 LJ
0.833 LW
N
634 161.286 M
628.57 161.286 L
S
GR
GS
[0.6 0 0 0.6 0 0] CT
0.149 GC
2 setlinecap
1 LJ
0.833 LW
N
634 100.143 M
628.57 100.143 L
S
GR
GS
[0.6 0 0 0.6 0 0] CT
0.149 GC
2 setlinecap
1 LJ
0.833 LW
N
634 39 M
628.57 39 L
S
GR
GS
[0.6 0 0 0.6 50.59962 280.2] CT
0.149 GC
/Helvetica 16.667 F
GS
[1 0 0 1 0 0] CT
-38 6.5 moveto 
1 -1 scale
(-0.25) t 
GR
GR
GS
[0.6 0 0 0.6 50.59962 243.51429] CT
0.149 GC
/Helvetica 16.667 F
GS
[1 0 0 1 0 0] CT
-29 6.5 moveto 
1 -1 scale
(-0.2) t 
GR
GR
GS
[0.6 0 0 0.6 50.59962 206.82858] CT
0.149 GC
/Helvetica 16.667 F
GS
[1 0 0 1 0 0] CT
-38 6.5 moveto 
1 -1 scale
(-0.15) t 
GR
GR
GS
[0.6 0 0 0.6 50.59962 170.14286] CT
0.149 GC
/Helvetica 16.667 F
GS
[1 0 0 1 0 0] CT
-29 6.5 moveto 
1 -1 scale
(-0.1) t 
GR
GR
GS
[0.6 0 0 0.6 50.59962 133.45714] CT
0.149 GC
/Helvetica 16.667 F
GS
[1 0 0 1 0 0] CT
-38 6.5 moveto 
1 -1 scale
(-0.05) t 
GR
GR
GS
[0.6 0 0 0.6 50.59962 96.77143] CT
0.149 GC
/Helvetica 16.667 F
GS
[1 0 0 1 0 0] CT
-10 6.5 moveto 
1 -1 scale
(0) t 
GR
GR
GS
[0.6 0 0 0.6 50.59962 60.08571] CT
0.149 GC
/Helvetica 16.667 F
GS
[1 0 0 1 0 0] CT
-33 6.5 moveto 
1 -1 scale
(0.05) t 
GR
GR
GS
[0.6 0 0 0.6 50.59962 23.4] CT
0.149 GC
/Helvetica 16.667 F
GS
[1 0 0 1 0 0] CT
-24 6.5 moveto 
1 -1 scale
(0.1) t 
GR
GR
GS
[0 -0.6 0.6 0 24.80005 151.79988] CT
0.149 GC
/Helvetica 18.333 F
GS
[1 0 0 1 0 0] CT
-20 -5 moveto 
1 -1 scale
(s [m]) t 
GR
GR
GS
[0.6 0 0 0.6 0 0] CT
0 0.447 0.741 RC
1 LJ
3.333 LW
N
149.585 70.672 M
149.585 70.672 L
149.585 70.672 L
149.585 70.672 L
149.585 70.672 L
149.585 70.672 L
149.585 70.672 L
149.585 70.672 L
149.585 70.672 L
149.585 70.672 L
149.585 70.672 L
149.585 70.672 L
149.585 70.672 L
149.585 70.672 L
149.585 70.672 L
149.585 70.672 L
149.585 70.672 L
149.585 70.672 L
149.585 70.672 L
149.587 70.672 L
149.589 70.672 L
149.592 70.672 L
149.592 70.672 L
149.596 70.672 L
149.599 70.672 L
149.601 70.672 L
149.606 70.672 L
149.608 70.672 L
149.615 70.672 L
149.618 70.672 L
149.622 70.672 L
149.627 70.672 L
149.634 70.672 L
149.639 70.672 L
149.644 70.672 L
149.651 70.672 L
149.66 70.672 L
149.667 70.672 L
149.674 70.672 L
149.679 70.672 L
149.686 70.672 L
149.695 70.672 L
149.707 70.672 L
149.714 70.672 L
149.724 70.672 L
149.731 70.672 L
149.74 70.672 L
149.754 70.672 L
149.761 70.672 L
149.771 70.672 L
149.783 70.672 L
149.797 70.672 L
149.811 70.672 L
149.82 70.672 L
149.83 70.672 L
149.841 70.672 L
149.858 70.672 L
149.872 70.672 L
149.886 70.672 L
149.898 70.672 L
149.91 70.672 L
149.926 70.672 L
149.943 70.672 L
149.957 70.672 L
149.969 70.672 L
149.985 70.672 L
150.006 70.672 L
150.023 70.672 L
150.037 70.672 L
150.051 70.672 L
150.068 70.672 L
150.089 70.672 L
150.11 70.672 L
150.127 70.672 L
150.143 70.672 L
150.16 70.672 L
150.179 70.672 L
150.204 70.672 L
150.221 70.672 L
150.237 70.672 L
150.259 70.672 L
150.285 70.672 L
150.308 70.672 L
150.327 70.672 L
150.343 70.672 L
150.365 70.672 L
150.391 70.672 L
150.417 70.672 L
150.44 70.672 L
150.459 70.672 L
150.48 70.672 L
150.504 70.672 L
150.534 70.672 L
150.556 70.672 L
150.577 70.672 L
150.603 70.672 L
150.633 70.672 L
150.662 70.672 L
150.685 70.672 L
150.706 70.672 L
150.732 70.672 L
150.763 70.672 L
150.796 70.672 L
150.822 70.672 L
150.845 70.672 L
150.869 70.672 L
150.9 70.672 L
150.935 70.672 L
150.961 70.672 L
150.985 70.672 L
151.018 70.672 L
151.053 70.672 L
151.086 70.672 L
151.114 70.672 L
151.138 70.672 L
151.168 70.672 L
151.206 70.672 L
151.244 70.672 L
151.274 70.672 L
151.3 70.672 L
151.329 70.672 L
151.364 70.672 L
151.406 70.672 L
151.435 70.672 L
151.465 70.672 L
151.501 70.672 L
151.543 70.672 L
151.581 70.672 L
151.611 70.672 L
151.642 70.672 L
151.675 70.672 L
151.717 70.672 L
151.762 70.672 L
151.798 70.672 L
151.828 70.672 L
151.861 70.672 L
151.901 70.672 L
151.946 70.672 L
151.981 70.672 L
152.014 70.672 L
152.055 70.672 L
152.104 70.672 L
152.146 70.672 L
152.182 70.672 L
152.215 70.672 L
152.252 70.672 L
152.302 70.672 L
152.349 70.672 L
152.392 70.672 L
152.425 70.672 L
152.462 70.672 L
152.507 70.672 L
152.559 70.672 L
152.597 70.672 L
152.634 70.672 L
152.681 70.672 L
152.733 70.672 L
152.783 70.672 L
152.82 70.672 L
152.858 70.672 L
152.901 70.672 L
152.955 70.672 L
153.009 70.672 L
153.054 70.672 L
153.091 70.672 L
153.132 70.672 L
153.183 70.672 L
153.24 70.672 L
153.282 70.672 L
153.325 70.672 L
153.374 70.672 L
153.433 70.672 L
153.487 70.672 L
153.532 70.672 L
153.572 70.672 L
153.619 70.672 L
153.678 70.672 L
153.737 70.672 L
153.787 70.672 L
153.829 70.672 L
153.874 70.672 L
153.93 70.672 L
153.992 70.672 L
154.039 70.672 L
154.084 70.672 L
154.14 70.672 L
154.204 70.672 L
154.263 70.672 L
154.312 70.672 L
154.355 70.672 L
154.409 70.672 L
154.473 70.672 L
154.536 70.672 L
154.59 70.672 L
154.638 70.672 L
154.687 70.672 L
154.746 70.672 L
154.814 70.672 L
154.866 70.672 L
154.916 70.672 L
154.977 70.672 L
155.045 70.672 L
155.109 70.672 L
155.161 70.672 L
155.21 70.672 L
155.267 70.672 L
155.335 70.672 L
155.406 70.672 L
155.465 70.672 L
155.514 70.672 L
155.568 70.672 L
155.632 70.672 L
155.708 70.672 L
155.762 70.672 L
155.816 70.672 L
155.882 70.672 L
155.957 70.672 L
156.026 70.672 L
156.082 70.672 L
156.134 70.672 L
156.195 70.672 L
156.271 70.672 L
156.346 70.672 L
156.41 70.672 L
156.464 70.672 L
156.521 70.672 L
156.591 70.672 L
156.671 70.672 L
156.728 70.672 L
156.787 70.672 L
156.858 70.672 L
156.938 70.672 L
157.013 70.672 L
157.072 70.672 L
157.129 70.672 L
157.195 70.672 L
157.275 70.672 L
157.357 70.672 L
157.426 70.672 L
157.482 70.672 L
157.543 70.672 L
157.619 70.672 L
157.704 70.672 L
157.765 70.672 L
157.829 70.672 L
157.904 70.672 L
157.991 70.672 L
158.069 70.672 L
158.133 70.672 L
158.194 70.672 L
158.265 70.672 L
158.349 70.672 L
158.437 70.672 L
158.51 70.672 L
158.571 70.672 L
158.635 70.672 L
158.715 70.672 L
158.807 70.672 L
158.873 70.672 L
158.939 70.672 L
159.021 70.672 L
159.113 70.672 L
159.196 70.672 L
159.264 70.672 L
159.327 70.672 L
159.403 70.672 L
159.495 70.672 L
159.587 70.672 L
159.665 70.672 L
159.728 70.672 L
159.796 70.672 L
159.884 70.672 L
159.98 70.672 L
160.051 70.672 L
160.122 70.672 L
160.207 70.672 L
160.303 70.672 L
160.393 70.672 L
160.466 70.672 L
160.534 70.672 L
160.612 70.672 L
160.709 70.672 L
160.808 70.672 L
160.888 70.672 L
160.958 70.672 L
161.031 70.672 L
161.121 70.672 L
161.222 70.672 L
161.298 70.672 L
161.373 70.672 L
161.463 70.672 L
161.566 70.672 L
161.661 70.672 L
161.736 70.672 L
161.809 70.672 L
161.892 70.672 L
161.993 70.672 L
162.097 70.672 L
162.184 70.672 L
162.257 70.672 L
162.332 70.672 L
162.429 70.672 L
162.537 70.672 L
162.615 70.672 L
162.693 70.672 L
162.79 70.672 L
162.898 70.672 L
162.997 70.672 L
163.077 70.672 L
163.153 70.672 L
163.242 70.672 L
163.348 70.672 L
163.457 70.672 L
163.548 70.672 L
163.624 70.672 L
163.706 70.672 L
163.805 70.672 L
163.921 70.672 L
164.003 70.672 L
164.086 70.672 L
164.185 70.672 L
164.3 70.672 L
164.404 70.672 L
164.489 70.672 L
164.569 70.672 L
164.661 70.672 L
164.774 70.672 L
164.887 70.672 L
164.984 70.672 L
165.064 70.672 L
165.149 70.672 L
165.252 70.672 L
165.373 70.672 L
165.46 70.672 L
165.547 70.672 L
165.653 70.672 L
165.771 70.672 L
165.882 70.672 L
165.971 70.672 L
166.054 70.672 L
166.15 70.672 L
166.268 70.672 L
166.388 70.672 L
166.487 70.672 L
166.572 70.672 L
166.662 70.672 L
166.77 70.672 L
166.897 70.672 L
166.987 70.672 L
167.079 70.672 L
167.187 70.672 L
167.315 70.672 L
167.428 70.672 L
167.522 70.672 L
167.607 70.672 L
167.708 70.672 L
167.833 70.672 L
167.958 70.672 L
168.062 70.672 L
168.151 70.672 L
168.243 70.672 L
168.359 70.672 L
168.491 70.672 L
168.585 70.672 L
168.679 70.672 L
168.795 70.672 L
168.924 70.672 L
169.044 70.672 L
169.141 70.672 L
169.233 70.672 L
169.339 70.672 L
169.466 70.672 L
169.598 70.672 L
169.707 70.672 L
169.799 70.672 L
169.895 70.672 L
170.015 70.672 L
170.152 70.672 L
170.251 70.672 L
170.35 70.672 L
170.47 70.672 L
170.607 70.672 L
170.732 70.672 L
170.833 70.672 L
170.928 70.672 L
171.038 70.672 L
171.17 70.672 L
171.307 70.672 L
171.422 70.672 L
171.517 70.672 L
171.618 70.672 L
171.743 70.672 L
171.884 70.672 L
171.988 70.672 L
172.092 70.672 L
172.217 70.672 L
172.358 70.672 L
172.488 70.672 L
172.594 70.672 L
172.69 70.672 L
172.806 70.672 L
172.945 70.672 L
173.086 70.672 L
173.204 70.672 L
173.306 70.672 L
173.409 70.672 L
173.539 70.672 L
173.687 70.672 L
173.793 70.672 L
173.902 70.672 L
174.031 70.672 L
174.18 70.672 L
174.314 70.672 L
174.423 70.672 L
174.524 70.672 L
174.644 70.672 L
174.788 70.672 L
174.936 70.672 L
175.059 70.672 L
175.163 70.672 L
175.271 70.672 L
175.405 70.672 L
175.559 70.672 L
175.669 70.672 L
175.782 70.672 L
175.917 70.672 L
176.07 70.672 L
176.209 70.672 L
176.322 70.672 L
176.428 70.672 L
176.553 70.672 L
176.702 70.672 L
176.855 70.672 L
176.982 70.672 L
177.088 70.672 L
177.201 70.672 L
177.343 70.672 L
177.501 70.672 L
177.616 70.672 L
177.732 70.672 L
177.871 70.672 L
178.031 70.672 L
178.175 70.672 L
178.292 70.672 L
178.401 70.672 L
178.53 70.672 L
178.686 70.672 L
178.844 70.672 L
178.976 70.672 L
179.087 70.672 L
179.202 70.672 L
179.348 70.672 L
179.513 70.672 L
179.631 70.672 L
179.751 70.672 L
179.895 70.672 L
180.06 70.672 L
180.208 70.672 L
180.331 70.672 L
180.444 70.672 L
180.576 70.672 L
180.739 70.672 L
180.901 70.672 L
181.038 70.672 L
181.151 70.672 L
181.274 70.672 L
181.422 70.672 L
181.594 70.672 L
181.717 70.672 L
181.839 70.672 L
181.988 70.672 L
182.16 70.672 L
182.313 70.672 L
182.44 70.672 L
182.556 70.672 L
182.693 70.672 L
182.86 70.672 L
183.03 70.672 L
183.169 70.672 L
183.289 70.672 L
183.414 70.672 L
183.567 70.672 L
183.744 70.672 L
183.871 70.672 L
183.998 70.672 L
184.151 70.672 L
184.328 70.672 L
184.488 70.672 L
184.618 70.672 L
184.738 70.672 L
184.88 70.672 L
185.052 70.672 L
185.226 70.672 L
185.37 70.672 L
185.492 70.672 L
185.622 70.672 L
185.782 70.672 L
185.964 70.672 L
186.093 70.672 L
186.225 70.672 L
186.386 70.672 L
186.565 70.672 L
186.73 70.672 L
186.864 70.672 L
186.989 70.672 L
187.135 70.672 L
187.312 70.672 L
187.493 70.672 L
187.642 70.672 L
187.767 70.672 L
187.901 70.672 L
188.066 70.672 L
188.252 70.672 L
188.386 70.672 L
188.523 70.672 L
188.686 70.672 L
188.872 70.672 L
189.044 70.672 L
189.181 70.672 L
189.31 70.672 L
189.459 70.672 L
189.643 70.672 L
189.826 70.672 L
189.982 70.672 L
190.112 70.672 L
190.248 70.672 L
190.418 70.672 L
190.611 70.672 L
190.75 70.672 L
190.889 70.672 L
191.057 70.672 L
191.25 70.672 L
191.424 70.672 L
191.566 70.672 L
191.7 70.672 L
191.853 70.672 L
192.042 70.672 L
192.233 70.672 L
192.391 70.672 L
192.525 70.672 L
192.664 70.672 L
192.838 70.672 L
193.039 70.672 L
193.18 70.672 L
193.324 70.672 L
193.498 70.672 L
193.696 70.672 L
193.875 70.672 L
194.022 70.672 L
194.158 70.672 L
194.316 70.672 L
194.509 70.672 L
194.705 70.672 L
194.87 70.672 L
195.007 70.672 L
195.15 70.672 L
195.33 70.672 L
195.535 70.672 L
195.681 70.672 L
195.829 70.672 L
196.008 70.672 L
196.211 70.672 L
196.395 70.672 L
196.546 70.672 L
196.685 70.672 L
196.85 70.672 L
197.048 70.672 L
197.248 70.672 L
197.418 70.672 L
197.557 70.672 L
197.708 70.672 L
197.891 70.672 L
198.101 70.672 L
198.252 70.672 L
198.403 70.672 L
198.587 70.672 L
198.794 70.672 L
198.985 70.672 L
199.138 70.672 L
199.282 70.672 L
199.449 70.672 L
199.654 70.672 L
199.862 70.672 L
200.034 70.672 L
200.177 70.672 L
200.331 70.672 L
200.519 70.672 L
200.736 70.672 L
200.889 70.672 L
201.045 70.672 L
201.233 70.672 L
201.448 70.672 L
201.643 70.672 L
201.801 70.672 L
201.947 70.672 L
202.119 70.672 L
202.329 70.672 L
202.541 70.672 L
202.718 70.672 L
202.866 70.672 L
203.024 70.672 L
203.218 70.672 L
203.439 70.672 L
203.597 70.672 L
203.757 70.672 L
203.951 70.672 L
204.17 161.286 L
204.37 161.286 L
204.533 161.286 L
204.684 161.286 L
204.86 161.286 L
205.072 161.286 L
205.292 161.286 L
205.473 161.286 L
205.624 161.286 L
205.787 161.286 L
205.984 161.286 L
206.211 161.286 L
206.373 161.286 L
206.538 161.286 L
206.736 161.286 L
206.96 161.286 L
207.165 161.286 L
207.333 161.286 L
207.488 161.286 L
207.667 161.286 L
207.886 161.286 L
208.11 161.286 L
208.296 161.286 L
208.452 161.286 L
208.617 161.286 L
208.822 161.286 L
209.053 161.286 L
209.22 161.286 L
209.388 161.286 L
209.59 161.286 L
209.821 161.286 L
210.031 161.286 L
210.203 161.286 L
210.361 161.286 L
210.547 161.286 L
210.771 161.286 L
211 161.286 L
211.191 161.286 L
211.351 161.286 L
211.518 161.286 L
211.728 161.286 L
211.966 161.286 L
212.136 161.286 L
212.308 161.286 L
212.515 161.286 L
212.753 161.286 L
212.968 161.286 L
213.142 161.286 L
213.305 161.286 L
213.493 161.286 L
213.724 161.286 L
213.96 161.286 L
214.153 161.286 L
214.318 161.286 L
214.49 161.286 L
214.705 161.286 L
214.947 161.286 L
215.122 161.286 L
215.298 161.286 L
215.511 161.286 L
215.753 161.286 L
215.972 161.286 L
216.152 161.286 L
216.317 161.286 L
216.512 161.286 L
216.748 161.286 L
216.988 161.286 L
217.186 161.286 L
217.354 161.286 L
217.53 161.286 L
217.749 161.286 L
217.999 161.286 L
218.178 161.286 L
218.358 161.286 L
218.574 161.286 L
218.822 161.286 L
219.048 161.286 L
219.23 161.286 L
219.399 161.286 L
219.6 161.286 L
219.84 161.286 L
220.085 161.286 L
220.288 161.286 L
220.46 161.286 L
220.641 161.286 L
220.865 161.286 L
221.12 161.286 L
221.301 161.286 L
221.485 161.286 L
221.709 161.286 L
221.961 161.286 L
222.192 161.286 L
222.378 161.286 L
222.553 161.286 L
222.755 161.286 L
223 161.286 L
223.253 161.286 L
223.46 161.286 L
223.634 161.286 L
223.821 161.286 L
224.049 161.286 L
224.308 161.286 L
224.495 161.286 L
224.683 161.286 L
224.909 161.286 L
225.169 161.286 L
225.404 161.286 L
225.595 161.286 L
225.772 161.286 L
225.979 161.286 L
226.232 161.286 L
226.488 161.286 L
226.701 161.286 L
226.88 161.286 L
227.068 161.286 L
227.301 161.286 L
227.568 161.286 L
227.759 161.286 L
227.95 161.286 L
228.183 161.286 L
228.447 161.286 L
228.687 161.286 L
228.881 161.286 L
229.062 161.286 L
229.274 161.286 L
229.531 161.286 L
229.793 161.286 L
230.012 161.286 L
230.193 161.286 L
230.386 161.286 L
230.625 161.286 L
230.896 161.286 L
231.091 161.286 L
231.287 161.286 L
231.522 161.286 L
231.793 161.286 L
232.039 161.286 L
232.237 161.286 L
232.423 161.286 L
232.637 161.286 L
232.901 161.286 L
233.167 161.286 L
233.389 161.286 L
233.575 161.286 L
233.773 161.286 L
234.016 161.286 L
234.292 161.286 L
234.492 161.286 L
234.69 161.286 L
234.933 161.286 L
235.208 161.286 L
235.458 161.286 L
235.661 161.286 L
235.849 161.286 L
236.071 161.286 L
236.34 161.286 L
236.611 161.286 L
236.837 161.286 L
237.028 161.286 L
237.228 161.286 L
237.476 161.286 L
237.758 161.286 L
237.961 161.286 L
238.164 161.286 L
238.411 161.286 L
238.692 161.286 L
238.949 161.286 L
239.156 161.286 L
239.347 161.286 L
239.573 161.286 L
239.847 161.286 L
240.125 161.286 L
240.353 161.286 L
240.547 161.286 L
240.752 161.286 L
241.006 161.286 L
241.294 161.286 L
241.501 161.286 L
241.708 161.286 L
241.961 161.286 L
242.246 161.286 L
242.505 161.286 L
242.717 161.286 L
242.913 161.286 L
243.144 161.286 L
243.422 161.286 L
243.705 161.286 L
243.94 161.286 L
244.136 161.286 L
244.346 161.286 L
244.603 161.286 L
244.897 161.286 L
245.109 161.286 L
245.319 161.286 L
245.576 161.286 L
245.868 161.286 L
246.132 161.286 L
246.349 161.286 L
246.549 161.286 L
246.783 161.286 L
247.065 161.286 L
247.355 161.286 L
247.593 161.286 L
247.794 161.286 L
248.008 161.286 L
248.27 161.286 L
248.569 161.286 L
248.783 161.286 L
249 161.286 L
249.262 161.286 L
249.559 161.286 L
249.827 161.286 L
250.047 161.286 L
250.252 161.286 L
250.49 161.286 L
250.777 161.286 L
250.985 161.286 L
250.985 161.286 L
251.279 161.286 L
251.548 161.286 L
251.767 161.286 L
251.975 161.286 L
252.217 161.286 L
252.507 161.286 L
252.797 405.857 L
253.037 405.857 L
253.242 405.857 L
253.464 405.857 L
253.733 405.857 L
254.034 405.857 L
254.303 405.857 L
254.517 405.857 L
254.723 405.857 L
254.965 405.857 L
255.26 405.857 L
255.554 405.857 L
255.792 405.857 L
255.995 405.857 L
256.212 405.857 L
256.485 405.857 L
256.789 405.857 L
257.004 405.857 L
257.216 405.857 L
257.482 405.857 L
257.786 405.857 L
258.005 405.857 L
258.222 405.857 L
258.489 405.857 L
258.786 405.857 L
259.057 405.857 L
259.278 405.857 L
259.483 405.857 L
259.724 405.857 L
260.013 405.857 L
260.306 405.857 L
260.551 405.857 L
260.756 405.857 L
260.973 405.857 L
261.239 405.857 L
261.541 405.857 L
261.814 405.857 L
262.031 405.857 L
262.234 405.857 L
262.474 405.857 L
262.766 405.857 L
263.063 405.857 L
263.304 405.857 L
263.506 405.857 L
263.723 405.857 L
263.992 405.857 L
264.296 405.857 L
264.513 405.857 L
264.727 405.857 L
264.991 405.857 L
265.295 405.857 L
265.514 405.857 L
265.733 405.857 L
265.997 405.857 L
266.294 405.857 L
266.565 405.857 L
266.787 405.857 L
266.994 405.857 L
267.232 405.857 L
267.522 405.857 L
267.814 405.857 L
268.057 405.857 L
268.265 405.857 L
268.481 405.857 L
268.748 405.857 L
269.049 405.857 L
269.32 405.857 L
269.54 405.857 L
269.742 405.857 L
269.983 405.857 L
270.275 405.857 L
270.569 405.857 L
270.812 405.857 L
271.015 405.857 L
271.232 405.857 L
271.5 405.857 L
271.804 405.857 L
272.021 405.857 L
272.236 405.857 L
272.5 405.857 L
272.804 405.857 L
273.077 405.857 L
273.296 405.857 L
273.499 405.857 L
273.737 405.857 L
274.027 405.857 L
274.324 405.857 L
274.569 405.857 L
274.772 405.857 L
274.986 405.857 L
275.252 405.857 L
275.559 405.857 L
275.776 405.857 L
275.992 405.857 L
276.256 405.857 L
276.558 405.857 L
276.829 405.857 L
277.051 405.857 L
277.253 405.857 L
277.494 405.857 L
277.784 405.857 L
278.078 405.857 L
278.321 405.857 L
278.526 405.857 L
278.743 405.857 L
279.009 405.857 L
279.313 405.857 L
279.53 405.857 L
279.747 405.857 L
280.011 405.857 L
280.31 405.857 L
280.583 405.857 L
280.805 405.857 L
281.008 405.857 L
281.248 405.857 L
281.538 405.857 L
281.832 405.857 L
282.075 405.857 L
282.28 405.857 L
282.497 405.857 L
282.763 405.857 L
283.065 405.857 L
283.284 405.857 L
283.501 405.857 L
283.765 405.857 L
284.064 405.857 L
284.338 405.857 L
284.557 405.857 L
284.762 405.857 L
285.002 405.857 L
285.292 405.857 L
285.587 405.857 L
285.83 405.857 L
286.035 405.857 L
286.251 405.857 L
286.518 405.857 L
286.819 405.857 L
287.039 405.857 L
287.255 405.857 L
287.519 405.857 L
287.819 405.857 L
288.092 405.857 L
288.311 405.857 L
288.516 405.857 L
288.757 405.857 L
289.044 405.857 L
289.341 405.857 L
289.584 405.857 L
289.789 405.857 L
290.003 405.857 L
290.272 405.857 L
290.574 405.857 L
290.793 405.857 L
291.01 405.857 L
291.274 405.857 L
291.573 405.857 L
291.846 405.857 L
292.066 405.857 L
292.271 405.857 L
292.509 405.857 L
292.798 405.857 L
293.093 405.857 L
293.338 405.857 L
293.543 405.857 L
293.758 405.857 L
294.024 405.857 L
294.328 405.857 L
294.547 405.857 L
294.764 405.857 L
295.028 405.857 L
295.327 405.857 L
295.601 405.857 L
295.82 405.857 L
296.025 405.857 L
296.263 405.857 L
296.553 405.857 L
296.847 405.857 L
297.093 405.857 L
297.298 405.857 L
297.512 405.857 L
297.778 405.857 L
298.082 405.857 L
298.299 405.857 L
298.518 405.857 L
298.782 405.857 L
299.082 405.857 L
299.353 405.857 L
299.574 405.857 L
299.779 405.857 L
300.017 405.857 L
300.307 405.857 L
300.602 405.857 L
300.847 405.857 L
301.05 405.857 L
301.266 405.857 L
301.533 405.857 L
301.837 405.857 L
302.054 405.857 L
302.273 405.857 L
302.537 405.857 L
302.836 405.857 L
303.107 405.857 L
303.329 405.857 L
303.534 405.857 L
303.772 405.857 L
304.062 405.857 L
304.356 405.857 L
304.601 405.857 L
304.804 405.857 L
305.021 405.857 L
305.287 405.857 L
305.591 405.857 L
305.808 405.857 L
306.027 405.857 L
306.291 405.857 L
306.59 405.857 L
306.861 405.857 L
307.083 405.857 L
307.288 405.857 L
307.526 405.857 L
307.816 405.857 L
308.11 405.857 L
308.353 405.857 L
308.558 405.857 L
308.775 405.857 L
309.041 405.857 L
309.345 405.857 L
309.562 405.857 L
309.779 405.857 L
310.045 405.857 L
310.342 405.857 L
310.616 405.857 L
310.837 405.857 L
311.042 405.857 L
311.28 405.857 L
311.57 405.857 L
311.865 405.857 L
312.108 405.857 L
312.313 405.857 L
312.529 405.857 L
312.796 405.857 L
313.1 405.857 L
313.317 405.857 L
313.533 405.857 L
313.797 405.857 L
314.097 405.857 L
314.37 405.857 L
314.592 405.857 L
314.794 405.857 L
315.035 405.857 L
315.325 405.857 L
315.619 405.857 L
315.862 405.857 L
316.067 405.857 L
316.284 405.857 L
316.55 405.857 L
316.852 405.857 L
317.071 405.857 L
317.288 405.857 L
317.552 405.857 L
317.851 405.857 L
318.124 405.857 L
318.344 405.857 L
318.549 405.857 L
318.789 405.857 L
319.079 405.857 L
319.373 405.857 L
319.616 405.857 L
319.821 405.857 L
320.038 405.857 L
320.304 405.857 L
320.606 405.857 L
320.825 405.857 L
321.042 405.857 L
321.306 405.857 L
321.605 405.857 L
321.879 405.857 L
322.098 405.857 L
322.303 405.857 L
322.543 405.857 L
322.831 405.857 L
323.125 405.857 L
323.371 405.857 L
323.576 405.857 L
323.79 405.857 L
324.059 405.857 L
324.36 405.857 L
324.58 405.857 L
324.796 405.857 L
325.06 405.857 L
325.36 405.857 L
325.633 405.857 L
325.852 405.857 L
326.057 405.857 L
326.295 405.857 L
326.585 405.857 L
326.88 405.857 L
327.125 405.857 L
327.33 405.857 L
327.544 405.857 L
327.811 405.857 L
328.115 405.857 L
328.332 405.857 L
328.551 405.857 L
328.815 405.857 L
329.114 405.857 L
329.385 405.857 L
329.607 405.857 L
329.812 405.857 L
330.05 405.857 L
330.34 405.857 L
330.634 405.857 L
330.879 405.857 L
331.082 405.857 L
331.299 405.857 L
331.565 405.857 L
331.869 405.857 L
332.086 405.857 L
332.305 405.857 L
332.569 405.857 L
332.868 405.857 L
333.139 405.857 L
333.361 405.857 L
333.566 405.857 L
333.804 405.857 L
334.094 405.857 L
334.388 405.857 L
334.634 405.857 L
334.836 405.857 L
335.053 405.857 L
335.319 405.857 L
335.623 405.857 L
335.84 405.857 L
336.059 405.857 L
336.323 405.857 L
336.623 405.857 L
336.894 405.857 L
337.115 405.857 L
337.32 405.857 L
337.558 405.857 L
337.848 405.857 L
338.143 405.857 L
338.386 405.857 L
338.591 405.857 L
338.807 405.857 L
339.074 405.857 L
339.378 405.857 L
339.595 405.857 L
339.811 405.857 L
340.078 405.857 L
340.377 405.857 L
340.648 405.857 L
340.87 405.857 L
341.075 405.857 L
341.313 405.857 L
341.603 405.857 L
341.897 405.857 L
342.14 405.857 L
342.345 405.857 L
342.562 405.857 L
342.828 405.857 L
343.132 405.857 L
343.349 405.857 L
343.566 405.857 L
343.83 405.857 L
344.129 405.857 L
344.402 405.857 L
344.624 405.857 L
344.829 405.857 L
345.067 405.857 L
345.357 405.857 L
345.651 405.857 L
345.894 405.857 L
346.099 405.857 L
346.316 405.857 L
346.582 405.857 L
346.886 405.857 L
347.103 405.857 L
347.32 405.857 L
347.584 405.857 L
347.883 405.857 L
348.157 405.857 L
348.376 405.857 L
348.581 405.857 L
348.821 405.857 L
349.111 405.857 L
349.406 405.857 L
349.649 405.857 L
349.854 405.857 L
350.07 405.857 L
350.337 405.857 L
350.638 405.857 L
350.858 405.857 L
351.074 405.857 L
351.338 405.857 L
351.638 405.857 L
351.911 405.857 L
352.13 405.857 L
352.335 405.857 L
352.576 405.857 L
352.866 405.857 L
353.16 405.857 L
353.403 405.857 L
353.608 405.857 L
353.825 405.857 L
354.091 405.857 L
354.393 405.857 L
354.612 405.857 L
354.829 405.857 L
355.093 405.857 L
355.392 405.857 L
355.665 405.857 L
355.885 405.857 L
356.09 405.857 L
356.33 405.857 L
356.617 405.857 L
356.912 405.857 L
357.157 405.857 L
357.362 405.857 L
357.577 405.857 L
357.845 405.857 L
358.147 405.857 L
358.366 405.857 L
358.583 405.857 L
358.847 405.857 L
359.146 405.857 L
359.42 405.857 L
359.639 405.857 L
359.844 405.857 L
360.082 405.857 L
360.372 405.857 L
360.666 405.857 L
360.912 405.857 L
361.117 405.857 L
361.331 405.857 L
361.597 405.857 L
361.901 405.857 L
362.118 405.857 L
362.337 405.857 L
362.601 405.857 L
362.901 405.857 L
363.172 405.857 L
363.393 405.857 L
363.598 405.857 L
363.836 405.857 L
364.126 405.857 L
364.421 405.857 L
364.666 405.857 L
364.869 405.857 L
365.085 405.857 L
365.352 405.857 L
365.656 405.857 L
365.873 405.857 L
366.092 405.857 L
366.356 405.857 L
366.655 405.857 L
366.926 405.857 L
367.148 405.857 L
367.353 405.857 L
367.591 405.857 L
367.88 405.857 L
368.175 405.857 L
368.42 405.857 L
368.623 405.857 L
368.84 405.857 L
369.106 405.857 L
369.41 405.857 L
369.627 405.857 L
369.846 405.857 L
370.11 405.857 L
370.409 405.857 L
370.68 405.857 L
370.902 405.857 L
371.107 405.857 L
371.345 405.857 L
371.635 405.857 L
371.929 405.857 L
372.172 405.857 L
372.377 405.857 L
372.594 405.857 L
372.86 405.857 L
373.164 405.857 L
373.381 405.857 L
373.598 405.857 L
373.864 405.857 L
374.164 405.857 L
374.435 405.857 L
374.656 405.857 L
374.861 405.857 L
375.099 405.857 L
375.389 405.857 L
375.684 405.857 L
375.927 405.857 L
376.132 405.857 L
376.348 405.857 L
376.615 405.857 L
376.919 405.857 L
377.136 405.857 L
377.352 405.857 L
377.616 405.857 L
377.916 405.857 L
378.189 405.857 L
378.411 405.857 L
378.613 405.857 L
378.854 405.857 L
379.144 405.857 L
379.438 405.857 L
379.681 405.857 L
379.886 405.857 L
380.103 405.857 L
380.369 405.857 L
380.671 405.857 L
380.89 405.857 L
381.107 405.857 L
381.371 405.857 L
381.67 405.857 L
381.943 405.857 L
382.163 405.857 L
382.368 405.857 L
382.608 405.857 L
382.898 405.857 L
383.192 405.857 L
383.435 405.857 L
383.64 405.857 L
383.857 405.857 L
384.123 405.857 L
384.425 405.857 L
384.644 405.857 L
384.861 405.857 L
385.125 405.857 L
385.424 405.857 L
385.698 405.857 L
385.917 405.857 L
386.122 405.857 L
386.362 405.857 L
386.65 405.857 L
386.947 405.857 L
387.19 405.857 L
387.395 405.857 L
387.609 405.857 L
387.878 405.857 L
388.201 405.857 L
S
GR
GS
[0.6 0 0 0.6 0 0] CT
0.851 0.325 0.098 RC
1 LJ
3.333 LW
N
149.585 70.64 M
149.886 70.64 L
150.195 70.64 L
150.501 70.64 L
150.805 70.64 L
151.117 70.64 L
151.437 70.64 L
151.753 70.64 L
152.073 70.64 L
152.422 70.64 L
152.738 70.64 L
153.075 70.64 L
153.379 70.64 L
153.692 70.64 L
154.013 70.64 L
154.357 70.64 L
154.694 70.64 L
155.052 70.64 L
155.366 70.64 L
155.693 70.64 L
156.023 70.64 L
156.358 70.64 L
156.7 70.64 L
157.053 70.64 L
157.423 70.64 L
157.796 70.64 L
158.102 70.64 L
158.404 70.64 L
158.724 70.64 L
159.04 70.64 L
159.622 70.64 L
159.95 70.64 L
160.294 70.64 L
160.638 70.64 L
160.98 70.64 L
161.335 70.64 L
161.689 70.64 L
162.057 70.64 L
162.427 70.64 L
162.79 70.64 L
163.167 70.64 L
163.508 70.64 L
163.817 70.64 L
164.206 70.64 L
164.508 70.64 L
164.809 70.64 L
165.125 70.64 L
165.427 70.64 L
165.745 70.64 L
166.058 70.64 L
166.381 70.64 L
166.699 70.64 L
167.029 70.64 L
167.362 70.64 L
167.692 70.64 L
168.015 70.64 L
168.363 70.64 L
168.71 70.64 L
169.056 70.64 L
169.398 70.64 L
169.749 70.64 L
170.105 70.64 L
170.454 70.64 L
170.814 70.64 L
171.177 70.64 L
171.545 70.64 L
171.913 70.64 L
172.285 70.64 L
172.657 70.64 L
173.03 70.64 L
173.412 70.64 L
173.793 70.64 L
174.185 70.64 L
174.571 70.64 L
174.962 70.64 L
175.358 70.64 L
175.761 70.64 L
176.16 70.64 L
176.565 70.64 L
176.982 70.64 L
177.383 70.64 L
177.795 70.64 L
178.236 70.64 L
178.644 70.64 L
179.063 70.64 L
179.492 70.64 L
179.914 70.64 L
180.355 70.64 L
180.788 70.64 L
181.231 70.64 L
181.658 70.64 L
181.967 70.64 L
182.405 70.64 L
182.843 70.64 L
183.291 70.64 L
183.739 70.64 L
184.055 70.64 L
184.498 70.64 L
184.816 70.64 L
185.271 70.64 L
185.58 70.64 L
185.898 70.64 L
186.313 70.64 L
186.619 70.64 L
186.937 70.64 L
187.255 70.64 L
187.578 70.64 L
187.896 70.64 L
188.219 70.64 L
188.533 70.64 L
188.858 70.64 L
189.275 70.64 L
189.588 70.64 L
189.918 70.64 L
190.248 70.64 L
190.59 70.64 L
190.918 70.64 L
191.243 70.64 L
191.582 70.64 L
191.922 70.64 L
192.261 70.64 L
192.589 70.64 L
192.928 70.64 L
193.272 70.64 L
193.614 70.64 L
193.996 70.64 L
194.344 70.64 L
194.688 70.64 L
195.033 70.64 L
195.384 70.64 L
195.725 70.64 L
196.084 70.64 L
196.442 70.64 L
196.781 70.64 L
197.135 70.64 L
197.495 70.64 L
197.851 70.64 L
198.21 70.64 L
198.568 70.64 L
198.919 70.64 L
199.289 70.64 L
199.652 70.64 L
200.02 70.64 L
200.453 70.64 L
200.835 70.64 L
201.193 70.64 L
201.573 70.64 L
201.931 70.64 L
202.315 70.64 L
202.692 70.64 L
203.05 70.64 L
203.427 70.64 L
203.814 70.64 L
204.186 70.64 L
204.563 70.64 L
204.952 71.306 L
205.334 72.488 L
205.812 73.949 L
206.201 75.16 L
206.585 76.349 L
206.967 77.524 L
207.358 78.735 L
207.745 79.931 L
208.136 81.142 L
208.532 82.36 L
208.933 83.599 L
209.329 84.824 L
209.727 86.049 L
210.114 87.246 L
210.512 88.478 L
210.924 89.746 L
211.33 90.992 L
211.73 92.239 L
212.133 93.478 L
212.548 94.76 L
212.956 95.897 L
213.366 97.021 L
213.771 98.14 L
214.184 99.27 L
214.601 100.427 L
214.994 101.513 L
215.409 102.657 L
215.833 103.82 L
216.253 104.976 L
216.665 106.114 L
216.976 106.963 L
217.398 108.126 L
217.823 109.296 L
218.249 110.465 L
218.669 111.621 L
219.098 112.803 L
219.517 113.947 L
219.941 115.123 L
220.373 116.311 L
220.804 117.438 L
221.245 118.572 L
221.678 119.694 L
222.093 120.768 L
222.536 121.914 L
222.982 123.06 L
223.413 124.176 L
223.856 125.322 L
224.294 126.456 L
224.742 127.608 L
225.19 128.766 L
225.626 129.894 L
226.064 131.034 L
226.524 132.216 L
226.962 133.345 L
227.62 135.037 L
228.075 136.213 L
228.525 137.476 L
228.968 138.855 L
229.434 140.306 L
229.899 141.75 L
230.337 143.115 L
230.799 144.544 L
231.207 145.822 L
231.671 147.267 L
232.145 148.732 L
232.602 150.162 L
233.066 151.599 L
233.53 153.05 L
234.009 154.53 L
234.478 155.989 L
234.942 157.426 L
235.404 158.863 L
235.882 160.343 L
236.359 161.286 L
236.835 161.286 L
237.315 161.286 L
237.789 161.286 L
238.27 161.286 L
238.762 161.286 L
239.239 161.286 L
239.731 161.286 L
240.207 161.286 L
240.9 161.286 L
241.393 161.286 L
241.88 161.286 L
242.373 161.286 L
242.866 161.286 L
243.356 161.286 L
243.846 161.286 L
244.355 161.286 L
244.843 161.286 L
245.35 161.286 L
245.899 161.286 L
246.405 161.286 L
246.898 161.286 L
247.407 161.286 L
247.914 161.286 L
248.428 161.286 L
248.937 161.286 L
249.436 161.286 L
249.936 161.286 L
250.454 161.286 L
251.062 161.286 L
251.572 161.286 L
252.076 161.286 L
252.604 161.286 L
253.113 161.286 L
253.638 161.286 L
254.15 161.286 L
254.685 161.286 L
255.189 161.286 L
255.724 161.286 L
256.257 161.286 L
256.756 161.286 L
257.216 161.286 L
257.732 161.286 L
258.281 161.286 L
258.793 161.286 L
259.344 161.286 L
259.865 161.286 L
260.407 161.286 L
260.949 161.286 L
261.465 161.286 L
262.012 161.286 L
262.54 161.286 L
262.95 161.286 L
263.48 161.286 L
264.029 161.286 L
264.557 161.286 L
265.109 161.286 L
265.641 161.286 L
266.193 161.286 L
266.73 161.286 L
267.263 161.286 L
267.817 161.286 L
268.366 161.286 L
268.917 161.286 L
269.384 161.286 L
269.935 161.286 L
270.489 161.286 L
271.048 161.286 L
271.566 161.286 L
272.123 161.286 L
272.686 161.286 L
273.372 161.286 L
273.925 161.286 L
274.456 161.286 L
275.01 161.286 L
275.563 161.286 L
276.113 161.286 L
276.615 161.286 L
277.168 161.286 L
277.718 161.286 L
278.262 161.286 L
278.816 161.286 L
279.348 161.286 L
279.905 161.286 L
280.447 161.286 L
280.989 161.286 L
281.543 161.286 L
282.092 161.286 L
282.627 161.286 L
283.176 161.286 L
283.718 161.286 L
284.458 161.286 L
285.012 161.286 L
285.547 161.286 L
286.084 161.286 L
286.633 161.286 L
287.171 163.633 L
287.727 168.346 L
288.281 173.06 L
288.804 177.513 L
289.348 182.127 L
289.902 186.82 L
290.454 191.534 L
290.981 196.027 L
291.523 200.641 L
292.075 205.315 L
292.523 209.126 L
293.044 213.559 L
293.588 218.192 L
294.139 222.866 L
294.682 227.48 L
295.235 231.844 L
296.004 237.695 L
296.541 241.756 L
297.078 245.817 L
297.628 249.985 L
298.163 254.082 L
298.709 258.215 L
299.258 262.383 L
299.805 266.534 L
300.338 270.56 L
300.866 274.567 L
301.422 278.789 L
301.969 282.922 L
302.508 287.019 L
303.017 290.825 L
303.571 294.773 L
304.099 298.537 L
304.648 302.451 L
305.183 306.248 L
305.721 310.079 L
306.272 314.01 L
307.048 319.538 L
307.566 323.234 L
308.118 327.182 L
308.671 331.113 L
309.209 334.927 L
309.751 338.808 L
310.283 342.605 L
310.816 346.402 L
311.358 350.974 L
311.91 355.704 L
312.423 360.112 L
312.97 364.802 L
313.522 369.533 L
314.071 374.244 L
314.603 378.833 L
315.131 383.342 L
315.68 388.032 L
316.227 392.722 L
316.755 397.251 L
317.29 401.84 L
317.844 406.591 L
318.4 411.363 L
318.907 415.095 L
319.461 415.095 L
319.878 415.095 L
320.427 415.095 L
320.96 415.095 L
321.504 415.095 L
322.037 415.095 L
322.576 415.095 L
323.13 415.095 L
323.663 415.095 L
324.2 415.095 L
324.638 415.095 L
325.166 415.095 L
325.72 415.095 L
326.253 415.095 L
326.785 415.095 L
327.342 415.095 L
327.877 415.095 L
328.412 415.095 L
328.968 415.095 L
329.625 415.095 L
330.17 415.095 L
330.714 415.095 L
331.247 415.095 L
331.787 415.095 L
332.324 415.095 L
332.871 415.095 L
333.403 415.095 L
333.941 415.095 L
334.487 415.095 L
335.041 415.095 L
335.576 415.095 L
336.107 415.095 L
336.642 415.095 L
337.188 415.095 L
337.74 415.095 L
338.268 415.095 L
338.805 415.095 L
339.262 415.095 L
339.797 415.095 L
340.346 415.095 L
340.884 415.095 L
341.423 415.095 L
341.963 415.095 L
342.508 415.095 L
343.019 415.095 L
343.547 415.095 L
344.087 415.095 L
344.64 415.095 L
345.168 415.095 L
345.71 415.095 L
346.252 415.095 L
346.799 415.095 L
347.334 415.095 L
347.78 415.095 L
348.329 415.095 L
348.859 415.095 L
349.413 415.095 L
349.948 415.095 L
350.478 415.095 L
351.027 415.095 L
351.574 415.095 L
352.125 415.095 L
352.653 415.095 L
353.2 415.095 L
353.745 415.095 L
354.28 415.095 L
354.815 415.095 L
355.359 415.095 L
355.779 415.095 L
356.325 415.095 L
356.872 415.095 L
357.416 415.095 L
357.966 415.095 L
358.682 415.095 L
359.229 415.095 L
359.776 415.095 L
360.322 415.095 L
360.834 415.095 L
361.383 415.095 L
361.93 415.095 L
362.476 415.095 L
362.993 415.095 L
363.542 415.095 L
364.152 415.095 L
364.668 415.095 L
365.215 415.095 L
365.762 415.095 L
366.313 415.095 L
366.846 415.095 L
367.379 415.095 L
367.911 415.095 L
368.458 415.095 L
369 415.095 L
369.528 415.095 L
370.084 415.095 L
370.621 415.095 L
370.977 415.095 L
371.536 415.095 L
372.045 415.095 L
372.599 415.095 L
373.134 415.095 L
373.681 415.095 L
374.284 415.095 L
374.75 415.095 L
375.293 415.095 L
375.825 415.095 L
376.348 415.095 L
376.893 415.095 L
377.423 415.095 L
377.97 415.095 L
378.486 415.095 L
379.045 415.095 L
379.577 415.095 L
380.119 415.095 L
380.664 415.095 L
381.194 415.095 L
381.814 415.095 L
382.346 415.095 L
382.891 415.095 L
383.423 415.095 L
383.958 415.095 L
384.503 415.095 L
385.057 415.095 L
385.599 415.095 L
386.108 415.095 L
386.64 415.095 L
387.185 415.095 L
387.722 415.095 L
388.257 415.095 L
388.787 415.095 L
389.327 415.095 L
389.879 415.095 L
390.428 415.095 L
390.946 415.095 L
391.493 415.095 L
392.04 415.095 L
392.549 415.095 L
393.1 415.095 L
393.645 415.095 L
394.189 415.095 L
394.717 415.095 L
395.264 415.095 L
395.792 415.095 L
396.327 415.095 L
397.147 415.095 L
397.696 415.095 L
398.212 415.095 L
398.757 415.095 L
399.303 415.095 L
399.838 415.095 L
400.38 415.095 L
400.918 415.095 L
401.439 415.095 L
401.976 415.095 L
402.534 415.095 L
403.055 415.095 L
403.602 415.095 L
404.149 415.095 L
404.568 415.095 L
405.117 415.095 L
405.645 415.095 L
406.176 415.095 L
406.734 415.095 L
407.264 415.095 L
407.795 415.095 L
408.32 415.095 L
408.874 415.095 L
409.409 415.095 L
409.956 415.095 L
410.496 415.095 L
411.021 415.095 L
411.627 415.095 L
412.157 415.095 L
412.699 415.095 L
413.232 415.095 L
413.776 415.095 L
414.311 415.095 L
414.867 415.095 L
415.381 415.095 L
415.935 415.095 L
416.465 415.095 L
417.003 415.095 L
417.531 415.095 L
418.075 415.095 L
418.617 415.095 L
419.145 415.095 L
420.064 415.095 L
420.594 415.095 L
421.122 415.095 L
421.669 415.095 L
422.178 415.095 L
422.715 415.095 L
423.239 415.095 L
423.71 415.095 L
424.226 415.095 L
424.761 415.095 L
425.287 415.095 L
425.808 415.095 L
426.571 415.095 L
427.09 415.095 L
427.613 415.095 L
428.131 415.095 L
428.647 415.095 L
429.178 415.095 L
429.703 415.095 L
430.21 415.095 L
430.731 415.095 L
431.245 415.095 L
431.754 415.095 L
432.15 415.095 L
432.638 415.095 L
433.163 415.095 L
433.679 415.095 L
434.179 415.095 L
434.688 415.095 L
435.183 415.095 L
435.699 415.095 L
436.189 415.095 L
436.677 415.095 L
437.184 415.095 L
437.69 415.095 L
438.195 415.095 L
438.668 415.095 L
439.17 415.095 L
439.675 415.095 L
440.16 415.095 L
440.662 415.095 L
441.145 415.095 L
442.343 415.095 L
442.812 415.095 L
443.314 415.095 L
443.792 415.095 L
444.292 415.095 L
444.77 415.095 L
445.253 415.095 L
445.715 415.095 L
446.212 415.095 L
446.674 415.095 L
447.148 415.095 L
447.617 415.095 L
448.098 415.095 L
448.579 415.095 L
449.043 415.095 L
449.507 415.095 L
449.983 415.095 L
450.457 415.095 L
450.931 415.095 L
451.404 415.095 L
451.866 415.095 L
452.321 415.095 L
452.797 415.095 L
453.82 415.095 L
454.289 415.095 L
454.753 415.095 L
455.201 415.095 L
455.668 415.095 L
456.116 415.095 L
456.578 415.095 L
457.04 415.095 L
457.539 415.095 L
458.006 415.095 L
458.454 415.095 L
458.913 415.095 L
459.363 415.095 L
459.818 415.095 L
460.275 415.095 L
460.702 415.095 L
461.154 415.095 L
461.605 415.095 L
462.036 415.095 L
462.484 415.095 L
462.936 415.095 L
463.377 415.095 L
463.813 415.095 L
464.256 415.095 L
464.687 415.095 L
465.526 415.095 L
465.965 415.095 L
466.401 415.095 L
466.825 415.095 L
467.261 415.095 L
467.697 415.095 L
468.123 415.095 L
468.555 415.095 L
468.981 415.095 L
469.365 415.095 L
469.79 415.095 L
470.219 415.095 L
470.64 415.095 L
471.067 415.095 L
471.477 415.095 L
471.899 415.095 L
472.318 415.095 L
472.74 415.095 L
473.148 415.095 L
473.568 415.095 L
473.975 415.095 L
474.395 415.095 L
474.805 415.095 L
475.213 415.095 L
475.625 415.095 L
476.03 415.095 L
476.426 415.095 L
476.846 415.095 L
477.237 415.095 L
477.633 415.095 L
478.031 415.095 L
478.427 415.095 L
478.849 415.095 L
479.252 415.095 L
479.643 415.095 L
480.042 415.095 L
480.428 415.095 L
480.826 415.095 L
481.22 415.095 L
481.616 415.095 L
482.007 415.095 L
482.389 415.095 L
482.771 415.095 L
483.134 415.095 L
483.523 415.095 L
483.914 415.095 L
484.305 415.095 L
484.682 415.095 L
485.062 415.095 L
485.439 415.095 L
485.816 415.095 L
486.207 415.095 L
486.572 415.095 L
486.945 415.095 L
487.333 415.095 L
487.701 415.095 L
488.066 415.095 L
488.469 415.095 L
488.832 415.095 L
489.207 415.095 L
489.57 415.095 L
489.942 415.095 L
490.312 415.095 L
490.673 415.095 L
491.031 415.095 L
491.394 415.095 L
491.75 415.095 L
492.099 415.095 L
492.457 415.095 L
492.82 415.095 L
493.169 415.095 L
493.522 415.095 L
493.869 415.095 L
494.229 415.095 L
494.578 415.095 L
494.922 415.095 L
495.266 415.095 L
495.613 415.095 L
495.954 415.095 L
496.296 415.095 L
496.633 415.095 L
496.977 415.095 L
497.314 415.095 L
497.654 415.095 L
497.991 415.095 L
498.332 415.095 L
498.655 415.095 L
498.995 415.095 L
499.32 415.095 L
499.643 415.095 L
499.978 415.095 L
500.305 415.095 L
500.628 415.095 L
501.092 415.095 L
501.403 415.095 L
501.731 415.095 L
502.054 415.095 L
502.37 415.095 L
502.693 415.095 L
503.008 415.095 L
503.312 415.095 L
503.628 415.095 L
503.946 415.095 L
504.26 415.095 L
504.561 415.095 L
504.873 415.095 L
505.181 415.095 L
505.634 415.095 L
505.945 415.095 L
506.388 415.095 L
506.697 415.095 L
507.107 415.095 L
507.545 415.095 L
507.993 415.095 L
508.299 415.095 L
508.74 415.095 L
509.171 415.095 L
509.61 415.095 L
510.029 415.095 L
510.628 415.095 L
511.052 415.095 L
511.476 415.095 L
511.891 415.095 L
512.32 415.095 L
512.73 415.095 L
513.147 415.095 L
513.552 415.095 L
513.97 415.095 L
514.375 415.095 L
514.78 415.095 L
515.172 415.095 L
515.572 415.095 L
515.98 415.095 L
516.364 415.095 L
516.76 415.095 L
517.137 415.095 L
517.533 415.095 L
517.913 415.095 L
518.283 415.095 L
518.664 415.095 L
519.046 415.095 L
519.414 415.095 L
519.791 415.095 L
520.154 415.095 L
520.521 415.095 L
520.868 415.095 L
521.224 415.095 L
521.594 415.095 L
521.94 415.095 L
522.284 415.095 L
522.628 415.095 L
522.977 415.095 L
523.376 415.095 L
523.71 415.095 L
524.052 415.095 L
524.387 415.095 L
524.714 415.095 L
525.042 415.095 L
525.372 415.095 L
525.688 415.095 L
526.01 415.095 L
526.319 415.095 L
526.637 415.095 L
526.955 415.095 L
527.257 415.095 L
527.573 415.095 L
527.978 415.095 L
528.37 415.095 L
528.69 415.095 L
529.081 415.095 L
529.383 415.095 L
529.765 415.095 L
530.151 415.095 L
530.521 415.095 L
530.891 415.095 L
531.264 415.095 L
531.627 415.095 L
531.975 415.095 L
532.331 415.095 L
532.97 415.095 L
533.312 415.095 L
533.66 415.095 L
533.99 415.095 L
534.332 415.095 L
545.338 415.095 L
545.668 415.095 L
545.982 415.095 L
546.297 415.095 L
546.602 415.095 L
546.908 415.095 L
547.21 415.095 L
547.573 415.095 L
547.931 415.095 L
548.284 415.095 L
548.635 415.095 L
548.972 415.095 L
549.314 415.095 L
549.92 415.095 L
550.247 415.095 L
550.575 415.095 L
550.898 415.095 L
551.223 415.095 L
551.551 415.095 L
551.878 415.095 L
552.201 415.095 L
552.522 415.095 L
552.849 415.095 L
553.177 415.095 L
553.502 415.095 L
553.832 415.095 L
554.162 415.095 L
554.483 415.095 L
554.82 415.095 L
555.142 415.095 L
555.47 415.095 L
555.8 415.095 L
556.13 415.095 L
556.462 415.095 L
556.787 415.095 L
557.117 415.095 L
557.445 415.095 L
557.773 415.095 L
558.107 415.095 L
558.44 415.095 L
558.762 415.095 L
559.097 415.095 L
559.427 415.095 L
559.766 415.095 L
560.094 415.095 L
560.433 415.095 L
560.763 415.095 L
561.096 415.095 L
561.43 415.095 L
561.765 415.095 L
562.1 415.095 L
562.437 415.095 L
562.771 415.095 L
563.094 415.095 L
563.429 415.095 L
563.763 415.095 L
564.101 415.095 L
564.438 415.095 L
564.768 415.095 L
565.109 415.095 L
565.444 415.095 L
565.781 415.095 L
566.116 415.095 L
566.45 415.095 L
566.79 415.095 L
567.129 415.095 L
567.473 415.095 L
567.808 415.095 L
568.14 415.095 L
568.475 415.095 L
568.795 415.095 L
569.12 415.095 L
569.436 415.095 L
569.757 415.095 L
570.075 415.095 L
570.388 415.095 L
570.697 415.095 L
571.013 415.095 L
571.326 415.095 L
571.64 415.095 L
571.956 415.095 L
572.267 415.095 L
572.578 415.095 L
572.898 415.095 L
573.214 415.095 L
573.53 415.095 L
573.848 415.095 L
574.162 415.095 L
S
GR
GS
[0.6 0 0 0.6 0 0] CT
1 GC
N
621 98 M
621 52 L
445 52 L
445 98 L
cp
f
GR
GS
[0.6 0 0 0.6 302.30013 38.76164] CT
/Helvetica 15 F
GS
[1 0 0 1 0 0] CT
0 6 moveto 
1 -1 scale
(Simulovan\341 data) t 
GR
GR
GS
[0.6 0 0 0.6 0 0] CT
0 0.447 0.741 RC
1 LJ
3.333 LW
N
450.007 64.603 M
500.078 64.603 L
S
GR
GS
[0.6 0 0 0.6 302.30013 51.23836] CT
N
1.141 6 M
1.141 -4.734 L
2.594 -4.734 L
8.234 3.688 L
8.234 -4.734 L
9.609 -4.734 L
9.609 6 L
8.141 6 L
2.5 -2.438 L
2.5 6 L
1.141 6 L
cp
16.895 5.047 M
16.161 5.656 15.489 5.914 QT
14.817 6.172 14.036 6.172 QT
12.754 6.172 12.067 5.547 QT
11.379 4.922 11.379 3.953 QT
11.379 3.375 11.637 2.906 QT
11.895 2.438 12.317 2.148 QT
12.739 1.859 13.27 1.719 QT
13.645 1.609 14.442 1.516 QT
16.036 1.328 16.786 1.063 QT
16.801 0.797 16.801 0.719 QT
16.801 -0.094 16.426 -0.422 QT
15.911 -0.859 14.926 -0.859 QT
13.989 -0.859 13.543 -0.539 QT
13.098 -0.219 12.895 0.609 QT
11.598 0.438 L
11.77 -0.391 12.176 -0.898 QT
12.583 -1.406 13.348 -1.68 QT
14.114 -1.953 15.114 -1.953 QT
16.114 -1.953 16.731 -1.719 QT
17.348 -1.484 17.645 -1.133 QT
17.942 -0.781 18.051 -0.234 QT
18.114 0.109 18.114 0.984 QT
18.114 2.734 L
18.114 4.578 18.2 5.063 QT
18.286 5.547 18.536 6 QT
17.161 6 L
16.958 5.594 16.895 5.047 QT
cp
16.786 2.094 M
16.067 2.391 14.629 2.594 QT
13.817 2.719 13.481 2.859 QT
13.145 3 12.965 3.281 QT
12.786 3.563 12.786 3.906 QT
12.786 4.438 13.184 4.789 QT
13.583 5.141 14.348 5.141 QT
15.114 5.141 15.708 4.805 QT
16.301 4.469 16.583 3.891 QT
16.786 3.453 16.786 2.578 QT
16.786 2.094 L
cp
20.159 6 M
20.159 -1.781 L
21.347 -1.781 L
21.347 -0.688 L
21.706 -1.266 22.315 -1.609 QT
22.925 -1.953 23.706 -1.953 QT
24.565 -1.953 25.12 -1.594 QT
25.675 -1.234 25.894 -0.594 QT
26.815 -1.953 28.3 -1.953 QT
29.456 -1.953 30.081 -1.313 QT
30.706 -0.672 30.706 0.656 QT
30.706 6 L
29.394 6 L
29.394 1.094 L
29.394 0.313 29.269 -0.039 QT
29.144 -0.391 28.8 -0.602 QT
28.456 -0.813 28.003 -0.813 QT
27.19 -0.813 26.644 -0.266 QT
26.097 0.281 26.097 1.484 QT
26.097 6 L
24.784 6 L
24.784 0.953 L
24.784 0.063 24.464 -0.375 QT
24.144 -0.813 23.409 -0.813 QT
22.847 -0.813 22.378 -0.516 QT
21.909 -0.219 21.698 0.344 QT
21.487 0.906 21.487 1.969 QT
21.487 6 L
20.159 6 L
cp
37.982 3.5 M
39.342 3.656 L
39.029 4.859 38.154 5.516 QT
37.279 6.172 35.92 6.172 QT
34.217 6.172 33.217 5.125 QT
32.217 4.078 32.217 2.172 QT
32.217 0.219 33.232 -0.867 QT
34.248 -1.953 35.857 -1.953 QT
37.42 -1.953 38.404 -0.891 QT
39.389 0.172 39.389 2.094 QT
39.389 2.219 39.389 2.453 QT
33.576 2.453 L
33.654 3.734 34.303 4.414 QT
34.951 5.094 35.936 5.094 QT
36.654 5.094 37.17 4.711 QT
37.686 4.328 37.982 3.5 QT
cp
33.654 1.359 M
37.998 1.359 L
37.904 0.375 37.498 -0.109 QT
36.873 -0.875 35.873 -0.875 QT
34.951 -0.875 34.334 -0.266 QT
33.717 0.344 33.654 1.359 QT
cp
35.67 -3.797 M
36.482 -5.047 L
37.967 -5.047 L
36.326 -3 L
34.92 -3 L
33.342 -5.047 L
34.842 -5.047 L
35.67 -3.797 L
cp
40.981 6 M
40.981 -1.781 L
42.168 -1.781 L
42.168 -0.594 L
42.622 -1.422 43.012 -1.688 QT
43.403 -1.953 43.856 -1.953 QT
44.528 -1.953 45.215 -1.531 QT
44.762 -0.313 L
44.278 -0.594 43.793 -0.594 QT
43.356 -0.594 43.012 -0.336 QT
42.668 -0.078 42.528 0.391 QT
42.309 1.094 42.309 1.922 QT
42.309 6 L
40.981 6 L
cp
43.012 -3.797 M
43.825 -5.047 L
45.309 -5.047 L
43.668 -3 L
42.262 -3 L
40.684 -5.047 L
42.184 -5.047 L
43.012 -3.797 L
cp
51.32 3.5 M
52.679 3.656 L
52.367 4.859 51.492 5.516 QT
50.617 6.172 49.257 6.172 QT
47.554 6.172 46.554 5.125 QT
45.554 4.078 45.554 2.172 QT
45.554 0.219 46.57 -0.867 QT
47.585 -1.953 49.195 -1.953 QT
50.757 -1.953 51.742 -0.891 QT
52.726 0.172 52.726 2.094 QT
52.726 2.219 52.726 2.453 QT
46.914 2.453 L
46.992 3.734 47.64 4.414 QT
48.289 5.094 49.273 5.094 QT
49.992 5.094 50.507 4.711 QT
51.023 4.328 51.32 3.5 QT
cp
46.992 1.359 M
51.335 1.359 L
51.242 0.375 50.835 -0.109 QT
50.21 -0.875 49.21 -0.875 QT
48.289 -0.875 47.671 -0.266 QT
47.054 0.344 46.992 1.359 QT
cp
54.334 6 M
54.334 -1.781 L
55.521 -1.781 L
55.521 -0.672 L
56.381 -1.953 58.006 -1.953 QT
58.709 -1.953 59.295 -1.703 QT
59.881 -1.453 60.178 -1.039 QT
60.475 -0.625 60.584 -0.063 QT
60.662 0.297 60.662 1.219 QT
60.662 6 L
59.334 6 L
59.334 1.266 L
59.334 0.469 59.186 0.07 QT
59.037 -0.328 58.646 -0.57 QT
58.256 -0.813 57.725 -0.813 QT
56.881 -0.813 56.271 -0.281 QT
55.662 0.25 55.662 1.75 QT
55.662 6 L
54.334 6 L
cp
67.754 5.047 M
67.02 5.656 66.348 5.914 QT
65.676 6.172 64.895 6.172 QT
63.614 6.172 62.926 5.547 QT
62.239 4.922 62.239 3.953 QT
62.239 3.375 62.497 2.906 QT
62.754 2.438 63.176 2.148 QT
63.598 1.859 64.129 1.719 QT
64.504 1.609 65.301 1.516 QT
66.895 1.328 67.645 1.063 QT
67.661 0.797 67.661 0.719 QT
67.661 -0.094 67.286 -0.422 QT
66.77 -0.859 65.786 -0.859 QT
64.848 -0.859 64.403 -0.539 QT
63.958 -0.219 63.754 0.609 QT
62.458 0.438 L
62.629 -0.391 63.036 -0.898 QT
63.442 -1.406 64.208 -1.68 QT
64.973 -1.953 65.973 -1.953 QT
66.973 -1.953 67.59 -1.719 QT
68.208 -1.484 68.504 -1.133 QT
68.801 -0.781 68.911 -0.234 QT
68.973 0.109 68.973 0.984 QT
68.973 2.734 L
68.973 4.578 69.059 5.063 QT
69.145 5.547 69.395 6 QT
68.02 6 L
67.817 5.594 67.754 5.047 QT
cp
67.645 2.094 M
66.926 2.391 65.489 2.594 QT
64.676 2.719 64.34 2.859 QT
64.004 3 63.825 3.281 QT
63.645 3.563 63.645 3.906 QT
63.645 4.438 64.043 4.789 QT
64.442 5.141 65.208 5.141 QT
65.973 5.141 66.567 4.805 QT
67.161 4.469 67.442 3.891 QT
67.645 3.453 67.645 2.578 QT
67.645 2.094 L
cp
64.598 -3 M
65.567 -5.047 L
67.301 -5.047 L
65.692 -3 L
64.598 -3 L
cp
80.233 6 M
80.233 5.016 L
79.499 6.172 78.061 6.172 QT
77.139 6.172 76.358 5.664 QT
75.577 5.156 75.147 4.234 QT
74.717 3.313 74.717 2.125 QT
74.717 0.953 75.108 0.008 QT
75.499 -0.938 76.272 -1.445 QT
77.045 -1.953 77.999 -1.953 QT
78.702 -1.953 79.256 -1.656 QT
79.811 -1.359 80.155 -0.891 QT
80.155 -4.734 L
81.467 -4.734 L
81.467 6 L
80.233 6 L
cp
76.077 2.125 M
76.077 3.609 76.702 4.352 QT
77.327 5.094 78.186 5.094 QT
79.045 5.094 79.655 4.383 QT
80.264 3.672 80.264 2.234 QT
80.264 0.625 79.647 -0.117 QT
79.03 -0.859 78.124 -0.859 QT
77.249 -0.859 76.663 -0.141 QT
76.077 0.578 76.077 2.125 QT
cp
88.606 5.047 M
87.872 5.656 87.2 5.914 QT
86.528 6.172 85.747 6.172 QT
84.466 6.172 83.778 5.547 QT
83.091 4.922 83.091 3.953 QT
83.091 3.375 83.349 2.906 QT
83.606 2.438 84.028 2.148 QT
84.45 1.859 84.981 1.719 QT
85.356 1.609 86.153 1.516 QT
87.747 1.328 88.497 1.063 QT
88.513 0.797 88.513 0.719 QT
88.513 -0.094 88.138 -0.422 QT
87.622 -0.859 86.638 -0.859 QT
85.7 -0.859 85.255 -0.539 QT
84.81 -0.219 84.606 0.609 QT
83.31 0.438 L
83.481 -0.391 83.888 -0.898 QT
84.294 -1.406 85.06 -1.68 QT
85.825 -1.953 86.825 -1.953 QT
87.825 -1.953 88.442 -1.719 QT
89.06 -1.484 89.356 -1.133 QT
89.653 -0.781 89.763 -0.234 QT
89.825 0.109 89.825 0.984 QT
89.825 2.734 L
89.825 4.578 89.911 5.063 QT
89.997 5.547 90.247 6 QT
88.872 6 L
88.669 5.594 88.606 5.047 QT
cp
88.497 2.094 M
87.778 2.391 86.341 2.594 QT
85.528 2.719 85.192 2.859 QT
84.856 3 84.677 3.281 QT
84.497 3.563 84.497 3.906 QT
84.497 4.438 84.896 4.789 QT
85.294 5.141 86.06 5.141 QT
86.825 5.141 87.419 4.805 QT
88.013 4.469 88.294 3.891 QT
88.497 3.453 88.497 2.578 QT
88.497 2.094 L
cp
94.761 4.828 M
94.949 5.984 L
94.386 6.109 93.949 6.109 QT
93.23 6.109 92.832 5.875 QT
92.433 5.641 92.277 5.273 QT
92.121 4.906 92.121 3.719 QT
92.121 -0.75 L
91.152 -0.75 L
91.152 -1.781 L
92.121 -1.781 L
92.121 -3.703 L
93.433 -4.5 L
93.433 -1.781 L
94.761 -1.781 L
94.761 -0.75 L
93.433 -0.75 L
93.433 3.797 L
93.433 4.359 93.503 4.523 QT
93.574 4.688 93.73 4.781 QT
93.886 4.875 94.167 4.875 QT
94.402 4.875 94.761 4.828 QT
cp
101.116 5.047 M
100.382 5.656 99.71 5.914 QT
99.038 6.172 98.257 6.172 QT
96.976 6.172 96.288 5.547 QT
95.601 4.922 95.601 3.953 QT
95.601 3.375 95.858 2.906 QT
96.116 2.438 96.538 2.148 QT
96.96 1.859 97.491 1.719 QT
97.866 1.609 98.663 1.516 QT
100.257 1.328 101.007 1.063 QT
101.022 0.797 101.022 0.719 QT
101.022 -0.094 100.647 -0.422 QT
100.132 -0.859 99.147 -0.859 QT
98.21 -0.859 97.765 -0.539 QT
97.319 -0.219 97.116 0.609 QT
95.819 0.438 L
95.991 -0.391 96.397 -0.898 QT
96.804 -1.406 97.569 -1.68 QT
98.335 -1.953 99.335 -1.953 QT
100.335 -1.953 100.952 -1.719 QT
101.569 -1.484 101.866 -1.133 QT
102.163 -0.781 102.272 -0.234 QT
102.335 0.109 102.335 0.984 QT
102.335 2.734 L
102.335 4.578 102.421 5.063 QT
102.507 5.547 102.757 6 QT
101.382 6 L
101.179 5.594 101.116 5.047 QT
cp
101.007 2.094 M
100.288 2.391 98.851 2.594 QT
98.038 2.719 97.702 2.859 QT
97.366 3 97.187 3.281 QT
97.007 3.563 97.007 3.906 QT
97.007 4.438 97.405 4.789 QT
97.804 5.141 98.569 5.141 QT
99.335 5.141 99.929 4.805 QT
100.522 4.469 100.804 3.891 QT
101.007 3.453 101.007 2.578 QT
101.007 2.094 L
cp
f
GR
GS
[0.6 0 0 0.6 0 0] CT
0.851 0.325 0.098 RC
1 LJ
3.333 LW
N
450.007 85.397 M
500.078 85.397 L
S
GR
GS
[0.6 0 0 0.6 0 0] CT
0.149 GC
10.0 ML
0.833 LW
N
445 98 M
445 52 L
621 52 L
621 98 L
cp
S
GR
%%Trailer
%%Pages: 1
%%EOF
