%!PS-Adobe-3.0 EPSF-3.0
%%Creator: (MATLAB, The Mathworks, Inc. Version 9.14.0.2206163 \(R2023a\). Operating System: Windows 10)
%%Title: C:/Users/radac/Desktop/Bachelor_thesis/thesis/Metody/fig/EKF_average/RMSE_150.eps
%%CreationDate: 2023-05-01T15:47:18
%%Pages: (atend)
%%BoundingBox:     0     0   420   315
%%LanguageLevel: 3
%%EndComments
%%BeginProlog
%%BeginResource: procset (Apache XML Graphics Std ProcSet) 1.2 0
%%Version: 1.2 0
%%Copyright: (Copyright 2001-2003,2010 The Apache Software Foundation. License terms: http://www.apache.org/licenses/LICENSE-2.0)
/bd{bind def}bind def
/ld{load def}bd
/GR/grestore ld
/GS/gsave ld
/RM/rmoveto ld
/C/curveto ld
/t/show ld
/L/lineto ld
/ML/setmiterlimit ld
/CT/concat ld
/f/fill ld
/N/newpath ld
/S/stroke ld
/CC/setcmykcolor ld
/A/ashow ld
/cp/closepath ld
/RC/setrgbcolor ld
/LJ/setlinejoin ld
/GC/setgray ld
/LW/setlinewidth ld
/M/moveto ld
/re {4 2 roll M
1 index 0 rlineto
0 exch rlineto
neg 0 rlineto
cp } bd
/_ctm matrix def
/_tm matrix def
/BT { _ctm currentmatrix pop matrix _tm copy pop 0 0 moveto } bd
/ET { _ctm setmatrix } bd
/iTm { _ctm setmatrix _tm concat } bd
/Tm { _tm astore pop iTm 0 0 moveto } bd
/ux 0.0 def
/uy 0.0 def
/F {
  /Tp exch def
  /Tf exch def
  Tf findfont Tp scalefont setfont
  /cf Tf def  /cs Tp def
} bd
/ULS {currentpoint /uy exch def /ux exch def} bd
/ULE {
  /Tcx currentpoint pop def
  gsave
  newpath
  cf findfont cs scalefont dup
  /FontMatrix get 0 get /Ts exch def /FontInfo get dup
  /UnderlinePosition get Ts mul /To exch def
  /UnderlineThickness get Ts mul /Tt exch def
  ux uy To add moveto  Tcx uy To add lineto
  Tt setlinewidth stroke
  grestore
} bd
/OLE {
  /Tcx currentpoint pop def
  gsave
  newpath
  cf findfont cs scalefont dup
  /FontMatrix get 0 get /Ts exch def /FontInfo get dup
  /UnderlinePosition get Ts mul /To exch def
  /UnderlineThickness get Ts mul /Tt exch def
  ux uy To add cs add moveto Tcx uy To add cs add lineto
  Tt setlinewidth stroke
  grestore
} bd
/SOE {
  /Tcx currentpoint pop def
  gsave
  newpath
  cf findfont cs scalefont dup
  /FontMatrix get 0 get /Ts exch def /FontInfo get dup
  /UnderlinePosition get Ts mul /To exch def
  /UnderlineThickness get Ts mul /Tt exch def
  ux uy To add cs 10 mul 26 idiv add moveto Tcx uy To add cs 10 mul 26 idiv add lineto
  Tt setlinewidth stroke
  grestore
} bd
/QT {
/Y22 exch store
/X22 exch store
/Y21 exch store
/X21 exch store
currentpoint
/Y21 load 2 mul add 3 div exch
/X21 load 2 mul add 3 div exch
/X21 load 2 mul /X22 load add 3 div
/Y21 load 2 mul /Y22 load add 3 div
/X22 load /Y22 load curveto
} bd
/SSPD {
dup length /d exch dict def
{
/v exch def
/k exch def
currentpagedevice k known {
/cpdv currentpagedevice k get def
v cpdv ne {
/upd false def
/nullv v type /nulltype eq def
/nullcpdv cpdv type /nulltype eq def
nullv nullcpdv or
{
/upd true def
} {
/sametype v type cpdv type eq def
sametype {
v type /arraytype eq {
/vlen v length def
/cpdvlen cpdv length def
vlen cpdvlen eq {
0 1 vlen 1 sub {
/i exch def
/obj v i get def
/cpdobj cpdv i get def
obj cpdobj ne {
/upd true def
exit
} if
} for
} {
/upd true def
} ifelse
} {
v type /dicttype eq {
v {
/dv exch def
/dk exch def
/cpddv cpdv dk get def
dv cpddv ne {
/upd true def
exit
} if
} forall
} {
/upd true def
} ifelse
} ifelse
} if
} ifelse
upd true eq {
d k v put
} if
} if
} if
} forall
d length 0 gt {
d setpagedevice
} if
} bd
/RE { % /NewFontName [NewEncodingArray] /FontName RE -
  findfont dup length dict begin
  {
    1 index /FID ne
    {def} {pop pop} ifelse
  } forall
  /Encoding exch def
  /FontName 1 index def
  currentdict definefont pop
  end
} bind def
%%EndResource
%%BeginResource: procset (Apache XML Graphics EPS ProcSet) 1.0 0
%%Version: 1.0 0
%%Copyright: (Copyright 2002-2003 The Apache Software Foundation. License terms: http://www.apache.org/licenses/LICENSE-2.0)
/BeginEPSF { %def
/b4_Inc_state save def         % Save state for cleanup
/dict_count countdictstack def % Count objects on dict stack
/op_count count 1 sub def      % Count objects on operand stack
userdict begin                 % Push userdict on dict stack
/showpage { } def              % Redefine showpage, { } = null proc
0 setgray 0 setlinecap         % Prepare graphics state
1 setlinewidth 0 setlinejoin
10 setmiterlimit [ ] 0 setdash newpath
/languagelevel where           % If level not equal to 1 then
{pop languagelevel             % set strokeadjust and
1 ne                           % overprint to their defaults.
{false setstrokeadjust false setoverprint
} if
} if
} bd
/EndEPSF { %def
count op_count sub {pop} repeat            % Clean up stacks
countdictstack dict_count sub {end} repeat
b4_Inc_state restore
} bd
%%EndResource
%FOPBeginFontDict
%%IncludeResource: font Courier-Oblique
%%IncludeResource: font Courier-BoldOblique
%%IncludeResource: font Courier-Bold
%%IncludeResource: font ZapfDingbats
%%IncludeResource: font Symbol
%%IncludeResource: font Helvetica
%%IncludeResource: font Helvetica-Oblique
%%IncludeResource: font Helvetica-Bold
%%IncludeResource: font Helvetica-BoldOblique
%%IncludeResource: font Times-Roman
%%IncludeResource: font Times-Italic
%%IncludeResource: font Times-Bold
%%IncludeResource: font Times-BoldItalic
%%IncludeResource: font Courier
%FOPEndFontDict
%%BeginResource: encoding WinAnsiEncoding
/WinAnsiEncoding [
/.notdef /.notdef /.notdef /.notdef /.notdef
/.notdef /.notdef /.notdef /.notdef /.notdef
/.notdef /.notdef /.notdef /.notdef /.notdef
/.notdef /.notdef /.notdef /.notdef /.notdef
/.notdef /.notdef /.notdef /.notdef /.notdef
/.notdef /.notdef /.notdef /.notdef /.notdef
/.notdef /.notdef /space /exclam /quotedbl
/numbersign /dollar /percent /ampersand /quotesingle
/parenleft /parenright /asterisk /plus /comma
/hyphen /period /slash /zero /one
/two /three /four /five /six
/seven /eight /nine /colon /semicolon
/less /equal /greater /question /at
/A /B /C /D /E
/F /G /H /I /J
/K /L /M /N /O
/P /Q /R /S /T
/U /V /W /X /Y
/Z /bracketleft /backslash /bracketright /asciicircum
/underscore /quoteleft /a /b /c
/d /e /f /g /h
/i /j /k /l /m
/n /o /p /q /r
/s /t /u /v /w
/x /y /z /braceleft /bar
/braceright /asciitilde /bullet /Euro /bullet
/quotesinglbase /florin /quotedblbase /ellipsis /dagger
/daggerdbl /circumflex /perthousand /Scaron /guilsinglleft
/OE /bullet /Zcaron /bullet /bullet
/quoteleft /quoteright /quotedblleft /quotedblright /bullet
/endash /emdash /asciitilde /trademark /scaron
/guilsinglright /oe /bullet /zcaron /Ydieresis
/space /exclamdown /cent /sterling /currency
/yen /brokenbar /section /dieresis /copyright
/ordfeminine /guillemotleft /logicalnot /sfthyphen /registered
/macron /degree /plusminus /twosuperior /threesuperior
/acute /mu /paragraph /middot /cedilla
/onesuperior /ordmasculine /guillemotright /onequarter /onehalf
/threequarters /questiondown /Agrave /Aacute /Acircumflex
/Atilde /Adieresis /Aring /AE /Ccedilla
/Egrave /Eacute /Ecircumflex /Edieresis /Igrave
/Iacute /Icircumflex /Idieresis /Eth /Ntilde
/Ograve /Oacute /Ocircumflex /Otilde /Odieresis
/multiply /Oslash /Ugrave /Uacute /Ucircumflex
/Udieresis /Yacute /Thorn /germandbls /agrave
/aacute /acircumflex /atilde /adieresis /aring
/ae /ccedilla /egrave /eacute /ecircumflex
/edieresis /igrave /iacute /icircumflex /idieresis
/eth /ntilde /ograve /oacute /ocircumflex
/otilde /odieresis /divide /oslash /ugrave
/uacute /ucircumflex /udieresis /yacute /thorn
/ydieresis
] def
%%EndResource
%FOPBeginFontReencode
/Courier-Oblique findfont
dup length dict begin
  {1 index /FID ne {def} {pop pop} ifelse} forall
  /Encoding WinAnsiEncoding def
  currentdict
end
/Courier-Oblique exch definefont pop
/Courier-BoldOblique findfont
dup length dict begin
  {1 index /FID ne {def} {pop pop} ifelse} forall
  /Encoding WinAnsiEncoding def
  currentdict
end
/Courier-BoldOblique exch definefont pop
/Courier-Bold findfont
dup length dict begin
  {1 index /FID ne {def} {pop pop} ifelse} forall
  /Encoding WinAnsiEncoding def
  currentdict
end
/Courier-Bold exch definefont pop
/Helvetica findfont
dup length dict begin
  {1 index /FID ne {def} {pop pop} ifelse} forall
  /Encoding WinAnsiEncoding def
  currentdict
end
/Helvetica exch definefont pop
/Helvetica-Oblique findfont
dup length dict begin
  {1 index /FID ne {def} {pop pop} ifelse} forall
  /Encoding WinAnsiEncoding def
  currentdict
end
/Helvetica-Oblique exch definefont pop
/Helvetica-Bold findfont
dup length dict begin
  {1 index /FID ne {def} {pop pop} ifelse} forall
  /Encoding WinAnsiEncoding def
  currentdict
end
/Helvetica-Bold exch definefont pop
/Helvetica-BoldOblique findfont
dup length dict begin
  {1 index /FID ne {def} {pop pop} ifelse} forall
  /Encoding WinAnsiEncoding def
  currentdict
end
/Helvetica-BoldOblique exch definefont pop
/Times-Roman findfont
dup length dict begin
  {1 index /FID ne {def} {pop pop} ifelse} forall
  /Encoding WinAnsiEncoding def
  currentdict
end
/Times-Roman exch definefont pop
/Times-Italic findfont
dup length dict begin
  {1 index /FID ne {def} {pop pop} ifelse} forall
  /Encoding WinAnsiEncoding def
  currentdict
end
/Times-Italic exch definefont pop
/Times-Bold findfont
dup length dict begin
  {1 index /FID ne {def} {pop pop} ifelse} forall
  /Encoding WinAnsiEncoding def
  currentdict
end
/Times-Bold exch definefont pop
/Times-BoldItalic findfont
dup length dict begin
  {1 index /FID ne {def} {pop pop} ifelse} forall
  /Encoding WinAnsiEncoding def
  currentdict
end
/Times-BoldItalic exch definefont pop
/Courier findfont
dup length dict begin
  {1 index /FID ne {def} {pop pop} ifelse} forall
  /Encoding WinAnsiEncoding def
  currentdict
end
/Courier exch definefont pop
%FOPEndFontReencode
%%EndProlog
%%Page: 1 1
%%PageBoundingBox: 0 0 420 315
%%BeginPageSetup
[1 0 0 -1 0 315] CT
%%EndPageSetup
GS
[0.6 0 0 0.6 0 0] CT
1 GC
N
0 0 700 525 re
f
GR
GS
[0.6 0 0 0.6 0 0] CT
1 GC
N
0 0 700 525 re
f
GR
GS
[0.6 0 0 0.6 0 0] CT
1 GC
N
91 467 M
634 467 L
634 39 L
91 39 L
cp
f
GR
GS
[0.6 0 0 0.6 0 0] CT
0.873 GC
1 LJ
0.833 LW
N
91 467 M
91 39 L
S
GR
GS
[0.6 0 0 0.6 0 0] CT
0.873 GC
1 LJ
0.833 LW
N
272 467 M
272 39 L
S
GR
GS
[0.6 0 0 0.6 0 0] CT
0.873 GC
1 LJ
0.833 LW
N
453 467 M
453 39 L
S
GR
GS
[0.6 0 0 0.6 0 0] CT
0.873 GC
1 LJ
0.833 LW
N
634 467 M
634 39 L
S
GR
GS
[0.6 0 0 0.6 0 0] CT
0.873 GC
1 LJ
0.833 LW
N
634 467 M
91 467 L
S
GR
GS
[0.6 0 0 0.6 0 0] CT
0.873 GC
1 LJ
0.833 LW
N
634 395.667 M
91 395.667 L
S
GR
GS
[0.6 0 0 0.6 0 0] CT
0.873 GC
1 LJ
0.833 LW
N
634 324.333 M
91 324.333 L
S
GR
GS
[0.6 0 0 0.6 0 0] CT
0.873 GC
1 LJ
0.833 LW
N
634 253 M
91 253 L
S
GR
GS
[0.6 0 0 0.6 0 0] CT
0.873 GC
1 LJ
0.833 LW
N
634 181.667 M
91 181.667 L
S
GR
GS
[0.6 0 0 0.6 0 0] CT
0.873 GC
1 LJ
0.833 LW
N
634 110.333 M
91 110.333 L
S
GR
GS
[0.6 0 0 0.6 0 0] CT
0.873 GC
1 LJ
0.833 LW
N
634 39 M
91 39 L
S
GR
GS
[0.6 0 0 0.6 0 0] CT
0.149 GC
2 setlinecap
1 LJ
0.833 LW
N
91 467 M
634 467 L
S
GR
GS
[0.6 0 0 0.6 0 0] CT
0.149 GC
2 setlinecap
1 LJ
0.833 LW
N
91 39 M
634 39 L
S
GR
GS
[0.6 0 0 0.6 0 0] CT
0.149 GC
2 setlinecap
1 LJ
0.833 LW
N
91 467 M
91 461.57 L
S
GR
GS
[0.6 0 0 0.6 0 0] CT
0.149 GC
2 setlinecap
1 LJ
0.833 LW
N
272 467 M
272 461.57 L
S
GR
GS
[0.6 0 0 0.6 0 0] CT
0.149 GC
2 setlinecap
1 LJ
0.833 LW
N
453 467 M
453 461.57 L
S
GR
GS
[0.6 0 0 0.6 0 0] CT
0.149 GC
2 setlinecap
1 LJ
0.833 LW
N
634 467 M
634 461.57 L
S
GR
GS
[0.6 0 0 0.6 0 0] CT
0.149 GC
2 setlinecap
1 LJ
0.833 LW
N
91 39 M
91 44.43 L
S
GR
GS
[0.6 0 0 0.6 0 0] CT
0.149 GC
2 setlinecap
1 LJ
0.833 LW
N
272 39 M
272 44.43 L
S
GR
GS
[0.6 0 0 0.6 0 0] CT
0.149 GC
2 setlinecap
1 LJ
0.833 LW
N
453 39 M
453 44.43 L
S
GR
GS
[0.6 0 0 0.6 0 0] CT
0.149 GC
2 setlinecap
1 LJ
0.833 LW
N
634 39 M
634 44.43 L
S
GR
GS
[0.6 0 0 0.6 54.6 284.19999] CT
0.149 GC
/Helvetica 16.667 F
GS
[1 0 0 1 0 0] CT
-5 17 moveto 
1 -1 scale
(0) t 
GR
GR
GS
[0.6 0 0 0.6 163.2 284.19999] CT
0.149 GC
/Helvetica 16.667 F
GS
[1 0 0 1 0 0] CT
-9.5 17 moveto 
1 -1 scale
(50) t 
GR
GR
GS
[0.6 0 0 0.6 271.8 284.19999] CT
0.149 GC
/Helvetica 16.667 F
GS
[1 0 0 1 0 0] CT
-14 17 moveto 
1 -1 scale
(100) t 
GR
GR
GS
[0.6 0 0 0.6 380.4 284.19999] CT
0.149 GC
/Helvetica 16.667 F
GS
[1 0 0 1 0 0] CT
-14 17 moveto 
1 -1 scale
(150) t 
GR
GR
GS
[0.6 0 0 0.6 217.50015 297.80001] CT
0.149 GC
N
-127.813 22.578 M
-127.813 9.672 L
-126.375 9.672 L
-126.375 10.875 L
-125.859 10.172 -125.219 9.813 QT
-124.578 9.453 -123.672 9.453 QT
-122.469 9.453 -121.555 10.07 QT
-120.641 10.688 -120.172 11.805 QT
-119.703 12.922 -119.703 14.266 QT
-119.703 15.688 -120.219 16.836 QT
-120.734 17.984 -121.719 18.602 QT
-122.703 19.219 -123.781 19.219 QT
-124.563 19.219 -125.195 18.883 QT
-125.828 18.547 -126.234 18.031 QT
-126.234 22.578 L
-127.813 22.578 L
cp
-126.375 14.391 M
-126.375 16.188 -125.648 17.047 QT
-124.922 17.906 -123.891 17.906 QT
-122.828 17.906 -122.078 17.016 QT
-121.328 16.125 -121.328 14.25 QT
-121.328 12.469 -122.063 11.578 QT
-122.797 10.688 -123.813 10.688 QT
-124.828 10.688 -125.602 11.633 QT
-126.375 12.578 -126.375 14.391 QT
cp
-118.222 14.328 M
-118.222 11.734 -116.769 10.484 QT
-115.565 9.453 -113.847 9.453 QT
-111.909 9.453 -110.69 10.719 QT
-109.472 11.984 -109.472 14.203 QT
-109.472 16 -110.011 17.031 QT
-110.55 18.063 -111.581 18.641 QT
-112.612 19.219 -113.847 19.219 QT
-115.8 19.219 -117.011 17.961 QT
-118.222 16.703 -118.222 14.328 QT
cp
-116.597 14.328 M
-116.597 16.125 -115.815 17.016 QT
-115.034 17.906 -113.847 17.906 QT
-112.659 17.906 -111.878 17.008 QT
-111.097 16.109 -111.097 14.281 QT
-111.097 12.547 -111.886 11.656 QT
-112.675 10.766 -113.847 10.766 QT
-115.034 10.766 -115.815 11.656 QT
-116.597 12.547 -116.597 14.328 QT
cp
-101.35 15.578 M
-99.803 15.781 L
-100.053 17.391 -101.1 18.305 QT
-102.147 19.219 -103.678 19.219 QT
-105.6 19.219 -106.764 17.961 QT
-107.928 16.703 -107.928 14.375 QT
-107.928 12.859 -107.428 11.727 QT
-106.928 10.594 -105.904 10.023 QT
-104.881 9.453 -103.678 9.453 QT
-102.147 9.453 -101.186 10.227 QT
-100.225 11 -99.943 12.406 QT
-101.49 12.641 L
-101.709 11.703 -102.264 11.227 QT
-102.818 10.75 -103.615 10.75 QT
-104.803 10.75 -105.553 11.609 QT
-106.303 12.469 -106.303 14.328 QT
-106.303 16.203 -105.584 17.055 QT
-104.865 17.906 -103.693 17.906 QT
-102.772 17.906 -102.147 17.336 QT
-101.522 16.766 -101.35 15.578 QT
cp
-103.475 7.031 M
-102.506 5.547 L
-100.709 5.547 L
-102.693 8 L
-104.381 8 L
-106.272 5.547 L
-104.475 5.547 L
-103.475 7.031 L
cp
-91.897 16 M
-90.256 16.203 L
-90.647 17.625 -91.693 18.422 QT
-92.74 19.219 -94.365 19.219 QT
-96.412 19.219 -97.615 17.953 QT
-98.818 16.688 -98.818 14.406 QT
-98.818 12.063 -97.607 10.758 QT
-96.397 9.453 -94.459 9.453 QT
-92.584 9.453 -91.397 10.727 QT
-90.209 12 -90.209 14.313 QT
-90.209 14.453 -90.225 14.734 QT
-97.178 14.734 L
-97.1 16.281 -96.311 17.094 QT
-95.522 17.906 -94.365 17.906 QT
-93.49 17.906 -92.873 17.453 QT
-92.256 17 -91.897 16 QT
cp
-97.1 13.438 M
-91.881 13.438 L
-91.99 12.266 -92.475 11.672 QT
-93.24 10.75 -94.443 10.75 QT
-95.522 10.75 -96.264 11.484 QT
-97.006 12.219 -97.1 13.438 QT
cp
-84.65 17.578 M
-84.415 18.984 L
-85.087 19.125 -85.618 19.125 QT
-86.478 19.125 -86.954 18.852 QT
-87.431 18.578 -87.618 18.133 QT
-87.806 17.688 -87.806 16.266 QT
-87.806 10.891 L
-88.978 10.891 L
-88.978 9.672 L
-87.806 9.672 L
-87.806 7.359 L
-86.243 6.406 L
-86.243 9.672 L
-84.65 9.672 L
-84.65 10.891 L
-86.243 10.891 L
-86.243 16.359 L
-86.243 17.031 -86.157 17.227 QT
-86.071 17.422 -85.884 17.531 QT
-85.696 17.641 -85.337 17.641 QT
-85.087 17.641 -84.65 17.578 QT
cp
-77.927 22.578 M
-77.927 9.672 L
-76.49 9.672 L
-76.49 10.875 L
-75.974 10.172 -75.333 9.813 QT
-74.693 9.453 -73.786 9.453 QT
-72.583 9.453 -71.669 10.07 QT
-70.755 10.688 -70.286 11.805 QT
-69.818 12.922 -69.818 14.266 QT
-69.818 15.688 -70.333 16.836 QT
-70.849 17.984 -71.833 18.602 QT
-72.818 19.219 -73.896 19.219 QT
-74.677 19.219 -75.31 18.883 QT
-75.943 18.547 -76.349 18.031 QT
-76.349 22.578 L
-77.927 22.578 L
cp
-76.49 14.391 M
-76.49 16.188 -75.763 17.047 QT
-75.036 17.906 -74.005 17.906 QT
-72.943 17.906 -72.193 17.016 QT
-71.443 16.125 -71.443 14.25 QT
-71.443 12.469 -72.177 11.578 QT
-72.911 10.688 -73.927 10.688 QT
-74.943 10.688 -75.716 11.633 QT
-76.49 12.578 -76.49 14.391 QT
cp
-67.758 19 M
-67.758 9.672 L
-66.336 9.672 L
-66.336 11.078 L
-65.789 10.094 -65.328 9.773 QT
-64.867 9.453 -64.321 9.453 QT
-63.508 9.453 -62.696 9.969 QT
-63.227 11.438 L
-63.821 11.094 -64.399 11.094 QT
-64.914 11.094 -65.328 11.406 QT
-65.742 11.719 -65.914 12.266 QT
-66.18 13.109 -66.18 14.109 QT
-66.18 19 L
-67.758 19 L
cp
-55.535 19 M
-55.535 17.625 L
-56.613 19.219 -58.488 19.219 QT
-59.316 19.219 -60.035 18.898 QT
-60.754 18.578 -61.097 18.102 QT
-61.441 17.625 -61.582 16.922 QT
-61.676 16.453 -61.676 15.453 QT
-61.676 9.672 L
-60.097 9.672 L
-60.097 14.844 L
-60.097 16.078 -60.004 16.516 QT
-59.847 17.141 -59.363 17.492 QT
-58.879 17.844 -58.176 17.844 QT
-57.457 17.844 -56.832 17.484 QT
-56.207 17.125 -55.949 16.492 QT
-55.691 15.859 -55.691 14.672 QT
-55.691 9.672 L
-54.113 9.672 L
-54.113 19 L
-55.535 19 L
cp
-59.41 6.344 M
-59.41 5.703 -58.941 5.242 QT
-58.472 4.781 -57.832 4.781 QT
-57.176 4.781 -56.707 5.25 QT
-56.238 5.719 -56.238 6.391 QT
-56.238 7.063 -56.707 7.531 QT
-57.176 8 -57.816 8 QT
-58.472 8 -58.941 7.523 QT
-59.41 7.047 -59.41 6.344 QT
cp
-58.738 6.359 M
-58.738 6.766 -58.465 7.047 QT
-58.191 7.328 -57.801 7.328 QT
-57.426 7.328 -57.152 7.047 QT
-56.879 6.766 -56.879 6.375 QT
-56.879 5.984 -57.152 5.703 QT
-57.426 5.422 -57.801 5.422 QT
-58.191 5.422 -58.465 5.695 QT
-58.738 5.969 -58.738 6.359 QT
cp
-51.46 19 M
-51.46 9.672 L
-50.038 9.672 L
-50.038 10.969 L
-49.6 10.297 -48.874 9.875 QT
-48.147 9.453 -47.21 9.453 QT
-46.178 9.453 -45.514 9.883 QT
-44.85 10.313 -44.585 11.094 QT
-43.475 9.453 -41.694 9.453 QT
-40.303 9.453 -39.561 10.227 QT
-38.819 11 -38.819 12.594 QT
-38.819 19 L
-40.382 19 L
-40.382 13.125 L
-40.382 12.172 -40.538 11.75 QT
-40.694 11.328 -41.1 11.078 QT
-41.507 10.828 -42.053 10.828 QT
-43.038 10.828 -43.686 11.484 QT
-44.335 12.141 -44.335 13.578 QT
-44.335 19 L
-45.913 19 L
-45.913 12.938 L
-45.913 11.875 -46.303 11.352 QT
-46.694 10.828 -47.569 10.828 QT
-48.241 10.828 -48.803 11.18 QT
-49.366 11.531 -49.624 12.203 QT
-49.882 12.875 -49.882 14.156 QT
-49.882 19 L
-51.46 19 L
cp
-29.815 16 M
-28.174 16.203 L
-28.565 17.625 -29.612 18.422 QT
-30.658 19.219 -32.283 19.219 QT
-34.33 19.219 -35.533 17.953 QT
-36.737 16.688 -36.737 14.406 QT
-36.737 12.063 -35.526 10.758 QT
-34.315 9.453 -32.377 9.453 QT
-30.502 9.453 -29.315 10.727 QT
-28.127 12 -28.127 14.313 QT
-28.127 14.453 -28.143 14.734 QT
-35.096 14.734 L
-35.018 16.281 -34.229 17.094 QT
-33.44 17.906 -32.283 17.906 QT
-31.408 17.906 -30.791 17.453 QT
-30.174 17 -29.815 16 QT
cp
-35.018 13.438 M
-29.799 13.438 L
-29.908 12.266 -30.393 11.672 QT
-31.158 10.75 -32.362 10.75 QT
-33.44 10.75 -34.182 11.484 QT
-34.924 12.219 -35.018 13.438 QT
cp
-32.393 7.031 M
-31.424 5.547 L
-29.627 5.547 L
-31.612 8 L
-33.299 8 L
-35.19 5.547 L
-33.393 5.547 L
-32.393 7.031 L
cp
-26.036 19 M
-26.036 9.672 L
-24.615 9.672 L
-24.615 11.078 L
-24.068 10.094 -23.607 9.773 QT
-23.146 9.453 -22.599 9.453 QT
-21.786 9.453 -20.974 9.969 QT
-21.505 11.438 L
-22.099 11.094 -22.677 11.094 QT
-23.193 11.094 -23.607 11.406 QT
-24.021 11.719 -24.193 12.266 QT
-24.458 13.109 -24.458 14.109 QT
-24.458 19 L
-26.036 19 L
cp
-20.516 14.328 M
-20.516 11.734 -19.063 10.484 QT
-17.86 9.453 -16.141 9.453 QT
-14.204 9.453 -12.985 10.719 QT
-11.766 11.984 -11.766 14.203 QT
-11.766 16 -12.305 17.031 QT
-12.844 18.063 -13.876 18.641 QT
-14.907 19.219 -16.141 19.219 QT
-18.094 19.219 -19.305 17.961 QT
-20.516 16.703 -20.516 14.328 QT
cp
-18.891 14.328 M
-18.891 16.125 -18.11 17.016 QT
-17.329 17.906 -16.141 17.906 QT
-14.954 17.906 -14.173 17.008 QT
-13.391 16.109 -13.391 14.281 QT
-13.391 12.547 -14.18 11.656 QT
-14.969 10.766 -16.141 10.766 QT
-17.329 10.766 -18.11 11.656 QT
-18.891 12.547 -18.891 14.328 QT
cp
-7.144 19 M
-10.691 9.672 L
-9.019 9.672 L
-7.019 15.25 L
-6.691 16.156 -6.426 17.141 QT
-6.207 16.391 -5.832 15.359 QT
-3.769 9.672 L
-2.129 9.672 L
-5.676 19 L
-7.144 19 L
cp
5.512 17.844 M
4.637 18.594 3.817 18.906 QT
2.996 19.219 2.074 19.219 QT
0.528 19.219 -0.293 18.461 QT
-1.113 17.703 -1.113 16.531 QT
-1.113 15.859 -0.801 15.289 QT
-0.488 14.719 0.012 14.375 QT
0.512 14.031 1.153 13.859 QT
1.621 13.734 2.559 13.625 QT
4.465 13.391 5.371 13.078 QT
5.387 12.75 5.387 12.656 QT
5.387 11.703 4.934 11.297 QT
4.324 10.766 3.137 10.766 QT
2.012 10.766 1.481 11.156 QT
0.949 11.547 0.699 12.547 QT
-0.847 12.328 L
-0.629 11.328 -0.152 10.719 QT
0.324 10.109 1.239 9.781 QT
2.153 9.453 3.371 9.453 QT
4.559 9.453 5.309 9.734 QT
6.059 10.016 6.41 10.445 QT
6.762 10.875 6.903 11.516 QT
6.981 11.922 6.981 12.984 QT
6.981 15.094 L
6.981 17.297 7.082 17.883 QT
7.184 18.469 7.481 19 QT
5.824 19 L
5.574 18.5 5.512 17.844 QT
cp
5.371 14.313 M
4.512 14.672 2.793 14.906 QT
1.824 15.047 1.418 15.227 QT
1.012 15.406 0.793 15.742 QT
0.574 16.078 0.574 16.5 QT
0.574 17.125 1.051 17.547 QT
1.528 17.969 2.449 17.969 QT
3.371 17.969 4.082 17.57 QT
4.793 17.172 5.121 16.484 QT
5.371 15.938 5.371 14.891 QT
5.371 14.313 L
cp
9.603 19 M
9.603 9.672 L
11.025 9.672 L
11.025 11 L
12.056 9.453 13.993 9.453 QT
14.837 9.453 15.548 9.758 QT
16.259 10.063 16.611 10.555 QT
16.962 11.047 17.103 11.719 QT
17.181 12.156 17.181 13.266 QT
17.181 19 L
15.603 19 L
15.603 13.328 L
15.603 12.359 15.423 11.875 QT
15.243 11.391 14.767 11.109 QT
14.29 10.828 13.665 10.828 QT
12.65 10.828 11.915 11.469 QT
11.181 12.109 11.181 13.906 QT
11.181 19 L
9.603 19 L
cp
19.709 22.594 M
19.537 21.109 L
20.053 21.25 20.444 21.25 QT
20.975 21.25 21.287 21.078 QT
21.6 20.906 21.803 20.578 QT
21.959 20.344 22.287 19.406 QT
22.334 19.266 22.428 19.016 QT
18.897 9.672 L
20.6 9.672 L
22.537 15.078 L
22.912 16.094 23.209 17.234 QT
23.49 16.141 23.865 15.109 QT
25.865 9.672 L
27.444 9.672 L
23.897 19.156 L
23.319 20.703 23.006 21.281 QT
22.584 22.063 22.037 22.422 QT
21.49 22.781 20.74 22.781 QT
20.272 22.781 19.709 22.594 QT
cp
21.287 8 M
22.459 5.547 L
24.522 5.547 L
22.6 8 L
21.287 8 L
cp
35.037 15.578 M
36.584 15.781 L
36.334 17.391 35.287 18.305 QT
34.24 19.219 32.709 19.219 QT
30.787 19.219 29.623 17.961 QT
28.459 16.703 28.459 14.375 QT
28.459 12.859 28.959 11.727 QT
29.459 10.594 30.483 10.023 QT
31.506 9.453 32.709 9.453 QT
34.24 9.453 35.201 10.227 QT
36.162 11 36.444 12.406 QT
34.897 12.641 L
34.678 11.703 34.123 11.227 QT
33.569 10.75 32.772 10.75 QT
31.584 10.75 30.834 11.609 QT
30.084 12.469 30.084 14.328 QT
30.084 16.203 30.803 17.055 QT
31.522 17.906 32.694 17.906 QT
33.615 17.906 34.24 17.336 QT
34.865 16.766 35.037 15.578 QT
cp
38.1 19 M
38.1 6.109 L
39.678 6.109 L
39.678 10.734 L
40.787 9.453 42.475 9.453 QT
43.506 9.453 44.272 9.859 QT
45.037 10.266 45.373 10.992 QT
45.709 11.719 45.709 13.078 QT
45.709 19 L
44.115 19 L
44.115 13.078 L
44.115 11.891 43.6 11.352 QT
43.084 10.813 42.147 10.813 QT
41.444 10.813 40.826 11.18 QT
40.209 11.547 39.944 12.172 QT
39.678 12.797 39.678 13.891 QT
39.678 19 L
38.1 19 L
cp
53.388 7.938 M
53.388 6.109 L
54.966 6.109 L
54.966 7.938 L
53.388 7.938 L
cp
53.388 19 M
53.388 9.672 L
54.966 9.672 L
54.966 19 L
53.388 19 L
cp
60.894 17.578 M
61.128 18.984 L
60.456 19.125 59.925 19.125 QT
59.066 19.125 58.589 18.852 QT
58.112 18.578 57.925 18.133 QT
57.737 17.688 57.737 16.266 QT
57.737 10.891 L
56.566 10.891 L
56.566 9.672 L
57.737 9.672 L
57.737 7.359 L
59.3 6.406 L
59.3 9.672 L
60.894 9.672 L
60.894 10.891 L
59.3 10.891 L
59.3 16.359 L
59.3 17.031 59.386 17.227 QT
59.472 17.422 59.659 17.531 QT
59.847 17.641 60.206 17.641 QT
60.456 17.641 60.894 17.578 QT
cp
68.919 16 M
70.56 16.203 L
70.169 17.625 69.122 18.422 QT
68.075 19.219 66.45 19.219 QT
64.403 19.219 63.2 17.953 QT
61.997 16.688 61.997 14.406 QT
61.997 12.063 63.208 10.758 QT
64.419 9.453 66.357 9.453 QT
68.232 9.453 69.419 10.727 QT
70.607 12 70.607 14.313 QT
70.607 14.453 70.591 14.734 QT
63.638 14.734 L
63.716 16.281 64.505 17.094 QT
65.294 17.906 66.45 17.906 QT
67.325 17.906 67.942 17.453 QT
68.56 17 68.919 16 QT
cp
63.716 13.438 M
68.935 13.438 L
68.825 12.266 68.341 11.672 QT
67.575 10.75 66.372 10.75 QT
65.294 10.75 64.552 11.484 QT
63.81 12.219 63.716 13.438 QT
cp
72.697 19 M
72.697 9.672 L
74.119 9.672 L
74.119 11.078 L
74.666 10.094 75.127 9.773 QT
75.588 9.453 76.135 9.453 QT
76.947 9.453 77.76 9.969 QT
77.229 11.438 L
76.635 11.094 76.057 11.094 QT
75.541 11.094 75.127 11.406 QT
74.713 11.719 74.541 12.266 QT
74.275 13.109 74.275 14.109 QT
74.275 19 L
72.697 19 L
cp
84.905 17.844 M
84.03 18.594 83.21 18.906 QT
82.389 19.219 81.467 19.219 QT
79.921 19.219 79.1 18.461 QT
78.28 17.703 78.28 16.531 QT
78.28 15.859 78.592 15.289 QT
78.905 14.719 79.405 14.375 QT
79.905 14.031 80.546 13.859 QT
81.014 13.734 81.952 13.625 QT
83.858 13.391 84.764 13.078 QT
84.78 12.75 84.78 12.656 QT
84.78 11.703 84.327 11.297 QT
83.717 10.766 82.53 10.766 QT
81.405 10.766 80.874 11.156 QT
80.342 11.547 80.092 12.547 QT
78.546 12.328 L
78.764 11.328 79.241 10.719 QT
79.717 10.109 80.631 9.781 QT
81.546 9.453 82.764 9.453 QT
83.952 9.453 84.702 9.734 QT
85.452 10.016 85.803 10.445 QT
86.155 10.875 86.296 11.516 QT
86.374 11.922 86.374 12.984 QT
86.374 15.094 L
86.374 17.297 86.475 17.883 QT
86.577 18.469 86.874 19 QT
85.217 19 L
84.967 18.5 84.905 17.844 QT
cp
84.764 14.313 M
83.905 14.672 82.186 14.906 QT
81.217 15.047 80.811 15.227 QT
80.405 15.406 80.186 15.742 QT
79.967 16.078 79.967 16.5 QT
79.967 17.125 80.444 17.547 QT
80.921 17.969 81.842 17.969 QT
82.764 17.969 83.475 17.57 QT
84.186 17.172 84.514 16.484 QT
84.764 15.938 84.764 14.891 QT
84.764 14.313 L
cp
95.089 15.578 M
96.636 15.781 L
96.386 17.391 95.339 18.305 QT
94.293 19.219 92.761 19.219 QT
90.839 19.219 89.675 17.961 QT
88.511 16.703 88.511 14.375 QT
88.511 12.859 89.011 11.727 QT
89.511 10.594 90.535 10.023 QT
91.558 9.453 92.761 9.453 QT
94.293 9.453 95.254 10.227 QT
96.214 11 96.496 12.406 QT
94.949 12.641 L
94.73 11.703 94.175 11.227 QT
93.621 10.75 92.824 10.75 QT
91.636 10.75 90.886 11.609 QT
90.136 12.469 90.136 14.328 QT
90.136 16.203 90.855 17.055 QT
91.574 17.906 92.746 17.906 QT
93.668 17.906 94.293 17.336 QT
94.918 16.766 95.089 15.578 QT
cp
98.699 19 M
98.699 9.672 L
100.293 9.672 L
100.293 19 L
98.699 19 L
cp
98.652 8 M
99.824 5.547 L
101.886 5.547 L
99.964 8 L
98.652 8 L
cp
108.359 22.578 M
108.359 6.109 L
111.859 6.109 L
111.859 7.422 L
109.937 7.422 L
109.937 21.266 L
111.859 21.266 L
111.859 22.578 L
108.359 22.578 L
cp
112.993 14.109 M
112.993 12.297 L
113.931 11.25 115.431 11.25 QT
115.962 11.25 116.54 11.406 QT
117.118 11.563 118.197 12.016 QT
118.806 12.266 119.111 12.344 QT
119.415 12.422 119.712 12.422 QT
120.29 12.422 120.9 12.078 QT
121.509 11.734 121.978 11.219 QT
121.978 13.078 L
121.415 13.609 120.845 13.852 QT
120.275 14.094 119.556 14.094 QT
119.025 14.094 118.548 13.969 QT
118.072 13.844 117.025 13.375 QT
115.978 12.906 115.29 12.906 QT
114.728 12.906 114.228 13.148 QT
113.728 13.391 112.993 14.109 QT
cp
126.75 22.578 M
123.266 22.578 L
123.266 21.266 L
125.172 21.266 L
125.172 7.422 L
123.266 7.422 L
123.266 6.109 L
126.75 6.109 L
126.75 22.578 L
cp
f
GR
GS
[0.6 0 0 0.6 0 0] CT
0.149 GC
2 setlinecap
1 LJ
0.833 LW
N
91 467 M
91 39 L
S
GR
GS
[0.6 0 0 0.6 0 0] CT
0.149 GC
2 setlinecap
1 LJ
0.833 LW
N
634 467 M
634 39 L
S
GR
GS
[0.6 0 0 0.6 0 0] CT
0.149 GC
2 setlinecap
1 LJ
0.833 LW
N
91 467 M
96.43 467 L
S
GR
GS
[0.6 0 0 0.6 0 0] CT
0.149 GC
2 setlinecap
1 LJ
0.833 LW
N
91 395.667 M
96.43 395.667 L
S
GR
GS
[0.6 0 0 0.6 0 0] CT
0.149 GC
2 setlinecap
1 LJ
0.833 LW
N
91 324.333 M
96.43 324.333 L
S
GR
GS
[0.6 0 0 0.6 0 0] CT
0.149 GC
2 setlinecap
1 LJ
0.833 LW
N
91 253 M
96.43 253 L
S
GR
GS
[0.6 0 0 0.6 0 0] CT
0.149 GC
2 setlinecap
1 LJ
0.833 LW
N
91 181.667 M
96.43 181.667 L
S
GR
GS
[0.6 0 0 0.6 0 0] CT
0.149 GC
2 setlinecap
1 LJ
0.833 LW
N
91 110.333 M
96.43 110.333 L
S
GR
GS
[0.6 0 0 0.6 0 0] CT
0.149 GC
2 setlinecap
1 LJ
0.833 LW
N
91 39 M
96.43 39 L
S
GR
GS
[0.6 0 0 0.6 0 0] CT
0.149 GC
2 setlinecap
1 LJ
0.833 LW
N
634 467 M
628.57 467 L
S
GR
GS
[0.6 0 0 0.6 0 0] CT
0.149 GC
2 setlinecap
1 LJ
0.833 LW
N
634 395.667 M
628.57 395.667 L
S
GR
GS
[0.6 0 0 0.6 0 0] CT
0.149 GC
2 setlinecap
1 LJ
0.833 LW
N
634 324.333 M
628.57 324.333 L
S
GR
GS
[0.6 0 0 0.6 0 0] CT
0.149 GC
2 setlinecap
1 LJ
0.833 LW
N
634 253 M
628.57 253 L
S
GR
GS
[0.6 0 0 0.6 0 0] CT
0.149 GC
2 setlinecap
1 LJ
0.833 LW
N
634 181.667 M
628.57 181.667 L
S
GR
GS
[0.6 0 0 0.6 0 0] CT
0.149 GC
2 setlinecap
1 LJ
0.833 LW
N
634 110.333 M
628.57 110.333 L
S
GR
GS
[0.6 0 0 0.6 0 0] CT
0.149 GC
2 setlinecap
1 LJ
0.833 LW
N
634 39 M
628.57 39 L
S
GR
GS
[0.6 0 0 0.6 50.6 280.2] CT
0.149 GC
/Helvetica 16.667 F
GS
[1 0 0 1 0 0] CT
-42 6.5 moveto 
1 -1 scale
(0.004) t 
GR
GR
GS
[0.6 0 0 0.6 50.6 237.39999] CT
0.149 GC
/Helvetica 16.667 F
GS
[1 0 0 1 0 0] CT
-42 6.5 moveto 
1 -1 scale
(0.006) t 
GR
GR
GS
[0.6 0 0 0.6 50.6 194.59999] CT
0.149 GC
/Helvetica 16.667 F
GS
[1 0 0 1 0 0] CT
-42 6.5 moveto 
1 -1 scale
(0.008) t 
GR
GR
GS
[0.6 0 0 0.6 50.6 151.80001] CT
0.149 GC
/Helvetica 16.667 F
GS
[1 0 0 1 0 0] CT
-33 6.5 moveto 
1 -1 scale
(0.01) t 
GR
GR
GS
[0.6 0 0 0.6 50.6 108.99999] CT
0.149 GC
/Helvetica 16.667 F
GS
[1 0 0 1 0 0] CT
-42 6.5 moveto 
1 -1 scale
(0.012) t 
GR
GR
GS
[0.6 0 0 0.6 50.6 66.19999] CT
0.149 GC
/Helvetica 16.667 F
GS
[1 0 0 1 0 0] CT
-42 6.5 moveto 
1 -1 scale
(0.014) t 
GR
GR
GS
[0.6 0 0 0.6 50.6 23.39998] CT
0.149 GC
/Helvetica 16.667 F
GS
[1 0 0 1 0 0] CT
-42 6.5 moveto 
1 -1 scale
(0.016) t 
GR
GR
GS
[0 -0.6 0.6 0 22.4 151.79986] CT
0.149 GC
/Helvetica 18.333 F
GS
[1 0 0 1 0 0] CT
-39.5 -5 moveto 
1 -1 scale
(RMSE [~]) t 
GR
GR
GS
[0.6 0 0 0.6 0 0] CT
0 0 1 RC
1 LJ
3.333 LW
N
94.62 72.585 M
98.24 221.506 L
101.86 298.37 L
105.48 334.823 L
109.1 349.639 L
112.72 359.079 L
116.34 369.196 L
119.96 376.245 L
123.58 388.704 L
127.2 393.029 L
130.82 398.162 L
134.44 399.367 L
138.06 400.159 L
141.68 404.369 L
145.3 410.752 L
148.92 414.107 L
152.54 415.188 L
156.16 421.327 L
159.78 423.57 L
163.4 426.569 L
167.02 428.664 L
170.64 431.078 L
174.26 432.858 L
177.88 435.836 L
181.5 437.871 L
185.12 440.411 L
188.74 439.96 L
192.36 441.509 L
195.98 443.636 L
199.6 444.074 L
203.22 445.296 L
206.84 444.835 L
210.46 445.995 L
214.08 446.584 L
217.7 447.608 L
221.32 446.883 L
224.94 446.868 L
228.56 447.948 L
232.18 448.522 L
235.8 448.954 L
239.42 450.094 L
243.04 450.453 L
246.66 450.675 L
250.28 451.327 L
253.9 451.792 L
257.52 452.236 L
261.14 452.525 L
264.76 453.622 L
268.38 453.941 L
272 454.035 L
275.62 454.773 L
279.24 455.076 L
282.86 455.406 L
286.48 455.341 L
290.1 455.879 L
293.72 456.419 L
297.34 456.884 L
300.96 457.151 L
304.58 457.148 L
308.2 457.927 L
311.82 458.085 L
315.44 458.598 L
319.06 458.69 L
322.68 459.224 L
326.3 459.375 L
329.92 459.935 L
333.54 460.353 L
337.16 460.815 L
340.78 460.861 L
344.4 460.788 L
348.02 460.984 L
351.64 461.266 L
355.26 461.396 L
358.88 461.544 L
362.5 461.56 L
366.12 462.122 L
369.74 462.416 L
373.36 462.795 L
376.98 463.11 L
380.6 463.587 L
384.22 463.117 L
387.84 463.327 L
391.46 463.601 L
395.08 463.531 L
398.7 463.834 L
402.32 463.883 L
405.94 464.294 L
409.56 464.545 L
413.18 464.559 L
416.8 464.682 L
420.42 464.574 L
424.04 464.748 L
427.66 464.866 L
431.28 465.011 L
434.9 464.93 L
438.52 464.673 L
442.14 464.558 L
445.76 464.772 L
449.38 465.224 L
453 465.017 L
456.62 465.171 L
460.24 465.219 L
463.86 465.5 L
467.48 465.457 L
471.1 465.36 L
474.72 465.193 L
478.34 464.947 L
481.96 465.104 L
485.58 464.943 L
489.2 464.955 L
492.82 465.184 L
496.44 465.533 L
500.06 465.628 L
503.68 465.3 L
507.3 465.148 L
510.92 465.185 L
514.54 465.401 L
518.16 465.588 L
521.78 465.722 L
525.4 465.986 L
529.02 466.054 L
532.64 466.082 L
536.26 465.919 L
539.88 465.972 L
543.5 466.341 L
547.12 466.527 L
550.74 466.602 L
554.36 466.485 L
557.98 466.407 L
561.6 466.526 L
565.22 466.322 L
568.84 466.1 L
572.46 466.402 L
576.08 466.385 L
579.7 466.235 L
583.32 466.118 L
586.94 466.125 L
590.56 466.085 L
594.18 466.029 L
597.8 466.031 L
601.42 466.121 L
605.04 466.089 L
608.66 466.357 L
612.28 466.314 L
615.9 466.417 L
619.52 466.535 L
623.14 466.623 L
626.76 466.736 L
630.38 466.853 L
634 466.837 L
S
GR
GS
[0.6 0 0 0.6 0 0] CT
1 0 0 RC
[12 12] 0 setdash
2 LJ
3.333 LW
N
94.62 58.432 M
98.24 193.842 L
101.86 256.905 L
105.48 293.485 L
109.1 318.959 L
112.72 334.557 L
116.34 347.55 L
119.96 357.876 L
123.58 364.745 L
127.2 369.641 L
130.82 374.544 L
134.44 378.779 L
138.06 383.186 L
141.68 385.853 L
145.3 388.496 L
148.92 391.559 L
152.54 393.802 L
156.16 395.59 L
159.78 397.442 L
163.4 398.776 L
167.02 399.588 L
170.64 400.914 L
174.26 402.342 L
177.88 403.378 L
181.5 404.594 L
185.12 406.113 L
188.74 407.113 L
192.36 408.321 L
195.98 409.144 L
199.6 410.148 L
203.22 411.209 L
206.84 412.218 L
210.46 412.894 L
214.08 413.905 L
217.7 414.523 L
221.32 414.742 L
224.94 414.919 L
228.56 415.735 L
232.18 416.421 L
235.8 416.926 L
239.42 417.255 L
243.04 417.756 L
246.66 418.285 L
250.28 418.837 L
253.9 419.104 L
257.52 419.388 L
261.14 419.457 L
264.76 419.919 L
268.38 419.968 L
272 420.451 L
275.62 420.82 L
279.24 421.117 L
282.86 421.438 L
286.48 421.582 L
290.1 421.808 L
293.72 421.949 L
297.34 422.148 L
300.96 422.314 L
304.58 422.671 L
308.2 422.909 L
311.82 423.007 L
315.44 423.251 L
319.06 423.297 L
322.68 423.547 L
326.3 423.702 L
329.92 423.869 L
333.54 424.034 L
337.16 424.173 L
340.78 424.311 L
344.4 424.362 L
348.02 424.639 L
351.64 424.747 L
355.26 424.869 L
358.88 424.843 L
362.5 424.975 L
366.12 425.077 L
369.74 425.148 L
373.36 425.281 L
376.98 425.423 L
380.6 425.513 L
384.22 425.658 L
387.84 425.836 L
391.46 425.842 L
395.08 425.924 L
398.7 426.027 L
402.32 426.204 L
405.94 426.284 L
409.56 426.409 L
413.18 426.587 L
416.8 426.725 L
420.42 426.806 L
424.04 426.931 L
427.66 427.01 L
431.28 427.108 L
434.9 427.202 L
438.52 427.31 L
442.14 427.416 L
445.76 427.481 L
449.38 427.522 L
453 427.582 L
456.62 427.624 L
460.24 427.745 L
463.86 427.738 L
467.48 427.849 L
471.1 427.914 L
474.72 428.022 L
478.34 428.151 L
481.96 428.231 L
485.58 428.332 L
489.2 428.327 L
492.82 428.388 L
496.44 428.491 L
500.06 428.548 L
503.68 428.587 L
507.3 428.701 L
510.92 428.786 L
514.54 428.889 L
518.16 428.972 L
521.78 429.056 L
525.4 429.098 L
529.02 429.167 L
532.64 429.239 L
536.26 429.271 L
539.88 429.321 L
543.5 429.387 L
547.12 429.429 L
550.74 429.469 L
554.36 429.556 L
557.98 429.594 L
561.6 429.597 L
565.22 429.649 L
568.84 429.734 L
572.46 429.786 L
576.08 429.806 L
579.7 429.853 L
583.32 429.905 L
586.94 429.976 L
590.56 430.085 L
594.18 430.128 L
597.8 430.185 L
601.42 430.213 L
605.04 430.283 L
608.66 430.305 L
612.28 430.387 L
615.9 430.403 L
619.52 430.489 L
623.14 430.569 L
626.76 430.64 L
630.38 430.669 L
634 430.743 L
S
GR
GS
[0.6 0 0 0.6 0 0] CT
1 GC
N
621 98 M
621 52 L
507 52 L
507 98 L
cp
f
GR
GS
[0.6 0 0 0.6 339.52745 38.76164] CT
/Helvetica 15 F
GS
[1 0 0 1 0 0] CT
0 6 moveto 
1 -1 scale
(1. profil) t 
GR
GR
GS
[0.6 0 0 0.6 0 0] CT
0 0 1 RC
1 LJ
3.333 LW
N
512.011 64.603 M
562.121 64.603 L
S
GR
GS
[0.6 0 0 0.6 339.52745 51.23836] CT
/Helvetica 15 F
GS
[1 0 0 1 0 0] CT
0 6 moveto 
1 -1 scale
(2.profil) t 
GR
GR
GS
[0.6 0 0 0.6 0 0] CT
1 0 0 RC
[12 12] 0 setdash
2 LJ
3.333 LW
N
512.011 85.397 M
562.121 85.397 L
S
GR
GS
[0.6 0 0 0.6 0 0] CT
0.149 GC
10.0 ML
0.833 LW
N
507 98 M
507 52 L
621 52 L
621 98 L
cp
S
GR
%%Trailer
%%Pages: 1
%%EOF
