%!PS-Adobe-3.0 EPSF-3.0
%%Creator: cairo 1.15.2 (http://cairographics.org)
%%CreationDate: Thu Apr 30 20:39:34 2020
%%Pages: 1
%%DocumentData: Clean7Bit
%%LanguageLevel: 2
%%BoundingBox: 0 -1 239 179
%%EndComments
%%BeginProlog
save
50 dict begin
/q { gsave } bind def
/Q { grestore } bind def
/cm { 6 array astore concat } bind def
/w { setlinewidth } bind def
/J { setlinecap } bind def
/j { setlinejoin } bind def
/M { setmiterlimit } bind def
/d { setdash } bind def
/m { moveto } bind def
/l { lineto } bind def
/c { curveto } bind def
/h { closepath } bind def
/re { exch dup neg 3 1 roll 5 3 roll moveto 0 rlineto
      0 exch rlineto 0 rlineto closepath } bind def
/S { stroke } bind def
/f { fill } bind def
/f* { eofill } bind def
/n { newpath } bind def
/W { clip } bind def
/W* { eoclip } bind def
/BT { } bind def
/ET { } bind def
/pdfmark where { pop globaldict /?pdfmark /exec load put }
    { globaldict begin /?pdfmark /pop load def /pdfmark
    /cleartomark load def end } ifelse
/BDC { mark 3 1 roll /BDC pdfmark } bind def
/EMC { mark /EMC pdfmark } bind def
/cairo_store_point { /cairo_point_y exch def /cairo_point_x exch def } def
/Tj { show currentpoint cairo_store_point } bind def
/TJ {
  {
    dup
    type /stringtype eq
    { show } { -0.001 mul 0 cairo_font_matrix dtransform rmoveto } ifelse
  } forall
  currentpoint cairo_store_point
} bind def
/cairo_selectfont { cairo_font_matrix aload pop pop pop 0 0 6 array astore
    cairo_font exch selectfont cairo_point_x cairo_point_y moveto } bind def
/Tf { pop /cairo_font exch def /cairo_font_matrix where
      { pop cairo_selectfont } if } bind def
/Td { matrix translate cairo_font_matrix matrix concatmatrix dup
      /cairo_font_matrix exch def dup 4 get exch 5 get cairo_store_point
      /cairo_font where { pop cairo_selectfont } if } bind def
/Tm { 2 copy 8 2 roll 6 array astore /cairo_font_matrix exch def
      cairo_store_point /cairo_font where { pop cairo_selectfont } if } bind def
/g { setgray } bind def
/rg { setrgbcolor } bind def
/d1 { setcachedevice } bind def
%%EndProlog
%%BeginSetup
%%EndSetup
%%Page: 1 1
%%BeginPageSetup
%%PageBoundingBox: 0 -1 239 179
%%EndPageSetup
q 0 -1 239 180 rectclip q
Q q
0 178.785 238 -178.785 re W n
q
0 178.785 238 -179 re W n
[ 1 0 0 1 0 -0.215012 ] concat
  q
Q q
q
0 179 239 -179 re W n
[ 1 0 0 1 0 0 ] concat
  q
1 g
0 179 238.379 -178.785 re f
  Q
Q
  Q
Q
Q q
1 g
0 178.785 238.379 -178.785 re f
0.14902 g
63.863 161.949 m 64.176 161.582 64.551 161.289 64.992 161.074 c 65.434 
160.859 65.895 160.75 66.371 160.75 c 66.844 160.75 67.277 160.871 67.664
 161.113 c 68.051 161.355 68.242 161.699 68.242 162.148 c 68.242 163.215
 l 68.242 163.488 67.711 163.625 66.652 163.625 c 66.652 164.07 l 70.305
 164.07 l 70.305 163.625 l 70.031 163.625 69.816 163.601 69.66 163.555 c
 69.504 163.508 69.426 163.394 69.426 163.215 c 69.426 160.703 l 69.426 
160.672 69.414 160.644 69.391 160.621 c 69.367 160.597 69.34 160.586 69.309
 160.586 c 69.23 160.586 69.102 160.68 68.918 160.867 c 68.734 161.055 68.586
 161.219 68.477 161.359 c 68.266 161.008 67.941 160.746 67.5 160.566 c 67.059
 160.39 66.594 160.305 66.102 160.305 c 65.281 160.305 64.531 160.515 63.852
 160.945 c 63.172 161.371 62.637 161.937 62.242 162.652 c 61.848 163.363
 61.648 164.129 61.648 164.953 c 61.648 165.555 61.766 166.14 61.996 166.707
 c 62.227 167.273 62.543 167.773 62.949 168.211 c 63.355 168.644 63.828 
168.98 64.371 169.226 c 64.914 169.469 65.492 169.59 66.102 169.59 c 66.547
 169.59 66.965 169.496 67.355 169.305 c 67.742 169.121 68.094 168.851 68.406
 168.508 c 69.145 169.555 l 69.191 169.578 69.219 169.59 69.227 169.59 c
 69.32 169.59 l 69.344 169.59 69.367 169.578 69.391 169.558 c 69.414 169.539
 69.426 169.515 69.426 169.484 c 69.426 166.031 l 69.426 165.961 69.391 
165.926 69.32 165.926 c 69.086 165.926 l 69.008 165.926 68.969 165.961 68.969
 166.031 c 68.969 166.281 68.922 166.558 68.824 166.859 c 68.727 167.16 
68.602 167.449 68.457 167.722 c 68.305 167.996 68.129 168.234 67.926 168.437
 c 67.449 168.906 66.906 169.144 66.289 169.144 c 65.813 169.144 65.359 
169.039 64.93 168.824 c 64.5 168.613 64.137 168.32 63.84 167.945 c 63.527
 167.547 63.309 167.094 63.191 166.582 c 63.07 166.074 63.008 165.531 63.008
 164.953 c 63.008 163.644 63.293 162.644 63.863 161.949 c f
71.461 160.586 m 71.461 161.031 l 71.75 161.031 71.984 161.055 72.172 161.101
 c 72.359 161.148 72.457 161.262 72.457 161.441 c 72.457 164.93 l 72.457
 165.156 72.422 165.32 72.355 165.422 c 72.289 165.523 72.191 165.586 72.063
 165.609 c 71.934 165.633 71.734 165.644 71.461 165.644 c 71.461 166.09 
l 73.285 166.23 l 73.285 164.988 l 73.418 165.355 73.613 165.656 73.867 
165.887 c 74.121 166.117 74.426 166.23 74.785 166.23 c 75.043 166.23 75.273
 166.156 75.469 166.008 c 75.668 165.859 75.77 165.66 75.77 165.41 c 75.77
 165.262 75.715 165.129 75.605 165.012 c 75.496 164.894 75.359 164.836 75.195
 164.836 c 75.039 164.836 74.906 164.89 74.793 165.004 c 74.68 165.117 74.621
 165.254 74.621 165.41 c 74.621 165.637 74.703 165.801 74.867 165.902 c 
74.785 165.902 l 74.441 165.902 74.164 165.777 73.949 165.527 c 73.734 165.277
 73.578 164.965 73.484 164.594 c 73.391 164.222 73.344 163.867 73.344 163.531
 c 73.344 161.441 l 73.344 161.168 73.758 161.031 74.586 161.031 c 74.586
 160.586 l 71.461 160.586 l f
76.734 161.844 m 76.734 162.351 76.934 162.762 77.332 163.082 c 77.73 163.394
 78.207 163.621 78.762 163.75 c 79.316 163.879 79.848 163.941 80.355 163.941
 c 80.355 164.472 l 80.355 164.715 80.301 164.949 80.191 165.18 c 80.082
 165.414 79.926 165.601 79.723 165.75 c 79.52 165.898 79.297 165.972 79.055
 165.972 c 78.484 165.972 78.055 165.847 77.766 165.597 c 77.922 165.597
 78.055 165.535 78.164 165.41 c 78.273 165.285 78.328 165.144 78.328 164.988
 c 78.328 164.816 78.27 164.668 78.148 164.547 c 78.027 164.426 77.883 164.363
 77.719 164.363 c 77.547 164.363 77.402 164.426 77.281 164.547 c 77.16 164.668
 77.098 164.816 77.098 164.988 c 77.098 165.433 77.301 165.765 77.707 165.984
 c 78.113 166.203 78.563 166.312 79.055 166.312 c 79.398 166.312 79.742 
166.238 80.09 166.09 c 80.438 165.941 80.723 165.73 80.945 165.457 c 81.168
 165.183 81.281 164.863 81.281 164.496 c 81.281 161.621 l 81.281 161.453
 81.316 161.301 81.387 161.16 c 81.457 161.019 81.566 160.949 81.715 160.949
 c 81.855 160.949 81.961 161.019 82.031 161.16 c 82.102 161.301 82.137 161.453
 82.137 161.621 c 82.137 162.441 l 82.512 162.441 l 82.512 161.621 l 82.512
 161.43 82.461 161.25 82.359 161.078 c 82.258 160.906 82.121 160.769 81.953
 160.668 c 81.785 160.566 81.605 160.515 81.41 160.515 c 81.16 160.515 80.945
 160.609 80.766 160.805 c 80.586 160.996 80.484 161.222 80.461 161.488 c
 80.305 161.168 80.074 160.914 79.77 160.726 c 79.465 160.539 79.137 160.445
 78.785 160.445 c 78.457 160.445 78.137 160.492 77.824 160.586 c 77.512 
160.68 77.254 160.832 77.047 161.039 c 76.84 161.246 76.734 161.512 76.734
 161.844 c h
77.766 161.844 m 77.766 161.543 77.875 161.293 78.094 161.086 c 78.313 
160.879 78.57 160.773 78.867 160.773 c 79.141 160.773 79.391 160.844 79.617
 160.984 c 79.844 161.125 80.023 161.312 80.156 161.547 c 80.289 161.781
 80.355 162.031 80.355 162.301 c 80.355 163.625 l 79.965 163.625 79.566 
163.562 79.168 163.433 c 78.766 163.305 78.43 163.101 78.164 162.832 c 77.898
 162.562 77.766 162.234 77.766 161.844 c f
85.832 160.445 m 85.324 160.445 84.863 160.582 84.449 160.851 c 84.035 
161.121 83.715 161.476 83.484 161.922 c 83.254 162.371 83.141 162.844 83.141
 163.344 c 83.141 163.859 83.262 164.34 83.512 164.781 c 83.762 165.222 
84.105 165.574 84.539 165.84 c 84.973 166.101 85.445 166.23 85.961 166.23
 c 86.273 166.23 86.57 166.164 86.848 166.031 c 87.121 165.898 87.363 165.719
 87.566 165.492 c 87.566 168.144 l 87.566 168.371 87.531 168.535 87.469 
168.637 c 87.402 168.738 87.301 168.801 87.172 168.824 c 87.043 168.847 
86.848 168.859 86.582 168.859 c 86.582 169.305 l 88.469 169.449 l 88.469
 161.75 l 88.469 161.519 88.5 161.355 88.566 161.254 c 88.633 161.152 88.73
 161.09 88.859 161.066 c 88.988 161.043 89.188 161.031 89.453 161.031 c 
89.453 160.586 l 87.531 160.445 l 87.531 161.242 l 87.313 160.992 87.051
 160.797 86.746 160.656 c 86.441 160.515 86.137 160.445 85.832 160.445 c
 h
84.531 161.699 m 84.672 161.418 84.863 161.195 85.105 161.027 c 85.348 
160.859 85.613 160.773 85.902 160.773 c 86.254 160.773 86.578 160.879 86.875
 161.086 c 87.172 161.293 87.391 161.555 87.531 161.879 c 87.531 164.941
 l 87.43 165.129 87.305 165.297 87.156 165.437 c 87.008 165.586 86.84 165.695
 86.648 165.777 c 86.457 165.863 86.254 165.902 86.043 165.902 c 85.598 
165.902 85.242 165.773 84.973 165.519 c 84.703 165.265 84.516 164.945 84.41
 164.555 c 84.305 164.164 84.25 163.754 84.25 163.332 c 84.25 162.988 84.27
 162.687 84.305 162.433 c 84.34 162.18 84.414 161.933 84.531 161.699 c f
90.324 160.586 m 90.324 161.031 l 90.617 161.031 90.859 161.055 91.043 
161.101 c 91.227 161.148 91.316 161.262 91.316 161.441 c 91.316 164.93 l
 91.316 165.258 91.254 165.461 91.129 165.531 c 91.004 165.605 90.754 165.644
 90.379 165.644 c 90.379 166.09 l 92.219 166.23 l 92.219 161.441 l 92.219
 161.262 92.301 161.148 92.461 161.101 c 92.621 161.055 92.836 161.031 93.109
 161.031 c 93.109 160.586 l h
90.871 168.426 m 90.871 168.613 90.941 168.777 91.082 168.922 c 91.223 
169.058 91.383 169.129 91.563 169.129 c 91.688 169.129 91.805 169.097 91.914
 169.039 c 92.023 168.972 92.109 168.887 92.172 168.773 c 92.234 168.66 
92.266 168.543 92.266 168.426 c 92.266 168.238 92.195 168.074 92.055 167.933
 c 91.914 167.793 91.75 167.722 91.563 167.722 c 91.383 167.722 91.223 167.793
 91.082 167.933 c 90.941 168.074 90.871 168.238 90.871 168.426 c f
96.719 160.445 m 96.203 160.445 95.73 160.582 95.297 160.851 c 94.863 161.121
 94.52 161.484 94.27 161.941 c 94.02 162.398 93.898 162.883 93.898 163.39
 c 93.898 163.883 94.008 164.355 94.234 164.805 c 94.461 165.254 94.777 
165.621 95.184 165.894 c 95.59 166.176 96.043 166.312 96.543 166.312 c 96.926
 166.312 97.262 166.246 97.551 166.113 c 97.84 165.98 98.078 165.801 98.266
 165.566 c 98.453 165.34 98.594 165.062 98.691 164.746 c 98.789 164.43 98.84
 164.082 98.84 163.707 c 98.84 163.59 98.793 163.531 98.699 163.531 c 95.008
 163.531 l 95.008 163.402 l 95.008 162.691 95.152 162.082 95.438 161.578
 c 95.723 161.074 96.188 160.82 96.836 160.82 c 97.094 160.82 97.336 160.879
 97.555 160.992 c 97.777 161.105 97.973 161.265 98.137 161.476 c 98.301 
161.687 98.41 161.914 98.465 162.148 c 98.473 162.18 98.488 162.203 98.512
 162.222 c 98.535 162.242 98.563 162.254 98.594 162.254 c 98.699 162.254
 l 98.793 162.254 98.84 162.203 98.84 162.101 c 98.715 161.613 98.453 161.219
 98.055 160.91 c 97.656 160.601 97.211 160.445 96.719 160.445 c h
95.02 163.847 m 97.938 163.847 l 97.938 164.172 97.895 164.496 97.801 164.824
 c 97.711 165.152 97.563 165.426 97.355 165.644 c 97.152 165.863 96.879 
165.972 96.543 165.972 c 96.059 165.972 95.684 165.75 95.418 165.301 c 95.152
 164.847 95.02 164.363 95.02 163.847 c f
99.695 160.586 m 99.695 161.031 l 99.992 161.031 100.23 161.055 100.414
 161.101 c 100.598 161.148 100.691 161.262 100.691 161.441 c 100.691 164.93
 l 100.691 165.156 100.656 165.32 100.59 165.422 c 100.523 165.523 100.426
 165.586 100.297 165.609 c 100.168 165.633 99.969 165.644 99.695 165.644
 c 99.695 166.09 l 101.547 166.23 l 101.547 164.988 l 101.719 165.347 101.969
 165.644 102.305 165.879 c 102.641 166.113 103.004 166.23 103.395 166.23
 c 103.98 166.23 104.422 166.09 104.719 165.808 c 105.016 165.527 105.164
 165.094 105.164 164.508 c 105.164 161.441 l 105.164 161.262 105.258 161.148
 105.445 161.101 c 105.633 161.055 105.871 161.031 106.16 161.031 c 106.16
 160.586 l 103.242 160.586 l 103.242 161.031 l 103.531 161.031 103.77 161.055
 103.957 161.101 c 104.145 161.148 104.238 161.262 104.238 161.441 c 104.238
 164.472 l 104.238 164.887 104.18 165.226 104.059 165.5 c 103.938 165.769
 103.691 165.902 103.324 165.902 c 102.824 165.902 102.418 165.707 102.102
 165.308 c 101.785 164.914 101.629 164.465 101.629 163.953 c 101.629 161.441
 l 101.629 161.262 101.723 161.148 101.906 161.101 c 102.098 161.055 102.336
 161.031 102.621 161.031 c 102.621 160.586 l 99.695 160.586 l f
107.477 162.125 m 107.477 165.644 l 106.422 165.644 l 106.422 165.972 l
 106.977 165.972 107.387 166.234 107.648 166.754 c 107.91 167.273 108.039
 167.836 108.039 168.437 c 108.402 168.437 l 108.402 166.09 l 110.207 166.09
 l 110.207 165.644 l 108.402 165.644 l 108.402 162.148 l 108.402 161.797
 108.461 161.484 108.578 161.219 c 108.695 160.953 108.91 160.82 109.223
 160.82 c 109.512 160.82 109.723 160.961 109.852 161.238 c 109.977 161.515
 110.043 161.816 110.043 162.148 c 110.043 162.898 l 110.406 162.898 l 110.406
 162.125 l 110.406 161.855 110.355 161.594 110.258 161.332 c 110.16 161.07
 110.016 160.855 109.824 160.691 c 109.637 160.527 109.402 160.445 109.129
 160.445 c 108.621 160.445 108.219 160.597 107.922 160.902 c 107.625 161.207
 107.477 161.613 107.477 162.125 c f
115.891 160.586 m 115.891 161.031 l 116.18 161.031 116.414 161.055 116.605
 161.101 c 116.789 161.148 116.887 161.262 116.887 161.441 c 116.887 165.644
 l 115.902 165.644 l 115.902 166.09 l 116.887 166.09 l 116.887 167.617 l
 116.887 167.945 116.977 168.234 117.156 168.48 c 117.336 168.726 117.566
 168.93 117.855 169.094 c 118.145 169.258 118.457 169.383 118.789 169.465
 c 119.121 169.547 119.434 169.59 119.73 169.59 c 119.973 169.59 120.219
 169.535 120.469 169.43 c 120.719 169.324 120.922 169.172 121.07 168.972
 c 121.227 168.773 121.301 168.539 121.301 168.273 c 121.301 168.101 121.242
 167.957 121.125 167.84 c 121.008 167.722 120.859 167.664 120.68 167.664
 c 120.508 167.664 120.363 167.722 120.246 167.84 c 120.129 167.957 120.07
 168.101 120.07 168.273 c 120.07 168.437 120.129 168.582 120.242 168.703
 c 120.355 168.824 120.488 168.883 120.645 168.883 c 120.387 169.137 120.047
 169.262 119.625 169.262 c 119.32 169.262 119.023 169.187 118.73 169.051
 c 118.438 168.906 118.199 168.711 118.016 168.457 c 117.832 168.203 117.738
 167.914 117.738 167.594 c 117.738 166.09 l 119.426 166.09 l 121.313 166.254
 l 121.313 161.441 l 121.313 161.262 121.406 161.148 121.594 161.101 c 121.781
 161.055 122.016 161.031 122.297 161.031 c 122.297 160.586 l 119.426 160.586
 l 119.426 161.031 l 119.715 161.031 119.953 161.055 120.137 161.101 c 120.32
 161.148 120.41 161.262 120.41 161.441 c 120.41 164.953 l 120.41 165.125
 120.402 165.25 120.383 165.332 c 120.363 165.414 120.32 165.48 120.258 
165.531 c 120.195 165.586 120.082 165.621 119.918 165.644 c 117.773 165.644
 l 117.773 161.441 l 117.773 161.262 117.867 161.148 118.059 161.101 c 118.242
 161.055 118.48 161.031 118.77 161.031 c 118.77 160.586 l 115.891 160.586
 l f
124.078 162.125 m 124.078 165.644 l 123.027 165.644 l 123.027 165.972 l
 123.578 165.972 123.988 166.234 124.25 166.754 c 124.512 167.273 124.645
 167.836 124.645 168.437 c 125.004 168.437 l 125.004 166.09 l 126.809 166.09
 l 126.809 165.644 l 125.004 165.644 l 125.004 162.148 l 125.004 161.797
 125.063 161.484 125.18 161.219 c 125.297 160.953 125.512 160.82 125.824
 160.82 c 126.113 160.82 126.324 160.961 126.453 161.238 c 126.582 161.515
 126.645 161.816 126.645 162.148 c 126.645 162.898 l 127.008 162.898 l 127.008
 162.125 l 127.008 161.855 126.961 161.594 126.863 161.332 c 126.766 161.07
 126.621 160.855 126.43 160.691 c 126.238 160.527 126.004 160.445 125.73
 160.445 c 125.223 160.445 124.82 160.597 124.523 160.902 c 124.23 161.207
 124.078 161.613 124.078 162.125 c f
129.133 162.125 m 129.133 165.644 l 128.078 165.644 l 128.078 165.972 l
 128.633 165.972 129.043 166.234 129.305 166.754 c 129.563 167.273 129.695
 167.836 129.695 168.437 c 130.059 168.437 l 130.059 166.09 l 131.863 166.09
 l 131.863 165.644 l 130.059 165.644 l 130.059 162.148 l 130.059 161.797
 130.117 161.484 130.234 161.219 c 130.352 160.953 130.566 160.82 130.879
 160.82 c 131.168 160.82 131.379 160.961 131.504 161.238 c 131.633 161.515
 131.699 161.816 131.699 162.148 c 131.699 162.898 l 132.063 162.898 l 132.063
 162.125 l 132.063 161.855 132.012 161.594 131.914 161.332 c 131.816 161.07
 131.672 160.855 131.48 160.691 c 131.289 160.527 131.059 160.445 130.785
 160.445 c 130.277 160.445 129.875 160.597 129.578 160.902 c 129.281 161.207
 129.133 161.613 129.133 162.125 c f
133.273 160.586 m 133.273 161.031 l 133.57 161.031 133.809 161.055 133.992
 161.101 c 134.176 161.148 134.27 161.262 134.27 161.441 c 134.27 164.93
 l 134.27 165.258 134.207 165.461 134.082 165.531 c 133.957 165.605 133.707
 165.644 133.332 165.644 c 133.332 166.09 l 135.172 166.23 l 135.172 161.441
 l 135.172 161.262 135.25 161.148 135.41 161.101 c 135.57 161.055 135.785
 161.031 136.059 161.031 c 136.059 160.586 l h
133.824 168.426 m 133.824 168.613 133.895 168.777 134.035 168.922 c 134.176
 169.058 134.336 169.129 134.516 169.129 c 134.641 169.129 134.758 169.097
 134.863 169.039 c 134.977 168.972 135.063 168.887 135.121 168.773 c 135.188
 168.66 135.219 168.543 135.219 168.426 c 135.219 168.238 135.145 168.074
 135.008 167.933 c 134.867 167.793 134.703 167.722 134.516 167.722 c 134.336
 167.722 134.176 167.793 134.035 167.933 c 133.895 168.074 133.824 168.238
 133.824 168.426 c f
136.871 160.586 m 136.871 161.031 l 137.168 161.031 137.406 161.055 137.59
 161.101 c 137.773 161.148 137.867 161.262 137.867 161.441 c 137.867 164.93
 l 137.867 165.156 137.832 165.32 137.766 165.422 c 137.699 165.523 137.602
 165.586 137.473 165.609 c 137.344 165.633 137.145 165.644 136.871 165.644
 c 136.871 166.09 l 138.723 166.23 l 138.723 164.988 l 138.895 165.347 139.145
 165.644 139.48 165.879 c 139.816 166.113 140.18 166.23 140.57 166.23 c 
141.156 166.23 141.598 166.09 141.895 165.808 c 142.191 165.527 142.34 165.094
 142.34 164.508 c 142.34 161.441 l 142.34 161.262 142.434 161.148 142.621
 161.101 c 142.809 161.055 143.047 161.031 143.336 161.031 c 143.336 160.586
 l 140.418 160.586 l 140.418 161.031 l 140.707 161.031 140.945 161.055 141.133
 161.101 c 141.32 161.148 141.414 161.262 141.414 161.441 c 141.414 164.472
 l 141.414 164.887 141.355 165.226 141.234 165.5 c 141.113 165.769 140.867
 165.902 140.5 165.902 c 140 165.902 139.594 165.707 139.277 165.308 c 138.961
 164.914 138.805 164.465 138.805 163.953 c 138.805 161.441 l 138.805 161.262
 138.898 161.148 139.086 161.101 c 139.27 161.055 139.512 161.031 139.797
 161.031 c 139.797 160.586 l 136.871 160.586 l f
144.066 159.59 m 144.066 159.894 144.176 160.16 144.398 160.387 c 144.621
 160.613 144.883 160.773 145.18 160.867 c 145.016 160.992 144.887 161.152
 144.797 161.347 c 144.707 161.543 144.664 161.754 144.664 161.972 c 144.664
 162.371 144.789 162.726 145.039 163.039 c 144.648 163.422 144.453 163.859
 144.453 164.355 c 144.453 164.621 144.508 164.867 144.621 165.097 c 144.734
 165.332 144.895 165.531 145.102 165.703 c 145.309 165.875 145.535 166.008
 145.781 166.097 c 146.027 166.187 146.281 166.23 146.551 166.23 c 147.055
 166.23 147.508 166.082 147.906 165.785 c 148.078 165.972 148.285 166.117
 148.523 166.219 c 148.762 166.32 149.008 166.371 149.266 166.371 c 149.453
 166.371 149.605 166.308 149.723 166.18 c 149.84 166.051 149.898 165.89 
149.898 165.703 c 149.898 165.601 149.855 165.512 149.773 165.433 c 149.691
 165.355 149.602 165.316 149.5 165.316 c 149.391 165.316 149.297 165.355
 149.219 165.433 c 149.141 165.512 149.102 165.601 149.102 165.703 c 149.102
 165.859 149.152 165.969 149.254 166.031 c 148.816 166.031 148.441 165.883
 148.129 165.586 c 148.277 165.43 148.398 165.238 148.492 165.015 c 148.586
 164.793 148.633 164.574 148.633 164.355 c 148.633 163.996 148.535 163.668
 148.336 163.379 c 148.137 163.09 147.875 162.863 147.551 162.703 c 147.227
 162.543 146.891 162.465 146.551 162.465 c 146.078 162.465 145.652 162.59
 145.27 162.84 c 145.145 162.676 145.086 162.492 145.086 162.289 c 145.086
 162.062 145.156 161.863 145.309 161.695 c 145.453 161.527 145.645 161.441
 145.867 161.441 c 146.91 161.441 l 147.422 161.441 147.875 161.394 148.281
 161.301 c 148.688 161.207 149.031 161.023 149.309 160.75 c 149.586 160.476
 149.723 160.09 149.723 159.59 c 149.723 159.215 149.563 158.902 149.246
 158.656 c 148.934 158.41 148.555 158.23 148.117 158.121 c 147.68 158.012
 147.273 157.957 146.898 157.957 c 146.523 157.957 146.117 158.012 145.676
 158.121 c 145.234 158.23 144.855 158.41 144.539 158.656 c 144.223 158.902
 144.066 159.215 144.066 159.59 c h
144.781 159.59 m 144.781 159.297 144.898 159.058 145.133 158.867 c 145.367
 158.676 145.648 158.531 145.977 158.437 c 146.301 158.344 146.609 158.297
 146.898 158.297 c 147.188 158.297 147.496 158.344 147.824 158.437 c 148.152
 158.531 148.434 158.676 148.664 158.867 c 148.895 159.058 149.008 159.297
 149.008 159.59 c 149.008 160.035 148.805 160.32 148.395 160.449 c 147.984
 160.582 147.488 160.644 146.91 160.644 c 145.867 160.644 l 145.676 160.644
 145.496 160.597 145.332 160.504 c 145.164 160.41 145.031 160.277 144.934
 160.109 c 144.828 159.941 144.781 159.769 144.781 159.59 c h
146.551 162.805 m 147.266 162.805 147.625 163.32 147.625 164.355 c 147.625
 164.801 147.551 165.168 147.398 165.457 c 147.246 165.746 146.965 165.89
 146.551 165.89 c 146.137 165.89 145.852 165.746 145.691 165.457 c 145.535
 165.168 145.461 164.801 145.461 164.355 c 145.461 164.07 145.488 163.816
 145.547 163.586 c 145.605 163.355 145.715 163.168 145.875 163.019 c 146.035
 162.875 146.258 162.805 146.551 162.805 c f
154.918 160.586 m 154.918 161.031 l 155.215 161.031 155.453 161.055 155.637
 161.101 c 155.82 161.148 155.914 161.262 155.914 161.441 c 155.914 164.93
 l 155.914 165.156 155.879 165.32 155.813 165.422 c 155.746 165.523 155.648
 165.586 155.52 165.609 c 155.391 165.633 155.191 165.644 154.918 165.644
 c 154.918 166.09 l 156.77 166.23 l 156.77 164.988 l 156.938 165.347 157.191
 165.644 157.527 165.879 c 157.863 166.113 158.227 166.23 158.617 166.23
 c 159.594 166.23 160.168 165.832 160.34 165.035 c 160.512 165.387 160.762
 165.676 161.09 165.894 c 161.418 166.121 161.777 166.23 162.168 166.23 
c 162.551 166.23 162.871 166.168 163.141 166.043 c 163.406 165.918 163.605
 165.73 163.734 165.476 c 163.867 165.219 163.938 164.898 163.938 164.508
 c 163.938 161.441 l 163.938 161.262 164.027 161.148 164.219 161.101 c 164.402
 161.055 164.641 161.031 164.93 161.031 c 164.93 160.586 l 162.016 160.586
 l 162.016 161.031 l 162.305 161.031 162.543 161.055 162.73 161.101 c 162.918
 161.148 163.012 161.262 163.012 161.441 c 163.012 164.472 l 163.012 164.902
 162.949 165.246 162.828 165.512 c 162.707 165.773 162.461 165.902 162.086
 165.902 c 161.594 165.902 161.188 165.707 160.867 165.308 c 160.547 164.914
 160.387 164.465 160.387 163.953 c 160.387 161.441 l 160.387 161.262 160.48
 161.148 160.668 161.101 c 160.855 161.055 161.094 161.031 161.383 161.031
 c 161.383 160.586 l 158.465 160.586 l 158.465 161.031 l 158.754 161.031
 158.992 161.055 159.18 161.101 c 159.367 161.148 159.461 161.262 159.461
 161.441 c 159.461 164.472 l 159.461 164.887 159.402 165.226 159.281 165.5
 c 159.16 165.769 158.914 165.902 158.547 165.902 c 158.047 165.902 157.641
 165.707 157.324 165.308 c 157.008 164.914 156.848 164.465 156.848 163.953
 c 156.848 161.441 l 156.848 161.262 156.941 161.148 157.129 161.101 c 157.316
 161.055 157.555 161.031 157.844 161.031 c 157.844 160.586 l 154.918 160.586
 l f
168.555 160.445 m 168.047 160.445 167.574 160.574 167.141 160.832 c 166.703
 161.09 166.355 161.437 166.102 161.879 c 165.848 162.316 165.723 162.793
 165.723 163.308 c 165.723 163.699 165.789 164.074 165.934 164.437 c 166.074
 164.797 166.273 165.117 166.527 165.402 c 166.785 165.687 167.09 165.914
 167.43 166.074 c 167.773 166.234 168.148 166.312 168.555 166.312 c 169.078
 166.312 169.555 166.176 169.984 165.894 c 170.414 165.621 170.754 165.25
 171.004 164.789 c 171.254 164.324 171.379 163.832 171.379 163.308 c 171.379
 162.793 171.254 162.316 170.996 161.879 c 170.742 161.437 170.398 161.09
 169.969 160.832 c 169.535 160.574 169.063 160.445 168.555 160.445 c h
168.555 160.82 m 169.234 160.82 169.691 161.066 169.922 161.558 c 170.152
 162.055 170.266 162.683 170.266 163.449 c 170.266 163.879 170.242 164.234
 170.195 164.512 c 170.148 164.789 170.047 165.047 169.891 165.281 c 169.797
 165.422 169.676 165.547 169.527 165.648 c 169.379 165.758 169.223 165.836
 169.059 165.89 c 168.895 165.945 168.727 165.972 168.555 165.972 c 168.289
 165.972 168.039 165.914 167.801 165.793 c 167.563 165.672 167.363 165.5
 167.207 165.281 c 167.051 165.039 166.949 164.773 166.902 164.484 c 166.855
 164.191 166.836 163.847 166.836 163.449 c 166.836 162.972 166.879 162.543
 166.965 162.164 c 167.047 161.785 167.215 161.465 167.465 161.207 c 167.715
 160.949 168.078 160.82 168.555 160.82 c f
175.344 160.445 m 174.836 160.445 174.375 160.582 173.961 160.851 c 173.547
 161.121 173.227 161.476 172.996 161.922 c 172.766 162.371 172.648 162.844
 172.648 163.344 c 172.648 163.859 172.773 164.34 173.023 164.781 c 173.273
 165.222 173.613 165.574 174.051 165.84 c 174.48 166.101 174.957 166.23 
175.473 166.23 c 175.785 166.23 176.078 166.164 176.355 166.031 c 176.633
 165.898 176.871 165.719 177.078 165.492 c 177.078 168.144 l 177.078 168.371
 177.043 168.535 176.977 168.637 c 176.91 168.738 176.813 168.801 176.684
 168.824 c 176.555 168.847 176.359 168.859 176.094 168.859 c 176.094 169.305
 l 177.977 169.449 l 177.977 161.75 l 177.977 161.519 178.012 161.355 178.078
 161.254 c 178.145 161.152 178.242 161.09 178.371 161.066 c 178.5 161.043
 178.695 161.031 178.965 161.031 c 178.965 160.586 l 177.039 160.445 l 177.039
 161.242 l 176.824 160.992 176.563 160.797 176.258 160.656 c 175.953 160.515
 175.648 160.445 175.344 160.445 c h
174.043 161.699 m 174.184 161.418 174.375 161.195 174.617 161.027 c 174.859
 160.859 175.125 160.773 175.414 160.773 c 175.766 160.773 176.09 160.879
 176.387 161.086 c 176.684 161.293 176.902 161.555 177.039 161.879 c 177.039
 164.941 l 176.941 165.129 176.816 165.297 176.664 165.437 c 176.52 165.586
 176.348 165.695 176.156 165.777 c 175.965 165.863 175.766 165.902 175.555
 165.902 c 175.109 165.902 174.75 165.773 174.48 165.519 c 174.215 165.265
 174.023 164.945 173.922 164.555 c 173.813 164.164 173.762 163.754 173.762
 163.332 c 173.762 162.988 173.777 162.687 173.816 162.433 c 173.852 162.18
 173.926 161.933 174.043 161.699 c f
182.621 160.445 m 182.105 160.445 181.629 160.582 181.195 160.851 c 180.766
 161.121 180.422 161.484 180.172 161.941 c 179.922 162.398 179.797 162.883
 179.797 163.39 c 179.797 163.883 179.91 164.355 180.137 164.805 c 180.363
 165.254 180.68 165.621 181.086 165.894 c 181.492 166.176 181.945 166.312
 182.445 166.312 c 182.828 166.312 183.164 166.246 183.453 166.113 c 183.742
 165.98 183.98 165.801 184.164 165.566 c 184.355 165.34 184.496 165.062 
184.594 164.746 c 184.691 164.43 184.742 164.082 184.742 163.707 c 184.742
 163.59 184.691 163.531 184.602 163.531 c 180.91 163.531 l 180.91 163.402
 l 180.91 162.691 181.055 162.082 181.34 161.578 c 181.621 161.074 182.09
 160.82 182.738 160.82 c 182.996 160.82 183.234 160.879 183.457 160.992 
c 183.68 161.105 183.871 161.265 184.039 161.476 c 184.199 161.687 184.313
 161.914 184.367 162.148 c 184.371 162.18 184.391 162.203 184.41 162.222
 c 184.438 162.242 184.465 162.254 184.496 162.254 c 184.602 162.254 l 184.691
 162.254 184.742 162.203 184.742 162.101 c 184.617 161.613 184.355 161.219
 183.953 160.91 c 183.559 160.601 183.113 160.445 182.621 160.445 c h
180.922 163.847 m 183.84 163.847 l 183.84 164.172 183.793 164.496 183.703
 164.824 c 183.613 165.152 183.465 165.426 183.258 165.644 c 183.051 165.863
 182.781 165.972 182.445 165.972 c 181.961 165.972 181.586 165.75 181.32
 165.301 c 181.055 164.847 180.922 164.363 180.922 163.847 c f
185.605 160.586 m 185.605 161.031 l 185.902 161.031 186.145 161.055 186.328
 161.101 c 186.512 161.148 186.602 161.262 186.602 161.441 c 186.602 168.144
 l 186.602 168.371 186.57 168.535 186.504 168.637 c 186.438 168.738 186.34
 168.801 186.211 168.824 c 186.082 168.847 185.879 168.859 185.605 168.859
 c 185.605 169.305 l 187.504 169.449 l 187.504 161.441 l 187.504 161.262
 187.598 161.148 187.785 161.101 c 187.973 161.055 188.207 161.031 188.488
 161.031 c 188.488 160.586 l 185.605 160.586 l f
1 g
33.734 151.742 182.156 -54.84 re f
0.87451 g
0.501049 w
0 J
1 j
[] 0.0 d
10 M q 0.997899 0 0 -1 0 178.784988 cm
45.212 81.883 m 45.212 27.043 l S Q
q 0.997899 0 0 -1 0 178.784988 cm
68.03 81.883 m 68.03 27.043 l S Q
q 0.997899 0 0 -1 0 178.784988 cm
90.847 81.883 m 90.847 27.043 l S Q
q 0.997899 0 0 -1 0 178.784988 cm
113.665 81.883 m 113.665 27.043 l S Q
q 0.997899 0 0 -1 0 178.784988 cm
136.482 81.883 m 136.482 27.043 l S Q
q 0.997899 0 0 -1 0 178.784988 cm
159.299 81.883 m 159.299 27.043 l S Q
q 0.997899 0 0 -1 0 178.784988 cm
182.121 81.883 m 182.121 27.043 l S Q
q 0.997899 0 0 -1 0 178.784988 cm
204.938 81.883 m 204.938 27.043 l S Q
0.776471 g
2 j
[ 0.751198 2.253594] 0 d
q 0.997899 0 0 -1 0 178.784988 cm
216.345 81.883 m 33.805 81.883 l S Q
[ 0.751198 2.253594] 0 d
q 0.997899 0 0 -1 0 178.784988 cm
216.345 75.43 m 33.805 75.43 l S Q
[ 0.751198 2.253594] 0 d
q 0.997899 0 0 -1 0 178.784988 cm
216.345 68.98 m 33.805 68.98 l S Q
[ 0.751198 2.253594] 0 d
q 0.997899 0 0 -1 0 178.784988 cm
216.345 56.074 m 33.805 56.074 l S Q
[ 0.751198 2.253594] 0 d
q 0.997899 0 0 -1 0 178.784988 cm
216.345 49.625 m 33.805 49.625 l S Q
[ 0.751198 2.253594] 0 d
q 0.997899 0 0 -1 0 178.784988 cm
216.345 43.172 m 33.805 43.172 l S Q
[ 0.751198 2.253594] 0 d
q 0.997899 0 0 -1 0 178.784988 cm
216.345 30.27 m 33.805 30.27 l S Q
0.87451 g
1 j
[] 0.0 d
q 0.997899 0 0 -1 0 178.784988 cm
216.345 62.527 m 33.805 62.527 l S Q
q 0.997899 0 0 -1 0 178.784988 cm
216.345 36.723 m 33.805 36.723 l S Q
0.14902 g
2 J
q 0.997899 0 0 -1 0 178.784988 cm
33.805 81.883 m 216.345 81.883 l S Q
q 0.997899 0 0 -1 0 178.784988 cm
33.805 27.043 m 216.345 27.043 l S Q
q 0.997899 0 0 -1 0 178.784988 cm
45.212 81.883 m 45.212 80.055 l S Q
q 0.997899 0 0 -1 0 178.784988 cm
68.03 81.883 m 68.03 80.055 l S Q
q 0.997899 0 0 -1 0 178.784988 cm
90.847 81.883 m 90.847 80.055 l S Q
q 0.997899 0 0 -1 0 178.784988 cm
113.665 81.883 m 113.665 80.055 l S Q
q 0.997899 0 0 -1 0 178.784988 cm
136.482 81.883 m 136.482 80.055 l S Q
q 0.997899 0 0 -1 0 178.784988 cm
159.299 81.883 m 159.299 80.055 l S Q
q 0.997899 0 0 -1 0 178.784988 cm
182.121 81.883 m 182.121 80.055 l S Q
q 0.997899 0 0 -1 0 178.784988 cm
204.938 81.883 m 204.938 80.055 l S Q
q 0.997899 0 0 -1 0 178.784988 cm
45.212 27.043 m 45.212 28.871 l S Q
q 0.997899 0 0 -1 0 178.784988 cm
68.03 27.043 m 68.03 28.871 l S Q
q 0.997899 0 0 -1 0 178.784988 cm
90.847 27.043 m 90.847 28.871 l S Q
q 0.997899 0 0 -1 0 178.784988 cm
113.665 27.043 m 113.665 28.871 l S Q
q 0.997899 0 0 -1 0 178.784988 cm
136.482 27.043 m 136.482 28.871 l S Q
q 0.997899 0 0 -1 0 178.784988 cm
159.299 27.043 m 159.299 28.871 l S Q
q 0.997899 0 0 -1 0 178.784988 cm
182.121 27.043 m 182.121 28.871 l S Q
q 0.997899 0 0 -1 0 178.784988 cm
204.938 27.043 m 204.938 28.871 l S Q
q 0.997899 0 0 -1 0 178.784988 cm
33.805 81.883 m 33.805 27.043 l S Q
q 0.997899 0 0 -1 0 178.784988 cm
216.345 81.883 m 216.345 27.043 l S Q
q 0.997899 0 0 -1 0 178.784988 cm
33.805 62.527 m 35.63 62.527 l S Q
q 0.997899 0 0 -1 0 178.784988 cm
33.805 36.723 m 35.63 36.723 l S Q
q 0.997899 0 0 -1 0 178.784988 cm
216.345 62.527 m 214.521 62.527 l S Q
q 0.997899 0 0 -1 0 178.784988 cm
216.345 36.723 m 214.521 36.723 l S Q
28.547 114.336 m 28.547 114.558 l 28.547 114.574 28.551 114.59 28.559 114.605
 c 29.848 116.027 l 30.043 116.238 30.199 116.414 30.316 116.555 c 30.43
 116.695 30.551 116.855 30.672 117.043 c 30.793 117.226 30.887 117.414 30.953
 117.609 c 31.02 117.805 31.051 118.008 31.051 118.222 c 31.051 118.449 
31.012 118.664 30.93 118.871 c 30.848 119.078 30.723 119.246 30.559 119.363
 c 30.398 119.488 30.199 119.547 29.965 119.547 c 29.723 119.547 29.504 
119.476 29.313 119.332 c 29.121 119.183 28.988 119 28.91 118.773 c 28.934
 118.781 28.965 118.785 29.004 118.785 c 29.129 118.785 29.234 118.742 29.32
 118.66 c 29.406 118.578 29.449 118.472 29.449 118.34 c 29.449 118.215 29.406
 118.105 29.32 118.015 c 29.234 117.926 29.129 117.879 29.004 117.879 c 
28.871 117.879 28.762 117.926 28.676 118.015 c 28.59 118.105 28.547 118.215
 28.547 118.34 c 28.547 118.543 28.586 118.734 28.664 118.922 c 28.742 119.101
 28.852 119.265 28.996 119.406 c 29.141 119.547 29.309 119.656 29.496 119.73
 c 29.68 119.805 29.879 119.84 30.078 119.84 c 30.391 119.84 30.684 119.773
 30.957 119.64 c 31.23 119.508 31.445 119.32 31.602 119.078 c 31.758 118.836
 31.836 118.551 31.836 118.222 c 31.836 117.98 31.785 117.75 31.68 117.535
 c 31.574 117.32 31.441 117.125 31.281 116.949 c 31.121 116.769 30.91 116.57
 30.652 116.347 c 30.395 116.125 30.227 115.98 30.152 115.91 c 29.215 115.004
 l 30.012 115.004 l 30.402 115.004 30.727 115.008 30.988 115.015 c 31.25
 115.023 31.387 115.035 31.402 115.051 c 31.465 115.113 31.531 115.363 31.602
 115.805 c 31.836 115.805 l 31.602 114.336 l 28.547 114.336 l f
28.371 141.504 m 28.371 141.797 l 30.91 145.601 l 30.934 145.629 30.961
 145.644 30.992 145.644 c 31.121 145.644 l 31.184 145.644 31.215 145.613
 31.215 145.551 c 31.215 141.797 l 32.023 141.797 l 32.023 141.504 l 31.215
 141.504 l 31.215 140.691 l 31.215 140.586 31.297 140.512 31.457 140.48 
c 31.617 140.449 31.801 140.433 32.012 140.433 c 32.012 140.14 l 29.738 
140.14 l 29.738 140.433 l 29.953 140.433 30.141 140.449 30.301 140.48 c 
30.465 140.512 30.547 140.586 30.547 140.691 c 30.547 141.504 l h
28.641 141.797 m 30.594 141.797 l 30.594 144.719 l h
28.641 141.797 m f
24.074 121.832 m 24.074 121.445 23.93 121.144 23.641 120.926 c 23.352 120.707
 23.016 120.597 22.637 120.597 c 22.242 120.597 21.844 120.695 21.434 120.898
 c 21.023 121.097 20.684 121.367 20.41 121.707 c 20.137 122.047 20 122.414
 20 122.805 c 20 122.976 20.047 123.133 20.145 123.277 c 20.242 123.422 
20.375 123.535 20.539 123.613 c 18.523 124.121 l 18.422 124.14 18.344 124.156
 18.289 124.164 c 18.188 124.164 18.137 123.969 18.137 123.578 c 18.137 
123.515 18.098 123.484 18.02 123.484 c 18.004 123.484 17.977 123.488 17.945
 123.504 c 17.91 123.515 17.879 123.527 17.855 123.543 c 17.832 123.558 
17.82 123.582 17.82 123.613 c 17.727 124.824 l 17.727 124.902 17.766 124.941
 17.844 124.941 c 23.02 123.637 l 23.113 123.597 23.254 123.578 23.441 123.578
 c 23.699 123.578 23.828 123.664 23.828 123.836 c 23.828 124.023 23.711 
124.168 23.473 124.265 c 23.234 124.363 22.957 124.445 22.645 124.519 c 
22.613 124.523 22.598 124.547 22.598 124.59 c 22.598 124.691 l 22.598 124.719
 22.609 124.734 22.629 124.754 c 22.648 124.769 22.664 124.777 22.68 124.777
 c 23.102 124.668 23.441 124.551 23.695 124.422 c 23.949 124.297 24.074 
124.094 24.074 123.812 c 24.074 123.617 24.016 123.441 23.895 123.285 c 
23.773 123.129 23.613 123.031 23.418 122.992 c 23.855 122.601 24.074 122.215
 24.074 121.832 c h
23.828 121.832 m 23.828 122.047 23.75 122.262 23.59 122.465 c 23.43 122.668
 23.238 122.844 23.02 122.992 c 23.012 123 23 123.004 22.984 123.004 c 20.996
 123.496 l 20.785 123.457 20.602 123.379 20.449 123.254 c 20.297 123.133
 20.223 122.976 20.223 122.781 c 20.223 122.578 20.305 122.387 20.473 122.211
 c 20.641 122.035 20.84 121.887 21.066 121.769 c 21.301 121.652 21.629 121.543
 22.047 121.437 c 22.469 121.332 22.793 121.277 23.02 121.277 c 23.23 121.277
 23.418 121.324 23.582 121.414 c 23.746 121.504 23.828 121.64 23.828 121.832
 c f
26.449 124.691 m 26.449 124.652 26.426 124.633 26.379 124.633 c 26.293 
124.648 26.25 124.676 26.25 124.715 c 26.25 124.84 26.238 124.93 26.215 
124.98 c 26.191 125.031 26.133 125.07 26.039 125.101 c 23.332 125.769 l 
23.262 125.805 23.168 125.82 23.051 125.82 c 22.879 125.82 22.793 125.762
 22.793 125.644 c 22.793 125.519 22.867 125.426 23.016 125.367 c 23.164 
125.308 23.352 125.246 23.578 125.183 c 23.609 125.183 23.625 125.168 23.625
 125.137 c 23.625 125.066 l 23.625 125.058 23.617 125.051 23.602 125.039
 c 23.586 125.027 23.57 125.019 23.555 125.019 c 23.383 125.058 23.238 125.101
 23.117 125.144 c 22.996 125.187 22.887 125.25 22.789 125.332 c 22.691 125.414
 22.641 125.519 22.641 125.652 c 22.641 125.789 22.68 125.906 22.754 126.012
 c 22.828 126.117 22.93 126.183 23.063 126.207 c 22.938 126.316 22.836 126.437
 22.758 126.57 c 22.68 126.703 22.641 126.84 22.641 126.98 c 22.641 127.152
 22.688 127.301 22.777 127.426 c 22.867 127.551 22.984 127.644 23.129 127.711
 c 23.273 127.769 23.426 127.801 23.59 127.801 c 23.848 127.801 24.117 127.734
 24.395 127.601 c 24.672 127.469 24.902 127.289 25.086 127.062 c 25.27 126.836
 25.359 126.594 25.359 126.336 c 25.359 126.219 25.328 126.113 25.262 126.019
 c 25.195 125.926 25.105 125.851 24.996 125.797 c 26.063 125.523 l 26.125
 125.515 26.16 125.512 26.168 125.504 c 26.223 125.504 26.25 125.633 26.25
 125.898 c 26.25 125.937 26.273 125.961 26.32 125.961 c 26.375 125.953 26.41
 125.941 26.426 125.93 c 26.441 125.918 26.449 125.898 26.449 125.863 c 
h
25.195 126.347 m 25.195 126.48 25.141 126.605 25.027 126.726 c 24.914 126.851
 24.785 126.945 24.645 127.015 c 24.535 127.07 24.402 127.125 24.246 127.176
 c 24.09 127.226 23.926 127.269 23.75 127.305 c 23.574 127.34 23.434 127.355
 23.332 127.355 c 23.238 127.355 23.152 127.344 23.074 127.316 c 22.996 
127.289 22.93 127.246 22.875 127.191 c 22.82 127.137 22.793 127.062 22.793
 126.969 c 22.793 126.828 22.848 126.691 22.953 126.558 c 23.059 126.426
 23.184 126.308 23.332 126.207 c 23.355 126.207 l 24.68 125.879 l 24.82 
125.902 24.941 125.953 25.043 126.031 c 25.145 126.109 25.195 126.215 25.195
 126.347 c f
0 0 1 rg
1.252243 w
0 J
2 j
[ 7.511979 4.507187] 0 d
q 0.997899 0 0 -1 0 178.784988 cm
45.212 60 m 204.938 60 l S Q
0.501049 w
0 j
[] 0.0 d
q 0.997899 0 0 -1 0 178.784988 cm
45.212 63.129 m 45.212 69.141 l 42.21 66.137 m 48.218 66.137 l 43.091 64.012
 m 47.338 68.262 l 43.091 68.262 m 47.338 64.012 l S Q
q 0.997899 0 0 -1 0 178.784988 cm
68.03 78.133 m 68.03 84.145 l 65.027 81.137 m 71.036 81.137 l 65.904 79.016
 m 70.155 83.262 l 65.904 83.262 m 70.155 79.016 l S Q
q 0.997899 0 0 -1 0 178.784988 cm
90.847 56.242 m 90.847 62.254 l 87.845 59.25 m 93.853 59.25 l 88.725 57.125
 m 92.973 61.371 l 88.725 61.371 m 92.973 57.125 l S Q
q 0.997899 0 0 -1 0 178.784988 cm
113.665 61.23 m 113.665 67.238 l 110.662 64.234 m 116.671 64.234 l 111.543
 62.109 m 115.79 66.359 l 111.543 66.359 m 115.79 62.109 l S Q
q 0.997899 0 0 -1 0 178.784988 cm
136.482 28.219 m 136.482 34.227 l 133.48 31.223 m 139.488 31.223 l 134.36
 29.102 m 138.608 33.348 l 134.36 33.348 m 138.608 29.102 l S Q
q 0.997899 0 0 -1 0 178.784988 cm
159.299 62.246 m 159.299 68.254 l 156.297 65.25 m 162.306 65.25 l 157.178
 63.125 m 161.425 67.375 l 157.178 67.375 m 161.425 63.125 l S Q
q 0.997899 0 0 -1 0 178.784988 cm
182.121 55.16 m 182.121 61.168 l 179.115 58.164 m 185.123 58.164 l 179.995
 56.039 m 184.243 60.289 l 179.995 60.289 m 184.243 56.039 l S Q
q 0.997899 0 0 -1 0 178.784988 cm
204.934 51.586 m 204.934 57.594 l 201.932 54.59 m 207.941 54.59 l 202.813
 52.465 m 207.06 56.715 l 202.813 56.715 m 207.06 52.465 l S Q
1 g
143.648 150.949 71.215 -23.289 re f
0 g
179.145 142.527 m 179.145 142.82 l 179.738 142.82 180.035 142.906 180.035
 143.078 c 180.035 147.621 l 180.035 147.793 179.738 147.879 179.145 147.879
 c 179.145 148.172 l 181.699 148.172 l 181.699 147.879 l 181.105 147.879
 180.809 147.793 180.809 147.621 c 180.809 143.078 l 180.809 142.906 181.105
 142.82 181.699 142.82 c 181.699 142.527 l 179.145 142.527 l f
183.836 142.433 m 183.508 142.433 183.211 142.519 182.945 142.699 c 182.68
 142.871 182.473 143.105 182.32 143.394 c 182.168 143.683 182.09 143.988
 182.09 144.312 c 182.09 144.648 182.172 144.957 182.336 145.242 c 182.5
 145.531 182.723 145.758 183 145.926 c 183.277 146.094 183.582 146.176 183.918
 146.176 c 184.121 146.176 184.313 146.133 184.492 146.047 c 184.672 145.961
 184.828 145.844 184.961 145.695 c 184.961 147.422 l 184.961 147.57 184.941
 147.676 184.898 147.738 c 184.855 147.801 184.793 147.84 184.711 147.855
 c 184.629 147.871 184.496 147.879 184.316 147.879 c 184.316 148.172 l 185.547
 148.254 l 185.547 143.277 l 185.547 143.129 185.57 143.023 185.613 142.961
 c 185.656 142.898 185.715 142.859 185.797 142.844 c 185.879 142.828 186.008
 142.82 186.18 142.82 c 186.18 142.527 l 184.938 142.433 l 184.938 142.949
 l 184.797 142.785 184.629 142.656 184.434 142.566 c 184.238 142.476 184.039
 142.433 183.836 142.433 c h
182.992 143.242 m 183.086 143.062 183.211 142.922 183.367 142.816 c 183.523
 142.707 183.695 142.656 183.883 142.656 c 184.109 142.656 184.32 142.722
 184.512 142.851 c 184.703 142.98 184.844 143.148 184.938 143.359 c 184.938
 145.344 l 184.875 145.461 184.797 145.57 184.699 145.668 c 184.598 145.765
 184.488 145.84 184.363 145.89 c 184.238 145.941 184.109 145.965 183.977
 145.965 c 183.688 145.965 183.457 145.883 183.281 145.719 c 183.105 145.555
 182.984 145.347 182.918 145.097 c 182.852 144.847 182.816 144.582 182.816
 144.301 c 182.816 144.078 182.828 143.89 182.848 143.722 c 182.867 143.558
 182.914 143.398 182.992 143.242 c f
188.316 142.433 m 187.98 142.433 187.672 142.519 187.395 142.699 c 187.117
 142.871 186.898 143.109 186.738 143.402 c 186.578 143.695 186.5 144.008
 186.5 144.332 c 186.5 144.664 186.57 144.972 186.715 145.262 c 186.859 
145.551 187.063 145.785 187.324 145.965 c 187.586 146.144 187.875 146.234
 188.195 146.234 c 188.453 146.234 188.676 146.191 188.859 146.105 c 189.043
 146.019 189.195 145.902 189.316 145.75 c 189.438 145.597 189.527 145.418
 189.59 145.215 c 189.652 145.012 189.684 144.789 189.684 144.547 c 189.684
 144.476 189.656 144.441 189.602 144.441 c 187.211 144.441 l 187.211 144.347
 l 187.211 143.89 187.305 143.5 187.488 143.172 c 187.672 142.844 187.973
 142.68 188.398 142.68 c 188.563 142.68 188.715 142.719 188.859 142.789 
c 189.004 142.863 189.129 142.969 189.234 143.101 c 189.34 143.234 189.41
 143.379 189.449 143.535 c 189.457 143.551 189.469 143.566 189.48 143.582
 c 189.492 143.597 189.508 143.605 189.531 143.605 c 189.602 143.605 l 189.656
 143.605 189.684 143.57 189.684 143.5 c 189.605 143.187 189.438 142.933 
189.18 142.73 c 188.922 142.531 188.633 142.433 188.316 142.433 c h
187.223 144.64 m 189.098 144.64 l 189.098 144.851 189.07 145.062 189.02
 145.273 c 188.961 145.484 188.867 145.66 188.73 145.801 c 188.594 145.941
 188.414 146.012 188.195 146.012 c 187.883 146.012 187.645 145.867 187.477
 145.574 c 187.309 145.281 187.223 144.969 187.223 144.64 c f
190.066 142.527 m 190.066 142.82 l 190.25 142.82 190.406 142.832 190.527
 142.859 c 190.648 142.89 190.707 142.961 190.707 143.078 c 190.707 145.332
 l 190.707 145.48 190.688 145.59 190.645 145.656 c 190.602 145.722 190.535
 145.762 190.449 145.777 c 190.363 145.793 190.234 145.801 190.066 145.801
 c 190.066 146.094 l 191.258 146.176 l 191.258 145.367 l 191.367 145.609
 191.531 145.805 191.75 145.953 c 191.969 146.101 192.203 146.176 192.453
 146.176 c 192.836 146.176 193.125 146.086 193.316 145.902 c 193.504 145.719
 193.602 145.437 193.602 145.062 c 193.602 143.078 l 193.602 142.961 193.66
 142.89 193.785 142.859 c 193.906 142.832 194.059 142.82 194.246 142.82 
c 194.246 142.527 l 192.359 142.527 l 192.359 142.82 l 192.547 142.82 192.703
 142.832 192.824 142.859 c 192.945 142.89 193.004 142.961 193.004 143.078
 c 193.004 145.039 l 193.004 145.312 192.965 145.535 192.887 145.707 c 192.809
 145.879 192.648 145.965 192.406 145.965 c 192.086 145.965 191.824 145.84
 191.621 145.582 c 191.418 145.328 191.316 145.039 191.316 144.711 c 191.316
 143.078 l 191.316 142.961 191.375 142.89 191.492 142.859 c 191.609 142.832
 191.762 142.82 191.949 142.82 c 191.949 142.527 l 190.066 142.527 l f
194.883 143.523 m 194.883 145.801 l 194.191 145.801 l 194.191 146.012 l
 194.551 146.012 194.816 146.183 194.988 146.519 c 195.16 146.855 195.246
 147.219 195.246 147.609 c 195.48 147.609 l 195.48 146.094 l 196.637 146.094
 l 196.637 145.801 l 195.48 145.801 l 195.48 143.535 l 195.48 143.308 195.52
 143.109 195.594 142.937 c 195.676 142.765 195.813 142.68 196.004 142.68
 c 196.195 142.68 196.328 142.769 196.41 142.949 c 196.492 143.129 196.531
 143.324 196.531 143.535 c 196.531 144.027 l 196.777 144.027 l 196.777 143.523
 l 196.777 143.351 196.746 143.183 196.684 143.015 c 196.621 142.847 196.531
 142.707 196.406 142.597 c 196.281 142.488 196.125 142.433 195.949 142.433
 c 195.621 142.433 195.359 142.531 195.168 142.73 c 194.977 142.933 194.883
 143.195 194.883 143.523 c f
197.406 142.527 m 197.406 142.82 l 197.594 142.82 197.746 142.832 197.867
 142.859 c 197.988 142.89 198.051 142.961 198.051 143.078 c 198.051 145.332
 l 198.051 145.543 198.008 145.676 197.926 145.726 c 197.844 145.777 197.684
 145.801 197.441 145.801 c 197.441 146.094 l 198.625 146.176 l 198.625 143.078
 l 198.625 142.961 198.676 142.89 198.781 142.859 c 198.887 142.832 199.027
 142.82 199.199 142.82 c 199.199 142.527 l h
197.758 147.597 m 197.758 147.722 197.801 147.828 197.891 147.922 c 197.98
 148.012 198.086 148.055 198.203 148.055 c 198.281 148.055 198.355 148.035
 198.43 147.996 c 198.504 147.957 198.563 147.902 198.602 147.824 c 198.641
 147.754 198.66 147.676 198.66 147.597 c 198.66 147.48 198.613 147.375 198.523
 147.285 c 198.434 147.195 198.328 147.152 198.203 147.152 c 198.086 147.152
 197.98 147.195 197.891 147.285 c 197.801 147.375 197.758 147.48 197.758
 147.597 c f
199.582 142.527 m 199.582 142.82 l 199.77 142.82 199.922 142.832 200.043
 142.859 c 200.164 142.89 200.223 142.961 200.223 143.078 c 200.223 145.801
 l 199.59 145.801 l 199.59 146.094 l 200.223 146.094 l 200.223 147.082 l
 200.223 147.293 200.281 147.476 200.398 147.64 c 200.516 147.801 200.668
 147.933 200.855 148.039 c 201.043 148.144 201.246 148.222 201.461 148.273
 c 201.676 148.324 201.875 148.347 202.063 148.347 c 202.227 148.347 202.387
 148.316 202.547 148.25 c 202.711 148.183 202.836 148.086 202.938 147.957
 c 203.031 147.824 203.082 147.676 203.082 147.504 c 203.082 147.394 203.043
 147.301 202.965 147.222 c 202.887 147.144 202.793 147.105 202.684 147.105
 c 202.566 147.105 202.469 147.14 202.398 147.215 c 202.324 147.289 202.285
 147.387 202.285 147.504 c 202.285 147.605 202.324 147.695 202.398 147.777
 c 202.469 147.859 202.559 147.902 202.66 147.902 c 202.488 148.058 202.266
 148.137 201.992 148.137 c 201.797 148.137 201.605 148.094 201.418 148.004
 c 201.23 147.91 201.078 147.785 200.957 147.621 c 200.836 147.457 200.773
 147.269 200.773 147.058 c 200.773 146.094 l 201.863 146.094 l 203.094 146.187
 l 203.094 143.078 l 203.094 142.961 203.156 142.89 203.277 142.859 c 203.395
 142.832 203.547 142.82 203.727 142.82 c 203.727 142.527 l 201.863 142.527
 l 201.863 142.82 l 202.051 142.82 202.207 142.832 202.328 142.859 c 202.449
 142.89 202.508 142.961 202.508 143.078 c 202.508 145.355 l 202.508 145.465
 202.504 145.547 202.488 145.601 c 202.48 145.656 202.453 145.699 202.41
 145.73 c 202.367 145.762 202.293 145.785 202.191 145.801 c 200.797 145.801
 l 200.797 143.078 l 200.797 142.961 200.859 142.89 200.984 142.859 c 201.109
 142.832 201.262 142.82 201.441 142.82 c 201.441 142.527 l 199.582 142.527
 l f
205.863 142.433 m 205.527 142.433 205.219 142.519 204.941 142.699 c 204.664
 142.871 204.445 143.109 204.285 143.402 c 204.125 143.695 204.047 144.008
 204.047 144.332 c 204.047 144.664 204.117 144.972 204.262 145.262 c 204.406
 145.551 204.609 145.785 204.871 145.965 c 205.133 146.144 205.422 146.234
 205.742 146.234 c 206 146.234 206.223 146.191 206.406 146.105 c 206.59 
146.019 206.742 145.902 206.863 145.75 c 206.984 145.597 207.074 145.418
 207.137 145.215 c 207.199 145.012 207.23 144.789 207.23 144.547 c 207.23
 144.476 207.203 144.441 207.148 144.441 c 204.758 144.441 l 204.758 144.347
 l 204.758 143.89 204.852 143.5 205.035 143.172 c 205.219 142.844 205.523
 142.68 205.941 142.68 c 206.105 142.68 206.262 142.719 206.406 142.789 
c 206.551 142.863 206.676 142.969 206.781 143.101 c 206.887 143.234 206.957
 143.379 206.996 143.535 c 207.004 143.551 207.016 143.566 207.027 143.582
 c 207.039 143.597 207.055 143.605 207.078 143.605 c 207.148 143.605 l 207.203
 143.605 207.23 143.57 207.23 143.5 c 207.152 143.187 206.984 142.933 206.727
 142.73 c 206.469 142.531 206.18 142.433 205.863 142.433 c h
204.773 144.64 m 206.645 144.64 l 206.645 144.851 206.617 145.062 206.563
 145.273 c 206.508 145.484 206.414 145.66 206.277 145.801 c 206.141 145.941
 205.961 146.012 205.742 146.012 c 205.43 146.012 205.191 145.867 205.023
 145.574 c 204.855 145.281 204.773 144.969 204.773 144.64 c f
209.379 142.433 m 209.051 142.433 208.754 142.519 208.488 142.699 c 208.223
 142.871 208.016 143.105 207.863 143.394 c 207.711 143.683 207.633 143.988
 207.633 144.312 c 207.633 144.648 207.715 144.957 207.879 145.242 c 208.043
 145.531 208.266 145.758 208.543 145.926 c 208.82 146.094 209.125 146.176
 209.461 146.176 c 209.664 146.176 209.855 146.133 210.035 146.047 c 210.215
 145.961 210.371 145.844 210.504 145.695 c 210.504 147.422 l 210.504 147.57
 210.484 147.676 210.441 147.738 c 210.398 147.801 210.336 147.84 210.254
 147.855 c 210.172 147.871 210.039 147.879 209.859 147.879 c 209.859 148.172
 l 211.09 148.254 l 211.09 143.277 l 211.09 143.129 211.113 143.023 211.156
 142.961 c 211.195 142.898 211.258 142.859 211.34 142.844 c 211.422 142.828
 211.551 142.82 211.723 142.82 c 211.723 142.527 l 210.48 142.433 l 210.48
 142.949 l 210.34 142.785 210.172 142.656 209.977 142.566 c 209.781 142.476
 209.582 142.433 209.379 142.433 c h
208.535 143.242 m 208.629 143.062 208.754 142.922 208.91 142.816 c 209.066
 142.707 209.238 142.656 209.426 142.656 c 209.652 142.656 209.863 142.722
 210.051 142.851 c 210.246 142.98 210.387 143.148 210.48 143.359 c 210.48
 145.344 l 210.418 145.461 210.336 145.57 210.242 145.668 c 210.145 145.765
 210.031 145.84 209.906 145.89 c 209.781 145.941 209.652 145.965 209.52 
145.965 c 209.23 145.965 209 145.883 208.824 145.719 c 208.648 145.555 208.527
 145.347 208.461 145.097 c 208.395 144.847 208.359 144.582 208.359 144.301
 c 208.359 144.078 208.371 143.89 208.391 143.722 c 208.41 143.558 208.457
 143.398 208.535 143.242 c f
0 0 1 rg
q 0.997899 0 0 -1 0 178.784988 cm
162.008 31.332 m 162.008 37.34 l 159.002 34.336 m 165.011 34.336 l 159.883
 32.211 m 164.13 36.461 l 159.883 36.461 m 164.13 32.211 l S Q
0 g
179.227 132.238 m 179.227 132.531 l 179.789 132.531 180.07 132.691 180.07
 133.012 c 180.07 137.332 l 180.07 137.504 179.789 137.59 179.227 137.59
 c 179.227 137.883 l 180.785 137.883 l 180.848 137.883 180.891 137.851 180.914
 137.789 c 182.707 133.117 l 184.512 137.789 l 184.535 137.851 184.578 137.883
 184.637 137.883 c 186.195 137.883 l 186.195 137.59 l 185.633 137.59 185.355
 137.504 185.355 137.332 c 185.355 132.789 l 185.355 132.617 185.633 132.531
 186.195 132.531 c 186.195 132.238 l 183.797 132.238 l 183.797 132.531 l
 184.367 132.531 184.652 132.617 184.652 132.789 c 184.652 137.601 l 182.625
 132.332 l 182.594 132.269 182.547 132.238 182.484 132.238 c 182.414 132.238
 182.367 132.269 182.344 132.332 c 180.34 137.531 l 180.34 133.012 l 180.34
 132.691 180.621 132.531 181.184 132.531 c 181.184 132.238 l 179.227 132.238
 l f
188.316 132.144 m 187.98 132.144 187.672 132.23 187.395 132.406 c 187.117
 132.582 186.898 132.816 186.738 133.113 c 186.578 133.406 186.5 133.715
 186.5 134.047 c 186.5 134.375 186.57 134.683 186.715 134.972 c 186.859 
135.262 187.063 135.496 187.324 135.676 c 187.586 135.855 187.875 135.945
 188.195 135.945 c 188.453 135.945 188.676 135.902 188.859 135.816 c 189.043
 135.73 189.195 135.613 189.316 135.457 c 189.438 135.308 189.527 135.129
 189.59 134.926 c 189.652 134.722 189.684 134.5 189.684 134.258 c 189.684
 134.187 189.656 134.152 189.602 134.152 c 187.211 134.152 l 187.211 134.058
 l 187.211 133.601 187.305 133.211 187.488 132.883 c 187.672 132.555 187.973
 132.39 188.398 132.39 c 188.563 132.39 188.715 132.426 188.859 132.504 
c 189.004 132.574 189.129 132.68 189.234 132.812 c 189.34 132.945 189.41
 133.09 189.449 133.246 c 189.457 133.262 189.469 133.277 189.48 133.293
 c 189.492 133.308 189.508 133.316 189.531 133.316 c 189.602 133.316 l 189.656
 133.316 189.684 133.281 189.684 133.211 c 189.605 132.898 189.438 132.64
 189.18 132.441 c 188.922 132.242 188.633 132.144 188.316 132.144 c h
187.223 134.351 m 189.098 134.351 l 189.098 134.562 189.07 134.773 189.02
 134.984 c 188.961 135.195 188.867 135.371 188.73 135.512 c 188.594 135.652
 188.414 135.722 188.195 135.722 c 187.883 135.722 187.645 135.578 187.477
 135.281 c 187.309 134.988 187.223 134.68 187.223 134.351 c f
190.148 133.047 m 190.148 133.375 190.277 133.644 190.531 133.851 c 190.789
 134.058 191.102 134.203 191.465 134.285 c 191.828 134.367 192.168 134.41
 192.488 134.41 c 192.488 134.75 l 192.488 134.906 192.453 135.058 192.383
 135.215 c 192.313 135.363 192.215 135.488 192.086 135.582 c 191.957 135.676
 191.809 135.722 191.645 135.722 c 191.285 135.722 191.008 135.64 190.816
 135.476 c 190.922 135.476 191.012 135.437 191.078 135.359 c 191.145 135.281
 191.176 135.187 191.176 135.078 c 191.176 134.969 191.137 134.875 191.059
 134.797 c 190.98 134.719 190.891 134.68 190.789 134.68 c 190.672 134.68
 190.574 134.719 190.496 134.797 c 190.418 134.875 190.379 134.969 190.379
 135.078 c 190.379 135.367 190.512 135.582 190.777 135.73 c 191.043 135.875
 191.332 135.945 191.645 135.945 c 191.871 135.945 192.098 135.898 192.324
 135.801 c 192.551 135.703 192.734 135.566 192.875 135.39 c 193.016 135.215
 193.086 135.008 193.086 134.773 c 193.086 132.906 l 193.086 132.797 193.109
 132.695 193.156 132.605 c 193.203 132.515 193.277 132.472 193.379 132.472
 c 193.465 132.472 193.531 132.519 193.578 132.613 c 193.625 132.707 193.648
 132.805 193.648 132.906 c 193.648 133.433 l 193.883 133.433 l 193.883 132.906
 l 193.883 132.781 193.852 132.664 193.789 132.555 c 193.727 132.445 193.641
 132.355 193.531 132.289 c 193.422 132.222 193.305 132.191 193.18 132.191
 c 193.016 132.191 192.875 132.254 192.758 132.379 c 192.641 132.504 192.574
 132.652 192.559 132.824 c 192.457 132.613 192.309 132.445 192.113 132.324
 c 191.918 132.203 191.707 132.144 191.48 132.144 c 191.27 132.144 191.063
 132.176 190.859 132.238 c 190.656 132.301 190.488 132.398 190.352 132.531
 c 190.215 132.664 190.148 132.836 190.148 133.047 c h
190.816 133.047 m 190.816 132.851 190.887 132.687 191.031 132.558 c 191.176
 132.43 191.34 132.367 191.527 132.367 c 191.707 132.367 191.871 132.41 
192.016 132.496 c 192.16 132.582 192.273 132.703 192.359 132.859 c 192.445
 133.015 192.488 133.176 192.488 133.34 c 192.488 134.195 l 192.238 134.195
 191.984 134.156 191.723 134.074 c 191.461 133.992 191.242 133.863 191.07
 133.691 c 190.898 133.519 190.816 133.305 190.816 133.047 c f
194.063 132.238 m 194.063 132.531 l 194.25 132.531 194.402 132.543 194.523
 132.57 c 194.645 132.597 194.707 132.672 194.707 132.789 c 194.707 135.043
 l 194.707 135.191 194.684 135.301 194.641 135.363 c 194.598 135.433 194.535
 135.472 194.449 135.488 c 194.363 135.504 194.234 135.512 194.063 135.512
 c 194.063 135.805 l 195.258 135.887 l 195.258 135.078 l 195.367 135.32 
195.531 135.515 195.75 135.664 c 195.969 135.812 196.203 135.887 196.453
 135.887 c 196.836 135.887 197.121 135.797 197.313 135.613 c 197.504 135.43
 197.598 135.148 197.598 134.773 c 197.598 132.789 l 197.598 132.672 197.66
 132.597 197.781 132.57 c 197.902 132.543 198.055 132.531 198.242 132.531
 c 198.242 132.238 l 196.359 132.238 l 196.359 132.531 l 196.547 132.531
 196.699 132.543 196.82 132.57 c 196.941 132.597 197.004 132.672 197.004
 132.789 c 197.004 134.75 l 197.004 135.023 196.961 135.246 196.887 135.418
 c 196.805 135.59 196.648 135.676 196.406 135.676 c 196.086 135.676 195.824
 135.551 195.621 135.297 c 195.418 135.039 195.316 134.75 195.316 134.422
 c 195.316 132.789 l 195.316 132.672 195.375 132.597 195.492 132.57 c 195.609
 132.543 195.762 132.531 195.949 132.531 c 195.949 132.238 l 194.063 132.238
 l f
0 0 1 rg
1.252243 w
2 j
[ 7.511979 4.507187] 0 d
q 0.997899 0 0 -1 0 178.784988 cm
146.961 44.625 m 177.056 44.625 l S Q
0.14902 g
0.501049 w
0 j
[] 0.0 d
q 0.997899 0 0 -1 0 178.784988 cm
143.951 27.836 71.365 23.289 re S Q
1 g
33.734 84.887 182.156 -54.84 re f
0.87451 g
1 j
q 0.997899 0 0 -1 0 178.784988 cm
45.212 148.738 m 45.212 93.902 l S Q
q 0.997899 0 0 -1 0 178.784988 cm
68.03 148.738 m 68.03 93.902 l S Q
q 0.997899 0 0 -1 0 178.784988 cm
90.847 148.738 m 90.847 93.902 l S Q
q 0.997899 0 0 -1 0 178.784988 cm
113.665 148.738 m 113.665 93.902 l S Q
q 0.997899 0 0 -1 0 178.784988 cm
136.482 148.738 m 136.482 93.902 l S Q
q 0.997899 0 0 -1 0 178.784988 cm
159.299 148.738 m 159.299 93.902 l S Q
q 0.997899 0 0 -1 0 178.784988 cm
182.121 148.738 m 182.121 93.902 l S Q
q 0.997899 0 0 -1 0 178.784988 cm
204.938 148.738 m 204.938 93.902 l S Q
0.776471 g
2 j
[ 0.751198 2.253594] 0 d
q 0.997899 0 0 -1 0 178.784988 cm
216.345 145.082 m 33.805 145.082 l S Q
[ 0.751198 2.253594] 0 d
q 0.997899 0 0 -1 0 178.784988 cm
216.345 141.426 m 33.805 141.426 l S Q
[ 0.751198 2.253594] 0 d
q 0.997899 0 0 -1 0 178.784988 cm
216.345 137.77 m 33.805 137.77 l S Q
[ 0.751198 2.253594] 0 d
q 0.997899 0 0 -1 0 178.784988 cm
216.345 134.113 m 33.805 134.113 l S Q
[ 0.751198 2.253594] 0 d
q 0.997899 0 0 -1 0 178.784988 cm
216.345 126.805 m 33.805 126.805 l S Q
[ 0.751198 2.253594] 0 d
q 0.997899 0 0 -1 0 178.784988 cm
216.345 123.148 m 33.805 123.148 l S Q
[ 0.751198 2.253594] 0 d
q 0.997899 0 0 -1 0 178.784988 cm
216.345 119.492 m 33.805 119.492 l S Q
[ 0.751198 2.253594] 0 d
q 0.997899 0 0 -1 0 178.784988 cm
216.345 115.836 m 33.805 115.836 l S Q
[ 0.751198 2.253594] 0 d
q 0.997899 0 0 -1 0 178.784988 cm
216.345 108.523 m 33.805 108.523 l S Q
[ 0.751198 2.253594] 0 d
q 0.997899 0 0 -1 0 178.784988 cm
216.345 104.867 m 33.805 104.867 l S Q
[ 0.751198 2.253594] 0 d
q 0.997899 0 0 -1 0 178.784988 cm
216.345 101.211 m 33.805 101.211 l S Q
[ 0.751198 2.253594] 0 d
q 0.997899 0 0 -1 0 178.784988 cm
216.345 97.559 m 33.805 97.559 l S Q
[ 0.751198 2.253594] 0 d
q 0.997899 0 0 -1 0 178.784988 cm
216.345 93.902 m 33.805 93.902 l S Q
0.87451 g
1 j
[] 0.0 d
q 0.997899 0 0 -1 0 178.784988 cm
216.345 148.738 m 33.805 148.738 l S Q
q 0.997899 0 0 -1 0 178.784988 cm
216.345 130.457 m 33.805 130.457 l S Q
q 0.997899 0 0 -1 0 178.784988 cm
216.345 112.18 m 33.805 112.18 l S Q
0.14902 g
2 J
q 0.997899 0 0 -1 0 178.784988 cm
33.805 148.738 m 216.345 148.738 l S Q
q 0.997899 0 0 -1 0 178.784988 cm
33.805 93.902 m 216.345 93.902 l S Q
q 0.997899 0 0 -1 0 178.784988 cm
45.212 148.738 m 45.212 146.914 l S Q
q 0.997899 0 0 -1 0 178.784988 cm
68.03 148.738 m 68.03 146.914 l S Q
q 0.997899 0 0 -1 0 178.784988 cm
90.847 148.738 m 90.847 146.914 l S Q
q 0.997899 0 0 -1 0 178.784988 cm
113.665 148.738 m 113.665 146.914 l S Q
q 0.997899 0 0 -1 0 178.784988 cm
136.482 148.738 m 136.482 146.914 l S Q
q 0.997899 0 0 -1 0 178.784988 cm
159.299 148.738 m 159.299 146.914 l S Q
q 0.997899 0 0 -1 0 178.784988 cm
182.121 148.738 m 182.121 146.914 l S Q
q 0.997899 0 0 -1 0 178.784988 cm
204.938 148.738 m 204.938 146.914 l S Q
q 0.997899 0 0 -1 0 178.784988 cm
45.212 93.902 m 45.212 95.727 l S Q
q 0.997899 0 0 -1 0 178.784988 cm
68.03 93.902 m 68.03 95.727 l S Q
q 0.997899 0 0 -1 0 178.784988 cm
90.847 93.902 m 90.847 95.727 l S Q
q 0.997899 0 0 -1 0 178.784988 cm
113.665 93.902 m 113.665 95.727 l S Q
q 0.997899 0 0 -1 0 178.784988 cm
136.482 93.902 m 136.482 95.727 l S Q
q 0.997899 0 0 -1 0 178.784988 cm
159.299 93.902 m 159.299 95.727 l S Q
q 0.997899 0 0 -1 0 178.784988 cm
182.121 93.902 m 182.121 95.727 l S Q
q 0.997899 0 0 -1 0 178.784988 cm
204.938 93.902 m 204.938 95.727 l S Q
43.879 21.715 m 43.879 22.008 l 44.566 22.008 44.91 22.094 44.91 22.265
 c 44.91 26.609 l 44.629 26.469 44.27 26.398 43.832 26.398 c 43.832 26.691
 l 44.504 26.691 45.012 26.867 45.355 27.219 c 45.473 27.219 l 45.496 27.219
 45.516 27.211 45.531 27.195 c 45.547 27.18 45.555 27.164 45.555 27.148 
c 45.555 22.265 l 45.555 22.094 45.898 22.008 46.586 22.008 c 46.586 21.715
 l 43.879 21.715 l f
66.297 21.715 m 66.297 21.937 l 66.297 21.953 66.301 21.969 66.309 21.984
 c 67.598 23.406 l 67.793 23.617 67.949 23.793 68.066 23.933 c 68.184 24.074
 68.305 24.234 68.426 24.422 c 68.547 24.605 68.641 24.793 68.707 24.988
 c 68.773 25.183 68.805 25.387 68.805 25.601 c 68.805 25.828 68.766 26.043
 68.684 26.25 c 68.602 26.457 68.477 26.621 68.313 26.742 c 68.148 26.867
 67.949 26.926 67.715 26.926 c 67.473 26.926 67.258 26.855 67.066 26.707
 c 66.875 26.562 66.738 26.379 66.66 26.152 c 66.684 26.16 66.715 26.164
 66.754 26.164 c 66.879 26.164 66.984 26.121 67.07 26.039 c 67.156 25.957
 67.199 25.851 67.199 25.719 c 67.199 25.594 67.156 25.484 67.07 25.394 
c 66.984 25.305 66.879 25.258 66.754 25.258 c 66.621 25.258 66.512 25.305
 66.426 25.394 c 66.34 25.484 66.297 25.594 66.297 25.719 c 66.297 25.922
 66.336 26.113 66.414 26.297 c 66.492 26.48 66.605 26.644 66.75 26.785 c
 66.895 26.926 67.059 27.035 67.246 27.109 c 67.434 27.183 67.629 27.219
 67.832 27.219 c 68.145 27.219 68.438 27.152 68.711 27.019 c 68.984 26.887
 69.199 26.699 69.355 26.457 c 69.512 26.215 69.59 25.93 69.59 25.601 c 
69.59 25.359 69.535 25.129 69.43 24.914 c 69.328 24.699 69.195 24.504 69.035
 24.328 c 68.875 24.148 68.664 23.949 68.406 23.726 c 68.148 23.504 67.98
 23.359 67.902 23.289 c 66.965 22.383 l 67.762 22.383 l 68.152 22.383 68.48
 22.387 68.742 22.394 c 69.004 22.402 69.141 22.414 69.156 22.43 c 69.219
 22.492 69.285 22.742 69.355 23.183 c 69.59 23.183 l 69.355 21.715 l 66.297
 21.715 l f
89.441 22.347 m 89.574 22.16 89.75 22.023 89.965 21.933 c 90.18 21.84 90.41
 21.797 90.66 21.797 c 90.98 21.797 91.207 21.933 91.34 22.207 c 91.473 
22.48 91.539 22.789 91.539 23.137 c 91.539 23.293 91.527 23.449 91.5 23.605
 c 91.473 23.762 91.426 23.906 91.359 24.039 c 91.293 24.172 91.199 24.277
 91.082 24.359 c 90.965 24.445 90.824 24.484 90.66 24.484 c 90.109 24.484
 l 90.063 24.484 90.039 24.508 90.039 24.555 c 90.039 24.637 l 90.039 24.676
 90.063 24.695 90.109 24.695 c 90.566 24.73 l 90.754 24.73 90.914 24.805
 91.043 24.949 c 91.172 25.094 91.266 25.269 91.324 25.484 c 91.383 25.695
 91.41 25.894 91.41 26.082 c 91.41 26.34 91.352 26.555 91.23 26.726 c 91.109
 26.898 90.918 26.984 90.66 26.984 c 90.449 26.984 90.25 26.945 90.063 26.863
 c 89.875 26.781 89.723 26.66 89.605 26.504 c 89.621 26.504 89.633 26.504
 89.641 26.504 c 89.648 26.504 89.656 26.504 89.664 26.504 c 89.789 26.504
 89.895 26.461 89.977 26.375 c 90.059 26.289 90.098 26.187 90.098 26.07 
c 90.098 25.953 90.059 25.851 89.977 25.765 c 89.895 25.68 89.789 25.637
 89.664 25.637 c 89.539 25.637 89.434 25.68 89.348 25.765 c 89.262 25.851
 89.219 25.953 89.219 26.07 c 89.219 26.305 89.293 26.508 89.438 26.683 
c 89.582 26.863 89.766 26.996 89.988 27.086 c 90.211 27.176 90.434 27.219
 90.66 27.219 c 90.832 27.219 91.012 27.195 91.195 27.144 c 91.379 27.094
 91.543 27.019 91.691 26.926 c 91.84 26.832 91.965 26.715 92.059 26.566 
c 92.16 26.422 92.207 26.262 92.207 26.082 c 92.207 25.847 92.156 25.633
 92.051 25.433 c 91.945 25.238 91.801 25.07 91.621 24.926 c 91.441 24.781
 91.246 24.672 91.035 24.601 c 91.27 24.562 91.496 24.476 91.711 24.34 c
 91.926 24.203 92.098 24.027 92.23 23.82 c 92.363 23.613 92.43 23.39 92.43
 23.148 c 92.43 22.84 92.348 22.566 92.18 22.32 c 92.012 22.074 91.793 21.883
 91.523 21.742 c 91.254 21.605 90.965 21.539 90.66 21.539 c 90.402 21.539
 90.145 21.586 89.887 21.683 c 89.629 21.781 89.418 21.93 89.254 22.125 
c 89.094 22.32 89.012 22.555 89.012 22.828 c 89.012 22.961 89.055 23.078
 89.145 23.172 c 89.234 23.265 89.344 23.312 89.477 23.312 c 89.574 23.312
 89.656 23.289 89.73 23.246 c 89.805 23.203 89.859 23.144 89.902 23.07 c
 89.938 22.996 89.957 22.914 89.957 22.828 c 89.957 22.695 89.91 22.582 
89.816 22.488 c 89.723 22.394 89.609 22.347 89.477 22.347 c 89.441 22.347
 l f
111.664 23.078 m 111.664 23.371 l 114.203 27.172 l 114.227 27.203 114.254
 27.219 114.285 27.219 c 114.414 27.219 l 114.477 27.219 114.508 27.187 
114.508 27.125 c 114.508 23.371 l 115.316 23.371 l 115.316 23.078 l 114.508
 23.078 l 114.508 22.265 l 114.508 22.156 114.59 22.086 114.75 22.055 c 
114.91 22.023 115.094 22.008 115.305 22.008 c 115.305 21.715 l 113.031 21.715
 l 113.031 22.008 l 113.242 22.008 113.43 22.023 113.594 22.055 c 113.758
 22.086 113.84 22.156 113.84 22.265 c 113.84 23.078 l h
111.934 23.371 m 113.887 23.371 l 113.887 26.293 l h
111.934 23.371 m f
134.91 22.652 m 134.969 22.488 135.055 22.344 135.172 22.215 c 135.285 
22.086 135.426 21.984 135.586 21.91 c 135.746 21.832 135.91 21.797 136.086
 21.797 c 136.48 21.797 136.758 21.953 136.91 22.262 c 137.063 22.57 137.137
 22.945 137.137 23.383 c 137.137 23.578 137.133 23.738 137.125 23.867 c 
137.117 23.996 137.098 24.125 137.066 24.25 c 137.02 24.437 136.934 24.605
 136.805 24.75 c 136.676 24.894 136.516 24.965 136.328 24.965 c 136.141 
24.965 135.98 24.937 135.848 24.883 c 135.715 24.828 135.609 24.765 135.527
 24.691 c 135.445 24.617 135.371 24.535 135.313 24.449 c 135.246 24.363 
135.211 24.32 135.191 24.32 c 135.098 24.32 l 135.086 24.32 135.066 24.328
 135.047 24.344 c 135.027 24.359 135.02 24.375 135.02 24.39 c 135.02 27.148
 l 135.02 27.164 135.023 27.18 135.039 27.195 c 135.059 27.211 135.074 27.219
 135.098 27.219 c 135.121 27.219 l 135.488 27.039 135.879 26.949 136.293
 26.949 c 136.707 26.949 137.102 27.039 137.477 27.219 c 137.5 27.219 l 
137.523 27.219 137.543 27.211 137.559 27.195 c 137.574 27.18 137.582 27.164
 137.582 27.148 c 137.582 27.078 l 137.582 27.047 137.574 27.031 137.559
 27.031 c 137.371 26.781 137.137 26.586 136.855 26.449 c 136.574 26.312 
136.281 26.246 135.977 26.246 c 135.758 26.246 135.531 26.277 135.301 26.34
 c 135.301 24.777 l 135.484 24.918 135.648 25.023 135.789 25.09 c 135.93
 25.156 136.113 25.187 136.34 25.187 c 136.645 25.187 136.918 25.101 137.156
 24.926 c 137.395 24.75 137.578 24.519 137.707 24.238 c 137.836 23.957 137.898
 23.672 137.898 23.383 c 137.898 23.047 137.82 22.734 137.66 22.453 c 137.5
 22.172 137.277 21.949 136.996 21.785 c 136.715 21.621 136.41 21.539 136.086
 21.539 c 135.816 21.539 135.57 21.605 135.34 21.742 c 135.109 21.883 134.93
 22.07 134.801 22.308 c 134.672 22.547 134.605 22.797 134.605 23.066 c 134.605
 23.191 134.648 23.293 134.73 23.371 c 134.813 23.449 134.91 23.488 135.031
 23.488 c 135.156 23.488 135.258 23.445 135.34 23.363 c 135.422 23.281 135.465
 23.183 135.465 23.066 c 135.465 22.949 135.422 22.847 135.34 22.765 c 135.258
 22.683 135.156 22.64 135.031 22.64 c 135.016 22.64 134.992 22.644 134.973
 22.648 c 134.949 22.652 134.93 22.652 134.91 22.652 c f
159.027 21.539 m 158.688 21.539 158.398 21.629 158.176 21.808 c 157.949
 21.988 157.773 22.222 157.648 22.512 c 157.523 22.801 157.438 23.105 157.391
 23.422 c 157.344 23.738 157.32 24.062 157.32 24.39 c 157.32 24.82 157.402
 25.254 157.57 25.695 c 157.738 26.133 157.988 26.496 158.313 26.785 c 158.641
 27.074 159.031 27.219 159.484 27.219 c 159.672 27.219 159.848 27.183 160.012
 27.113 c 160.176 27.043 160.305 26.937 160.395 26.797 c 160.484 26.656 
160.527 26.488 160.527 26.293 c 160.527 26.183 160.492 26.09 160.418 26.012
 c 160.344 25.933 160.246 25.894 160.129 25.894 c 160.02 25.894 159.93 25.933
 159.855 26.012 c 159.781 26.09 159.742 26.183 159.742 26.293 c 159.742 
26.402 159.781 26.496 159.855 26.574 c 159.93 26.652 160.02 26.691 160.129
 26.691 c 160.176 26.691 l 160.105 26.793 160.008 26.867 159.879 26.914 
c 159.75 26.961 159.617 26.984 159.484 26.984 c 159.32 26.984 159.168 26.949
 159.023 26.875 c 158.879 26.801 158.754 26.699 158.645 26.574 c 158.531
 26.449 158.438 26.312 158.363 26.164 c 158.281 26.015 158.227 25.844 158.188
 25.652 c 158.145 25.461 158.121 25.281 158.109 25.117 c 158.098 24.953 
158.094 24.746 158.094 24.496 c 158.188 24.715 158.32 24.898 158.504 25.043
 c 158.684 25.187 158.883 25.258 159.098 25.258 c 159.34 25.258 159.563 
25.211 159.766 25.113 c 159.969 25.015 160.145 24.879 160.289 24.703 c 160.434
 24.527 160.543 24.324 160.621 24.097 c 160.699 23.871 160.738 23.64 160.738
 23.406 c 160.738 23.082 160.668 22.777 160.523 22.488 c 160.379 22.199 
160.176 21.969 159.914 21.797 c 159.652 21.625 159.355 21.539 159.027 21.539
 c h
159.027 21.797 m 159.238 21.797 159.41 21.844 159.539 21.945 c 159.668 
22.043 159.762 22.172 159.824 22.332 c 159.887 22.492 159.926 22.652 159.938
 22.812 c 159.949 22.972 159.953 23.172 159.953 23.406 c 159.953 23.719 
159.941 23.984 159.914 24.207 c 159.887 24.433 159.805 24.629 159.672 24.797
 c 159.539 24.965 159.34 25.047 159.063 25.047 c 158.848 25.047 158.664 
24.972 158.52 24.82 c 158.375 24.668 158.27 24.476 158.203 24.242 c 158.137
 24.012 158.105 23.793 158.105 23.582 c 158.105 23.512 158.109 23.457 158.117
 23.418 c 158.117 23.41 158.117 23.402 158.117 23.398 c 158.117 23.394 158.113
 23.39 158.105 23.383 c 158.105 23.14 158.129 22.898 158.18 22.66 c 158.23
 22.422 158.324 22.219 158.461 22.051 c 158.598 21.879 158.785 21.797 159.027
 21.797 c f
181.164 21.926 m 181.164 22.23 181.195 22.531 181.246 22.824 c 181.305 
23.117 181.383 23.41 181.488 23.699 c 181.594 23.988 181.719 24.269 181.863
 24.543 c 182.008 24.816 182.164 25.074 182.34 25.316 c 183.098 26.363 l
 182.148 26.363 l 181.176 26.363 180.672 26.351 180.641 26.328 c 180.57 
26.242 180.504 25.988 180.441 25.566 c 180.203 25.566 l 180.477 27.301 l
 180.711 27.301 l 180.711 27.277 l 180.711 27.176 180.879 27.109 181.215
 27.078 c 181.551 27.047 181.879 27.031 182.195 27.031 c 183.73 27.031 l
 183.73 26.82 l 183.73 26.82 183.73 26.82 183.73 26.816 c 183.73 26.812 
183.73 26.805 183.73 26.797 c 182.594 25.199 l 182.313 24.785 182.137 24.328
 182.066 23.82 c 181.996 23.316 181.965 22.683 181.965 21.926 c 181.965 
21.816 181.926 21.726 181.848 21.648 c 181.77 21.574 181.676 21.539 181.563
 21.539 c 181.453 21.539 181.359 21.574 181.285 21.648 c 181.203 21.726 
181.164 21.816 181.164 21.926 c f
202.859 22.972 m 202.859 23.301 202.965 23.59 203.18 23.844 c 203.395 24.097
 203.676 24.312 204.02 24.484 c 203.715 24.683 l 203.527 24.801 203.371 
24.965 203.25 25.172 c 203.129 25.379 203.07 25.597 203.07 25.824 c 203.07
 26.09 203.141 26.328 203.281 26.539 c 203.422 26.75 203.605 26.918 203.836
 27.039 c 204.066 27.16 204.313 27.219 204.566 27.219 c 204.813 27.219 205.047
 27.168 205.27 27.066 c 205.496 26.965 205.684 26.824 205.836 26.64 c 205.98
 26.453 206.055 26.234 206.055 25.976 c 206.055 25.797 206.012 25.625 205.926
 25.465 c 205.84 25.305 205.723 25.16 205.57 25.035 c 205.418 24.91 205.258
 24.801 205.086 24.707 c 205.551 24.414 l 205.77 24.265 205.945 24.074 206.078
 23.844 c 206.215 23.613 206.277 23.375 206.277 23.125 c 206.277 22.816 
206.199 22.543 206.039 22.301 c 205.879 22.058 205.664 21.871 205.398 21.738
 c 205.133 21.605 204.855 21.539 204.566 21.539 c 204.289 21.539 204.016
 21.594 203.75 21.707 c 203.484 21.824 203.27 21.988 203.105 22.207 c 202.941
 22.426 202.859 22.68 202.859 22.972 c h
203.305 22.972 m 203.305 22.75 203.363 22.551 203.48 22.371 c 203.598 22.191
 203.754 22.051 203.953 21.949 c 204.152 21.847 204.355 21.797 204.566 21.797
 c 204.891 21.797 205.18 21.89 205.441 22.078 c 205.703 22.265 205.836 22.512
 205.836 22.816 c 205.836 22.93 205.813 23.035 205.77 23.137 c 205.727 23.238
 205.668 23.332 205.594 23.418 c 205.52 23.504 205.434 23.574 205.344 23.629
 c 204.242 24.344 l 204.07 24.25 203.91 24.133 203.766 23.992 c 203.621 
23.851 203.508 23.695 203.426 23.523 c 203.344 23.351 203.305 23.168 203.305
 22.972 c h
203.867 25.492 m 204.859 24.847 l 205.098 24.98 205.285 25.144 205.438 
25.336 c 205.586 25.527 205.656 25.742 205.656 25.976 c 205.656 26.164 205.605
 26.336 205.5 26.492 c 205.395 26.648 205.262 26.769 205.094 26.855 c 204.93
 26.941 204.754 26.984 204.559 26.984 c 204.395 26.984 204.227 26.953 204.059
 26.887 c 203.891 26.82 203.754 26.722 203.645 26.59 c 203.535 26.461 203.48
 26.312 203.48 26.14 c 203.48 25.883 203.609 25.668 203.867 25.492 c f
108.297 11.426 m 108.297 11.742 l 108.945 11.742 109.27 11.836 109.27 12.023
 c 109.27 16.976 l 109.27 17.172 108.945 17.269 108.297 17.269 c 108.297
 17.59 l 111.074 17.59 l 111.074 17.269 l 110.426 17.269 110.102 17.172 
110.102 16.976 c 110.102 12.023 l 110.102 11.836 110.426 11.742 111.074 
11.742 c 111.074 11.426 l 108.297 11.426 l f
112.152 12.508 m 112.152 14.996 l 111.414 14.996 l 111.414 15.23 l 111.805
 15.23 112.094 15.414 112.277 15.781 c 112.461 16.148 112.551 16.547 112.551
 16.976 c 112.809 16.976 l 112.809 15.312 l 114.086 15.312 l 114.086 14.996
 l 112.809 14.996 l 112.809 12.531 l 112.809 12.281 112.852 12.058 112.938
 11.871 c 113.023 11.683 113.172 11.59 113.383 11.59 c 113.594 11.59 113.746
 11.691 113.836 11.89 c 113.926 12.09 113.969 12.305 113.969 12.531 c 113.969
 13.058 l 114.227 13.058 l 114.227 12.508 l 114.227 12.32 114.191 12.133
 114.121 11.949 c 114.051 11.765 113.949 11.613 113.816 11.496 c 113.684
 11.379 113.52 11.32 113.324 11.32 c 112.965 11.32 112.68 11.43 112.469 
11.648 c 112.258 11.867 112.152 12.152 112.152 12.508 c f
116.898 11.32 m 116.531 11.32 116.195 11.418 115.891 11.613 c 115.586 11.808
 115.348 12.066 115.172 12.387 c 114.992 12.711 114.906 13.047 114.906 13.398
 c 114.906 13.75 114.984 14.086 115.145 14.402 c 115.309 14.719 115.527 
14.976 115.813 15.172 c 116.098 15.367 116.418 15.465 116.77 15.465 c 117.051
 15.465 117.293 15.418 117.496 15.328 c 117.699 15.238 117.867 15.113 118
 14.949 c 118.133 14.785 118.23 14.59 118.297 14.367 c 118.363 14.144 118.398
 13.898 118.398 13.633 c 118.398 13.547 118.367 13.504 118.305 13.504 c 
115.703 13.504 l 115.703 13.41 l 115.703 12.91 115.801 12.48 116.004 12.125
 c 116.199 11.769 116.527 11.59 116.98 11.59 c 117.168 11.59 117.34 11.633
 117.496 11.715 c 117.652 11.797 117.785 11.91 117.898 12.055 c 118.012 
12.199 118.094 12.359 118.141 12.531 c 118.141 12.547 118.148 12.562 118.168
 12.582 c 118.188 12.601 118.207 12.613 118.223 12.613 c 118.305 12.613 
l 118.367 12.613 118.398 12.574 118.398 12.496 c 118.313 12.148 118.129 
11.867 117.848 11.648 c 117.566 11.43 117.25 11.32 116.898 11.32 c h
115.703 13.738 m 117.754 13.738 l 117.754 13.957 117.723 14.183 117.66 
14.418 c 117.598 14.652 117.492 14.847 117.348 15 c 117.203 15.152 117.012
 15.23 116.77 15.23 c 116.434 15.23 116.172 15.07 115.984 14.754 c 115.797
 14.437 115.703 14.097 115.703 13.738 c f
118.805 11.426 m 118.805 11.742 l 119.008 11.742 119.176 11.758 119.309
 11.789 c 119.441 11.82 119.508 11.898 119.508 12.023 c 119.508 14.488 l
 119.508 14.652 119.484 14.769 119.438 14.844 c 119.391 14.914 119.32 14.957
 119.227 14.972 c 119.133 14.988 118.992 14.996 118.805 14.996 c 118.805
 15.312 l 120.094 15.406 l 120.094 14.523 l 120.188 14.789 120.324 15.004
 120.504 15.164 c 120.684 15.324 120.898 15.406 121.156 15.406 c 121.328
 15.406 121.484 15.351 121.629 15.246 c 121.766 15.14 121.84 15.004 121.84
 14.828 c 121.84 14.722 121.801 14.629 121.727 14.547 c 121.652 14.469 121.555
 14.43 121.438 14.43 c 121.328 14.43 121.234 14.469 121.152 14.547 c 121.07
 14.629 121.027 14.722 121.027 14.828 c 121.027 14.996 121.09 15.113 121.203
 15.183 c 121.156 15.183 l 120.91 15.183 120.707 15.094 120.555 14.918 c
 120.402 14.742 120.297 14.523 120.23 14.262 c 120.172 14 120.141 13.746
 120.141 13.504 c 120.141 12.023 l 120.141 11.836 120.43 11.742 121.008 
11.742 c 121.008 11.426 l 118.805 11.426 l f
122.379 12.308 m 122.379 12.668 122.52 12.961 122.801 13.187 c 123.078 
13.414 123.418 13.574 123.813 13.664 c 124.207 13.754 124.578 13.797 124.93
 13.797 c 124.93 14.172 l 124.93 14.344 124.895 14.512 124.82 14.672 c 124.746
 14.832 124.637 14.965 124.492 15.07 c 124.348 15.176 124.188 15.23 124.02
 15.23 c 123.617 15.23 123.313 15.14 123.105 14.961 c 123.223 14.961 123.316
 14.918 123.391 14.828 c 123.465 14.742 123.504 14.64 123.504 14.523 c 123.504
 14.406 123.461 14.305 123.371 14.219 c 123.289 14.133 123.188 14.09 123.066
 14.09 c 122.953 14.09 122.852 14.133 122.766 14.219 c 122.68 14.305 122.637
 14.406 122.637 14.523 c 122.637 14.847 122.777 15.082 123.063 15.234 c 
123.348 15.387 123.664 15.465 124.02 15.465 c 124.258 15.465 124.504 15.414
 124.75 15.312 c 124.996 15.211 125.195 15.062 125.352 14.867 c 125.508 
14.672 125.586 14.441 125.586 14.183 c 125.586 12.152 l 125.586 12.035 125.613
 11.93 125.664 11.832 c 125.715 11.734 125.789 11.683 125.891 11.683 c 125.992
 11.683 126.066 11.734 126.113 11.836 c 126.16 11.937 126.184 12.043 126.184
 12.152 c 126.184 12.73 l 126.453 12.73 l 126.453 12.152 l 126.453 12.019
 126.418 11.894 126.348 11.773 c 126.277 11.652 126.184 11.555 126.063 11.48
 c 125.941 11.406 125.813 11.367 125.68 11.367 c 125.5 11.367 125.348 11.437
 125.223 11.574 c 125.098 11.711 125.027 11.871 125.012 12.058 c 124.902
 11.84 124.738 11.664 124.52 11.527 c 124.301 11.39 124.07 11.32 123.828
 11.32 c 123.598 11.32 123.367 11.355 123.152 11.426 c 122.934 11.496 122.746
 11.605 122.602 11.75 c 122.453 11.894 122.379 12.078 122.379 12.308 c h
123.105 12.308 m 123.105 12.094 123.184 11.918 123.34 11.777 c 123.492 
11.637 123.68 11.566 123.891 11.566 c 124.086 11.566 124.258 11.613 124.414
 11.707 c 124.57 11.801 124.695 11.933 124.789 12.101 c 124.883 12.269 124.93
 12.445 124.93 12.637 c 124.93 13.574 l 124.656 13.574 124.379 13.527 124.094
 13.441 c 123.809 13.347 123.57 13.207 123.387 13.015 c 123.195 12.824 123.105
 12.59 123.105 12.308 c f
127.324 12.508 m 127.324 14.996 l 126.59 14.996 l 126.59 15.23 l 126.977
 15.23 127.266 15.414 127.449 15.781 c 127.633 16.148 127.723 16.547 127.723
 16.976 c 127.98 16.976 l 127.98 15.312 l 129.258 15.312 l 129.258 14.996
 l 127.98 14.996 l 127.98 12.531 l 127.98 12.281 128.023 12.058 128.109 
11.871 c 128.195 11.683 128.344 11.59 128.555 11.59 c 128.766 11.59 128.918
 11.691 129.008 11.89 c 129.098 12.09 129.141 12.305 129.141 12.531 c 129.141
 13.058 l 129.398 13.058 l 129.398 12.508 l 129.398 12.32 129.363 12.133
 129.293 11.949 c 129.223 11.765 129.121 11.613 128.988 11.496 c 128.855
 11.379 128.691 11.32 128.496 11.32 c 128.137 11.32 127.852 11.43 127.641
 11.648 c 127.434 11.867 127.324 12.152 127.324 12.508 c f
130.113 11.426 m 130.113 11.742 l 130.316 11.742 130.484 11.758 130.617
 11.789 c 130.75 11.82 130.816 11.898 130.816 12.023 c 130.816 14.488 l 
130.816 14.726 130.773 14.867 130.684 14.918 c 130.594 14.969 130.414 14.996
 130.148 14.996 c 130.148 15.312 l 131.449 15.406 l 131.449 12.023 l 131.449
 11.898 131.508 11.82 131.617 11.789 c 131.73 11.758 131.883 11.742 132.07
 11.742 c 132.07 11.426 l h
130.488 16.953 m 130.488 17.086 130.539 17.207 130.641 17.308 c 130.742
 17.41 130.855 17.461 130.98 17.461 c 131.066 17.461 131.148 17.437 131.227
 17.394 c 131.305 17.351 131.367 17.289 131.414 17.207 c 131.461 17.125 
131.484 17.039 131.484 16.953 c 131.484 16.828 131.434 16.715 131.332 16.613
 c 131.23 16.512 131.113 16.461 130.98 16.461 c 130.855 16.461 130.742 16.512
 130.641 16.613 c 130.539 16.715 130.488 16.828 130.488 16.953 c f
134.523 11.32 m 134.164 11.32 133.832 11.414 133.523 11.597 c 133.215 11.781
 132.973 12.027 132.793 12.336 c 132.613 12.644 132.523 12.984 132.523 13.351
 c 132.523 13.625 132.574 13.89 132.676 14.144 c 132.773 14.398 132.914 
14.625 133.098 14.824 c 133.273 15.023 133.488 15.18 133.734 15.293 c 133.98
 15.406 134.242 15.465 134.523 15.465 c 134.891 15.465 135.227 15.367 135.531
 15.172 c 135.836 14.976 136.078 14.715 136.254 14.39 c 136.43 14.066 136.516
 13.719 136.516 13.351 c 136.516 12.984 136.426 12.644 136.246 12.336 c 
136.066 12.027 135.824 11.781 135.52 11.597 c 135.215 11.414 134.883 11.32
 134.523 11.32 c h
134.523 11.59 m 135.008 11.59 135.332 11.765 135.492 12.113 c 135.652 12.461
 135.73 12.906 135.73 13.445 c 135.73 13.75 135.715 14 135.684 14.195 c 
135.652 14.39 135.582 14.57 135.473 14.734 c 135.402 14.836 135.316 14.926
 135.211 15 c 135.105 15.074 134.996 15.133 134.883 15.172 c 134.77 15.211
 134.648 15.23 134.523 15.23 c 134.34 15.23 134.16 15.187 133.992 15.101
 c 133.824 15.015 133.684 14.894 133.574 14.734 c 133.461 14.562 133.387
 14.375 133.359 14.172 c 133.332 13.969 133.32 13.726 133.32 13.445 c 133.32
 13.109 133.348 12.805 133.406 12.535 c 133.465 12.265 133.582 12.039 133.758
 11.859 c 133.934 11.68 134.188 11.59 134.523 11.59 c f
136.941 11.426 m 136.941 11.742 l 137.145 11.742 137.313 11.758 137.445
 11.789 c 137.578 11.82 137.645 11.898 137.645 12.023 c 137.645 14.488 l
 137.645 14.652 137.621 14.769 137.574 14.844 c 137.527 14.914 137.461 14.957
 137.363 14.972 c 137.27 14.988 137.129 14.996 136.941 14.996 c 136.941 
15.312 l 138.242 15.406 l 138.242 14.523 l 138.367 14.785 138.547 14.996
 138.781 15.16 c 139.016 15.324 139.273 15.406 139.555 15.406 c 139.969 
15.406 140.281 15.305 140.492 15.105 c 140.703 14.906 140.809 14.601 140.809
 14.195 c 140.809 12.023 l 140.809 11.898 140.871 11.82 141.004 11.789 c
 141.129 11.758 141.301 11.742 141.512 11.742 c 141.512 11.426 l 139.449
 11.426 l 139.449 11.742 l 139.652 11.742 139.82 11.758 139.953 11.789 c
 140.086 11.82 140.152 11.898 140.152 12.023 c 140.152 14.172 l 140.152 
14.461 140.109 14.703 140.023 14.894 c 139.938 15.086 139.762 15.183 139.496
 15.183 c 139.152 15.183 138.867 15.043 138.641 14.762 c 138.414 14.476 
138.301 14.16 138.301 13.808 c 138.301 12.023 l 138.301 11.898 138.367 11.82
 138.5 11.789 c 138.633 11.758 138.801 11.742 139.004 11.742 c 139.004 11.426
 l 136.941 11.426 l f
q 0.997899 0 0 -1 0 178.784988 cm
33.805 148.738 m 33.805 93.902 l S Q
q 0.997899 0 0 -1 0 178.784988 cm
216.345 148.738 m 216.345 93.902 l S Q
q 0.997899 0 0 -1 0 178.784988 cm
33.805 148.738 m 35.63 148.738 l S Q
q 0.997899 0 0 -1 0 178.784988 cm
33.805 130.457 m 35.63 130.457 l S Q
q 0.997899 0 0 -1 0 178.784988 cm
33.805 112.18 m 35.63 112.18 l S Q
q 0.997899 0 0 -1 0 178.784988 cm
216.345 148.738 m 214.521 148.738 l S Q
q 0.997899 0 0 -1 0 178.784988 cm
216.345 130.457 m 214.521 130.457 l S Q
q 0.997899 0 0 -1 0 178.784988 cm
216.345 112.18 m 214.521 112.18 l S Q
19.344 30.168 2.18 -0.516 re f
23.977 27.949 m 23.305 27.949 22.852 28.226 22.605 28.781 c 22.367 29.336
 22.246 29.996 22.246 30.754 c 22.246 31.238 22.289 31.695 22.375 32.117
 c 22.461 32.539 22.633 32.894 22.891 33.191 c 23.148 33.484 23.512 33.629
 23.977 33.629 c 24.336 33.629 24.633 33.543 24.867 33.367 c 25.102 33.191
 25.277 32.961 25.395 32.68 c 25.512 32.398 25.594 32.097 25.641 31.773 
c 25.688 31.453 25.711 31.113 25.711 30.754 c 25.711 30.285 25.668 29.844
 25.578 29.426 c 25.488 29.012 25.316 28.664 25.063 28.379 c 24.809 28.094
 24.445 27.949 23.977 27.949 c h
23.977 28.16 m 24.281 28.16 24.512 28.316 24.664 28.629 c 24.816 28.941
 24.91 29.293 24.945 29.676 c 24.98 30.058 24.996 30.465 24.996 30.894 c
 24.996 31.308 24.98 31.691 24.945 32.039 c 24.91 32.387 24.816 32.703 24.668
 32.992 c 24.52 33.277 24.289 33.418 23.977 33.418 c 23.664 33.418 23.434
 33.277 23.285 32.992 c 23.141 32.703 23.047 32.387 23.012 32.039 c 22.977
 31.691 22.961 31.308 22.961 30.894 c 22.961 30.59 22.965 30.301 22.977 
30.027 c 22.988 29.754 23.027 29.469 23.094 29.18 c 23.16 28.89 23.266 28.648
 23.41 28.453 c 23.555 28.258 23.742 28.16 23.977 28.16 c f
26.605 28.582 m 26.605 28.707 26.652 28.812 26.746 28.898 c 26.84 28.984
 26.945 29.027 27.063 29.027 c 27.141 29.027 27.215 29.008 27.285 28.969
 c 27.355 28.93 27.41 28.875 27.449 28.801 c 27.488 28.726 27.508 28.652
 27.508 28.582 c 27.508 28.457 27.465 28.351 27.379 28.262 c 27.293 28.172
 27.188 28.125 27.063 28.125 c 26.945 28.125 26.84 28.172 26.746 28.262 
c 26.652 28.351 26.605 28.457 26.605 28.582 c f
28.922 28.758 m 29.055 28.57 29.227 28.433 29.441 28.344 c 29.656 28.25
 29.891 28.207 30.141 28.207 c 30.461 28.207 30.684 28.344 30.82 28.617 
c 30.949 28.89 31.016 29.199 31.016 29.547 c 31.016 29.703 31.004 29.859
 30.977 30.015 c 30.949 30.172 30.902 30.316 30.836 30.449 c 30.77 30.582
 30.676 30.687 30.559 30.769 c 30.445 30.855 30.305 30.894 30.141 30.894
 c 29.59 30.894 l 29.539 30.894 29.52 30.918 29.52 30.965 c 29.52 31.047
 l 29.52 31.086 29.539 31.105 29.59 31.105 c 30.047 31.14 l 30.234 31.14
 30.391 31.215 30.52 31.359 c 30.648 31.504 30.742 31.683 30.801 31.894 
c 30.859 32.105 30.891 32.305 30.891 32.492 c 30.891 32.75 30.828 32.965
 30.707 33.137 c 30.586 33.308 30.398 33.394 30.141 33.394 c 29.93 33.394
 29.73 33.355 29.543 33.273 c 29.355 33.191 29.203 33.07 29.086 32.914 c
 29.102 32.914 29.113 32.914 29.121 32.914 c 29.129 32.914 29.137 32.914
 29.145 32.914 c 29.27 32.914 29.371 32.871 29.453 32.785 c 29.535 32.699
 29.578 32.597 29.578 32.48 c 29.578 32.363 29.535 32.262 29.453 32.176 
c 29.371 32.09 29.27 32.047 29.145 32.047 c 29.02 32.047 28.914 32.09 28.828
 32.176 c 28.742 32.262 28.699 32.363 28.699 32.48 c 28.699 32.715 28.77
 32.918 28.914 33.094 c 29.059 33.273 29.242 33.406 29.465 33.496 c 29.688
 33.586 29.91 33.629 30.141 33.629 c 30.309 33.629 30.488 33.605 30.672 
33.555 c 30.855 33.504 31.023 33.43 31.168 33.336 c 31.316 33.242 31.441
 33.125 31.539 32.976 c 31.637 32.832 31.684 32.672 31.684 32.492 c 31.684
 32.258 31.633 32.043 31.527 31.844 c 31.422 31.648 31.277 31.48 31.098 
31.336 c 30.918 31.191 30.723 31.082 30.516 31.012 c 30.746 30.972 30.973
 30.887 31.188 30.75 c 31.402 30.613 31.574 30.437 31.707 30.23 c 31.84 
30.023 31.906 29.801 31.906 29.558 c 31.906 29.25 31.824 28.976 31.656 28.73
 c 31.488 28.484 31.27 28.293 31 28.152 c 30.73 28.015 30.445 27.949 30.141
 27.949 c 29.883 27.949 29.625 27.996 29.363 28.094 c 29.109 28.191 28.898
 28.34 28.734 28.535 c 28.57 28.73 28.488 28.965 28.488 29.238 c 28.488 
29.371 28.531 29.488 28.621 29.582 c 28.711 29.676 28.824 29.722 28.957 
29.722 c 29.051 29.722 29.133 29.699 29.207 29.656 c 29.281 29.613 29.34
 29.555 29.379 29.48 c 29.418 29.406 29.438 29.324 29.438 29.238 c 29.438
 29.105 29.391 28.992 29.297 28.898 c 29.203 28.805 29.09 28.758 28.957 
28.758 c 28.922 28.758 l f
19.344 48.445 2.18 -0.516 re f
23.977 46.226 m 23.305 46.226 22.852 46.508 22.605 47.062 c 22.367 47.617
 22.246 48.273 22.246 49.035 c 22.246 49.519 22.289 49.972 22.375 50.394
 c 22.461 50.816 22.633 51.176 22.891 51.469 c 23.148 51.762 23.512 51.91
 23.977 51.91 c 24.336 51.91 24.633 51.82 24.867 51.644 c 25.102 51.469 
25.277 51.238 25.395 50.957 c 25.512 50.676 25.594 50.375 25.641 50.055 
c 25.688 49.734 25.711 49.394 25.711 49.035 c 25.711 48.562 25.668 48.121
 25.578 47.707 c 25.488 47.293 25.316 46.941 25.063 46.656 c 24.809 46.371
 24.445 46.226 23.977 46.226 c h
23.977 46.437 m 24.281 46.437 24.512 46.597 24.664 46.91 c 24.816 47.222
 24.91 47.57 24.945 47.953 c 24.98 48.336 24.996 48.742 24.996 49.176 c 
24.996 49.59 24.98 49.969 24.945 50.32 c 24.91 50.668 24.816 50.984 24.668
 51.269 c 24.52 51.555 24.289 51.699 23.977 51.699 c 23.664 51.699 23.434
 51.555 23.285 51.269 c 23.141 50.984 23.047 50.668 23.012 50.32 c 22.977
 49.969 22.961 49.59 22.961 49.176 c 22.961 48.867 22.965 48.578 22.977 
48.305 c 22.988 48.031 23.027 47.75 23.094 47.461 c 23.16 47.172 23.266 
46.93 23.41 46.734 c 23.555 46.539 23.742 46.437 23.977 46.437 c f
26.605 46.863 m 26.605 46.988 26.652 47.094 26.746 47.18 c 26.84 47.265
 26.945 47.308 27.063 47.308 c 27.141 47.308 27.215 47.289 27.285 47.25 
c 27.355 47.211 27.41 47.152 27.449 47.078 c 27.488 47.004 27.508 46.933
 27.508 46.863 c 27.508 46.738 27.465 46.629 27.379 46.539 c 27.293 46.449
 27.188 46.402 27.063 46.402 c 26.945 46.402 26.84 46.449 26.746 46.539 
c 26.652 46.629 26.605 46.738 26.605 46.863 c f
28.547 46.402 m 28.547 46.629 l 28.547 46.644 28.551 46.66 28.559 46.672
 c 29.848 48.094 l 30.043 48.305 30.199 48.48 30.316 48.621 c 30.43 48.762
 30.551 48.926 30.672 49.109 c 30.793 49.293 30.887 49.484 30.953 49.68 
c 31.02 49.875 31.051 50.078 31.051 50.289 c 31.051 50.515 31.012 50.734
 30.93 50.941 c 30.848 51.148 30.723 51.312 30.559 51.433 c 30.398 51.555
 30.199 51.617 29.965 51.617 c 29.723 51.617 29.504 51.543 29.313 51.398
 c 29.121 51.254 28.988 51.066 28.91 50.84 c 28.934 50.847 28.965 50.851
 29.004 50.851 c 29.129 50.851 29.234 50.812 29.32 50.73 c 29.406 50.648
 29.449 50.539 29.449 50.406 c 29.449 50.281 29.406 50.172 29.32 50.082 
c 29.234 49.992 29.129 49.949 29.004 49.949 c 28.871 49.949 28.762 49.992
 28.676 50.082 c 28.59 50.172 28.547 50.281 28.547 50.406 c 28.547 50.609
 28.586 50.805 28.664 50.988 c 28.742 51.172 28.852 51.332 28.996 51.476
 c 29.141 51.617 29.309 51.722 29.496 51.797 c 29.68 51.871 29.879 51.91
 30.078 51.91 c 30.391 51.91 30.684 51.844 30.957 51.711 c 31.23 51.578 
31.445 51.39 31.602 51.144 c 31.758 50.902 31.836 50.617 31.836 50.289 c
 31.836 50.047 31.785 49.816 31.68 49.601 c 31.574 49.387 31.441 49.191 
31.281 49.015 c 31.121 48.84 30.91 48.64 30.652 48.418 c 30.395 48.195 30.227
 48.047 30.152 47.976 c 29.215 47.074 l 30.012 47.074 l 30.402 47.074 30.727
 47.078 30.988 47.086 c 31.25 47.094 31.387 47.105 31.402 47.121 c 31.465
 47.183 31.531 47.433 31.602 47.871 c 31.836 47.871 l 31.602 46.402 l 28.547
 46.402 l f
19.344 66.726 2.18 -0.52 re f
23.977 64.508 m 23.305 64.508 22.852 64.785 22.605 65.34 c 22.367 65.894
 22.246 66.555 22.246 67.312 c 22.246 67.797 22.289 68.25 22.375 68.676 
c 22.461 69.097 22.633 69.453 22.891 69.746 c 23.148 70.043 23.512 70.187
 23.977 70.187 c 24.336 70.187 24.633 70.101 24.867 69.926 c 25.102 69.746
 25.277 69.519 25.395 69.238 c 25.512 68.957 25.594 68.652 25.641 68.332
 c 25.688 68.012 25.711 67.672 25.711 67.312 c 25.711 66.844 25.668 66.402
 25.578 65.984 c 25.488 65.57 25.316 65.222 25.063 64.937 c 24.809 64.648
 24.445 64.508 23.977 64.508 c h
23.977 64.719 m 24.281 64.719 24.512 64.875 24.664 65.187 c 24.816 65.5
 24.91 65.847 24.945 66.234 c 24.98 66.617 24.996 67.023 24.996 67.453 c
 24.996 67.867 24.98 68.25 24.945 68.597 c 24.91 68.945 24.816 69.262 24.668
 69.547 c 24.52 69.836 24.289 69.976 23.977 69.976 c 23.664 69.976 23.434
 69.836 23.285 69.547 c 23.141 69.262 23.047 68.945 23.012 68.597 c 22.977
 68.25 22.961 67.867 22.961 67.453 c 22.961 67.148 22.965 66.859 22.977 
66.586 c 22.988 66.308 23.027 66.027 23.094 65.738 c 23.16 65.449 23.266
 65.207 23.41 65.012 c 23.555 64.816 23.742 64.719 23.977 64.719 c f
26.605 65.14 m 26.605 65.265 26.652 65.371 26.746 65.457 c 26.84 65.543
 26.945 65.586 27.063 65.586 c 27.141 65.586 27.215 65.566 27.285 65.527
 c 27.355 65.488 27.41 65.433 27.449 65.359 c 27.488 65.285 27.508 65.211
 27.508 65.14 c 27.508 65.015 27.465 64.906 27.379 64.82 c 27.293 64.726
 27.188 64.683 27.063 64.683 c 26.945 64.683 26.84 64.726 26.746 64.82 c
 26.652 64.906 26.605 65.015 26.605 65.14 c f
28.898 64.683 m 28.898 64.976 l 29.586 64.976 29.926 65.062 29.926 65.234
 c 29.926 69.578 l 29.648 69.437 29.289 69.367 28.852 69.367 c 28.852 69.66
 l 29.523 69.66 30.031 69.836 30.371 70.187 c 30.488 70.187 l 30.512 70.187
 30.531 70.18 30.547 70.164 c 30.566 70.148 30.574 70.133 30.574 70.117 
c 30.574 65.234 l 30.574 65.062 30.914 64.976 31.602 64.976 c 31.602 64.683
 l 28.898 64.683 l f
16.375 53.722 m 16.227 53.722 16.098 53.773 15.988 53.875 c 15.879 53.976
 15.824 54.097 15.824 54.238 c 15.824 54.34 15.852 54.422 15.91 54.484 c
 15.969 54.547 16.051 54.578 16.152 54.578 c 16.262 54.578 16.359 54.551
 16.445 54.492 c 16.531 54.43 16.59 54.351 16.621 54.25 c 16.676 54.414 
16.703 54.668 16.703 55.012 c 16.703 55.285 16.594 55.539 16.379 55.769 
c 16.164 56 15.922 56.152 15.648 56.222 c 14.594 56.48 l 14.922 56.152 15.086
 55.812 15.086 55.457 c 15.086 55.199 15.02 54.98 14.887 54.797 c 14.754
 54.613 14.578 54.469 14.359 54.371 c 14.141 54.273 13.906 54.226 13.656
 54.226 c 13.383 54.226 13.098 54.281 12.797 54.398 c 12.496 54.508 12.215
 54.668 11.957 54.871 c 11.699 55.074 11.496 55.308 11.344 55.574 c 11.191
 55.844 11.113 56.121 11.113 56.41 c 11.113 56.59 11.16 56.75 11.254 56.89
 c 11.348 57.031 11.477 57.14 11.641 57.219 c 11.406 57.281 11.289 57.41
 11.289 57.605 c 11.289 57.683 11.313 57.75 11.359 57.805 c 11.406 57.859
 11.465 57.887 11.535 57.887 c 11.559 57.887 11.574 57.887 11.582 57.883
 c 11.59 57.879 11.598 57.875 11.605 57.875 c 15.695 56.844 l 15.883 56.797
 16.055 56.711 16.211 56.586 c 16.367 56.461 16.496 56.312 16.602 56.14 
c 16.707 55.969 16.789 55.781 16.848 55.582 c 16.906 55.383 16.938 55.187
 16.938 55 c 16.938 54.656 16.902 54.355 16.836 54.101 c 16.77 53.847 16.617
 53.722 16.375 53.722 c h
14.852 55.48 m 14.852 55.867 14.59 56.242 14.066 56.609 c 12.098 57.113
 l 11.887 57.066 11.707 56.984 11.559 56.859 c 11.41 56.738 11.336 56.586
 11.336 56.398 c 11.336 56.195 11.418 56.004 11.582 55.828 c 11.746 55.652
 11.941 55.504 12.168 55.387 c 12.387 55.277 12.699 55.172 13.105 55.066
 c 13.512 54.961 13.832 54.906 14.066 54.906 c 14.27 54.906 14.453 54.953
 14.609 55.047 c 14.77 55.14 14.852 55.285 14.852 55.48 c f
17.566 57.644 m 17.566 57.605 17.539 57.586 17.492 57.586 c 17.406 57.601
 17.363 57.629 17.363 57.668 c 17.363 57.793 17.352 57.879 17.328 57.93 
c 17.305 57.98 17.246 58.023 17.156 58.055 c 14.449 58.722 l 14.379 58.754
 14.285 58.769 14.168 58.769 c 13.996 58.769 13.91 58.711 13.91 58.594 c
 13.91 58.469 13.984 58.379 14.133 58.32 c 14.281 58.262 14.469 58.199 14.695
 58.137 c 14.727 58.137 14.742 58.121 14.742 58.09 c 14.742 58.019 l 14.742
 58.012 14.734 58 14.719 57.992 c 14.703 57.976 14.688 57.972 14.672 57.972
 c 14.5 58.012 14.352 58.051 14.23 58.094 c 14.109 58.137 14 58.199 13.902
 58.285 c 13.805 58.367 13.758 58.472 13.758 58.605 c 13.758 58.738 13.793
 58.859 13.867 58.965 c 13.945 59.07 14.047 59.133 14.18 59.156 c 14.055
 59.265 13.953 59.39 13.875 59.523 c 13.797 59.656 13.758 59.793 13.758 
59.933 c 13.758 60.105 13.801 60.254 13.891 60.379 c 13.98 60.504 14.098
 60.597 14.242 60.66 c 14.387 60.722 14.543 60.754 14.707 60.754 c 14.965
 60.754 15.23 60.687 15.508 60.555 c 15.785 60.422 16.016 60.242 16.199 
60.015 c 16.383 59.789 16.477 59.547 16.477 59.285 c 16.477 59.168 16.441
 59.062 16.375 58.969 c 16.309 58.875 16.223 58.801 16.113 58.746 c 17.176
 58.476 l 17.238 58.469 17.277 58.461 17.281 58.453 c 17.34 58.453 17.363
 58.586 17.363 58.851 c 17.363 58.89 17.391 58.91 17.434 58.91 c 17.488 
58.902 17.527 58.894 17.543 58.883 c 17.555 58.871 17.566 58.847 17.566 
58.816 c h
16.313 59.301 m 16.313 59.43 16.254 59.558 16.141 59.68 c 16.027 59.801
 15.902 59.898 15.762 59.969 c 15.652 60.023 15.52 60.074 15.363 60.125 
c 15.207 60.176 15.039 60.219 14.863 60.254 c 14.688 60.289 14.551 60.308
 14.449 60.308 c 14.355 60.308 14.27 60.293 14.191 60.265 c 14.113 60.238
 14.047 60.199 13.992 60.144 c 13.938 60.09 13.91 60.015 13.91 59.922 c 
13.91 59.781 13.965 59.644 14.07 59.512 c 14.172 59.375 14.301 59.258 14.449
 59.156 c 14.473 59.156 l 15.797 58.828 l 15.938 58.851 16.059 58.902 16.16
 58.98 c 16.262 59.058 16.313 59.164 16.313 59.301 c f
0 0 1 rg
1.252243 w
0 J
2 j
[ 7.511979 4.507187] 0 d
q 0.997899 0 0 -1 0 178.784988 cm
45.212 116.289 m 204.938 116.289 l S Q
0.501049 w
0 j
[] 0.0 d
q 0.997899 0 0 -1 0 178.784988 cm
45.212 102.027 m 45.212 108.039 l 42.21 105.035 m 48.218 105.035 l 43.091
 102.91 m 47.338 107.156 l 43.091 107.156 m 47.338 102.91 l S Q
q 0.997899 0 0 -1 0 178.784988 cm
68.03 96.105 m 68.03 102.113 l 65.027 99.109 m 71.036 99.109 l 65.904 96.984
 m 70.155 101.234 l 65.904 101.234 m 70.155 96.984 l S Q
q 0.997899 0 0 -1 0 178.784988 cm
90.847 108.254 m 90.847 114.266 l 87.845 111.262 m 93.853 111.262 l 88.725
 109.137 m 92.973 113.383 l 88.725 113.383 m 92.973 109.137 l S Q
q 0.997899 0 0 -1 0 178.784988 cm
113.665 110.594 m 113.665 116.602 l 110.662 113.598 m 116.671 113.598 l
 111.543 111.473 m 115.79 115.723 l 111.543 115.723 m 115.79 111.473 l S Q
q 0.997899 0 0 -1 0 178.784988 cm
136.482 143.809 m 136.482 149.816 l 133.48 146.813 m 139.488 146.813 l 
134.36 144.688 m 138.608 148.938 l 134.36 148.938 m 138.608 144.688 l S Q
q 0.997899 0 0 -1 0 178.784988 cm
159.299 112.992 m 159.299 119 l 156.297 115.996 m 162.306 115.996 l 157.178
 113.871 m 161.425 118.121 l 157.178 118.121 m 161.425 113.871 l S Q
q 0.997899 0 0 -1 0 178.784988 cm
182.121 119.473 m 182.121 125.484 l 179.115 122.477 m 185.123 122.477 l
 179.995 120.352 m 184.243 124.602 l 179.995 124.602 m 184.243 120.352 l
 S Q
q 0.997899 0 0 -1 0 178.784988 cm
204.934 113.02 m 204.934 119.027 l 201.932 116.023 m 207.941 116.023 l 
202.813 113.898 m 207.06 118.148 l 202.813 118.148 m 207.06 113.898 l S Q
Q Q
showpage
%%Trailer
end restore
%%EOF
