%!PS-Adobe-3.0 EPSF-3.0
%%Creator: (MATLAB, The Mathworks, Inc. Version 9.8.0.1323502 \(R2020a\). Operating System: Windows 10)
%%Title: D:/CVUT/AcouMan/MasterThesis/figs/ident_triangle.eps
%%CreationDate: 2020-05-13T13:12:27
%%Pages: (atend)
%%BoundingBox:     0     0   477   202
%%LanguageLevel: 3
%%EndComments
%%BeginProlog
%%BeginResource: procset (Apache XML Graphics Std ProcSet) 1.2 0
%%Version: 1.2 0
%%Copyright: (Copyright 2001-2003,2010 The Apache Software Foundation. License terms: http://www.apache.org/licenses/LICENSE-2.0)
/bd{bind def}bind def
/ld{load def}bd
/GR/grestore ld
/GS/gsave ld
/RM/rmoveto ld
/C/curveto ld
/t/show ld
/L/lineto ld
/ML/setmiterlimit ld
/CT/concat ld
/f/fill ld
/N/newpath ld
/S/stroke ld
/CC/setcmykcolor ld
/A/ashow ld
/cp/closepath ld
/RC/setrgbcolor ld
/LJ/setlinejoin ld
/GC/setgray ld
/LW/setlinewidth ld
/M/moveto ld
/re {4 2 roll M
1 index 0 rlineto
0 exch rlineto
neg 0 rlineto
cp } bd
/_ctm matrix def
/_tm matrix def
/BT { _ctm currentmatrix pop matrix _tm copy pop 0 0 moveto } bd
/ET { _ctm setmatrix } bd
/iTm { _ctm setmatrix _tm concat } bd
/Tm { _tm astore pop iTm 0 0 moveto } bd
/ux 0.0 def
/uy 0.0 def
/F {
  /Tp exch def
  /Tf exch def
  Tf findfont Tp scalefont setfont
  /cf Tf def  /cs Tp def
} bd
/ULS {currentpoint /uy exch def /ux exch def} bd
/ULE {
  /Tcx currentpoint pop def
  gsave
  newpath
  cf findfont cs scalefont dup
  /FontMatrix get 0 get /Ts exch def /FontInfo get dup
  /UnderlinePosition get Ts mul /To exch def
  /UnderlineThickness get Ts mul /Tt exch def
  ux uy To add moveto  Tcx uy To add lineto
  Tt setlinewidth stroke
  grestore
} bd
/OLE {
  /Tcx currentpoint pop def
  gsave
  newpath
  cf findfont cs scalefont dup
  /FontMatrix get 0 get /Ts exch def /FontInfo get dup
  /UnderlinePosition get Ts mul /To exch def
  /UnderlineThickness get Ts mul /Tt exch def
  ux uy To add cs add moveto Tcx uy To add cs add lineto
  Tt setlinewidth stroke
  grestore
} bd
/SOE {
  /Tcx currentpoint pop def
  gsave
  newpath
  cf findfont cs scalefont dup
  /FontMatrix get 0 get /Ts exch def /FontInfo get dup
  /UnderlinePosition get Ts mul /To exch def
  /UnderlineThickness get Ts mul /Tt exch def
  ux uy To add cs 10 mul 26 idiv add moveto Tcx uy To add cs 10 mul 26 idiv add lineto
  Tt setlinewidth stroke
  grestore
} bd
/QT {
/Y22 exch store
/X22 exch store
/Y21 exch store
/X21 exch store
currentpoint
/Y21 load 2 mul add 3 div exch
/X21 load 2 mul add 3 div exch
/X21 load 2 mul /X22 load add 3 div
/Y21 load 2 mul /Y22 load add 3 div
/X22 load /Y22 load curveto
} bd
/SSPD {
dup length /d exch dict def
{
/v exch def
/k exch def
currentpagedevice k known {
/cpdv currentpagedevice k get def
v cpdv ne {
/upd false def
/nullv v type /nulltype eq def
/nullcpdv cpdv type /nulltype eq def
nullv nullcpdv or
{
/upd true def
} {
/sametype v type cpdv type eq def
sametype {
v type /arraytype eq {
/vlen v length def
/cpdvlen cpdv length def
vlen cpdvlen eq {
0 1 vlen 1 sub {
/i exch def
/obj v i get def
/cpdobj cpdv i get def
obj cpdobj ne {
/upd true def
exit
} if
} for
} {
/upd true def
} ifelse
} {
v type /dicttype eq {
v {
/dv exch def
/dk exch def
/cpddv cpdv dk get def
dv cpddv ne {
/upd true def
exit
} if
} forall
} {
/upd true def
} ifelse
} ifelse
} if
} ifelse
upd true eq {
d k v put
} if
} if
} if
} forall
d length 0 gt {
d setpagedevice
} if
} bd
/RE { % /NewFontName [NewEncodingArray] /FontName RE -
  findfont dup length dict begin
  {
    1 index /FID ne
    {def} {pop pop} ifelse
  } forall
  /Encoding exch def
  /FontName 1 index def
  currentdict definefont pop
  end
} bind def
%%EndResource
%%BeginResource: procset (Apache XML Graphics EPS ProcSet) 1.0 0
%%Version: 1.0 0
%%Copyright: (Copyright 2002-2003 The Apache Software Foundation. License terms: http://www.apache.org/licenses/LICENSE-2.0)
/BeginEPSF { %def
/b4_Inc_state save def         % Save state for cleanup
/dict_count countdictstack def % Count objects on dict stack
/op_count count 1 sub def      % Count objects on operand stack
userdict begin                 % Push userdict on dict stack
/showpage { } def              % Redefine showpage, { } = null proc
0 setgray 0 setlinecap         % Prepare graphics state
1 setlinewidth 0 setlinejoin
10 setmiterlimit [ ] 0 setdash newpath
/languagelevel where           % If level not equal to 1 then
{pop languagelevel             % set strokeadjust and
1 ne                           % overprint to their defaults.
{false setstrokeadjust false setoverprint
} if
} if
} bd
/EndEPSF { %def
count op_count sub {pop} repeat            % Clean up stacks
countdictstack dict_count sub {end} repeat
b4_Inc_state restore
} bd
%%EndResource
%FOPBeginFontDict
%%IncludeResource: font Courier-Oblique
%%IncludeResource: font Courier-BoldOblique
%%IncludeResource: font Courier-Bold
%%IncludeResource: font ZapfDingbats
%%IncludeResource: font Symbol
%%IncludeResource: font Helvetica
%%IncludeResource: font Helvetica-Oblique
%%IncludeResource: font Helvetica-Bold
%%IncludeResource: font Helvetica-BoldOblique
%%IncludeResource: font Times-Roman
%%IncludeResource: font Times-Italic
%%IncludeResource: font Times-Bold
%%IncludeResource: font Times-BoldItalic
%%IncludeResource: font Courier
%FOPEndFontDict
%%BeginResource: encoding WinAnsiEncoding
/WinAnsiEncoding [
/.notdef /.notdef /.notdef /.notdef /.notdef
/.notdef /.notdef /.notdef /.notdef /.notdef
/.notdef /.notdef /.notdef /.notdef /.notdef
/.notdef /.notdef /.notdef /.notdef /.notdef
/.notdef /.notdef /.notdef /.notdef /.notdef
/.notdef /.notdef /.notdef /.notdef /.notdef
/.notdef /.notdef /space /exclam /quotedbl
/numbersign /dollar /percent /ampersand /quotesingle
/parenleft /parenright /asterisk /plus /comma
/hyphen /period /slash /zero /one
/two /three /four /five /six
/seven /eight /nine /colon /semicolon
/less /equal /greater /question /at
/A /B /C /D /E
/F /G /H /I /J
/K /L /M /N /O
/P /Q /R /S /T
/U /V /W /X /Y
/Z /bracketleft /backslash /bracketright /asciicircum
/underscore /quoteleft /a /b /c
/d /e /f /g /h
/i /j /k /l /m
/n /o /p /q /r
/s /t /u /v /w
/x /y /z /braceleft /bar
/braceright /asciitilde /bullet /Euro /bullet
/quotesinglbase /florin /quotedblbase /ellipsis /dagger
/daggerdbl /circumflex /perthousand /Scaron /guilsinglleft
/OE /bullet /Zcaron /bullet /bullet
/quoteleft /quoteright /quotedblleft /quotedblright /bullet
/endash /emdash /asciitilde /trademark /scaron
/guilsinglright /oe /bullet /zcaron /Ydieresis
/space /exclamdown /cent /sterling /currency
/yen /brokenbar /section /dieresis /copyright
/ordfeminine /guillemotleft /logicalnot /sfthyphen /registered
/macron /degree /plusminus /twosuperior /threesuperior
/acute /mu /paragraph /middot /cedilla
/onesuperior /ordmasculine /guillemotright /onequarter /onehalf
/threequarters /questiondown /Agrave /Aacute /Acircumflex
/Atilde /Adieresis /Aring /AE /Ccedilla
/Egrave /Eacute /Ecircumflex /Edieresis /Igrave
/Iacute /Icircumflex /Idieresis /Eth /Ntilde
/Ograve /Oacute /Ocircumflex /Otilde /Odieresis
/multiply /Oslash /Ugrave /Uacute /Ucircumflex
/Udieresis /Yacute /Thorn /germandbls /agrave
/aacute /acircumflex /atilde /adieresis /aring
/ae /ccedilla /egrave /eacute /ecircumflex
/edieresis /igrave /iacute /icircumflex /idieresis
/eth /ntilde /ograve /oacute /ocircumflex
/otilde /odieresis /divide /oslash /ugrave
/uacute /ucircumflex /udieresis /yacute /thorn
/ydieresis
] def
%%EndResource
%FOPBeginFontReencode
/Courier-Oblique findfont
dup length dict begin
  {1 index /FID ne {def} {pop pop} ifelse} forall
  /Encoding WinAnsiEncoding def
  currentdict
end
/Courier-Oblique exch definefont pop
/Courier-BoldOblique findfont
dup length dict begin
  {1 index /FID ne {def} {pop pop} ifelse} forall
  /Encoding WinAnsiEncoding def
  currentdict
end
/Courier-BoldOblique exch definefont pop
/Courier-Bold findfont
dup length dict begin
  {1 index /FID ne {def} {pop pop} ifelse} forall
  /Encoding WinAnsiEncoding def
  currentdict
end
/Courier-Bold exch definefont pop
/Helvetica findfont
dup length dict begin
  {1 index /FID ne {def} {pop pop} ifelse} forall
  /Encoding WinAnsiEncoding def
  currentdict
end
/Helvetica exch definefont pop
/Helvetica-Oblique findfont
dup length dict begin
  {1 index /FID ne {def} {pop pop} ifelse} forall
  /Encoding WinAnsiEncoding def
  currentdict
end
/Helvetica-Oblique exch definefont pop
/Helvetica-Bold findfont
dup length dict begin
  {1 index /FID ne {def} {pop pop} ifelse} forall
  /Encoding WinAnsiEncoding def
  currentdict
end
/Helvetica-Bold exch definefont pop
/Helvetica-BoldOblique findfont
dup length dict begin
  {1 index /FID ne {def} {pop pop} ifelse} forall
  /Encoding WinAnsiEncoding def
  currentdict
end
/Helvetica-BoldOblique exch definefont pop
/Times-Roman findfont
dup length dict begin
  {1 index /FID ne {def} {pop pop} ifelse} forall
  /Encoding WinAnsiEncoding def
  currentdict
end
/Times-Roman exch definefont pop
/Times-Italic findfont
dup length dict begin
  {1 index /FID ne {def} {pop pop} ifelse} forall
  /Encoding WinAnsiEncoding def
  currentdict
end
/Times-Italic exch definefont pop
/Times-Bold findfont
dup length dict begin
  {1 index /FID ne {def} {pop pop} ifelse} forall
  /Encoding WinAnsiEncoding def
  currentdict
end
/Times-Bold exch definefont pop
/Times-BoldItalic findfont
dup length dict begin
  {1 index /FID ne {def} {pop pop} ifelse} forall
  /Encoding WinAnsiEncoding def
  currentdict
end
/Times-BoldItalic exch definefont pop
/Courier findfont
dup length dict begin
  {1 index /FID ne {def} {pop pop} ifelse} forall
  /Encoding WinAnsiEncoding def
  currentdict
end
/Courier exch definefont pop
%FOPEndFontReencode
%%EndProlog
%%Page: 1 1
%%PageBoundingBox: 0 0 477 202
%%BeginPageSetup
[1 0 0 -1 0 202] CT
%%EndPageSetup
GS
[0.74962 0 0 0.74938 0 0.41731] CT
N
0 0 M
636 0 L
636 269 L
0 269 L
0 0 L
cp
clip
1 GC
N
0 0 636 269 re
f
GR
GS
[0.74962 0 0 0.74938 0 0.41731] CT
1 GC
N
0 0 636 269 re
f
GR
GS
[0.74962 0 0 0.74938 246.72282 23.24836] CT
0.149 GC
N
-171.211 -6.24 M
-171.211 -6.834 L
-169.367 -6.834 -169.367 -7.381 QT
-169.367 -16.709 L
-169.367 -17.256 -171.211 -17.256 QT
-171.211 -17.849 L
-165.961 -17.849 L
-165.961 -17.256 L
-167.789 -17.256 -167.789 -16.709 QT
-167.789 -7.381 L
-167.789 -6.834 -165.961 -6.834 QT
-165.961 -6.24 L
-171.211 -6.24 L
cp
f
GR
GS
[0.74962 0 0 0.74938 246.72282 23.24836] CT
0.149 GC
N
-161.233 -6.053 M
-162.249 -6.053 -163.077 -6.592 QT
-163.905 -7.131 -164.366 -8.021 QT
-164.827 -8.912 -164.827 -9.912 QT
-164.827 -10.943 -164.327 -11.826 QT
-163.827 -12.709 -162.96 -13.232 QT
-162.092 -13.756 -161.061 -13.756 QT
-160.436 -13.756 -159.881 -13.49 QT
-159.327 -13.224 -158.92 -12.771 QT
-158.92 -16.303 L
-158.92 -16.756 -159.053 -16.959 QT
-159.186 -17.162 -159.444 -17.209 QT
-159.702 -17.256 -160.233 -17.256 QT
-160.233 -17.849 L
-157.717 -18.037 L
-157.717 -7.787 L
-157.717 -7.334 -157.585 -7.131 QT
-157.452 -6.928 -157.194 -6.881 QT
-156.936 -6.834 -156.405 -6.834 QT
-156.405 -6.24 L
-158.967 -6.053 L
-158.967 -7.115 L
-159.405 -6.615 -160.014 -6.334 QT
-160.624 -6.053 -161.233 -6.053 QT
cp
-162.967 -7.724 M
-162.686 -7.162 -162.202 -6.826 QT
-161.717 -6.49 -161.139 -6.49 QT
-160.436 -6.49 -159.842 -6.904 QT
-159.249 -7.318 -158.967 -7.959 QT
-158.967 -12.037 L
-159.17 -12.412 -159.467 -12.701 QT
-159.764 -12.99 -160.147 -13.154 QT
-160.53 -13.318 -160.952 -13.318 QT
-161.842 -13.318 -162.381 -12.81 QT
-162.92 -12.303 -163.131 -11.521 QT
-163.342 -10.74 -163.342 -9.896 QT
-163.342 -9.209 -163.272 -8.701 QT
-163.202 -8.193 -162.967 -7.724 QT
cp
f
GR
GS
[0.74962 0 0 0.74938 246.72282 23.24836] CT
0.149 GC
N
-151.525 -6.053 M
-152.556 -6.053 -153.424 -6.592 QT
-154.291 -7.131 -154.791 -8.045 QT
-155.291 -8.959 -155.291 -9.974 QT
-155.291 -10.959 -154.838 -11.857 QT
-154.385 -12.756 -153.572 -13.31 QT
-152.76 -13.865 -151.76 -13.865 QT
-150.994 -13.865 -150.416 -13.599 QT
-149.838 -13.334 -149.463 -12.873 QT
-149.088 -12.412 -148.892 -11.779 QT
-148.697 -11.146 -148.697 -10.396 QT
-148.697 -10.162 -148.885 -10.162 QT
-153.806 -10.162 L
-153.806 -9.99 L
-153.806 -8.568 -153.236 -7.56 QT
-152.666 -6.553 -151.369 -6.553 QT
-150.853 -6.553 -150.408 -6.779 QT
-149.963 -7.006 -149.635 -7.428 QT
-149.306 -7.849 -149.197 -8.318 QT
-149.181 -8.381 -149.135 -8.42 QT
-149.088 -8.459 -149.025 -8.459 QT
-148.885 -8.459 L
-148.697 -8.459 -148.697 -8.256 QT
-148.947 -7.287 -149.744 -6.67 QT
-150.541 -6.053 -151.525 -6.053 QT
cp
-153.791 -10.584 M
-149.9 -10.584 L
-149.9 -11.224 -150.08 -11.881 QT
-150.26 -12.537 -150.674 -12.974 QT
-151.088 -13.412 -151.76 -13.412 QT
-152.728 -13.412 -153.26 -12.514 QT
-153.791 -11.615 -153.791 -10.584 QT
cp
f
GR
GS
[0.74962 0 0 0.74938 246.72282 23.24836] CT
0.149 GC
N
-147.556 -6.24 M
-147.556 -6.834 L
-146.962 -6.834 -146.595 -6.928 QT
-146.228 -7.021 -146.228 -7.381 QT
-146.228 -12.021 L
-146.228 -12.474 -146.361 -12.678 QT
-146.493 -12.881 -146.751 -12.928 QT
-147.009 -12.974 -147.556 -12.974 QT
-147.556 -13.568 L
-145.087 -13.756 L
-145.087 -12.099 L
-144.743 -12.818 -144.071 -13.287 QT
-143.4 -13.756 -142.618 -13.756 QT
-141.446 -13.756 -140.853 -13.193 QT
-140.259 -12.631 -140.259 -11.459 QT
-140.259 -7.381 L
-140.259 -7.021 -139.884 -6.928 QT
-139.509 -6.834 -138.931 -6.834 QT
-138.931 -6.24 L
-142.821 -6.24 L
-142.821 -6.834 L
-142.243 -6.834 -141.868 -6.928 QT
-141.493 -7.021 -141.493 -7.381 QT
-141.493 -11.412 L
-141.493 -12.24 -141.736 -12.779 QT
-141.978 -13.318 -142.712 -13.318 QT
-143.712 -13.318 -144.345 -12.529 QT
-144.978 -11.74 -144.978 -10.724 QT
-144.978 -7.381 L
-144.978 -7.021 -144.603 -6.928 QT
-144.228 -6.834 -143.65 -6.834 QT
-143.65 -6.24 L
-147.556 -6.24 L
cp
f
GR
GS
[0.74962 0 0 0.74938 246.72282 23.24836] CT
0.149 GC
N
-137.173 -8.287 M
-137.173 -12.974 L
-138.58 -12.974 L
-138.58 -13.412 L
-137.47 -13.412 -136.947 -14.451 QT
-136.423 -15.49 -136.423 -16.693 QT
-135.939 -16.693 L
-135.939 -13.568 L
-133.533 -13.568 L
-133.533 -12.974 L
-135.939 -12.974 L
-135.939 -8.318 L
-135.939 -7.615 -135.705 -7.084 QT
-135.47 -6.553 -134.845 -6.553 QT
-134.267 -6.553 -134.009 -7.107 QT
-133.751 -7.662 -133.751 -8.318 QT
-133.751 -9.318 L
-133.267 -9.318 L
-133.267 -8.287 L
-133.267 -7.756 -133.462 -7.232 QT
-133.658 -6.709 -134.041 -6.381 QT
-134.423 -6.053 -134.97 -6.053 QT
-135.986 -6.053 -136.58 -6.662 QT
-137.173 -7.271 -137.173 -8.287 QT
cp
f
GR
GS
[0.74962 0 0 0.74938 246.72282 23.24836] CT
0.149 GC
N
-131.651 -6.24 M
-131.651 -6.834 L
-131.058 -6.834 -130.69 -6.928 QT
-130.323 -7.021 -130.323 -7.381 QT
-130.323 -12.021 L
-130.323 -12.678 -130.573 -12.826 QT
-130.823 -12.974 -131.573 -12.974 QT
-131.573 -13.568 L
-129.12 -13.756 L
-129.12 -7.381 L
-129.12 -7.021 -128.8 -6.928 QT
-128.479 -6.834 -127.933 -6.834 QT
-127.933 -6.24 L
-131.651 -6.24 L
cp
-130.917 -16.678 M
-130.917 -17.053 -130.636 -17.334 QT
-130.354 -17.615 -129.995 -17.615 QT
-129.745 -17.615 -129.526 -17.49 QT
-129.308 -17.365 -129.183 -17.139 QT
-129.058 -16.912 -129.058 -16.678 QT
-129.058 -16.303 -129.339 -16.021 QT
-129.62 -15.74 -129.995 -15.74 QT
-130.354 -15.74 -130.636 -16.021 QT
-130.917 -16.303 -130.917 -16.678 QT
cp
f
GR
GS
[0.74962 0 0 0.74938 246.72282 23.24836] CT
0.149 GC
N
-126.915 -6.24 M
-126.915 -6.834 L
-126.336 -6.834 -125.961 -6.928 QT
-125.586 -7.021 -125.586 -7.381 QT
-125.586 -12.974 L
-126.899 -12.974 L
-126.899 -13.568 L
-125.586 -13.568 L
-125.586 -15.599 L
-125.586 -16.256 -125.227 -16.748 QT
-124.868 -17.24 -124.29 -17.568 QT
-123.711 -17.896 -123.047 -18.06 QT
-122.383 -18.224 -121.79 -18.224 QT
-121.305 -18.224 -120.805 -18.014 QT
-120.305 -17.803 -120.001 -17.404 QT
-119.696 -17.006 -119.696 -16.474 QT
-119.696 -16.131 -119.93 -15.896 QT
-120.165 -15.662 -120.524 -15.662 QT
-120.868 -15.662 -121.102 -15.896 QT
-121.336 -16.131 -121.336 -16.474 QT
-121.336 -16.803 -121.11 -17.045 QT
-120.883 -17.287 -120.571 -17.287 QT
-121.086 -17.787 -121.93 -17.787 QT
-122.54 -17.787 -123.126 -17.506 QT
-123.711 -17.224 -124.079 -16.717 QT
-124.446 -16.209 -124.446 -15.568 QT
-124.446 -13.568 L
-122.196 -13.568 L
-119.68 -13.787 L
-119.68 -7.381 L
-119.68 -7.021 -119.305 -6.928 QT
-118.93 -6.834 -118.368 -6.834 QT
-118.368 -6.24 L
-122.196 -6.24 L
-122.196 -6.834 L
-121.618 -6.834 -121.251 -6.928 QT
-120.883 -7.021 -120.883 -7.381 QT
-120.883 -12.053 L
-120.883 -12.396 -120.922 -12.56 QT
-120.961 -12.724 -121.086 -12.826 QT
-121.211 -12.928 -121.54 -12.974 QT
-124.399 -12.974 L
-124.399 -7.381 L
-124.399 -7.021 -124.024 -6.928 QT
-123.649 -6.834 -123.071 -6.834 QT
-123.071 -6.24 L
-126.915 -6.24 L
cp
f
GR
GS
[0.74962 0 0 0.74938 246.72282 23.24836] CT
0.149 GC
N
-113.488 -6.053 M
-114.519 -6.053 -115.387 -6.592 QT
-116.254 -7.131 -116.754 -8.045 QT
-117.254 -8.959 -117.254 -9.974 QT
-117.254 -10.959 -116.801 -11.857 QT
-116.347 -12.756 -115.535 -13.31 QT
-114.722 -13.865 -113.722 -13.865 QT
-112.957 -13.865 -112.379 -13.599 QT
-111.801 -13.334 -111.426 -12.873 QT
-111.051 -12.412 -110.855 -11.779 QT
-110.66 -11.146 -110.66 -10.396 QT
-110.66 -10.162 -110.847 -10.162 QT
-115.769 -10.162 L
-115.769 -9.99 L
-115.769 -8.568 -115.199 -7.56 QT
-114.629 -6.553 -113.332 -6.553 QT
-112.816 -6.553 -112.371 -6.779 QT
-111.926 -7.006 -111.597 -7.428 QT
-111.269 -7.849 -111.16 -8.318 QT
-111.144 -8.381 -111.097 -8.42 QT
-111.051 -8.459 -110.988 -8.459 QT
-110.847 -8.459 L
-110.66 -8.459 -110.66 -8.256 QT
-110.91 -7.287 -111.707 -6.67 QT
-112.504 -6.053 -113.488 -6.053 QT
cp
-115.754 -10.584 M
-111.863 -10.584 L
-111.863 -11.224 -112.043 -11.881 QT
-112.222 -12.537 -112.637 -12.974 QT
-113.051 -13.412 -113.722 -13.412 QT
-114.691 -13.412 -115.222 -12.514 QT
-115.754 -11.615 -115.754 -10.584 QT
cp
f
GR
GS
[0.74962 0 0 0.74938 246.72282 23.24836] CT
0.149 GC
N
-105.862 -6.053 M
-106.878 -6.053 -107.706 -6.592 QT
-108.534 -7.131 -108.995 -8.021 QT
-109.456 -8.912 -109.456 -9.912 QT
-109.456 -10.943 -108.956 -11.826 QT
-108.456 -12.709 -107.589 -13.232 QT
-106.722 -13.756 -105.691 -13.756 QT
-105.066 -13.756 -104.511 -13.49 QT
-103.956 -13.224 -103.55 -12.771 QT
-103.55 -16.303 L
-103.55 -16.756 -103.683 -16.959 QT
-103.816 -17.162 -104.073 -17.209 QT
-104.331 -17.256 -104.862 -17.256 QT
-104.862 -17.849 L
-102.347 -18.037 L
-102.347 -7.787 L
-102.347 -7.334 -102.214 -7.131 QT
-102.081 -6.928 -101.823 -6.881 QT
-101.566 -6.834 -101.034 -6.834 QT
-101.034 -6.24 L
-103.597 -6.053 L
-103.597 -7.115 L
-104.034 -6.615 -104.644 -6.334 QT
-105.253 -6.053 -105.862 -6.053 QT
cp
-107.597 -7.724 M
-107.316 -7.162 -106.831 -6.826 QT
-106.347 -6.49 -105.769 -6.49 QT
-105.066 -6.49 -104.472 -6.904 QT
-103.878 -7.318 -103.597 -7.959 QT
-103.597 -12.037 L
-103.8 -12.412 -104.097 -12.701 QT
-104.394 -12.99 -104.777 -13.154 QT
-105.159 -13.318 -105.581 -13.318 QT
-106.472 -13.318 -107.011 -12.81 QT
-107.55 -12.303 -107.761 -11.521 QT
-107.972 -10.74 -107.972 -9.896 QT
-107.972 -9.209 -107.902 -8.701 QT
-107.831 -8.193 -107.597 -7.724 QT
cp
f
GR
GS
[0.74962 0 0 0.74938 246.72282 23.24836] CT
0.149 GC
N
-94.174 -2.943 M
-94.174 -3.537 L
-93.596 -3.537 -93.221 -3.639 QT
-92.846 -3.74 -92.846 -4.084 QT
-92.846 -12.271 L
-92.846 -12.74 -93.174 -12.857 QT
-93.502 -12.974 -94.174 -12.974 QT
-94.174 -13.568 L
-91.658 -13.756 L
-91.658 -12.693 L
-91.189 -13.209 -90.572 -13.482 QT
-89.955 -13.756 -89.252 -13.756 QT
-88.252 -13.756 -87.447 -13.209 QT
-86.643 -12.662 -86.189 -11.779 QT
-85.736 -10.896 -85.736 -9.912 QT
-85.736 -8.881 -86.236 -7.99 QT
-86.736 -7.099 -87.604 -6.576 QT
-88.471 -6.053 -89.518 -6.053 QT
-90.752 -6.053 -91.611 -7.053 QT
-91.611 -4.084 L
-91.611 -3.74 -91.229 -3.639 QT
-90.846 -3.537 -90.283 -3.537 QT
-90.283 -2.943 L
-94.174 -2.943 L
cp
-91.611 -7.896 M
-91.314 -7.287 -90.783 -6.889 QT
-90.252 -6.49 -89.611 -6.49 QT
-89.018 -6.49 -88.572 -6.81 QT
-88.127 -7.131 -87.814 -7.662 QT
-87.502 -8.193 -87.361 -8.779 QT
-87.221 -9.365 -87.221 -9.912 QT
-87.221 -10.584 -87.463 -11.381 QT
-87.705 -12.178 -88.205 -12.717 QT
-88.705 -13.256 -89.424 -13.256 QT
-90.111 -13.256 -90.689 -12.904 QT
-91.268 -12.553 -91.611 -11.959 QT
-91.611 -7.896 L
cp
f
GR
GS
[0.74962 0 0 0.74938 246.72282 23.24836] CT
0.149 GC
N
-84.294 -7.912 M
-84.294 -8.928 -83.497 -9.56 QT
-82.7 -10.193 -81.591 -10.451 QT
-80.482 -10.709 -79.466 -10.709 QT
-79.466 -11.412 L
-79.466 -11.896 -79.685 -12.357 QT
-79.904 -12.818 -80.31 -13.115 QT
-80.716 -13.412 -81.2 -13.412 QT
-82.341 -13.412 -82.919 -12.912 QT
-82.607 -12.912 -82.388 -12.662 QT
-82.169 -12.412 -82.169 -12.099 QT
-82.169 -11.756 -82.411 -11.514 QT
-82.654 -11.271 -82.982 -11.271 QT
-83.325 -11.271 -83.568 -11.514 QT
-83.81 -11.756 -83.81 -12.099 QT
-83.81 -12.99 -82.997 -13.428 QT
-82.185 -13.865 -81.2 -13.865 QT
-80.513 -13.865 -79.818 -13.568 QT
-79.122 -13.271 -78.677 -12.724 QT
-78.232 -12.178 -78.232 -11.443 QT
-78.232 -7.615 L
-78.232 -7.287 -78.091 -7.006 QT
-77.95 -6.724 -77.654 -6.724 QT
-77.372 -6.724 -77.232 -7.006 QT
-77.091 -7.287 -77.091 -7.615 QT
-77.091 -8.709 L
-76.591 -8.709 L
-76.591 -7.615 L
-76.591 -7.24 -76.794 -6.896 QT
-76.997 -6.553 -77.333 -6.349 QT
-77.669 -6.146 -78.06 -6.146 QT
-78.56 -6.146 -78.919 -6.529 QT
-79.279 -6.912 -79.325 -7.443 QT
-79.638 -6.803 -80.247 -6.428 QT
-80.857 -6.053 -81.56 -6.053 QT
-82.216 -6.053 -82.841 -6.24 QT
-83.466 -6.428 -83.88 -6.842 QT
-84.294 -7.256 -84.294 -7.912 QT
cp
-82.919 -7.912 M
-82.919 -7.318 -82.482 -6.904 QT
-82.044 -6.49 -81.45 -6.49 QT
-80.904 -6.49 -80.45 -6.771 QT
-79.997 -7.053 -79.732 -7.521 QT
-79.466 -7.99 -79.466 -8.521 QT
-79.466 -10.287 L
-80.247 -10.287 -81.052 -10.029 QT
-81.857 -9.771 -82.388 -9.232 QT
-82.919 -8.693 -82.919 -7.912 QT
cp
f
GR
GS
[0.74962 0 0 0.74938 246.72282 23.24836] CT
0.149 GC
N
-75.877 -6.24 M
-75.877 -6.834 L
-75.299 -6.834 -74.924 -6.928 QT
-74.549 -7.021 -74.549 -7.381 QT
-74.549 -12.021 L
-74.549 -12.474 -74.682 -12.678 QT
-74.815 -12.881 -75.073 -12.928 QT
-75.331 -12.974 -75.877 -12.974 QT
-75.877 -13.568 L
-73.44 -13.756 L
-73.44 -12.099 L
-73.174 -12.834 -72.667 -13.295 QT
-72.159 -13.756 -71.44 -13.756 QT
-70.924 -13.756 -70.526 -13.459 QT
-70.127 -13.162 -70.127 -12.662 QT
-70.127 -12.365 -70.346 -12.131 QT
-70.565 -11.896 -70.893 -11.896 QT
-71.206 -11.896 -71.432 -12.123 QT
-71.659 -12.349 -71.659 -12.662 QT
-71.659 -13.115 -71.331 -13.318 QT
-71.44 -13.318 L
-72.127 -13.318 -72.557 -12.818 QT
-72.987 -12.318 -73.174 -11.576 QT
-73.362 -10.834 -73.362 -10.162 QT
-73.362 -7.381 L
-73.362 -6.834 -71.706 -6.834 QT
-71.706 -6.24 L
-75.877 -6.24 L
cp
f
GR
GS
[0.74962 0 0 0.74938 246.72282 23.24836] CT
0.149 GC
N
-68.839 -7.912 M
-68.839 -8.928 -68.042 -9.56 QT
-67.245 -10.193 -66.135 -10.451 QT
-65.026 -10.709 -64.01 -10.709 QT
-64.01 -11.412 L
-64.01 -11.896 -64.229 -12.357 QT
-64.448 -12.818 -64.854 -13.115 QT
-65.26 -13.412 -65.745 -13.412 QT
-66.885 -13.412 -67.464 -12.912 QT
-67.151 -12.912 -66.932 -12.662 QT
-66.714 -12.412 -66.714 -12.099 QT
-66.714 -11.756 -66.956 -11.514 QT
-67.198 -11.271 -67.526 -11.271 QT
-67.87 -11.271 -68.112 -11.514 QT
-68.354 -11.756 -68.354 -12.099 QT
-68.354 -12.99 -67.542 -13.428 QT
-66.729 -13.865 -65.745 -13.865 QT
-65.057 -13.865 -64.362 -13.568 QT
-63.667 -13.271 -63.221 -12.724 QT
-62.776 -12.178 -62.776 -11.443 QT
-62.776 -7.615 L
-62.776 -7.287 -62.635 -7.006 QT
-62.495 -6.724 -62.198 -6.724 QT
-61.917 -6.724 -61.776 -7.006 QT
-61.635 -7.287 -61.635 -7.615 QT
-61.635 -8.709 L
-61.135 -8.709 L
-61.135 -7.615 L
-61.135 -7.24 -61.339 -6.896 QT
-61.542 -6.553 -61.878 -6.349 QT
-62.214 -6.146 -62.604 -6.146 QT
-63.104 -6.146 -63.464 -6.529 QT
-63.823 -6.912 -63.87 -7.443 QT
-64.182 -6.803 -64.792 -6.428 QT
-65.401 -6.053 -66.104 -6.053 QT
-66.76 -6.053 -67.385 -6.24 QT
-68.01 -6.428 -68.424 -6.842 QT
-68.839 -7.256 -68.839 -7.912 QT
cp
-67.464 -7.912 M
-67.464 -7.318 -67.026 -6.904 QT
-66.589 -6.49 -65.995 -6.49 QT
-65.448 -6.49 -64.995 -6.771 QT
-64.542 -7.053 -64.276 -7.521 QT
-64.01 -7.99 -64.01 -8.521 QT
-64.01 -10.287 L
-64.792 -10.287 -65.596 -10.029 QT
-66.401 -9.771 -66.932 -9.232 QT
-67.464 -8.693 -67.464 -7.912 QT
cp
f
GR
GS
[0.74962 0 0 0.74938 246.72282 23.24836] CT
0.149 GC
N
-60.359 -6.24 M
-60.359 -6.834 L
-59.766 -6.834 -59.398 -6.928 QT
-59.031 -7.021 -59.031 -7.381 QT
-59.031 -12.021 L
-59.031 -12.474 -59.164 -12.678 QT
-59.297 -12.881 -59.555 -12.928 QT
-59.812 -12.974 -60.359 -12.974 QT
-60.359 -13.568 L
-57.891 -13.756 L
-57.891 -12.099 L
-57.547 -12.818 -56.875 -13.287 QT
-56.203 -13.756 -55.422 -13.756 QT
-53.469 -13.756 -53.125 -12.162 QT
-52.781 -12.865 -52.125 -13.31 QT
-51.469 -13.756 -50.687 -13.756 QT
-49.922 -13.756 -49.391 -13.506 QT
-48.859 -13.256 -48.594 -12.748 QT
-48.328 -12.24 -48.328 -11.459 QT
-48.328 -7.381 L
-48.328 -7.021 -47.953 -6.928 QT
-47.578 -6.834 -47 -6.834 QT
-47 -6.24 L
-50.891 -6.24 L
-50.891 -6.834 L
-50.312 -6.834 -49.937 -6.928 QT
-49.562 -7.021 -49.562 -7.381 QT
-49.562 -11.412 L
-49.562 -12.271 -49.805 -12.795 QT
-50.047 -13.318 -50.797 -13.318 QT
-51.781 -13.318 -52.422 -12.529 QT
-53.062 -11.74 -53.062 -10.724 QT
-53.062 -7.381 L
-53.062 -7.021 -52.687 -6.928 QT
-52.312 -6.834 -51.734 -6.834 QT
-51.734 -6.24 L
-55.625 -6.24 L
-55.625 -6.834 L
-55.047 -6.834 -54.672 -6.928 QT
-54.297 -7.021 -54.297 -7.381 QT
-54.297 -11.412 L
-54.297 -12.24 -54.539 -12.779 QT
-54.781 -13.318 -55.516 -13.318 QT
-56.516 -13.318 -57.148 -12.529 QT
-57.781 -11.74 -57.781 -10.724 QT
-57.781 -7.381 L
-57.781 -7.021 -57.406 -6.928 QT
-57.031 -6.834 -56.453 -6.834 QT
-56.453 -6.24 L
-60.359 -6.24 L
cp
f
GR
GS
[0.74962 0 0 0.74938 246.72282 23.24836] CT
0.149 GC
N
-42.181 -6.053 M
-43.212 -6.053 -44.079 -6.592 QT
-44.946 -7.131 -45.446 -8.045 QT
-45.946 -8.959 -45.946 -9.974 QT
-45.946 -10.959 -45.493 -11.857 QT
-45.04 -12.756 -44.227 -13.31 QT
-43.415 -13.865 -42.415 -13.865 QT
-41.649 -13.865 -41.071 -13.599 QT
-40.493 -13.334 -40.118 -12.873 QT
-39.743 -12.412 -39.548 -11.779 QT
-39.352 -11.146 -39.352 -10.396 QT
-39.352 -10.162 -39.54 -10.162 QT
-44.462 -10.162 L
-44.462 -9.99 L
-44.462 -8.568 -43.891 -7.56 QT
-43.321 -6.553 -42.024 -6.553 QT
-41.509 -6.553 -41.063 -6.779 QT
-40.618 -7.006 -40.29 -7.428 QT
-39.962 -7.849 -39.852 -8.318 QT
-39.837 -8.381 -39.79 -8.42 QT
-39.743 -8.459 -39.681 -8.459 QT
-39.54 -8.459 L
-39.352 -8.459 -39.352 -8.256 QT
-39.602 -7.287 -40.399 -6.67 QT
-41.196 -6.053 -42.181 -6.053 QT
cp
-44.446 -10.584 M
-40.556 -10.584 L
-40.556 -11.224 -40.735 -11.881 QT
-40.915 -12.537 -41.329 -12.974 QT
-41.743 -13.412 -42.415 -13.412 QT
-43.384 -13.412 -43.915 -12.514 QT
-44.446 -11.615 -44.446 -10.584 QT
cp
f
GR
GS
[0.74962 0 0 0.74938 246.72282 23.24836] CT
0.149 GC
N
-36.977 -8.287 M
-36.977 -12.974 L
-38.383 -12.974 L
-38.383 -13.412 L
-37.274 -13.412 -36.75 -14.451 QT
-36.227 -15.49 -36.227 -16.693 QT
-35.742 -16.693 L
-35.742 -13.568 L
-33.336 -13.568 L
-33.336 -12.974 L
-35.742 -12.974 L
-35.742 -8.318 L
-35.742 -7.615 -35.508 -7.084 QT
-35.274 -6.553 -34.649 -6.553 QT
-34.071 -6.553 -33.813 -7.107 QT
-33.555 -7.662 -33.555 -8.318 QT
-33.555 -9.318 L
-33.071 -9.318 L
-33.071 -8.287 L
-33.071 -7.756 -33.266 -7.232 QT
-33.461 -6.709 -33.844 -6.381 QT
-34.227 -6.053 -34.774 -6.053 QT
-35.789 -6.053 -36.383 -6.662 QT
-36.977 -7.271 -36.977 -8.287 QT
cp
f
GR
GS
[0.74962 0 0 0.74938 246.72282 23.24836] CT
0.149 GC
N
-27.736 -6.053 M
-28.767 -6.053 -29.634 -6.592 QT
-30.502 -7.131 -31.002 -8.045 QT
-31.502 -8.959 -31.502 -9.974 QT
-31.502 -10.959 -31.049 -11.857 QT
-30.595 -12.756 -29.783 -13.31 QT
-28.97 -13.865 -27.97 -13.865 QT
-27.205 -13.865 -26.627 -13.599 QT
-26.049 -13.334 -25.674 -12.873 QT
-25.299 -12.412 -25.103 -11.779 QT
-24.908 -11.146 -24.908 -10.396 QT
-24.908 -10.162 -25.095 -10.162 QT
-30.017 -10.162 L
-30.017 -9.99 L
-30.017 -8.568 -29.447 -7.56 QT
-28.877 -6.553 -27.58 -6.553 QT
-27.064 -6.553 -26.619 -6.779 QT
-26.174 -7.006 -25.845 -7.428 QT
-25.517 -7.849 -25.408 -8.318 QT
-25.392 -8.381 -25.345 -8.42 QT
-25.299 -8.459 -25.236 -8.459 QT
-25.095 -8.459 L
-24.908 -8.459 -24.908 -8.256 QT
-25.158 -7.287 -25.955 -6.67 QT
-26.752 -6.053 -27.736 -6.053 QT
cp
-30.002 -10.584 M
-26.111 -10.584 L
-26.111 -11.224 -26.291 -11.881 QT
-26.47 -12.537 -26.884 -12.974 QT
-27.299 -13.412 -27.97 -13.412 QT
-28.939 -13.412 -29.47 -12.514 QT
-30.002 -11.615 -30.002 -10.584 QT
cp
f
GR
GS
[0.74962 0 0 0.74938 246.72282 23.24836] CT
0.149 GC
N
-23.829 -6.24 M
-23.829 -6.834 L
-23.251 -6.834 -22.876 -6.928 QT
-22.501 -7.021 -22.501 -7.381 QT
-22.501 -12.021 L
-22.501 -12.474 -22.634 -12.678 QT
-22.767 -12.881 -23.025 -12.928 QT
-23.282 -12.974 -23.829 -12.974 QT
-23.829 -13.568 L
-21.392 -13.756 L
-21.392 -12.099 L
-21.126 -12.834 -20.618 -13.295 QT
-20.11 -13.756 -19.392 -13.756 QT
-18.876 -13.756 -18.478 -13.459 QT
-18.079 -13.162 -18.079 -12.662 QT
-18.079 -12.365 -18.298 -12.131 QT
-18.517 -11.896 -18.845 -11.896 QT
-19.157 -11.896 -19.384 -12.123 QT
-19.61 -12.349 -19.61 -12.662 QT
-19.61 -13.115 -19.282 -13.318 QT
-19.392 -13.318 L
-20.079 -13.318 -20.509 -12.818 QT
-20.939 -12.318 -21.126 -11.576 QT
-21.314 -10.834 -21.314 -10.162 QT
-21.314 -7.381 L
-21.314 -6.834 -19.657 -6.834 QT
-19.657 -6.24 L
-23.829 -6.24 L
cp
f
GR
GS
[0.74962 0 0 0.74938 246.72282 23.24836] CT
0.149 GC
N
-16.915 -6.193 M
-16.915 -8.959 L
-16.915 -9.099 -16.759 -9.099 QT
-16.556 -9.099 L
-16.462 -9.099 -16.431 -8.959 QT
-15.947 -6.49 -14.134 -6.49 QT
-13.322 -6.49 -12.783 -6.857 QT
-12.243 -7.224 -12.243 -7.99 QT
-12.243 -8.537 -12.665 -8.928 QT
-13.087 -9.318 -13.665 -9.459 QT
-14.806 -9.678 L
-15.384 -9.803 -15.853 -10.06 QT
-16.322 -10.318 -16.618 -10.748 QT
-16.915 -11.178 -16.915 -11.74 QT
-16.915 -12.49 -16.517 -12.967 QT
-16.118 -13.443 -15.493 -13.654 QT
-14.868 -13.865 -14.134 -13.865 QT
-13.259 -13.865 -12.618 -13.396 QT
-12.118 -13.818 L
-12.118 -13.865 -12.04 -13.865 QT
-11.915 -13.865 L
-11.868 -13.865 -11.829 -13.818 QT
-11.79 -13.771 -11.79 -13.724 QT
-11.79 -11.49 L
-11.79 -11.334 -11.915 -11.334 QT
-12.118 -11.334 L
-12.275 -11.334 -12.275 -11.49 QT
-12.275 -12.381 -12.767 -12.92 QT
-13.259 -13.459 -14.15 -13.459 QT
-14.915 -13.459 -15.478 -13.178 QT
-16.04 -12.896 -16.04 -12.209 QT
-16.04 -11.74 -15.634 -11.435 QT
-15.228 -11.131 -14.681 -10.99 QT
-13.54 -10.787 L
-12.947 -10.646 -12.447 -10.334 QT
-11.947 -10.021 -11.65 -9.537 QT
-11.353 -9.053 -11.353 -8.443 QT
-11.353 -7.834 -11.572 -7.381 QT
-11.79 -6.928 -12.165 -6.631 QT
-12.54 -6.334 -13.056 -6.193 QT
-13.572 -6.053 -14.134 -6.053 QT
-15.197 -6.053 -15.947 -6.756 QT
-16.572 -6.084 L
-16.572 -6.053 -16.665 -6.053 QT
-16.759 -6.053 L
-16.915 -6.053 -16.915 -6.193 QT
cp
f
GR
GS
[0.74962 0 0 0.74938 246.72282 23.24836] CT
0.149 GC
N
-4.316 -6.24 M
-4.316 -6.834 L
-3.738 -6.834 -3.363 -6.928 QT
-2.988 -7.021 -2.988 -7.381 QT
-2.988 -12.974 L
-4.301 -12.974 L
-4.301 -13.568 L
-2.988 -13.568 L
-2.988 -15.599 L
-2.988 -16.146 -2.761 -16.623 QT
-2.535 -17.099 -2.152 -17.459 QT
-1.769 -17.818 -1.269 -18.021 QT
-0.769 -18.224 -0.222 -18.224 QT
0.356 -18.224 0.817 -17.889 QT
1.278 -17.553 1.278 -16.974 QT
1.278 -16.662 1.051 -16.443 QT
0.824 -16.224 0.512 -16.224 QT
0.184 -16.224 -0.043 -16.443 QT
-0.269 -16.662 -0.269 -16.974 QT
-0.269 -17.506 0.184 -17.693 QT
-0.097 -17.787 -0.301 -17.787 QT
-0.801 -17.787 -1.152 -17.435 QT
-1.504 -17.084 -1.683 -16.576 QT
-1.863 -16.068 -1.863 -15.568 QT
-1.863 -13.568 L
0.106 -13.568 L
0.106 -12.974 L
-1.801 -12.974 L
-1.801 -7.381 L
-1.801 -7.021 -1.301 -6.928 QT
-0.801 -6.834 -0.16 -6.834 QT
-0.16 -6.24 L
-4.316 -6.24 L
cp
f
GR
GS
[0.74962 0 0 0.74938 246.72282 23.24836] CT
0.149 GC
N
4.683 -6.053 M
3.668 -6.053 2.793 -6.568 QT
1.918 -7.084 1.41 -7.959 QT
0.902 -8.834 0.902 -9.865 QT
0.902 -10.646 1.183 -11.365 QT
1.465 -12.084 1.98 -12.654 QT
2.496 -13.224 3.183 -13.545 QT
3.871 -13.865 4.683 -13.865 QT
5.73 -13.865 6.59 -13.31 QT
7.449 -12.756 7.949 -11.834 QT
8.449 -10.912 8.449 -9.865 QT
8.449 -8.834 7.941 -7.959 QT
7.433 -7.084 6.566 -6.568 QT
5.699 -6.053 4.683 -6.053 QT
cp
4.683 -6.553 M
6.043 -6.553 6.504 -7.537 QT
6.965 -8.521 6.965 -10.053 QT
6.965 -10.912 6.871 -11.467 QT
6.777 -12.021 6.465 -12.49 QT
6.277 -12.771 5.98 -12.982 QT
5.683 -13.193 5.355 -13.303 QT
5.027 -13.412 4.683 -13.412 QT
4.152 -13.412 3.675 -13.17 QT
3.199 -12.928 2.886 -12.49 QT
2.574 -12.006 2.48 -11.428 QT
2.386 -10.849 2.386 -10.053 QT
2.386 -9.099 2.558 -8.342 QT
2.73 -7.584 3.23 -7.068 QT
3.73 -6.553 4.683 -6.553 QT
cp
f
GR
GS
[0.74962 0 0 0.74938 246.72282 23.24836] CT
0.149 GC
N
9.538 -6.24 M
9.538 -6.834 L
10.116 -6.834 10.491 -6.928 QT
10.866 -7.021 10.866 -7.381 QT
10.866 -12.021 L
10.866 -12.474 10.733 -12.678 QT
10.6 -12.881 10.342 -12.928 QT
10.084 -12.974 9.538 -12.974 QT
9.538 -13.568 L
11.975 -13.756 L
11.975 -12.099 L
12.241 -12.834 12.748 -13.295 QT
13.256 -13.756 13.975 -13.756 QT
14.491 -13.756 14.889 -13.459 QT
15.288 -13.162 15.288 -12.662 QT
15.288 -12.365 15.069 -12.131 QT
14.85 -11.896 14.522 -11.896 QT
14.209 -11.896 13.983 -12.123 QT
13.756 -12.349 13.756 -12.662 QT
13.756 -13.115 14.084 -13.318 QT
13.975 -13.318 L
13.288 -13.318 12.858 -12.818 QT
12.428 -12.318 12.241 -11.576 QT
12.053 -10.834 12.053 -10.162 QT
12.053 -7.381 L
12.053 -6.834 13.709 -6.834 QT
13.709 -6.24 L
9.538 -6.24 L
cp
f
GR
GS
[0.74962 0 0 0.74938 246.72282 23.24836] CT
0.149 GC
N
24.026 -12.865 M
23.417 -12.865 23.135 -13.428 QT
22.854 -13.99 22.854 -14.678 QT
22.854 -15.318 23.034 -15.92 QT
23.214 -16.521 23.557 -17.068 QT
23.901 -17.615 24.354 -18.006 QT
24.417 -18.037 24.464 -18.037 QT
24.542 -18.037 24.628 -17.959 QT
24.714 -17.881 24.714 -17.803 QT
24.714 -17.74 24.635 -17.662 QT
24.229 -17.303 23.924 -16.818 QT
23.62 -16.334 23.464 -15.779 QT
23.307 -15.224 23.307 -14.678 QT
23.307 -14.506 23.323 -14.412 QT
23.557 -14.74 24.026 -14.74 QT
24.432 -14.74 24.698 -14.467 QT
24.964 -14.193 24.964 -13.803 QT
24.964 -13.428 24.698 -13.146 QT
24.432 -12.865 24.026 -12.865 QT
cp
f
GR
GS
[0.74962 0 0 0.74938 246.72282 23.24836] CT
0.149 GC
N
26.997 -6.24 M
26.997 -6.834 L
28.763 -6.834 28.763 -7.381 QT
28.763 -16.709 L
28.763 -17.256 26.997 -17.256 QT
26.997 -17.849 L
36.372 -17.849 L
36.856 -13.959 L
36.356 -13.959 L
36.247 -15.037 36.052 -15.654 QT
35.856 -16.271 35.481 -16.623 QT
35.106 -16.974 34.481 -17.115 QT
33.856 -17.256 32.763 -17.256 QT
31.2 -17.256 L
30.903 -17.256 30.731 -17.232 QT
30.56 -17.209 30.45 -17.084 QT
30.341 -16.959 30.341 -16.709 QT
30.341 -12.334 L
31.544 -12.334 L
32.419 -12.334 32.825 -12.49 QT
33.231 -12.646 33.388 -13.053 QT
33.544 -13.459 33.544 -14.334 QT
34.028 -14.334 L
34.028 -9.756 L
33.544 -9.756 L
33.544 -10.631 33.388 -11.037 QT
33.231 -11.443 32.825 -11.599 QT
32.419 -11.756 31.544 -11.756 QT
30.341 -11.756 L
30.341 -7.381 L
30.341 -6.834 32.513 -6.834 QT
32.513 -6.24 L
26.997 -6.24 L
cp
f
GR
GS
[0.74962 0 0 0.74938 246.72282 23.24836] CT
0.149 GC
N
38.18 -8.271 M
38.18 -12.021 L
38.18 -12.474 38.047 -12.678 QT
37.914 -12.881 37.657 -12.928 QT
37.399 -12.974 36.852 -12.974 QT
36.852 -13.568 L
39.43 -13.756 L
39.43 -8.271 L
39.43 -7.599 39.524 -7.232 QT
39.618 -6.865 39.93 -6.678 QT
40.243 -6.49 40.93 -6.49 QT
41.836 -6.49 42.375 -7.256 QT
42.914 -8.021 42.914 -8.99 QT
42.914 -12.021 L
42.914 -12.474 42.774 -12.678 QT
42.633 -12.881 42.383 -12.928 QT
42.133 -12.974 41.586 -12.974 QT
41.586 -13.568 L
44.149 -13.756 L
44.149 -7.787 L
44.149 -7.334 44.289 -7.131 QT
44.43 -6.928 44.688 -6.881 QT
44.946 -6.834 45.477 -6.834 QT
45.477 -6.24 L
42.961 -6.053 L
42.961 -7.49 L
42.649 -6.849 42.086 -6.451 QT
41.524 -6.053 40.836 -6.053 QT
39.618 -6.053 38.899 -6.568 QT
38.18 -7.084 38.18 -8.271 QT
cp
f
GR
GS
[0.74962 0 0 0.74938 246.72282 23.24836] CT
0.149 GC
N
46.497 -6.24 M
46.497 -6.834 L
47.091 -6.834 47.458 -6.928 QT
47.825 -7.021 47.825 -7.381 QT
47.825 -16.303 L
47.825 -16.756 47.692 -16.959 QT
47.56 -17.162 47.302 -17.209 QT
47.044 -17.256 46.497 -17.256 QT
46.497 -17.849 L
49.028 -18.037 L
49.028 -7.381 L
49.028 -7.021 49.403 -6.928 QT
49.778 -6.834 50.341 -6.834 QT
50.341 -6.24 L
46.497 -6.24 L
cp
f
GR
GS
[0.74962 0 0 0.74938 246.72282 23.24836] CT
0.149 GC
N
51.312 -6.24 M
51.312 -6.834 L
51.906 -6.834 52.273 -6.928 QT
52.64 -7.021 52.64 -7.381 QT
52.64 -16.303 L
52.64 -16.756 52.507 -16.959 QT
52.375 -17.162 52.117 -17.209 QT
51.859 -17.256 51.312 -17.256 QT
51.312 -17.849 L
53.843 -18.037 L
53.843 -7.381 L
53.843 -7.021 54.218 -6.928 QT
54.593 -6.834 55.156 -6.834 QT
55.156 -6.24 L
51.312 -6.24 L
cp
f
GR
GS
[0.74962 0 0 0.74938 246.72282 23.24836] CT
0.149 GC
N
65.545 -6.24 M
63.061 -12.49 L
62.905 -12.803 62.576 -12.889 QT
62.248 -12.974 61.717 -12.974 QT
61.717 -13.568 L
65.28 -13.568 L
65.28 -12.974 L
64.326 -12.974 64.326 -12.568 QT
64.326 -12.506 64.342 -12.459 QT
66.248 -7.662 L
67.967 -12.006 L
68.014 -12.131 68.014 -12.271 QT
68.014 -12.599 67.772 -12.787 QT
67.53 -12.974 67.201 -12.974 QT
67.201 -13.568 L
70.03 -13.568 L
70.03 -12.974 L
69.498 -12.974 69.108 -12.732 QT
68.717 -12.49 68.498 -12.021 QT
66.201 -6.24 L
66.139 -6.053 65.936 -6.053 QT
65.811 -6.053 L
65.592 -6.053 65.545 -6.24 QT
cp
f
GR
GS
[0.74962 0 0 0.74938 246.72282 23.24836] CT
0.149 GC
N
74.306 -6.053 M
73.29 -6.053 72.415 -6.568 QT
71.54 -7.084 71.032 -7.959 QT
70.524 -8.834 70.524 -9.865 QT
70.524 -10.646 70.806 -11.365 QT
71.087 -12.084 71.603 -12.654 QT
72.118 -13.224 72.806 -13.545 QT
73.493 -13.865 74.306 -13.865 QT
75.353 -13.865 76.212 -13.31 QT
77.071 -12.756 77.571 -11.834 QT
78.071 -10.912 78.071 -9.865 QT
78.071 -8.834 77.563 -7.959 QT
77.056 -7.084 76.188 -6.568 QT
75.321 -6.053 74.306 -6.053 QT
cp
74.306 -6.553 M
75.665 -6.553 76.126 -7.537 QT
76.587 -8.521 76.587 -10.053 QT
76.587 -10.912 76.493 -11.467 QT
76.399 -12.021 76.087 -12.49 QT
75.899 -12.771 75.603 -12.982 QT
75.306 -13.193 74.978 -13.303 QT
74.649 -13.412 74.306 -13.412 QT
73.774 -13.412 73.298 -13.17 QT
72.821 -12.928 72.509 -12.49 QT
72.196 -12.006 72.103 -11.428 QT
72.009 -10.849 72.009 -10.053 QT
72.009 -9.099 72.181 -8.342 QT
72.353 -7.584 72.853 -7.068 QT
73.353 -6.553 74.306 -6.553 QT
cp
f
GR
GS
[0.74962 0 0 0.74938 246.72282 23.24836] CT
0.149 GC
N
79.238 -6.24 M
79.238 -6.834 L
79.832 -6.834 80.199 -6.928 QT
80.566 -7.021 80.566 -7.381 QT
80.566 -16.303 L
80.566 -16.756 80.433 -16.959 QT
80.3 -17.162 80.043 -17.209 QT
79.785 -17.256 79.238 -17.256 QT
79.238 -17.849 L
81.769 -18.037 L
81.769 -7.381 L
81.769 -7.021 82.144 -6.928 QT
82.519 -6.834 83.082 -6.834 QT
83.082 -6.24 L
79.238 -6.24 L
cp
f
GR
GS
[0.74962 0 0 0.74938 246.72282 23.24836] CT
0.149 GC
N
85.365 -8.271 M
85.365 -12.021 L
85.365 -12.474 85.233 -12.678 QT
85.1 -12.881 84.842 -12.928 QT
84.584 -12.974 84.037 -12.974 QT
84.037 -13.568 L
86.615 -13.756 L
86.615 -8.271 L
86.615 -7.599 86.709 -7.232 QT
86.803 -6.865 87.115 -6.678 QT
87.428 -6.49 88.115 -6.49 QT
89.022 -6.49 89.561 -7.256 QT
90.1 -8.021 90.1 -8.99 QT
90.1 -12.021 L
90.1 -12.474 89.959 -12.678 QT
89.818 -12.881 89.568 -12.928 QT
89.318 -12.974 88.772 -12.974 QT
88.772 -13.568 L
91.334 -13.756 L
91.334 -7.787 L
91.334 -7.334 91.475 -7.131 QT
91.615 -6.928 91.873 -6.881 QT
92.131 -6.834 92.662 -6.834 QT
92.662 -6.24 L
90.147 -6.053 L
90.147 -7.49 L
89.834 -6.849 89.272 -6.451 QT
88.709 -6.053 88.022 -6.053 QT
86.803 -6.053 86.084 -6.568 QT
85.365 -7.084 85.365 -8.271 QT
cp
f
GR
GS
[0.74962 0 0 0.74938 246.72282 23.24836] CT
0.149 GC
N
93.667 -6.24 M
93.667 -6.834 L
94.261 -6.834 94.628 -6.928 QT
94.995 -7.021 94.995 -7.381 QT
94.995 -12.021 L
94.995 -12.474 94.862 -12.678 QT
94.729 -12.881 94.472 -12.928 QT
94.214 -12.974 93.667 -12.974 QT
93.667 -13.568 L
96.136 -13.756 L
96.136 -12.099 L
96.479 -12.818 97.151 -13.287 QT
97.823 -13.756 98.604 -13.756 QT
100.557 -13.756 100.901 -12.162 QT
101.245 -12.865 101.901 -13.31 QT
102.557 -13.756 103.339 -13.756 QT
104.104 -13.756 104.636 -13.506 QT
105.167 -13.256 105.432 -12.748 QT
105.698 -12.24 105.698 -11.459 QT
105.698 -7.381 L
105.698 -7.021 106.073 -6.928 QT
106.448 -6.834 107.026 -6.834 QT
107.026 -6.24 L
103.136 -6.24 L
103.136 -6.834 L
103.714 -6.834 104.089 -6.928 QT
104.464 -7.021 104.464 -7.381 QT
104.464 -11.412 L
104.464 -12.271 104.222 -12.795 QT
103.979 -13.318 103.229 -13.318 QT
102.245 -13.318 101.604 -12.529 QT
100.964 -11.74 100.964 -10.724 QT
100.964 -7.381 L
100.964 -7.021 101.339 -6.928 QT
101.714 -6.834 102.292 -6.834 QT
102.292 -6.24 L
98.401 -6.24 L
98.401 -6.834 L
98.979 -6.834 99.354 -6.928 QT
99.729 -7.021 99.729 -7.381 QT
99.729 -11.412 L
99.729 -12.24 99.487 -12.779 QT
99.245 -13.318 98.511 -13.318 QT
97.511 -13.318 96.878 -12.529 QT
96.245 -11.74 96.245 -10.724 QT
96.245 -7.381 L
96.245 -7.021 96.62 -6.928 QT
96.995 -6.834 97.573 -6.834 QT
97.573 -6.24 L
93.667 -6.24 L
cp
f
GR
GS
[0.74962 0 0 0.74938 246.72282 23.24836] CT
0.149 GC
N
111.846 -6.053 M
110.814 -6.053 109.947 -6.592 QT
109.08 -7.131 108.58 -8.045 QT
108.08 -8.959 108.08 -9.974 QT
108.08 -10.959 108.533 -11.857 QT
108.986 -12.756 109.799 -13.31 QT
110.611 -13.865 111.611 -13.865 QT
112.377 -13.865 112.955 -13.599 QT
113.533 -13.334 113.908 -12.873 QT
114.283 -12.412 114.479 -11.779 QT
114.674 -11.146 114.674 -10.396 QT
114.674 -10.162 114.486 -10.162 QT
109.564 -10.162 L
109.564 -9.99 L
109.564 -8.568 110.135 -7.56 QT
110.705 -6.553 112.002 -6.553 QT
112.518 -6.553 112.963 -6.779 QT
113.408 -7.006 113.736 -7.428 QT
114.064 -7.849 114.174 -8.318 QT
114.189 -8.381 114.236 -8.42 QT
114.283 -8.459 114.346 -8.459 QT
114.486 -8.459 L
114.674 -8.459 114.674 -8.256 QT
114.424 -7.287 113.627 -6.67 QT
112.83 -6.053 111.846 -6.053 QT
cp
109.58 -10.584 M
113.471 -10.584 L
113.471 -11.224 113.291 -11.881 QT
113.111 -12.537 112.697 -12.974 QT
112.283 -13.412 111.611 -13.412 QT
110.643 -13.412 110.111 -12.514 QT
109.58 -11.615 109.58 -10.584 QT
cp
f
GR
GS
[0.74962 0 0 0.74938 246.72282 23.24836] CT
0.149 GC
N
117.003 -13.099 M
117.003 -13.178 117.065 -13.24 QT
117.721 -13.818 118.065 -14.599 QT
118.409 -15.381 118.409 -16.24 QT
118.409 -16.412 118.393 -16.49 QT
118.143 -16.162 117.674 -16.162 QT
117.284 -16.162 117.01 -16.435 QT
116.737 -16.709 116.737 -17.099 QT
116.737 -17.506 117.01 -17.771 QT
117.284 -18.037 117.674 -18.037 QT
118.096 -18.037 118.362 -17.756 QT
118.628 -17.474 118.737 -17.053 QT
118.846 -16.631 118.846 -16.24 QT
118.846 -15.303 118.448 -14.412 QT
118.049 -13.521 117.362 -12.912 QT
117.284 -12.865 117.253 -12.865 QT
117.159 -12.865 117.081 -12.943 QT
117.003 -13.021 117.003 -13.099 QT
cp
f
GR
GS
[0.74962 0 0 0.74938 246.72282 23.24836] CT
0.149 GC
N
126.408 -6.24 M
126.408 -6.834 L
127.001 -6.834 127.369 -6.928 QT
127.736 -7.021 127.736 -7.381 QT
127.736 -12.021 L
127.736 -12.474 127.603 -12.678 QT
127.47 -12.881 127.212 -12.928 QT
126.955 -12.974 126.408 -12.974 QT
126.408 -13.568 L
128.876 -13.756 L
128.876 -12.099 L
129.22 -12.818 129.892 -13.287 QT
130.564 -13.756 131.345 -13.756 QT
133.298 -13.756 133.642 -12.162 QT
133.986 -12.865 134.642 -13.31 QT
135.298 -13.756 136.08 -13.756 QT
136.845 -13.756 137.376 -13.506 QT
137.908 -13.256 138.173 -12.748 QT
138.439 -12.24 138.439 -11.459 QT
138.439 -7.381 L
138.439 -7.021 138.814 -6.928 QT
139.189 -6.834 139.767 -6.834 QT
139.767 -6.24 L
135.876 -6.24 L
135.876 -6.834 L
136.455 -6.834 136.83 -6.928 QT
137.205 -7.021 137.205 -7.381 QT
137.205 -11.412 L
137.205 -12.271 136.962 -12.795 QT
136.72 -13.318 135.97 -13.318 QT
134.986 -13.318 134.345 -12.529 QT
133.705 -11.74 133.705 -10.724 QT
133.705 -7.381 L
133.705 -7.021 134.08 -6.928 QT
134.455 -6.834 135.033 -6.834 QT
135.033 -6.24 L
131.142 -6.24 L
131.142 -6.834 L
131.72 -6.834 132.095 -6.928 QT
132.47 -7.021 132.47 -7.381 QT
132.47 -11.412 L
132.47 -12.24 132.228 -12.779 QT
131.986 -13.318 131.251 -13.318 QT
130.251 -13.318 129.619 -12.529 QT
128.986 -11.74 128.986 -10.724 QT
128.986 -7.381 L
128.986 -7.021 129.361 -6.928 QT
129.736 -6.834 130.314 -6.834 QT
130.314 -6.24 L
126.408 -6.24 L
cp
f
GR
GS
[0.74962 0 0 0.74938 246.72282 23.24836] CT
0.149 GC
N
144.602 -6.053 M
143.587 -6.053 142.712 -6.568 QT
141.837 -7.084 141.329 -7.959 QT
140.821 -8.834 140.821 -9.865 QT
140.821 -10.646 141.102 -11.365 QT
141.383 -12.084 141.899 -12.654 QT
142.415 -13.224 143.102 -13.545 QT
143.79 -13.865 144.602 -13.865 QT
145.649 -13.865 146.508 -13.31 QT
147.368 -12.756 147.868 -11.834 QT
148.368 -10.912 148.368 -9.865 QT
148.368 -8.834 147.86 -7.959 QT
147.352 -7.084 146.485 -6.568 QT
145.618 -6.053 144.602 -6.053 QT
cp
144.602 -6.553 M
145.962 -6.553 146.422 -7.537 QT
146.883 -8.521 146.883 -10.053 QT
146.883 -10.912 146.79 -11.467 QT
146.696 -12.021 146.383 -12.49 QT
146.196 -12.771 145.899 -12.982 QT
145.602 -13.193 145.274 -13.303 QT
144.946 -13.412 144.602 -13.412 QT
144.071 -13.412 143.594 -13.17 QT
143.118 -12.928 142.805 -12.49 QT
142.493 -12.006 142.399 -11.428 QT
142.305 -10.849 142.305 -10.053 QT
142.305 -9.099 142.477 -8.342 QT
142.649 -7.584 143.149 -7.068 QT
143.649 -6.553 144.602 -6.553 QT
cp
f
GR
GS
[0.74962 0 0 0.74938 246.72282 23.24836] CT
0.149 GC
N
153.657 -6.053 M
152.641 -6.053 151.813 -6.592 QT
150.985 -7.131 150.524 -8.021 QT
150.063 -8.912 150.063 -9.912 QT
150.063 -10.943 150.563 -11.826 QT
151.063 -12.709 151.93 -13.232 QT
152.797 -13.756 153.828 -13.756 QT
154.453 -13.756 155.008 -13.49 QT
155.563 -13.224 155.969 -12.771 QT
155.969 -16.303 L
155.969 -16.756 155.836 -16.959 QT
155.703 -17.162 155.446 -17.209 QT
155.188 -17.256 154.657 -17.256 QT
154.657 -17.849 L
157.172 -18.037 L
157.172 -7.787 L
157.172 -7.334 157.305 -7.131 QT
157.438 -6.928 157.696 -6.881 QT
157.953 -6.834 158.485 -6.834 QT
158.485 -6.24 L
155.922 -6.053 L
155.922 -7.115 L
155.485 -6.615 154.875 -6.334 QT
154.266 -6.053 153.657 -6.053 QT
cp
151.922 -7.724 M
152.203 -7.162 152.688 -6.826 QT
153.172 -6.49 153.75 -6.49 QT
154.453 -6.49 155.047 -6.904 QT
155.641 -7.318 155.922 -7.959 QT
155.922 -12.037 L
155.719 -12.412 155.422 -12.701 QT
155.125 -12.99 154.743 -13.154 QT
154.36 -13.318 153.938 -13.318 QT
153.047 -13.318 152.508 -12.81 QT
151.969 -12.303 151.758 -11.521 QT
151.547 -10.74 151.547 -9.896 QT
151.547 -9.209 151.618 -8.701 QT
151.688 -8.193 151.922 -7.724 QT
cp
f
GR
GS
[0.74962 0 0 0.74938 246.72282 23.24836] CT
0.149 GC
N
163.364 -6.053 M
162.333 -6.053 161.466 -6.592 QT
160.599 -7.131 160.099 -8.045 QT
159.599 -8.959 159.599 -9.974 QT
159.599 -10.959 160.052 -11.857 QT
160.505 -12.756 161.317 -13.31 QT
162.13 -13.865 163.13 -13.865 QT
163.896 -13.865 164.474 -13.599 QT
165.052 -13.334 165.427 -12.873 QT
165.802 -12.412 165.997 -11.779 QT
166.192 -11.146 166.192 -10.396 QT
166.192 -10.162 166.005 -10.162 QT
161.083 -10.162 L
161.083 -9.99 L
161.083 -8.568 161.653 -7.56 QT
162.224 -6.553 163.521 -6.553 QT
164.036 -6.553 164.482 -6.779 QT
164.927 -7.006 165.255 -7.428 QT
165.583 -7.849 165.692 -8.318 QT
165.708 -8.381 165.755 -8.42 QT
165.802 -8.459 165.864 -8.459 QT
166.005 -8.459 L
166.192 -8.459 166.192 -8.256 QT
165.942 -7.287 165.146 -6.67 QT
164.349 -6.053 163.364 -6.053 QT
cp
161.099 -10.584 M
164.989 -10.584 L
164.989 -11.224 164.81 -11.881 QT
164.63 -12.537 164.216 -12.974 QT
163.802 -13.412 163.13 -13.412 QT
162.161 -13.412 161.63 -12.514 QT
161.099 -11.615 161.099 -10.584 QT
cp
f
GR
GS
[0.74962 0 0 0.74938 246.72282 23.24836] CT
0.149 GC
N
167.349 -6.24 M
167.349 -6.834 L
167.943 -6.834 168.31 -6.928 QT
168.677 -7.021 168.677 -7.381 QT
168.677 -16.303 L
168.677 -16.756 168.545 -16.959 QT
168.412 -17.162 168.154 -17.209 QT
167.896 -17.256 167.349 -17.256 QT
167.349 -17.849 L
169.881 -18.037 L
169.881 -7.381 L
169.881 -7.021 170.256 -6.928 QT
170.631 -6.834 171.193 -6.834 QT
171.193 -6.24 L
167.349 -6.24 L
cp
f
GR
GS
[0.74962 0 0 0.74938 0 0.41731] CT
1 GC
N
83 125 M
305 125 L
305 43 L
83 43 L
cp
f
GR
GS
[0.74962 0 0 0.74938 0 0.41731] CT
0.873 GC
1 LJ
0.667 LW
N
96.875 125 M
96.875 43 L
S
GR
GS
[0.74962 0 0 0.74938 0 0.41731] CT
0.873 GC
1 LJ
0.667 LW
N
124.625 125 M
124.625 43 L
S
GR
GS
[0.74962 0 0 0.74938 0 0.41731] CT
0.873 GC
1 LJ
0.667 LW
N
152.375 125 M
152.375 43 L
S
GR
GS
[0.74962 0 0 0.74938 0 0.41731] CT
0.873 GC
1 LJ
0.667 LW
N
180.125 125 M
180.125 43 L
S
GR
GS
[0.74962 0 0 0.74938 0 0.41731] CT
0.873 GC
1 LJ
0.667 LW
N
207.875 125 M
207.875 43 L
S
GR
GS
[0.74962 0 0 0.74938 0 0.41731] CT
0.873 GC
1 LJ
0.667 LW
N
235.625 125 M
235.625 43 L
S
GR
GS
[0.74962 0 0 0.74938 0 0.41731] CT
0.873 GC
1 LJ
0.667 LW
N
263.375 125 M
263.375 43 L
S
GR
GS
[0.74962 0 0 0.74938 0 0.41731] CT
0.873 GC
1 LJ
0.667 LW
N
291.125 125 M
291.125 43 L
S
GR
GS
[0.74962 0 0 0.74938 0 0.41731] CT
0.775 GC
[1 3] 0 setdash
2 LJ
0.667 LW
N
305 115.225 M
83 115.225 L
S
GR
GS
[0.74962 0 0 0.74938 0 0.41731] CT
0.775 GC
[1 3] 0 setdash
2 LJ
0.667 LW
N
305 108.659 M
83 108.659 L
S
GR
GS
[0.74962 0 0 0.74938 0 0.41731] CT
0.775 GC
[1 3] 0 setdash
2 LJ
0.667 LW
N
305 102.093 M
83 102.093 L
S
GR
GS
[0.74962 0 0 0.74938 0 0.41731] CT
0.775 GC
[1 3] 0 setdash
2 LJ
0.667 LW
N
305 88.961 M
83 88.961 L
S
GR
GS
[0.74962 0 0 0.74938 0 0.41731] CT
0.775 GC
[1 3] 0 setdash
2 LJ
0.667 LW
N
305 82.395 M
83 82.395 L
S
GR
GS
[0.74962 0 0 0.74938 0 0.41731] CT
0.775 GC
[1 3] 0 setdash
2 LJ
0.667 LW
N
305 75.829 M
83 75.829 L
S
GR
GS
[0.74962 0 0 0.74938 0 0.41731] CT
0.775 GC
[1 3] 0 setdash
2 LJ
0.667 LW
N
305 62.698 M
83 62.698 L
S
GR
GS
[0.74962 0 0 0.74938 0 0.41731] CT
0.775 GC
[1 3] 0 setdash
2 LJ
0.667 LW
N
305 56.132 M
83 56.132 L
S
GR
GS
[0.74962 0 0 0.74938 0 0.41731] CT
0.775 GC
[1 3] 0 setdash
2 LJ
0.667 LW
N
305 49.566 M
83 49.566 L
S
GR
GS
[0.74962 0 0 0.74938 0 0.41731] CT
0.873 GC
1 LJ
0.667 LW
N
305 121.791 M
83 121.791 L
S
GR
GS
[0.74962 0 0 0.74938 0 0.41731] CT
0.873 GC
1 LJ
0.667 LW
N
305 95.527 M
83 95.527 L
S
GR
GS
[0.74962 0 0 0.74938 0 0.41731] CT
0.873 GC
1 LJ
0.667 LW
N
305 69.264 M
83 69.264 L
S
GR
GS
[0.74962 0 0 0.74938 0 0.41731] CT
0.873 GC
1 LJ
0.667 LW
N
305 43 M
83 43 L
S
GR
GS
[0.74962 0 0 0.74938 0 0.41731] CT
0.149 GC
2 setlinecap
1 LJ
0.667 LW
N
83 125 M
305 125 L
S
GR
GS
[0.74962 0 0 0.74938 0 0.41731] CT
0.149 GC
2 setlinecap
1 LJ
0.667 LW
N
96.875 125 M
96.875 122.78 L
S
GR
GS
[0.74962 0 0 0.74938 0 0.41731] CT
0.149 GC
2 setlinecap
1 LJ
0.667 LW
N
124.625 125 M
124.625 122.78 L
S
GR
GS
[0.74962 0 0 0.74938 0 0.41731] CT
0.149 GC
2 setlinecap
1 LJ
0.667 LW
N
152.375 125 M
152.375 122.78 L
S
GR
GS
[0.74962 0 0 0.74938 0 0.41731] CT
0.149 GC
2 setlinecap
1 LJ
0.667 LW
N
180.125 125 M
180.125 122.78 L
S
GR
GS
[0.74962 0 0 0.74938 0 0.41731] CT
0.149 GC
2 setlinecap
1 LJ
0.667 LW
N
207.875 125 M
207.875 122.78 L
S
GR
GS
[0.74962 0 0 0.74938 0 0.41731] CT
0.149 GC
2 setlinecap
1 LJ
0.667 LW
N
235.625 125 M
235.625 122.78 L
S
GR
GS
[0.74962 0 0 0.74938 0 0.41731] CT
0.149 GC
2 setlinecap
1 LJ
0.667 LW
N
263.375 125 M
263.375 122.78 L
S
GR
GS
[0.74962 0 0 0.74938 0 0.41731] CT
0.149 GC
2 setlinecap
1 LJ
0.667 LW
N
291.125 125 M
291.125 122.78 L
S
GR
GS
[0.74962 0 0 0.74938 0 0.41731] CT
0.149 GC
2 setlinecap
1 LJ
0.667 LW
N
83 125 M
83 43 L
S
GR
GS
[0.74962 0 0 0.74938 0 0.41731] CT
0.149 GC
2 setlinecap
1 LJ
0.667 LW
N
83 121.791 M
85.22 121.791 L
S
GR
GS
[0.74962 0 0 0.74938 0 0.41731] CT
0.149 GC
2 setlinecap
1 LJ
0.667 LW
N
83 95.527 M
85.22 95.527 L
S
GR
GS
[0.74962 0 0 0.74938 0 0.41731] CT
0.149 GC
2 setlinecap
1 LJ
0.667 LW
N
83 69.264 M
85.22 69.264 L
S
GR
GS
[0.74962 0 0 0.74938 0 0.41731] CT
0.149 GC
2 setlinecap
1 LJ
0.667 LW
N
83 43 M
85.22 43 L
S
GR
GS
[0.74962 0 0 0.74938 60.01967 91.68455] CT
0.149 GC
/Helvetica 11.333 F
GS
[1 0 0 1 0 0] CT
-16 4.5 moveto 
1 -1 scale
(0.8) t 
GR
GR
GS
[0.74962 0 0 0.74938 60.01967 72.00323] CT
0.149 GC
/Helvetica 11.333 F
GS
[1 0 0 1 0 0] CT
-7 4.5 moveto 
1 -1 scale
(1) t 
GR
GR
GS
[0.74962 0 0 0.74938 60.01967 52.32189] CT
0.149 GC
/Helvetica 11.333 F
GS
[1 0 0 1 0 0] CT
-16 4.5 moveto 
1 -1 scale
(1.2) t 
GR
GR
GS
[0.74962 0 0 0.74938 60.01967 32.64057] CT
0.149 GC
/Helvetica 11.333 F
GS
[1 0 0 1 0 0] CT
-16 4.5 moveto 
1 -1 scale
(1.4) t 
GR
GR
GS
[0 -0.74938 0.74962 0 46.52649 63.36504] CT
0.149 GC
N
-3.038 -4.347 M
-3.804 -4.347 -4.241 -4.926 QT
-4.679 -5.504 -4.679 -6.269 QT
-4.679 -7.051 -4.28 -7.871 QT
-3.882 -8.691 -3.202 -9.238 QT
-2.522 -9.785 -1.741 -9.785 QT
-1.397 -9.785 -1.108 -9.59 QT
-0.819 -9.394 -0.663 -9.066 QT
0.009 -11.754 L
0.056 -11.957 0.071 -12.066 QT
0.071 -12.269 -0.71 -12.269 QT
-0.835 -12.269 -0.835 -12.426 QT
-0.835 -12.457 -0.811 -12.527 QT
-0.788 -12.597 -0.757 -12.644 QT
-0.725 -12.691 -0.663 -12.691 QT
0.946 -12.816 L
1.103 -12.816 1.103 -12.66 QT
-0.632 -5.754 L
-0.71 -5.566 -0.71 -5.191 QT
-0.71 -4.676 -0.366 -4.676 QT
0.009 -4.676 0.204 -5.152 QT
0.4 -5.629 0.54 -6.254 QT
0.556 -6.316 0.634 -6.316 QT
0.775 -6.316 L
0.821 -6.316 0.853 -6.277 QT
0.884 -6.238 0.884 -6.207 QT
0.665 -5.363 0.415 -4.855 QT
0.165 -4.347 -0.397 -4.347 QT
-0.788 -4.347 -1.1 -4.59 QT
-1.413 -4.832 -1.491 -5.222 QT
-2.272 -4.347 -3.038 -4.347 QT
cp
-3.038 -4.676 M
-2.6 -4.676 -2.194 -4.996 QT
-1.788 -5.316 -1.491 -5.754 QT
-1.475 -5.769 -1.475 -5.801 QT
-0.819 -8.457 L
-0.897 -8.879 -1.139 -9.183 QT
-1.382 -9.488 -1.772 -9.488 QT
-2.179 -9.488 -2.53 -9.152 QT
-2.882 -8.816 -3.116 -8.363 QT
-3.35 -7.894 -3.561 -7.051 QT
-3.772 -6.207 -3.772 -5.754 QT
-3.772 -5.332 -3.593 -5.004 QT
-3.413 -4.676 -3.038 -4.676 QT
cp
f
GR
GS
[0 -0.74938 0.74962 0 46.52649 63.36504] CT
0.149 GC
N
1.92 -3.352 M
1.92 -3.477 1.935 -3.602 QT
2.591 -6.181 L
1.654 -6.181 L
1.56 -6.181 1.56 -6.306 QT
1.591 -6.493 1.67 -6.493 QT
2.67 -6.493 L
3.029 -7.962 L
3.06 -8.087 3.17 -8.173 QT
3.279 -8.259 3.404 -8.259 QT
3.529 -8.259 3.607 -8.188 QT
3.685 -8.118 3.685 -8.009 QT
3.685 -7.977 3.677 -7.962 QT
3.67 -7.946 3.67 -7.931 QT
3.31 -6.493 L
4.232 -6.493 L
4.326 -6.493 4.326 -6.384 QT
4.326 -6.352 4.31 -6.306 QT
4.295 -6.259 4.271 -6.22 QT
4.248 -6.181 4.216 -6.181 QT
3.232 -6.181 L
2.576 -3.587 L
2.513 -3.321 2.513 -3.134 QT
2.513 -2.759 2.779 -2.759 QT
3.17 -2.759 3.482 -3.126 QT
3.795 -3.493 3.951 -3.946 QT
3.982 -3.993 4.013 -3.993 QT
4.123 -3.993 L
4.17 -3.993 4.193 -3.97 QT
4.216 -3.946 4.216 -3.915 QT
4.216 -3.899 4.201 -3.884 QT
3.998 -3.337 3.623 -2.931 QT
3.248 -2.524 2.763 -2.524 QT
2.404 -2.524 2.162 -2.751 QT
1.92 -2.977 1.92 -3.352 QT
cp
f
GR
GS
[0.74962 0 0 0.74938 0 0.41731] CT
0 0 1 RC
[10 6] 0 setdash
2 LJ
1.667 LW
N
96.875 120.009 M
291.125 120.009 L
S
GR
GS
[0.74962 0 0 0.74938 72.61955 54.38854] CT
0 0 1 RC
10.0 ML
0.667 LW
N
0 -4 M
0 4 L
-4 0 M
4 0 L
-2.828 -2.828 M
2.828 2.828 L
-2.828 2.828 M
2.828 -2.828 L
S
GR
GS
[0.74962 0 0 0.74938 93.42154 35.13985] CT
0 0 1 RC
10.0 ML
0.667 LW
N
0 -4 M
0 4 L
-4 0 M
4 0 L
-2.828 -2.828 M
2.828 2.828 L
-2.828 2.828 M
2.828 -2.828 L
S
GR
GS
[0.74962 0 0 0.74938 114.22353 62.45445] CT
0 0 1 RC
10.0 ML
0.667 LW
N
0 -4 M
0 4 L
-4 0 M
4 0 L
-2.828 -2.828 M
2.828 2.828 L
-2.828 2.828 M
2.828 -2.828 L
S
GR
GS
[0.74962 0 0 0.74938 135.02551 94.08957] CT
0 0 1 RC
10.0 ML
0.667 LW
N
0 -4 M
0 4 L
-4 0 M
4 0 L
-2.828 -2.828 M
2.828 2.828 L
-2.828 2.828 M
2.828 -2.828 L
S
GR
GS
[0.74962 0 0 0.74938 155.8275 84.32334] CT
0 0 1 RC
10.0 ML
0.667 LW
N
0 -4 M
0 4 L
-4 0 M
4 0 L
-2.828 -2.828 M
2.828 2.828 L
-2.828 2.828 M
2.828 -2.828 L
S
GR
GS
[0.74962 0 0 0.74938 176.62949 93.41659] CT
0 0 1 RC
10.0 ML
0.667 LW
N
0 -4 M
0 4 L
-4 0 M
4 0 L
-2.828 -2.828 M
2.828 2.828 L
-2.828 2.828 M
2.828 -2.828 L
S
GR
GS
[0.74962 0 0 0.74938 197.43148 91.87359] CT
0 0 1 RC
10.0 ML
0.667 LW
N
0 -4 M
0 4 L
-4 0 M
4 0 L
-2.828 -2.828 M
2.828 2.828 L
-2.828 2.828 M
2.828 -2.828 L
S
GR
GS
[0.74962 0 0 0.74938 218.23346 88.04505] CT
0 0 1 RC
10.0 ML
0.667 LW
N
0 -4 M
0 4 L
-4 0 M
4 0 L
-2.828 -2.828 M
2.828 2.828 L
-2.828 2.828 M
2.828 -2.828 L
S
GR
GS
[0.74962 0 0 0.74938 0 0.41731] CT
1 GC
N
294 84 M
294 54 L
199 54 L
199 84 L
cp
f
GR
GS
[0.74962 0 0 0.74938 184.4618 47.15759] CT
N
0.281 2.56 M
0.281 2.169 L
1.469 2.169 1.469 1.826 QT
1.469 -4.221 L
1.469 -4.565 0.281 -4.565 QT
0.281 -4.956 L
3.688 -4.956 L
3.688 -4.565 L
2.5 -4.565 2.5 -4.221 QT
2.5 1.826 L
2.5 2.169 3.688 2.169 QT
3.688 2.56 L
0.281 2.56 L
cp
f
GR
GS
[0.74962 0 0 0.74938 184.4618 47.15759] CT
N
6.539 2.685 M
5.883 2.685 5.352 2.333 QT
4.821 1.982 4.516 1.404 QT
4.211 0.826 4.211 0.185 QT
4.211 -0.487 4.539 -1.057 QT
4.867 -1.628 5.422 -1.963 QT
5.977 -2.299 6.649 -2.299 QT
7.055 -2.299 7.414 -2.128 QT
7.774 -1.956 8.039 -1.659 QT
8.039 -3.956 L
8.039 -4.253 7.953 -4.378 QT
7.867 -4.503 7.703 -4.534 QT
7.539 -4.565 7.18 -4.565 QT
7.18 -4.956 L
8.821 -5.065 L
8.821 1.56 L
8.821 1.857 8.907 1.982 QT
8.992 2.107 9.157 2.138 QT
9.321 2.169 9.664 2.169 QT
9.664 2.56 L
8.008 2.685 L
8.008 1.997 L
7.727 2.326 7.336 2.505 QT
6.946 2.685 6.539 2.685 QT
cp
5.414 1.607 M
5.602 1.966 5.914 2.177 QT
6.227 2.388 6.602 2.388 QT
7.055 2.388 7.438 2.13 QT
7.821 1.872 8.008 1.451 QT
8.008 -1.19 L
7.883 -1.424 7.688 -1.62 QT
7.492 -1.815 7.242 -1.917 QT
6.992 -2.018 6.727 -2.018 QT
6.149 -2.018 5.797 -1.69 QT
5.446 -1.362 5.313 -0.862 QT
5.18 -0.362 5.18 0.201 QT
5.18 0.638 5.219 0.966 QT
5.258 1.294 5.414 1.607 QT
cp
f
GR
GS
[0.74962 0 0 0.74938 184.4618 47.15759] CT
N
12.512 2.685 M
11.84 2.685 11.286 2.333 QT
10.731 1.982 10.411 1.396 QT
10.09 0.81 10.09 0.154 QT
10.09 -0.503 10.379 -1.081 QT
10.668 -1.659 11.192 -2.018 QT
11.715 -2.378 12.356 -2.378 QT
12.872 -2.378 13.239 -2.206 QT
13.606 -2.034 13.848 -1.729 QT
14.09 -1.424 14.215 -1.018 QT
14.34 -0.612 14.34 -0.128 QT
14.34 0.013 14.231 0.013 QT
11.043 0.013 L
11.043 0.138 L
11.043 1.044 11.411 1.701 QT
11.778 2.357 12.622 2.357 QT
12.95 2.357 13.239 2.208 QT
13.528 2.06 13.739 1.794 QT
13.95 1.529 14.028 1.216 QT
14.043 1.185 14.067 1.154 QT
14.09 1.122 14.137 1.122 QT
14.231 1.122 L
14.34 1.122 14.34 1.263 QT
14.184 1.888 13.668 2.287 QT
13.153 2.685 12.512 2.685 QT
cp
11.059 -0.253 M
13.559 -0.253 L
13.559 -0.674 13.45 -1.096 QT
13.34 -1.518 13.067 -1.799 QT
12.793 -2.081 12.356 -2.081 QT
11.731 -2.081 11.395 -1.495 QT
11.059 -0.909 11.059 -0.253 QT
cp
f
GR
GS
[0.74962 0 0 0.74938 184.4618 47.15759] CT
N
14.847 2.56 M
14.847 2.169 L
15.222 2.169 15.464 2.115 QT
15.706 2.06 15.706 1.826 QT
15.706 -1.174 L
15.706 -1.471 15.62 -1.604 QT
15.534 -1.737 15.362 -1.768 QT
15.19 -1.799 14.847 -1.799 QT
14.847 -2.19 L
16.44 -2.299 L
16.44 -1.221 L
16.659 -1.706 17.097 -2.003 QT
17.534 -2.299 18.034 -2.299 QT
18.8 -2.299 19.183 -1.932 QT
19.565 -1.565 19.565 -0.815 QT
19.565 1.826 L
19.565 2.06 19.808 2.115 QT
20.05 2.169 20.425 2.169 QT
20.425 2.56 L
17.909 2.56 L
17.909 2.169 L
18.284 2.169 18.526 2.115 QT
18.769 2.06 18.769 1.826 QT
18.769 -0.784 L
18.769 -1.331 18.612 -1.674 QT
18.456 -2.018 17.972 -2.018 QT
17.331 -2.018 16.925 -1.51 QT
16.519 -1.003 16.519 -0.346 QT
16.519 1.826 L
16.519 2.06 16.753 2.115 QT
16.987 2.169 17.362 2.169 QT
17.362 2.56 L
14.847 2.56 L
cp
f
GR
GS
[0.74962 0 0 0.74938 184.4618 47.15759] CT
N
21.273 1.232 M
21.273 -1.799 L
20.351 -1.799 L
20.351 -2.081 L
21.07 -2.081 21.414 -2.753 QT
21.758 -3.424 21.758 -4.206 QT
22.07 -4.206 L
22.07 -2.19 L
23.617 -2.19 L
23.617 -1.799 L
22.07 -1.799 L
22.07 1.216 L
22.07 1.669 22.226 2.013 QT
22.383 2.357 22.773 2.357 QT
23.148 2.357 23.312 1.997 QT
23.476 1.638 23.476 1.216 QT
23.476 0.56 L
23.804 0.56 L
23.804 1.232 L
23.804 1.576 23.679 1.912 QT
23.554 2.247 23.304 2.466 QT
23.054 2.685 22.695 2.685 QT
22.039 2.685 21.656 2.287 QT
21.273 1.888 21.273 1.232 QT
cp
f
GR
GS
[0.74962 0 0 0.74938 184.4618 47.15759] CT
N
24.64 2.56 M
24.64 2.169 L
25.015 2.169 25.257 2.115 QT
25.499 2.06 25.499 1.826 QT
25.499 -1.174 L
25.499 -1.596 25.335 -1.698 QT
25.171 -1.799 24.687 -1.799 QT
24.687 -2.19 L
26.265 -2.299 L
26.265 1.826 L
26.265 2.06 26.476 2.115 QT
26.687 2.169 27.031 2.169 QT
27.031 2.56 L
24.64 2.56 L
cp
25.109 -4.19 M
25.109 -4.44 25.289 -4.62 QT
25.468 -4.799 25.703 -4.799 QT
25.859 -4.799 26.007 -4.721 QT
26.156 -4.643 26.234 -4.495 QT
26.312 -4.346 26.312 -4.19 QT
26.312 -3.956 26.132 -3.776 QT
25.953 -3.596 25.703 -3.596 QT
25.468 -3.596 25.289 -3.776 QT
25.109 -3.956 25.109 -4.19 QT
cp
f
GR
GS
[0.74962 0 0 0.74938 184.4618 47.15759] CT
N
27.541 2.56 M
27.541 2.169 L
27.916 2.169 28.158 2.115 QT
28.4 2.06 28.4 1.826 QT
28.4 -1.799 L
27.556 -1.799 L
27.556 -2.19 L
28.4 -2.19 L
28.4 -3.503 L
28.4 -3.924 28.634 -4.245 QT
28.869 -4.565 29.244 -4.776 QT
29.619 -4.987 30.048 -5.088 QT
30.478 -5.19 30.853 -5.19 QT
31.181 -5.19 31.501 -5.057 QT
31.822 -4.924 32.017 -4.667 QT
32.212 -4.409 32.212 -4.065 QT
32.212 -3.846 32.056 -3.69 QT
31.9 -3.534 31.681 -3.534 QT
31.447 -3.534 31.298 -3.682 QT
31.15 -3.831 31.15 -4.065 QT
31.15 -4.268 31.298 -4.432 QT
31.447 -4.596 31.65 -4.596 QT
31.306 -4.909 30.759 -4.909 QT
30.369 -4.909 29.994 -4.729 QT
29.619 -4.549 29.376 -4.221 QT
29.134 -3.893 29.134 -3.471 QT
29.134 -2.19 L
30.587 -2.19 L
32.228 -2.315 L
32.228 1.826 L
32.228 2.06 32.47 2.115 QT
32.712 2.169 33.072 2.169 QT
33.072 2.56 L
30.587 2.56 L
30.587 2.169 L
30.962 2.169 31.205 2.115 QT
31.447 2.06 31.447 1.826 QT
31.447 -1.206 L
31.447 -1.424 31.423 -1.534 QT
31.4 -1.643 31.314 -1.706 QT
31.228 -1.768 31.025 -1.799 QT
29.166 -1.799 L
29.166 1.826 L
29.166 2.06 29.416 2.115 QT
29.666 2.169 30.025 2.169 QT
30.025 2.56 L
27.541 2.56 L
cp
f
GR
GS
[0.74962 0 0 0.74938 184.4618 47.15759] CT
N
35.92 2.685 M
35.248 2.685 34.693 2.333 QT
34.138 1.982 33.818 1.396 QT
33.498 0.81 33.498 0.154 QT
33.498 -0.503 33.787 -1.081 QT
34.076 -1.659 34.599 -2.018 QT
35.123 -2.378 35.763 -2.378 QT
36.279 -2.378 36.646 -2.206 QT
37.013 -2.034 37.256 -1.729 QT
37.498 -1.424 37.623 -1.018 QT
37.748 -0.612 37.748 -0.128 QT
37.748 0.013 37.638 0.013 QT
34.451 0.013 L
34.451 0.138 L
34.451 1.044 34.818 1.701 QT
35.185 2.357 36.029 2.357 QT
36.357 2.357 36.646 2.208 QT
36.935 2.06 37.146 1.794 QT
37.357 1.529 37.435 1.216 QT
37.451 1.185 37.474 1.154 QT
37.498 1.122 37.545 1.122 QT
37.638 1.122 L
37.748 1.122 37.748 1.263 QT
37.592 1.888 37.076 2.287 QT
36.56 2.685 35.92 2.685 QT
cp
34.467 -0.253 M
36.967 -0.253 L
36.967 -0.674 36.857 -1.096 QT
36.748 -1.518 36.474 -1.799 QT
36.201 -2.081 35.763 -2.081 QT
35.138 -2.081 34.802 -1.495 QT
34.467 -0.909 34.467 -0.253 QT
cp
f
GR
GS
[0.74962 0 0 0.74938 184.4618 47.15759] CT
N
40.613 2.685 M
39.957 2.685 39.426 2.333 QT
38.895 1.982 38.59 1.404 QT
38.285 0.826 38.285 0.185 QT
38.285 -0.487 38.613 -1.057 QT
38.942 -1.628 39.496 -1.963 QT
40.051 -2.299 40.723 -2.299 QT
41.129 -2.299 41.488 -2.128 QT
41.848 -1.956 42.113 -1.659 QT
42.113 -3.956 L
42.113 -4.253 42.028 -4.378 QT
41.942 -4.503 41.778 -4.534 QT
41.613 -4.565 41.254 -4.565 QT
41.254 -4.956 L
42.895 -5.065 L
42.895 1.56 L
42.895 1.857 42.981 1.982 QT
43.067 2.107 43.231 2.138 QT
43.395 2.169 43.738 2.169 QT
43.738 2.56 L
42.082 2.685 L
42.082 1.997 L
41.801 2.326 41.41 2.505 QT
41.02 2.685 40.613 2.685 QT
cp
39.488 1.607 M
39.676 1.966 39.988 2.177 QT
40.301 2.388 40.676 2.388 QT
41.129 2.388 41.512 2.13 QT
41.895 1.872 42.082 1.451 QT
42.082 -1.19 L
41.957 -1.424 41.762 -1.62 QT
41.567 -1.815 41.317 -1.917 QT
41.067 -2.018 40.801 -2.018 QT
40.223 -2.018 39.871 -1.69 QT
39.52 -1.362 39.387 -0.862 QT
39.254 -0.362 39.254 0.201 QT
39.254 0.638 39.293 0.966 QT
39.332 1.294 39.488 1.607 QT
cp
f
GR
GS
[0.74962 0 0 0.74938 167.1936 47.15759] CT
0 0 1 RC
10.0 ML
0.667 LW
N
0 -4 M
0 4 L
-4 0 M
4 0 L
-2.828 -2.828 M
2.828 2.828 L
-2.828 2.828 M
2.828 -2.828 L
S
GR
GS
[0.74962 0 0 0.74938 184.4618 57.0912] CT
N
0.391 2.56 M
0.391 2.169 L
1.516 2.169 1.516 1.529 QT
1.516 -4.221 L
1.516 -4.565 0.391 -4.565 QT
0.391 -4.956 L
2.469 -4.956 L
2.594 -4.956 2.641 -4.831 QT
5.031 1.388 L
7.438 -4.831 L
7.484 -4.956 7.609 -4.956 QT
9.688 -4.956 L
9.688 -4.565 L
8.563 -4.565 8.563 -4.221 QT
8.563 1.826 L
8.563 2.169 9.688 2.169 QT
9.688 2.56 L
6.484 2.56 L
6.484 2.169 L
7.625 2.169 7.625 1.826 QT
7.625 -4.581 L
4.922 2.435 L
4.859 2.56 4.734 2.56 QT
4.594 2.56 4.547 2.435 QT
1.875 -4.487 L
1.875 1.529 L
1.875 2.169 3 2.169 QT
3 2.56 L
0.391 2.56 L
cp
f
GR
GS
[0.74962 0 0 0.74938 184.4618 57.0912] CT
N
/f873988117{12.512 2.685 M
11.84 2.685 11.286 2.333 QT
10.731 1.982 10.411 1.396 QT
10.09 0.81 10.09 0.154 QT
10.09 -0.503 10.379 -1.081 QT
10.668 -1.659 11.192 -2.018 QT
11.715 -2.378 12.356 -2.378 QT
12.872 -2.378 13.239 -2.206 QT
13.606 -2.034 13.848 -1.729 QT
14.09 -1.424 14.215 -1.018 QT
14.34 -0.612 14.34 -0.128 QT
14.34 0.013 14.231 0.013 QT
11.043 0.013 L
11.043 0.138 L
11.043 1.044 11.411 1.701 QT
11.778 2.357 12.622 2.357 QT
12.95 2.357 13.239 2.208 QT
13.528 2.06 13.739 1.794 QT
13.95 1.529 14.028 1.216 QT
14.043 1.185 14.067 1.154 QT
14.09 1.122 14.137 1.122 QT
14.231 1.122 L
14.34 1.122 14.34 1.263 QT
14.184 1.888 13.668 2.287 QT
13.153 2.685 12.512 2.685 QT
cp
11.059 -0.253 M
13.559 -0.253 L
13.559 -0.674 13.45 -1.096 QT
13.34 -1.518 13.067 -1.799 QT
12.793 -2.081 12.356 -2.081 QT
11.731 -2.081 11.395 -1.495 QT
11.059 -0.909 11.059 -0.253 QT
cp}def
f873988117
f
GR
GS
[0.74962 0 0 0.74938 184.4618 57.0912] CT
N
/f254978038{14.956 1.482 M
14.956 0.826 15.472 0.412 QT
15.987 -0.003 16.714 -0.167 QT
17.44 -0.331 18.081 -0.331 QT
18.081 -0.784 L
18.081 -1.096 17.94 -1.401 QT
17.8 -1.706 17.542 -1.893 QT
17.284 -2.081 16.956 -2.081 QT
16.237 -2.081 15.847 -1.753 QT
16.065 -1.753 16.198 -1.596 QT
16.331 -1.44 16.331 -1.221 QT
16.331 -1.003 16.175 -0.846 QT
16.019 -0.69 15.815 -0.69 QT
15.581 -0.69 15.425 -0.846 QT
15.269 -1.003 15.269 -1.221 QT
15.269 -1.799 15.8 -2.088 QT
16.331 -2.378 16.956 -2.378 QT
17.409 -2.378 17.862 -2.182 QT
18.315 -1.987 18.597 -1.635 QT
18.878 -1.284 18.878 -0.815 QT
18.878 1.669 L
18.878 1.888 18.972 2.068 QT
19.065 2.247 19.269 2.247 QT
19.44 2.247 19.534 2.06 QT
19.628 1.872 19.628 1.669 QT
19.628 0.966 L
19.94 0.966 L
19.94 1.669 L
19.94 1.919 19.815 2.138 QT
19.69 2.357 19.472 2.49 QT
19.253 2.622 19.003 2.622 QT
18.675 2.622 18.44 2.372 QT
18.206 2.122 18.175 1.779 QT
17.972 2.201 17.581 2.443 QT
17.19 2.685 16.737 2.685 QT
16.315 2.685 15.909 2.56 QT
15.503 2.435 15.229 2.169 QT
14.956 1.904 14.956 1.482 QT
cp
15.847 1.482 M
15.847 1.872 16.136 2.13 QT
16.425 2.388 16.8 2.388 QT
17.159 2.388 17.448 2.216 QT
17.737 2.044 17.909 1.732 QT
18.081 1.419 18.081 1.091 QT
18.081 -0.049 L
17.581 -0.049 17.058 0.115 QT
16.534 0.279 16.19 0.622 QT
15.847 0.966 15.847 1.482 QT
cp}def
f254978038
f
GR
GS
[0.74962 0 0 0.74938 184.4618 57.0912] CT
N
/f125226543{20.18 2.56 M
20.18 2.169 L
20.555 2.169 20.797 2.115 QT
21.039 2.06 21.039 1.826 QT
21.039 -1.174 L
21.039 -1.471 20.953 -1.604 QT
20.868 -1.737 20.696 -1.768 QT
20.524 -1.799 20.18 -1.799 QT
20.18 -2.19 L
21.774 -2.299 L
21.774 -1.221 L
21.993 -1.706 22.43 -2.003 QT
22.868 -2.299 23.368 -2.299 QT
24.133 -2.299 24.516 -1.932 QT
24.899 -1.565 24.899 -0.815 QT
24.899 1.826 L
24.899 2.06 25.141 2.115 QT
25.383 2.169 25.758 2.169 QT
25.758 2.56 L
23.243 2.56 L
23.243 2.169 L
23.618 2.169 23.86 2.115 QT
24.102 2.06 24.102 1.826 QT
24.102 -0.784 L
24.102 -1.331 23.946 -1.674 QT
23.789 -2.018 23.305 -2.018 QT
22.664 -2.018 22.258 -1.51 QT
21.852 -1.003 21.852 -0.346 QT
21.852 1.826 L
21.852 2.06 22.086 2.115 QT
22.321 2.169 22.696 2.169 QT
22.696 2.56 L
20.18 2.56 L
cp}def
f125226543
f
GR
GS
[0.74962 0 0 0.74938 0 0.41731] CT
0 0 1 RC
[10 6] 0 setdash
2 LJ
1.667 LW
N
203.006 75.628 M
243.069 75.628 L
S
GR
GS
[0.74962 0 0 0.74938 0 0.41731] CT
0.149 GC
10.0 ML
0.667 LW
N
199 84 M
199 54 L
294 54 L
294 84 L
cp
S
GR
GS
[0.74962 0 0 0.74938 0 0.41731] CT
1 GC
N
353 125 M
576 125 L
576 43 L
353 43 L
cp
f
GR
GS
[0.74962 0 0 0.74938 0 0.41731] CT
0.873 GC
1 LJ
0.667 LW
N
366.938 125 M
366.938 43 L
S
GR
GS
[0.74962 0 0 0.74938 0 0.41731] CT
0.873 GC
1 LJ
0.667 LW
N
394.813 125 M
394.813 43 L
S
GR
GS
[0.74962 0 0 0.74938 0 0.41731] CT
0.873 GC
1 LJ
0.667 LW
N
422.688 125 M
422.688 43 L
S
GR
GS
[0.74962 0 0 0.74938 0 0.41731] CT
0.873 GC
1 LJ
0.667 LW
N
450.563 125 M
450.563 43 L
S
GR
GS
[0.74962 0 0 0.74938 0 0.41731] CT
0.873 GC
1 LJ
0.667 LW
N
478.438 125 M
478.438 43 L
S
GR
GS
[0.74962 0 0 0.74938 0 0.41731] CT
0.873 GC
1 LJ
0.667 LW
N
506.313 125 M
506.313 43 L
S
GR
GS
[0.74962 0 0 0.74938 0 0.41731] CT
0.873 GC
1 LJ
0.667 LW
N
534.188 125 M
534.188 43 L
S
GR
GS
[0.74962 0 0 0.74938 0 0.41731] CT
0.873 GC
1 LJ
0.667 LW
N
562.063 125 M
562.063 43 L
S
GR
GS
[0.74962 0 0 0.74938 0 0.41731] CT
0.775 GC
[1 3] 0 setdash
2 LJ
0.667 LW
N
576 119.938 M
353 119.938 L
S
GR
GS
[0.74962 0 0 0.74938 0 0.41731] CT
0.775 GC
[1 3] 0 setdash
2 LJ
0.667 LW
N
576 114.343 M
353 114.343 L
S
GR
GS
[0.74962 0 0 0.74938 0 0.41731] CT
0.775 GC
[1 3] 0 setdash
2 LJ
0.667 LW
N
576 103.153 M
353 103.153 L
S
GR
GS
[0.74962 0 0 0.74938 0 0.41731] CT
0.775 GC
[1 3] 0 setdash
2 LJ
0.667 LW
N
576 97.558 M
353 97.558 L
S
GR
GS
[0.74962 0 0 0.74938 0 0.41731] CT
0.775 GC
[1 3] 0 setdash
2 LJ
0.667 LW
N
576 91.963 M
353 91.963 L
S
GR
GS
[0.74962 0 0 0.74938 0 0.41731] CT
0.775 GC
[1 3] 0 setdash
2 LJ
0.667 LW
N
576 86.368 M
353 86.368 L
S
GR
GS
[0.74962 0 0 0.74938 0 0.41731] CT
0.775 GC
[1 3] 0 setdash
2 LJ
0.667 LW
N
576 75.178 M
353 75.178 L
S
GR
GS
[0.74962 0 0 0.74938 0 0.41731] CT
0.775 GC
[1 3] 0 setdash
2 LJ
0.667 LW
N
576 69.583 M
353 69.583 L
S
GR
GS
[0.74962 0 0 0.74938 0 0.41731] CT
0.775 GC
[1 3] 0 setdash
2 LJ
0.667 LW
N
576 63.988 M
353 63.988 L
S
GR
GS
[0.74962 0 0 0.74938 0 0.41731] CT
0.775 GC
[1 3] 0 setdash
2 LJ
0.667 LW
N
576 58.393 M
353 58.393 L
S
GR
GS
[0.74962 0 0 0.74938 0 0.41731] CT
0.775 GC
[1 3] 0 setdash
2 LJ
0.667 LW
N
576 47.203 M
353 47.203 L
S
GR
GS
[0.74962 0 0 0.74938 0 0.41731] CT
0.873 GC
1 LJ
0.667 LW
N
576 108.748 M
353 108.748 L
S
GR
GS
[0.74962 0 0 0.74938 0 0.41731] CT
0.873 GC
1 LJ
0.667 LW
N
576 80.773 M
353 80.773 L
S
GR
GS
[0.74962 0 0 0.74938 0 0.41731] CT
0.873 GC
1 LJ
0.667 LW
N
576 52.798 M
353 52.798 L
S
GR
GS
[0.74962 0 0 0.74938 0 0.41731] CT
0.149 GC
2 setlinecap
1 LJ
0.667 LW
N
353 125 M
576 125 L
S
GR
GS
[0.74962 0 0 0.74938 0 0.41731] CT
0.149 GC
2 setlinecap
1 LJ
0.667 LW
N
366.938 125 M
366.938 122.77 L
S
GR
GS
[0.74962 0 0 0.74938 0 0.41731] CT
0.149 GC
2 setlinecap
1 LJ
0.667 LW
N
394.813 125 M
394.813 122.77 L
S
GR
GS
[0.74962 0 0 0.74938 0 0.41731] CT
0.149 GC
2 setlinecap
1 LJ
0.667 LW
N
422.688 125 M
422.688 122.77 L
S
GR
GS
[0.74962 0 0 0.74938 0 0.41731] CT
0.149 GC
2 setlinecap
1 LJ
0.667 LW
N
450.563 125 M
450.563 122.77 L
S
GR
GS
[0.74962 0 0 0.74938 0 0.41731] CT
0.149 GC
2 setlinecap
1 LJ
0.667 LW
N
478.438 125 M
478.438 122.77 L
S
GR
GS
[0.74962 0 0 0.74938 0 0.41731] CT
0.149 GC
2 setlinecap
1 LJ
0.667 LW
N
506.313 125 M
506.313 122.77 L
S
GR
GS
[0.74962 0 0 0.74938 0 0.41731] CT
0.149 GC
2 setlinecap
1 LJ
0.667 LW
N
534.188 125 M
534.188 122.77 L
S
GR
GS
[0.74962 0 0 0.74938 0 0.41731] CT
0.149 GC
2 setlinecap
1 LJ
0.667 LW
N
562.063 125 M
562.063 122.77 L
S
GR
GS
[0.74962 0 0 0.74938 0 0.41731] CT
0.149 GC
2 setlinecap
1 LJ
0.667 LW
N
353 125 M
353 43 L
S
GR
GS
[0.74962 0 0 0.74938 0 0.41731] CT
0.149 GC
2 setlinecap
1 LJ
0.667 LW
N
353 108.748 M
355.23 108.748 L
S
GR
GS
[0.74962 0 0 0.74938 0 0.41731] CT
0.149 GC
2 setlinecap
1 LJ
0.667 LW
N
353 80.773 M
355.23 80.773 L
S
GR
GS
[0.74962 0 0 0.74938 0 0.41731] CT
0.149 GC
2 setlinecap
1 LJ
0.667 LW
N
353 52.798 M
355.23 52.798 L
S
GR
GS
[0.74962 0 0 0.74938 262.41739 81.91102] CT
0.149 GC
/Helvetica 11.333 F
GS
[1 0 0 1 0 0] CT
-7 4.5 moveto 
1 -1 scale
(1) t 
GR
GR
GS
[0.74962 0 0 0.74938 262.41739 60.94715] CT
0.149 GC
/Helvetica 11.333 F
GS
[1 0 0 1 0 0] CT
-16 4.5 moveto 
1 -1 scale
(1.5) t 
GR
GR
GS
[0.74962 0 0 0.74938 262.41739 39.98327] CT
0.149 GC
/Helvetica 11.333 F
GS
[1 0 0 1 0 0] CT
-7 4.5 moveto 
1 -1 scale
(2) t 
GR
GR
GS
[0 -0.74938 0.74962 0 248.92421 63.36504] CT
0.149 GC
N
/f-1283222118{-3.552 -4.347 M
-4.318 -4.347 -4.755 -4.926 QT
-5.193 -5.504 -5.193 -6.269 QT
-5.193 -7.051 -4.794 -7.871 QT
-4.396 -8.691 -3.716 -9.238 QT
-3.036 -9.785 -2.255 -9.785 QT
-1.911 -9.785 -1.622 -9.59 QT
-1.333 -9.394 -1.177 -9.066 QT
-0.505 -11.754 L
-0.458 -11.957 -0.443 -12.066 QT
-0.443 -12.269 -1.224 -12.269 QT
-1.349 -12.269 -1.349 -12.426 QT
-1.349 -12.457 -1.325 -12.527 QT
-1.302 -12.597 -1.271 -12.644 QT
-1.24 -12.691 -1.177 -12.691 QT
0.432 -12.816 L
0.589 -12.816 0.589 -12.66 QT
-1.146 -5.754 L
-1.224 -5.566 -1.224 -5.191 QT
-1.224 -4.676 -0.88 -4.676 QT
-0.505 -4.676 -0.31 -5.152 QT
-0.115 -5.629 0.026 -6.254 QT
0.042 -6.316 0.12 -6.316 QT
0.26 -6.316 L
0.307 -6.316 0.339 -6.277 QT
0.37 -6.238 0.37 -6.207 QT
0.151 -5.363 -0.099 -4.855 QT
-0.349 -4.347 -0.911 -4.347 QT
-1.302 -4.347 -1.615 -4.59 QT
-1.927 -4.832 -2.005 -5.222 QT
-2.786 -4.347 -3.552 -4.347 QT
cp
-3.552 -4.676 M
-3.115 -4.676 -2.708 -4.996 QT
-2.302 -5.316 -2.005 -5.754 QT
-1.99 -5.769 -1.99 -5.801 QT
-1.333 -8.457 L
-1.411 -8.879 -1.654 -9.183 QT
-1.896 -9.488 -2.286 -9.488 QT
-2.693 -9.488 -3.044 -9.152 QT
-3.396 -8.816 -3.63 -8.363 QT
-3.865 -7.894 -4.075 -7.051 QT
-4.286 -6.207 -4.286 -5.754 QT
-4.286 -5.332 -4.107 -5.004 QT
-3.927 -4.676 -3.552 -4.676 QT
cp}def
f-1283222118
f
GR
GS
[0 -0.74938 0.74962 0 248.92421 63.36504] CT
0.149 GC
N
/f1712389845{1.53 -2.774 M
1.53 -2.821 1.546 -2.852 QT
2.218 -5.54 L
2.28 -5.79 2.28 -5.977 QT
2.28 -6.368 2.015 -6.368 QT
1.734 -6.368 1.601 -6.032 QT
1.468 -5.696 1.343 -5.181 QT
1.343 -5.149 1.312 -5.134 QT
1.28 -5.118 1.265 -5.118 QT
1.155 -5.118 L
1.124 -5.118 1.101 -5.149 QT
1.077 -5.181 1.077 -5.212 QT
1.187 -5.602 1.273 -5.876 QT
1.359 -6.149 1.554 -6.376 QT
1.749 -6.602 2.03 -6.602 QT
2.343 -6.602 2.577 -6.415 QT
2.812 -6.227 2.874 -5.946 QT
3.093 -6.243 3.39 -6.423 QT
3.687 -6.602 4.03 -6.602 QT
4.312 -6.602 4.53 -6.431 QT
4.749 -6.259 4.749 -5.977 QT
4.749 -5.743 4.609 -5.579 QT
4.468 -5.415 4.234 -5.415 QT
4.077 -5.415 3.984 -5.501 QT
3.89 -5.587 3.89 -5.727 QT
3.89 -5.931 4.03 -6.087 QT
4.171 -6.243 4.359 -6.243 QT
4.218 -6.368 4.015 -6.368 QT
3.624 -6.368 3.335 -6.087 QT
3.046 -5.806 2.827 -5.384 QT
2.187 -2.821 L
2.155 -2.696 2.046 -2.61 QT
1.937 -2.524 1.812 -2.524 QT
1.702 -2.524 1.616 -2.595 QT
1.53 -2.665 1.53 -2.774 QT
cp}def
f1712389845
f
GR
GS
[0.74962 0 0 0.74938 0 0.41731] CT
0 0 1 RC
[10 6] 0 setdash
2 LJ
1.667 LW
N
366.938 100 M
562.063 100 L
S
GR
GS
[0.74962 0 0 0.74938 275.06412 32.64056] CT
0 0 1 RC
10.0 ML
0.667 LW
N
0 -4 M
0 4 L
-4 0 M
4 0 L
-2.828 -2.828 M
2.828 2.828 L
-2.828 2.828 M
2.828 -2.828 L
S
GR
GS
[0.74962 0 0 0.74938 295.95981 68.41275] CT
0 0 1 RC
10.0 ML
0.667 LW
N
0 -4 M
0 4 L
-4 0 M
4 0 L
-2.828 -2.828 M
2.828 2.828 L
-2.828 2.828 M
2.828 -2.828 L
S
GR
GS
[0.74962 0 0 0.74938 316.8555 82.0463] CT
0 0 1 RC
10.0 ML
0.667 LW
N
0 -4 M
0 4 L
-4 0 M
4 0 L
-2.828 -2.828 M
2.828 2.828 L
-2.828 2.828 M
2.828 -2.828 L
S
GR
GS
[0.74962 0 0 0.74938 337.75119 44.12804] CT
0 0 1 RC
10.0 ML
0.667 LW
N
0 -4 M
0 4 L
-4 0 M
4 0 L
-2.828 -2.828 M
2.828 2.828 L
-2.828 2.828 M
2.828 -2.828 L
S
GR
GS
[0.74962 0 0 0.74938 358.64688 70.74061] CT
0 0 1 RC
10.0 ML
0.667 LW
N
0 -4 M
0 4 L
-4 0 M
4 0 L
-2.828 -2.828 M
2.828 2.828 L
-2.828 2.828 M
2.828 -2.828 L
S
GR
GS
[0.74962 0 0 0.74938 379.54257 77.2766] CT
0 0 1 RC
10.0 ML
0.667 LW
N
0 -4 M
0 4 L
-4 0 M
4 0 L
-2.828 -2.828 M
2.828 2.828 L
-2.828 2.828 M
2.828 -2.828 L
S
GR
GS
[0.74962 0 0 0.74938 400.43826 94.08957] CT
0 0 1 RC
10.0 ML
0.667 LW
N
0 -4 M
0 4 L
-4 0 M
4 0 L
-2.828 -2.828 M
2.828 2.828 L
-2.828 2.828 M
2.828 -2.828 L
S
GR
GS
[0.74962 0 0 0.74938 421.33395 90.53948] CT
0 0 1 RC
10.0 ML
0.667 LW
N
0 -4 M
0 4 L
-4 0 M
4 0 L
-2.828 -2.828 M
2.828 2.828 L
-2.828 2.828 M
2.828 -2.828 L
S
GR
GS
[0.74962 0 0 0.74938 0 0.41731] CT
1 GC
N
83 225 M
305 225 L
305 144 L
83 144 L
cp
f
GR
GS
[0.74962 0 0 0.74938 0 0.41731] CT
0.873 GC
1 LJ
0.667 LW
N
96.875 225 M
96.875 144 L
S
GR
GS
[0.74962 0 0 0.74938 0 0.41731] CT
0.873 GC
1 LJ
0.667 LW
N
124.625 225 M
124.625 144 L
S
GR
GS
[0.74962 0 0 0.74938 0 0.41731] CT
0.873 GC
1 LJ
0.667 LW
N
152.375 225 M
152.375 144 L
S
GR
GS
[0.74962 0 0 0.74938 0 0.41731] CT
0.873 GC
1 LJ
0.667 LW
N
180.125 225 M
180.125 144 L
S
GR
GS
[0.74962 0 0 0.74938 0 0.41731] CT
0.873 GC
1 LJ
0.667 LW
N
207.875 225 M
207.875 144 L
S
GR
GS
[0.74962 0 0 0.74938 0 0.41731] CT
0.873 GC
1 LJ
0.667 LW
N
235.625 225 M
235.625 144 L
S
GR
GS
[0.74962 0 0 0.74938 0 0.41731] CT
0.873 GC
1 LJ
0.667 LW
N
263.375 225 M
263.375 144 L
S
GR
GS
[0.74962 0 0 0.74938 0 0.41731] CT
0.873 GC
1 LJ
0.667 LW
N
291.125 225 M
291.125 144 L
S
GR
GS
[0.74962 0 0 0.74938 0 0.41731] CT
0.775 GC
[1 3] 0 setdash
2 LJ
0.667 LW
N
305 207.033 M
83 207.033 L
S
GR
GS
[0.74962 0 0 0.74938 0 0.41731] CT
0.775 GC
[1 3] 0 setdash
2 LJ
0.667 LW
N
305 198.028 M
83 198.028 L
S
GR
GS
[0.74962 0 0 0.74938 0 0.41731] CT
0.775 GC
[1 3] 0 setdash
2 LJ
0.667 LW
N
305 189.023 M
83 189.023 L
S
GR
GS
[0.74962 0 0 0.74938 0 0.41731] CT
0.775 GC
[1 3] 0 setdash
2 LJ
0.667 LW
N
305 171.014 M
83 171.014 L
S
GR
GS
[0.74962 0 0 0.74938 0 0.41731] CT
0.775 GC
[1 3] 0 setdash
2 LJ
0.667 LW
N
305 162.009 M
83 162.009 L
S
GR
GS
[0.74962 0 0 0.74938 0 0.41731] CT
0.775 GC
[1 3] 0 setdash
2 LJ
0.667 LW
N
305 153.005 M
83 153.005 L
S
GR
GS
[0.74962 0 0 0.74938 0 0.41731] CT
0.873 GC
1 LJ
0.667 LW
N
305 216.037 M
83 216.037 L
S
GR
GS
[0.74962 0 0 0.74938 0 0.41731] CT
0.873 GC
1 LJ
0.667 LW
N
305 180.019 M
83 180.019 L
S
GR
GS
[0.74962 0 0 0.74938 0 0.41731] CT
0.873 GC
1 LJ
0.667 LW
N
305 144 M
83 144 L
S
GR
GS
[0.74962 0 0 0.74938 0 0.41731] CT
0.149 GC
2 setlinecap
1 LJ
0.667 LW
N
83 225 M
305 225 L
S
GR
GS
[0.74962 0 0 0.74938 0 0.41731] CT
0.149 GC
2 setlinecap
1 LJ
0.667 LW
N
96.875 225 M
96.875 222.78 L
S
GR
GS
[0.74962 0 0 0.74938 0 0.41731] CT
0.149 GC
2 setlinecap
1 LJ
0.667 LW
N
124.625 225 M
124.625 222.78 L
S
GR
GS
[0.74962 0 0 0.74938 0 0.41731] CT
0.149 GC
2 setlinecap
1 LJ
0.667 LW
N
152.375 225 M
152.375 222.78 L
S
GR
GS
[0.74962 0 0 0.74938 0 0.41731] CT
0.149 GC
2 setlinecap
1 LJ
0.667 LW
N
180.125 225 M
180.125 222.78 L
S
GR
GS
[0.74962 0 0 0.74938 0 0.41731] CT
0.149 GC
2 setlinecap
1 LJ
0.667 LW
N
207.875 225 M
207.875 222.78 L
S
GR
GS
[0.74962 0 0 0.74938 0 0.41731] CT
0.149 GC
2 setlinecap
1 LJ
0.667 LW
N
235.625 225 M
235.625 222.78 L
S
GR
GS
[0.74962 0 0 0.74938 0 0.41731] CT
0.149 GC
2 setlinecap
1 LJ
0.667 LW
N
263.375 225 M
263.375 222.78 L
S
GR
GS
[0.74962 0 0 0.74938 0 0.41731] CT
0.149 GC
2 setlinecap
1 LJ
0.667 LW
N
291.125 225 M
291.125 222.78 L
S
GR
GS
[0.74962 0 0 0.74938 72.61955 171.22554] CT
0.149 GC
/Helvetica 11.333 F
GS
[1 0 0 1 0 0] CT
-3.5 12 moveto 
1 -1 scale
(1) t 
GR
GR
GS
[0.74962 0 0 0.74938 93.42154 171.22554] CT
0.149 GC
/Helvetica 11.333 F
GS
[1 0 0 1 0 0] CT
-3.5 12 moveto 
1 -1 scale
(2) t 
GR
GR
GS
[0.74962 0 0 0.74938 114.22353 171.22554] CT
0.149 GC
/Helvetica 11.333 F
GS
[1 0 0 1 0 0] CT
-3.5 12 moveto 
1 -1 scale
(3) t 
GR
GR
GS
[0.74962 0 0 0.74938 135.02551 171.22554] CT
0.149 GC
/Helvetica 11.333 F
GS
[1 0 0 1 0 0] CT
-3.5 12 moveto 
1 -1 scale
(4) t 
GR
GR
GS
[0.74962 0 0 0.74938 155.8275 171.22554] CT
0.149 GC
/Helvetica 11.333 F
GS
[1 0 0 1 0 0] CT
-3.5 12 moveto 
1 -1 scale
(5) t 
GR
GR
GS
[0.74962 0 0 0.74938 176.62949 171.22554] CT
0.149 GC
/Helvetica 11.333 F
GS
[1 0 0 1 0 0] CT
-3.5 12 moveto 
1 -1 scale
(6) t 
GR
GR
GS
[0.74962 0 0 0.74938 197.43148 171.22554] CT
0.149 GC
/Helvetica 11.333 F
GS
[1 0 0 1 0 0] CT
-3.5 12 moveto 
1 -1 scale
(7) t 
GR
GR
GS
[0.74962 0 0 0.74938 218.23346 171.22554] CT
0.149 GC
/Helvetica 11.333 F
GS
[1 0 0 1 0 0] CT
-3.5 12 moveto 
1 -1 scale
(8) t 
GR
GR
GS
[0.74962 0 0 0.74938 145.42659 182.716] CT
0.149 GC
N
/f2116148176{-23.426 10.472 M
-23.426 10.05 L
-22.129 10.05 -22.129 9.675 QT
-22.129 3.081 L
-22.129 2.691 -23.426 2.691 QT
-23.426 2.269 L
-19.723 2.269 L
-19.723 2.691 L
-21.02 2.691 -21.02 3.081 QT
-21.02 9.675 L
-21.02 10.05 -19.723 10.05 QT
-19.723 10.472 L
-23.426 10.472 L
cp}def
f2116148176
f
GR
GS
[0.74962 0 0 0.74938 145.42659 182.716] CT
0.149 GC
N
/f-930534189{-18.018 9.034 M
-18.018 5.722 L
-19.002 5.722 L
-19.002 5.409 L
-18.221 5.409 -17.854 4.675 QT
-17.487 3.941 -17.487 3.081 QT
-17.143 3.081 L
-17.143 5.3 L
-15.44 5.3 L
-15.44 5.722 L
-17.143 5.722 L
-17.143 9.003 L
-17.143 9.503 -16.971 9.878 QT
-16.799 10.253 -16.377 10.253 QT
-15.956 10.253 -15.776 9.855 QT
-15.596 9.456 -15.596 9.003 QT
-15.596 8.3 L
-15.252 8.3 L
-15.252 9.034 L
-15.252 9.409 -15.393 9.777 QT
-15.534 10.144 -15.799 10.378 QT
-16.065 10.613 -16.456 10.613 QT
-17.174 10.613 -17.596 10.175 QT
-18.018 9.738 -18.018 9.034 QT
cp}def
f-930534189
f
GR
GS
[0.74962 0 0 0.74938 145.42659 182.716] CT
0.149 GC
N
/f2138403812{-11.404 10.613 M
-12.139 10.613 -12.748 10.222 QT
-13.357 9.831 -13.709 9.191 QT
-14.061 8.55 -14.061 7.847 QT
-14.061 7.144 -13.74 6.511 QT
-13.42 5.878 -12.85 5.488 QT
-12.279 5.097 -11.576 5.097 QT
-11.014 5.097 -10.607 5.277 QT
-10.201 5.456 -9.936 5.784 QT
-9.67 6.113 -9.537 6.558 QT
-9.404 7.003 -9.404 7.534 QT
-9.404 7.706 -9.529 7.706 QT
-12.998 7.706 L
-12.998 7.831 L
-12.998 8.831 -12.6 9.542 QT
-12.201 10.253 -11.295 10.253 QT
-10.92 10.253 -10.607 10.089 QT
-10.295 9.925 -10.068 9.636 QT
-9.842 9.347 -9.748 9.003 QT
-9.748 8.972 -9.709 8.933 QT
-9.67 8.894 -9.639 8.894 QT
-9.529 8.894 L
-9.404 8.894 -9.404 9.05 QT
-9.576 9.738 -10.139 10.175 QT
-10.701 10.613 -11.404 10.613 QT
cp
-12.998 7.394 M
-10.264 7.394 L
-10.264 6.956 -10.389 6.488 QT
-10.514 6.019 -10.803 5.714 QT
-11.092 5.409 -11.576 5.409 QT
-12.248 5.409 -12.623 6.042 QT
-12.998 6.675 -12.998 7.394 QT
cp}def
f2138403812
f
GR
GS
[0.74962 0 0 0.74938 145.42659 182.716] CT
0.149 GC
N
/f-118700227{-8.535 10.472 M
-8.535 10.05 L
-8.129 10.05 -7.864 9.988 QT
-7.598 9.925 -7.598 9.675 QT
-7.598 6.394 L
-7.598 6.066 -7.692 5.925 QT
-7.785 5.784 -7.973 5.753 QT
-8.16 5.722 -8.535 5.722 QT
-8.535 5.3 L
-6.817 5.175 L
-6.817 6.347 L
-6.629 5.816 -6.27 5.495 QT
-5.91 5.175 -5.395 5.175 QT
-5.051 5.175 -4.77 5.386 QT
-4.489 5.597 -4.489 5.941 QT
-4.489 6.159 -4.637 6.316 QT
-4.785 6.472 -5.02 6.472 QT
-5.239 6.472 -5.403 6.316 QT
-5.567 6.159 -5.567 5.941 QT
-5.567 5.613 -5.332 5.472 QT
-5.395 5.472 L
-5.895 5.472 -6.199 5.824 QT
-6.504 6.175 -6.629 6.699 QT
-6.754 7.222 -6.754 7.706 QT
-6.754 9.675 L
-6.754 10.05 -5.598 10.05 QT
-5.598 10.472 L
-8.535 10.472 L
cp}def
f-118700227
f
GR
GS
[0.74962 0 0 0.74938 145.42659 182.716] CT
0.149 GC
N
/f426129512{-3.481 9.3 M
-3.481 8.581 -2.918 8.128 QT
-2.356 7.675 -1.567 7.495 QT
-0.778 7.316 -0.074 7.316 QT
-0.074 6.816 L
-0.074 6.472 -0.223 6.152 QT
-0.371 5.831 -0.66 5.62 QT
-0.949 5.409 -1.293 5.409 QT
-2.09 5.409 -2.512 5.769 QT
-2.278 5.769 -2.129 5.941 QT
-1.981 6.113 -1.981 6.347 QT
-1.981 6.581 -2.153 6.753 QT
-2.324 6.925 -2.559 6.925 QT
-2.793 6.925 -2.965 6.753 QT
-3.137 6.581 -3.137 6.347 QT
-3.137 5.706 -2.567 5.402 QT
-1.996 5.097 -1.293 5.097 QT
-0.809 5.097 -0.317 5.3 QT
0.176 5.503 0.488 5.894 QT
0.801 6.284 0.801 6.8 QT
0.801 9.503 L
0.801 9.738 0.902 9.933 QT
1.004 10.128 1.207 10.128 QT
1.41 10.128 1.504 9.925 QT
1.597 9.722 1.597 9.503 QT
1.597 8.738 L
1.957 8.738 L
1.957 9.503 L
1.957 9.769 1.816 10.011 QT
1.676 10.253 1.433 10.402 QT
1.191 10.55 0.926 10.55 QT
0.566 10.55 0.316 10.277 QT
0.066 10.003 0.035 9.628 QT
-0.184 10.066 -0.621 10.339 QT
-1.059 10.613 -1.543 10.613 QT
-2.012 10.613 -2.449 10.472 QT
-2.887 10.331 -3.184 10.042 QT
-3.481 9.753 -3.481 9.3 QT
cp
-2.512 9.3 M
-2.512 9.722 -2.199 10.003 QT
-1.887 10.284 -1.465 10.284 QT
-1.074 10.284 -0.762 10.097 QT
-0.449 9.909 -0.262 9.574 QT
-0.074 9.238 -0.074 8.863 QT
-0.074 7.613 L
-0.621 7.613 -1.192 7.792 QT
-1.762 7.972 -2.137 8.355 QT
-2.512 8.738 -2.512 9.3 QT
cp}def
f426129512
f
GR
GS
[0.74962 0 0 0.74938 145.42659 182.716] CT
0.149 GC
N
/f1871022844{3.487 9.034 M
3.487 5.722 L
2.503 5.722 L
2.503 5.409 L
3.284 5.409 3.651 4.675 QT
4.018 3.941 4.018 3.081 QT
4.362 3.081 L
4.362 5.3 L
6.065 5.3 L
6.065 5.722 L
4.362 5.722 L
4.362 9.003 L
4.362 9.503 4.534 9.878 QT
4.706 10.253 5.128 10.253 QT
5.549 10.253 5.729 9.855 QT
5.909 9.456 5.909 9.003 QT
5.909 8.3 L
6.253 8.3 L
6.253 9.034 L
6.253 9.409 6.112 9.777 QT
5.971 10.144 5.706 10.378 QT
5.44 10.613 5.049 10.613 QT
4.331 10.613 3.909 10.175 QT
3.487 9.738 3.487 9.034 QT
cp}def
f1871022844
f
GR
GS
[0.74962 0 0 0.74938 145.42659 182.716] CT
0.149 GC
N
/f-1032232310{7.491 10.472 M
7.491 10.05 L
7.898 10.05 8.163 9.988 QT
8.429 9.925 8.429 9.675 QT
8.429 6.394 L
8.429 5.925 8.249 5.824 QT
8.07 5.722 7.538 5.722 QT
7.538 5.3 L
9.273 5.175 L
9.273 9.675 L
9.273 9.925 9.499 9.988 QT
9.726 10.05 10.101 10.05 QT
10.101 10.472 L
7.491 10.472 L
cp
7.991 3.113 M
7.991 2.847 8.195 2.644 QT
8.398 2.441 8.648 2.441 QT
8.82 2.441 8.976 2.527 QT
9.132 2.613 9.226 2.777 QT
9.32 2.941 9.32 3.113 QT
9.32 3.363 9.116 3.566 QT
8.913 3.769 8.648 3.769 QT
8.398 3.769 8.195 3.566 QT
7.991 3.363 7.991 3.113 QT
cp}def
f-1032232310
f
GR
GS
[0.74962 0 0 0.74938 145.42659 182.716] CT
0.149 GC
N
/f-1537076266{13.579 10.613 M
12.861 10.613 12.243 10.245 QT
11.626 9.878 11.267 9.261 QT
10.908 8.644 10.908 7.909 QT
10.908 7.363 11.111 6.855 QT
11.314 6.347 11.673 5.949 QT
12.033 5.55 12.525 5.324 QT
13.017 5.097 13.579 5.097 QT
14.314 5.097 14.923 5.488 QT
15.533 5.878 15.884 6.527 QT
16.236 7.175 16.236 7.909 QT
16.236 8.644 15.876 9.261 QT
15.517 9.878 14.908 10.245 QT
14.298 10.613 13.579 10.613 QT
cp
13.579 10.253 M
14.548 10.253 14.868 9.558 QT
15.189 8.863 15.189 7.784 QT
15.189 7.175 15.126 6.784 QT
15.064 6.394 14.845 6.066 QT
14.704 5.863 14.493 5.714 QT
14.283 5.566 14.056 5.488 QT
13.829 5.409 13.579 5.409 QT
13.204 5.409 12.868 5.581 QT
12.533 5.753 12.314 6.066 QT
12.079 6.409 12.025 6.816 QT
11.97 7.222 11.97 7.784 QT
11.97 8.456 12.087 8.995 QT
12.204 9.534 12.556 9.894 QT
12.908 10.253 13.579 10.253 QT
cp}def
f-1537076266
f
GR
GS
[0.74962 0 0 0.74938 145.42659 182.716] CT
0.149 GC
N
/f1589202444{17.172 10.472 M
17.172 10.05 L
17.578 10.05 17.844 9.988 QT
18.11 9.925 18.11 9.675 QT
18.11 6.394 L
18.11 6.066 18.016 5.925 QT
17.922 5.784 17.735 5.753 QT
17.547 5.722 17.172 5.722 QT
17.172 5.3 L
18.906 5.175 L
18.906 6.347 L
19.156 5.831 19.625 5.503 QT
20.094 5.175 20.656 5.175 QT
21.485 5.175 21.906 5.574 QT
22.328 5.972 22.328 6.784 QT
22.328 9.675 L
22.328 9.925 22.586 9.988 QT
22.844 10.05 23.266 10.05 QT
23.266 10.472 L
20.516 10.472 L
20.516 10.05 L
20.922 10.05 21.188 9.988 QT
21.453 9.925 21.453 9.675 QT
21.453 6.816 L
21.453 6.238 21.281 5.855 QT
21.11 5.472 20.578 5.472 QT
19.891 5.472 19.438 6.034 QT
18.985 6.597 18.985 7.3 QT
18.985 9.675 L
18.985 9.925 19.25 9.988 QT
19.516 10.05 19.922 10.05 QT
19.922 10.472 L
17.172 10.472 L
cp}def
f1589202444
f
GR
GS
[0.74962 0 0 0.74938 0 0.41731] CT
0.149 GC
2 setlinecap
1 LJ
0.667 LW
N
83 225 M
83 144 L
S
GR
GS
[0.74962 0 0 0.74938 0 0.41731] CT
0.149 GC
2 setlinecap
1 LJ
0.667 LW
N
83 216.037 M
85.22 216.037 L
S
GR
GS
[0.74962 0 0 0.74938 0 0.41731] CT
0.149 GC
2 setlinecap
1 LJ
0.667 LW
N
83 180.019 M
85.22 180.019 L
S
GR
GS
[0.74962 0 0 0.74938 0 0.41731] CT
0.149 GC
2 setlinecap
1 LJ
0.667 LW
N
83 144 M
85.22 144 L
S
GR
GS
[0.74962 0 0 0.74938 60.01967 162.3109] CT
0.149 GC
/Helvetica 11.333 F
GS
[1 0 0 1 0 0] CT
-7 4.5 moveto 
1 -1 scale
(4) t 
GR
GR
GS
[0.74962 0 0 0.74938 60.01967 135.31933] CT
0.149 GC
/Helvetica 11.333 F
GS
[1 0 0 1 0 0] CT
-7 4.5 moveto 
1 -1 scale
(6) t 
GR
GR
GS
[0.74962 0 0 0.74938 60.01967 108.32775] CT
0.149 GC
/Helvetica 11.333 F
GS
[1 0 0 1 0 0] CT
-7 4.5 moveto 
1 -1 scale
(8) t 
GR
GR
GS
[0 -0.74938 0.74962 0 53.27308 138.67753] CT
0.149 GC
N
/f775103388{-4.689 -2.769 M
-4.689 -3.066 -4.485 -3.285 QT
-4.282 -3.504 -4.001 -3.504 QT
-3.798 -3.504 -3.673 -3.386 QT
-3.548 -3.269 -3.548 -3.066 QT
-3.548 -2.847 -3.665 -2.676 QT
-3.782 -2.504 -3.985 -2.441 QT
-3.657 -2.332 -2.97 -2.332 QT
-2.423 -2.332 -1.962 -2.761 QT
-1.501 -3.191 -1.36 -3.738 QT
-1.017 -5.144 L
-1.673 -4.488 -2.376 -4.488 QT
-2.892 -4.488 -3.259 -4.754 QT
-3.626 -5.019 -3.821 -5.457 QT
-4.017 -5.894 -4.017 -6.394 QT
-4.017 -6.941 -3.79 -7.543 QT
-3.564 -8.144 -3.157 -8.66 QT
-2.751 -9.176 -2.22 -9.48 QT
-1.689 -9.785 -1.11 -9.785 QT
-0.751 -9.785 -0.47 -9.597 QT
-0.189 -9.41 -0.032 -9.082 QT
0.093 -9.551 0.483 -9.551 QT
0.64 -9.551 0.749 -9.457 QT
0.858 -9.363 0.858 -9.222 QT
0.858 -9.176 0.851 -9.16 QT
0.843 -9.144 0.843 -9.129 QT
-0.532 -3.676 L
-0.626 -3.301 -0.876 -2.988 QT
-1.126 -2.676 -1.47 -2.465 QT
-1.814 -2.254 -2.212 -2.136 QT
-2.61 -2.019 -2.985 -2.019 QT
-3.673 -2.019 -4.181 -2.152 QT
-4.689 -2.285 -4.689 -2.769 QT
cp
-2.345 -4.801 M
-1.579 -4.801 -0.845 -5.847 QT
-0.173 -8.472 L
-0.267 -8.894 -0.509 -9.191 QT
-0.751 -9.488 -1.126 -9.488 QT
-1.532 -9.488 -1.884 -9.16 QT
-2.235 -8.832 -2.47 -8.379 QT
-2.689 -7.941 -2.899 -7.129 QT
-3.11 -6.316 -3.11 -5.847 QT
-3.11 -5.441 -2.923 -5.121 QT
-2.735 -4.801 -2.345 -4.801 QT
cp}def
f775103388
f
GR
GS
[0 -0.74938 0.74962 0 53.27308 138.67753] CT
0.149 GC
N
/f665659991{1.648 -3.352 M
1.648 -3.477 1.664 -3.602 QT
2.32 -6.181 L
1.383 -6.181 L
1.289 -6.181 1.289 -6.306 QT
1.32 -6.493 1.398 -6.493 QT
2.398 -6.493 L
2.758 -7.962 L
2.789 -8.087 2.898 -8.173 QT
3.008 -8.259 3.133 -8.259 QT
3.258 -8.259 3.336 -8.188 QT
3.414 -8.118 3.414 -8.009 QT
3.414 -7.977 3.406 -7.962 QT
3.398 -7.946 3.398 -7.931 QT
3.039 -6.493 L
3.961 -6.493 L
4.055 -6.493 4.055 -6.384 QT
4.055 -6.352 4.039 -6.306 QT
4.023 -6.259 4 -6.22 QT
3.976 -6.181 3.945 -6.181 QT
2.961 -6.181 L
2.305 -3.587 L
2.242 -3.321 2.242 -3.134 QT
2.242 -2.759 2.508 -2.759 QT
2.898 -2.759 3.211 -3.126 QT
3.523 -3.493 3.68 -3.946 QT
3.711 -3.993 3.742 -3.993 QT
3.851 -3.993 L
3.898 -3.993 3.922 -3.97 QT
3.945 -3.946 3.945 -3.915 QT
3.945 -3.899 3.93 -3.884 QT
3.726 -3.337 3.351 -2.931 QT
2.976 -2.524 2.492 -2.524 QT
2.133 -2.524 1.89 -2.751 QT
1.648 -2.977 1.648 -3.352 QT
cp}def
f665659991
f
GR
GS
[0.74962 0 0 0.74938 0 0.41731] CT
0 0 1 RC
[10 6] 0 setdash
2 LJ
1.667 LW
N
96.875 180.281 M
291.125 180.281 L
S
GR
GS
[0.74962 0 0 0.74938 72.61955 111.3645] CT
0 0 1 RC
10.0 ML
0.667 LW
N
0 -4 M
0 4 L
-4 0 M
4 0 L
-2.828 -2.828 M
2.828 2.828 L
-2.828 2.828 M
2.828 -2.828 L
S
GR
GS
[0.74962 0 0 0.74938 93.42154 169.02737] CT
0 0 1 RC
10.0 ML
0.667 LW
N
0 -4 M
0 4 L
-4 0 M
4 0 L
-2.828 -2.828 M
2.828 2.828 L
-2.828 2.828 M
2.828 -2.828 L
S
GR
GS
[0.74962 0 0 0.74938 114.22353 115.34449] CT
0 0 1 RC
10.0 ML
0.667 LW
N
0 -4 M
0 4 L
-4 0 M
4 0 L
-2.828 -2.828 M
2.828 2.828 L
-2.828 2.828 M
2.828 -2.828 L
S
GR
GS
[0.74962 0 0 0.74938 135.02551 159.11146] CT
0 0 1 RC
10.0 ML
0.667 LW
N
0 -4 M
0 4 L
-4 0 M
4 0 L
-2.828 -2.828 M
2.828 2.828 L
-2.828 2.828 M
2.828 -2.828 L
S
GR
GS
[0.74962 0 0 0.74938 155.8275 126.5627] CT
0 0 1 RC
10.0 ML
0.667 LW
N
0 -4 M
0 4 L
-4 0 M
4 0 L
-2.828 -2.828 M
2.828 2.828 L
-2.828 2.828 M
2.828 -2.828 L
S
GR
GS
[0.74962 0 0 0.74938 176.62949 131.04466] CT
0 0 1 RC
10.0 ML
0.667 LW
N
0 -4 M
0 4 L
-4 0 M
4 0 L
-2.828 -2.828 M
2.828 2.828 L
-2.828 2.828 M
2.828 -2.828 L
S
GR
GS
[0.74962 0 0 0.74938 197.43148 132.23585] CT
0 0 1 RC
10.0 ML
0.667 LW
N
0 -4 M
0 4 L
-4 0 M
4 0 L
-2.828 -2.828 M
2.828 2.828 L
-2.828 2.828 M
2.828 -2.828 L
S
GR
GS
[0.74962 0 0 0.74938 218.23346 128.62349] CT
0 0 1 RC
10.0 ML
0.667 LW
N
0 -4 M
0 4 L
-4 0 M
4 0 L
-2.828 -2.828 M
2.828 2.828 L
-2.828 2.828 M
2.828 -2.828 L
S
GR
GS
[0.74962 0 0 0.74938 0 0.41731] CT
1 GC
N
353 225 M
576 225 L
576 144 L
353 144 L
cp
f
GR
GS
[0.74962 0 0 0.74938 0 0.41731] CT
0.873 GC
1 LJ
0.667 LW
N
366.938 225 M
366.938 144 L
S
GR
GS
[0.74962 0 0 0.74938 0 0.41731] CT
0.873 GC
1 LJ
0.667 LW
N
394.813 225 M
394.813 144 L
S
GR
GS
[0.74962 0 0 0.74938 0 0.41731] CT
0.873 GC
1 LJ
0.667 LW
N
422.688 225 M
422.688 144 L
S
GR
GS
[0.74962 0 0 0.74938 0 0.41731] CT
0.873 GC
1 LJ
0.667 LW
N
450.563 225 M
450.563 144 L
S
GR
GS
[0.74962 0 0 0.74938 0 0.41731] CT
0.873 GC
1 LJ
0.667 LW
N
478.438 225 M
478.438 144 L
S
GR
GS
[0.74962 0 0 0.74938 0 0.41731] CT
0.873 GC
1 LJ
0.667 LW
N
506.313 225 M
506.313 144 L
S
GR
GS
[0.74962 0 0 0.74938 0 0.41731] CT
0.873 GC
1 LJ
0.667 LW
N
534.188 225 M
534.188 144 L
S
GR
GS
[0.74962 0 0 0.74938 0 0.41731] CT
0.873 GC
1 LJ
0.667 LW
N
562.063 225 M
562.063 144 L
S
GR
GS
[0.74962 0 0 0.74938 0 0.41731] CT
0.775 GC
[1 3] 0 setdash
2 LJ
0.667 LW
N
576 216.048 M
353 216.048 L
S
GR
GS
[0.74962 0 0 0.74938 0 0.41731] CT
0.775 GC
[1 3] 0 setdash
2 LJ
0.667 LW
N
576 207.256 M
353 207.256 L
S
GR
GS
[0.74962 0 0 0.74938 0 0.41731] CT
0.775 GC
[1 3] 0 setdash
2 LJ
0.667 LW
N
576 198.464 M
353 198.464 L
S
GR
GS
[0.74962 0 0 0.74938 0 0.41731] CT
0.775 GC
[1 3] 0 setdash
2 LJ
0.667 LW
N
576 180.881 M
353 180.881 L
S
GR
GS
[0.74962 0 0 0.74938 0 0.41731] CT
0.775 GC
[1 3] 0 setdash
2 LJ
0.667 LW
N
576 172.089 M
353 172.089 L
S
GR
GS
[0.74962 0 0 0.74938 0 0.41731] CT
0.775 GC
[1 3] 0 setdash
2 LJ
0.667 LW
N
576 163.298 M
353 163.298 L
S
GR
GS
[0.74962 0 0 0.74938 0 0.41731] CT
0.775 GC
[1 3] 0 setdash
2 LJ
0.667 LW
N
576 145.714 M
353 145.714 L
S
GR
GS
[0.74962 0 0 0.74938 0 0.41731] CT
0.873 GC
1 LJ
0.667 LW
N
576 224.839 M
353 224.839 L
S
GR
GS
[0.74962 0 0 0.74938 0 0.41731] CT
0.873 GC
1 LJ
0.667 LW
N
576 189.673 M
353 189.673 L
S
GR
GS
[0.74962 0 0 0.74938 0 0.41731] CT
0.873 GC
1 LJ
0.667 LW
N
576 154.506 M
353 154.506 L
S
GR
GS
[0.74962 0 0 0.74938 0 0.41731] CT
0.149 GC
2 setlinecap
1 LJ
0.667 LW
N
353 225 M
576 225 L
S
GR
GS
[0.74962 0 0 0.74938 0 0.41731] CT
0.149 GC
2 setlinecap
1 LJ
0.667 LW
N
366.938 225 M
366.938 222.77 L
S
GR
GS
[0.74962 0 0 0.74938 0 0.41731] CT
0.149 GC
2 setlinecap
1 LJ
0.667 LW
N
394.813 225 M
394.813 222.77 L
S
GR
GS
[0.74962 0 0 0.74938 0 0.41731] CT
0.149 GC
2 setlinecap
1 LJ
0.667 LW
N
422.688 225 M
422.688 222.77 L
S
GR
GS
[0.74962 0 0 0.74938 0 0.41731] CT
0.149 GC
2 setlinecap
1 LJ
0.667 LW
N
450.563 225 M
450.563 222.77 L
S
GR
GS
[0.74962 0 0 0.74938 0 0.41731] CT
0.149 GC
2 setlinecap
1 LJ
0.667 LW
N
478.438 225 M
478.438 222.77 L
S
GR
GS
[0.74962 0 0 0.74938 0 0.41731] CT
0.149 GC
2 setlinecap
1 LJ
0.667 LW
N
506.313 225 M
506.313 222.77 L
S
GR
GS
[0.74962 0 0 0.74938 0 0.41731] CT
0.149 GC
2 setlinecap
1 LJ
0.667 LW
N
534.188 225 M
534.188 222.77 L
S
GR
GS
[0.74962 0 0 0.74938 0 0.41731] CT
0.149 GC
2 setlinecap
1 LJ
0.667 LW
N
562.063 225 M
562.063 222.77 L
S
GR
GS
[0.74962 0 0 0.74938 275.06412 171.22554] CT
0.149 GC
/Helvetica 11.333 F
GS
[1 0 0 1 0 0] CT
-3.5 12 moveto 
1 -1 scale
(1) t 
GR
GR
GS
[0.74962 0 0 0.74938 295.95981 171.22554] CT
0.149 GC
/Helvetica 11.333 F
GS
[1 0 0 1 0 0] CT
-3.5 12 moveto 
1 -1 scale
(2) t 
GR
GR
GS
[0.74962 0 0 0.74938 316.8555 171.22554] CT
0.149 GC
/Helvetica 11.333 F
GS
[1 0 0 1 0 0] CT
-3.5 12 moveto 
1 -1 scale
(3) t 
GR
GR
GS
[0.74962 0 0 0.74938 337.75119 171.22554] CT
0.149 GC
/Helvetica 11.333 F
GS
[1 0 0 1 0 0] CT
-3.5 12 moveto 
1 -1 scale
(4) t 
GR
GR
GS
[0.74962 0 0 0.74938 358.64688 171.22554] CT
0.149 GC
/Helvetica 11.333 F
GS
[1 0 0 1 0 0] CT
-3.5 12 moveto 
1 -1 scale
(5) t 
GR
GR
GS
[0.74962 0 0 0.74938 379.54257 171.22554] CT
0.149 GC
/Helvetica 11.333 F
GS
[1 0 0 1 0 0] CT
-3.5 12 moveto 
1 -1 scale
(6) t 
GR
GR
GS
[0.74962 0 0 0.74938 400.43826 171.22554] CT
0.149 GC
/Helvetica 11.333 F
GS
[1 0 0 1 0 0] CT
-3.5 12 moveto 
1 -1 scale
(7) t 
GR
GR
GS
[0.74962 0 0 0.74938 421.33395 171.22554] CT
0.149 GC
/Helvetica 11.333 F
GS
[1 0 0 1 0 0] CT
-3.5 12 moveto 
1 -1 scale
(8) t 
GR
GR
GS
[0.74962 0 0 0.74938 348.1991 182.716] CT
0.149 GC
N
f2116148176
f
GR
GS
[0.74962 0 0 0.74938 348.1991 182.716] CT
0.149 GC
N
f-930534189
f
GR
GS
[0.74962 0 0 0.74938 348.1991 182.716] CT
0.149 GC
N
f2138403812
f
GR
GS
[0.74962 0 0 0.74938 348.1991 182.716] CT
0.149 GC
N
f-118700227
f
GR
GS
[0.74962 0 0 0.74938 348.1991 182.716] CT
0.149 GC
N
f426129512
f
GR
GS
[0.74962 0 0 0.74938 348.1991 182.716] CT
0.149 GC
N
f1871022844
f
GR
GS
[0.74962 0 0 0.74938 348.1991 182.716] CT
0.149 GC
N
f-1032232310
f
GR
GS
[0.74962 0 0 0.74938 348.1991 182.716] CT
0.149 GC
N
f-1537076266
f
GR
GS
[0.74962 0 0 0.74938 348.1991 182.716] CT
0.149 GC
N
f1589202444
f
GR
GS
[0.74962 0 0 0.74938 0 0.41731] CT
0.149 GC
2 setlinecap
1 LJ
0.667 LW
N
353 225 M
353 144 L
S
GR
GS
[0.74962 0 0 0.74938 0 0.41731] CT
0.149 GC
2 setlinecap
1 LJ
0.667 LW
N
353 224.839 M
355.23 224.839 L
S
GR
GS
[0.74962 0 0 0.74938 0 0.41731] CT
0.149 GC
2 setlinecap
1 LJ
0.667 LW
N
353 189.673 M
355.23 189.673 L
S
GR
GS
[0.74962 0 0 0.74938 0 0.41731] CT
0.149 GC
2 setlinecap
1 LJ
0.667 LW
N
353 154.506 M
355.23 154.506 L
S
GR
GS
[0.74962 0 0 0.74938 262.41739 168.90692] CT
0.149 GC
/Helvetica 11.333 F
GS
[1 0 0 1 0 0] CT
-7 4.5 moveto 
1 -1 scale
(0) t 
GR
GR
GS
[0.74962 0 0 0.74938 262.41739 142.55375] CT
0.149 GC
/Helvetica 11.333 F
GS
[1 0 0 1 0 0] CT
-23 4.5 moveto 
1 -1 scale
(0.02) t 
GR
GR
GS
[0.74962 0 0 0.74938 262.41739 116.20058] CT
0.149 GC
/Helvetica 11.333 F
GS
[1 0 0 1 0 0] CT
-23 4.5 moveto 
1 -1 scale
(0.04) t 
GR
GR
GS
[0 -0.74938 0.74962 0 243.67687 138.67752] CT
0.149 GC
N
/f-1837574880{-5.203 -2.769 M
-5.203 -3.066 -5 -3.285 QT
-4.796 -3.504 -4.515 -3.504 QT
-4.312 -3.504 -4.187 -3.386 QT
-4.062 -3.269 -4.062 -3.066 QT
-4.062 -2.847 -4.179 -2.676 QT
-4.296 -2.504 -4.5 -2.441 QT
-4.171 -2.332 -3.484 -2.332 QT
-2.937 -2.332 -2.476 -2.761 QT
-2.015 -3.191 -1.875 -3.738 QT
-1.531 -5.144 L
-2.187 -4.488 -2.89 -4.488 QT
-3.406 -4.488 -3.773 -4.754 QT
-4.14 -5.019 -4.335 -5.457 QT
-4.531 -5.894 -4.531 -6.394 QT
-4.531 -6.941 -4.304 -7.543 QT
-4.078 -8.144 -3.671 -8.66 QT
-3.265 -9.176 -2.734 -9.48 QT
-2.203 -9.785 -1.625 -9.785 QT
-1.265 -9.785 -0.984 -9.597 QT
-0.703 -9.41 -0.546 -9.082 QT
-0.421 -9.551 -0.031 -9.551 QT
0.125 -9.551 0.235 -9.457 QT
0.344 -9.363 0.344 -9.222 QT
0.344 -9.176 0.336 -9.16 QT
0.329 -9.144 0.329 -9.129 QT
-1.046 -3.676 L
-1.14 -3.301 -1.39 -2.988 QT
-1.64 -2.676 -1.984 -2.465 QT
-2.328 -2.254 -2.726 -2.136 QT
-3.125 -2.019 -3.5 -2.019 QT
-4.187 -2.019 -4.695 -2.152 QT
-5.203 -2.285 -5.203 -2.769 QT
cp
-2.859 -4.801 M
-2.093 -4.801 -1.359 -5.847 QT
-0.687 -8.472 L
-0.781 -8.894 -1.023 -9.191 QT
-1.265 -9.488 -1.64 -9.488 QT
-2.046 -9.488 -2.398 -9.16 QT
-2.75 -8.832 -2.984 -8.379 QT
-3.203 -7.941 -3.414 -7.129 QT
-3.625 -6.316 -3.625 -5.847 QT
-3.625 -5.441 -3.437 -5.121 QT
-3.25 -4.801 -2.859 -4.801 QT
cp}def
f-1837574880
f
GR
GS
[0 -0.74938 0.74962 0 243.67687 138.67752] CT
0.149 GC
N
/f-150263410{1.259 -2.774 M
1.259 -2.821 1.275 -2.852 QT
1.947 -5.54 L
2.009 -5.79 2.009 -5.977 QT
2.009 -6.368 1.744 -6.368 QT
1.462 -6.368 1.329 -6.032 QT
1.197 -5.696 1.072 -5.181 QT
1.072 -5.149 1.04 -5.134 QT
1.009 -5.118 0.994 -5.118 QT
0.884 -5.118 L
0.853 -5.118 0.829 -5.149 QT
0.806 -5.181 0.806 -5.212 QT
0.915 -5.602 1.001 -5.876 QT
1.087 -6.149 1.283 -6.376 QT
1.478 -6.602 1.759 -6.602 QT
2.072 -6.602 2.306 -6.415 QT
2.54 -6.227 2.603 -5.946 QT
2.822 -6.243 3.119 -6.423 QT
3.415 -6.602 3.759 -6.602 QT
4.04 -6.602 4.259 -6.431 QT
4.478 -6.259 4.478 -5.977 QT
4.478 -5.743 4.337 -5.579 QT
4.197 -5.415 3.962 -5.415 QT
3.806 -5.415 3.712 -5.501 QT
3.619 -5.587 3.619 -5.727 QT
3.619 -5.931 3.759 -6.087 QT
3.9 -6.243 4.087 -6.243 QT
3.947 -6.368 3.744 -6.368 QT
3.353 -6.368 3.064 -6.087 QT
2.775 -5.806 2.556 -5.384 QT
1.915 -2.821 L
1.884 -2.696 1.775 -2.61 QT
1.665 -2.524 1.54 -2.524 QT
1.431 -2.524 1.345 -2.595 QT
1.259 -2.665 1.259 -2.774 QT
cp}def
f-150263410
f
GR
GS
[0.74962 0 0 0.74938 0 0.41731] CT
0 0 1 RC
[10 6] 0 setdash
2 LJ
1.667 LW
N
366.938 182.077 M
562.063 182.077 L
S
GR
GS
[0.74962 0 0 0.74938 275.06412 141.26233] CT
0 0 1 RC
10.0 ML
0.667 LW
N
0 -4 M
0 4 L
-4 0 M
4 0 L
-2.828 -2.828 M
2.828 2.828 L
-2.828 2.828 M
2.828 -2.828 L
S
GR
GS
[0.74962 0 0 0.74938 295.95981 132.45691] CT
0 0 1 RC
10.0 ML
0.667 LW
N
0 -4 M
0 4 L
-4 0 M
4 0 L
-2.828 -2.828 M
2.828 2.828 L
-2.828 2.828 M
2.828 -2.828 L
S
GR
GS
[0.74962 0 0 0.74938 316.8555 118.59954] CT
0 0 1 RC
10.0 ML
0.667 LW
N
0 -4 M
0 4 L
-4 0 M
4 0 L
-2.828 -2.828 M
2.828 2.828 L
-2.828 2.828 M
2.828 -2.828 L
S
GR
GS
[0.74962 0 0 0.74938 337.75119 169.02737] CT
0 0 1 RC
10.0 ML
0.667 LW
N
0 -4 M
0 4 L
-4 0 M
4 0 L
-2.828 -2.828 M
2.828 2.828 L
-2.828 2.828 M
2.828 -2.828 L
S
GR
GS
[0.74962 0 0 0.74938 358.64688 152.41303] CT
0 0 1 RC
10.0 ML
0.667 LW
N
0 -4 M
0 4 L
-4 0 M
4 0 L
-2.828 -2.828 M
2.828 2.828 L
-2.828 2.828 M
2.828 -2.828 L
S
GR
GS
[0.74962 0 0 0.74938 379.54257 142.80296] CT
0 0 1 RC
10.0 ML
0.667 LW
N
0 -4 M
0 4 L
-4 0 M
4 0 L
-2.828 -2.828 M
2.828 2.828 L
-2.828 2.828 M
2.828 -2.828 L
S
GR
GS
[0.74962 0 0 0.74938 400.43826 111.73676] CT
0 0 1 RC
10.0 ML
0.667 LW
N
0 -4 M
0 4 L
-4 0 M
4 0 L
-2.828 -2.828 M
2.828 2.828 L
-2.828 2.828 M
2.828 -2.828 L
S
GR
GS
[0.74962 0 0 0.74938 421.33395 108.32775] CT
0 0 1 RC
10.0 ML
0.667 LW
N
0 -4 M
0 4 L
-4 0 M
4 0 L
-2.828 -2.828 M
2.828 2.828 L
-2.828 2.828 M
2.828 -2.828 L
S
GR
%%Trailer
%%Pages: 1
%%EOF
