0
SECTION
2
HEADER
9
$INSUNITS
70
4
9
$ACADVER
1
AC1014
9
$HANDSEED
5
FFFF
0
ENDSEC
0
SECTION
2
TABLES
0
TABLE
2
VPORT
5
8
100
AcDbSymbolTable
0
ENDTAB
0
TABLE
2
LTYPE
5
5
100
AcDbSymbolTable
0
LTYPE
5
14
100
AcDbSymbolTableRecord
100
AcDbLinetypeTableRecord
2
BYBLOCK
70
0
0
LTYPE
5
15
100
AcDbSymbolTableRecord
100
AcDbLinetypeTableRecord
2
BYLAYER
70
0
0
ENDTAB
0
TABLE
2
LAYER
5
2
100
AcDbSymbolTable
70
2
0
LAYER
5
50
100
AcDbSymbolTableRecord
100
AcDbLayerTableRecord
2
0
70
0
6
CONTINUOUS
0
ENDTAB
0
TABLE
2
STYLE
5
3
100
AcDbSymbolTable
70
1
0
STYLE
5
11
100
AcDbSymbolTableRecord
100
AcDbTextStyleTableRecord
2
STANDARD
70
0
0
ENDTAB
0
TABLE
2
VIEW
5
6
100
AcDbSymbolTable
70
0
0
ENDTAB
0
TABLE
2
UCS
5
7
100
AcDbSymbolTable
70
0
0
ENDTAB
0
TABLE
2
APPID
5
9
100
AcDbSymbolTable
70
2
0
APPID
5
12
100
AcDbSymbolTableRecord
100
AcDbRegAppTableRecord
2
ACAD
70
0
0
ENDTAB
0
TABLE
2
DIMSTYLE
5
A
100
AcDbSymbolTable
70
1
0
ENDTAB
0
TABLE
2
BLOCK_RECORD
5
1
100
AcDbSymbolTable
70
1
0
BLOCK_RECORD
5
1F
100
AcDbSymbolTableRecord
100
AcDbBlockTableRecord
2
*MODEL_SPACE
0
BLOCK_RECORD
5
1B
100
AcDbSymbolTableRecord
100
AcDbBlockTableRecord
2
*PAPER_SPACE
0
ENDTAB
0
ENDSEC
0
SECTION
2
BLOCKS
0
BLOCK
5
20
100
AcDbEntity
100
AcDbBlockBegin
2
*MODEL_SPACE
0
ENDBLK
5
21
100
AcDbEntity
100
AcDbBlockEnd
0
BLOCK
5
1C
100
AcDbEntity
100
AcDbBlockBegin
2
*PAPER_SPACE
0
ENDBLK
5
1D
100
AcDbEntity
100
AcDbBlockEnd
0
ENDSEC
0
SECTION
2
ENTITIES
0
CIRCLE
5
100
100
AcDbEntity
8
0
100
AcDbCircle
10
150.584
20
179.21400000000003
30
0
40
1.5000000000000002
210
0
220
0
230
1
0
CIRCLE
5
101
100
AcDbEntity
8
0
100
AcDbCircle
10
120.684
20
149.214
30
0
40
1.5000000000000002
210
0
220
0
230
1
0
CIRCLE
5
102
100
AcDbEntity
8
0
100
AcDbCircle
10
150.684
20
149.214
30
0
40
1.5000000000000002
210
0
220
0
230
1
0
CIRCLE
5
103
100
AcDbEntity
8
0
100
AcDbCircle
10
150.584
20
69.213999999999999
30
0
40
1.5000000000000002
210
0
220
0
230
1
0
CIRCLE
5
104
100
AcDbEntity
8
0
100
AcDbCircle
10
150.584
20
109.214
30
0
40
1.5000000000000002
210
0
220
0
230
1
0
CIRCLE
5
105
100
AcDbEntity
8
0
100
AcDbCircle
10
10.584000000000003
20
179.21400000000003
30
0
40
1.5000000000000002
210
0
220
0
230
1
0
CIRCLE
5
106
100
AcDbEntity
8
0
100
AcDbCircle
10
40.584000000000003
20
109.214
30
0
40
1.5000000000000002
210
0
220
0
230
1
0
CIRCLE
5
107
100
AcDbEntity
8
0
100
AcDbCircle
10
10.584000000000003
20
109.214
30
0
40
1.5000000000000002
210
0
220
0
230
1
0
CIRCLE
5
108
100
AcDbEntity
8
0
100
AcDbCircle
10
120.584
20
39.213999999999999
30
0
40
1.5000000000000002
210
0
220
0
230
1
0
CIRCLE
5
109
100
AcDbEntity
8
0
100
AcDbCircle
10
150.584
20
39.213999999999999
30
0
40
1.5000000000000002
210
0
220
0
230
1
0
CIRCLE
5
110
100
AcDbEntity
8
0
100
AcDbCircle
10
80.584000000000003
20
69.213999999999999
30
0
40
1.5000000000000002
210
0
220
0
230
1
0
CIRCLE
5
111
100
AcDbEntity
8
0
100
AcDbCircle
10
40.584000000000003
20
149.214
30
0
40
1.5000000000000002
210
0
220
0
230
1
0
CIRCLE
5
112
100
AcDbEntity
8
0
100
AcDbCircle
10
80.584000000000003
20
149.214
30
0
40
1.5000000000000002
210
0
220
0
230
1
0
CIRCLE
5
113
100
AcDbEntity
8
0
100
AcDbCircle
10
40.584000000000003
20
39.213999999999999
30
0
40
1.5000000000000002
210
0
220
0
230
1
0
CIRCLE
5
114
100
AcDbEntity
8
0
100
AcDbCircle
10
80.584000000000003
20
39.213999999999999
30
0
40
1.5000000000000002
210
0
220
0
230
1
0
CIRCLE
5
115
100
AcDbEntity
8
0
100
AcDbCircle
10
120.584
20
109.214
30
0
40
1.5000000000000002
210
0
220
0
230
1
0
CIRCLE
5
116
100
AcDbEntity
8
0
100
AcDbCircle
10
80.584000000000003
20
109.214
30
0
40
1.5000000000000002
210
0
220
0
230
1
0
CIRCLE
5
117
100
AcDbEntity
8
0
100
AcDbCircle
10
120.584
20
179.21400000000003
30
0
40
1.5000000000000002
210
0
220
0
230
1
0
CIRCLE
5
118
100
AcDbEntity
8
0
100
AcDbCircle
10
10.584000000000003
20
149.214
30
0
40
1.5000000000000002
210
0
220
0
230
1
0
CIRCLE
5
119
100
AcDbEntity
8
0
100
AcDbCircle
10
80.584000000000003
20
179.21400000000003
30
0
40
1.5000000000000002
210
0
220
0
230
1
0
CIRCLE
5
120
100
AcDbEntity
8
0
100
AcDbCircle
10
10.584000000000003
20
39.213999999999999
30
0
40
1.5000000000000002
210
0
220
0
230
1
0
CIRCLE
5
121
100
AcDbEntity
8
0
100
AcDbCircle
10
10.584000000000003
20
69.213999999999999
30
0
40
1.5000000000000002
210
0
220
0
230
1
0
CIRCLE
5
122
100
AcDbEntity
8
0
100
AcDbCircle
10
120.584
20
69.213999999999999
30
0
40
1.5000000000000002
210
0
220
0
230
1
0
CIRCLE
5
123
100
AcDbEntity
8
0
100
AcDbCircle
10
40.584000000000003
20
179.21400000000003
30
0
40
1.5000000000000002
210
0
220
0
230
1
0
CIRCLE
5
124
100
AcDbEntity
8
0
100
AcDbCircle
10
40.584000000000003
20
69.213999999999999
30
0
40
1.5000000000000002
210
0
220
0
230
1
0
LINE
5
125
100
AcDbEntity
8
0
100
AcDbLine
10
8.7539999999999978
20
23.367999999999999
30
-4.6657502080632825e-16
11
4.7539999999999978
21
23.367999999999999
31
-4.6657502080632825e-16
0
LINE
5
126
100
AcDbEntity
8
0
100
AcDbLine
10
4.7539999999999978
20
23.367999999999999
30
-4.6657502080632825e-16
11
4.7539999999999978
21
29.367999999999999
31
-4.6657502080632825e-16
0
LINE
5
127
100
AcDbEntity
8
0
100
AcDbLine
10
161.27399999999997
20
5.6320000000000006
30
4.6657502080631198e-16
11
165.27399999999997
21
5.6320000000000006
31
4.6657502080631198e-16
0
LINE
5
128
100
AcDbEntity
8
0
100
AcDbLine
10
165.27399999999997
20
5.6320000000000006
30
4.6657502080631198e-16
11
165.27399999999997
21
-0.36800000000000055
31
4.6657502080631198e-16
0
LINE
5
129
100
AcDbEntity
8
0
100
AcDbLine
10
4.7539999999999978
20
29.367999999999999
30
-4.6657502080632825e-16
11
165.27399999999997
21
29.367999999999999
31
4.6657502080631198e-16
0
LINE
5
130
100
AcDbEntity
8
0
100
AcDbLine
10
165.27399999999997
20
29.367999999999999
30
4.6657502080631198e-16
11
165.27399999999997
21
-0.36800000000000055
31
4.6657502080631198e-16
0
LINE
5
131
100
AcDbEntity
8
0
100
AcDbLine
10
165.27399999999997
20
-0.36800000000000055
30
4.6657502080631198e-16
11
4.7539999999999978
21
-0.36799999999999944
31
4.6657502080631198e-16
0
LINE
5
132
100
AcDbEntity
8
0
100
AcDbLine
10
4.7539999999999978
20
-0.36799999999999944
30
4.6657502080631198e-16
11
4.7539999999999978
21
29.367999999999999
31
-4.6657502080632825e-16
0
LINE
5
133
100
AcDbEntity
8
0
100
AcDbLine
10
-0.10600000000000387
20
212.79600000000002
30
-4.6657502080632726e-16
11
-4.1060000000000034
21
212.79600000000002
31
-4.6657502080632726e-16
0
LINE
5
134
100
AcDbEntity
8
0
100
AcDbLine
10
-4.1060000000000034
20
212.79600000000002
30
-4.6657502080632726e-16
11
-4.1060000000000034
21
218.79600000000005
31
-4.6657502080632726e-16
0
LINE
5
135
100
AcDbEntity
8
0
100
AcDbLine
10
152.41400000000004
20
195.06000000000003
30
4.6657502080631987e-16
11
156.41400000000007
21
195.06000000000003
31
4.6657502080631987e-16
0
LINE
5
136
100
AcDbEntity
8
0
100
AcDbLine
10
156.41400000000007
20
195.06000000000003
30
4.6657502080631987e-16
11
156.41400000000007
21
189.06000000000003
31
4.6657502080631987e-16
0
LINE
5
137
100
AcDbEntity
8
0
100
AcDbLine
10
-4.1060000000000034
20
218.79600000000005
30
-4.6657502080632726e-16
11
156.41400000000007
21
218.79600000000005
31
4.6657502080631987e-16
0
LINE
5
138
100
AcDbEntity
8
0
100
AcDbLine
10
156.41400000000007
20
218.79600000000005
30
4.6657502080631987e-16
11
156.41400000000007
21
189.06000000000003
31
4.6657502080631987e-16
0
LINE
5
139
100
AcDbEntity
8
0
100
AcDbLine
10
156.41400000000007
20
189.06000000000003
30
4.6657502080631987e-16
11
-4.1060000000000034
21
189.06000000000003
31
4.6657502080631987e-16
0
LINE
5
140
100
AcDbEntity
8
0
100
AcDbLine
10
-4.1060000000000034
20
189.06000000000003
30
4.6657502080631987e-16
11
-4.1060000000000034
21
218.79600000000005
31
-4.6657502080632726e-16
0
LWPOLYLINE
5
141
100
AcDbEntity
8
0
100
AcDbPolyline
90
8
70
1
43
0.0
10
-39.415999999999976
20
-15.78599999999998
10
200.584
20
-15.78599999999998
42
0.41421356237309437
10
205.584
20
-10.78599999999998
10
205.584
20
229.214
42
0.41421356237309503
10
200.584
20
234.214
10
-39.415999999999976
20
234.214
42
0.41421356237309426
10
-44.415999999999976
20
229.214
10
-44.415999999999976
20
-10.78599999999998
42
0.41421356237309531
0
LINE
5
142
100
AcDbEntity
8
0
100
AcDbLine
10
-44.415999999999976
20
234.214
30
0
11
-34.415999999999976
21
234.214
31
0
0
LINE
5
143
100
AcDbEntity
8
0
100
AcDbLine
10
-34.415999999999976
20
234.214
30
0
11
-34.415999999999976
21
224.214
31
0
0
CIRCLE
5
144
100
AcDbEntity
8
0
100
AcDbCircle
10
-34.415999999999976
20
224.214
30
0
40
5.5000000000000027
210
0
220
0
230
1
0
CIRCLE
5
145
100
AcDbEntity
8
0
100
AcDbCircle
10
195.58400000000003
20
224.214
30
0
40
5.5000000000000027
210
0
220
0
230
1
0
CIRCLE
5
146
100
AcDbEntity
8
0
100
AcDbCircle
10
-34.415999999999976
20
-5.7860000000000156
30
0
40
5.5000000000000027
210
0
220
0
230
1
0
CIRCLE
5
147
100
AcDbEntity
8
0
100
AcDbCircle
10
195.58400000000003
20
-5.7860000000000156
30
0
40
5.5000000000000027
210
0
220
0
230
1
0
ENDSEC
0
SECTION
2
OBJECTS
0
DICTIONARY
5
C
100
AcDbDictionary
3
ACAD_GROUP
350
D
3
ACAD_MLINESTYLE
350
17
0
DICTIONARY
5
D
100
AcDbDictionary
0
DICTIONARY
5
1A
330
C
100
AcDbDictionary
0
DICTIONARY
5
17
100
AcDbDictionary
0
ENDSEC
0
EOF
