Amplitudes, 1000 Pa, 1250 Pa, 1500 Pa, 1750 Pa, 2000 Pa, 2250 Pa, 2500 Pa
1 points, 2.07567e-08, 3.13409e-08, 4.42644e-08, 5.94698e-08, 7.67237e-08, 9.55604e-08, 1.15228e-07
2 points, 9.88104e-08, 1.20349e-07, 1.42312e-07, 1.65014e-07, 1.88631e-07, 2.12974e-07, 2.36009e-07
3 points, 9.87736e-08, 1.26886e-07, 1.56859e-07, 1.84828e-07, 2.06815e-07, 2.22803e-07, 2.35764e-07
4 points, 1.16601e-07, 1.39236e-07, 1.64649e-07, 1.91368e-07, 2.15274e-07, 2.56047e-07, 0.365423
