Amplitudes, 1000 Pa, 1250 Pa, 1500 Pa, 1750 Pa, 2000 Pa, 2250 Pa, 2500 Pa
1 points, 6.8867, 6.88873, 6.88867, 7.07372, 6.88967, 6.89526, 6.71065
2 points, 27.168, 28.783, 29.1322, 29.4945, 30.2279, 32.0166, 31.4103
3 points, 47.8079, 49.3166, 50.6559, 54.6646, 54.6943, 56.0472, 56.0728
4 points, 70.6223, 74.05, 72.9874, 82.6444, 83.7623, 87.0043, 85.9718
