%!PS-Adobe-3.0 EPSF-3.0
%%Creator: (MATLAB, The Mathworks, Inc. Version 9.7.0.1216025 \(R2019b\) Update 1. Operating System: Linux)
%%Title: ./experiment_snapshot.eps
%%CreationDate: 2019-12-13T15:42:04
%%Pages: (atend)
%%BoundingBox:    89    48   865   664
%%LanguageLevel: 2
%%EndComments
%%BeginProlog
%%BeginResource: procset (Apache XML Graphics Std ProcSet) 1.2 0
%%Version: 1.2 0
%%Copyright: (Copyright 2001-2003,2010 The Apache Software Foundation. License terms: http://www.apache.org/licenses/LICENSE-2.0)
/bd{bind def}bind def
/ld{load def}bd
/GR/grestore ld
/GS/gsave ld
/RM/rmoveto ld
/C/curveto ld
/t/show ld
/L/lineto ld
/ML/setmiterlimit ld
/CT/concat ld
/f/fill ld
/N/newpath ld
/S/stroke ld
/CC/setcmykcolor ld
/A/ashow ld
/cp/closepath ld
/RC/setrgbcolor ld
/LJ/setlinejoin ld
/GC/setgray ld
/LW/setlinewidth ld
/M/moveto ld
/re {4 2 roll M
1 index 0 rlineto
0 exch rlineto
neg 0 rlineto
cp } bd
/_ctm matrix def
/_tm matrix def
/BT { _ctm currentmatrix pop matrix _tm copy pop 0 0 moveto } bd
/ET { _ctm setmatrix } bd
/iTm { _ctm setmatrix _tm concat } bd
/Tm { _tm astore pop iTm 0 0 moveto } bd
/ux 0.0 def
/uy 0.0 def
/F {
  /Tp exch def
  /Tf exch def
  Tf findfont Tp scalefont setfont
  /cf Tf def  /cs Tp def
} bd
/ULS {currentpoint /uy exch def /ux exch def} bd
/ULE {
  /Tcx currentpoint pop def
  gsave
  newpath
  cf findfont cs scalefont dup
  /FontMatrix get 0 get /Ts exch def /FontInfo get dup
  /UnderlinePosition get Ts mul /To exch def
  /UnderlineThickness get Ts mul /Tt exch def
  ux uy To add moveto  Tcx uy To add lineto
  Tt setlinewidth stroke
  grestore
} bd
/OLE {
  /Tcx currentpoint pop def
  gsave
  newpath
  cf findfont cs scalefont dup
  /FontMatrix get 0 get /Ts exch def /FontInfo get dup
  /UnderlinePosition get Ts mul /To exch def
  /UnderlineThickness get Ts mul /Tt exch def
  ux uy To add cs add moveto Tcx uy To add cs add lineto
  Tt setlinewidth stroke
  grestore
} bd
/SOE {
  /Tcx currentpoint pop def
  gsave
  newpath
  cf findfont cs scalefont dup
  /FontMatrix get 0 get /Ts exch def /FontInfo get dup
  /UnderlinePosition get Ts mul /To exch def
  /UnderlineThickness get Ts mul /Tt exch def
  ux uy To add cs 10 mul 26 idiv add moveto Tcx uy To add cs 10 mul 26 idiv add lineto
  Tt setlinewidth stroke
  grestore
} bd
/QT {
/Y22 exch store
/X22 exch store
/Y21 exch store
/X21 exch store
currentpoint
/Y21 load 2 mul add 3 div exch
/X21 load 2 mul add 3 div exch
/X21 load 2 mul /X22 load add 3 div
/Y21 load 2 mul /Y22 load add 3 div
/X22 load /Y22 load curveto
} bd
/SSPD {
dup length /d exch dict def
{
/v exch def
/k exch def
currentpagedevice k known {
/cpdv currentpagedevice k get def
v cpdv ne {
/upd false def
/nullv v type /nulltype eq def
/nullcpdv cpdv type /nulltype eq def
nullv nullcpdv or
{
/upd true def
} {
/sametype v type cpdv type eq def
sametype {
v type /arraytype eq {
/vlen v length def
/cpdvlen cpdv length def
vlen cpdvlen eq {
0 1 vlen 1 sub {
/i exch def
/obj v i get def
/cpdobj cpdv i get def
obj cpdobj ne {
/upd true def
exit
} if
} for
} {
/upd true def
} ifelse
} {
v type /dicttype eq {
v {
/dv exch def
/dk exch def
/cpddv cpdv dk get def
dv cpddv ne {
/upd true def
exit
} if
} forall
} {
/upd true def
} ifelse
} ifelse
} if
} ifelse
upd true eq {
d k v put
} if
} if
} if
} forall
d length 0 gt {
d setpagedevice
} if
} bd
/RE { % /NewFontName [NewEncodingArray] /FontName RE -
  findfont dup length dict begin
  {
    1 index /FID ne
    {def} {pop pop} ifelse
  } forall
  /Encoding exch def
  /FontName 1 index def
  currentdict definefont pop
  end
} bind def
%%EndResource
%%BeginResource: procset (Apache XML Graphics EPS ProcSet) 1.0 0
%%Version: 1.0 0
%%Copyright: (Copyright 2002-2003 The Apache Software Foundation. License terms: http://www.apache.org/licenses/LICENSE-2.0)
/BeginEPSF { %def
/b4_Inc_state save def         % Save state for cleanup
/dict_count countdictstack def % Count objects on dict stack
/op_count count 1 sub def      % Count objects on operand stack
userdict begin                 % Push userdict on dict stack
/showpage { } def              % Redefine showpage, { } = null proc
0 setgray 0 setlinecap         % Prepare graphics state
1 setlinewidth 0 setlinejoin
10 setmiterlimit [ ] 0 setdash newpath
/languagelevel where           % If level not equal to 1 then
{pop languagelevel             % set strokeadjust and
1 ne                           % overprint to their defaults.
{false setstrokeadjust false setoverprint
} if
} if
} bd
/EndEPSF { %def
count op_count sub {pop} repeat            % Clean up stacks
countdictstack dict_count sub {end} repeat
b4_Inc_state restore
} bd
%%EndResource
%FOPBeginFontDict
%%IncludeResource: font Courier-Oblique
%%IncludeResource: font Courier-BoldOblique
%%IncludeResource: font Courier-Bold
%%IncludeResource: font ZapfDingbats
%%IncludeResource: font Symbol
%%IncludeResource: font Helvetica
%%IncludeResource: font Helvetica-Oblique
%%IncludeResource: font Helvetica-Bold
%%IncludeResource: font Helvetica-BoldOblique
%%IncludeResource: font Times-Roman
%%IncludeResource: font Times-Italic
%%IncludeResource: font Times-Bold
%%IncludeResource: font Times-BoldItalic
%%IncludeResource: font Courier
%FOPEndFontDict
%%BeginResource: encoding WinAnsiEncoding
/WinAnsiEncoding [
/.notdef /.notdef /.notdef /.notdef /.notdef
/.notdef /.notdef /.notdef /.notdef /.notdef
/.notdef /.notdef /.notdef /.notdef /.notdef
/.notdef /.notdef /.notdef /.notdef /.notdef
/.notdef /.notdef /.notdef /.notdef /.notdef
/.notdef /.notdef /.notdef /.notdef /.notdef
/.notdef /.notdef /space /exclam /quotedbl
/numbersign /dollar /percent /ampersand /quotesingle
/parenleft /parenright /asterisk /plus /comma
/hyphen /period /slash /zero /one
/two /three /four /five /six
/seven /eight /nine /colon /semicolon
/less /equal /greater /question /at
/A /B /C /D /E
/F /G /H /I /J
/K /L /M /N /O
/P /Q /R /S /T
/U /V /W /X /Y
/Z /bracketleft /backslash /bracketright /asciicircum
/underscore /quoteleft /a /b /c
/d /e /f /g /h
/i /j /k /l /m
/n /o /p /q /r
/s /t /u /v /w
/x /y /z /braceleft /bar
/braceright /asciitilde /bullet /Euro /bullet
/quotesinglbase /florin /quotedblbase /ellipsis /dagger
/daggerdbl /circumflex /perthousand /Scaron /guilsinglleft
/OE /bullet /Zcaron /bullet /bullet
/quoteleft /quoteright /quotedblleft /quotedblright /bullet
/endash /emdash /asciitilde /trademark /scaron
/guilsinglright /oe /bullet /zcaron /Ydieresis
/space /exclamdown /cent /sterling /currency
/yen /brokenbar /section /dieresis /copyright
/ordfeminine /guillemotleft /logicalnot /sfthyphen /registered
/macron /degree /plusminus /twosuperior /threesuperior
/acute /mu /paragraph /middot /cedilla
/onesuperior /ordmasculine /guillemotright /onequarter /onehalf
/threequarters /questiondown /Agrave /Aacute /Acircumflex
/Atilde /Adieresis /Aring /AE /Ccedilla
/Egrave /Eacute /Ecircumflex /Edieresis /Igrave
/Iacute /Icircumflex /Idieresis /Eth /Ntilde
/Ograve /Oacute /Ocircumflex /Otilde /Odieresis
/multiply /Oslash /Ugrave /Uacute /Ucircumflex
/Udieresis /Yacute /Thorn /germandbls /agrave
/aacute /acircumflex /atilde /adieresis /aring
/ae /ccedilla /egrave /eacute /ecircumflex
/edieresis /igrave /iacute /icircumflex /idieresis
/eth /ntilde /ograve /oacute /ocircumflex
/otilde /odieresis /divide /oslash /ugrave
/uacute /ucircumflex /udieresis /yacute /thorn
/ydieresis
] def
%%EndResource
%FOPBeginFontReencode
/Courier-Oblique findfont
dup length dict begin
  {1 index /FID ne {def} {pop pop} ifelse} forall
  /Encoding WinAnsiEncoding def
  currentdict
end
/Courier-Oblique exch definefont pop
/Courier-BoldOblique findfont
dup length dict begin
  {1 index /FID ne {def} {pop pop} ifelse} forall
  /Encoding WinAnsiEncoding def
  currentdict
end
/Courier-BoldOblique exch definefont pop
/Courier-Bold findfont
dup length dict begin
  {1 index /FID ne {def} {pop pop} ifelse} forall
  /Encoding WinAnsiEncoding def
  currentdict
end
/Courier-Bold exch definefont pop
/Helvetica findfont
dup length dict begin
  {1 index /FID ne {def} {pop pop} ifelse} forall
  /Encoding WinAnsiEncoding def
  currentdict
end
/Helvetica exch definefont pop
/Helvetica-Oblique findfont
dup length dict begin
  {1 index /FID ne {def} {pop pop} ifelse} forall
  /Encoding WinAnsiEncoding def
  currentdict
end
/Helvetica-Oblique exch definefont pop
/Helvetica-Bold findfont
dup length dict begin
  {1 index /FID ne {def} {pop pop} ifelse} forall
  /Encoding WinAnsiEncoding def
  currentdict
end
/Helvetica-Bold exch definefont pop
/Helvetica-BoldOblique findfont
dup length dict begin
  {1 index /FID ne {def} {pop pop} ifelse} forall
  /Encoding WinAnsiEncoding def
  currentdict
end
/Helvetica-BoldOblique exch definefont pop
/Times-Roman findfont
dup length dict begin
  {1 index /FID ne {def} {pop pop} ifelse} forall
  /Encoding WinAnsiEncoding def
  currentdict
end
/Times-Roman exch definefont pop
/Times-Italic findfont
dup length dict begin
  {1 index /FID ne {def} {pop pop} ifelse} forall
  /Encoding WinAnsiEncoding def
  currentdict
end
/Times-Italic exch definefont pop
/Times-Bold findfont
dup length dict begin
  {1 index /FID ne {def} {pop pop} ifelse} forall
  /Encoding WinAnsiEncoding def
  currentdict
end
/Times-Bold exch definefont pop
/Times-BoldItalic findfont
dup length dict begin
  {1 index /FID ne {def} {pop pop} ifelse} forall
  /Encoding WinAnsiEncoding def
  currentdict
end
/Times-BoldItalic exch definefont pop
/Courier findfont
dup length dict begin
  {1 index /FID ne {def} {pop pop} ifelse} forall
  /Encoding WinAnsiEncoding def
  currentdict
end
/Courier exch definefont pop
%FOPEndFontReencode
%%EndProlog
%%Page: 1 1
%%PageBoundingBox: 0 0 954 717
%%BeginPageSetup
[1 0 0 -1 0 717] CT
%%EndPageSetup
GS
[0.75 0 0 0.75 0 0] CT
1 GC
N
0 0 1272 956 re
f
GR
GS
[0.75 0 0 0.75 0 0] CT
1 GC
N
0 0 1272 956 re
f
GR
GS
[0.75 0 0 0.75 0 0] CT
1 GC
N
165 398 M
1151 398 L
1151 72 L
165 72 L
cp
f
GR
GS
[0.75 0 0 0.75 0 0] CT
0.149 GC
2 setlinecap
1 LJ
0.667 LW
N
164.99 398 M
1150.998 398 L
S
GR
GS
[0.75 0 0 0.75 0 0] CT
0.149 GC
2 setlinecap
1 LJ
0.667 LW
N
164.99 72 M
1150.998 72 L
S
GR
GS
[0.75 0 0 0.75 0 0] CT
0.149 GC
2 setlinecap
1 LJ
0.667 LW
N
352.806 398 M
352.806 388.14 L
S
GR
GS
[0.75 0 0 0.75 0 0] CT
0.149 GC
2 setlinecap
1 LJ
0.667 LW
N
574.533 398 M
574.533 388.14 L
S
GR
GS
[0.75 0 0 0.75 0 0] CT
0.149 GC
2 setlinecap
1 LJ
0.667 LW
N
796.259 398 M
796.259 388.14 L
S
GR
GS
[0.75 0 0 0.75 0 0] CT
0.149 GC
2 setlinecap
1 LJ
0.667 LW
N
1017.871 398 M
1017.871 388.14 L
S
GR
GS
[0.75 0 0 0.75 0 0] CT
0.149 GC
2 setlinecap
1 LJ
0.667 LW
N
352.806 72 M
352.806 81.86 L
S
GR
GS
[0.75 0 0 0.75 0 0] CT
0.149 GC
2 setlinecap
1 LJ
0.667 LW
N
574.533 72 M
574.533 81.86 L
S
GR
GS
[0.75 0 0 0.75 0 0] CT
0.149 GC
2 setlinecap
1 LJ
0.667 LW
N
796.259 72 M
796.259 81.86 L
S
GR
GS
[0.75 0 0 0.75 0 0] CT
0.149 GC
2 setlinecap
1 LJ
0.667 LW
N
1017.871 72 M
1017.871 81.86 L
S
GR
GS
[0.75 0 0 0.75 264.60477 302.49998] CT
0.149 GC
/Helvetica 13.333 F
GS
[1 0 0 1 0 0] CT
-26 13 moveto 
1 -1 scale
(12:07:50) t 
GR
GR
GS
[0.75 0 0 0.75 430.8994 302.49998] CT
0.149 GC
/Helvetica 13.333 F
GS
[1 0 0 1 0 0] CT
-26 13 moveto 
1 -1 scale
(12:08:00) t 
GR
GR
GS
[0.75 0 0 0.75 597.194 302.49998] CT
0.149 GC
/Helvetica 13.333 F
GS
[1 0 0 1 0 0] CT
-26 13 moveto 
1 -1 scale
(12:08:10) t 
GR
GR
GS
[0.75 0 0 0.75 763.403 302.49998] CT
0.149 GC
/Helvetica 13.333 F
GS
[1 0 0 1 0 0] CT
-26 13 moveto 
1 -1 scale
(12:08:20) t 
GR
GR
GS
[0.75 0 0 0.75 863.24826 315.49999] CT
0.149 GC
/Helvetica 13.333 F
GS
[1 0 0 1 0 0] CT
-91 13 moveto 
1 -1 scale
(Dec 06, 2019   ) t 
GR
GR
GS
[0.75 0 0 0.75 0 0] CT
0.149 GC
2 setlinecap
1 LJ
0.667 LW
N
164.99 398 M
164.99 72 L
S
GR
GS
[0.75 0 0 0.75 0 0] CT
0.149 GC
2 setlinecap
1 LJ
0.667 LW
N
1150.998 398 M
1150.998 72 L
S
GR
GS
[0.75 0 0 0.75 0 0] CT
0.149 GC
2 setlinecap
1 LJ
0.667 LW
N
164.99 368.619 M
174.809 368.619 L
S
GR
GS
[0.75 0 0 0.75 0 0] CT
0.149 GC
2 setlinecap
1 LJ
0.667 LW
N
164.99 335.061 M
174.809 335.061 L
S
GR
GS
[0.75 0 0 0.75 0 0] CT
0.149 GC
2 setlinecap
1 LJ
0.667 LW
N
164.99 301.503 M
174.809 301.503 L
S
GR
GS
[0.75 0 0 0.75 0 0] CT
0.149 GC
2 setlinecap
1 LJ
0.667 LW
N
164.99 267.944 M
174.809 267.944 L
S
GR
GS
[0.75 0 0 0.75 0 0] CT
0.149 GC
2 setlinecap
1 LJ
0.667 LW
N
164.99 234.386 M
174.809 234.386 L
S
GR
GS
[0.75 0 0 0.75 0 0] CT
0.149 GC
2 setlinecap
1 LJ
0.667 LW
N
164.99 200.828 M
174.809 200.828 L
S
GR
GS
[0.75 0 0 0.75 0 0] CT
0.149 GC
2 setlinecap
1 LJ
0.667 LW
N
164.99 167.27 M
174.809 167.27 L
S
GR
GS
[0.75 0 0 0.75 0 0] CT
0.149 GC
2 setlinecap
1 LJ
0.667 LW
N
164.99 133.712 M
174.809 133.712 L
S
GR
GS
[0.75 0 0 0.75 0 0] CT
0.149 GC
2 setlinecap
1 LJ
0.667 LW
N
164.99 100.154 M
174.809 100.154 L
S
GR
GS
[0.75 0 0 0.75 0 0] CT
0.149 GC
2 setlinecap
1 LJ
0.667 LW
N
1150.998 368.619 M
1141.179 368.619 L
S
GR
GS
[0.75 0 0 0.75 0 0] CT
0.149 GC
2 setlinecap
1 LJ
0.667 LW
N
1150.998 335.061 M
1141.179 335.061 L
S
GR
GS
[0.75 0 0 0.75 0 0] CT
0.149 GC
2 setlinecap
1 LJ
0.667 LW
N
1150.998 301.503 M
1141.179 301.503 L
S
GR
GS
[0.75 0 0 0.75 0 0] CT
0.149 GC
2 setlinecap
1 LJ
0.667 LW
N
1150.998 267.944 M
1141.179 267.944 L
S
GR
GS
[0.75 0 0 0.75 0 0] CT
0.149 GC
2 setlinecap
1 LJ
0.667 LW
N
1150.998 234.386 M
1141.179 234.386 L
S
GR
GS
[0.75 0 0 0.75 0 0] CT
0.149 GC
2 setlinecap
1 LJ
0.667 LW
N
1150.998 200.828 M
1141.179 200.828 L
S
GR
GS
[0.75 0 0 0.75 0 0] CT
0.149 GC
2 setlinecap
1 LJ
0.667 LW
N
1150.998 167.27 M
1141.179 167.27 L
S
GR
GS
[0.75 0 0 0.75 0 0] CT
0.149 GC
2 setlinecap
1 LJ
0.667 LW
N
1150.998 133.712 M
1141.179 133.712 L
S
GR
GS
[0.75 0 0 0.75 0 0] CT
0.149 GC
2 setlinecap
1 LJ
0.667 LW
N
1150.998 100.154 M
1141.179 100.154 L
S
GR
GS
[0.75 0 0 0.75 119.71781 276.46406] CT
0.149 GC
/Helvetica 13.333 F
GS
[1 0 0 1 0 0] CT
-15 5 moveto 
1 -1 scale
(30) t 
GR
GR
GS
[0.75 0 0 0.75 119.71781 251.29548] CT
0.149 GC
/Helvetica 13.333 F
GS
[1 0 0 1 0 0] CT
-15 5 moveto 
1 -1 scale
(35) t 
GR
GR
GS
[0.75 0 0 0.75 119.71781 226.12688] CT
0.149 GC
/Helvetica 13.333 F
GS
[1 0 0 1 0 0] CT
-15 5 moveto 
1 -1 scale
(40) t 
GR
GR
GS
[0.75 0 0 0.75 119.71781 200.9583] CT
0.149 GC
/Helvetica 13.333 F
GS
[1 0 0 1 0 0] CT
-15 5 moveto 
1 -1 scale
(45) t 
GR
GR
GS
[0.75 0 0 0.75 119.71781 175.78971] CT
0.149 GC
/Helvetica 13.333 F
GS
[1 0 0 1 0 0] CT
-15 5 moveto 
1 -1 scale
(50) t 
GR
GR
GS
[0.75 0 0 0.75 119.71781 150.62113] CT
0.149 GC
/Helvetica 13.333 F
GS
[1 0 0 1 0 0] CT
-15 5 moveto 
1 -1 scale
(55) t 
GR
GR
GS
[0.75 0 0 0.75 119.71781 125.45254] CT
0.149 GC
/Helvetica 13.333 F
GS
[1 0 0 1 0 0] CT
-15 5 moveto 
1 -1 scale
(60) t 
GR
GR
GS
[0.75 0 0 0.75 119.71781 100.28395] CT
0.149 GC
/Helvetica 13.333 F
GS
[1 0 0 1 0 0] CT
-15 5 moveto 
1 -1 scale
(65) t 
GR
GR
GS
[0.75 0 0 0.75 119.71781 75.11536] CT
0.149 GC
/Helvetica 13.333 F
GS
[1 0 0 1 0 0] CT
-15 5 moveto 
1 -1 scale
(70) t 
GR
GR
GS
[0 -0.75 0.75 0 105.50314 176.24987] CT
0.149 GC
/Helvetica 14.667 F
GS
[1 0 0 1 0 0] CT
-44 -3 moveto 
1 -1 scale
(Speed \(km/h\)) t 
GR
GR
GS
[0.75 0 0 0.75 0 0] CT
0 0 1 RC
1 LJ
4 LW
N
164.872 188.735 M
166.588 189.104 L
173.21 189.056 L
179.833 188.476 L
186.569 187.099 L
195.36 187.606 L
202.097 188.186 L
208.719 188.742 L
215.341 188.307 L
221.963 188.041 L
228.699 188.09 L
235.321 188.452 L
241.943 190.723 L
248.565 199.76 L
255.302 210.415 L
261.924 218.558 L
268.546 223.752 L
275.168 228.706 L
281.904 233.369 L
288.526 238.564 L
295.148 243.976 L
301.771 247.383 L
310.676 251.853 L
321.751 257.434 L
328.373 259.053 L
337.279 263.885 L
346.184 267.075 L
354.976 269.998 L
361.712 273.381 L
368.334 275 L
374.956 272.656 L
381.578 271.859 L
388.315 265.673 L
394.937 263.354 L
401.559 262.943 L
408.181 264.32 L
414.917 262.701 L
421.539 262.363 L
428.161 264.03 L
434.783 265.287 L
441.52 269.781 L
448.142 266.809 L
454.764 263.112 L
461.386 259.15 L
468.122 253.061 L
474.744 246.924 L
481.366 239.409 L
487.989 231.774 L
492.441 226.41 L
499.178 218.074 L
505.8 210.004 L
512.422 205.655 L
519.044 202.297 L
525.78 198.165 L
532.402 194.758 L
539.024 191.013 L
545.646 188.983 L
552.383 185.19 L
559.005 181.614 L
565.627 179.705 L
572.249 175.96 L
581.155 177.845 L
587.777 179.101 L
596.682 178.618 L
605.588 178.159 L
612.21 178.304 L
623.285 177.555 L
629.907 177.676 L
636.529 176.854 L
643.265 176.564 L
649.887 175.525 L
656.51 176.54 L
663.246 175.598 L
669.868 175.815 L
676.49 176.033 L
683.112 176.009 L
689.848 174.897 L
696.471 174.825 L
703.093 174.704 L
709.715 175.26 L
716.451 174.124 L
723.073 174.849 L
729.695 174.776 L
736.317 174.124 L
743.054 174.293 L
749.676 174.511 L
756.298 174.994 L
762.92 174.704 L
769.656 173.568 L
776.278 174.873 L
782.9 174.1 L
789.522 174.849 L
796.259 175.356 L
802.881 174.801 L
809.503 174.607 L
816.125 174.704 L
822.861 174.68 L
829.483 175.139 L
836.105 175.719 L
842.728 173.592 L
849.464 174.172 L
858.255 174.994 L
867.161 175.187 L
876.066 174.873 L
884.858 174.97 L
891.594 174.511 L
898.216 173.931 L
911.46 174.221 L
918.197 174.438 L
924.819 174.414 L
931.441 174.825 L
938.063 174.341 L
944.799 174.559 L
951.421 173.931 L
958.043 174.607 L
964.666 174.825 L
971.402 175.163 L
978.024 174.752 L
984.646 174.535 L
991.268 174.076 L
998.004 174.148 L
1004.626 174.148 L
1011.249 173.882 L
1017.871 173.689 L
1024.607 174.68 L
1031.229 173.496 L
1037.851 174.076 L
1044.473 174.269 L
1051.209 174.752 L
1057.832 174.825 L
1064.454 173.882 L
1071.076 173.254 L
1077.812 173.689 L
1084.434 174.728 L
1091.056 175.163 L
1097.678 174.366 L
1104.415 173.713 L
1111.037 173.834 L
1117.659 174.752 L
1135.47 175.429 L
1151.115 198.072 L
S
GR
GS
[0.75 0 0 0.75 0 0] CT
1 0 0 RC
1 LJ
2 LW
N
164.872 190.407 M
171.041 190.651 L
177.663 190.892 L
184.285 191.907 L
202.097 191.11 L
208.719 191.81 L
215.341 190.626 L
221.963 190.868 L
228.699 190.747 L
235.321 191.859 L
241.943 191.617 L
248.565 190.216 L
255.302 190.868 L
261.924 191.4 L
268.546 192.753 L
275.168 194.033 L
281.904 196.425 L
288.526 199.615 L
295.148 202.103 L
301.771 204.882 L
310.676 209.545 L
319.582 215.368 L
326.204 220.925 L
335.109 228.609 L
343.901 237.283 L
352.806 245.039 L
359.428 250.765 L
363.881 253.906 L
370.503 258.062 L
377.24 262.532 L
383.862 266.277 L
390.484 270.771 L
397.106 273.792 L
403.842 276.353 L
410.464 277.73 L
417.086 278.262 L
423.708 280.581 L
430.445 279.494 L
437.067 280.871 L
443.689 281.306 L
450.311 280.219 L
457.047 281.233 L
463.669 281.693 L
470.292 279.639 L
476.914 278.189 L
483.65 277.802 L
490.272 274.879 L
496.894 271.617 L
503.516 268.162 L
510.253 265.673 L
516.875 260.889 L
523.497 256.588 L
530.119 251.249 L
536.855 246.368 L
543.477 241.149 L
550.099 236.099 L
556.721 230.252 L
563.458 224.187 L
570.08 218.848 L
576.702 212.396 L
583.324 206.356 L
592.229 197.174 L
601.135 188.283 L
607.757 182.508 L
616.663 175.501 L
625.454 168.349 L
634.36 162.889 L
640.982 159.216 L
647.718 155.713 L
654.34 153.417 L
660.962 153.127 L
667.584 151.557 L
674.321 151.726 L
680.943 151.339 L
687.565 151.412 L
694.187 152.33 L
700.923 151.388 L
707.545 152.717 L
714.167 152.354 L
720.79 154.287 L
727.526 153.876 L
734.148 155.399 L
740.77 156.413 L
747.392 156.921 L
754.128 158.685 L
760.751 158.878 L
767.373 160.158 L
773.995 161.946 L
780.731 162.502 L
787.353 163.154 L
793.975 164.218 L
800.597 165.498 L
807.334 166.924 L
813.956 167.939 L
820.578 168.929 L
827.2 169.606 L
833.936 170.645 L
840.558 171.998 L
847.18 172.94 L
853.802 173.979 L
862.708 174.801 L
869.33 176.323 L
876.066 176.613 L
884.858 176.903 L
893.763 177.772 L
900.385 178.473 L
907.008 179.295 L
913.744 178.836 L
920.366 178.98 L
926.988 179.512 L
933.61 179.101 L
940.346 178.908 L
946.969 179.101 L
953.591 178.884 L
960.213 179.198 L
966.949 179.029 L
973.571 178.908 L
980.193 179.15 L
986.929 178.473 L
993.552 178.521 L
1000.174 178.811 L
1006.796 178.401 L
1013.532 178.787 L
1020.154 177.821 L
1026.776 177.555 L
1033.398 177.386 L
1040.135 177.434 L
1046.757 177.362 L
1053.379 176.443 L
1060.001 176.178 L
1066.737 176.25 L
1073.359 175.066 L
1079.981 174.994 L
1086.604 175.018 L
1093.34 174.39 L
1099.962 174.366 L
1106.584 172.916 L
1113.206 173.399 L
1124.281 171.925 L
1144.261 171.514 L
1151.115 173.661 L
S
GR
GS
[0.75 0 0 0.75 0 0] CT
0 1 0 RC
1 LJ
2 LW
N
164.872 188.636 M
171.041 189.056 L
177.663 190.288 L
182.116 188.694 L
193.191 190.022 L
202.097 189.974 L
210.888 189.177 L
219.794 189.443 L
226.416 188.983 L
233.038 189.08 L
239.774 189.612 L
246.396 189.588 L
253.018 191.279 L
259.64 189.128 L
266.377 189.636 L
272.999 189.467 L
279.621 191.061 L
292.979 190.167 L
301.771 191.255 L
312.96 192.584 L
321.751 193.478 L
328.373 194.686 L
337.279 195.773 L
346.184 198.044 L
354.976 201.958 L
361.712 204.785 L
370.503 208.555 L
379.409 213.774 L
390.484 225.178 L
397.106 233.441 L
408.181 245.256 L
414.917 249.34 L
421.539 254.051 L
428.161 256.709 L
434.898 260.72 L
441.52 264.03 L
448.142 266.471 L
459.217 271.279 L
468.122 274.951 L
481.366 281.813 L
490.272 286.211 L
499.178 289.11 L
507.969 291.744 L
516.875 292.106 L
525.78 292.71 L
534.572 292.106 L
541.308 290.463 L
550.099 288.409 L
559.005 285.413 L
567.91 280.823 L
576.702 276.28 L
585.607 270.626 L
594.513 264.127 L
601.135 258.739 L
607.757 251.442 L
616.663 242.961 L
625.454 232.91 L
634.36 223.173 L
643.265 213.991 L
654.34 204.471 L
663.246 196.135 L
674.321 187.534 L
680.943 183.716 L
687.565 179.246 L
694.187 176.395 L
700.923 173.061 L
707.545 169.992 L
714.167 167.141 L
720.79 163.855 L
729.695 160.158 L
738.601 156.22 L
745.223 153.828 L
756.298 151.315 L
762.92 149.068 L
769.656 148.102 L
776.278 146.048 L
782.9 146.7 L
789.522 145.71 L
796.259 145.685 L
802.881 145.927 L
809.503 146.41 L
818.408 145.806 L
825.031 146.579 L
838.389 147.353 L
847.18 148.174 L
856.086 149.841 L
862.708 149.817 L
869.33 150.929 L
876.066 151.871 L
884.858 153.466 L
893.763 155.278 L
902.669 156.196 L
911.46 157.138 L
920.366 157.863 L
929.272 158.346 L
935.894 161.052 L
942.516 161.077 L
953.591 162.985 L
960.327 163.638 L
969.118 164.725 L
978.024 165.232 L
986.929 165.691 L
995.721 166.344 L
1004.626 167.528 L
1013.532 167.721 L
1020.154 168.712 L
1026.776 169.219 L
1033.398 170.21 L
1040.135 170.693 L
1046.757 170.959 L
1053.379 171.249 L
1060.001 171.08 L
1066.737 172.191 L
1073.359 172.964 L
1084.434 172.795 L
1091.056 172.747 L
1099.962 173.641 L
1108.867 174.003 L
1117.659 173.617 L
1135.47 173.665 L
1151.115 173.95 L
S
GR
GS
[0.75 0 0 0.75 0 0] CT
0 0 0.173 RC
1 LJ
2 LW
N
164.872 188.929 M
171.041 189.128 L
177.663 189.563 L
184.285 191.086 L
202.097 190.578 L
208.719 190.288 L
215.341 190.989 L
221.963 191.835 L
228.699 192.729 L
235.321 192.197 L
241.943 191.69 L
248.565 192.1 L
255.302 192.028 L
261.924 191.327 L
268.546 191.134 L
275.168 191.665 L
281.904 191.69 L
288.526 192.076 L
295.148 192.439 L
301.771 189.829 L
310.676 191.4 L
319.582 191.617 L
326.204 191.279 L
335.109 191.545 L
341.731 192.68 L
350.637 192.68 L
357.259 193.985 L
363.881 193.719 L
370.503 194.057 L
377.24 194.831 L
383.862 196.039 L
390.484 198.286 L
397.106 200.025 L
403.842 201.499 L
410.464 204.713 L
417.086 209.787 L
423.708 215.078 L
430.445 219.017 L
437.067 224.356 L
443.689 229.479 L
450.311 234.867 L
457.047 239.409 L
463.669 245.957 L
470.292 249.509 L
476.914 255.018 L
483.65 258.956 L
490.272 262.87 L
496.894 266.93 L
503.516 271.279 L
510.253 274.347 L
516.875 279.832 L
523.497 283.046 L
530.119 285.317 L
536.855 287.878 L
543.477 288.12 L
550.099 288.047 L
556.721 290.004 L
563.458 291.212 L
570.08 290.27 L
576.702 291.357 L
583.324 291.043 L
592.229 291.333 L
601.135 289.328 L
607.757 287.685 L
616.663 284.954 L
625.454 280.823 L
632.19 277.488 L
638.813 274.081 L
643.265 270.989 L
649.887 266.519 L
656.51 261.928 L
663.132 257.386 L
669.868 251.49 L
676.49 245.16 L
683.112 238.709 L
689.734 233.079 L
696.471 225.371 L
703.093 220.031 L
709.715 213.677 L
716.337 207.226 L
723.073 200.968 L
729.695 195.556 L
736.317 190.433 L
743.054 185.19 L
749.676 180.672 L
756.298 177.265 L
762.92 173.423 L
769.656 170.161 L
778.448 164.991 L
785.07 161.898 L
791.806 158.08 L
798.428 153.586 L
805.05 152.547 L
811.672 150.059 L
818.408 148.343 L
825.031 146.217 L
831.653 146.314 L
838.275 145.806 L
845.011 145.154 L
853.802 145.251 L
862.708 145.42 L
869.33 144.912 L
876.066 145.516 L
884.858 145.081 L
891.594 145.202 L
898.216 146 L
907.008 145.371 L
913.744 146.41 L
920.366 145.855 L
926.988 146.7 L
933.61 147.377 L
940.346 147.256 L
946.969 148.512 L
953.591 149.89 L
960.213 149.962 L
966.949 150.325 L
973.571 152.692 L
980.193 154.094 L
986.929 152.668 L
993.552 154.408 L
1000.174 154.529 L
1006.796 155.229 L
1013.532 155.592 L
1020.154 155.568 L
1024.607 156.776 L
1031.229 155.954 L
1037.851 156.776 L
1044.473 157.09 L
1051.209 158.008 L
1057.832 158.008 L
1064.454 159.554 L
1071.076 159.893 L
1077.812 160.98 L
1084.434 161.536 L
1091.056 161.173 L
1097.678 162.212 L
1104.415 162.309 L
1111.037 163.251 L
1117.659 164.991 L
1135.47 166.489 L
1151.115 169.159 L
S
GR
GS
[0.75 0 0 0.75 0 0] CT
1 0.102 0.725 RC
1 LJ
2 LW
N
164.872 185.806 M
166.588 185.601 L
173.21 186.326 L
179.833 186.616 L
186.569 187.558 L
199.813 188.234 L
206.435 188.597 L
213.171 189.153 L
219.794 189.515 L
226.416 188.621 L
233.038 188.935 L
239.774 190.409 L
246.396 191.11 L
257.471 190.433 L
264.093 192.052 L
270.829 191.061 L
277.451 191.376 L
281.904 190.675 L
286.243 190.771 L
292.979 191.255 L
301.771 191.182 L
308.507 190.941 L
315.129 191.327 L
324.034 191.835 L
330.657 191.255 L
339.562 191.327 L
348.354 192.318 L
354.976 191.98 L
361.712 191.714 L
368.334 192.656 L
374.956 192.801 L
381.578 192.439 L
388.315 192.366 L
399.389 192.318 L
410.464 193.937 L
417.086 194.831 L
423.708 196.087 L
430.445 196.57 L
437.067 198.165 L
443.689 202.973 L
450.311 207.612 L
457.047 212.082 L
463.669 218.364 L
470.292 224.477 L
476.914 231.967 L
483.65 239.071 L
490.272 247.648 L
496.894 254.462 L
503.516 261.227 L
514.705 271.617 L
521.327 278.527 L
527.949 282.804 L
534.572 290.753 L
541.308 295.126 L
547.93 299.161 L
554.552 302.979 L
561.174 305.854 L
567.91 307.497 L
574.533 309.793 L
581.155 308.705 L
587.777 310.59 L
596.682 311.943 L
603.304 311.363 L
610.041 311.267 L
616.663 310.952 L
623.285 308.705 L
629.907 307.981 L
636.643 306.313 L
643.265 304.211 L
649.887 301.892 L
656.51 299.524 L
660.962 297.398 L
667.584 294.087 L
674.321 291.261 L
683.112 287.733 L
694.187 280.75 L
700.923 276.667 L
707.545 272.535 L
714.167 267.703 L
720.79 262.073 L
727.526 257.072 L
734.148 250.862 L
740.77 246.948 L
747.392 239.772 L
754.128 234.07 L
762.92 225.565 L
769.656 219.258 L
776.278 212.372 L
782.9 205.945 L
793.975 195.845 L
800.597 189.636 L
809.503 180.817 L
816.125 175.574 L
822.861 170.306 L
829.483 164.846 L
836.105 159.216 L
847.18 152.185 L
853.917 147.039 L
862.708 142.158 L
869.33 137.881 L
876.066 135.658 L
884.858 132.396 L
891.594 130.778 L
898.216 128.99 L
904.838 127.25 L
911.46 126.163 L
918.197 125.39 L
924.819 124.81 L
933.724 122.659 L
940.346 122.345 L
946.969 122.031 L
953.591 121.934 L
960.327 120.63 L
966.949 121.403 L
973.571 121.789 L
980.193 122.853 L
986.929 122.804 L
993.552 124.23 L
1000.174 125.921 L
1006.796 126.839 L
1013.532 127.008 L
1020.154 130.294 L
1024.607 130.319 L
1031.229 132.372 L
1037.851 133.435 L
1044.473 135.127 L
1051.209 136.117 L
1057.832 136.866 L
1073.359 139.911 L
1079.981 141.385 L
1086.604 142.641 L
1093.34 143.535 L
1099.962 144.936 L
1106.584 145.71 L
1113.206 147.159 L
1126.564 150.735 L
1146.545 155.133 L
1151.115 157.095 L
S
GR
GS
[0.75 0 0 0.75 0 0] CT
1 0.827 0 RC
1 LJ
2 LW
N
164.872 185.539 M
171.041 184.344 L
177.663 184.199 L
184.285 186.157 L
202.097 185.021 L
208.719 185.408 L
215.341 186.471 L
221.963 187.292 L
228.699 188.259 L
235.321 188.887 L
241.943 188.79 L
248.565 189.37 L
255.302 190.022 L
261.924 190.143 L
268.546 189.563 L
275.168 189.95 L
281.904 190.167 L
288.526 190.771 L
295.148 190.24 L
301.771 190.264 L
308.507 191.376 L
315.129 190.965 L
321.751 190.457 L
328.373 191.738 L
335.109 192.004 L
343.901 191.665 L
352.806 191.4 L
359.428 191.617 L
366.051 192.414 L
372.787 191.424 L
379.409 191.69 L
386.031 191.907 L
392.653 193.091 L
399.389 192.753 L
406.012 191.835 L
412.634 192.221 L
419.256 192.849 L
425.992 193.188 L
432.614 192.849 L
439.236 192.898 L
445.972 193.84 L
452.595 194.71 L
459.217 196.498 L
465.839 197.899 L
472.575 200.05 L
479.197 203.819 L
485.819 206.936 L
492.441 209.255 L
499.178 213.169 L
505.8 218.171 L
512.422 223.97 L
519.044 229.769 L
525.78 235.713 L
532.402 243.662 L
539.024 248.712 L
545.646 256.178 L
552.383 262.411 L
559.005 269.032 L
565.627 276.594 L
572.249 283.094 L
581.155 290.802 L
590.06 297.905 L
S
GR
GS
[0.75 0 0 0.75 0 0] CT
1 0.827 0 RC
1 LJ
2 LW
N
603.304 305.709 M
609.927 309.72 L
616.663 312.765 L
623.285 314.988 L
629.907 319.385 L
636.529 320.666 L
643.265 321.825 L
649.887 322.695 L
656.51 322.333 L
663.132 321.294 L
669.868 319.312 L
676.49 317.162 L
683.112 315.688 L
689.734 313.127 L
696.471 310.711 L
703.093 308.415 L
709.715 305.54 L
727.526 297.108 L
747.392 285.462 L
767.373 271.327 L
785.07 253.882 L
802.881 235.278 L
805.05 232.088 L
807.334 229.406 L
809.503 227.087 L
811.672 224.308 L
813.956 221.771 L
816.125 219.331 L
818.408 216.89 L
820.578 214.378 L
822.861 211.744 L
825.031 208.506 L
827.2 206.694 L
829.483 204.254 L
831.653 200.75 L
833.936 198.817 L
836.105 196.015 L
838.389 193.574 L
840.558 191.182 L
845.011 185.456 L
847.18 182.871 L
849.464 180.865 L
851.633 178.328 L
853.802 175.888 L
856.086 172.916 L
858.255 170.476 L
860.539 168.591 L
862.708 166.561 L
864.992 163.879 L
867.161 161.439 L
869.33 159.796 L
871.614 157.67 L
873.783 155.036 L
876.066 153.272 L
878.236 151.194 L
880.405 149.334 L
882.688 147.28 L
884.858 145.637 L
887.141 144.139 L
889.311 141.409 L
891.594 139.21 L
893.763 138.244 L
895.933 137.108 L
898.216 135.368 L
900.385 133.629 L
902.669 132.155 L
904.838 130.319 L
907.008 129.207 L
909.291 127.975 L
911.46 127.637 L
913.744 126.09 L
915.913 124.423 L
942.516 113.043 L
949.138 111.883 L
955.874 111.593 L
962.496 113.067 L
973.571 114.251 L
980.193 114.879 L
986.929 114.976 L
993.552 115.169 L
1000.174 116.522 L
1006.796 116.667 L
1013.532 117.271 L
1020.154 117.948 L
1024.607 119.204 L
1031.229 119.615 L
1037.851 120.702 L
1044.473 122.152 L
1051.209 123.118 L
1057.832 123.215 L
1064.454 125.704 L
1071.076 126.936 L
1077.812 128.458 L
1084.434 129.062 L
1091.056 131.092 L
1097.678 132.566 L
1104.415 133.967 L
1111.037 134.958 L
1117.659 136.625 L
1135.47 140.539 L
1151.115 144.706 L
S
GR
GS
[0.75 0 0 0.75 0 0] CT
0 0.345 0 RC
1 LJ
2 LW
N
164.872 180.203 M
171.041 180.889 L
177.663 180.865 L
184.285 183.426 L
202.097 182.411 L
208.719 182.17 L
215.341 182.629 L
221.963 182.532 L
228.699 182.846 L
235.321 183.74 L
241.943 184.369 L
248.565 184.828 L
255.302 185.045 L
261.924 186.084 L
268.546 185.818 L
275.168 186.906 L
281.904 186.954 L
288.526 187.461 L
295.148 187.534 L
306.223 187.993 L
315.129 188.186 L
324.034 189.249 L
341.731 189.708 L
350.637 189.612 L
357.259 190.022 L
363.881 190.747 L
370.503 191.134 L
377.24 191.11 L
383.862 191.037 L
390.484 191.545 L
397.106 191.11 L
403.842 192.656 L
410.464 191.98 L
417.086 192.1 L
423.708 191.424 L
430.445 192.439 L
437.067 192.68 L
445.972 193.695 L
452.595 193.381 L
459.217 193.478 L
465.839 193.502 L
476.914 193.695 L
483.65 194.734 L
490.272 195.217 L
496.894 196.594 L
505.8 198.068 L
512.422 199.736 L
519.044 202.297 L
525.78 205.752 L
532.402 211.865 L
539.024 217.591 L
545.646 225.903 L
552.383 234.094 L
559.005 242.55 L
565.627 250.185 L
572.249 258.618 L
581.155 271.182 L
587.777 279.011 L
596.682 288.941 L
603.304 297.108 L
614.379 309.14 L
623.285 314.311 L
629.907 319.143 L
636.643 322.188 L
645.435 327.213 L
652.057 331.079 L
658.793 333.955 L
665.415 335.598 L
674.321 337.603 L
680.943 339.004 L
687.565 339.198 L
694.187 339.874 L
700.923 339.512 L
707.545 338.787 L
714.167 337.12 L
720.79 336.105 L
729.695 333.689 L
736.317 331.587 L
743.054 329.195 L
749.676 327.238 L
758.581 324.241 L
765.203 321.656 L
771.825 319.578 L
778.448 316.727 L
787.353 313.61 L
793.975 310.203 L
800.597 306.966 L
807.334 303.39 L
816.125 297.905 L
822.861 293.822 L
829.483 289.086 L
836.105 284.64 L
845.011 278.213 L
853.917 270.24 L
860.539 264.586 L
867.161 258.135 L
876.066 249.992 L
884.858 241.391 L
891.594 235.012 L
900.385 226.217 L
909.291 217.422 L
915.913 211.357 L
922.535 204.761 L
929.272 197.803 L
935.894 191.714 L
942.516 185.601 L
949.138 179.778 L
955.874 172.312 L
962.496 167.624 L
969.118 160.521 L
975.855 154.746 L
982.477 148.053 L
989.099 143.052 L
995.721 137.253 L
1002.457 131.647 L
1011.249 125.438 L
1017.871 119.615 L
1024.607 115.58 L
1031.229 111.448 L
1037.851 107.582 L
1044.473 103.813 L
1051.209 101.034 L
1057.832 97.748 L
1064.454 94.076 L
1071.076 91.563 L
1077.812 89.05 L
1084.434 86.658 L
1091.056 84.459 L
1097.678 81.874 L
1104.415 80.738 L
1111.037 79.579 L
1117.659 80.763 L
1135.47 76.703 L
1151.115 78.378 L
S
GR
GS
[0.75 0 0 0.75 0 0] CT
0.518 0.518 1 RC
1 LJ
2 LW
N
164.872 174.745 M
171.041 175.187 L
177.663 174.631 L
184.285 175.912 L
202.097 174.511 L
210.888 174.559 L
215.341 175.598 L
221.963 173.979 L
228.699 174.414 L
235.321 174.486 L
241.943 174.631 L
248.565 176.105 L
255.302 174.945 L
261.924 174.897 L
268.546 175.018 L
275.168 175.646 L
284.074 176.371 L
290.696 177.023 L
297.432 177.555 L
304.054 177.772 L
312.845 178.811 L
321.751 180.575 L
330.657 181.421 L
341.731 181.807 L
350.637 184.417 L
357.259 185.118 L
363.881 187.075 L
370.503 187.606 L
377.24 188.114 L
383.862 189.008 L
390.484 189.926 L
397.106 191.883 L
403.842 192.221 L
410.464 192.825 L
417.086 193.284 L
423.708 196.039 L
430.445 197.054 L
437.067 197.029 L
443.689 198.842 L
450.311 199.808 L
457.047 199.832 L
463.669 200.581 L
470.292 202.176 L
476.914 202.852 L
483.65 203.432 L
490.272 204.592 L
496.894 202.152 L
503.516 203.819 L
510.253 204.665 L
516.875 205.414 L
523.497 203.626 L
530.119 204.205 L
536.855 205.317 L
543.477 204.254 L
550.099 203.771 L
556.721 204.205 L
563.458 203.964 L
570.08 204.109 L
576.702 203.529 L
583.324 203.746 L
592.229 204.036 L
601.135 205.075 L
607.757 207.636 L
616.663 211.092 L
625.454 217.519 L
634.36 223.148 L
640.982 228.343 L
647.718 234.214 L
654.34 239.868 L
660.962 248.277 L
667.584 253.254 L
674.321 263.523 L
680.943 269.829 L
687.565 278.648 L
694.187 286.404 L
700.923 292.179 L
707.545 301.384 L
714.167 304.042 L
720.79 309.334 L
727.526 313.538 L
734.148 316.075 L
740.77 320.811 L
747.392 322.381 L
754.128 324.725 L
760.751 327.697 L
767.373 326.996 L
773.995 330.572 L
780.731 331.78 L
787.353 334.269 L
793.975 335.308 L
800.597 335.332 L
807.334 337.386 L
813.956 336.008 L
820.578 336.733 L
827.2 336.177 L
833.936 335.743 L
840.558 335.163 L
847.18 333.81 L
853.802 332.481 L
862.708 330.306 L
869.33 329.074 L
876.066 326.585 L
884.858 324.725 L
893.763 321.125 L
902.669 318.201 L
909.291 315.277 L
915.913 312.571 L
922.535 309.454 L
929.272 306.483 L
935.894 303.052 L
942.516 299.5 L
949.138 296.528 L
955.874 290.995 L
962.496 285.172 L
969.118 278.986 L
975.74 272.269 L
982.477 264.417 L
989.099 257.748 L
995.721 251.176 L
1002.343 244.338 L
1009.079 237.452 L
1015.701 231.363 L
1022.323 224.405 L
1031.229 214.523 L
1037.851 208.941 L
1044.473 202.272 L
1051.209 195.894 L
1057.832 187.945 L
1064.454 184.441 L
1071.076 176.951 L
1077.812 171.249 L
1084.434 165.474 L
1091.056 159.675 L
1097.678 153.248 L
1104.415 147.957 L
1111.037 143.438 L
1117.659 139.283 L
1135.47 127.298 L
1151.115 118.698 L
S
GR
GS
[0.75 0 0 0.75 0 0] CT
0.62 0.31 0.275 RC
1 LJ
2 LW
N
164.872 174.146 M
168.758 174.486 L
175.494 174.559 L
182.116 174.462 L
188.738 174.196 L
197.644 174.148 L
204.266 174.486 L
210.888 175.622 L
217.51 174.631 L
224.246 174.873 L
230.868 174.39 L
237.491 173.012 L
244.227 177.99 L
261.924 172.505 L
268.546 173.472 L
275.168 173.278 L
281.904 174.051 L
288.526 173.568 L
295.148 172.336 L
301.771 173.81 L
310.676 173.834 L
319.582 174.897 L
326.204 175.888 L
335.109 175.38 L
343.901 177.289 L
352.806 178.57 L
359.428 178.401 L
366.051 179.778 L
372.787 182.17 L
379.409 183.813 L
386.031 184.465 L
392.767 185.722 L
399.389 186.785 L
406.012 188.694 L
412.634 189.829 L
419.37 190.844 L
425.992 191.424 L
432.614 192.946 L
439.236 195.411 L
445.972 196.184 L
452.595 197.44 L
459.217 198.745 L
465.839 200.605 L
472.575 201.983 L
479.197 202.466 L
485.819 204.205 L
492.441 204.761 L
499.178 204.544 L
505.8 204.93 L
512.422 206.235 L
519.044 205.969 L
525.78 206.042 L
532.402 205.703 L
539.024 204.278 L
545.646 205.848 L
554.552 205.172 L
561.174 206.259 L
567.91 204.906 L
574.533 204.81 L
585.607 203.988 L
594.513 203.795 L
603.304 204.012 L
612.21 204.061 L
621.116 204.254 L
627.738 204.181 L
634.36 205.051 L
640.982 206.936 L
647.718 208.096 L
654.34 210.077 L
660.962 212.372 L
667.584 216.721 L
674.321 219.79 L
680.943 224.84 L
687.565 229.092 L
694.187 236.051 L
700.923 241.584 L
707.545 249.509 L
714.167 256.492 L
720.79 263.329 L
727.526 270.868 L
734.148 276.908 L
740.77 284.302 L
747.392 292.179 L
754.128 297.253 L
762.92 307.522 L
769.656 313.127 L
776.278 317.669 L
782.9 323.831 L
789.522 326.464 L
796.259 331.78 L
802.881 336.129 L
809.503 338.159 L
816.125 343.426 L
822.861 344.997 L
829.483 347.92 L
836.105 349.273 L
842.728 350.868 L
851.633 351.375 L
858.255 349.684 L
867.161 348.524 L
876.066 346.809 L
884.858 344.924 L
893.763 343.039 L
902.669 340.865 L
909.291 339.222 L
915.913 336.492 L
922.535 334.824 L
929.272 331.683 L
935.894 329.243 L
942.516 326.513 L
949.138 323.734 L
955.874 321.052 L
962.496 318.298 L
969.118 314.577 L
975.74 311.798 L
982.477 306.555 L
989.099 303.221 L
995.721 297.349 L
1002.343 291.865 L
1009.079 285.872 L
1015.701 278.721 L
1022.323 271.665 L
1028.946 264.127 L
1035.682 256.975 L
1042.304 249.074 L
1048.926 241.463 L
1055.662 232.958 L
1062.284 225.782 L
1068.906 216.915 L
1075.529 210.463 L
1082.265 202.587 L
1088.887 194.251 L
1095.509 186.688 L
1102.131 180.962 L
1108.867 173.157 L
1115.49 164.653 L
1131.017 148.754 L
1151.115 132.399 L
S
GR
GS
[0.75 0 0 0.75 0 0] CT
0 1 0.757 RC
1 LJ
2 LW
N
164.872 177.417 M
168.758 177.531 L
175.494 176.878 L
182.116 176.347 L
188.738 175.332 L
195.36 174.849 L
202.097 174.438 L
208.719 174.728 L
215.341 174.704 L
221.963 173.447 L
228.699 173.52 L
235.321 173.762 L
241.943 173.302 L
248.565 172.795 L
255.302 173.327 L
261.924 173.786 L
268.546 172.698 L
275.168 173.23 L
281.904 173.617 L
288.526 173.544 L
295.148 173.037 L
301.771 172.795 L
308.507 173.375 L
315.129 173.23 L
326.204 172.263 L
337.279 173.254 L
346.184 174.124 L
354.976 174.897 L
361.712 174.897 L
368.334 175.574 L
374.956 176.564 L
381.578 177.337 L
388.315 178.328 L
394.937 179.464 L
401.559 180.261 L
408.181 180.913 L
414.917 182.556 L
421.539 184.634 L
428.161 185.601 L
434.783 186.809 L
441.52 188.283 L
448.142 189.781 L
454.764 191.641 L
461.386 192.849 L
468.122 194.734 L
474.744 195.435 L
481.366 197.199 L
487.989 198.6 L
494.725 200.074 L
501.347 200.895 L
507.969 202.442 L
514.591 204.302 L
521.327 205.148 L
527.949 206.38 L
534.572 207.274 L
541.194 206.912 L
547.93 207.322 L
554.552 207.733 L
561.174 208.216 L
567.91 208.313 L
574.533 208.482 L
581.155 207.032 L
590.06 206.936 L
596.682 206.525 L
603.304 207.443 L
609.927 206.404 L
616.663 205.027 L
629.907 204.423 L
636.529 203.167 L
643.265 202.877 L
649.887 203.239 L
656.51 202.466 L
663.132 202.49 L
669.868 203.65 L
676.49 204.326 L
683.112 205.969 L
689.848 208.651 L
696.471 211.043 L
703.093 213.532 L
709.715 218.823 L
716.451 225.057 L
723.073 231.677 L
729.695 237.96 L
736.317 245.957 L
743.054 253.737 L
749.676 261.976 L
756.298 269.757 L
762.92 276.739 L
769.656 283.408 L
776.278 289.811 L
782.9 297.398 L
789.522 303.728 L
796.259 309.865 L
802.881 313.514 L
809.503 317.259 L
816.125 320.521 L
822.861 322.719 L
829.483 327.117 L
836.105 329.75 L
842.728 333.616 L
849.464 339.077 L
864.992 346.688 L
871.614 348.693 L
882.688 350.433 L
889.311 350.94 L
898.216 350.385 L
904.838 348.935 L
911.46 347.896 L
918.197 346.929 L
924.819 345.335 L
931.441 344.247 L
938.063 342.29 L
944.799 340.261 L
951.421 338.739 L
958.043 336.347 L
964.666 334.22 L
971.402 332.094 L
978.024 330.089 L
984.646 327.407 L
991.268 324.507 L
998.004 321.415 L
1004.626 317.645 L
1011.249 314.142 L
1017.871 309.865 L
1024.607 305.83 L
1031.229 300.949 L
1037.851 295.948 L
1044.473 290.27 L
1051.209 284.374 L
1057.832 278.189 L
1064.454 271.931 L
1071.076 265.214 L
1077.812 258.014 L
1084.434 250.33 L
1091.056 243.13 L
1097.678 235.374 L
1104.415 227.159 L
1111.037 218.727 L
1117.659 212.01 L
1135.47 194.009 L
1151.115 178.178 L
S
GR
GS
[0.75 0 0 0.75 0 0] CT
0 0.518 0.584 RC
1 LJ
2 LW
N
164.872 179.785 M
171.041 180.019 L
177.663 181.228 L
184.285 181.373 L
202.097 181.034 L
208.719 181.421 L
215.341 181.59 L
221.963 182.315 L
228.699 181.687 L
235.321 181.517 L
241.943 180.406 L
253.018 181.348 L
259.64 180.261 L
266.377 180.189 L
272.999 180.454 L
279.621 180.768 L
286.243 179.754 L
292.979 179.415 L
301.771 179.874 L
310.676 179.367 L
319.582 179.005 L
326.204 178.231 L
335.109 177.797 L
343.901 177.337 L
352.806 178.207 L
359.428 178.28 L
366.165 177.893 L
372.787 179.512 L
379.409 179.464 L
386.031 178.884 L
392.767 178.763 L
399.389 178.449 L
408.181 179.222 L
414.917 179.44 L
421.539 180.406 L
428.161 180.865 L
434.783 180.672 L
441.52 180.43 L
448.142 181.276 L
454.764 183.426 L
461.386 184.683 L
468.122 185.432 L
474.744 186.398 L
481.366 187.196 L
488.103 188.911 L
494.725 190.143 L
501.347 190.675 L
507.969 191.569 L
514.705 192.173 L
521.327 194.372 L
527.949 195.676 L
534.572 196.449 L
541.308 197.392 L
547.93 199.639 L
554.552 201.258 L
561.174 201.789 L
567.91 203.215 L
574.533 204.616 L
583.324 205.993 L
592.229 207.491 L
601.135 208.361 L
607.757 209.038 L
616.663 210.391 L
625.454 210.729 L
632.19 210.173 L
638.813 209.183 L
645.435 210.705 L
652.057 211.382 L
658.793 210.101 L
665.415 210.657 L
672.037 210.922 L
678.659 210.947 L
685.396 210.053 L
692.018 210.343 L
698.64 210.149 L
705.262 210.149 L
711.998 210.753 L
720.79 210.874 L
727.526 211.212 L
734.148 213.363 L
740.77 216.697 L
747.392 219.089 L
754.128 221.771 L
762.92 226.821 L
769.656 231.653 L
776.278 237.67 L
782.9 243.179 L
789.522 250.451 L
796.259 255.815 L
802.881 264.248 L
809.503 271.714 L
816.125 279.905 L
822.861 288.844 L
829.483 295.199 L
836.105 301.36 L
842.728 304.646 L
851.633 311.557 L
858.255 318.515 L
867.161 326.368 L
876.066 332.408 L
884.858 339.971 L
891.594 348.065 L
898.216 351.013 L
907.122 355.797 L
913.744 359.542 L
920.366 362.248 L
926.988 363.939 L
933.724 364.761 L
940.346 367.25 L
946.969 365.365 L
953.591 364.906 L
960.327 363.263 L
966.949 361.451 L
973.571 359.228 L
980.193 357.609 L
986.929 354.734 L
993.552 351.786 L
1000.174 349.611 L
1006.796 346.64 L
1013.532 344.006 L
1020.154 340.913 L
1026.776 338.569 L
1033.398 335.863 L
1040.135 332.239 L
1046.757 329.436 L
1053.379 325.135 L
1060.001 321.197 L
1066.737 316.848 L
1073.359 313.079 L
1079.981 308.15 L
1086.604 303.631 L
1093.34 297.567 L
1099.962 290.415 L
1106.584 283.456 L
1113.206 277.005 L
1124.281 264.248 L
1144.261 244.314 L
1151.115 238.363 L
S
GR
GS
[0.75 0 0 0.75 0 0] CT
1 GC
N
289 452 M
289 278 L
200 278 L
200 452 L
cp
f
GR
GS
[0.75 0 0 0.75 185.25 215.625] CT
/Helvetica 12 F
GS
[1 0 0 1 0 0] CT
0 4.5 moveto 
1 -1 scale
(Leader) t 
GR
GR
GS
[0.75 0 0 0.75 0 0] CT
0 0 1 RC
1 LJ
4 LW
N
204 287.5 M
244 287.5 L
S
GR
GS
[0.75 0 0 0.75 185.25 227.25] CT
/Helvetica 12 F
GS
[1 0 0 1 0 0] CT
0 4.5 moveto 
1 -1 scale
(Car01) t 
GR
GR
GS
[0.75 0 0 0.75 0 0] CT
1 0 0 RC
1 LJ
2 LW
N
204 303 M
244 303 L
S
GR
GS
[0.75 0 0 0.75 185.25 238.875] CT
/Helvetica 12 F
GS
[1 0 0 1 0 0] CT
0 4.5 moveto 
1 -1 scale
(Car02) t 
GR
GR
GS
[0.75 0 0 0.75 0 0] CT
0 1 0 RC
1 LJ
2 LW
N
204 318.5 M
244 318.5 L
S
GR
GS
[0.75 0 0 0.75 185.25 250.5] CT
/Helvetica 12 F
GS
[1 0 0 1 0 0] CT
0 4.5 moveto 
1 -1 scale
(Car03) t 
GR
GR
GS
[0.75 0 0 0.75 0 0] CT
0 0 0.173 RC
1 LJ
2 LW
N
204 334 M
244 334 L
S
GR
GS
[0.75 0 0 0.75 185.25 262.125] CT
/Helvetica 12 F
GS
[1 0 0 1 0 0] CT
0 4.5 moveto 
1 -1 scale
(Car04) t 
GR
GR
GS
[0.75 0 0 0.75 0 0] CT
1 0.102 0.725 RC
1 LJ
2 LW
N
204 349.5 M
244 349.5 L
S
GR
GS
[0.75 0 0 0.75 185.25 273.75] CT
/Helvetica 12 F
GS
[1 0 0 1 0 0] CT
0 4.5 moveto 
1 -1 scale
(Car05) t 
GR
GR
GS
[0.75 0 0 0.75 0 0] CT
1 0.827 0 RC
1 LJ
2 LW
N
204 365 M
244 365 L
S
GR
GS
[0.75 0 0 0.75 185.25 285.375] CT
/Helvetica 12 F
GS
[1 0 0 1 0 0] CT
0 4.5 moveto 
1 -1 scale
(Car06) t 
GR
GR
GS
[0.75 0 0 0.75 0 0] CT
0 0.345 0 RC
1 LJ
2 LW
N
204 380.5 M
244 380.5 L
S
GR
GS
[0.75 0 0 0.75 185.25 297] CT
/Helvetica 12 F
GS
[1 0 0 1 0 0] CT
0 4.5 moveto 
1 -1 scale
(Car08) t 
GR
GR
GS
[0.75 0 0 0.75 0 0] CT
0.518 0.518 1 RC
1 LJ
2 LW
N
204 396 M
244 396 L
S
GR
GS
[0.75 0 0 0.75 185.25 308.625] CT
/Helvetica 12 F
GS
[1 0 0 1 0 0] CT
0 4.5 moveto 
1 -1 scale
(Car09) t 
GR
GR
GS
[0.75 0 0 0.75 0 0] CT
0.62 0.31 0.275 RC
1 LJ
2 LW
N
204 411.5 M
244 411.5 L
S
GR
GS
[0.75 0 0 0.75 185.25 320.25] CT
/Helvetica 12 F
GS
[1 0 0 1 0 0] CT
0 4.5 moveto 
1 -1 scale
(Car10) t 
GR
GR
GS
[0.75 0 0 0.75 0 0] CT
0 1 0.757 RC
1 LJ
2 LW
N
204 427 M
244 427 L
S
GR
GS
[0.75 0 0 0.75 185.25 331.875] CT
/Helvetica 12 F
GS
[1 0 0 1 0 0] CT
0 4.5 moveto 
1 -1 scale
(Car11) t 
GR
GR
GS
[0.75 0 0 0.75 0 0] CT
0 0.518 0.584 RC
1 LJ
2 LW
N
204 442.5 M
244 442.5 L
S
GR
GS
[0.75 0 0 0.75 0 0] CT
0.149 GC
10.0 ML
0.667 LW
N
200 452 M
200 278 L
289 278 L
289 452 L
cp
S
GR
GS
[0.75 0 0 0.75 0 0] CT
1 GC
N
165 851 M
1151 851 L
1151 525 L
165 525 L
cp
f
GR
GS
[0.75 0 0 0.75 0 0] CT
0.149 GC
2 setlinecap
1 LJ
0.667 LW
N
164.99 851 M
1150.998 851 L
S
GR
GS
[0.75 0 0 0.75 0 0] CT
0.149 GC
2 setlinecap
1 LJ
0.667 LW
N
352.806 851 M
352.806 841.14 L
S
GR
GS
[0.75 0 0 0.75 0 0] CT
0.149 GC
2 setlinecap
1 LJ
0.667 LW
N
574.533 851 M
574.533 841.14 L
S
GR
GS
[0.75 0 0 0.75 0 0] CT
0.149 GC
2 setlinecap
1 LJ
0.667 LW
N
796.259 851 M
796.259 841.14 L
S
GR
GS
[0.75 0 0 0.75 0 0] CT
0.149 GC
2 setlinecap
1 LJ
0.667 LW
N
1017.871 851 M
1017.871 841.14 L
S
GR
GS
[0.75 0 0 0.75 264.60477 642.24998] CT
0.149 GC
/Helvetica 13.333 F
GS
[1 0 0 1 0 0] CT
-26 13 moveto 
1 -1 scale
(12:07:50) t 
GR
GR
GS
[0.75 0 0 0.75 430.8994 642.24998] CT
0.149 GC
/Helvetica 13.333 F
GS
[1 0 0 1 0 0] CT
-26 13 moveto 
1 -1 scale
(12:08:00) t 
GR
GR
GS
[0.75 0 0 0.75 597.194 642.24998] CT
0.149 GC
/Helvetica 13.333 F
GS
[1 0 0 1 0 0] CT
-26 13 moveto 
1 -1 scale
(12:08:10) t 
GR
GR
GS
[0.75 0 0 0.75 763.403 642.24998] CT
0.149 GC
/Helvetica 13.333 F
GS
[1 0 0 1 0 0] CT
-26 13 moveto 
1 -1 scale
(12:08:20) t 
GR
GR
GS
[0.75 0 0 0.75 493.49538 655.25002] CT
0.149 GC
/Helvetica 14.667 F
GS
[1 0 0 1 0 0] CT
-55 14 moveto 
1 -1 scale
(Time \(hh:mm:ss\)) t 
GR
GR
GS
[0.75 0 0 0.75 863.24826 655.25002] CT
0.149 GC
/Helvetica 13.333 F
GS
[1 0 0 1 0 0] CT
-91 13 moveto 
1 -1 scale
(Dec 06, 2019   ) t 
GR
GR
GS
[0.75 0 0 0.75 0 0] CT
0.149 GC
2 setlinecap
1 LJ
0.667 LW
N
164.99 851 M
164.99 525 L
S
GR
GS
[0.75 0 0 0.75 0 0] CT
0.149 GC
2 setlinecap
1 LJ
0.667 LW
N
164.99 851 M
174.809 851 L
S
GR
GS
[0.75 0 0 0.75 0 0] CT
0.149 GC
2 setlinecap
1 LJ
0.667 LW
N
164.99 810.25 M
174.809 810.25 L
S
GR
GS
[0.75 0 0 0.75 0 0] CT
0.149 GC
2 setlinecap
1 LJ
0.667 LW
N
164.99 769.5 M
174.809 769.5 L
S
GR
GS
[0.75 0 0 0.75 0 0] CT
0.149 GC
2 setlinecap
1 LJ
0.667 LW
N
164.99 728.75 M
174.809 728.75 L
S
GR
GS
[0.75 0 0 0.75 0 0] CT
0.149 GC
2 setlinecap
1 LJ
0.667 LW
N
164.99 688 M
174.809 688 L
S
GR
GS
[0.75 0 0 0.75 0 0] CT
0.149 GC
2 setlinecap
1 LJ
0.667 LW
N
164.99 647.25 M
174.809 647.25 L
S
GR
GS
[0.75 0 0 0.75 0 0] CT
0.149 GC
2 setlinecap
1 LJ
0.667 LW
N
164.99 606.5 M
174.809 606.5 L
S
GR
GS
[0.75 0 0 0.75 0 0] CT
0.149 GC
2 setlinecap
1 LJ
0.667 LW
N
164.99 565.75 M
174.809 565.75 L
S
GR
GS
[0.75 0 0 0.75 0 0] CT
0.149 GC
2 setlinecap
1 LJ
0.667 LW
N
164.99 525 M
174.809 525 L
S
GR
GS
[0.75 0 0 0.75 119.71781 638.25] CT
0.149 GC
/Helvetica 13.333 F
GS
[1 0 0 1 0 0] CT
-8 5 moveto 
1 -1 scale
(0) t 
GR
GR
GS
[0.75 0 0 0.75 119.71781 607.6875] CT
0.149 GC
/Helvetica 13.333 F
GS
[1 0 0 1 0 0] CT
-15 5 moveto 
1 -1 scale
(50) t 
GR
GR
GS
[0.75 0 0 0.75 119.71781 577.125] CT
0.149 GC
/Helvetica 13.333 F
GS
[1 0 0 1 0 0] CT
-23 5 moveto 
1 -1 scale
(100) t 
GR
GR
GS
[0.75 0 0 0.75 119.71781 546.5625] CT
0.149 GC
/Helvetica 13.333 F
GS
[1 0 0 1 0 0] CT
-23 5 moveto 
1 -1 scale
(150) t 
GR
GR
GS
[0.75 0 0 0.75 119.71781 516] CT
0.149 GC
/Helvetica 13.333 F
GS
[1 0 0 1 0 0] CT
-23 5 moveto 
1 -1 scale
(200) t 
GR
GR
GS
[0.75 0 0 0.75 119.71781 485.4375] CT
0.149 GC
/Helvetica 13.333 F
GS
[1 0 0 1 0 0] CT
-23 5 moveto 
1 -1 scale
(250) t 
GR
GR
GS
[0.75 0 0 0.75 119.71781 454.875] CT
0.149 GC
/Helvetica 13.333 F
GS
[1 0 0 1 0 0] CT
-23 5 moveto 
1 -1 scale
(300) t 
GR
GR
GS
[0.75 0 0 0.75 119.71781 424.3125] CT
0.149 GC
/Helvetica 13.333 F
GS
[1 0 0 1 0 0] CT
-23 5 moveto 
1 -1 scale
(350) t 
GR
GR
GS
[0.75 0 0 0.75 119.71781 393.75] CT
0.149 GC
/Helvetica 13.333 F
GS
[1 0 0 1 0 0] CT
-23 5 moveto 
1 -1 scale
(400) t 
GR
GR
GS
[0 -0.75 0.75 0 99.509 515.99991] CT
0.149 GC
/Helvetica 14.667 F
GS
[1 0 0 1 0 0] CT
-42 -3 moveto 
1 -1 scale
(Distance \(m\)) t 
GR
GR
GS
[0.75 0 0 0.75 0 0] CT
1 0 0 RC
1 LJ
2 LW
N
164.872 825.987 M
171.041 825.961 L
177.663 825.937 L
184.285 825.913 L
202.097 825.841 L
208.719 825.813 L
215.341 825.783 L
221.963 825.754 L
228.699 825.724 L
235.321 825.693 L
241.943 825.679 L
248.565 825.735 L
255.302 825.894 L
261.924 826.149 L
268.546 826.454 L
275.168 826.787 L
281.904 827.148 L
288.526 827.537 L
295.148 827.945 L
301.771 828.369 L
310.676 828.947 L
319.582 829.509 L
326.204 829.906 L
335.109 830.376 L
343.901 830.783 L
352.806 831.134 L
359.428 831.353 L
363.881 831.489 L
370.503 831.671 L
377.24 831.787 L
383.862 831.839 L
390.484 831.81 L
397.106 831.711 L
403.842 831.581 L
410.464 831.451 L
417.086 831.3 L
423.708 831.125 L
430.445 830.948 L
437.067 830.79 L
443.689 830.67 L
450.311 830.523 L
457.047 830.335 L
463.669 830.111 L
470.292 829.836 L
476.914 829.503 L
483.65 829.112 L
490.272 828.667 L
496.894 828.165 L
503.516 827.616 L
510.253 827.037 L
516.875 826.454 L
523.497 825.877 L
530.119 825.312 L
536.855 824.758 L
543.477 824.223 L
550.099 823.709 L
556.721 823.221 L
563.458 822.761 L
570.08 822.333 L
576.702 821.941 L
583.324 821.628 L
592.229 821.328 L
601.135 821.145 L
607.757 821.08 L
616.663 821.079 L
625.454 821.17 L
634.36 821.332 L
640.982 821.498 L
647.718 821.697 L
654.34 821.915 L
660.962 822.15 L
667.584 822.386 L
674.321 822.623 L
680.943 822.861 L
687.565 823.104 L
694.187 823.34 L
700.923 823.582 L
707.545 823.808 L
714.167 824.042 L
720.79 824.258 L
727.526 824.468 L
734.148 824.672 L
740.77 824.859 L
747.392 825.039 L
754.128 825.205 L
760.751 825.361 L
767.373 825.509 L
773.995 825.645 L
780.731 825.771 L
787.353 825.887 L
793.975 825.99 L
800.597 826.085 L
807.334 826.171 L
813.956 826.247 L
820.578 826.309 L
827.2 826.366 L
833.936 826.406 L
840.558 826.439 L
847.18 826.464 L
853.802 826.473 L
862.708 826.475 L
869.33 826.465 L
876.066 826.448 L
884.858 826.415 L
893.763 826.367 L
900.385 826.326 L
907.008 826.282 L
913.744 826.238 L
920.366 826.189 L
926.988 826.136 L
933.61 826.091 L
940.346 826.043 L
946.969 825.994 L
953.591 825.946 L
960.213 825.903 L
966.949 825.854 L
973.571 825.81 L
980.193 825.762 L
986.929 825.717 L
993.552 825.668 L
1000.174 825.62 L
1006.796 825.576 L
1013.532 825.534 L
1020.154 825.492 L
1026.776 825.456 L
1033.398 825.417 L
1040.135 825.384 L
1046.757 825.354 L
1053.379 825.328 L
1060.001 825.305 L
1066.737 825.286 L
1073.359 825.272 L
1079.981 825.26 L
1086.604 825.253 L
1093.34 825.254 L
1099.962 825.257 L
1106.584 825.263 L
1113.206 825.274 L
1124.281 827.965 L
1144.261 833.368 L
1151.115 833.385 L
S
GR
GS
[0.75 0 0 0.75 0 0] CT
0 1 0 RC
1 LJ
2 LW
N
164.872 800.947 M
171.041 800.934 L
177.663 800.919 L
182.116 800.917 L
193.191 800.89 L
202.097 800.87 L
210.888 800.853 L
219.794 800.832 L
226.416 800.819 L
233.038 800.803 L
239.774 800.793 L
246.396 800.829 L
253.018 800.964 L
259.64 801.207 L
266.377 801.514 L
272.999 801.869 L
279.621 802.274 L
292.979 803.235 L
301.771 803.973 L
312.96 804.972 L
321.751 805.816 L
328.373 806.47 L
337.279 807.371 L
346.184 808.289 L
354.976 809.216 L
361.712 809.912 L
370.503 810.822 L
379.409 811.644 L
390.484 812.462 L
397.106 812.792 L
408.181 813.171 L
414.917 813.34 L
421.539 813.448 L
428.161 813.52 L
434.898 813.563 L
441.52 813.617 L
448.142 813.64 L
459.217 813.519 L
468.122 813.268 L
481.366 812.582 L
490.272 811.881 L
499.178 810.985 L
507.969 809.907 L
516.875 808.724 L
525.78 807.466 L
534.572 806.16 L
541.308 805.148 L
550.099 803.781 L
559.005 802.394 L
567.91 801.009 L
576.702 799.63 L
585.607 798.348 L
594.513 797.164 L
601.135 796.338 L
607.757 795.572 L
616.663 794.651 L
625.454 793.86 L
634.36 793.189 L
643.265 792.643 L
654.34 792.11 L
663.246 791.802 L
674.321 791.539 L
680.943 791.442 L
687.565 791.386 L
694.187 791.364 L
700.923 791.373 L
707.545 791.412 L
714.167 791.486 L
720.79 791.591 L
729.695 791.773 L
738.601 792.005 L
745.223 792.207 L
756.298 792.592 L
762.92 792.846 L
769.656 793.113 L
776.278 793.392 L
782.9 793.674 L
789.522 793.965 L
796.259 794.256 L
802.881 794.548 L
809.503 794.841 L
818.408 795.226 L
825.031 795.512 L
838.389 796.073 L
847.18 796.431 L
856.086 796.774 L
862.708 797.026 L
869.33 797.266 L
876.066 797.498 L
884.858 797.793 L
893.763 798.065 L
902.669 798.318 L
911.46 798.554 L
920.366 798.773 L
929.272 798.975 L
935.894 799.116 L
942.516 799.253 L
953.591 799.46 L
960.327 799.579 L
969.118 799.721 L
978.024 799.853 L
986.929 799.973 L
995.721 800.08 L
1004.626 800.178 L
1013.532 800.263 L
1020.154 800.316 L
1026.776 800.37 L
1033.398 800.412 L
1040.135 800.45 L
1046.757 800.483 L
1053.379 800.508 L
1060.001 800.533 L
1066.737 800.55 L
1073.359 800.565 L
1084.434 800.591 L
1091.056 800.602 L
1099.962 800.617 L
1108.867 800.631 L
1117.659 800.648 L
1135.47 806.014 L
1151.115 807.078 L
S
GR
GS
[0.75 0 0 0.75 0 0] CT
0 0 0.173 RC
1 LJ
2 LW
N
164.872 775.577 M
171.041 775.567 L
177.663 775.557 L
184.285 775.547 L
202.097 775.5 L
208.719 775.476 L
215.341 775.447 L
221.963 775.411 L
228.699 775.376 L
235.321 775.341 L
241.943 775.313 L
248.565 775.355 L
255.302 775.503 L
261.924 775.745 L
268.546 776.049 L
275.168 776.399 L
281.904 776.807 L
288.526 777.266 L
295.148 777.777 L
301.771 778.332 L
310.676 779.129 L
319.582 779.975 L
326.204 780.645 L
335.109 781.573 L
341.731 782.298 L
350.637 783.303 L
357.259 784.082 L
363.881 784.887 L
370.503 785.705 L
377.24 786.493 L
383.862 787.255 L
390.484 787.952 L
397.106 788.599 L
403.842 789.22 L
410.464 789.83 L
417.086 790.39 L
423.708 790.892 L
430.445 791.352 L
437.067 791.779 L
443.689 792.196 L
450.311 792.538 L
457.047 792.791 L
463.669 792.947 L
470.292 793.003 L
476.914 792.936 L
483.65 792.748 L
490.272 792.441 L
496.894 792.009 L
503.516 791.462 L
510.253 790.799 L
516.875 790.06 L
523.497 789.243 L
530.119 788.35 L
536.855 787.404 L
543.477 786.418 L
550.099 785.388 L
556.721 784.318 L
563.458 783.219 L
570.08 782.088 L
576.702 780.922 L
583.324 779.776 L
592.229 778.267 L
601.135 776.769 L
607.757 775.655 L
616.663 774.198 L
625.454 772.781 L
632.19 771.752 L
638.813 770.754 L
643.265 770.112 L
649.887 769.183 L
656.51 768.3 L
663.132 767.458 L
669.868 766.672 L
676.49 765.949 L
683.112 765.282 L
689.734 764.681 L
696.471 764.143 L
703.093 763.663 L
709.715 763.255 L
716.337 762.905 L
723.073 762.622 L
729.695 762.392 L
736.317 762.217 L
743.054 762.094 L
749.676 762.017 L
756.298 761.983 L
762.92 761.984 L
769.656 762.024 L
778.448 762.139 L
785.07 762.265 L
791.806 762.427 L
798.428 762.62 L
805.05 762.837 L
811.672 763.08 L
818.408 763.343 L
825.031 763.615 L
831.653 763.899 L
838.275 764.192 L
845.011 764.485 L
853.802 764.884 L
862.708 765.281 L
869.33 765.579 L
876.066 765.871 L
884.858 766.264 L
891.594 766.553 L
898.216 766.847 L
907.008 767.238 L
913.744 767.529 L
920.366 767.82 L
926.988 768.105 L
933.61 768.388 L
940.346 768.659 L
946.969 768.92 L
953.591 769.174 L
960.213 769.424 L
966.949 769.661 L
973.571 769.889 L
980.193 770.115 L
986.929 770.33 L
993.552 770.535 L
1000.174 770.738 L
1006.796 770.935 L
1013.532 771.125 L
1020.154 771.307 L
1024.607 771.428 L
1031.229 771.603 L
1037.851 771.776 L
1044.473 771.946 L
1051.209 772.114 L
1057.832 772.275 L
1064.454 772.424 L
1071.076 772.574 L
1077.812 772.716 L
1084.434 772.854 L
1091.056 772.981 L
1097.678 773.105 L
1104.415 773.218 L
1111.037 773.328 L
1117.659 773.433 L
1135.47 780.337 L
1151.115 780.491 L
S
GR
GS
[0.75 0 0 0.75 0 0] CT
1 0.102 0.725 RC
1 LJ
2 LW
N
164.872 760.073 M
166.588 760.08 L
173.21 760.094 L
179.833 760.105 L
186.569 760.107 L
199.813 760.108 L
206.435 760.103 L
213.171 760.097 L
219.794 760.089 L
226.416 760.082 L
233.038 760.067 L
239.774 760.057 L
246.396 760.09 L
257.471 760.358 L
264.093 760.632 L
270.829 760.961 L
277.451 761.339 L
281.904 761.619 L
286.243 761.921 L
292.979 762.414 L
301.771 763.15 L
308.507 763.746 L
315.129 764.373 L
324.034 765.254 L
330.657 765.949 L
339.562 766.919 L
348.354 767.927 L
354.976 768.715 L
361.712 769.524 L
368.334 770.349 L
374.956 771.174 L
381.578 771.976 L
388.315 772.737 L
399.389 773.93 L
410.464 775.115 L
417.086 775.813 L
423.708 776.488 L
430.445 777.162 L
437.067 777.835 L
443.689 778.519 L
450.311 779.136 L
457.047 779.661 L
463.669 780.09 L
470.292 780.399 L
476.914 780.572 L
483.65 780.597 L
490.272 780.46 L
496.894 780.177 L
503.516 779.734 L
514.705 778.714 L
521.327 777.967 L
527.949 777.125 L
534.572 776.178 L
541.308 775.145 L
547.93 774.029 L
554.552 772.847 L
561.174 771.607 L
567.91 770.314 L
574.533 768.976 L
581.155 767.636 L
587.777 766.299 L
596.682 764.515 L
603.304 763.172 L
610.041 761.821 L
616.663 760.475 L
623.285 759.143 L
629.907 757.809 L
636.643 756.494 L
643.265 755.195 L
649.887 753.92 L
656.51 752.664 L
660.962 751.843 L
667.584 750.629 L
674.321 749.444 L
683.112 747.912 L
694.187 746.086 L
700.923 745.042 L
707.545 744.04 L
714.167 743.088 L
720.79 742.183 L
727.526 741.332 L
734.148 740.536 L
740.77 739.797 L
747.392 739.12 L
754.128 738.494 L
762.92 737.762 L
769.656 737.288 L
776.278 736.884 L
782.9 736.543 L
793.975 736.118 L
800.597 735.953 L
809.503 735.829 L
816.125 735.797 L
822.861 735.827 L
829.483 735.915 L
836.105 736.054 L
847.18 736.395 L
853.917 736.653 L
862.708 737.063 L
869.33 737.413 L
876.066 737.789 L
884.858 738.341 L
891.594 738.776 L
898.216 739.231 L
904.838 739.703 L
911.46 740.182 L
918.197 740.671 L
924.819 741.175 L
933.724 741.86 L
940.346 742.384 L
946.969 742.915 L
953.591 743.451 L
960.327 743.995 L
966.949 744.534 L
973.571 745.072 L
980.193 745.601 L
986.929 746.124 L
993.552 746.633 L
1000.174 747.132 L
1006.796 747.616 L
1013.532 748.085 L
1020.154 748.534 L
1024.607 748.833 L
1031.229 749.259 L
1037.851 749.676 L
1044.473 750.08 L
1051.209 750.468 L
1057.832 750.847 L
1073.359 751.676 L
1079.981 752.011 L
1086.604 752.335 L
1093.34 752.651 L
1099.962 752.952 L
1106.584 753.239 L
1113.206 753.514 L
1126.564 758.033 L
1146.545 762.72 L
1151.115 762.86 L
S
GR
GS
[0.75 0 0 0.75 0 0] CT
1 0.827 0 RC
1 LJ
2 LW
N
164.872 734.785 M
171.041 734.816 L
177.663 734.855 L
184.285 734.892 L
202.097 734.978 L
208.719 735.002 L
215.341 735.019 L
221.963 735.029 L
228.699 735.033 L
235.321 735.032 L
241.943 735.039 L
248.565 735.111 L
255.302 735.284 L
261.924 735.552 L
268.546 735.878 L
275.168 736.251 L
281.904 736.676 L
288.526 737.148 L
295.148 737.665 L
301.771 738.224 L
308.507 738.819 L
315.129 739.448 L
321.751 740.105 L
328.373 740.786 L
335.109 741.494 L
343.901 742.482 L
352.806 743.519 L
359.428 744.322 L
366.051 745.149 L
372.787 745.992 L
379.409 746.801 L
386.031 747.585 L
392.653 748.327 L
399.389 749.034 L
406.012 749.75 L
412.634 750.48 L
419.256 751.194 L
425.992 751.892 L
432.614 752.604 L
439.236 753.343 L
445.972 754.105 L
452.595 754.818 L
459.217 755.48 L
465.839 756.087 L
472.575 756.607 L
479.197 757.024 L
485.819 757.34 L
492.441 757.549 L
499.178 757.633 L
505.8 757.597 L
512.422 757.448 L
519.044 757.204 L
525.78 756.856 L
532.402 756.407 L
539.024 755.854 L
545.646 755.204 L
552.383 754.448 L
559.005 753.595 L
565.627 752.644 L
572.249 751.598 L
581.155 750.08 L
590.06 748.51 L
S
GR
GS
[0.75 0 0 0.75 0 0] CT
1 0.827 0 RC
1 LJ
2 LW
N
603.304 746.004 M
609.927 744.686 L
616.663 743.337 L
623.285 741.952 L
629.907 740.528 L
636.529 739.08 L
643.265 737.608 L
649.887 736.13 L
656.51 734.646 L
663.132 733.172 L
669.868 731.713 L
676.49 730.271 L
683.112 728.844 L
689.734 727.44 L
696.471 726.06 L
703.093 724.7 L
709.715 723.37 L
727.526 726.629 L
747.392 724.449 L
767.373 721.337 L
S
GR
GS
[0.75 0 0 0.75 0 0] CT
1 0.827 0 RC
1 LJ
2 LW
N
942.516 709.034 M
949.138 709.679 L
955.874 710.34 L
962.496 712.198 L
973.571 713.689 L
980.193 714.544 L
986.929 715.919 L
993.552 716.511 L
1000.174 717.097 L
1006.796 717.68 L
1013.532 718.255 L
1020.154 718.822 L
1024.607 719.199 L
1031.229 719.751 L
1037.851 720.296 L
1044.473 720.829 L
1051.209 721.35 L
1057.832 721.861 L
1064.454 722.35 L
1071.076 722.834 L
1077.812 723.301 L
1084.434 723.757 L
1091.056 724.197 L
1097.678 724.623 L
1104.415 725.036 L
1111.037 725.438 L
1117.659 725.828 L
1135.47 733.459 L
1151.115 735.248 L
S
GR
GS
[0.75 0 0 0.75 0 0] CT
0 0.345 0 RC
1 LJ
2 LW
N
164.872 713.467 M
171.041 713.531 L
177.663 713.604 L
184.285 713.678 L
202.097 713.843 L
208.719 713.908 L
215.341 713.966 L
221.963 714.022 L
228.699 714.077 L
235.321 714.124 L
241.943 714.184 L
248.565 714.308 L
255.302 714.53 L
261.924 714.841 L
268.546 715.208 L
275.168 715.615 L
281.904 716.069 L
288.526 716.573 L
295.148 717.122 L
306.223 718.123 L
315.129 718.988 L
324.034 719.901 L
341.731 721.855 L
350.637 722.9 L
357.259 723.71 L
363.881 724.544 L
370.503 725.397 L
377.24 726.226 L
383.862 727.038 L
390.484 727.799 L
397.106 728.525 L
403.842 729.239 L
410.464 729.978 L
417.086 730.701 L
423.708 731.411 L
430.445 732.123 L
437.067 732.852 L
445.972 733.874 L
452.595 734.601 L
459.217 735.287 L
465.839 735.931 L
476.914 736.856 L
483.65 737.307 L
490.272 737.678 L
496.894 737.956 L
505.8 738.183 L
512.422 738.27 L
519.044 738.291 L
525.78 738.237 L
532.402 738.099 L
539.024 737.864 L
545.646 737.52 L
552.383 737.059 L
559.005 736.484 L
565.627 735.803 L
572.249 735 L
581.155 733.793 L
587.777 732.803 L
596.682 731.363 L
603.304 730.191 L
614.379 728.079 L
623.285 726.263 L
629.907 724.839 L
636.643 723.382 L
645.435 721.372 L
652.057 719.814 L
658.793 718.233 L
665.415 716.618 L
674.321 714.433 L
680.943 712.783 L
687.565 711.12 L
694.187 709.456 L
700.923 707.789 L
707.545 706.129 L
714.167 704.487 L
720.79 702.851 L
729.695 700.7 L
736.317 699.105 L
743.054 697.533 L
749.676 695.982 L
758.581 693.947 L
765.203 692.451 L
771.825 690.974 L
778.448 689.53 L
787.353 687.641 L
793.975 686.257 L
800.597 684.908 L
807.334 683.599 L
816.125 681.905 L
822.861 680.686 L
829.483 679.514 L
836.105 678.383 L
845.011 676.959 L
853.917 675.633 L
860.539 674.706 L
867.161 673.838 L
876.066 672.779 L
884.858 671.833 L
891.594 671.194 L
900.385 670.451 L
909.291 669.83 L
915.913 669.435 L
922.535 669.113 L
929.272 668.849 L
935.894 668.654 L
942.516 668.518 L
949.138 668.448 L
955.874 668.44 L
962.496 668.49 L
969.118 668.606 L
975.855 668.785 L
982.477 669.023 L
989.099 669.322 L
995.721 669.676 L
1002.457 670.089 L
1011.249 670.716 L
1017.871 671.248 L
1024.607 671.826 L
1031.229 672.445 L
1037.851 673.11 L
1044.473 673.811 L
1051.209 674.546 L
1057.832 675.308 L
1064.454 676.106 L
1071.076 676.931 L
1077.812 677.789 L
1084.434 678.675 L
1091.056 679.584 L
1097.678 680.514 L
1104.415 681.458 L
1111.037 682.418 L
1117.659 683.385 L
1135.47 686.005 L
1151.115 688.342 L
S
GR
GS
[0.75 0 0 0.75 0 0] CT
0.518 0.518 1 RC
1 LJ
2 LW
N
164.872 659.889 M
171.041 660.003 L
177.663 660.135 L
184.285 660.269 L
202.097 660.62 L
210.888 660.802 L
215.341 660.89 L
221.963 661.031 L
228.699 661.166 L
235.321 661.304 L
241.943 661.453 L
248.565 661.669 L
255.302 661.995 L
261.924 662.41 L
268.546 662.887 L
275.168 663.401 L
284.074 664.172 L
290.696 664.797 L
297.432 665.474 L
304.054 666.183 L
312.845 667.17 L
321.751 668.196 L
330.657 669.256 L
341.731 670.629 L
350.637 671.756 L
357.259 672.621 L
363.881 673.501 L
370.503 674.393 L
377.24 675.251 L
383.862 676.082 L
390.484 676.853 L
397.106 677.582 L
403.842 678.297 L
410.464 679.02 L
417.086 679.723 L
423.708 680.398 L
430.445 681.076 L
437.067 681.76 L
443.689 682.475 L
450.311 683.157 L
457.047 683.789 L
463.669 684.373 L
470.292 684.893 L
476.914 685.342 L
483.65 685.706 L
490.272 685.989 L
496.894 686.186 L
503.516 686.295 L
510.253 686.339 L
516.875 686.34 L
523.497 686.303 L
530.119 686.226 L
536.855 686.116 L
543.477 685.973 L
550.099 685.8 L
556.721 685.598 L
563.458 685.371 L
570.08 685.116 L
576.702 684.832 L
583.324 684.57 L
592.229 684.227 L
601.135 683.868 L
607.757 683.575 L
616.663 683.144 L
625.454 682.637 L
634.36 682.046 L
640.982 681.542 L
647.718 680.985 L
654.34 680.354 L
660.962 679.656 L
667.584 678.882 L
674.321 678.021 L
680.943 677.084 L
687.565 676.063 L
694.187 674.964 L
700.923 673.794 L
707.545 672.54 L
714.167 671.249 L
720.79 669.899 L
727.526 668.512 L
734.148 667.086 L
740.77 665.619 L
747.392 664.131 L
754.128 662.613 L
760.751 661.081 L
767.373 659.535 L
773.995 657.961 L
780.731 656.38 L
787.353 654.773 L
793.975 653.153 L
800.597 651.527 L
807.334 649.892 L
813.956 648.257 L
820.578 646.618 L
827.2 644.984 L
833.936 643.352 L
840.558 641.727 L
847.18 640.114 L
853.802 638.51 L
862.708 636.394 L
869.33 634.827 L
876.066 633.274 L
884.858 631.236 L
893.763 629.234 L
902.669 627.28 L
909.291 625.846 L
915.913 624.436 L
922.535 623.063 L
929.272 621.71 L
935.894 620.402 L
942.516 619.12 L
949.138 617.88 L
955.874 616.684 L
962.496 615.54 L
969.118 614.462 L
975.74 613.448 L
982.477 612.509 L
989.099 611.639 L
995.721 610.839 L
1002.343 610.108 L
1009.079 609.448 L
1015.701 608.853 L
1022.323 608.328 L
1031.229 607.726 L
1037.851 607.352 L
1044.473 607.047 L
1051.209 606.804 L
1057.832 606.628 L
1064.454 606.503 L
1071.076 606.455 L
1077.812 606.466 L
1084.434 606.537 L
1091.056 606.671 L
1097.678 606.862 L
1104.415 607.103 L
1111.037 607.399 L
1117.659 607.747 L
1135.47 615.575 L
1151.115 617.905 L
S
GR
GS
[0.75 0 0 0.75 0 0] CT
0.62 0.31 0.275 RC
1 LJ
2 LW
N
164.872 633.869 M
168.758 633.951 L
175.494 634.092 L
182.116 634.233 L
188.738 634.369 L
197.644 634.558 L
204.266 634.697 L
210.888 634.839 L
217.51 634.982 L
224.246 635.125 L
230.868 635.271 L
237.491 635.417 L
244.227 635.565 L
261.924 636.524 L
268.546 637.017 L
275.168 637.557 L
281.904 638.149 L
288.526 638.798 L
295.148 639.491 L
301.771 640.219 L
310.676 641.249 L
319.582 642.32 L
326.204 643.159 L
335.109 644.302 L
343.901 645.481 L
352.806 646.693 L
359.428 647.622 L
366.051 648.562 L
372.787 649.508 L
379.409 650.413 L
386.031 651.283 L
392.767 652.098 L
399.389 652.866 L
406.012 653.627 L
412.634 654.395 L
419.37 655.135 L
425.992 655.844 L
432.614 656.554 L
439.236 657.28 L
445.972 658.023 L
452.595 658.712 L
459.217 659.347 L
465.839 659.93 L
472.575 660.439 L
479.197 660.861 L
485.819 661.195 L
492.441 661.441 L
499.178 661.593 L
505.8 661.664 L
512.422 661.679 L
519.044 661.656 L
525.78 661.594 L
532.402 661.503 L
539.024 661.37 L
545.646 661.207 L
554.552 660.942 L
561.174 660.707 L
567.91 660.454 L
574.533 660.164 L
585.607 659.705 L
594.513 659.36 L
603.304 659.015 L
612.21 658.666 L
621.116 658.314 L
627.738 658.043 L
634.36 657.765 L
640.982 657.473 L
647.718 657.169 L
654.34 656.831 L
660.962 656.469 L
667.584 656.066 L
674.321 655.629 L
680.943 655.145 L
687.565 654.612 L
694.187 654.017 L
700.923 653.365 L
707.545 652.634 L
714.167 651.85 L
720.79 650.985 L
727.526 650.044 L
734.148 649.033 L
740.77 647.942 L
747.392 646.785 L
754.128 645.546 L
762.92 643.801 L
769.656 642.424 L
776.278 640.992 L
782.9 639.506 L
789.522 637.981 L
796.259 636.402 L
802.881 634.789 L
809.503 633.139 L
816.125 631.449 L
822.861 629.735 L
829.483 627.995 L
836.105 626.232 L
842.728 624.452 L
851.633 622.084 L
858.255 620.308 L
867.161 617.956 L
876.066 615.622 L
884.858 613.315 L
893.763 611.03 L
902.669 608.775 L
909.291 607.104 L
915.913 605.453 L
922.535 603.825 L
929.272 602.222 L
935.894 600.647 L
942.516 599.096 L
949.138 597.576 L
955.874 596.083 L
962.496 594.616 L
969.118 593.183 L
975.74 591.782 L
982.477 590.425 L
989.099 589.109 L
995.721 587.84 L
1002.343 586.627 L
1009.079 585.474 L
1015.701 584.394 L
1022.323 583.381 L
1028.946 582.445 L
1035.682 581.587 L
1042.304 580.806 L
1048.926 580.101 L
1055.662 579.476 L
1062.284 578.927 L
1068.906 578.461 L
1075.529 578.07 L
1082.265 577.757 L
1088.887 577.521 L
1095.509 577.367 L
1102.131 577.285 L
1108.867 577.287 L
1115.49 577.361 L
1131.017 583.143 L
1151.115 587.861 L
S
GR
GS
[0.75 0 0 0.75 0 0] CT
0 1 0.757 RC
1 LJ
2 LW
N
164.872 608.177 M
168.758 608.243 L
175.494 608.359 L
182.116 608.479 L
188.738 608.603 L
195.36 608.733 L
202.097 608.871 L
208.719 609.01 L
215.341 609.151 L
221.963 609.298 L
228.699 609.444 L
235.321 609.592 L
241.943 609.755 L
248.565 609.989 L
255.302 610.324 L
261.924 610.757 L
268.546 611.251 L
275.168 611.789 L
281.904 612.384 L
288.526 613.031 L
295.148 613.726 L
301.771 614.466 L
308.507 615.244 L
315.129 616.055 L
326.204 617.47 L
337.279 618.953 L
346.184 620.187 L
354.976 621.463 L
361.712 622.444 L
368.334 623.441 L
374.956 624.429 L
381.578 625.384 L
388.315 626.29 L
394.937 627.156 L
401.559 627.987 L
408.181 628.822 L
414.917 629.651 L
421.539 630.452 L
428.161 631.237 L
434.783 632.02 L
441.52 632.831 L
448.142 633.629 L
454.764 634.367 L
461.386 635.052 L
468.122 635.676 L
474.744 636.223 L
481.366 636.678 L
487.989 637.046 L
494.725 637.315 L
501.347 637.488 L
507.969 637.572 L
514.591 637.595 L
521.327 637.57 L
527.949 637.494 L
534.572 637.379 L
541.194 637.217 L
547.93 637.022 L
554.552 636.791 L
561.174 636.523 L
567.91 636.233 L
574.533 635.912 L
581.155 635.595 L
590.06 635.205 L
596.682 634.917 L
603.304 634.632 L
609.927 634.351 L
616.663 634.073 L
629.907 633.524 L
636.529 633.251 L
643.265 632.979 L
649.887 632.71 L
656.51 632.439 L
663.132 632.167 L
669.868 631.886 L
676.49 631.601 L
683.112 631.296 L
689.848 630.972 L
696.471 630.618 L
703.093 630.232 L
709.715 629.802 L
716.451 629.315 L
723.073 628.766 L
729.695 628.144 L
736.317 627.444 L
743.054 626.665 L
749.676 625.81 L
756.298 624.876 L
762.92 623.868 L
769.656 622.79 L
776.278 621.645 L
782.9 620.426 L
789.522 619.138 L
796.259 617.786 L
802.881 616.393 L
809.503 614.964 L
816.125 613.502 L
822.861 612.008 L
829.483 610.482 L
836.105 608.923 L
842.728 607.322 L
849.464 605.687 L
864.992 601.688 L
871.614 599.93 L
882.688 596.976 L
889.311 595.19 L
898.216 592.819 L
904.838 591.048 L
911.46 589.284 L
918.197 587.533 L
924.819 585.797 L
931.441 584.076 L
938.063 582.371 L
944.799 580.682 L
951.421 579.015 L
958.043 577.371 L
964.666 575.742 L
971.402 574.138 L
978.024 572.553 L
984.646 570.997 L
991.268 569.47 L
998.004 567.971 L
1004.626 566.508 L
1011.249 565.077 L
1017.871 563.689 L
1024.607 562.343 L
1031.229 561.042 L
1037.851 559.792 L
1044.473 558.598 L
1051.209 557.461 L
1057.832 556.384 L
1064.454 555.368 L
1071.076 554.424 L
1077.812 553.552 L
1084.434 552.755 L
1091.056 552.034 L
1097.678 551.395 L
1104.415 550.836 L
1111.037 550.357 L
1117.659 549.96 L
1135.47 555.904 L
1151.115 556.756 L
S
GR
GS
[0.75 0 0 0.75 0 0] CT
0 0.518 0.584 RC
1 LJ
2 LW
N
164.872 587.063 M
171.041 587.138 L
177.663 587.215 L
184.285 587.298 L
202.097 587.483 L
208.719 587.55 L
215.341 587.618 L
221.963 587.685 L
228.699 587.757 L
235.321 587.828 L
241.943 587.915 L
253.018 588.232 L
259.64 588.563 L
266.377 588.963 L
272.999 589.415 L
279.621 589.918 L
286.243 590.478 L
292.979 591.085 L
301.771 591.972 L
310.676 592.933 L
319.582 593.945 L
326.204 594.749 L
335.109 595.859 L
343.901 597.016 L
352.806 598.222 L
359.428 599.155 L
366.165 600.113 L
372.787 601.08 L
379.409 602.024 L
386.031 602.942 L
392.767 603.821 L
399.389 604.661 L
408.181 605.802 L
414.917 606.659 L
421.539 607.501 L
428.161 608.331 L
434.783 609.17 L
441.52 610.046 L
448.142 610.914 L
454.764 611.732 L
461.386 612.506 L
468.122 613.226 L
474.744 613.871 L
481.366 614.43 L
488.103 614.899 L
494.725 615.276 L
501.347 615.559 L
507.969 615.754 L
514.705 615.888 L
521.327 615.971 L
527.949 616.004 L
534.572 615.991 L
541.308 615.925 L
547.93 615.819 L
554.552 615.665 L
561.174 615.466 L
567.91 615.23 L
574.533 614.953 L
583.324 614.574 L
592.229 614.201 L
601.135 613.813 L
607.757 613.508 L
616.663 613.091 L
625.454 612.661 L
632.19 612.332 L
638.813 611.994 L
645.435 611.648 L
652.057 611.3 L
658.793 610.956 L
665.415 610.601 L
672.037 610.244 L
678.659 609.892 L
685.396 609.537 L
692.018 609.18 L
698.64 608.825 L
705.262 608.467 L
711.998 608.109 L
720.79 607.624 L
727.526 607.246 L
734.148 606.857 L
740.77 606.443 L
747.392 606.002 L
754.128 605.528 L
762.92 604.852 L
769.656 604.291 L
776.278 603.681 L
782.9 603.008 L
789.522 602.271 L
796.259 601.467 L
802.881 600.584 L
809.503 599.626 L
816.125 598.583 L
822.861 597.46 L
829.483 596.266 L
836.105 595.007 L
842.728 593.706 L
851.633 591.89 L
858.255 590.458 L
867.161 588.464 L
876.066 586.368 L
884.858 584.163 L
891.594 582.431 L
898.216 580.66 L
907.122 578.231 L
913.744 576.371 L
920.366 574.474 L
926.988 572.561 L
933.724 570.633 L
940.346 568.692 L
946.969 566.753 L
953.591 564.822 L
960.327 562.906 L
966.949 561.006 L
973.571 559.128 L
980.193 557.269 L
986.929 555.435 L
993.552 553.628 L
1000.174 551.848 L
1006.796 550.096 L
1013.532 548.369 L
1020.154 546.667 L
1026.776 544.998 L
1033.398 543.353 L
1040.135 541.745 L
1046.757 540.168 L
1053.379 538.628 L
1060.001 537.128 L
1066.737 535.67 L
1073.359 534.25 L
1079.981 532.88 L
1086.604 531.556 L
1093.34 530.296 L
1099.962 529.096 L
1106.584 527.963 L
1113.206 526.903 L
1124.281 527.959 L
1144.261 530.888 L
1151.115 530.283 L
S
GR
%%Trailer
%%Pages: 1
%%EOF
