{
    "imu_port": "/dev/ttyS20",
    "gps_port": "/dev/ttyS4",
    "ntrip_caster": "stromek.felk.cvut.cz",
    "master": "stromek.felk.cvut.cz:5200",
    "gui_port": 5001,
    "id": "leader",
    "map": true
}